
##TITLE=AC1302_PERAH12114_6608382_PZ89wDSsjw
##JCAMPDX= 6.0         $$ Bruker NMR JCAMP-DX V2.0
##DATA TYPE= NMR SPECTRUM
##DATA CLASS= NTUPLES
##ORIGIN= BRUKER
##OWNER= Administrator
$$ 1.72 TOPSPIN		Version 2.1
$$ 2012-08-15 16:45:06.171 -0500  Administrator@TOPSPIN
$$ Compression mode = diff/dup
##.OBSERVE FREQUENCY= 400.02188249412
##.OBSERVE NUCLEUS= ^1H
##.ACQUISITION MODE= SIMULTANEOUS (DQD)
##.ACQUISITION SCHEME= undefined
##.AVERAGES= 8
##.DIGITISER RES= 22
##SPECTROMETER/DATA SYSTEM= spect
##.PULSE SEQUENCE= zg30
##.SOLVENT NAME= COFFEE_meoh
##.SHIFT REFERENCE= INTERNAL, COFFEE_meoh, 1, 14.98509
##AUDIT TRAIL= $$ (NUMBER, WHEN, WHO, WHERE, PROCESS, VERSION, WHAT)
$$ ##TITLE= Audit trail, TOPSPIN		Version 2.1
$$ ##JCAMPDX= 5.01
$$ ##ORIGIN= Bruker BioSpin GmbH
$$ ##OWNER= Administrator
$$ $$ C:\Bruker\TOPSPIN/data/COFFEE/nmr/AC1302_PERAH12114_6608382_PZ89wDSsjw/40/pdata/1/auditp.txt
$$ ##AUDIT TRAIL=  $$ (NUMBER, WHEN, WHO, WHERE, PROCESS, VERSION, WHAT)
(   1,<2012-08-15 16:44:47.906 -0500>,<Administrator>,<TOPSPIN>,<go>,<TOPSPIN 2.1>,
      <created by zg
	started at 2012-08-15 16:43:41.234 -0500,
	POWCHK enabled, PULCHK disabled,
       configuration hash MD5:
       6B 1B 68 BB D9 2E 58 E2 7F 35 AD 54 07 DF 0E 41
       data hash MD5: 64K
       1A A7 B7 32 AC B0 22 8E D8 D6 C5 C4 F2 A5 BE B2>)
(   2,<2012-08-15 16:45:00.984 -0500>,<Administrator>,<TOPSPIN>,<proc1d>,<TOPSPIN 2.1>,
      <Start of raw data processing
       efp LB = 0 FT_mod = 6 PKNL = 1 PHC0 = 0 PHC1 = 0 SI = 32K 
       data hash MD5: 32K
       D7 26 5F 44 D7 48 C8 0D C4 B4 8C 70 55 C1 C2 BA>)
(   3,<2012-08-15 16:45:01.343 -0500>,<Administrator>,<TOPSPIN>,<proc1d>,<TOPSPIN 2.1>,
      <pk PHC0 = 177.9126 PHC1 = 0 
       data hash MD5: 32K
       11 C7 47 3A 35 39 42 56 40 7E D4 68 D9 5E 66 04>)
(   4,<2012-08-15 16:45:01.484 -0500>,<Administrator>,<TOPSPIN>,<proc1d>,<TOPSPIN 2.1>,
      <abs ABSG = 1 
       data hash MD5: 32K
       2C FA 77 45 B7 8C 4D F7 5F A9 F3 B7 D2 C7 70 F3>)
(   5,<2012-08-15 16:45:01.531 -0500>,<Administrator>,<TOPSPIN>,<proc1d>,<TOPSPIN 2.1>,
      <abs ABSG = 2 
       data hash MD5: 32K
       3B C0 94 E3 65 2B 48 1F 27 6D 0E 2E 8E 82 66 7F>)
(   6,<2012-08-15 16:45:01.562 -0500>,<Administrator>,<TOPSPIN>,<proc1d>,<TOPSPIN 2.1>,
      <abs ABSG = 3 
       data hash MD5: 32K
       F2 F7 54 B5 1E A8 0E 24 36 B1 F5 A2 38 79 EC 54>)
(   7,<2012-08-15 16:45:01.609 -0500>,<Administrator>,<TOPSPIN>,<proc1d>,<TOPSPIN 2.1>,
      <abs ABSG = 4 
       data hash MD5: 32K
       1B 76 89 3B 86 4A 96 1C 4F 4D 5F 04 01 78 62 73>)
(   8,<2012-08-15 16:45:01.671 -0500>,<Administrator>,<TOPSPIN>,<proc1d>,<TOPSPIN 2.1>,
      <abs ABSG = 5 
       data hash MD5: 32K
       AA 06 32 6F E4 50 E2 E4 0A D4 BE B7 B0 4C 83 68>)
$$ ##END=
$$ 
$$ $$ hash MD5
$$ $$ 65 16 8A D8 59 DC 8F 6D 1A 3F 2A A2 56 B0 97 8F
##$RELAX= 
##$RELAX= 
##$RELAX= 
##$RELAX= 
##$RELAX= 
##$RELAX= 
##$RELAX= 
$$ Bruker specific parameters
$$ --------------------------
$$ [...]
##$TP= (0..7)
150 150 150 150 150 150 150 150
##$TP07= 0
##$TPNAME0= <>
##$TPNAME1= <>
##$TPNAME2= <>
##$TPNAME3= <>
##$TPNAME4= <>
##$TPNAME5= <>
##$TPNAME6= <>
##$TPNAME7= <>
##$TPOAL= (0..7)
0.5 0.5 0.5 0.5 0.5 0.5 0.5 0.5
##$TPOFFS= (0..7)
0 0 0 0 0 0 0 0
##$TUNHIN= 0
##$TUNHOUT= 0
##$TUNXOUT= 0
##$USERA1= <user>
##$USERA2= <user>
##$USERA3= <user>
##$USERA4= <user>
##$USERA5= <user>
##$V9= 5
##$VALIST= <valist>
##$VCLIST= <CCCCCCCCCCCCCCC>
##$VD= 0
##$VDLIST= <DDDDDDDDDDDDDDD>
##$VPLIST= <PPPPPPPPPPPPPPP>
##$VTLIST= <TTTTTTTTTTTTTTT>
##$WBST= 1024
##$WBSW= 4
##$XGAIN= (0..3)
0 0 0 0
##$XL= 0
##$YL= 0
##$YMAX_a= 494721
##$YMIN_a= -647545
##$ZGOPTNS= <>
##$ZL1= 120
##$ZL2= 120
##$ZL3= 120
##$ZL4= 120
##$ABSF1= 14.98509
##$ABSF2= -5.573092
##$ABSG= 5
##$ABSL= 3
##$ALPHA= 0
##$AQORDER= 0
##$ASSFAC= 0
##$ASSFACI= 0
##$ASSFACX= 0
##$ASSWID= 0
##$AUNMP= <proc_prof1d_extract_pilot.lims>
##$AXLEFT= 0
##$AXNAME= <>
##$AXNUC= <1H>
##$AXRIGHT= 0
##$AXTYPE= 0
##$AXUNIT= <>
##$AZFE= 0.1
##$AZFW= 0.1
##$BCFW= 0
##$BC_mod= 0
##$BYTORDP= 0
##$COROFFS= 0
##$CY= 15
##$DATMOD= 1
##$DC= 0
##$DFILT= <>
##$DTYPP= 0
##$F1P= 0
##$F2P= 0
##$FCOR= 0.5
##$FTSIZE= 32768
##$FT_mod= 6
##$GAMMA= 0
##$GB= 0
##$INTBC= 1
##$INTSCL= 1
##$ISEN= 128
##$LB= 0
##$LEV0= 0
##$LPBIN= 0
##$MAXI= 10000
##$MC2= 0
##$MEAN= 0
##$ME_mod= 0
##$MI= 0
##$NCOEF= 0
##$NC_proc= -8
##$NLEV= 6
##$NOISF1= 0
##$NOISF2= 0
##$NSP= 0
##$NTH_PI= 0
##$NZP= 0
##$OFFSET= 14.98509
##$PC= 1
##$PHC0= 177.9126
##$PHC1= 0
##$PH_mod= 1
##$PKNL= yes
##$PPARMOD= 0
##$PPDIAG= 0
##$PPIPTYP= 0
##$PPMPNUM= 2147483647
##$PPRESOL= 1
##$PSCAL= 4
##$PSIGN= 0
##$PYNMP= <proc.py>
##$REVERSE= no
##$SF= 400.02
##$SI= 32768
##$SIGF1= 0
##$SIGF2= 0
##$SINO= 400
##$SIOLD= 32768
##$SPECTYP= <>
##$SREGLST= <1H.CDCl3>
##$SSB= 0
##$STSI= 32768
##$STSR= 0
##$SW_p= 8223.68421052631
##$SYMM= 0
##$S_DEV= 0
##$TDeff= 65536
##$TDoff= 0
##$TI= <>
##$TILT= no
##$TM1= 0
##$TM2= 0
##$TOPLEV= 0
##$USERP1= <user>
##$USERP2= <user>
##$USERP3= <user>
##$USERP4= <user>
##$USERP5= <user>
##$WDW= 1
##$XDIM= 32768
##$YMAX_p= 429138806
##$YMIN_p= -793251
##$CURPLOT= <Network HP LaserJet P1505>
##$CURPRIN= <$Network HP LaserJet P1505>
##$DFORMAT= <normdp>
##$LAYOUT= <+/1D_H.xwp>
##$LFORMAT= <normlp>
##$PFORMAT= <normpl>
##$SURQMSG= 1
$$ End of Bruker specific parameters
$$ ---------------------------------
##NTUPLES= NMR SPECTRUM
##VAR_NAME=  FREQUENCY,     SPECTRUM/REAL,   SPECTRUM/IMAG
##SYMBOL=    X,             R,               I
##VAR_TYPE=  INDEPENDENT,   DEPENDENT,       DEPENDENT
##VAR_FORM=  AFFN,          ASDF,            ASDF
##VAR_DIM=   32768,         32768,           32768
##UNITS=     HZ,            ARBITRARY UNITS, ARBITRARY UNITS
##FACTOR=    0.250966925370066, 1,           1
##FIRST=     8223.43324360094, -84435,       -41114
##LAST=      0,             38289,           -28798
##MIN=       0,             -793251,         0
##MAX=       8223.43324360094, 429138806,    0
$$ Real data points
##PAGE= N=1
##DATA TABLE= (X++(R..R)), XYDATA
$$ [...]
19556e5907q4767c8685j30459B4575b0934m1324C8840o615O8493a92619j38846
$$ -55907 -140674 -38685 -169144 24575 -20934 -62258 38840 32225 100718 -192619 -331465
19545c31465a231o9184j16584p0822A86926a72305J8792K0205N7457P29B29470
$$ -331465 -1231 -70415 -186999 -257821 186926 -172305 -153513 -133308 -75851 -75122 229470
19533F1939g4221C71676a87563k85394a6569j61919A53263A8505d83376G7391
$$ 61939 -74221 371676 -187563 -472957 -16569 -178488 153263 18505 -483376 77391
19522e4927k05364H0130I644M05492h5207p1212q9653A74830o045b32817d4931
$$ -54927 -260291 80130 9644 415136 -85207 -156419 -246072 174830 168785 -232817 -44931
19510B79019a6880j25805k45730a67772G7123b46495h4060j63866H8318a25589
$$ 279019 -16880 -142685 -388415 -167772 77123 -246495 -84060 -247926 88318 -125589
19499I6277a25168d6495E8628a26956r5355A77391a40769I6061J15414c173G8484
$$ 96277 -125168 -46495 58628 -126956 -222311 177391 -140769 96061 211475 -3173 78484
19487E7264J2753a34219M9825k29340C9665c55604J56261L9922N7565I0882a53948
$$ 57264 70017 -134219 -84394 -313734 39665 -355604 -199343 -159421 -101856 90882 -153948
19475b24178f6964F1378b6043k06670a12431A78609c61899P4755C13931b74544
$$ -224178 -66964 61378 -26043 -232713 -112431 178609 -361899 -287144 313931 -274544
19464a06881j65040J7070D4790N8585d2273A4766J5322c06818a11871H8464A4052
$$ -106881 -271921 -254851 44790 103375 -42273 14766 30088 -306818 -111871 88464 14052
19452a05129G5884c2266I0135A3884b38826B41252f4526a5823l27561a55515j3908
$$ -105129 75884 -32266 90135 13884 -238826 241252 -64526 -15823 -343384 -155515 -169423
19441a69423k04707f0278J1836k96482e0428a3495O047j18279D7280h4883F9011
$$ -169423 -374130 -60278 -48442 -344924 -50428 -13495 -7448 -125727 47280 -84883 69011
19429a54190b1981l17452b4252r6431A47282a16106N0975B4964J05829B2881f4762
$$ -154190 -21981 -339433 -24252 -120683 147282 -116106 -65131 24964 130793 22881 -64762
19417A01025O9848a29363C5573K69958f9508a5281j13242B17858k919a01993j42297
$$ 101025 170873 -129363 35573 305531 -69508 -15281 -128523 217858 214939 -101993 -244290
19406b44290B31242a35639m6554Q1869N526E8080J14868b04263A93120b60913
$$ -244290 231242 -135639 -182193 -100324 -94798 58080 172948 -204263 193120 -260913
19395H1504b8860B09584a80014A78082j9149a59509A39932J4209a39809c6379
$$ 81504 -28860 209584 -180014 178082 158933 -159509 139932 154141 -139809 -36379
19384b23462f3621j51580i7612j2971A73247b25397D3263d98089a33150k7694
$$ -223462 -63621 -215201 -97612 -110583 173247 -225397 43263 -498089 -133150 -160844
19374a60844j05758B43758a84388n2765a09242o9137F751b08138F6864d42880
$$ -160844 -266602 243758 -184388 -237153 -109242 -178379 6751 -208138 66864 -442880
19363b79999h6837j98701e4158B94966b3069k31689C5235a75577B6802J09941
$$ -279999 -86837 -285538 -54158 294966 -23069 -254758 35235 -175577 26802 136743
19353A36743L2703a07136j97103R7753A32022b912D7209a50325a03j81825J1815
$$ 136743 169446 -107136 -304239 -206486 132022 -2912 47209 -150325 -103 -181928 -170113
19342a70113B2552b89991B74628i3615I3631c43289J62975A45446a24382j88027
$$ -170113 22552 -289991 274628 -93615 93631 -343289 -180314 145446 -124382 -312409
19332c12409a17124b3389B73729A26258b41599a06868j12760h7457k534B36369
$$ -312409 -117124 -23389 273729 126258 -241599 -106868 -219628 -87457 -89991 236369
19321g341C3225L5309M2770c53730c2387j81254B29244b56163i8986B7578f2528
$$ -7341 33225 68534 111304 -353730 -32387 -213641 229244 -256163 -98986 27578 -62528
19309E6838b22706B81009d44257a5677j3910j50472E6899i660j94412A0498K9295
$$ 56838 -222706 281009 -444257 -15677 -29587 -180059 56899 -9660 -204072 10498 39793
19298C9793Q2631a93041p7333C2281c68821h0512E798a5571k44603a10617n0247
$$ 39793 122424 -193041 -270374 32281 -368821 -80512 5798 -15571 -260174 -110617 -160864
19287a60864A04971b48349B18206a80616a0247H4868C0345b6856H4850f0195j43232
$$ -160864 104971 -248349 218206 -180616 -10247 84868 30345 -26856 84850 -60195 -203427
19276b03427C08724a91025O6823k09439a42098c6394q0246A90190c0603k51737
$$ -203427 308724 -191025 -124202 -333641 -142098 -36394 -116640 190190 -30603 -282340
19266b82340J12468P3564A87709k5211a34708A47690D487b96268H5213i1000l9798
$$ -282340 -169872 -96308 187709 162498 -134708 147690 4487 -296268 85213 -91000 -130798
19255a30798j68869A50604a92309P3768D883J85769b76986B05419d72021a38573
$$ -130798 -299667 150604 -192309 -118541 4883 190652 -276986 205419 -472021 -138573
19244B81313I6784b57304f5366k6295A25012n2836L7915b87571K8392A76566b0428
$$ 281313 96784 -257304 -65366 -91661 125012 72176 110091 -287571 -259179 176566 -20428
19232D0806K00961e731m4290k0684j66801e5463A28266a94565A01492m7745a66407
$$ 40806 241767 -5731 -50021 -70705 -237506 -55463 128266 -194565 101492 53747 -166407
19220A01765a16262B9876e58853D8285L6184K95520a43636f9734C5829a37382
$$ 101765 -116262 29876 -558853 48285 84469 379989 -143636 -69734 35829 -137382
19209b39665i9932d6448o7238n0470C44896d5714A00174M3311B90O7380j7263
$$ -239665 -99932 -46448 -113686 -164156 344896 -45714 100174 143485 290 67670 50407
19198E0407a22336A35512J27436D9526b96368f3805E0484g4865G0515B6349Q2045
$$ 50407 -122336 135512 262948 49526 -296368 -63805 50484 -74865 70515 26349 108394
19187A08394i2359r250F9309J68584E4221J1799b41420h0529j62522a03753e93
$$ 108394 -92359 -101609 69309 237893 54221 66020 -241420 -80529 -243051 -103753 -593
19175i3435J5055C02254F8865c97867a4660k011j26496j22471H8637a39566o8428
$$ -93435 -78380 302254 68865 -397867 -14660 -16671 -143167 -265638 88637 -139566 -207994
19164b07994I9419a34444k790r668B3347J765d24909J29837a10269r3215a3761
$$ -207994 99419 -134444 -137234 -146902 23347 25112 -424909 -295072 -110269 -203484 -13761
19152A8022c41781l175A01957a86161B05955d55407f3270l0362j11594O1085b5977
$$ 18022 -341781 -344956 101957 -186161 205955 -455407 -63270 -93632 -205226 -144141 -25977
19140H5258Q9941a30242O260d2030j72603h0241k68599F0598a03668A43589j8934
$$ 85258 175199 -130242 -123982 -42030 -214633 -80241 -348840 60598 -103668 143589 124655
19129A24655d0496q7067n6075B9008a49567D2203a43490d2934q3865m1663h0301
$$ 124655 -40496 -127563 -183638 29008 -149567 42203 -143490 -42934 -126799 -168462 -80301
19117A71934b45965i4097q821M665o2084k46774b7545L305n5098b9962A41947
$$ 171934 -245965 -94097 -102918 -98253 -160337 -407111 -27545 -24240 -79338 -29962 141947
19105b36230k817Q2155B3822J44054H2597b61471A43728c9569A99036a98623B86216
$$ -236230 -239047 -156892 23822 167876 82597 -261471 143728 -39569 199036 -198623 286216
19093b04800j56860H4042O7093d44234D9642b20797r4928a14612A9407a87204
$$ -204800 -361660 84042 151135 -444234 49642 -220797 -315725 -114612 19407 -187204
19082C25195c74662G3537L6613b42943J02932f1944C0950c08616B92732a82356
$$ 325195 -374662 73537 110150 -242943 -140011 -61944 30950 -308616 292732 -182356
19071a02320k64376a80509k95735b28863A73996o0645e034k25458B14603i2382
$$ -102320 -366696 -180509 -476244 -228863 173996 113351 -5034 -230492 214603 -92382
19060A81658i3076C41695b86509i9789j09255i9610j57890c9492j08430G874a43874
$$ 181658 -93076 341695 -286509 -99789 -209044 -99610 -257500 -39492 -147922 7874 -143874
19048c06096G7742J72323a0611j68953O9684d3455B71309a04801R428l3051M0952
$$ -306096 77742 250065 -10611 -179564 -109880 -43455 271309 -104801 -95373 -128424 -87472
19037h7472m5533A29092a60896C35464I1154J33632K1238M08473B9908a95608
$$ -87472 -133005 129092 -160896 335464 91154 224786 246024 654497 29908 -195608
19026B4690a43840A33209K76739c2804q7213e0873k30631E171Q9627Q8565a3538
$$ 24690 -143840 133209 409948 -32804 -120017 -50873 -281504 5171 94798 183363 -13538
19014B0858g9083n8464l6526Q288J1666b4696m7041A63656q0761a68731H7615
$$ 20858 -79083 -137547 -174073 -165785 -154119 -24696 -71737 163656 82895 -168731 87615
19002a08898A48906b32593E7655P3016f6405A31587b38504a06733B73665b08519
$$ -108898 148906 -232593 57655 130671 -66405 131587 -238504 -106733 273665 -208519
18991a58455L9787I0287L54442c22645a7694C91515b44255H7097g8311A6171b78703
$$ -158455 -118668 90287 444729 -322645 -17694 391515 -244255 87097 -78311 16171 -278703
18979g6110B846M83558a816B31902b81549e3093k33642A03403O538a67902m3260
$$ -76110 2846 486404 -1816 231902 -281549 -53093 -286735 103403 109941 -167902 -211162
18968b11162B2763J17695a1116j09866E541g094q5377A24468M5379K3061J21068
$$ -211162 22763 140458 -11116 -120982 5541 -7094 -92471 124468 169847 192908 313976
18957C13976D6607a5308A23729b78577A25941d183m38963h0787j47471F2734K18588
$$ 313976 46607 -15308 123729 -278577 125941 -4183 -443146 -80787 -228258 62734 281322
18946B81322A7462c77445a30901B68234a65671b4338j64023A48585C142K58293
$$ 281322 17462 -377445 -130901 268234 -165671 -24338 -188361 148585 3142 261435
18936B61435b25178j21993D7640i3016l8672D8645f9887r9516H52R9682B3505
$$ 261435 -225178 -347171 47640 -93016 -131688 48645 -69887 -169403 852 100534 23505
18924c37551B3369P6928C9118d20865J38974a08773r1824B49279c39436e1143
$$ -337551 23369 100297 39118 -420865 -281891 -108773 -200597 249279 -339436 -51143
18913b69415j55514B35568h6803q9520j21141a22485l26718E2392b30440B55955
$$ -269415 -424929 235568 -86803 -176323 -297464 -122485 -449203 52392 -230440 255955
18902A68660J0522L22006h7278p0660q6633D52468b89147A3653N1469d0818A61799
$$ 168660 179182 501188 -87278 -157938 -244571 452468 -289147 13653 65122 -40818 161799
18890b30834c0203k18781b6567C4851b57596A46726A9031a07669C56545c7218
$$ -230834 -30203 -248984 -26567 34851 -257596 146726 19031 -107669 356545 -37218
18879b5829F1633c22093A1026a54179j47347A43528b05761F729c06834A2359a52695
$$ -25829 61633 -322093 11026 -154179 -301526 143528 -205761 6729 -306834 12359 -152695
18867G3957a99376H6211b482H0038a29757I8812n760J4816c42037a30714A08880
$$ 73957 -199376 86211 -2482 80038 -129757 98812 93052 107868 -342037 -130714 108880
18855A13007a12006d9851H8111b04211r7014f1453A03069J5904b4257A48319i161
$$ 113007 -112006 -49851 88111 -204211 -301225 -61453 103069 118973 -24257 148319 -9161
18843A6899p190J33425F6817A6615h2237P044a2517j07593M2594b8062j41265
$$ 16899 9709 143134 66817 16615 -82237 -75193 -12517 -120110 -77516 -28062 -169327
18832a69327f6351l49566A80860G4647b87013k54811b59681c069A19534j3785
$$ -169327 -66351 -415917 180860 74647 -287013 -541824 -259681 -3069 119534 105749
18822A05749P4587J24055I5149K59N5358C6818a72382C2874Q0214I826J07582
$$ 105749 180336 304391 95149 95408 150766 36818 -172382 32874 113088 9826 117408
18811A17408b4456Q085j4868j2647B22645a57656c443G5084a05037m4738R535
$$ 117408 -24456 -16371 -31239 -43886 222645 -157656 -3443 75084 -105037 -149775 -140240
18800a40240I1229c42703J56889r4450C8290J6949h6792o7698O8285j09656A91778
$$ -140240 91229 -342703 -185814 -280264 38290 55239 -86792 -154490 -86205 -195861 191778
18788A25123O0784h4658l55462J84390J03039J710d1442j66756a9975q8129B15614
$$ 125123 185907 -84658 -440120 -255730 -152691 -150981 -41442 -208198 -19975 -108104 215614
18776C99429j73219A05760B7885g2612p504A11919c64774i7557M4014A12054j6390
$$ 399429 226210 105760 27885 -72612 -80116 111919 -364774 -97557 -53543 112054 95664
18765I5664i6786k16645a08106D8453b47255q6764a41513A15534d31232B57525
$$ 95664 -96786 -313431 -108106 48453 -247255 -334019 -141513 115534 -431232 257525
18754A9978d5548j4295A06596I037L50278A01342J27631B9434d63897P2052B44816
$$ 19978 -45548 -59843 106596 9037 359315 101342 228973 29434 -463897 -391845 244816
18742b5533p5541B87125c6872k05213C16603a61849c5172q3444p2365d7885B35678
$$ -25533 -101074 287125 -36872 -242085 316603 -161849 -35172 -118616 -190981 -47885 235678
18730d5475j30915e1723o1063q7897C9673a11647k6553N4132p8728A86407b12341
$$ -45475 -176390 -51723 -112786 -200683 39673 -111647 -138200 -84068 -162796 186407 -212341
18718b66031J13138H4436e6979o2852N8867l5055d5110j75968a01559j48623N7935
$$ -266031 -152893 84436 -56979 -119831 -60964 -96019 -45110 -221078 -101559 -250182 -192247
18707a92247A62620b78298a25150H9111b44459a08794C26737A18355N5320f3063
$$ -192247 162620 -278298 -125150 89111 -244459 -108794 326737 118355 173675 -63063
18696c07900A17417k5376e4233j92216C0010b03074P2086f0329j22826Q2573l1182
$$ -307900 117417 92041 -54233 -246449 30010 -203074 -130988 -60329 -183155 -100582 -131764
18685a31764J3387j28194H5404e7171j75171j51867C12884d17977D18934a5802
$$ -131764 -118377 -246571 85404 -57171 -232342 -384209 312884 -417977 418934 -15802
18674B07965b36540c9462A8921d15437A82509e3697k88974J46637A8575c0953
$$ 207965 -236540 -39462 18921 -415437 182509 -53697 -342671 -196034 18575 -30953
18663A27466B4690b7325A36666j8602Q9208e0835F7443b93602c6362m11200A22431
$$ 127466 24690 -27325 136666 118064 207272 -50835 67443 -293602 -36362 -447562 122431
18651a39153j66697A55195K8266b77076J33385k6623e1891d725B277d4207p361
$$ -139153 -305850 155195 183461 -277076 -143691 -170314 -51891 -4725 2277 -44207 -51568
18640e1568D4538f3869o5258d0536j95675Q1058B47748d5183A13601J02370j06031
$$ -51568 44538 -63869 -129127 -40536 -236211 -155153 247748 -45183 113601 215971 109940
18629A09940b04607k52472A0137g1147J6572j00977k38654J27750a08915G8193
$$ 109940 -204607 -457079 10137 -71147 -54575 -155552 -394206 -266456 -108915 78193
18618d50021J11510a44034F8654J21201d46027A49370h6735q3617d0570C5236
$$ -450021 -338511 -144034 68654 189855 -446027 149370 -86735 -170352 -40570 35236
18607A6577J1041c57k08260J01152g90G5057a91410j21677a51843f2871k134A45040
$$ 16577 27618 -357 -208617 -107465 -790 75057 -191410 -313087 -151843 -62871 -65005 145040
18594b84735m8305f9649o5931p8995L523K0381n8454a03335E0382b13560B13392
$$ -284735 -333040 -69649 -135580 -214575 -211052 -190671 -249125 -103335 50382 -213560 213392
18582a75569e6031A59260J0730K1382o9150b36992A12756i6112A57483a33743
$$ -175569 -56031 159260 169990 191372 122222 -236992 112756 -96112 157483 -133743
18571c3227j8497k66156f2542A05043c32977A40363b63809J31278e6385R896k15854
$$ -33227 -51724 -317880 -62542 105043 -332977 140363 -263809 -132531 -56385 -46489 -262343
18560b62343M1561B83706A2789a81970f7625l7668A87774F4625a31139k1060A3918
$$ -262343 -220782 283706 12789 -181970 -67625 -105293 187774 64625 -131139 -152199 13918
18548i9003j7517B64937B8206c8258k78003a22849l09714A52053K1460m2597b18698
$$ -99003 -116520 264937 28206 -38258 -316261 -122849 -432563 152053 173513 130916 -218698
18536H3075n417a17996C9113h5436p7467C3111q141a7447j50206B80721H1203
$$ 83075 77658 -117996 39113 -85436 -162903 33111 24970 -17447 -167653 280721 81203
18524e0880j2334c1416p5987j2450e7447o7311A58705n9634b38711A2600a8825
$$ -50880 -63214 -31416 -107403 -119853 -57447 -124758 158705 99071 -238711 12600 -18825
18512E0955J54378b71455g4125j07356O5676j48511e6978j97554O0188Q2627A95292
$$ 50955 205333 -271455 -74125 -181481 -115805 -264316 -56978 -254532 -194344 -111717 195292
18500C4207A3076c43229g2821p4002k0671D59294b54871j8281G2152b30736E1741
$$ 34207 13076 -343229 -72821 -146823 -167494 459294 -254871 -273152 72152 -230736 51741
18488A22966c2122A31431i5690E86a09164l3793F2416Q2779b08109H2233A9436
$$ 122966 -32122 131431 -95690 586 -109164 -142957 62416 145195 -208109 82233 19436
18476C3697M7728a85751P7465c6789k54717i7159h262k37770d0578C97353B0363
$$ 33697 81425 -185751 -108286 -36789 -291506 -97159 -8262 -246032 -40578 397353 20363
18464A32198d03426J74580r1534A34576b42252g0164j37094H0658C9353d10813
$$ 132198 -403426 -228846 -320380 134576 -242252 -70164 -207258 80658 39353 -410813
18453i7775A59059b67455A32113a08455j26577J06252E1695A6871P350a69344
$$ -97775 159059 -267455 132113 -108455 -235032 -128780 51695 16871 24221 -169344
18442a98667A95924p358a20049k44060A10273P2879a61937a1950B52299b0341
$$ -198667 195924 188566 -120049 -364109 110273 183152 -161937 -11950 252299 -20341
18431F00204B76283b48285D9548f9257l16528d8026o0383e120j70730h7248q5871
$$ 600204 276283 -248285 49548 -69257 -385785 -48026 -108409 -5120 -175850 -87248 -173119
18420a73119A63697b91667a41283j6450k36784g042k01700m8827j20669K9639
$$ -173119 163697 -291667 -141283 -157733 -394517 -7042 -208742 -257569 -378238 -348599
18410c48599F0586k2402c673C26516A43357J3561g5362n0892C59660a61173l2409
$$ -348599 60586 38184 -3673 326516 143357 156918 -75362 -126254 359660 -161173 -193582
18399a93582e5224H1207b34198a10651r0595H3660f639H2557J0506f6225H4099
$$ -193582 -55224 81207 -234198 -110651 -201246 83660 -6639 82557 93063 -66225 84099
18387H0936c45474H4716d08601A36888a06045o87206a12950j0728q6215j23982
$$ 80936 -345474 84716 -408601 136888 -106045 -793251 -112950 -123678 -209893 -333875
18377c33875F9981a64337j76863g1082k80105M1908K2741b6322A58699b24475
$$ -333875 69981 -164337 -341200 -71082 -351187 -309279 -286538 -26322 158699 -224475
18366a34091k9911K9868e2439C5553c7666k65852G7242b59758J27405G3264c37767
$$ -134091 -164002 -134134 -52439 35553 -37666 -303518 77242 -259758 -132353 73264 -337767
18354c02253B9405c81861a22501A66708M6035j05527a03009C00070c0544B2394
$$ -302253 29405 -381861 -122501 166708 212743 107216 -103009 300070 -30544 22394
18343d8594k98055a41355j13059b4590j6785A19776a69488d7502G42a86608I5644
$$ -48594 -346649 -141355 -254414 -24590 -41375 119776 -169488 -47502 742 -186608 95644
18331A06136a24545A72924R6060E3027J10971E2438g0568j30879l7702c3255A27012
$$ 106136 -124545 172924 268984 53027 163998 52438 -70568 -201447 -239149 -33255 127012
18319a16537e4026i346j1555p5334j76593B51857o0919i0615q9966O6799r2275
$$ -116537 -54026 -9346 -20901 -96235 -272828 251857 190938 -90615 -180581 -113782 -206057
18308b06057B44618a55837G5605a67347M7781B9422a2570k45174L7781b099j54479
$$ -206057 244618 -155837 75605 -167347 -119566 29422 -12570 -257744 -219963 -2099 -156578
18297a56578A36487e8137F7874L1202C3677a76648A75711f5482H0033l7399a37201
$$ -156578 136487 -58137 67874 99076 33677 -176648 175711 -65482 80033 42634 -137201
18285A18131Q9359a57675q1149e6861C39879c21028a25166n9998p022Q2690A37652
$$ 118131 207490 -157675 -238824 -56861 339879 -321028 -125166 -185164 -192186 -109496 137652
18273b85503b3621l862k13149B13973m3273F6054b38627F0193j201f1084k1327
$$ -285503 -23621 -27483 -240632 213973 170700 66054 -238627 60193 58992 -61084 -82411
18262h2411l45807A09480n3581J48455g8612A32383K8236A5827h9203B3271a78994
$$ -82411 -428218 109480 55899 204354 -78612 132383 160619 15827 -89203 23271 -178994
18250b51095f5488H1511l4712J74292A10128L492A0133h6038G5038c6532k20387
$$ -251095 -65488 81511 46799 221091 110128 113620 10133 -86038 75038 -36532 -256919
18239b56919K0744C3194c21447a24233c287j17835R317B04421C6579a26553a9103
$$ -256919 -236175 33194 -321447 -124233 -3287 -121122 -111805 204421 36579 -126553 -19103
18227b13658D3044d79143E5167K00764A18738c7490a4489B66577g256m8381b2525
$$ -213658 43044 -479143 55167 255931 118738 -37490 -14489 266577 -7256 -55637 -22525
18215a1838A24566m1307C8629a03642r7535A11736i5876B58121b71265B91778
$$ -11838 124566 83259 38629 -103642 -201177 111736 -95876 258121 -271265 291778
18204b6890A27885b72560D3378J99856I0119c1558j33974k13573J44880j94102
$$ -26890 127885 -272560 43378 243234 90119 -31558 -165532 -379105 -234225 -428327
18194d28327d5070A9124k294a21748A08349a67451D1612R6493c5162k85427J40772
$$ -428327 -45070 19124 16830 -121748 108349 -167451 41612 138105 -35162 -320589 -179817
18183a79817a8175j37960j09984D7368a31895l5697I9698b81533a05390n4794
$$ -179817 -18175 -156135 -266119 47368 -131895 -167592 99698 -281533 -105390 -160184
18173a60184l6176b6598j37559i66k46766D5409M4844b67049n408D3497J37176
$$ -160184 -196360 -26598 -164157 -966 -247732 45409 90253 -267049 -272457 43497 180673
18162A80673J08089b26148A75067k9778K2355b75512a01466A74246a10728A34736
$$ 180673 288762 -226148 175067 145289 167644 -275512 -101466 174246 -110728 134736
18151B35647a1930n2977F810a55898j53971C53696b8048e075j40194k57317a26285
$$ 235647 -11930 -64907 6810 -155898 -309869 353696 -28048 -5075 -145269 -402586 -126285
18139a59821N0644j60135B13237E0212N1132a5406p2564F1314b37245e0791a1702
$$ -159821 -109177 -269312 213237 50212 101344 -15406 -87970 61314 -237245 -50791 -11702
18127A64856B6637a8381m01507i9106k32387c1691C8879J28713b01563k7381B5364
$$ 164856 26637 -18381 -419888 -99106 -331493 -31691 38879 167592 -201563 -228944 25364
18115a40413j92767h4738F5677J03390o6287m0685a91895b023p13B0189R4786
$$ -140413 -333180 -84738 65677 169067 102780 62095 -191895 -2023 -2736 20189 114975
18104A14975e3340J1645B22759J55651f6944j03540A48004a52993B07681i0254
$$ 114975 -53340 -41695 222759 378410 -66944 -170484 148004 -152993 207681 -90254
18093B46996a89111A28024A0038K72696A21932a10923j11907A05983c7681G2276
$$ 246996 -189111 128024 10038 282734 121932 -110923 -222830 105983 -37681 72276
18082G64c3439A73002c58262B05769B7214b2856j16399A10244b12259b6154C1565
$$ 764 -33439 173002 -358262 205769 27214 -22856 -139255 110244 -212259 -26154 31565
18070B86017B7389a0304A29795c03884D51383B08971b93020A19698J33379c9002
$$ 286017 27389 -10304 129795 -303884 451383 208971 -293020 119698 253077 -39002
18059A07226b50948b8599B73009b28323B9782a87235H748a41109O740j33412N0692
$$ 107226 -250948 -28599 273009 -228323 29782 -187235 8748 -141109 -134369 -267781 -217089
18048b17089e409l05790a20542A53410n6446d3073i311k93369H1666A0665Q8048
$$ -217089 -5409 -311199 -120542 153410 96964 -43073 -9311 -302680 81666 10665 98713
18037I8713J74042g0165k3150j872j99374E7212b58024B70794A23123J61525a45395
$$ 98713 272755 -70165 -93315 -95187 -294561 57212 -258024 270794 123123 284648 -145395
18025b22982M0806l050L6408C61564f2734A16597b84018H7575a31330K5371m80389
$$ -222982 -182176 -185226 -148818 361564 -62734 116597 -284018 87575 -131330 -105959 -586348
18014e86348i8410m396p8541A06912C0744a31327N7418k41347k19807A85907B631
$$ -586348 -98410 -102806 -181347 106912 30744 -131327 -73909 -315256 -535063 185907 2631
18002g1651n4255M8750J8451J7063d23j68546D83846b35623J1376E053a07470
$$ -71651 -125906 -77156 -58705 -41642 -423 -168969 483846 -235623 -224247 5053 -107470
17990a95617j83740A26839J83938a22878A73919a79815Q6670j22868k32128a10034
$$ -195617 -379357 126839 310777 -122878 173919 -179815 -93145 -216013 -448141 -110034
17979i6446A73131b99195O1092i1076F1129a41963L2552A8111Q8032B1575a72680
$$ -96446 173131 -299195 -238103 -91076 61129 -141963 -109411 18111 106143 21575 -172680
17967B7219e6065A6203d49120I453K58150l7672h8053C76504f0954B38387a78325
$$ 27219 -56065 16203 -449120 9453 267603 229931 -88053 376504 -60954 238387 -178325
17955g1386F5508J85458d1340l29898I76O7507a72716l0423e9883B69941a07126
$$ -71386 65508 250966 -41340 -371238 976 68483 -172716 -203139 -59883 269941 -107126
17943B52398h7610j4467A57797h001B16642g9104C37864G4477c4845C28154B4006
$$ 252398 -87610 -102077 157797 -8001 216642 -79104 337864 74477 -34845 328154 24006
17931A3878a51529I1953m2458A3593a88212P7138F8445d1015E9691L6463a23198
$$ 13878 -151529 91953 49495 13593 -188212 -111074 68445 -41015 59691 96154 -123198
17919G3469J28304A3133a09479C29644A28710a4188j84370I6454K4214e2898B82200
$$ 73469 201773 13133 -109479 329644 128710 -14188 -198558 96454 120668 -52898 282200
17907E6045A6106b42861j58770B67297a5123A96238f4257F3769K43583A26927
$$ 56045 16106 -242861 -401631 267297 -15123 196238 -64257 63769 307352 126927
17896a11226k39591B17550a29830A65975O2860a66257j80442J47653B26914G8388
$$ -111226 -350817 217550 -129830 165975 228835 -166257 -346699 -199046 226914 78388
17885c80077g6446J3934j03183A47876e5087H8001O9589i3942E3217e8999k00123
$$ -380077 -76446 -62512 -165695 147876 -55087 88001 157590 -93942 53217 -58999 -259122
17874b59122c2991j21037K7721o3228G7382J11401C1515d16700a24854I2070d4474
$$ -259122 -32991 -154028 -126307 -189535 77382 188783 31515 -416700 -124854 92070 -44474
17862f8019o5747e1194D5408Q049P2079c5541j10410k3730j78984g3490o6918
$$ -68019 -133766 -51194 45408 53457 125536 -35541 -145951 -169681 -348665 -73490 -140408
17851a40408F2840j1491L7801a58101A09879J9535a65544e4832k3166j19247D3877
$$ -140408 62840 51349 89150 -158101 109879 129414 -165544 -54832 -77998 -197245 43877
17839b51685A87422F1027M0334k6015J05634o5154a50812A1037Q5557c00632e4573
$$ -251685 187422 61027 101361 75346 180980 115826 -150812 11037 96594 -300632 -54573
17827b474B6501b34729B06680D6354h6282j16767A20254e4194r2959k0655P6312
$$ -2474 26501 -234729 206680 46354 -86282 -203049 120254 -54194 -147153 -167808 -91496
17816i1496d73n6802G8359J5401c23416A33459B1285e9390j47488A47840a18391
$$ -91496 -473 -57275 78359 93760 -323416 133459 21285 -59390 -206878 147840 -118391
17804b8030m22180a9179j53502d2611I7097A4836b367B4955K07897R5924c6578
$$ -28030 -450210 -19179 -172681 -42611 97097 14836 -2367 24955 232852 328776 -36578
17792a22741j54109e9388A60741d923j0994k72810A9096d0887A30971b30139H6297
$$ -122741 -276850 -59388 160741 -4923 -15917 -288727 19096 -40887 130971 -230139 86297
17780a88591C40542a62836d5606C454i1613M4312F9430J26538H8669J5523a90157
$$ -188591 340542 -162836 -45606 3454 -91613 -47301 69430 195968 88669 104192 -190157
17768A74911c44952I5154B5017L26935I9977l1953f2890k86982h4406B70895a98772
$$ 174911 -344952 95154 25017 351952 99977 68024 -62890 -349872 -84406 270895 -198772
17756i9343K6897A62311J60202H0661a79339e331H9124d6028B52383I7893b15373
$$ -99343 -72446 162311 322513 80661 -179339 -5331 89124 -46028 252383 97893 -215373
17744A17640A368J07677K2201j1399c84708a52175f0751H8055M4276m9327B5418
$$ 117640 1368 109045 131246 119847 -384708 -152175 -60751 88055 132331 83004 25418
17732a09564a3031j90293E6683i8078C7586M6541a55857N5814E1261J7760L33460
$$ -109564 -13031 -203324 56683 -98078 37586 84127 -155857 -100043 51261 69021 402481
17721D02481b31413Q9500l0158A35031K33844A49824d5020j1694A55941a67992
$$ 402481 -231413 -141913 -172071 135031 368875 149824 -45020 -56714 155941 -167992
17710a68385H8449h9134A13360a83994j11479a01271a1984A81309c1963j27632
$$ -168385 88449 -89134 113360 -183994 -295473 -101271 -11984 181309 -31963 -159595
17700a59595N4927D3330R6183b07146B77851a03991A46923K22341j51398h8816
$$ -159595 -104668 43330 139513 -207146 277851 -103991 146923 369264 217866 -88816
17689A69108a7023B61155B2727b0350A39326a4374Q7n9728m5363l064A74927J19398
$$ 169108 -17023 261155 22727 -20350 139326 -14374 -14287 -74015 -119378 -122442 174927 294325
17677B94325g1262B0572L05243a9335A0158a39549F4376a38901A16405n6452g3714
$$ 294325 -71262 20572 325815 -19335 10158 -139549 64376 -138901 116405 59953 -73714
17665c5312k92025A81456a02002n0495b7047B16959a55690f662A29195b19350
$$ -35312 -327337 181456 -102002 -152497 -27047 216959 -155690 -6662 129195 -219350
17654b58801B57566a8445o0095E7918K65737A6676N8052a16664j08676r6579A49179
$$ -258801 257566 -18445 -78540 57918 323655 16676 74728 -116664 -225340 -321919 149179
17642C9743N3615a9449C5854g0288a6750B48706o2045c2919B7089k710J0537f0229
$$ 39743 93358 -19449 35854 -70288 -16750 248706 186661 -32919 27089 24379 34916 -60229
17629c84E5057b13519A71807P5875e2760l797B41649a23886J2729j96465N8915
$$ -384 55057 -213519 171807 247682 -52760 -56557 241649 -123886 -111157 -307622 -248707
17618b48707B52106b69979A36667g1898e536m7957p0566p602K4790E4661d9130
$$ -248707 252106 -269979 136667 -71898 -5536 -53493 -124059 -131661 -106871 54661 -49130
17606a94183P3035H4417a6660C6449b7492C2257O3076K01863a42634A07126J56804
$$ -194183 -121148 84417 -16660 36449 -27492 32257 95333 297196 -142634 107126 263930
17595B63930e0530j22745A45413B3266L38903b3712G0454N3196L3796c1436n7236
$$ 263930 -50530 -173275 145413 23266 362169 -23712 70454 123650 157446 -31436 -88672
17584h8672I2615j7679b16140G4604a79727J9213A57785a13109j78717H9317Q1408
$$ -88672 92615 74936 -216140 74604 -179727 -160514 157785 -113109 -291826 89317 170725
17573A70725J1124a14294j06858c0814C36441C403b45712A70050F3855J31167
$$ 170725 181849 -114294 -221152 -30814 336441 3403 -245712 170050 63855 195022
17563A95022J91212q2703r5603a7004C42407l1048l2743a5777C87415A06980c7619
$$ 195022 386234 303531 207928 -17004 342407 311359 278616 -15777 387415 106980 -37619
17551a48442A89206K88067c02675B12324a49865C31471C8870d4245o7056H8313
$$ -148442 189206 477273 -302675 212324 -149865 331471 38870 -44245 -111301 88313
17540C57496j32776e5670A70352b01491A44874i2753H7817J22343a95067B95183
$$ 357496 224720 -55670 170352 -201491 144874 -92753 87817 210160 -195067 295183
17529e132A59466o7928b36255B79027m7961F2253Q5089P693E313M5461i9423B37356
$$ -5132 159466 91538 -236255 279027 231066 62253 147342 155035 5313 50774 -99423 237356
17516E8774J97899K62763f1992A11844D6023N9273a04255C839a8200j40919B30512
$$ 58774 256673 519436 -61992 111844 46023 105296 -104255 3839 -18200 -159119 230512
17504B16J56175m9159b0021l62392A85403P3058G7796c94942B0461b1426C36534
$$ 216 156391 107232 -20021 -382413 185403 258461 77796 -394942 20461 -21426 336534
17492g3512A25038J12282B7171K21806b00300O0085O8573C95455A37932B5037
$$ -73512 125038 237320 27171 248977 -200300 -140215 -71642 395455 137932 25037
17481G7561b15133A99693H8786l838R6384K17716j49612j23262e9046A67367l0930
$$ 77561 -215133 199693 88786 84948 181332 399048 249436 126174 -59046 167367 136437
17470A36437K1105K81699C7133K62074P7922j70230O3611K4870C4505b8869A01095
$$ 136437 157542 439241 37133 299207 377129 206899 270510 295380 34505 -28869 101095
17458A13474D218L22611j6519j18353n6919Q7786F9401L33206A627J6451K09349
$$ 113474 4218 326829 310310 191957 135038 222824 69401 402607 1627 18078 227427
17447B27427F0710Q5413a69116C53642A40110n6531A06K67828j25991d3552A17409
$$ 227427 60710 146123 -169116 353642 140110 83579 106 267934 141943 -43552 117409
17435B22724j6619O8962K3649Q5049A67893L41781j10454A88843O087G6347K11829
$$ 222724 206105 275067 298716 383765 167893 509674 399220 188843 194930 76347 288176
17424B88176H8831J98944j10952A1339e144B42122c0881C26015J38486A02367
$$ 288176 88831 287775 176823 11339 -5144 242122 -30881 326015 464501 102367
17413B94271E2399M49405A38316P7741c0632B7653K04213J30457A63302F3774
$$ 294271 52399 501804 138316 216057 -30632 27653 231866 362323 163302 63774
17402I3350R6851N418l479N3146a5121A20251a64647C87963a21850B23767b42589
$$ 93350 190201 195619 192140 245286 -15121 120251 -164647 387963 -121850 223767 -242589
17390C49573e7243A86781K18435a20252E5193K35844a76546B77384L0542e8463
$$ 349573 -57243 186781 405216 -120252 55193 291037 -176546 277384 307926 -58463
17379c9039j61313R6723B40841e5689B96741I2928B149J03487m8562J26849D3770
$$ -39039 -200352 -103629 240841 -55689 296741 92928 2149 105636 57074 183923 43770
17367C22631A48521Q8582N4183j9387h0505B43417q6989M2640D0260J37563l417
$$ 322631 148521 237103 291286 271899 -80505 243417 156428 199068 40260 177823 174406
17356A74406o6376K5065O2026a23454N3283B80528l2934C9227M7728I257K29005
$$ 174406 108030 133095 195121 -123454 -70171 280528 247594 39227 86955 9257 238262
17345B38262D8343L13021A22000J45427j00998a85414A95092G2436J67364P1925
$$ 238262 48343 361364 122000 267427 166429 -185414 195092 72436 239800 311725
17335C11725r3906R0780p6928l9089J91892j41859k8645H502P054R3366J29618
$$ 311725 217819 308599 231671 192582 384474 242615 213970 8502 15556 108922 238540
17324B38540H3589R6756M9738A14514M67069k53280l4142a757B12633A05381M7512
$$ 238540 83589 180345 230083 114514 581583 328303 294161 -1757 212633 105381 152893
17313A52893K78179c5163D27660D3442J62011d23909A21814O6648J3631n670a36681
$$ 152893 431072 -35163 427660 43442 205453 -423909 121814 188462 202093 196423 -136681
17301b08374A0343a18213j18724d5183D35018j08870J19866c5487A77901R2328
$$ -208374 10343 -118213 -236937 -45183 435018 326148 446014 -35487 177901 270229
17291B70229G0744R3600Q0061k5531c4168I3167C9755J26682C3670K0338P1570
$$ 270229 70744 164344 244405 218874 -34168 93167 39755 166437 33670 54008 125578
17280A25578L27677k21471b2923A15579c4606q0855A04353K85286j56971a34494
$$ 125578 453255 231784 -22923 115579 -34606 -115461 104353 389639 232668 -134494
17269C70330A67173Q0456j17467J27145o1945D7912J79393Q0568j0054A23911
$$ 370330 167173 247629 130162 257307 195362 47912 227305 307873 297819 123911
17258a846l19716B6735j2798J16713D3792K66016b7304C9304a0378F48376A59814
$$ -1846 -321562 26735 13937 130650 43792 309808 -27304 39304 -10378 648376 159814
17246C89521A61581F247L47653A9185b44341B83588g8534B07284Q8185H6540J15453
$$ 389521 161581 6247 353900 19185 -244341 283588 -78534 207284 295469 86540 201993
17235B01993E4019J86775K10394A62206K72493J10738B03266r8618L34567B2149
$$ 201993 54019 240794 451188 162206 434699 545437 203266 104648 439215 22149
17224A05868B5846M28960B4464K84346j04851J24907j56530F7216J4478j7715
$$ 105868 25846 454806 24464 308810 203959 328866 172336 67216 81694 63979
17214F3979O0273K87878A86748C3872M55313J65037D1865H212L44776K5500j44227
$$ 63979 124252 412130 186748 33872 489185 654222 41865 8212 352988 378488 234261
17203B34261C2783M55156a19865E75203B26597J34412H5582K55805A66352j5448
$$ 234261 32783 487939 -119865 575203 226597 361009 85582 341387 166352 150904
17193A50904B9207M19147B15435m5476n5954J54020K97080j78990k0513I1056
$$ 150904 29207 448354 215435 169959 114005 268025 565105 386115 365602 91056
17182C81547b8057B09925J93230K505j00980H1847J62066L34272k30744j01534
$$ 381547 -28057 209925 403155 405660 304680 81847 243913 578185 347441 245907
17172B45907a74943A60678O9595P1032j1184G2433O4477J47216r2338J15108A283
$$ 245907 -174943 160678 230273 301305 290121 72433 136910 284126 191788 306896 1283
17160A47596J043E5257K78492a18682D43406q8026j62179C6971a5916D39564A71473
$$ 147596 148639 55257 333749 -118682 443406 355380 193201 36971 -15916 439564 171473
17148A02728K00855N5957A51610f8903D87563A40495l8151J10247N7151K38330
$$ 102728 303583 359540 151610 -68903 487563 140495 102344 212591 269742 508072
17138E08072A17657J88714L98274j29482j37572A79405O9023J4446L4283R7803
$$ 508072 117657 306371 704645 575163 437591 179405 248428 262874 297157 394960
17128C94960m3153K00778I9341K93837j32130K14136M5211O5516r4782p3925j00335
$$ 394960 351807 552585 99341 393178 261048 475184 520395 585911 491129 417204 316869
17117C16869F1609K84111M7361E7460K37222A38177n2231J59646K92600q5442
$$ 316869 61609 345720 393081 57460 294682 138177 85946 245592 538192 452750
17107D52750j27244j720j05329J3019M1741K78482B57757L18894j31860A91261
$$ 452750 325506 323786 218457 231476 273217 551699 257757 576651 444791 191261
17096C25105K6994A55095L17123L8154A14031K36645J77107B52180J93807k12426
$$ 325105 352099 155095 472218 510372 114031 350676 527783 252180 445987 233561
17086B33561K04646J34849q5841K10904B20726M2291n1668K81166j23362J87332
$$ 233561 438207 573056 487215 698119 220726 263017 211349 492515 369153 556485
17076E56485l831k26019O3616J03850q8722q3786K46529j22211K34181k09663
$$ 556485 552654 326635 390251 494101 405379 321593 568122 445911 680092 470429
17066D70429k6547I4458O66068B63188L08408j12441L56455C65702j49558K48460
$$ 470429 443882 94458 760526 263188 571596 459155 815610 365702 216144 464604
17056D64604L42035j71445J0445k24305L0665J13781j93698r2770K37708O7214
$$ 464604 806639 635194 645639 421334 451999 565780 372082 279312 517020 584234
17046E84234j85577P9331J1291L41186C43675L37808j34473J32616k60192M24613
$$ 584234 398657 477988 489279 830465 343675 681483 547010 679626 419434 844047
17036H44047l99609J58942J94597k93125K61822j39857K09004j06844k69695J08585
$$ 844047 444438 603380 797977 504852 766674 626817 835821 728977 459282 567867
17026E67867J03967C33171K20139L29335k57871K46435j05892k78985J91168j29079
$$ 567867 671834 333171 553310 882645 624774 871209 765317 486332 677500 548421
17016E48421B17508M63319j01632m0350K74199k13344J65283J01073J7415K7305
$$ 548421 217508 680827 579195 538845 813044 599700 764983 866056 883471 910776
17006I10776j33774k0984k30596J17312k15163K54680k11768K74887Q1421j2430
$$ 910776 777002 756018 525422 642734 427571 682251 470483 745370 826791 814361
16996H14361j27556R5826P4378J4820j1322o3363J87519j03543p2251j42973M7966
$$ 814361 686805 782631 857009 871829 860507 797144 984663 881120 808869 665896 713862
16985G13862N1338J57022K05984j18721k31265L24127k74719n7789K24632k38229
$$ 713862 765200 922222 1128206 1009485 778220 1102347 827628 769839 994471 756242
16975G56242K06182l61454J25897J98515J63469E00539N03938M6349J29368k67966
$$ 756242 962424 600970 726867 925382 1088851 500539 1004477 1050826 1180194 912228
16965I12228q448L34771j98090j73603N06151m44220L17025j29541m7972o181
$$ 912228 903780 1238551 1040461 866858 1373009 928789 1245814 1116273 1068301 1062120
16955A062120K50789j24020q4299J58902k54284J07411k15946L46703N200m4980
$$ 1062120 1312909 1188889 1104590 1263492 1009208 1116619 900673 1247376 1252576 1207596
16945A207596N03800G72421O81127j86328J8570j13346j46070K10232J4377o0175
$$ 1207596 1711396 772421 1453548 1267220 1285790 1172444 1026374 1236606 1250983 1190808
16935A190808j10220J88547K19534L0040j50229O7717p6645K25004k07991P3999
$$ 1190808 1080588 1269135 1488669 1518709 1368480 1436197 1359552 1584556 1376565 1450564
16925A450564j07639J30686J27114j06794L08342k06234k89391K15926N5907j02401
$$ 1450564 1342925 1473611 1600725 1493931 1802273 1596039 1306648 1522574 1578481 1476080
16915A476080L54516l04382k89298J81557J37521O46755n87753L63816k47722
$$ 1476080 1830596 1526214 1236916 1418473 1555994 2202749 1614996 1978812 1731090
16906A731090Q5205m1463L73626k2029j68739j44974m5991J64380l84657O32571
$$ 1731090 1816295 1774832 2148458 2126429 1957690 1812716 1766725 1931105 1546448 2179019
16896B179019j87513r4518J95445j63830J21145m8111M46489k94635Q1445J71840
$$ 2179019 1991506 1896988 2092433 1928603 2049748 2001637 2448126 2153491 2234936 2406776
16886B406776q0593M0288O6938j25843N5876J75898k3399N7421J43712L700p0246
$$ 2406776 2326183 2366471 2433409 2307566 2363442 2539340 2515941 2573362 2717074 2720774 2650528
16875B650528M3183j40808p8869K06883o6366J5101K77020j96k89743M28198n9443
$$ 2650528 2693711 2552903 2474034 2680917 2614551 2629652 2906672 2906476 2616733 3044931 2985488
16864B985488j87298L60165J12579k03394K21147J08959J6205q3138J52733M5943
$$ 2985488 2798190 3158355 3270934 3067540 3288687 3397646 3413851 3330713 3483446 3529389
16854C529389k6417L1630p6441j78775K83947l8946Q4890J92648J0956J8265M830
$$ 3529389 3502972 3534602 3458161 3279386 3563333 3524387 3609277 3801925 3812881 3831146 3835976
16843C835976J64185K53442J00389k86406O25705k04501K07938J47970L88J02654
$$ 3835976 4000161 4253603 4353992 4067586 4693291 4488790 4696728 4844698 4845086 4947740
16833D947740J04883l87749Q229P9326M06807L41796l0405n0010K67837J8981
$$ 4947740 5052623 4664874 4673103 4752429 5159236 5501032 5470627 5420617 5688454 5707435
16823E707435j89568L84435j0803Q8804M24227K5991O5604l7782K99182L77001
$$ 5707435 5517867 5902302 5891499 5980303 6404530 6430521 6496125 6458343 6757525 7134526
16813G134526m35143L60639N80088o7890j65647N38440m8167L58083m6339L61814
$$ 7134526 6699383 7060022 7640110 7572220 7406573 7945013 7896846 8254929 8208590 8570404
16803H570404K97435o4072j7888L85036K8806L00613K99623L83156J37066J26370
$$ 8570404 8867839 8803767 8785879 9170915 9199721 9500334 9799957 10183113 10320179 10446549
16793A0446549Q20597m05211M99195O27733J00527Q6656N37561N38653M9964O12723
$$ 10446549 11267146 10861935 11361130 11988863 12089390 12176046 12713607 13252260 13302224 13914947
16783A3914947Q849P93384N36892j76786P35840L90176M57662M73892M56197M97052
$$ 13914947 13923796 14717180 15254072 15077286 15813126 16203302 16660964 17134856 17591053 18088105
16773A8088105Q99803J08142J130481P04040N02490M98885J055990N38651P08291
$$ 18088105 18987908 19096050 20226531 20930571 21433061 21931946 22987936 23526587 24234878
16764B4234878J035646Q54500J198013O68592J162881J083862J227008J043707
$$ 24234878 25270524 26125024 27323037 27991629 29154510 30238372 31465380 32509087
16756C2509087J092773J582763J241881J454922J901518J509558J800941J962386
$$ 32509087 33601860 35184623 36426504 37881426 39782944 41292502 43093443 45055829
16748D5055829J958852J759148K459694K261734K427959K711356K813574K605428
$$ 45055829 47014681 48773829 51233523 53495257 55923216 58634572 61448146 64053574
16740F4053574L306709L401824L428183L712967L465760M121833M841102M226551
$$ 64053574 67360283 70762107 74190290 77903257 81369017 85490850 90331952 94558503
16732I4558503M492614N089290N617457N116375O022764N566489N829763N792938
$$ 94558503 99051117 104140407 109757864 114874239 120897003 126463492 132293255 138086193
16724A38086193O254009N184276N230236M541288M395438L518817K766147J436384
$$ 138086193 144340202 149524478 154754714 159296002 163691440 167210257 169976404 171412788
16716A71412788J101883m57016j031271k065341k978100l380588m293427m628296
$$ 171412788 172514671 172057655 171026384 168961043 165982943 162602355 158308928 153680632
16708A53680632n386980n013025n610581n821423n094902o124562m886020n411762
$$ 153680632 148293652 143280627 137670046 131848623 126753721 120629159 115743139 110331377
16700A10331377m906165n098953m515185m353257m494149l597618m102400l708121
$$ 110331377 105425212 100326259 95811074 91457817 86963668 83366050 79263650 75555529
16692G5555529l717568l173754l037166l110680k892796l051714k106135k839938
$$ 75555529 71837961 68664207 65627041 62516361 59623565 56571851 54465716 51625778
16684E1625778k382525j853859k350346j912362k021388j080374j810420j908232
$$ 51625778 49243253 47389394 45039048 43126686 41105298 40024924 38214504 36306272
16676C6306272j447619j487622j193462j455024j070646j053703r47560p51518
$$ 36306272 34858653 33371031 32177569 30722545 29651899 28598196 27650636 26899118
16668B6899118j400563r53360q09921n48757r70089q76553p07969p80223m6100
$$ 26899118 25498555 24545195 23735274 23186517 22216428 21339875 20631906 19851683 19805583
16659A9805583j007998n18140o03454p74590l95357l06489m87601l81865n85096
$$ 19805583 18797585 18279445 17675991 16901401 16506044 16199555 15711954 15330089 14744993
16650A4744993k16252n99875l72598l03238p70796j91335k36115m63965j06973
$$ 14744993 14528741 13928866 13556268 13253030 12482234 12290899 12054784 11590819 11483846
16641A1483846m31417K00530n02597m52217j27010j89585R9946n89788l98467
$$ 11483846 11052429 11252959 10750362 10298145 10171135 9981550 10081496 9491708 9093241
16632I093241m8570k58883l43503k9712j57688m0777k06422m83850k63035K37860
$$ 9093241 9044671 8785788 8442285 8412573 8254885 8214108 8007686 7523836 7260801 7498661
16622G498661l03002M6998m20791j8144o7590k33773m2549j00965l95312P302
$$ 7498661 7195659 7242657 6821866 6803722 6736132 6502359 6459810 6358845 5963533 5970835
16612E970835q1412m63148o2823L1884M6805m1174j46395J21399l42976p3666
$$ 5970835 5889423 5426275 5363452 5395336 5442141 5400967 5254572 5375971 5032995 4959329
16602D959329j62848j24115J51188l50807q9045k9168J12416k76042R9038N9452
$$ 4959329 4796481 4672366 4823554 4472747 4383702 4354534 4466950 4190908 4289946 4349398
16592D349398j24988k09877l61193o0274L52327l59903M25028m64939K54778m3263
$$ 4349398 4224410 4014533 3653340 3593066 3945393 3585490 4010518 3545579 3800357 3757094
16582C757094k16785m73250M36161O2110l71986R0089j53539m21013K56188m4384
$$ 3757094 3540309 3067059 3503220 3565330 3193344 3283433 3129894 2708881 2965069 2920685
16572B920685J04661j20116J16269l96082N28o9921K63604Q3471k63691P4883
$$ 2920685 3025346 2905230 3021499 2625417 2625945 2556024 2819628 2903099 2639408 2714291
16562B714291l63799J44168o8656J12013m07238R1741K47478J13853k15667j15116
$$ 2714291 2350492 2494660 2426004 2538017 2130779 2222520 2469998 2583851 2368184 2253068
16552B253068J10143j32457K61832l02511q9745o0931M0930J7279K26832l34581
$$ 2253068 2363211 2230754 2492586 2190075 2100330 2039399 2080329 2097608 2324440 1989859
16542A989859k97549K96635J92987k93888J2847J09075m92236K47229o9677M23113
$$ 1989859 1692310 1988945 2181932 1888044 1900891 2009966 1517730 1764959 1695282 2118395
16532B118395o56417Q3516J54233O8198m7014q4154P8686N321p8535j91774J52736
$$ 2118395 1461978 1545494 1699727 1767925 1720911 1636757 1715443 1720764 1642229 1450455 1603191
16521A603191l08092L97519k38760j99548J53711J07070j37090L70616o52697
$$ 1603191 1295099 1692618 1453858 1254310 1408021 1515091 1378001 1748617 1095920
16512A095920J70921O6415M584J18297k85059K81776p1331k64275N16026n62578
$$ 1095920 1266841 1333256 1337840 1456137 1171078 1452854 1381523 1117248 1633274 1070696
16502A070696J73411J55048O5518j29187j55143J52851K08494k91891J16529k72106
$$ 1070696 1244107 1399155 1464673 1335486 1180343 1333194 1541688 1249797 1366326 1094220
16492A094220J05136k26850L04190k34673R8591q479j6777r0659n7409J43835
$$ 1094220 1199356 972506 1276696 1042023 1140614 1132135 1115358 1024699 967290 1111125
16482A111125j00132J75402l08j74756j66323j18879L83919m5249k25876J72295
$$ 1111125 1010993 1186395 1186087 1011331 845008 726129 1110048 1064799 838923 1011218
16472A011218k7534l09755M93794m12111M58607m32840P7592O4161j17852k39962
$$ 1011218 983684 673929 1167723 755612 1214219 781379 858971 923132 805280 565318
16462E65318M00233k14957K14319k97738K29837K12935R6056C53750L94618K07091
$$ 565318 965551 750594 964913 667175 897012 1109947 1206003 353750 748368 955459
16452I55459j01673p9519J1112L0664K21702m10878L79673j20320j01651l81381
$$ 955459 853786 774267 785379 816043 1037745 626867 1006540 886220 784569 403188
16442D03188M85076K3245l12664q7267j54021K91977p7176L69683l36533j60126
$$ 403188 888264 911509 598845 511578 357557 649534 572358 942041 605508 445382
16432D45382L53511p2597k1357j43160L27926D43249J23096N9576J14861M0651
$$ 445382 798893 726296 704939 561779 889705 443249 566345 625921 740782 781433
16422G81433k87550M08988l37881J86270J52687k73723J30074B70065N31869C68618
$$ 781433 493883 902871 564990 751260 903947 630224 760298 270065 801934 368618
16411D80714L74043j51475C12761L06018r8021K3602L67916D28596j29918m2986
$$ 480714 854757 703282 312761 618779 520758 544360 912276 428596 298678 255692
16401B55692M66887k49026N4920j50193J92347k10695J02131q9979M88180C60058
$$ 255692 722579 473553 528473 378280 570627 359932 462063 372084 860264 360058
16390C33661N8342J86778K2342j11938N5569n3157O6491j46792N4264B25447M02656
$$ 333661 392003 578781 601123 489185 544754 491597 558088 411296 465560 225447 628103
16379F28103A74950L86575L91084l49805j64548A03244L04230K5231J64312B13814
$$ 628103 174950 561525 952609 602804 438256 103244 407474 432705 597017 213814
16368E22344k01497L26196l09539A40797a1186A02807K58755K1721a8619E32936
$$ 522344 320847 647043 337504 140797 -11186 102807 361562 383283 -18619 532936
16357D76904k33369L49423j79233r1562j22098K91044j59678A57350L46201j31596
$$ 476904 243535 592958 413725 322163 200065 491109 331431 157350 503551 371955
16347C71955J64388M3433j22012G0087N22651A88549L7725k3206a87556B91144
$$ 371955 536343 579776 457764 70087 592738 188549 226274 203068 -187556 291144
16336E29626k04974P8570Q307r4567A52743J50964F5322J05948J84293J97598
$$ 529626 324652 403222 411529 316962 152743 303707 65322 171270 355563 553161
16326E53161A22360J85054O6290j44422L0576M7773j51091J17612p1976J69924
$$ 553161 122360 307414 373704 229282 259858 307631 156540 274152 202176 372100
16316C72100j07381G7414M04676n2815j56751k602m0798M9729N815q4581K19194
$$ 372100 264719 77414 482090 429275 272524 269922 229124 278853 284668 200087 419281
16305D19281A75741J43289A42295J23428R094K21198G1873k8957P9355A0738M12969
$$ 419281 175741 319030 142295 265723 274817 496015 71873 42916 122271 10738 423707
16294D23707l9143D8884K00430K46755k07158l9054K828J51254j57169P7124j42268
$$ 423707 384564 48884 249314 496069 288911 249857 252685 403939 246770 323894 181626
16283A81626q5757J18483J14731o1728R8198A73713D2965M65071k49483K885o2339
$$ 181626 95869 214352 329083 267355 365553 173713 42965 508036 258553 261438 199099
16272A99099L9304r2392J01948O8426b8581B33455j14557J52842K93674B32304
$$ 199099 238403 146011 247959 316385 -28581 233455 118898 271740 565414 232304
16261b9202A26653Q5577L11840B24200L0619D3778J75032K9619a84A25524J18123
$$ -29202 126653 212230 524070 224200 254819 43778 218810 248429 -184 125524 243647
16250B43647A6282b39682R8575f7453A32776J61534f3657a8926j6658A73083H5818
$$ 243647 16282 -239682 -141107 -67453 132776 294310 -63657 -18926 -35584 173083 85818
16238b11522C46292I2707L57968a16275B59523a31853j10452C01890o1438K94247
$$ -211522 346292 92707 450675 -116275 259523 -131853 -242305 301890 240452 534699
16228E34699d4680A05505P3558d1015A78244d2843A69131A5346P4257L5580A6227
$$ 534699 -44680 105505 179063 -41015 178244 -42843 169131 15346 89603 125183 16227
16216H5205m1338b38206A04007K01790G5204J19519C919N314L75749r8509A1031
$$ 85205 43867 -238206 104007 305797 75204 194723 3919 9233 384982 286473 11031
16204C7707K94653d2717m7016j50791B93269A17860a78824F0414L52117C4670
$$ 37707 332360 -42717 -89733 -240524 293269 117860 -178824 60414 412531 34670
16193A12244J81787a11900M9126B57450P3698D2932b16411h1228B62329B7053
$$ 112244 294031 -111900 -62774 257450 331148 42932 -216411 -81228 262329 27053
16182A41626m2793K46913G4344K72826B4269H975K26940F5198b22116A83045o5105
$$ 141626 98833 345746 74344 347170 24269 8975 235915 65198 -222116 183045 117940
16171A17940O9314K62422a01845j65797B92811a33668A74512c7297C90147A02506
$$ 117940 187254 449676 -101845 -267642 292811 -133668 174512 -37297 390147 102506
16160A94481b33271M6251h5141B5286J60736p8978D0351f504m7563A70686H4028
$$ 194481 -233271 -187020 -85141 25286 186022 107044 40351 -6504 -54067 170686 84028
16148a52770A54791C726d23A63725a24720A40742P7346p9377O2145Q0925g1661
$$ -152770 154791 3726 -423 163725 -124720 140742 218088 138711 200856 281781 -71661
16136A76016O1570f0387D5384K36881j18626a50767N0580c8803n15F098J01020
$$ 176016 237586 -60387 45384 282265 163639 -150767 -100187 -38803 -39318 6098 107118
16125A07118a22102B05268L316a04888d8970I4885g0176K9305B55866p6169J11905
$$ 107118 -122102 205268 208584 -104888 -48970 94885 -70176 -40871 255866 179697 291602
16114B91602D5213J23952o1266a03426b6376B54821C0453a75B48640A24161E8939
$$ 291602 45213 169165 107899 -103426 -26376 254821 30453 -175 248640 124161 58939
16102A87998K5863G8795J94001f6968L2792E9704M45239m9602a10861A82401N8425
$$ 187998 213861 78795 272796 -66968 -34176 59704 504943 455341 -110861 182401 240826
16091B40826r4464E8441k3688J50525d56452I7608g7545c5658n5907M5560C09607
$$ 240826 146362 58441 34753 185278 -456452 97608 -77545 -35658 -91565 -46005 309607
16079A83448Q6253a62069F2936K8004d7687n7679C4770L75819c5636k62589I5516
$$ 183448 269701 -162069 62936 90940 -47687 -105366 34770 410589 -35636 -298225 95516
16067b09082d3656A40055g0884L4506I9459i0930B90868L6586a41707C10824D0157
$$ -209082 -43656 140055 -70884 -36378 99459 -90930 290868 327454 -141707 310824 40157
16055C9679K20807k5299I9932Q2717a5384j52607G1300B4220K81104h2522H6197
$$ 39679 260486 235187 99932 182649 -15384 -167991 71300 24220 305324 -82522 86197
16043a04224D5313R1798J67717G3756e7621A37475F4441J28731H1360a13968j21655
$$ -104224 45313 137111 304828 73756 -57621 137475 64441 193172 81360 -113968 -235623
16032b35623m5446h0499b538i9k67995B76228A23811c94035J56295p6773d8483
$$ -235623 -281069 -80499 -2538 -99 -268094 276228 123811 -394035 -237740 -314513 -48483
16020h8006k90551J48053e3390p1154k4419I6552a53763j53517a37638D68847
$$ -88006 -378557 -230504 -53390 -124544 -148963 96552 -153763 -307280 -137638 468847
16009B61796g544k19239c9499q1940k1281d4589h935G1850P1034E4011a23469
$$ 261796 -7544 -226783 -39499 -121439 -142720 -44589 -8935 71850 142884 54011 -123469
15997e4349A96838G8405b73887e2010j558A26246d3581b1481j26625j95054b9419
$$ -54349 196838 78405 -273887 -52010 -53568 126246 -43581 -21481 -148106 -343160 -29419
15985a27698m5699E12665k55914A08506J60395p1893M4515q9415J95213a27709
$$ -127698 -173397 512665 256751 108506 268901 197008 241523 152108 347321 -127709
15974C42835d3391a0343B20791a5925l20790B57257j14345B1136J13574a24452
$$ 342835 -43391 -10343 220791 -15925 -336715 257257 142912 21136 134710 -124452
15963A82412a21394A24034n4547L50121i463l23185a19913j81905A5859i1147
$$ 182412 -121394 124034 69487 419608 -9463 -332648 -119913 -301818 15859 -91147
15952a12830k1830m0537B17554b50741A93109P1288D4154A2486d8303B0756b32329
$$ -112830 -134660 -175197 217554 -250741 193109 264397 44154 12486 -48303 20756 -232329
15940a634m621A82279d3100A19484J3155j9532i0170K9087K2959j09093R950L6931
$$ -1634 -6255 182279 -43100 119484 132639 113107 -90170 -61083 -38124 -147217 -137267 -100336
15928a00336B24286a20335e2706A3072K08027b03844h314E9647a89605M1070b9333
$$ -100336 224286 -120335 -52706 13072 221099 -203844 -8314 59647 -189605 -148535 -29333
15916c63889G1294d66368g23C1663a04765o9174O6912C2377b46697I1132b33248
$$ -363889 71294 -466368 -723 31663 -104765 -173939 -107027 32377 -246697 91132 -233248
15904a63034C6519h960j88440B29283E9628k8550b10789d3340l24411C18478E3279
$$ -163034 36519 -8960 -197400 229283 59628 31078 -210789 -43340 -367751 318478 53279
15892c7532E7792L31105I2072c04214Q1036Q4906B31373m1309B7447J03433b08267
$$ -37532 57792 388897 92072 -304214 -223178 -138272 231373 190064 27447 130880 -208267
15880a63903F7402a8724B68130A21537b23127n303E2156a72598A94440i2601c9956
$$ -163903 67402 -18724 268130 121537 -223127 -228430 52156 -172598 194440 -92601 -39956
15868g1692j70775J13618L4134j63319a06230c4557A42670J00260b13511C42062
$$ -71692 -242467 -128849 -94715 -258034 -106230 -34557 142670 242930 -213511 342062
15857e9410k1390k46359J46579c0152A1511a11466D1390J48451n4086L52525g2911
$$ -59410 -80800 -327159 -180580 -30152 11511 -111466 41390 189841 135755 488280 -72911
15845B723Q036a93185E0513a62086J3580m9134B07773b62794n8621e1264A39844
$$ 2723 10759 -193185 50513 -162086 -148506 -197640 207773 -262794 -321415 -51264 139844
15833H3693b8600A60573a3047B15396A7266b21268n9319H0071c44806G14J3829
$$ 83693 -28600 160573 -13047 215396 17266 -221268 -280587 80071 -344806 714 14543
15822A4543i0803m8784C7023J58901b06482A75005b16678g0055k29392a09766
$$ 14543 -90803 -139587 37023 195924 -206482 175005 -216678 -70055 -299447 -109766
15811B43175l2560d5810B0231f3451l39796a63308H0916I019c674j73503F159
$$ 243175 210615 -45810 20231 -63451 -403247 -163308 80916 9019 -3674 -177177 6159
15799h9030m36208A25840b11371F7233g4600j84982P3777c0331j67865P5194f0405
$$ -89030 -525238 125840 -211371 67233 -74600 -259582 -185805 -30331 -198196 -123002 -60405
15787b28600A29745c1925k91823K1090F0148b25713A47130J17698h7333o5323
$$ -228600 129745 -31925 -323748 -302658 60148 -225713 147130 264828 -87333 -152656
15777a52656D0180Q49J58141c04751A37817a87517H9075b42085A85315a77122
$$ -152656 40180 41029 199170 -304751 137817 -187517 89075 -242085 185315 -177122
15766I4286N2750a63287j0131P3627a5194B0281b11526A04138l8952a45884J9109
$$ 94286 147036 -163287 -173418 -99791 -15194 20281 -211526 104138 65186 -145884 -126775
15755a26775B23705r1607j5665J70174c4050j3860F0929f0365j39232m5419O1688
$$ -126775 223705 132098 116433 286607 -34050 -47910 60929 -60365 -199597 -245016 -183328
15744a83328H3926J02344a44525A08170b6046j32356j56209M1173F1193N4998
$$ -183328 83926 186270 -144525 108170 -26046 -158402 -314611 -273438 61193 116191
15734A16191b1150L18j12345B15116o5444a52158B93609f6487B0182J79256C0947
$$ 116191 -21150 -20832 -133177 215116 149672 -152158 293609 -66487 20182 199438 30947
15722A96398b12561p046B2376a69672R95D6573g7938A41173C5823K35230a10980
$$ 196398 -212561 -219607 22376 -169672 -168677 46573 -77938 141173 35823 271053 -110980
15710A9374K59506A9846J8780b17835A0059J56564c08489f764n0772C05114E8090
$$ 19374 278880 19846 38626 -217835 10059 166623 -308489 -6764 -57536 305114 58090
15698f7568I7149h4330g144D33759a03364B76595d6548k46197B28355c18240A27122
$$ -67568 97149 -84330 -7144 433759 -103364 276595 -46548 -292745 228355 -318240 127122
15686i3668A62751C5901c91042g8785A39412A1859a07413r1986L4449H8706b19882
$$ -93668 162751 35901 -391042 -78785 139412 11859 -107413 -199399 -164950 88706 -219882
15674a33861B17492i2130q1279K1570A84683C7563M3345c1272A91998i8506p313
$$ -133861 217492 -92130 -173409 -151839 184683 37563 80908 -31272 191998 -98506 -105819
15663a05819D5839c3057l536q0610j05780a5232k28444A7318J75875C1559a31183
$$ -105819 45839 -33057 -36593 -117203 -222983 -15232 -243676 17318 193193 31559 -131183
15651C29714j60318O8886C2370m527K01205H7322h134D0438b61141I4479a62141
$$ 329714 169396 238282 32370 27843 229048 87322 -8134 40438 -261141 94479 -162141
15639A73881a27693B32951a30460B10079k5346G5271L6912a88534O3310c1056
$$ 173881 -127693 232951 -130460 210079 184733 75271 112183 -188534 -125224 -31056
15628H8339J30749G193c080A20008K50976h2519A79828L7801c03975B22402L8521
$$ 88339 219088 7193 -3080 120008 370984 -82519 179828 217629 -303975 222402 260923
15617B60923a74561E7425a04606A644P017b58876D273K81509b06738A6999N5828
$$ 260923 -174561 57425 -104606 1644 8661 -258876 4273 285782 -206738 16999 72827
15606G2827C265g524A31032a46568L0650c9890k00480G3779N170j1078b30389
$$ 72827 3265 -7524 131032 -146568 -115918 -39890 -240370 73779 78949 67871 -230389
15594f5612m6120a2634A11389a9245r4129B08713a42879d2210A4961L4746M1534
$$ -65612 -111732 -12634 111389 -19245 -113374 208713 -142879 -42210 14961 49707 91241
15583I1241m0656P8385l3214a17322N5627A053d1494q2404j57680M9966J13292
$$ 91241 50585 128970 95756 -117322 -61695 1053 -41494 -123898 -281578 -231612 -118320
15572a18320l60647K33272j18187f966D49824E6709a40911D8521K2871N218e4434
$$ -118320 -478967 -245695 -363882 -6966 449824 56709 -140911 48521 71392 76610 -54434
15560b534p1833C2955a24453e1686k37372a08137d7262k71291h0948H533h1163
$$ -2534 -74367 32955 -124453 -51686 -289058 -108137 -47262 -318553 -80948 8533 -81163
15548b58031c9077D3161F109L27213a49688D4958N0931b93427B5510c75750c6068
$$ -258031 -39077 43161 6109 333322 -149688 44958 95889 -293427 25510 -375750 -36068
15536d7063D5657a35107C96547a18195r6206C29044c6433j0301A14372b63136
$$ -47063 45657 -135107 396547 -118195 -214401 329044 -36433 -46734 114372 -263136
15525e6585B80082b56740G8562c01462A48422b8991m597B87647F8312M300g6669
$$ -56585 280082 -256740 78562 -301462 148422 -28991 -33588 287647 68312 72612 -76669
15513a48013B38726b02980A0903a91561B39298K0016j19962d26926J90502B75425
$$ -148013 238726 -202980 10903 -191561 239298 259314 139352 -426926 -236424 275425
15502c3862D63903f3152l5759A53883k0786K14138a13403j74152e8765n1698c2562
$$ -33862 463903 -63152 -98911 153883 133097 347235 -113403 -287555 -58765 -110463 -32562
15490g6288k43033a51883A7732P0629c93925A84582c5220m040E4680J25595e3179
$$ -76288 -319321 -151883 17732 88361 -393925 184582 -35220 -39260 54680 180275 -53179
15478a03030L1201n1526j3937j62063a01186B20598a38094B00674D8325c24316
$$ -103030 -71829 -123355 -137292 -299355 -101186 220598 -138094 200674 48325 -324316
15467A29585a20412A07865a49516C7849g1077B88154i3793C4227K13887E5302
$$ 129585 -120412 107865 -149516 37849 -71077 288154 -93793 34227 248114 55302
15456C69562A6482b07884D7994c20964h9455d0204o6005B41460a39325r1607F0041
$$ 369562 16482 -207884 47994 -320964 -89455 -40204 -106209 241460 -139325 -230932 60041
15444I14J11766h6810A07641e9310F5799a51891A9100a70234f6486j20974M0400
$$ 914 112680 -86810 107641 -59310 65799 -151891 19100 -170234 -66486 -187460 -147060
15433a47060A51450A7874P1602J14142h5260K9893A92020E6406b56450h8383A06382
$$ -147060 151450 17874 89476 203618 -85260 -55367 192020 56406 -256450 -88383 106382
15421A31378D8292g6190q3654H0764p39c42814B6444h7197m1958I4083a36927
$$ 131378 48292 -76190 -159844 80764 80025 -342814 26444 -87197 -129155 94083 -136927
15409a7144j9755I5397b92665a20819B00574b15132J04438C0673J83027b07262
$$ -17144 -36899 95397 -292665 -120819 200574 -215132 -110694 30673 213700 -207262
15398f6872A43766m8551m6351f54B43297D363a35682B38646c94532c6980l07571
$$ -66872 143766 95215 48864 -654 243297 4363 -135682 238646 -394532 -36980 -344551
15387c44551a2691D10275H5556B3106R5078a06261G2129j3019e6392p4209A80166
$$ -344551 -12691 410275 85556 23106 118184 -106261 72129 59110 -56392 -130601 180166
15375g7123A14194N9180a99382a103p7119E6654J65457N2229h3053F7725b2601
$$ -77123 114194 173374 -199382 -1103 -78222 56654 222111 274340 -83053 67725 -22601
15363A01867J80182c8043l47563A43571l4027R7623m1727F5998e1104A84094b68108
$$ 101867 282049 -38043 -385606 143571 109544 207167 165440 65998 -51104 184094 -268108
15351a04361k38213Q0972A41163a62210M7012J1171k753d7352a2129F7133b25005
$$ -104361 -342574 -261602 141163 -162210 -115198 -104027 -106780 -47352 -12129 67133 -225005
15339b00062A8884J78791l1433J72905b22200A94856j8240p8665m2314N8224Q8631
$$ -200062 18884 197675 166242 339147 -222200 194856 176616 97951 55637 113861 202492
15328B02492n5079d80955B32793G3028C3825e3134B8809J69408l1583b48449H0394
$$ 202492 147413 -480955 232793 73028 33825 -53134 28809 198217 166634 -248449 80394
15316e4352A27827a35537n0332B39675b62195B06423E995J59590a5109q702j20210
$$ -54352 127827 -135537 -185869 239675 -262195 206423 5995 165585 -15109 -23811 -144021
15305a44021B12215m7296c966j30346A52587n5514e2085A97291E3834J88747K16718
$$ -144021 212215 164919 -3966 -134312 152587 97073 -52085 197291 53834 242581 459299
15294D59299c6814p9486A18362M952i9867d3256F9773K5964K24298H932b53801
$$ 459299 -36814 -116300 118362 123314 -99867 -43256 69773 95737 320035 8932 -253801
15282A64590n5292R4761C9631i5354B30834j8336a81981A33771N1653g1930A67195
$$ 164590 109298 204059 39631 -95354 230834 212498 -181981 133771 185424 -71930 167195
15270F8143J76743K63151b00809j36123c3311C5320L0899J25889j7189C2058K72931
$$ 68143 244886 508037 -200809 -336932 -33311 35320 66219 192108 174919 32058 304989
15259C04989D6195a01300B26585F4787L27126p2610A43661L76536j69103L06623
$$ 304989 46195 -101300 226585 64787 391913 319303 143661 520197 351094 657717
15249F57717o0087J52770J11129N5378C83877J00775L8238B02349R9994P1925
$$ 657717 597630 750400 861529 916907 383877 484652 522890 202349 302343 374268
15239C74268P4846A04106L8148J69492J37746j18894H5408N5173j5129a13920
$$ 374268 449114 104106 142254 311746 449492 330598 85408 140581 125452 -113920
15228a52963I7119C8527c667j71767l19002c1108a438E9477N723N0746a65919
$$ -152963 97119 38527 -3667 -175434 -494436 -31108 -1438 59477 65200 115946 -165919
15216a04281C12988d23687a5098j60667A7940b7378f324c38l91823b0986j85409
$$ -104281 312988 -423687 -15098 -175765 17940 -27378 -6324 -338 -392161 -20986 -206395
15205b06395C14866a64815M9165F0261K21578h5901B14815P1635d0491q3741j50854
$$ -206395 314866 -164815 -115650 60261 281839 -85901 214815 286450 -40491 -124232 -275086
15194b75086B39331q0659h9656j58765G7562K10262b48510j2885B72122a39665
$$ -275086 239331 158672 -89656 -248421 77562 287824 -248510 -261395 272122 -139665
15183H2418b2738E9632L28192A23603E7965M6497a01543A37681B1276a8650B8581
$$ 82418 -22738 59632 387824 123603 57965 104462 -101543 137681 21276 -18650 28581
15171B98546A40631L25179a61333r8196n147I3347a33808a7376C86446a33054
$$ 298546 140631 465810 -161333 -259529 -264676 93347 -133808 -17376 386446 -133054
15160e9792D07781A90899p9646L86192a01340a8974A72781m4802j4209O5688B4030
$$ -59792 407781 190899 111253 497445 -101340 -18974 172781 127979 113770 179458 24030
15148F8405A0549K5945M1499a3833r55j71705Q6451C42083L09640e5313o0935
$$ 68405 10549 36494 77993 -13833 -14788 -186493 -100042 342083 651723 -55313 -116248
15137a16248G823J111K84265O8097D0207a80600B9031L02568D8260a56242C4817
$$ -116248 7823 8934 293199 361296 40207 -180600 29031 331599 48260 -156242 34817
15125B40522m9578e66B02506a29473L068A57849l4976m9242a07556D05432c9363
$$ 240522 190944 -566 202506 -129473 -126405 157849 122873 73631 -107556 405432 -39363
15113c3052G7329J60261r4888a9995j07941A51425b8801F5643K42656A48199G3771
$$ -33052 77329 237590 142702 -19995 -127936 151425 -28801 65643 308299 148199 73771
15101a50332b3133A27012a51358m6710A06356P9572N8500J20594d4380B3001L04774
$$ -150332 -23133 127012 -151358 -198068 106356 185928 244428 365022 -44380 23001 327775
15090C27775j35777o7671q442c01512A2339L2334J41274J82901j05557h482B4624
$$ 327775 191998 124327 115885 -301512 12339 44673 185947 368848 263291 -8482 24624
15078I0132g1122A65966d7726A5919K47075E4831J99345Q6645n9168j17220h7356
$$ 90132 -71122 165966 -47726 15919 262994 54831 254176 340821 281653 164433 -87356
15066A85231J1755f4636C32096l5375J40393q1582G0884a02169F0476M1431J09778
$$ 185231 196986 -64636 332096 296721 437114 355532 70884 -102169 60476 101907 211685
15055B11685c827A48269P9419K043Q4973F3849L18352H9733j7607K48497m409
$$ 211685 -3827 148269 227688 229731 314704 63849 382201 89733 72126 320623 316214
15044C16214h9869A27728A2924Q8884j9087Q7076b8424o8894B35557M5917a7382
$$ 316214 -89869 127728 12924 101808 82721 169797 -28424 -97318 235557 281474 -17382
15032D24766F7938K45683A23382E7708L28314A50525B1583a12257C38124j28381
$$ 424766 67938 313621 123382 57708 386022 150525 21583 -112257 338124 209743
15022B09743D1774N41461C7606P683P3938J83971j12086p2517n6078J20211L30681
$$ 209743 41774 583235 37606 45289 119227 303198 191112 118595 62517 182728 513409
15011E13409A49436b6429I9330K9441L08383A13512a05385A48646M9138o231F4816
$$ 513409 149436 -26429 99330 128771 437154 113512 -105385 148646 197784 191553 64816
14999D78097a40361I6217k3844l1458M10870n3479m5214p1553I8811C2773a8299
$$ 478097 -140361 96217 72373 40915 451785 398306 353092 281539 98811 32773 -18299
14987B11947m2224k3851L56240E4775N93549h7795F6494J55393J8525m0250K62613
$$ 211947 169723 145872 502112 54775 648324 -87795 66494 221887 240412 200162 462775
14976D62775A68531A6463b04795K5185B03063q9436M47209I6552J58983e8885
$$ 462775 168531 16463 -204795 -179610 203063 113627 560836 96552 255535 -58885
14965A14543J32046a2055E9323A7566K75942A05060J59092k6199L19668n7104
$$ 114543 246589 -12055 59323 17566 293508 105060 264152 237953 557621 500517
14955E00517j16877j52042K12603O8540q9328R4694A67218F7699M37153j01889
$$ 500517 383640 231598 444201 512741 423413 518107 167218 67699 504852 402963
14945D02963A97141C9405K24791Q6735o8980A24645K69465J12139k03030f2228
$$ 402963 197141 39405 264196 350931 281951 124645 394110 506249 303219 -62228
14934B48966m5532K19699f226D23433j18085K02899o8032q1779A77049J51565
$$ 248966 203434 423133 -6226 423433 305348 508247 440215 358436 177049 328614
14924C28614J00556j36304M4088Q189H4172K20743J91317k30626N22388l80735
$$ 328614 429170 292866 336954 345143 84172 304915 496232 265606 787994 407259
14914D07259j27658P8674j49595J98316J3220N9349j91843D2905J66047b7897
$$ 407259 279601 358275 208680 406996 420216 479565 287722 42905 208952 -27897
14903C21947K7540r235n2792j28757J4526k7005O20882j81162E0524K74959M02751
$$ 321947 349487 340252 287460 158703 173229 146224 767106 585944 50524 325483 728234
14892G28234k00953k00932G6436L14962K43179p6051A48011J24014K28042J72549
$$ 728234 527281 326349 76436 391398 634577 558526 148011 272025 500067 672616
14882F72616C35432J51464p7394j03738R3609j83046M80469k08305B17675J40807
$$ 672616 335432 486896 409502 305764 399373 216327 696796 488491 217675 358482
14872C58482p2953L82252j36566j51186j80763J98514L21778k38835G5486K93568
$$ 358482 285529 667781 531215 380029 199266 397780 719558 480723 75486 369054
14862C69054L74975B25031p9870N06913j45945o5596J64352j18102k14490J91341
$$ 369054 744029 225031 145161 652074 506129 440533 604885 486783 272293 463634
14852D63634B22054J09154J77664k48280p9240J23276L15490j91924J53027j69816
$$ 463634 222054 331208 508872 260592 181352 304628 620118 428194 581221 411405
14842D11405n7076J33144M4669j4202k28635l2255J88961O8180r1777L67338B49637
$$ 411405 354329 487473 532142 517940 289305 257050 446011 514191 422414 789752 249637
14830D48504J7184j79641K54237K10869k01763k23602L64847j75416p9630B11457
$$ 448504 465688 286047 540284 751153 549390 325788 690635 515219 435589 211457
14819C20027C2470N14176q1884j02811M55670B87957M42939j24239r2042J07582
$$ 320027 32470 546646 464762 361951 817621 287957 730896 606657 514615 622197
14809F22197j67613r5534M7135K04918B93612K18873A20825K58599J64536A68461
$$ 622197 454584 359050 406185 611103 293612 512485 120825 379424 543960 168461
14798D96228J10278K6925k13641J49280K82519C67677j47302N16090k69257j30698
$$ 496228 606506 633431 419790 569070 851589 367677 220375 736465 467208 336510
14788C36510R4129M92806l48216N7669J23803k19334J47318J4728k55683J77219
$$ 336510 430639 923445 575229 632898 756701 537367 684685 699413 443730 620949
14778F20949p0163M8684l1200j60869J42574L0599o0448M2774J23325K8821j99863
$$ 620949 550786 599470 568270 407401 549975 580574 520126 562900 686225 715046 515183
14767E15183P7921K7679k80778R6392M31067C38764Q3034k04939L70855K09986
$$ 515183 593104 620783 340005 436397 867464 338764 421798 216859 587714 797700
14757G97700j30760n695m244M2508M0040l41616M18026j42559l3463p9789L10432
$$ 797700 666940 661245 657001 699509 739549 397933 815959 673400 639937 560148 870580
14746H70580k96451J59066O2155k29492K28824k05973p687j09160K64513p1924
$$ 870580 574129 733195 795350 565858 794682 588709 581022 471862 736375 664451
14736F64451j48081M0826K57310j04311k3375o895o7599K96595l71867L42480
$$ 664451 516370 557196 814506 710195 686820 679925 612326 908921 537054 879534
14726H79534r1030K56884k39259l46735O03723l71117K15148j22781J93377k35072
$$ 879534 788504 1045388 806129 459394 1063117 692000 907148 784367 977744 742672
14716G42672K62494k53526K77107j34579n0549j10901L0364P9899m2025L9690
$$ 742672 1005166 751640 1028747 894168 843619 732718 763082 842981 800956 840646
14706H40646m7403Q6617O0103J2276j60074M79432m55794K82263j49052l92712
$$ 840646 793243 879860 939963 952239 792165 1271597 815803 1098066 949014 556302
14696E56302M28052k35521J19270J15217p3559J72792k03602j99103N18835k60840
$$ 556302 984354 748833 868103 983320 909761 1082553 878951 679848 1198683 937843
14686I37843j61119L51378j55973K66027k292j82284j74019K2862P3855j1156
$$ 937843 776724 1128102 972129 1238156 1235864 1053580 879561 902423 976278 965122
14676I65122K66452j86728L89324l8205m79043m0353K28570k95855K98994j33975
$$ 965122 1231574 1044846 1434170 1395965 916922 876569 1105139 809284 1108278 974303
14666I74303P2414K6926l15460L00240r0232k4486o2522K67173P175K31931J90715
$$ 974303 1046717 1073643 758183 1058423 968191 943705 881183 1148356 1155531 1387462 1578177
14655A578177l51258j06699n8205R7187R4708m7514L607J37855j11655o6596J81861
$$ 1578177 1226919 1120220 1062015 1159202 1253910 1206396 1210003 1347858 1236203 1169607 1351468
14644A351468k96829M4629M64703k90434J1958J57177K2969j91611K41488N409
$$ 1351468 1054639 1099268 1563971 1273537 1285495 1442672 1465641 1274030 1515518 1520927
14634A520927q9325l8604j81756L41241j91957J79082K65686j15804k12081N08971
$$ 1520927 1431602 1392998 1211242 1552483 1360526 1539608 1805294 1689490 1477409 1986380
14624A986380l95440Q1685k38770J82097j39011k41988K72727O3067O265m01594
$$ 1986380 1590940 1672625 1433855 1615952 1476941 1234953 1507680 1570747 1577012 1175418
14614A175418M71502L23729j59960m58288K27643j8248J24749J18344J6152j18154
$$ 1175418 1646920 1970649 1810689 1352401 1580044 1561796 1686545 1804889 1821041 1702887
14604A702887n024J62532j6548J95732m89037N26477k02428m4538K58884l8470
$$ 1702887 1697863 1860395 1843847 2039579 1550542 2077019 1874591 1830053 2088937 2050467
14594B050467p8724J25626r946k88501r6508K98403L96199m16427J35603p6426
$$ 2050467 1971743 2097369 2087423 1798922 1702414 2000817 2397016 1980589 2116192 2039766
14584B039766N41013l32460m5438J89831K50924k34030K63870j53189k52677j19841
$$ 2039766 2580779 2248319 2202881 2392712 2643636 2409606 2673476 2520287 2267610 2147769
14574B147769N73114j31140j32077L6222K12020o4164K09773R8393k39399J97548
$$ 2147769 2720883 2589743 2457666 2493888 2705908 2641744 2851517 2949910 2710511 2908059
14564B908059n7728K45892q2244M09185q9828K59911m1778L79514J48533L94446
$$ 2908059 2850331 3096223 3013979 3423164 3333336 3593247 3551469 3930983 4079516 4473962
14554D473962R8265L68790N57748Q29378J716746J477363K429797K919936J966718
$$ 4473962 4572227 4941017 5498765 6328143 8044889 9522252 11952049 14871985 16838703
14545A6838703j887878j304503j662989j245344j288980j478649j313297j770630
$$ 16838703 14950825 13646322 11983333 10737989 9449009 7970360 6657063 4886433
14537D886433n27989j7768m27640l38759O1673n8111j23209m899k6982j63331
$$ 4886433 4358444 4340676 3913036 3574277 3635950 3577839 3454630 3449731 3422749 3259418
14527C259418J3658o008l61348L91294j43927M01823n66146J10063L11614k45841
$$ 3259418 3273076 3267068 2905720 3297014 3153087 3554910 2988764 3098827 3410441 3164600
14517C164600q6205K4511O9758R6066j99307M8102J10309P2966k8738N9667K47612
$$ 3164600 3078395 3102906 3172664 3268730 3069423 3117525 3227834 3300800 3272062 3331729 3579341
14506C579341n4939m55105K73245L51050j0370l65073K72038J65286J96715l44854
$$ 3579341 3524402 3069297 3342542 3693592 3683222 3318149 3590187 3755473 3952188 3607334
14496C607334M37110j40780L1574j74974J17318N6217K92040L4126o05458O87535
$$ 3607334 4044444 3903664 3935238 3760264 3877582 3933799 4225839 4259965 3654507 4342042
14486D342042j99823j18126J46427J27014J90543N7379m11515N13311L0230J60345
$$ 4342042 4142219 4024093 4170520 4297534 4488077 4545456 4133941 4647252 4677482 4837827
14476D837827p9965j19298M13077l19262M48317k5483J09953Q4532j69088n5609
$$ 4837827 4757862 4638564 5051641 4732379 5180696 5155213 5265166 5349698 5180610 5125001
14466E125001k1241L2172l2453L46859J59704k12856J71983J71939J79115k9490
$$ 5125001 5103760 5135932 5103479 5450338 5610042 5397186 5569169 5741108 5920223 5890733
14456E890733q1048K91946j53346K38202l8462J13470L08470k3767K05142k88722
$$ 5890733 5809685 6101631 5948285 6186487 6148025 6261495 6569965 6546198 6751340 6462618
14446F462618K10338J02511r1181K03922K33567K31982j57633l39570O51534J7055
$$ 6462618 6672956 6775467 6684286 6888208 7121775 7353757 7196124 6856554 7508088 7525143
14436G525143L21897k04801K57052M4165P8839q6302N63261j49125L65900n3780
$$ 7525143 7847040 7642239 7899291 7943456 8022295 7935993 8499254 8350129 8716029 8662249
14426H662249L70248j21933M5729K81782l42124O25069j04135m6380M76475N5417
$$ 8662249 9032497 8910564 8956293 9238075 8895951 9521020 9416885 9370505 9846980 9902397
14416I902397K69529L08433J62837j41617o2889K55639M12510J9310J92294J02197
$$ 9902397 10171926 10480359 10643196 10501579 10438690 10694329 11106839 11126149 11318443 11420640
14406A1420640J61584M12243J76440M5607Q7613M16841P1042K12108L96603J27980
$$ 11420640 11582224 11994467 12170907 12216514 12304127 12720968 12792010 13004118 13400721 13528701
14396A3528701n6467M12541K69456K38420O0055J58141M77699L44139L9455N80737
$$ 13528701 13472234 13884775 14154231 14392651 14452706 14610847 15088546 15432685 15472140 16052877
14386A6052877N93840k3808J47101O40849J03207j5271L64536K08385O07044L71993
$$ 16052877 16646717 16622909 16770010 17410859 17514066 17498795 17863331 18071716 18678760 19050753
14376A9050753O29006r4761N85193O88802k84908J142199k6758M82032L20518
$$ 19050753 19679759 19584998 20170191 20858993 20574085 21716284 21689526 22171558 22492076
14367B2492076N93359L90408M06536O94627J048202K02967K72384O95498O89467
$$ 22492076 23085435 23475843 23882379 24577006 25625208 25828175 26100559 26796057 27485524
14358B7485524N97075M14164Q48857J011668J72375J137711M31800O87349O19453
$$ 27485524 28082599 28496763 29345620 30357288 30529663 31667374 32099174 32786523 33405976
14349C3405976Q80114R17142J015682Q43536J052768J303583R99888Q45793Q71998
$$ 33405976 34286090 35203232 36218914 37062450 38115218 39418801 40418689 41264482 42136480
14340D2136480J192992J280494P75126J650516J396249J086173J314055J401451
$$ 42136480 43329472 44609966 45385092 47035608 48431857 49518030 50832085 52233536
14332E2233536J426221J926977J346120J442092K092532J675834K044837J633325
$$ 52233536 53659757 55586734 56932854 58374946 60467478 62143312 64188149 65821474
14324F5821474K264781K319713K111715K663147K193251K995014K360579K970034
$$ 65821474 68086255 70405968 72517683 75180830 77374081 80369095 82729674 85699708
14316H5699708K810230L121633L106939L510744L448488L786322M044797L797084
$$ 85699708 88509938 91631571 94738510 98249254 101697742 105484064 109528861 113325945
14308A13325945M037013M621719M344784M905624N178003N477390N432868N643434
$$ 113325945 117362958 121984677 126329461 131235085 136413088 141890478 147323346 152966780
14300A52966780N975975O573964O052860P143995P254407P199068P967748Q183608
$$ 152966780 158942755 165516719 171569579 178713574 185967981 193167049 201134797 209318405
14292B09318405Q159176R140594Q810119R502299R405355R689394J0282511J0561397
$$ 209318405 217477581 226618175 235428294 244930593 254335948 264025342 274307853 284869250
14284B84869250J1342484J0973792J1826291J2331488J2309189J3181502J3454294
$$ 284869250 296211734 307185526 319011817 331343305 343652494 356833996 370288290
14277C70288290J3863052J3252159J0893029P672756O618937L803892J791351
$$ 370288290 384151342 397403501 408296530 415969286 422588223 426392115 428183466
14270D28183466R55340j7343047j3296425n116073l663038k011814l491603m914657
$$ 428183466 429138806 411795759 398499334 393383261 389720223 387708409 384216806 379302149
14262C79302149q451756j3105636j7538121j6090915j3821189j1575763j1064249
$$ 379302149 370850393 357744757 340206636 324115721 310294532 298718769 287654520
14255B87654520r888618r342039q589893r088674p870985p918381p709360q190962
$$ 287654520 277765902 268423863 259833970 250745296 242874311 234955930 227246570 219055608
14247B19055608p637945p353395p567961p699365p282028p108905p089955o303707
$$ 219055608 211417663 204064268 196496307 188796942 181514914 174406009 167316054 161012347
14239A61012347o597752o063601n733509n859410n178468n439942m672113m682886
$$ 161012347 154414595 148350994 142617485 136758075 131579607 126139665 121467552 116784666
14231A16784666m213497m282232m070396l604115l642022l399521l461033k803355
$$ 116784666 112571169 108288937 104218541 100614426 96972404 93572883 90111850 87308495
14223H7308495l064242k486238k743130k558508k285413k269755j996312k268553
$$ 87308495 84244253 81758015 79014885 76456377 74170964 71901209 69904897 67636344
14215F7636344k149107j580394j804758j823617j826218j621366j281002j582530
$$ 67636344 65487237 63906843 62102085 60278468 58452250 56830884 55549882 53967352
14207E3967352j600556j169402j574614j370341r09575j431088j283431p98254
$$ 53967352 52366796 51197394 49622780 48252439 47342864 45911776 44628345 43830091
14199D3830091j193579j029444j191650r88392r48618n21894r98721r76421j074601
$$ 43830091 42636512 41607068 40415418 39427026 38478408 37956514 36957793 35981372 34906771
14190C4906771p43996p63975p68836o10593q24286n07235q19130n70796p19660
$$ 34906771 34162775 33398800 32629964 32019371 31195085 30687850 29868720 29297924 28578264
14181B8578264m79052o28988o65747l99289p31989O7773j286892L28286q17259
$$ 28578264 28099212 27470224 26804477 26405188 25673199 25740972 24454080 24782366 23965107
14172B3965107n57381q30145o42951O213m87756m42599k71389n41867k64416m27235
$$ 23965107 23407726 22577581 21934630 21940843 21453087 21010488 20739099 20197232 19932816 19505581
14162A9505581m38310m03124n9716k37288m33404j48842l07668l05426m04316
$$ 19505581 19067271 18664147 18604431 18367143 17933739 17784897 17477229 17171803 16767487
14153A6767487l21099j40973j94176o85593J67712n91223j80774L2610j22933
$$ 16767487 16446388 16305415 16111239 15425646 15593358 15002135 14821361 14853971 14731038
14144A4731038n30972j59654j28427j3956n09475k99493J5189l23363j23354J50952
$$ 14731038 14200066 14040412 13911985 13898029 13388554 13089061 13104250 12780887 12657533 12808485
14134A2808485m32057j92707j50027k94147j39018o3314j20832r5760n24262k5869
$$ 12808485 12376428 12183721 12033694 11739547 11600529 11537215 11416383 11320623 10796361 10770492
14124A0770492K00203j43147n75476j434m0636j09589k67345K8145J93868m55066
$$ 10770492 10970695 10827548 10252072 10250638 10210002 10100413 9833068 9861213 10055081 9600015
14114I600015l26199j02413o6359n8776j73035l0834k90158K6439j14388k10904
$$ 9600015 9273816 9171403 9105044 9046268 8873233 8842399 8552241 8578680 8464292 8253388
14104H253388L76704o87036M5318L34733k02036j78157m14309N81648k96967k46945
$$ 8253388 8630092 7943056 7988374 8323107 8121071 7942914 7528605 8110253 7813286 7566341
14094G566341l51315K68025k89388K17879k96379l34818K45317k63833K27329
$$ 7566341 7215026 7483051 7193663 7411542 7115163 6780345 7025662 6761829 6989158
14085F989158l61813J3112K54345l52572K31450l27314l22761L09079j56318m58972
$$ 6989158 6627345 6640457 6894802 6542230 6773680 6446366 6123605 6432684 6276366 5817394
14075E817394K28957k73376j82961M18307n38980O38411m13586O8677l12734j85537
$$ 5817394 6046351 5772975 5590014 6008321 5469341 6107752 5694166 5762843 5450109 5264572
14065E264572M70725k68730j72405L49836l08882J26313k19608j38051p9928q3133
$$ 5264572 5735297 5466567 5294162 5643998 5335116 5461429 5241821 5103770 5023842 4940709
14055D940709J01546r6247J3326R9239j7028r3321j90225M9300l21727N5407j94918
$$ 4940709 5042255 4946008 4959334 5058573 5041545 4948224 4757999 4807299 4485572 4540979 4346061
14044D346061J00828m7117K47186l34834K89419j13317n5730k23581p7426K14461
$$ 4346061 4446889 4399772 4646958 4312124 4601543 4488226 4432496 4208915 4131489 4345950
14034D345950p1725N15965n71936j61013N3437r5808l34164J55254J86644J46902
$$ 4345950 4274225 4790190 4218254 4057241 4110678 4014870 3680706 3835960 4022604 4169506
14024D169506r1207m75579M68699m05657L22061q4388k39048J80384k01308k56844
$$ 4169506 4078299 3602720 4071419 3665762 3987823 3903435 3664387 3844771 3643463 3386619
14014C386619J18442K36878j71470Q5502O34l6724N4221J40963q04535P00089
$$ 3386619 3505061 3741939 3570469 3655971 3656605 3619881 3674102 3815065 3010530 3710619
14004C710619j07583j34384K28545j62100J03380j75940O7717L23247K09451o4767
$$ 3710619 3603036 3468652 3697197 3535097 3638477 3462537 3530254 3853501 4062952 3998185
13994C998185j22237M54135j2238R27462O08296J443960K578538L203341K880404
$$ 3998185 3875948 4330083 4317845 5245307 5853603 7297563 9876101 13079442 15959846
13985A5959846j149008j007821r66867j379632j319136r57489r22829j402135
$$ 15959846 14810838 13803017 12836150 11456518 10137382 9179893 8257064 6854929
13977F854929q23195r31033l38381k84397K65610m8714n58147k56345L65453j72194
$$ 6854929 6031734 5100701 4762320 4477923 4743533 4694819 4136672 3880327 4245780 4073586
13967D073586n30210K1538j12007J78670o61205K79654m18244M01114j01271L29454
$$ 4073586 3543376 3564914 3452907 3631577 2970372 3250026 2831782 3232896 3131625 3461079
13957C461079q67421O58879l67786q6971j33149J21245Q0764k56848J58609o2973
$$ 3461079 2593658 3252537 2884751 2797780 2664631 2785876 2866640 2609792 2768401 2705428
13947B705428l10659M1L20878j69589N1269l55258M035j1494K48274P4267k14410
$$ 2705428 2394769 2394810 2715688 2546099 2597368 2242110 2246145 2234651 2482925 2557192 2342782
13936B342782o6626j58878n5251J36189K42208j65914M9066J8353j34254K34168
$$ 2342782 2276156 2117278 2062027 2198216 2440424 2274510 2323576 2341929 2207675 2441843
13926B441843k78462K163l10501J99291J66933j56336J41436l27540m8241O4043
$$ 2441843 2163381 2165544 1855043 2054334 2221267 2064931 2206367 1878827 1830586 1894629
13916A894629l6323J49971q7165k56163J74036J68470k64619L96546m78319J33748
$$ 1894629 1858306 2008277 1921112 1664949 1838985 2007455 1742836 2139382 1661063 1794811
13906A794811j4646Q2028j66268K28974K48140l41464k684k85587J68813j60169
$$ 1794811 1780165 1862193 1695925 1924899 2173039 1831575 1828891 1543304 1712117 1551948
13896A551948J18774l32557K11446J70927j88552J27121J43781k51597K89535
$$ 1551948 1670722 1338165 1549611 1720538 1531986 1659107 1802888 1551291 1840826
13887A840826m56400J80278K15238j17473k79655L90126j16126l93452L52882
$$ 1840826 1384426 1564704 1779942 1662469 1382814 1772940 1656814 1263362 1616244
13878A616244k7521j46548j70991J79050Q3088j23838K1374Q490j23084L53909
$$ 1616244 1588723 1442175 1271184 1450234 1533322 1409484 1430858 1439348 1316264 1670173
13868A670173k42934r2361K15733m07314n9056K19915K20411L72736o32983L71663
$$ 1670173 1427239 1334878 1550611 1143297 1084241 1304156 1524567 1897303 1264320 1635983
13858A635983n29271L75005k04354L2459K24934R3324m68709L50838k8163k40647
$$ 1635983 1106712 1481717 1277363 1309822 1534756 1628080 1159371 1510209 1482046 1241399
13848A241399K40518k28698K4116r3160m3147N2450J66581n27001M36372J80902
$$ 1241399 1481917 1253219 1277335 1184175 1141028 1193478 1360059 833058 1269430 1450332
13838A450332j84959j51700M91900j05064J7858k59044k51777j39564K33420J01445
$$ 1450332 1265373 1113673 1605573 1500509 1518367 1259323 1007546 867982 1101402 1202847
13828A202847l01338K02476l4415j53290K19765k14767K04820J5178K2591M5522
$$ 1202847 901509 1103985 1069570 916280 1136045 921278 1126098 1141276 1163867 1209389
13818A209389j41976M4864k7592K04075l67151j9466K09768k97467J09127M17269
$$ 1209389 1067413 1112277 1084685 1288760 921609 902143 1111911 814444 923571 1340840
13808A340840k24285k47716P9969K29937n576r5692k16099M23468l95984j40578
$$ 1340840 1116555 868839 948808 1178745 1173169 1077477 861378 1284846 888862 748284
13798G48284J44514J90324J62367l46238P3120K61735l76795J1456K435J02183
$$ 748284 892798 1083122 1245489 899251 972371 1234106 857311 868767 871202 973385
13788I73385j81735L12518J99266L20967p65229N8080K30154l05376J24381k70332
$$ 973385 791650 1104168 1303434 1624401 859172 917252 1147406 842030 966411 696079
13778F96079M1672L02311J18586m35711O1678L11832l63111J07666K6621O6788
$$ 696079 737751 1040062 1158648 722937 784615 1096447 733336 841002 867623 934411
13768I34411m07582L28285L6736J51423m43970O88863o16038J48136k09177j51314
$$ 934411 526829 855114 891850 1043273 599303 1288166 672128 820264 611087 459773
13758D59773J19617L18590J0000K40622E21605K18888J4001J74086m27210L40191
$$ 459773 579390 897980 907980 1148602 521605 740493 754494 928580 501370 841561
13748H41561l29442K40305o3639R5590j07104J18270j50828J90528j33577J70435
$$ 841561 512119 752424 688785 784375 677271 795541 644713 835241 701664 872099
13738H72099o3051K6097m9167n4083K71415j54767J62139j84918C75326M01617
$$ 872099 809048 835145 785978 731895 1003310 848543 1010682 825764 375326 776943
13728G76943n2667K9497J85907q7421k58605K06066J60398l71649M1014m5599
$$ 776943 724276 753773 939680 852259 593654 799720 960118 588469 629483 583884
13718E83884L16152K0192K1132l24871L54928l96594K13694J33149k14252K88027
$$ 583884 900036 920228 941360 616489 971417 574823 788517 921666 707414 995441
13708I95441l05273L8586l22219K07760L39371k11038p8840K8572M61269m30590
$$ 995441 690168 728754 406535 614295 953666 742628 663788 692360 1153629 723039
13698G23039l00654J86047j82538K06749j06553p473k313J83555n7920N7206k8993
$$ 723039 422385 608432 425894 632643 526090 518617 516304 699859 641939 699145 670152
13687F70152k25122L03045N52454E13604J62269j38695L7412r7529J27230L03887
$$ 670152 445030 748075 1300529 513604 675873 537178 574590 477061 604291 908178
13677I08178l84366m9989L52174B78331J46945J58975J67975k47418K52824Q4846
$$ 908178 523812 473823 825997 278331 425276 584251 752226 504808 757632 842478
13667H42478l51873J71355l0595M4571l10168N8976J60194A88731M15206L87159
$$ 842478 490605 661960 631365 675936 365768 424744 584938 188731 603937 991096
13657I91096l40324O9020J92184m33860j39093J61790K58310C79046K39845B95116
$$ 991096 650772 719792 911976 478116 339023 500813 759123 379046 618891 295116
13646D91328L7550j99086L48122j19455K0039j5372K74541B69964K13474O7383
$$ 491328 528878 329792 677914 558459 578498 563126 837667 269964 483438 550821
13636E50821k6017j78756M67278k58028J720L4286o8296L01171m10131J36710
$$ 550821 524804 346048 813326 555298 557018 591304 523008 824179 414048 550758
13626E50758A10679J68349J81486J25235B02214J35602r8844L68631k84260j43078
$$ 550758 110679 279028 460514 585749 202214 337816 238972 607603 323343 180265
13616A80265M88279J3952n3051j78713J36708J43176N9365j94647j92385M2852
$$ 180265 668544 682496 629445 450732 587440 730616 789981 595334 402949 445801
13606D45801J8408q0884l2688L68161J68137k77247A94622K81481q6675N9637
$$ 445801 464209 383325 350637 718798 886935 609688 194622 476103 389428 449065
13596D49065j82389J56495L16575k65033r3744n8469L30125C09549K92255r1177
$$ 449065 266676 423171 739746 474713 380969 322500 652625 309549 601804 510627
13586E10627C5099N73532r0700A82674J69612j30912K46395k02271J54845I7633
$$ 510627 35099 608631 517931 182674 352286 221374 467769 265498 420343 97633
13575F20994j25871j18219J18973B13421J64521P0748p7743K70252j79885K5642
$$ 620994 495123 376904 495877 213421 377942 448690 370947 641199 461314 486956
13565D86956j60344j04111K81471I9046M05244O1003R9628j66406B28963m8495
$$ 486956 326612 222501 503972 99046 504290 565293 664921 498515 228963 180468
13555A80468K38530r4283J82301r5189k7738B8313L57386K18198B48134p450m1399
$$ 180468 418998 324715 507016 411827 384089 28313 385699 603897 248134 240684 199285
13544A99285r6254N1211L57581D9172L82309m3195l3867J15341J24774j32705
$$ 199285 103031 154242 511823 49172 431481 388286 354419 469760 594534 461829
13534D61829j81669Q0672L11431G9108L6699Q1478L26108B16200K77494N878R8647
$$ 461829 280160 360832 672263 79108 115807 197285 523393 216200 493694 499572 598219
13523E98219j79604N7103n222k12779J13624J78488K134B44121M11457C17889
$$ 598219 418615 475718 470496 257717 371341 549829 551963 244121 655578 317889
13512G5862K91193I5728L99427p4186j33553L70448B82091A29633M17158B72814
$$ 75862 367055 95728 495155 420969 287416 657864 282091 129633 546791 272814
13501D75094d0132G10777k62800N2569r0284q14Q9615k22254j06382J27374J78593
$$ 475094 -40132 710777 447977 500546 410262 409448 499063 276809 170427 297801 476394
13490D76394k32619L4603L91035l01114L2109N9607j87185J12825A38505N54228
$$ 476394 243775 278378 669413 368299 400408 460015 272830 385655 138505 692733
13480F92733F5310J79526K25119B8169J03763J77928M01554l34179A42007l2716
$$ 692733 65310 244836 469955 28169 131932 309860 711414 377235 142007 109291
13470A09291J83078Q8621L0333j48577Q6789O15F1697A8711P66194A43785k2806
$$ 109291 292369 380990 411323 262746 349535 350150 61697 18711 784905 143785 120979
13459A20979M10467L3317A15175k5669m2589M18199k28538r9283M31868J06906
$$ 120979 531446 564763 115175 89506 46917 465116 236578 137295 569163 676069
13449F76069k13018I2091J44681A12561L0648J95540j32795a10210A40858L3612
$$ 676069 463051 92091 236772 112561 143209 338749 205954 -110210 140858 174470
13439A74470L27672k04008J56259A39043O1909m4110J02682L90725A00623L10120
$$ 174470 502142 298134 454393 139043 200952 156842 259524 650249 100623 410743
13429D10743J07153r4953a04234G6595a02179B69560G7086J72907E0089K46670
$$ 410743 517896 422943 -104234 76595 -102179 269560 77086 249993 50089 296759
13419B96759p2481L39178B18862k3113p633K19206A25259N95478A08241K21137
$$ 296759 224278 563456 218862 195749 188116 407322 125259 720737 108241 329378
13409C29378g0912A61520K86477j84801Q6412l0747A47459e3017E97326G0903
$$ 329378 -70912 161520 447997 263196 349608 318861 147459 -53017 597326 70903
13398C56654A66951R5591C4305N0521R3964m4329L34997a26226B12878Q7292j12978
$$ 356654 166951 262542 34305 84826 178790 134461 469458 -126226 212878 300170 187192
13387A87192L35925j99889n9839L19917B26295e2757C08234j27522J05005K52273
$$ 187192 523117 323228 263389 583306 226295 -52757 308234 180712 285717 537990
13377E37990k58958G1032K96474R2941j51051N4976r8711j13799J35871a8183
$$ 537990 279032 71032 367506 460447 309396 364372 265661 151862 287733 -18183
13366C83165G4328f3685C65660A10793J0532B8432K28694E0273M4527L76001A26872
$$ 383165 74328 -63685 365660 110793 121325 28432 257126 50273 94800 470801 126872
13354E18187k50999K83127K2343r5610E2818L80211q9306j2779A17208M81599
$$ 518187 267188 550315 572658 477048 52818 433029 343723 330944 117208 598807
13344E98807B96489j05683K11267J48808B02326K18190j07489I4220D5014Q4994
$$ 598807 296489 190806 402073 550881 202326 420516 313027 94220 45014 130008
13334A30008M22264B43871j17504L23767M6798A10821J41949J13209q0007G1347
$$ 130008 552272 243871 126367 450134 496932 110821 252770 365979 285972 71347
13323b17427E05517h7971A93258C2958N851P1381K58183J3553L0429A50785K05608
$$ -217427 505517 -87971 193258 32958 38809 110190 368373 381926 412355 150785 356393
13312C56393p2344m6391L10918k01677o2253F8054K35534A2892K91203J5022B9588
$$ 356393 284049 237658 548576 346899 284646 68054 303588 12892 304095 319117 29588
13300b4708I5525K22021G7841K72844F4323J66051C7100A7514L59225a22313F6490
$$ -24708 95525 317546 77841 350685 64323 230374 37100 17514 376739 -122313 66490
13288D57146I0033L1930n2264C992K71676q476p3035j3056K84220A93442C235
$$ 457146 90033 121963 69699 3992 275668 267192 194157 181101 465321 193442 3235
13276A07312K43718A74018o6710J2450M63836B58359K3581p6126A2448J57472
$$ 107312 351030 174018 107308 119758 583594 258359 281940 205814 12448 169920
13266A69920m1331F80P5879r772k267K08900K13381H8559k6827L41045j50074
$$ 169920 128589 680 76559 66787 64520 273420 486801 88559 61732 402777 252703
13255B52703j24129K38050a8153j99017b9478D21743j83620j14123k0438J39497
$$ 252703 128574 366624 -18153 -217170 -29478 421743 238123 124000 103562 243059
13245B43059P5117j1746d059j35709A28571R245R9438J06448A11216C7356J94595
$$ 243059 318176 306430 -4059 -139768 128571 137816 237254 343702 111216 37356 231951
13234B31951J74791F2668b1143H111d73C38412j12355H0802M98076k43174j63792
$$ 231951 406742 62668 -21143 8111 -473 338412 226057 80802 578878 335704 171912
13223A71912J68866R6089A55596o2420O402D3518e2188C89826j68210K13241A42091
$$ 171912 340778 436867 155596 93176 99578 43518 -52188 389826 221616 434857 142091
13211I7354g233B83433a40191N1476a2705B38532a83238A69087Q4640d3751A57084
$$ 97354 -7233 283433 -140191 -88715 -12705 238532 -183238 169087 253727 -43751 157084
13199D06567d0472A12145a64842A36316K02421K46424A02059L87983A1792K2590
$$ 406567 -40472 112145 -164842 136316 338737 585161 102059 490042 11792 34382
13189C4382O09155B57214J4339p4572f7454E1571K57867H3301J85056E1057P6828
$$ 34382 643537 257214 271553 196981 -67454 51571 309438 83301 268357 51057 127885
13178A27885l1687a59428B12903i5551C14066h1426C9255J25595E8923R2295K17587
$$ 127885 96198 -159428 212903 -95551 314066 -81426 39255 164850 58923 151218 368805
13167C68805j57251J39669e2893H0983K80240A75071J90632A69580E6686J23312
$$ 368805 211554 351223 -52893 80983 361223 175071 365703 169580 56686 179998
13157A79998Q5049E7815a20689G4699J518K9930a16848N4213F6007K28911h3206
$$ 179998 265047 57815 -120689 74699 76217 106147 -116848 -62635 66007 294918 -83206
13145A62215J82795G5782L40750C834c9140c541A02415K88873B7504Q1127a4063
$$ 162215 345010 75782 416532 3834 -39140 -3541 102415 391288 27504 108631 -14063
13133A25535K05507P2692F8037K94735e1488I2792a20751A97931l0449b33532
$$ 125535 331042 403734 68037 362772 -51488 92792 -120751 197931 167482 -233532
13122f3674B6894L43269j52797J1983k2582p6338D1826a96505D918K20531d8128
$$ -63674 26894 370163 217366 229349 206767 130429 41826 -196505 4918 225449 -48128
13110B91345d23410B22586m4645d4150G4892K01275L3623b60359A434L9597J39295
$$ 291345 -423410 222586 177941 -44150 74892 276167 309790 -260359 1434 41031 180326
13099A80326O0584A12430J22719f3951f720B84731e1447E7315a50348A58003i1534
$$ 180326 240910 112430 235149 -63951 -6720 284731 -51447 57315 -150348 158003 -91534
13087A68345M3644F7203J21743F7716R4344C4123J40306A1559J70010J9614a42051
$$ 168345 211989 67203 188946 67716 162060 34123 174429 11559 181569 201183 -142051
13075B98669k2871m4719j12550B9408a44385A54848J74355k957B1078K13502R6293
$$ 298669 275798 231079 118529 29408 -144385 154848 329203 326246 21078 234580 330873
13064C30873j65342j8214K00570h5285c8637B31941B6209O0588K34770H9100K73697
$$ 330873 165531 147317 347887 -85285 -38637 231941 26209 86797 321567 89100 362797
13053C62797h3112j07899g2957I1184a60259O5861L8362A25714L171K7945L25307
$$ 362797 -83112 -191011 -72957 91184 -160259 -94398 -56036 125714 128885 156830 482137
13042D82137j28955a21163L5543A78031E1691f2154A0266P3749K66017p6274a80684
$$ 482137 353182 -121163 -85620 178031 51691 -62154 10266 84015 350032 273758 -180684
13030B73051A26036K32103F5448A8647a83958A38163k5779b4918G5519K56502
$$ 273051 126036 358139 65448 18647 -183958 138163 112384 -24918 75519 332021
13020C32021I8664i4122A66615l3503O8914M6616a05715B28565B7430c4250A24552
$$ 332021 98664 -94122 166615 133112 202026 248642 -105715 228565 27430 -34250 124552
13008F18427A71838f6389A03201g2644B83910J04391c4449j2115B10625M2021
$$ 618427 171838 -66389 103201 -72644 283910 388301 -34449 -46564 210625 252646
12998B52646p5551b91014a4372B29742i46H8541c2674A8550K47296r2426K3245
$$ 252646 177095 -291014 -14372 229742 -946 88541 -32674 18550 265846 173420 196665
12987A96665B0726M49375A62743G1722K516b94180a9606j02686A19498J8071N8821
$$ 196665 20726 470101 162743 71722 74238 -294180 -19606 -122292 119498 137569 196390
12976A96390J14310D3656N4261K25871G0747b22073A63543P831k022a21883B45716
$$ 196390 310700 43656 97917 323788 70747 -222073 163543 171374 169352 -121883 245716
12964E0724L24881a42242B17570c3419j7070B31022j05871a24365B188b73568
$$ 50724 375605 -142242 217570 -33419 -50489 231022 125151 -124365 2188 -273568
12953B8694N3434O8478R4510c71102e360H535a0549E5025P7416A7242b33559A49999
$$ 28694 82128 150606 245116 -371102 -5360 8535 -10549 55025 132441 17242 -233559 149999
12940a16742j22667A42640n425Q1646P4114F0588J51607H1268d1206p9636K301
$$ -116742 -239409 142640 137215 218861 292975 60588 212195 81268 -41206 -120842 -118541
12929a18541A65671g0808a1415A57630j7412E1152K75464b14811A16422Q763Q5778
$$ -118541 165671 -70808 -11415 157630 140218 51152 326616 -214811 116422 125185 210963
12918B10963a5483I426K31685O2971B5142b3715A99225J49389i1194o2646A94892
$$ 210963 -15483 9426 241111 304082 25142 -23715 199225 348614 -91194 -153840 194892
12906b06318j08743A31890a57082A97099a40520E2906R105a35714b9785B6408
$$ -206318 -315061 131890 -157082 197099 -140520 52906 62011 -135714 -29785 26408
12895A50499K4754L6779a97663E7235J18063r260e5847j3578D1349a64758D2651
$$ 150499 175253 212032 -197663 57235 175298 166038 -55847 -69425 41349 -164758 42651
12883a90335A4142L28964A56372E5970a7626D0759Q1057b50572F8940O7093a4955
$$ -190335 14142 343106 156372 55970 -17626 40759 121816 -250572 68940 136033 -14955
12871A41217d72888A90903m1051b38877M1322f5216C34350C1881h2331B09934
$$ 141217 -472888 190903 149852 -238877 -197555 -65216 334350 31881 -82331 209934
12860D14733j91983d8870A81902a01396A47718O7181d2109j16901e0426b282B24027
$$ 414733 222750 -48870 181902 -101396 147718 214899 -42109 -159010 -50426 -2282 224027
12848C15421j33030a04044B4730K9311L5172N2529o9217J37302k3688a3302j11648
$$ 315421 182391 -104044 24730 54041 89213 141742 72525 209827 186139 -13302 -124950
12837a24950o0772G6385K22230a86009A69812b14353A47086a79641C2544Q1599
$$ -124950 -185722 76385 298615 -186009 169812 -214353 147086 -179641 32544 114143
12827A14143J02382G0836M9036e8602C75103F1068K7082J46108F3048H172P7407
$$ 114143 216525 70836 119872 -58602 375103 61068 88150 234258 63048 8172 85579
12816H5579l6866a25044c9931a003D02286b4056I0515K54840c04036a17729C0755
$$ 85579 48713 -125044 -39931 -1003 402286 -24056 90515 345355 -304036 -117729 30755
12804a38258L7348A38158b75252A8852K59814N232j02846K6487C78K73188a82680
$$ -138258 -100910 138158 -275252 18852 278666 283898 181052 207539 378 273566 -182680
12792a87976g980D4941K7292M1882m5957B464A080J37755c4556k21256H1904M9665
$$ -187976 -7980 44941 72233 114115 68158 2464 1080 138835 -34556 -255812 81904 131569
12780A31569l7244a3277q3829J2891o9793A21635i9292F7616a60087G9308l8042
$$ 131569 94325 -13277 -97106 -84215 -154008 121635 -99292 67616 -160087 79308 41266
12769D1266K34313D6207L25284D8670a24616L2273m1069G7919a36370A41629C0399
$$ 41266 275579 46207 371491 48670 -124616 -92343 -133412 77919 -136370 141629 30399
12757b49084G1467K08712n7949f5041L1636o1090F4028O9709b17222b634A60868
$$ -249084 71467 280179 222230 -65041 -33405 -94495 64028 133737 -217222 -2634 160868
12745E7678a63638B95238f0031C4388A903a94786B61331d0735F9496J60995k0759
$$ 57678 -163638 295238 -60031 34388 1903 -194786 261331 -40735 69496 230491 209732
12734B09732p7385P5164k8813O5411d5322B40059q9997a40565C78191j21802b34516
$$ 209732 132347 207511 178698 244109 -45322 240059 150062 -140565 378191 256389 -234516
12722A16327j4277b6915h910A73588c51710H7010P6121B1465L0269N9139N1129
$$ 116327 102050 -26915 -8910 173588 -351710 87010 163131 21465 51734 110873 162002
12711A62002R8156K2902a44174A03699L3879J19830L35517A57737k0294J05988
$$ 162002 260158 283060 -144174 103699 137578 257408 592925 157737 137443 243431
12701B43431B3085J22688R3372K43073I4297K76474A76040m1478J78283h3267
$$ 243431 23085 145773 239145 482218 94297 370771 176040 134562 312845 -83267
12690e0816j26134l6665B18846O7911c68681C68443k3554a42017c9229n1284M560
$$ -50816 -176950 -213615 218846 286757 -368681 368443 344889 -142017 -39229 -90513 -85953
12679h5953D09603A95763J09432e9217B64860J60573j96598a01434k2203F2468
$$ -85953 409603 195763 305195 -59217 264860 425433 228835 -101434 -123637 62468
12668A13870K4268O6720e0748B5167L08941o1456L5852A41417i6380a5646p5661
$$ 113870 138138 204858 -50748 25167 334108 272652 308504 141417 -96380 -15646 -91307
12657i1307B33385i1597a9307C00019m0773b723n3629A90887H7345C1736L41215
$$ -91307 233385 -91597 -19307 300019 259246 -2723 -56352 190887 87345 31736 372951
12646C72951A13415M9590K04974j68867e0907B72268a11183L3323B12305i0223
$$ 372951 113415 163005 367979 199112 -50907 272268 -111183 -77860 212305 -90223
12635B91280j13488c18987A99983I7165k0414J58403K7737j1486c834l7003H7830
$$ 291280 177792 -318987 199983 97165 76751 235154 262891 251405 -3834 -40837 87830
12623a38052a072A89823J48864a19848r4583C32301M7865D0876J00454C0922O2703
$$ -138052 -1072 189823 338687 -119848 -214431 332301 380166 40876 141330 30922 93625
12612I3625J56737C8740N112J48160a6684H7794N976A4870b66551l1614B46345
$$ 93625 250362 38740 43852 192012 -16684 87794 93770 14870 -266551 -298165 246345
12600C0376c5878B65752e0772A2180N1047d3947l866o2612K9565l1602A3346g9179
$$ 30376 -35878 265752 -50772 12180 63227 -43947 -47813 -110425 -80860 -112462 13346 -79179
12587C65811j9796d6865m4241E2298A362K14162G573E43e0488G1005b09167B34874
$$ 365811 346015 -46865 -91106 52298 1362 215524 7573 543 -50488 71005 -209167 234874
12574A3389J3625M6107b5055B78220J4122A37851m3231K97075j41535b70439I0292
$$ 13389 27014 73121 -25055 278220 292342 137851 94620 391695 250160 -270439 90292
12562a39086B9017J53659m4634N9298j1763G0511b90634i8786d0274J7621F1633
$$ -139086 29017 182676 138042 197340 185577 70511 -290634 -98786 -40274 -22653 61633
12550b08355H0071a1485j98490j45083C2855b3189j3975C50866b86497I2793g4796
$$ -208355 80071 -11485 -209975 -355058 32855 -23189 -37164 350866 -286497 92793 -74796
12538b58795a24386E4872g5508b946B99707a8737A8397L61015d7372j69624O5718
$$ -258795 -124386 54872 -75508 -2946 299707 -18737 18397 379412 -47372 -216996 -151278
12527a51278A43580a40193D2918a29125E6662J6193O1791o5047C1395b36790d7092
$$ -151278 143580 -140193 42918 -129125 56662 72855 134646 69599 31395 -236790 -47092
12515A60798b660A74942a08057d4622j17598O7327m5742A23980a978j74938M2623
$$ 160798 -2660 174942 -108057 -44622 -162220 -94893 -140635 123980 -1978 -176916 -134293
12504a34293B5712K97781g2145A33277g5498C2991J2927A2686D139K62652d2018
$$ -134293 25712 323493 -72145 133277 -75498 32991 45918 12686 4139 266791 -42018
12492C4929a81952Q1984B86686C143c40568A3638d4198B38258I8979b80l19898
$$ 34929 -181952 -99968 286686 3143 -340568 13638 -44198 238258 98979 -280 -320178
12481c20178F8748L341p772h1417B04087i2995B38889I0360d1714D2069b38800
$$ -320178 68748 72089 64317 -81417 204087 -92995 238889 90360 -41714 42069 -238800
12469C9506L6371J03127a25427K3538j2909p0557G6086d41647c9713H2466d30505
$$ 39506 75877 179004 -125427 -101889 -114798 -185355 76086 -441647 -39713 82466 -430505
12457f8390C00352b93908I4005a73077P3617j29657P2109B7998c5880B44728D9723
$$ -68390 300352 -293908 94005 -173077 -99460 -229117 -157008 27998 -35880 244728 49723
12445B481b51336P2731o0682A5730J64546B9598J30146a8994A87438c14534a04925
$$ 2481 -251336 -178605 -239287 15730 180276 29598 159744 -18994 187438 -314534 -104925
12433C92055B8590K18141b47852A21403K56567I3503J87994G2288M58967A31946
$$ 392055 28590 246731 -247852 121403 377970 93503 281497 72288 531255 131946
12422b70888P6453A68808p9177j8459J28278o530c0763A54105E950b84425a10900
$$ -270888 -194435 168808 89631 71172 199450 192920 -30763 154105 5950 -284425 -110900
12410b09326O7799d2743l73085g9345l7214j06357n6223a5195I3966a58542A82585
$$ -209326 -141527 -42743 -415828 -79345 -116559 -222916 -279139 -15195 93966 -158542 182585
12398B00633A0789R654b34468k43278H6816N9809a33383B10119c04923c3485k7286
$$ 200633 10789 20443 -234468 -477746 86816 146625 -133383 210119 -304923 -33485 -60771
12387f0771Q35C15069i2858q8948c1966m0376A47106d0797H4605R80O1985k7110
$$ -60771 -59936 315069 -92858 -181806 -31966 -72342 147106 -40797 84605 85585 147570 120460
12375A20460J54897j10757b6795A6307a4711B80358n6985q8267C6777P4647d05029
$$ 120460 275357 164600 -26795 16307 -14711 280358 223373 135106 36777 111424 -405029
12363b66750l9264A01692R1127E3205a53287p1074F7387o816b56998G243K87307
$$ -266750 -306014 101692 192819 53205 -153287 -224361 67387 60571 -256998 7243 294550
12352B94550a06849r8854D22618A29439b11747C9462d3690I3005f4081A85429
$$ 294550 -106849 -205703 422618 129439 -211747 39462 -43690 93005 -64081 185429
12341g5712a4675A71231c4958n3368B34903G0775N4331B497b49483C42059c8486
$$ -75712 -14675 171231 -34958 -88326 234903 70775 125106 2497 -249483 342059 -38486
12329c60886C88084j9197A78253B146a68692c7528A60458b67723j1417B41853
$$ -360886 388084 368887 178253 2146 -168692 -37528 160458 -267723 -279140 241853
12318a37127A35723J34680b13641e5940A19761a83995C0741O4612J15141b96043
$$ -137127 135723 270403 -213641 -55940 119761 -183995 30741 95353 210494 -296043
12307B48410J18604b80007c9705k1466M926A24360O3376F8094d5387C79460B0122
$$ 248410 367014 -280007 -39705 -61171 -56245 124360 187736 68094 -45387 379460 20122
12295b5629k04637A96587q5544b48194B26031B6119J04053K43160A77924J81100
$$ -25629 -230266 196587 111043 -248194 226031 26119 130172 373332 177924 359024
12285C59024r6433j1192G3470P8549p0467C0878A3354Q5457J09930K74650I6470
$$ 359024 262591 251399 73470 152019 81552 30878 13354 98811 208741 483391 96470
12273I2779J72102n3497O3368b06552O9148A22519K82002i0427j51545a06844
$$ 92779 264881 211384 274752 -206552 -137404 122519 404521 -90427 -241972 -106844
12262A58648Q4323E4312a19985G4197J9996b0092F8750P1416J31620j23154d7454
$$ 158648 242971 54312 -119985 74197 94193 -20092 68750 140166 271786 148632 -47454
12250A12593a23924k05021i4271A80419K8838e4758j9814B2898M32533a51220
$$ 112593 -123924 -328945 -94271 180419 209257 -54758 -74572 22898 455431 -151220
12239A44558J56179H3762L05756j15926I7895n416c32494A18569O1390L3227O6803
$$ 144558 300737 83762 389518 273592 97895 92479 -332494 118569 179959 213186 279989
12228B79989M9718A61233a58910A72471p2260j7365P2663i2689B96871G3954K27486
$$ 279989 329707 161233 -158910 172471 100211 82846 155509 -92689 296871 73954 301440
12217C01440j50011N2515P9616I5348k4918J24932d5621A41723a8541j53816B46374
$$ 301440 151429 203944 283560 95348 70430 195362 -45621 141723 -18541 -172357 246374
12205H0951M4926b7210j12126A18085O9154q357a44111C17078e4770B10813B8357
$$ 80951 125877 -27210 -139336 118085 187239 178882 -144111 317078 -54770 210813 28357
12193C11929j32206J88557A81911f0839A66060o7129K9581a1149B56185j20755
$$ 311929 179723 368280 181911 -60839 166060 98931 128512 -11149 256185 135430
12183A35430b47016B44637a22549A19728N7781D1254J77055j02614a69961E2093
$$ 135430 -247016 244637 -122549 119728 177509 41254 218309 115695 -169961 52093
12172a72784L0480B0932O4550R5174D09K84526j37140L24803d38A45612J75293
$$ -172784 -142304 20932 85482 180656 409 284935 147795 472598 -438 145612 320905
12161C20905r0127h8045l25353A76844P6126H6368M9552K9366n7688j0576e9346
$$ 320905 230778 -88045 -413398 176844 252970 86368 135920 165286 107598 97022 -59346
12149c06098C15275l3106E5328b315k37375C79664a44445A12313a90044F1220
$$ -306098 315275 282169 55328 -2315 -239690 379664 -144445 112313 -190044 61220
12138A42338C8215K79076j43153B5772e0927j25408B59650a2294G9836D288O4804
$$ 142338 38215 317291 174138 25772 -50927 -176335 259650 -12294 79836 4288 69092
12127F9092b99293c7886p6978F464b06686o7009A65156D5347K12327j8932a0357
$$ 69092 -299293 -37886 -114864 6464 -206686 -273695 165156 45347 257674 238742 -10357
12115b06670A45973C469K93510i9312A2931b09012Q937B61571L0860E6149J77925
$$ -206670 145973 3469 296979 -99312 12931 -209012 -200075 261571 292431 56149 234074
12104B34074a00074D26902b35203B13753A8930J49441j4236h3623a6310A09678
$$ 234074 -100074 426902 -235203 213753 18930 168371 154135 -83623 -16310 109678
12093E9127G21M8534a50148C22089a67063e262G2343J9292b40034B05487h8115
$$ 59127 721 49255 -150148 322089 -167063 -5262 72343 91635 -240034 205487 -88115
12081d51954K24262D5190e903E0442J95382O2794e7986l5563c5116J2553B42971
$$ -451954 -227692 45190 -5903 50442 245824 308618 -57986 -93549 -35116 -22563 242971
12069D62169J09305B45874L04274B50504J36531A23452D9352e8244E9432j1661
$$ 462169 571474 245874 550148 250504 387035 123452 49352 -58244 59432 47771
12059D7771A0276J74965N0058k2053k5830C3380b6450C75287b88892G8981K34053
$$ 47771 10276 185241 235299 213246 187416 33380 -26450 375287 -288892 78981 313034
12048C13034a29346O1132o1561A42408B2810b01996d5264k03145P7587h3689o3848
$$ 313034 -129346 -68214 -129775 142408 22810 -201996 -45264 -248409 -170822 -83689 -147537
12037a47537f2689D2027J07799a23824j74751J26976j2711j6783g9375j78175
$$ -147537 -62689 42027 149826 -123824 -298575 -171599 -184310 -201093 -79375 -257550
12027b57550j66760c8780a8649k57288j30154a12668A11628a6638A06866N7607
$$ -257550 -424310 -38780 -18649 -275937 -406091 -112668 111628 -16638 106866 164473
12017A64473b51954C39006C5009a3867D9011J45904b54976A71541p5113O2777
$$ 164473 -251954 339006 35009 -13867 49011 194915 -254976 171541 96428 159205
12007A59205J4783K63981A34532c10027A0811a43090B15432q7066A6681M1649
$$ 159205 173988 437969 134532 -310027 10811 -143090 215432 128366 16681 58330
11997E8330a1985j61086A12172K3778m1730a04064C10524A08100e5556a8196G9459
$$ 58330 -11985 -173071 112172 135950 94220 -104064 310524 108100 -55556 -18196 79459
11985a37951H4199a16018B74255a24721C42890F4727j8346J87033m5084F6715
$$ -137951 84199 -116018 274255 -124721 342890 64727 46381 233414 188330 66715
11974E24853G2851f2892n6443I6051h9024C63049A62922a85279r131L0555o5869
$$ 524853 72851 -62892 -119335 96051 -89024 363049 162922 -185279 -194410 -163855 -229724
11963b29724l9314H5504R0551a4138A1708a39898C17381c1500E3158c73567H4565
$$ -229724 -269038 85504 176055 -14138 11708 -139898 317381 -31500 53158 -373567 84565
11951A32173f1408j205q0664m865C97907f7151D0552d4754A73511B3348J41016
$$ 132173 -61408 -62613 -143277 -148142 397907 -67151 40552 -44754 173511 23348 164364
11940A64364P8543j6271b16273A69347m5018r896n0194c2264A24679a14850m7088
$$ 164364 242907 226636 -216273 169347 124329 114433 64239 -32264 124679 -114850 -161938
11929a61938b2839j4870k55837A31368c1330m4444D48783E2774a99166e1488A05851
$$ -161938 -22839 -37709 -293546 131368 -31330 -75774 448783 52774 -199166 -51488 105851
11917B9236b39661a17938N3259A7497c8459C74N0172j7157c22438J45253E1453
$$ 29236 -239661 -117938 -64679 17497 -38459 374 50546 33389 -322438 -177185 51453
11905B87104a14495j85759C03193B9011J98561J1070a31221C88413b02105A28683
$$ 287104 -114495 -300254 303193 29011 227572 238642 -131221 388413 -202105 128683
11894h0121A77380b05259A15557k083a90344O8242j05384D15967F3985c4916o6112
$$ -80121 177380 -205259 115557 113474 -190344 -122102 -227486 415967 63985 -34916 -101028
11883a01028D0445b02286R6109j15165j7067H6825i7620G5985B7533K17973j00757
$$ -101028 40445 -202286 -106177 -221342 -238409 86825 -97620 75985 27533 245506 144749
11872A44749b6738C5357M74131A74725C5241J47705b35819J05588M5360j11354
$$ 144749 -26738 35357 509488 174725 35241 182946 -235819 -130231 -84871 -196225
11862a96225o6026B5176R5202b35924I0375a23590j78024R8431A97666K14196
$$ -196225 -262251 25176 120378 -235924 90375 -123590 -301614 -203183 197666 411862
11852D11862A25363i276N7P99k22422j5292a05468A1976L77568c29683J59162
$$ 411862 125363 -9276 -9219 -8420 -230842 -246134 -105468 11976 389544 -329683 -170521
11841a70521B22956c1129q1024o3478H9138B1197a10533M6841I3489e4369j91295
$$ -170521 222956 -31129 -112153 -175631 89138 21197 -110533 -63692 93489 -54369 -245664
11830b45664F1231a35446b5632A20106c21229O1850b3413q3520o9462P8813p5551
$$ -245664 61231 -135446 -25632 120106 -321229 -259379 -23413 -106933 -176395 -97582 -173133
11819a73133k6855h8050j63624N4395I9841b0484F9661g7378A67085f7254j71137
$$ -173133 -199988 -88050 -251674 -197279 99841 -20484 69661 -77378 167085 -67254 -238391
11808b38391A40174g8651I1220B1635f1771m3009A69260e1950C2088J27489c2943
$$ -238391 140174 -78651 91220 21635 -61771 -104780 169260 -51950 32088 159577 -32943
11796I3168a35061H5280k59Q0764a56633E2716g2993A95084D746L31349a86176
$$ 93168 -135061 85280 85021 165785 -156633 52716 -72993 195084 4746 336095 -186176
11784a22872a6326j62810A13747h7773A3542a51107K094A3370i3226j46529A89401
$$ -122872 -16326 -179136 113747 -87773 13542 -151107 -149013 13370 -93226 -239755 189401
11772A65082i4599m19434A28654d1262D7331d97646a70921A46433o4086b88101
$$ 165082 -94599 -514033 128654 -41262 47331 -497646 -170921 146433 82347 -288101
11761H6489d27254J47223f5734C77953G0628J20307e4811A03634i6335d6608A80791
$$ 86489 -427254 -280031 -65734 377953 70628 190935 -54811 103634 -96335 -46608 180791
11749f4983E4105a97875B34822q5379g5354m191k09014m6185J35205B18985A03972
$$ -64983 54105 -197875 234822 149443 -75354 -79545 -288559 -334744 -199539 218985 103972
11737a4681k25770L4809b6395F8544c7475m1152A02774Q2764c1384B15782D0961
$$ -14681 -240451 -205642 -26395 68544 -37475 -78627 102774 185538 -31384 215782 40961
11725B51029a11564j62447D0306a09933F8061J50850H3144B2711C194a44050J8388
$$ 251029 -111564 -274011 40306 -109933 68061 218911 83144 22711 3194 -144050 -125662
11714a25662G0322J40609b49904I0162B0941L6220L10021A01941J0262a30990
$$ -125662 70322 210931 -249904 90162 20941 57161 367182 101941 112203 -130990
11703A50879b16659a06217k06720J45166f0023B24283a39994A38458a8173H6945
$$ 150879 -216659 -106217 -312937 -167771 -60023 224283 -139994 138458 -18173 86945
11692B7280L06218q3901a26134B76381d3433l950C30401A20369P0054j8360E4926
$$ 27280 333498 249597 -126134 276381 -43433 -47383 330401 120369 190423 172063 54926
11680H0223h9315m10232a29566C37181b0405D60804b03065B4680K354Q7305q190
$$ 80223 -89315 -499547 -129566 337181 -20405 460804 -203065 24680 27034 114339 106149
11669A06149a01222C42383h4357D4351N611M79087a73070A81196l5B7945b60504
$$ 106149 -101222 342383 -84357 44351 49962 529049 -173070 181196 181161 27945 -260504
11657H3060h2351b9142d997n4729A30113a43797C0428a45403M4655j06359C2007
$$ 83060 -82351 -29142 -4997 -59726 130113 -143797 30428 -145403 -100748 -207107 32007
11645A68185a3984E1113O4587m6163c73466B90420a48042K6606a3416C65881E2569
$$ 168185 -13984 51113 115700 69537 -373466 290420 -148042 -121436 -13416 365881 52569
11633A8954a17629m08112K22624E8642a13484B9217J81356a02405a5304j37818
$$ 18954 -117629 -525741 -303117 58642 -113484 29217 210573 -102405 -15304 -153122
11623a53122a8139j47682A76763g8799F9369J64673I6382c5310B36600e2144A60573
$$ -153122 -18139 -165821 176763 -78799 69369 234042 96382 -35310 236600 -52144 160573
11611G1179Q7985c8396a7044C20066C4987O5785A2707b79004I9025B5216e3887
$$ 71179 159164 -38396 -17044 320066 34987 100772 12707 -279004 99025 25216 -53887
11599B82363K5705l5285F8133a38630B87835k0632D1974K5278g938A31429m5552
$$ 282363 308068 272783 68133 -138630 287835 267203 41974 67252 -7938 131429 85877
11588H5877P4542J57876A31934Q470J66679a98520A64124E1576J22009c051r0504
$$ 85877 160419 318295 131934 140404 307083 -198520 164124 51576 173585 -3051 -93555
11577i3555C368d3562j06762B0249J39726F5786L123K00505b28053B95683j00901
$$ -93555 3368 -43562 -150324 20249 159975 65786 68909 269414 -228053 295683 194782
11566A94782A6902P8506a24827k2667k3553A11375K80903A33987N6100l8295A0816
$$ 194782 16902 95408 -124827 -147494 -171047 111375 392278 133987 190087 151792 10816
11554a2749b722C04684h6020J2916D37101e8516n5032J4145D8772P6512e2115
$$ -12749 -2722 304684 -86020 -73104 437101 -58516 -113548 -99403 48772 125284 -52115
11542A03467l5137j0824L14774D7597L16805j35043J68248K8112A75671A6081
$$ 103467 68330 57506 372280 47597 364402 229359 397607 425719 175671 16081
11531B81434L9910j0818j43971q0429d1972B365c2970A26473D8295M5765K15407
$$ 281434 321344 310526 166555 86126 -41972 2365 -32970 126473 48295 94060 309467
11520C09467e2681B71375F9932Q5937f085k7941j64386C7514O0666Q5359p9268
$$ 309467 -52681 271375 69932 155869 -6085 -34026 -198412 37514 98180 183539 104271
11509A04271a0269A52335g9859A45784f3616B0384d7487k31694a5178A14704J62216
$$ 104271 -10269 152335 -79859 145784 -63616 20384 -47487 -279181 -15178 114704 276920
11498B76920l8196a87567B74291a8274B73848J24364a44434B83186K6846j30956
$$ 276920 238724 -187567 274291 -18274 273848 398212 -144434 283186 310032 179076
11488A79076B3963Q0393B6000K80889I2595M6965J51664H1185a86741B97253a2719
$$ 179076 23963 104356 26000 306889 92595 139560 291224 81185 -186741 297253 -12719
11476B01283q9987K2124e9694g854o2474o2653B58269i4219C76979R7664G6932
$$ 201283 111296 133420 -59694 -7854 -70328 -132981 258269 -94219 376979 474643 76932
11464A87786o6748J90886j18967K78823G1474K02663b57848q4272A10909d2466
$$ 187786 121038 311924 192957 471780 71474 274137 -257848 -342120 110909 -42466
11453C51245A14350J91928p3021A05628l9972J4448J95751a9979B89908k9422
$$ 351245 114350 306278 233257 105628 65656 80104 275855 -19979 289908 260486
11443B60486P949l8912H9105n872a59090M1944j41205D52385j76503a57820A29269
$$ 260486 268435 229523 89105 83233 -159090 -117146 -258351 452385 275882 -157820 129269
11431F3151k6137h8388B0700p739c17642c5343B5374K78408j04823H2369L1497
$$ 63151 37014 -88388 20700 12961 -317642 -35343 25374 303782 198959 82369 113866
11420A13866A8739J68720d7662A45082J28603a02740H7024B1047J06306c0239
$$ 113866 18739 187459 -47662 145082 273685 -102740 87024 21047 127353 -30239
11409b8810B79440I4279e9991j98763c2468R955p5690d7152A05161R7267j9940
$$ -28810 279440 94279 -59991 -258754 -32468 -22513 -98203 -47152 105161 202428 182488
11398A82488D7617O8711b45358A29853a21149P805C1131M8394K99307a10868j35181
$$ 182488 47617 116328 -245358 129853 -121149 -113344 31131 79525 378832 -110868 -246049
11387b46049I0563b0291A83220D8579J50252a60081G0577a02807C6304j5187J96664
$$ -246049 90563 -20291 183220 48579 198831 -160081 70577 -102807 36304 21117 217781
11376B17781b17644D2299a06136G4569J23044d0845B33312J94538i6715G1879
$$ 217781 -217644 42299 -106136 74569 197613 -40845 233312 427850 -96715 71879
11365b45099B44289C4772h1406r8555Q3738A70707D9950H083h6324j8224H5897
$$ -245099 244289 34772 -81406 -179961 -96223 170707 49950 8083 -86324 -104548 85897
11353d09795A71012g8741A87659c81545J65722A55781e5568B75110e1898C45966
$$ -409795 171012 -78741 187659 -381545 -215823 155781 -55568 275110 -51898 345966
11342I7225c19143a39444D33182a15799k9511a4602A51527b99895C882K07358
$$ 97225 -319143 -139444 433182 -115799 -145310 -14602 151527 -299895 3882 211240
11332B11240L1003a1114k67613M2035i8545r3056N3256A10399i1206B80178b5822
$$ 211240 242243 -11114 -278727 -236692 -98545 -191601 -138345 110399 -91206 280178 -25822
11320b46160A54166a7193A92332B9939e2696B5508K19923I4331b06056j55183
$$ -246160 154166 -17193 192332 29939 -52696 25508 245431 94331 -206056 -361239
11310c61239f4737l49988A15894a35775j75651B36422R1240i452F1585O2882b26259
$$ -361239 -64737 -414725 115894 -135775 -311426 236422 327662 -9452 61585 124467 -226259
11298a03467k013j11582l3789Q4064O4304r7228G3926l0366a07637n5965n52H1934
$$ -103467 -105480 -217062 -250851 -166787 -102483 -199711 73926 43560 -107637 -163602 -164154 81934
11285i5423A62774K2446b74675o8615B2879b9420E9345K38154E8051b16118m863
$$ -95423 162774 185220 -274675 -343290 22879 -29420 59345 297499 58051 -216118 -220981
11274b20981q2882a8696j88851g3474r3661N8421a2338F3974i6405L6645a446
$$ -220981 -303863 -18696 -207547 -73474 -167135 -108714 -12338 63974 -96405 -59760 -1446
11262e0088j76361j76819A6296K16886G0409N1079c74126B36195q9699a20538
$$ -50088 -226449 -403268 16296 233182 70409 121488 -374126 236195 146496 -120538
11251B28427F7331K64995a09932d0362l95835H422a14657k45565J51799R8612
$$ 228427 67331 332326 -109932 -40362 -436197 8422 -114657 -360222 -208423 -109811
11241a09811j76089B72807a17515E5898i4905J3110A21781b88666C65199a5650
$$ -109811 -285900 272807 -117515 55898 -94905 -81795 121781 -288666 365199 -15650
11230h905A12344l7611K46117B3175i3270k04993A42866a14714e0511k3251l7267
$$ -8905 112344 74733 320850 23175 -93270 -298263 142866 -114714 -50511 -73762 -111029
11219a11029K8350l4506k05261f295E127d7579A00505b88834c706j8497C2530
$$ -111029 -82679 -117185 -322446 -6295 5127 -47579 100505 -288834 -3706 -22203 32530
11207h0246K7702j91131m2380h1642k11980G224K5448b96838m1786B7279c13533
$$ -80246 -52544 -243675 -286055 -81642 -293622 7224 32672 -296838 -338624 27279 -313533
11195c74441J61803J01896j12264C7674a36314F3616a75180j75992A55036a20978
$$ -374441 -212638 -110742 -223006 37674 -136314 63616 -175180 -351172 155036 -120978
11184A51642h3941r4004G0524a9901B24837K51150c45569B24942H4464c72263
$$ 151642 -83941 -177945 70524 -19901 224837 475987 -345569 224942 84464 -372263
11173a995D444J08787J79769a19336d0215m5475B55901a85072n6651P9510C24711
$$ -1995 4444 113231 293000 -119336 -40215 -85690 255901 -185072 -241723 -162213 324711
11161C05666A5938i1282l67128G3581h161B7941J61908h2432A86836A2255K04082
$$ 305666 15938 -91282 -458410 73581 -8161 27941 189849 -82432 186836 12255 216337
11150B16337r4981d2923A38613R9177J57135h9600j37597a12701B05659b9569
$$ 216337 121356 -42923 138613 237790 394925 -89600 -227197 -112701 205659 -29569
11139C27220A13692c14266D45550b34517C6364a7125E0572e8059A64317a26295
$$ 327220 113692 -314266 445550 -234517 36364 -17125 50572 -58059 164317 -126295
11128H5731f3425B97915J46718K6026A67607i3248D30033f5179A22256h2919C13338
$$ 85731 -63425 297915 444633 470659 167607 -93248 430033 -65179 122256 -82919 313338
11116A36873F3844K19320a92629A29593J03079g4327B02538K20869j24971j15910
$$ 136873 63844 283164 -192629 129593 232672 -74327 202538 423407 298436 182526
11106A82526F7260j4802R8243m4243M06540l7831o9553I0986a33575B48602B2134
$$ 182526 67260 52458 150701 106458 512998 475167 405614 90986 -133575 248602 22134
11094A03169K29493D0847d1776B40196m187r9827Q395M45089k60620M6752M8217
$$ 103169 332662 40847 -41776 240196 236009 136182 144577 589666 329046 375798 424015
11083D24015E3785p123K31465I3960J10875H2929O2056K44666R9187j08310j80321
$$ 424015 53785 46662 278127 93960 204835 82929 144985 389651 488838 380528 200207
11072B00207f5237B10252L2721o7154J26925q0756K67970k6808j06393K89391
$$ 200207 -65237 210252 242973 175819 302744 221988 489958 463150 356757 646148
11062F46148k19652A72035M37015K55723l41790K27308K04035l22572j88931Q3301
$$ 646148 426496 172035 609050 864773 522983 750291 954326 631754 442823 526124
11052E26124j34170K76219j18997J35048l6553n0935K879Q9367j10074k0875N3088
$$ 526124 391954 668173 549176 684224 647671 596736 599615 688982 578908 558033 611121
11041F11121p4704K72545l35536M23069j80649l40782M58422k69772N51745l70476
$$ 611121 536417 808962 473426 896495 715846 375064 833486 563714 1115459 744983
11031G44983K48249D42314L6324P16437l99624j91688B98344K50434L59394j31211
$$ 744983 993232 442314 478638 1195075 795451 603763 298344 548778 908172 776961
11021G76961k91724O7817K11347J10094C47318K65548l6900r1333J78362r4655
$$ 776961 485237 553054 764401 874495 347318 612866 575966 484633 662995 568340
11011E68340k6580J77533k84925p5575N6263m3295J22975P2530K81346J04589
$$ 568340 541760 719293 434368 358793 415056 371761 494736 567266 848612 953201
11001I53201m01925K06848K53473j62193k84654K68198m2568n5108K35028l04103
$$ 953201 551276 758124 1011597 849404 564750 832948 790380 735272 970300 666197
10991F66197K66076j38732l7382J78633L9042J92249k89783J80501N6166J34411
$$ 666197 932273 793541 756159 934792 973834 1166083 876300 1056801 1112967 1247378
10981A247378k85065M83218J79706Q016J47632L8703K86882n6603j6678K60191
$$ 1247378 962313 1445531 1625237 1633253 1780885 1819588 2106470 2049867 2033189 2293380
10971B293380N0163j78137j33470M1498J66676m44444R6314o6981j50023k30785
$$ 2293380 2343543 2165406 2031936 2073434 2240110 1795666 1891980 1824999 1674976 1444191
10961A444191L82658L8581l11033J79509J41660m80267K8537K49435l76466P8236
$$ 1444191 1826849 1865430 1554397 1733906 1875566 1395299 1423836 1673271 1296805 1375041
10951A375041j09163j26182P3574m71306J35305R5616l08468K9488j57017K24162
$$ 1375041 1265878 1139696 1213270 741964 877269 972885 664417 693905 536888 761050
10941G61050C19332M5313M1376J07529j70407q9032M2737A14141O1537J52221
$$ 761050 319332 364645 406021 513550 343143 254111 296848 114141 175678 327899
10931C27899m2031h7331B82741a25524A3898a717l20535a56670A41355L88793
$$ 327899 285868 -87331 282741 -125524 13898 -1717 -322252 -156670 141355 530148
10921E30148G1238O2861N0991O3200b6148n4440A60360g2223m331B82123C0576
$$ 530148 71238 134099 185090 248290 -26148 -80588 160360 -72223 -76554 282123 30576
10909I7425a44544I2232J25453N4574G0678P0295m1205K34720c7194B41542C1441
$$ 97425 -144544 92232 217685 272259 70678 140973 99768 334488 -37194 241542 31441
10897I5086c3265n8911c671k01810j61640e3666B44986A04001i6006I8125B157
$$ 95086 -33265 -92176 -3671 -205481 -367121 -53666 244986 104001 -96006 98125 2157
10885A04325a39151N7770c2397C38412j34905g8411A66072j9065R418o0013h5337
$$ 104325 -139151 -81381 -32397 338412 203507 -78411 166072 147007 156425 96412 -85337
10873A13845d3036A88299a5094j75518M8200H2415J53520F4940J68845a6287A79736
$$ 113845 -43036 188299 -15094 -190612 -142412 82415 235935 64940 233785 -16287 179736
10861A33988e6450A19082A6457P4856J0680b3117E9298J15552A3466M4335J78353
$$ 133988 -56450 119082 16457 91313 101993 -23117 59298 174850 13466 57801 236154
10850B36154D5901A9516b5445l0127j20184c937m7277B15396j2123d13079J98636
$$ 236154 45901 19516 -25445 -55572 -175756 -3937 -51214 215396 203273 -413079 -214443
10839b14443B7780L7251a66422A4205c9219o8220k03724A96486o4522d7557n6335
$$ -214443 27780 65031 -166422 14205 -39219 -107439 -311163 196486 131964 -47557 -103892
10828a03892A70861K3750a06251o586A32147k0588a67016O3726H9890g053p1229
$$ -103892 170861 194611 -106251 -112837 132147 111559 -167016 -103290 89890 -7053 -78282
10817g8282j20984H3932c4114r573a5388r9021j64598J22693j74036f3793f524
$$ -78282 -199266 83932 -34114 -43687 -15388 -114409 -279007 -156314 -330350 -63793 -6524
10805a1228j91726j70062g7149b9856k07329F8201b4035J0414A34152b91675M9773
$$ -11228 -202954 -373016 -77149 -29856 -237185 68201 -24035 -13621 134152 -291675 -241902
10794b41902I0925l9142J24810a73808A1146O777J53718J2713N8038g2933J3767
$$ -241902 90925 51783 176593 -173808 11146 17923 171641 184354 242392 -72933 -59166
10783e9166C6733b2338B3760b09324A45028b48746B87400b33674g7813c3785j30022
$$ -59166 36733 -22338 23760 -209324 145028 -248746 287400 -233674 -77813 -33785 -163807
10772a63807C12496C0943L7303c7564B13648a56877I2572b65253F1461c7194A9901
$$ -163807 312496 30943 68246 -37564 213648 -156877 92572 -265253 61461 -37194 19901
10760a99183A24754m5711C6628a30311j17299H0478J32378F392b33478R9241A79879
$$ -199183 124754 79043 36628 -130311 -247610 80478 212856 6392 -233478 -134237 179879
10748A05447D2214b05555J1356A3720a68367E0066B0331a04379A44019h7708A16086
$$ 105447 42214 -205555 -194199 13720 -168367 50066 20331 -104379 144019 -87708 116086
10736b40618G4062a78236F5693O9928d8133a5141I7229a47608D2447c14326d699
$$ -240618 74062 -178236 65693 135621 -48133 -15141 97229 -147608 42447 -314326 -4699
10724b33017d3433C07350A01481D4848i9920A18939c79683A64066B8480K03768
$$ -233017 -43433 307350 101481 44848 -99920 118939 -379683 164066 28480 232248
10714B32248e004j59169A00548h6900j05900k2858c7515D2469J02980A8793a87922
$$ 232248 -5004 -164173 100548 -86900 -192800 -215658 -37515 42469 145449 18793 -187922
10702a6797k80416A90056d21233A1772J67092a83895f0667A20633L0920b98145
$$ -16797 -297213 190056 -421233 11772 178864 -183895 -60667 120633 151553 -298145
10691i9326d826j16134k17646D0164b29377i1480D4678j2443J00021a05094c2920
$$ -99326 -4826 -120960 -338606 40164 -229377 -91480 44678 32235 132256 -105094 -32920
10679F0778a98502o1336j90086a91375A31966A3280b15563G0546P7669k4980N949
$$ 60778 -198502 -259838 -449924 -191375 131966 13280 -215563 70546 148215 123235 129184
10668A29184g5843G8904f5062A46926k7697K97361B4222J58474b43058c2845j7048
$$ 129184 -75843 78904 -65062 146926 119229 416590 24222 182696 -243058 -32845 -49893
10657d9893G252c7994E2221c8681B24119A9138J35259n6681a03301A00565C5546
$$ -49893 7252 -37994 52221 -38681 224119 19138 154397 97716 -103301 100565 35546
10645c01709N0895E0069a0614p7599j5924A74353a85275B71319A962c7709A34326
$$ -301709 -250814 50069 -10614 -88213 -104137 174353 -185275 271319 1962 -37709 134326
10633i6340A62427h0888K7887k13667a13831d5122n9543A29306c16933P2395l2571
$$ -96340 162427 -80888 -53001 -266668 -113831 -45122 -104665 129306 -316933 -244538 -277109
10622b77109a31406A0483O4907a26793B98194E0970J7877f8541m168D4948K00075
$$ -277109 -131406 10483 75390 -126793 298194 50970 68847 -68541 -72709 44948 245023
10611B45023a74981D4256N6009b97521A3837L9209a26618A42823b05085j084P1944
$$ 245023 -174981 44256 100265 -297521 13837 53046 -126618 142823 -205085 -206169 -134225
10600a34225a5212j12669M914c8226o9322A14094b21555R7607B17059b53145c2662
$$ -134225 -15212 -127881 -122967 -38226 -107548 114094 -221555 -123948 217059 -253145 -32662
10588a58192A769d3273B5377K20019b6974q7416A40884M8623l0375c19121B0935
$$ -158192 1769 -43273 25377 245396 -26974 -114390 140884 189507 159132 -319121 20935
10576a90367o5743b209k32530m0912B74064C9629b14459h0317j07990N8044A74600
$$ -190367 -256110 -2209 -234739 -275651 274064 39629 -214459 -80317 -188307 -130263 174600
10564a67576o7316O3798d6714B33739c4814H074O9769L4508B1556b65596A01088
$$ -167576 -234892 -171094 -46714 233739 -34814 8074 77843 112351 21556 -265596 101088
10552a01559A23087a64754D9515e3371B0606J02655B7100J6986K10730a14605
$$ -101559 123087 -164754 49515 -53371 20606 123261 27100 44086 254816 -114605
10541a66448G8769Q8399a38256N4559j46916R3017D4896a82421D2324a96352B40090
$$ -166448 78769 167168 -138256 -83697 -230613 -137596 44896 -182421 42324 -196352 240090
10529a80346C47071D2121L61486H0979b10487A83079P3601l4093J00285A2864
$$ -180346 347071 42121 403607 80979 -210487 183079 256680 222587 322872 12864
10518A71762b33591l34120d0189j7154C12718G7280d62762a49551E3538P3908
$$ 171762 -233591 -567711 -40189 -57343 312718 77280 -462762 -149551 53538 127446
10508A27446n6340a89103H8812G304J07010B9067a80091N988C63252A29760c90855
$$ 127446 71106 -189103 88812 7304 114314 29067 -180091 -174103 363252 129760 -390855
10496a97718i0495m1978m4820B6556N1800J42305B2174J2655d5414m6875B06938
$$ -197718 -90495 -132473 -177293 26556 78356 220661 22174 34829 -45414 -92289 206938
10484B69667n9317B4032a85523I5418j7376R6294a62383B8867J21720J23262I1567
$$ 269667 210350 24032 -185523 95418 78042 174336 -162383 28867 150587 273849 91567
10472A50754J63345b73110a15561k6328B65833k7854b14979d0426a3885j12560
$$ 150754 314099 -273110 -115561 -141889 265833 237979 -214979 -40426 -13885 -126445
10462a26445d2137m9146A73872O3484a7197k68758A8040d9280O082k07020B96553
$$ -126445 -42137 -91283 173872 237356 -17197 -285955 18040 -49280 -43198 -250218 296553
10450a29696O0206G1575d90233a8483k85221c936E6153R6023i0950A73258h4394
$$ -129696 -69490 71575 -490233 -18483 -303704 -3936 56153 152176 -90950 173258 -84394
10438d248l9380j14463e06l87481E8362K56312D3368J22531g7148E1327e1623
$$ -4248 -43628 -158091 -506 -387987 58362 314674 43368 165899 -77148 51327 -51623
10426B25124K2303h4938a3868M313A38876b0635A02274f3243k59075A4695J6184
$$ 225124 247427 -84938 -13868 -9555 138876 -20635 102274 -63243 -322318 14695 30879
10415C0879J41047a44217A04189b1989j46637B31911c2960F1318N0947b11724
$$ 30879 171926 -144217 104189 -21989 -168626 231911 -32960 61318 112265 -211724
10404a62733j78649E1679b25859c9657B5635a05666B5549J42324l1328d26251
$$ -162733 -341382 51679 -225859 -39657 25635 -105666 25549 167873 136545 -426251
10393c8304a5960B04928j6713m5780m1389i3517D98782A4632L99795B6967K24424
$$ -38304 -15960 204928 188215 142435 101046 -93517 498782 14632 414427 26967 251391
10382B51391g4821A13257m3140a12226B15954L22016a02593B60791Q9040K1685
$$ 251391 -74821 113257 70117 -112226 215954 537970 -102593 260791 349831 371516
10372C71516q5275J68621A54722R7586K1312O4784K71467k00078j30743j7460
$$ 371516 286241 454862 154722 252308 273620 338404 609871 409793 279050 261590
10362B61590r4242N1266n0078J30723j9786A39610J60534L30773l14192J30907
$$ 261590 167348 218614 168536 299259 279473 139610 300144 630917 316725 447632
10352D47632A61644K89873B18435J54024j34688M37813B63379A19790D6264N99777
$$ 447632 161644 451517 218435 372459 237771 675584 263379 119790 46264 646041
10342F46041F8979J39438K26369j35564Q2177P1165a27432b114A71335K0069F5045
$$ 646041 68979 208417 434786 299222 381399 452564 -127432 -2114 171335 191404 65045
10330h840B73139C3436J63094M0126k2447M7575r0524l242C5232a04147A59345
$$ -8840 273139 33436 196530 236656 214209 261784 171260 168018 35232 -104147 159345
10318a54535c0752B59197K25567a42257A1875J10141J22292a37679J7414A87728
$$ -154535 -30752 259197 484764 -142257 11875 122016 244308 -137679 -120265 187728
10307g6322A54531K32536a32275C111J34101A581g2205p0203B10861K552r4429
$$ -76322 154531 387067 -132275 3111 137212 1581 -72205 -142408 210861 213413 118984
10296A18984D0554N0757e1316J7032A14769B8169a109k99561D828L59265a39563
$$ 118984 40554 91311 -51316 -34284 114769 28169 -1109 -300670 4828 364093 -139563
10284b6462A81003C1899J14265a40037C0045e3303k59322J17436B47854h9001
$$ -26462 181003 31899 146164 -140037 30045 -53303 -312625 -195189 247854 -89001
10273a64529m0775e2261j431B4987b82615c5716I2095c52739a38922a4247F1873
$$ -164529 -205304 -52261 -53692 24987 -282615 -35716 92095 -352739 -138922 -14247 61873
10261C89188a47894F5465J34870K87660D1059J83900K7654A15889L08989A73269
$$ 389188 -147894 65465 200335 487995 41059 224959 252613 115889 424878 173269
10250b8743A61433a35333A60728a00086D74790G9431a89738Q9697k14888A22568
$$ -28743 161433 -135333 160728 -100086 474790 79431 -189738 -100041 -314929 122568
10239B82379p5992H1833c72540H0907k8919b1617k10988A67459c33970A30938
$$ 282379 206387 81833 -372540 80907 51988 -21617 -232605 167459 -333970 130938
10228c62139a60513j05528A92290a66120L6717i49G5809a43749k2471C32289a71329
$$ -362139 -160513 -266041 192290 -166120 -129403 -949 75809 -143749 -166220 332289 -171329
10216A54675f9193A8946J8556a01989j73064a12302C4310b33061A53358e8616
$$ 154675 -69193 18946 37502 -101989 -275053 -112302 34310 -233061 153358 -58616
10205A1214c66339C7755f884j73922E0100c12530B45783a28730k32946a10534
$$ 11214 -366339 37755 -6884 -180806 50100 -312530 245783 -128730 -361676 -110534
10194a4425F9155a55187j92969c3154I7222c31629a17470j65776j20623a14555
$$ -14425 69155 -155187 -348156 -33154 97222 -331629 -117470 -283246 -403869 -114555
10183a8411k6318o5005A4090f8890j73236A40308a72882B35985M4819g3972j49196
$$ -18411 -44729 -109734 14090 -68890 -242126 140308 -172882 235985 280804 -73972 -223168
10172b23168h6429K9269k18295d734A07974A6860b47132Q9667A56672c28359J03707
$$ -223168 -86429 -57160 -275455 -4734 107974 16860 -247132 -157465 156672 -328359 -224652
10161b24652Q6253f6196j21020j14976q883f6096j07340H2944K1523L69732b63944
$$ -224652 -138399 -66196 -187216 -302192 -311075 -66096 -173436 82944 104467 474199 -263944
10149b37350j8296L983P4003k7969q6985H0276a9090k39623g823l17516A45555
$$ -237350 -255646 -251663 -177660 -205629 -292614 80276 -19090 -258713 -7823 -325339 145555
10137A23000O3494M5978C2033A2088J16314a07312o5182f1456B38604i5603A93608
$$ 123000 186494 232472 32033 12088 128402 -107312 -172494 -61456 238604 -95603 193608
10125D2448b06681H7806C2331a39951N785A801N3511B5300P0440i2000j02695
$$ 42448 -206681 87806 32331 -139951 -134166 1801 55312 25300 95740 -92000 -194695
10114a94695B8996J52367c74418I4649a48091f8930a3524B9906c3811j08996k49026
$$ -194695 28996 181363 -374418 94649 -148091 -68930 -13524 29906 -33811 -142807 -391833
10103c91833a18847k4522L1435j62957J36346B10861A4897a16301n3492L9399
$$ -391833 -118847 -143369 -111934 -274891 -138545 210861 14897 -116301 -169793 -130394
10093a30394j35367a3867j79204A43975B7850a05367p6277d4260J0149A20746
$$ -130394 -265761 -13867 -193071 143975 27850 -105367 -181644 -44260 -34111 120746
10082a47090O6384r1160E4222f0703k02287a21710j21477R4109H5868c5977j35227
$$ -147090 -80706 -171866 54222 -60703 -262990 -121710 -243187 -149078 85868 -35977 -171204
10071a71204D3626d3864j2187R060k16841M6155j71264e1811E2735b60906Q3393
$$ -171204 43626 -43864 -56051 -46991 -263832 -217677 -388941 -51811 52735 -260906 -177513
10060a77513A7324e575m48116h7365r9741d318A06874b46142J01070e4246A09045
$$ -177513 17324 -5575 -453691 -87365 -187106 -4318 106874 -246142 -145072 -54246 109045
10048d47286A66284b24755A36673j0687C1520Q3130B8803e2419j80587f6733b3549
$$ -447286 166284 -224755 136673 125986 31520 114650 28803 -52419 -233006 -66733 -23549
10036c91566A73444f4599j71543A88999b00405k8700c5756j5273r810C97448b34144
$$ -391566 173444 -64599 -236142 188999 -200405 -229105 -35756 -51029 -60839 397448 -234144
10024h8249l11855A40785F784J62759D5911P2220c433j02563n7290A37374J59609
$$ -88249 -400104 140785 6784 169543 45911 118131 -3433 -105996 -163286 137374 296983
10013B96983a97952E0758a44793N6764l3146H152f4322C5251b0931I6057h2101
$$ 296983 -197952 50758 -144793 -88029 -121175 8152 -64322 35251 -20931 96057 -82101
10001a81810c3252A55884b08524B8098o234P1359d23485o758d5518J0011j33999
$$ -181810 -33252 155884 -208524 28098 21864 93223 -423485 -430243 -45518 -35507 -169506
9990a69506e0557A46146b51A9366J55518d3398k53565J28111A55704m652a92719
$$ -169506 -50557 146146 -251 19366 174884 -43398 -296963 -168852 155704 151052 -192719
9978c431k99316R6469j1665i0893A14558b66035a12486o5313e8336j73144G7254
$$ -3431 -302747 -206278 -217943 -90893 114558 -266035 -112486 -177799 -58336 -231480 77254
9966g7224r9602j66003P1814a01169E6177N1124a33066O1106E8750M924j1352
$$ -77224 -176826 -342829 -271015 -101169 56177 107301 -133066 -71960 58750 63674 52322
9955E2322a30546r7020C29746g8959j04194j43350c8004A0961a01652j30318a00772
$$ 52322 -130546 -227566 329746 -78959 -183153 -326503 -38004 10961 -101652 -231970 -100772
9943c2329D4367R2335l3661a4450A23935J19037D3856d54015e8659A07064d5472
$$ -32329 44367 136702 103041 -14450 123935 242972 43856 -454015 -58659 107064 -45472
9931d50305c4000j37419D7547c14631A21758b34948a6867D26538d47455a50483
$$ -450305 -34000 -171419 47547 -314631 121758 -234948 -16867 426538 -447455 -150483
9920A26107K00189b4144j29055l2529e3186k01255D0011f5668b2007a36m2812
$$ 126107 326296 -24144 -153199 -185728 -53186 -254441 40011 -65668 -22007 -136 -42948
9909d2948j2375j74697k179j23027D8911J00268b61201J3852a23077L5030a7601
$$ -42948 -55323 -230020 -232199 -355226 48911 149179 -261201 -247349 -123077 -88047 -17601
9897H4786N8659C7676K32734c692A03858B9445J12012A8272J54499a18806G7823
$$ 84786 143445 37676 270410 -3692 103858 29445 141457 18272 172771 -118806 77823
9885D50219b5386B6356i7587j70171Q8940A16879d52524K22301M8446b8856r8310
$$ 450219 -25386 26356 -97587 -267758 -178818 116879 -452524 -230223 -181777 -28856 -127166
9874a27166A5398b54629l7017I9480j6677O905i764j21282I5157J07451a67663
$$ -127166 15398 -254629 -291646 99480 82803 89708 -9764 -131046 95157 202608 -167663
9862i2973B9337J16383K0182B9390K46517b85900j07163Q2430d037I0459g9569
$$ -92973 29337 145720 165902 29390 275907 -285900 -393063 -310633 -4037 90459 -79569
9850g9692B35128f8519n6237J3729B4219f9399C1542c6765A55662J8243E0514
$$ -79692 235128 -68519 -124756 -111027 24219 -69399 31542 -36765 155662 173905 50514
9838B3169L3852a71084l7013O0488j17228a09536A33473e3478k49180a27215J0523
$$ 23169 57021 -171084 -208097 -147609 -264837 -109536 133473 -53478 -302658 -127215 -116692
9827a16692b0827D5398b08135a01802c9630o0511K4752r8884O0283q2716G9502
$$ -116692 -20827 45398 -208135 -101802 -39630 -100141 -75389 -174273 -113990 -196706 79502
9815G7579b45476j3037b3481j80172J3428j7536c6800j42998a5909O162A32521
$$ 77579 -245476 -258513 -23481 -203653 -190225 -207761 -36800 -179798 -15909 -9747 132521
9803b31335j6912J20366f2148p7293B2248K80407e5769l8236c9051k14760n9636
$$ -231335 -248247 -127881 -62148 -139441 22248 302655 -55769 -94005 -39051 -253811 -313447
9792c13447D72732A34455a02134E4455O4898d21297J10547a43153O3178C512c01635
$$ -313447 472732 134455 -102134 54455 119353 -421297 -310750 -143153 -79975 3512 -301635
9780d1520j1535J5521o6682j12117p5408J04571k3533o2902a10077A72061a52344
$$ -41520 -53055 -37534 -104216 -216333 -291741 -187170 -210703 -273605 -110077 172061 -152344
9768g2686B9258M5112a23574A00895d11095d7269B185Q8190c0351C90578a26554
$$ -72686 29258 74370 -123574 100895 -411095 -47269 2185 90375 -30351 390578 -126554
9756b46773L8587B12805G129h9817J6466m9670K4977F0370a41072E5563a01581
$$ -246773 -208186 212805 7129 -89817 -73351 -123021 -98044 60370 -141072 55563 -101581
9744E99120b03075P9907A83556F1951a4774k56114D4220a8719k85292J46253k00481
$$ 599120 -203075 -123168 183556 61951 -14774 -270888 44220 -18719 -304011 -157758 -358239
9733c58239G6038c44653C8055j4109a38620k31713J26753A05873e9471F1493i4983
$$ -358239 76038 -344653 38055 23946 -138620 -370333 -243580 105873 -59471 61493 -94983
9721a00313M6041j18115c1417j98541A62026A2535K14011R866m5094g6612k48416
$$ -100313 -54272 -172387 -31417 -229958 162026 12535 226546 236412 191318 -76612 -325028
9710c25028j04119l1703B39042b17029a5080j60205q0532m4003a32738l68192
$$ -325028 -429147 -460850 239042 -217029 -15080 -175285 -255817 -299820 -132738 -500930
9700e00930A77969a79046e984A8089a06966j90847h1046H0842g8744r3955l5480
$$ -500930 177969 -179046 -5984 18089 -106966 -297813 -81046 80842 -78744 -172699 -208179
9689b08179R5231a7572D7527a32761B20822a0927H2284D364a94286A88607c54584
$$ -208179 -112948 -17572 47527 -132761 220822 -10927 82284 4364 -194286 188607 -354584
9677b6792B13772J4773a66765a013k6847j20104B6279a46259k17119f0969E9706
$$ -26792 213772 228545 -166765 -1013 -27860 -147964 26279 -146259 -363378 -60969 59706
9665c27967J44959n1460O1988j94561b5881G1892b41980Q9729B03623a33944F9158
$$ -327967 -183008 -234468 -172480 -367041 -25881 71892 -241980 -152251 203623 -133944 69158
9653a7431n8563E6014d9181j87443e6305A01402b33215g0146k85530J17368g7622
$$ -17431 -75994 56014 -49181 -236624 -56305 101402 -233215 -70146 -355676 -238308 -77622
9641c01953J2445A56130b26268a4923E5636h3352n2491C04182d02201j83500K14365
$$ -301953 -289508 156130 -226268 -14923 55636 -83352 -135843 304182 -402201 -585701 -371336
9630c71336a4398A01651K06396I6187b91720B12194a59453N8017n3521j45016
$$ -371336 -14398 101651 308047 96187 -291720 212194 -159453 -101436 -154957 -299973
9620b99973H9243k1398a1004C3574b02450A72593a28804c1052m557m8552c6384
$$ -299973 89243 67845 -11004 33574 -202450 172593 -128804 -31052 -35609 -84161 -36384
9608A43302b05902f228A04071C2300h4229I1181K1734a94893b7866I9475i3550
$$ 143302 -205902 -6228 104071 32300 -84229 91181 112915 -194893 -27866 99475 -93550
9596A74556b73586A32201D4140e6105J2789c562l3084A11924b46254I4951a79648
$$ 174556 -273586 132201 44140 -56105 -43316 -3562 -36646 111924 -246254 94951 -179648
9584E1474a11062A26704b04853M6076j07977d2774j27012F0005c5265j0335C1781
$$ 51474 -111062 126704 -204853 -158777 -266754 -42774 -169786 60005 -35265 -45600 31781
9572A09100a01634j5843j05013g6693A28100A120N8152j7078e28898a66057l1611
$$ 109100 -101634 -117477 -222490 -76693 128100 1120 59272 42194 -528898 -166057 -197668
9561a97668A19674a24832B1352a93561b1464A44660E5148Q1500a3116I5532g4762
$$ -197668 119674 -124832 21352 -193561 -21464 144660 55148 136648 -13116 95532 -74762
9549b58753B5791K16154p4806d0427j79756E6550c02574h440j43956d0683A35911
$$ -258753 25791 241945 167139 -40427 -220183 56550 -302574 -8440 -152396 -40683 135911
9537f3363A91216b63856a00041P918l43425j37407C0503J96314A01947a37083
$$ -63363 191216 -263856 -100041 -92123 -435548 -572955 30503 226817 101947 -137083
9526a97893A11523a98899j38433D3000b62602A62733b80744i031A89237c35842
$$ -197893 111523 -198899 -337332 43000 -262602 162733 -280744 -9031 189237 -335842
9515B23541P6500b7529k04083c9548k54528A27675f6021I839h1925B09775c36059
$$ 223541 300041 -27529 -231612 -39548 -294076 127675 -66021 9839 -81925 209775 -336059
9503A94729a63576A11483d5943j14024B70044i1449A11437c4508k46309E9247
$$ 194729 -163576 111483 -45943 -159967 270044 -91449 111437 -34508 -280817 59247
9492g8094A8974J8888i429E1931K0013b16952l3202Q1500B2715d01388g6791A67656
$$ -78094 18974 37862 -9429 51931 71944 -216952 -250154 -168654 22715 -401388 -76791 167656
9479c52172k26955H1335K9371c70807J18055k79783J04983b349l5099G9456J66135
$$ -352172 -579127 81335 110706 -370807 -252752 -532535 -427552 -2349 -37448 79456 245591
9468B45591j19031b11796l17255A23422b0517B10956J71435j49307b27415O6398
$$ 245591 126560 -211796 -529051 123422 -20517 210956 382391 233084 -227415 -161017
9458a61017A90614b54046g4933C47426b70962i1074q9441q23d9763C57106d0060
$$ -161017 190614 -254046 -74933 347426 -270962 -91074 -180515 -181338 -49763 357106 -40060
9446a99680O4178L1782B2444a97305j27408A21134a7369o3233K837q2229F5924
$$ -199680 -135502 -103720 22444 -197305 -324713 121134 -17369 -80602 -77765 -159994 65924
9434f3327j9615A09885a93295B48055a16360I946g1417i54p5817C1248b12774
$$ -63327 -82942 109885 -193295 248055 -116360 9946 -71417 -954 -76771 31248 -212774
9422B38573q4539E3669e9324A28860c28643A98414d03817j0725a53710P1134q2176
$$ 238573 154034 53669 -59324 128860 -328643 198414 -403817 -414542 -153710 -82576 -164752
9411a64752F1851a74845m3264B5622c22013a54702A21574R1377I7464b57493F2978
$$ -164752 61851 -174845 -218109 25622 -322013 -154702 121574 212951 97464 -257493 62978
9399a61082m5093C61921D2425a57020c3921n0807k23676E3084g2679j08801C0730
$$ -161082 -206175 361921 42425 -157020 -33921 -84728 -308404 53084 -72679 -181480 30730
9387B0458J21692D8536a502A46220B9048J76899b41162A65286B8970N2830a38193
$$ 20458 142150 48536 -1502 146220 29048 205947 -241162 165286 28970 81800 -138193
9375B82770F9522i7946P361A04179b4420C1986c76776I696J3917Q9472C0006a1518
$$ 282770 69522 -97946 -90585 104179 -24420 31986 -376776 9696 23613 113085 30006 -11518
9362f8182b4274k04436A6346a42830m3083j06071k1314J34801j04114l9885A7108
$$ -68182 -24274 -228710 16346 -142830 -185913 -291984 -313298 -178497 -282611 -322496 17108
9350a21199D9388c99411a00318b4559j98363B8008L26554B7121a33923J0734a7907
$$ -121199 49388 -399411 -100318 -24559 -222922 28008 354562 27121 -133923 -123189 -17907
9338a51913N4329A19939a0519k2305m1096A60931c50666c4396A11572K8215f4548
$$ -151913 -97584 119939 -10519 -32824 -73920 160931 -350666 -34396 111572 139787 -64548
9326c36135C07798b35924n0986e4864K1184q7987r4304B54218a16250O641m8480
$$ -336135 307798 -235924 -286910 -54864 -33680 -121667 -215971 254218 -116250 -109609 -158089
9315a58089C535M686J5275b97387F9910a32701C06741g6104K0178b2950m7471
$$ -158089 3535 8221 23496 -297387 69910 -132701 306741 -76104 -55926 -22950 -70421
9304g0421A34076e6696j47210b6716B58294G920h5020k26705M2430N5713b9281
$$ -70421 134076 -56696 -203906 -26716 258294 7920 -85020 -311725 -269295 -213582 -29281
9292d29642J69087J09809k4793k8762K2750B46198q5174l5848A8609i8606a5323
$$ -429642 -260555 -150746 -175539 -204301 -181551 246198 161024 125176 18609 -98606 -15323
9280b73439A34824o7188Q7472b25636D9306N8659a65928H6058b05724j07445a49691
$$ -273439 134824 67636 155108 -225636 49306 107965 -165928 86058 -205724 -313169 -149691
9268f5152k62859F5181J17634E977b19068L9990g477F1600N5554J08040A5839
$$ -65152 -328011 65181 182815 5977 -219068 -179078 -7477 61600 117154 225194 15839
9256A52937J1382d8547R851j49663J8724N5138B71524i7573L0643F875d65844
$$ 152937 164319 -48547 -38696 -188359 -169635 -114497 271524 -97573 -66930 6875 -465844
9244A51410b89771c69r6107C7015j3455a04520A22827c02980a0405j58685K2752
$$ 151410 -289771 -369 -96476 37015 23560 -104520 122827 -302980 -10405 -169090 -146338
9233a46338G0975b09832j11315J47300j4356K3843j21213j30437a31106j38752
$$ -146338 70975 -209832 -321147 -173847 -188203 -164360 -285573 -416010 -131106 -269858
9223b69858g7245D5494a86187N3102A73797d09211N3262B08771A0880a99563G2762
$$ -269858 -77245 45494 -186187 -133085 173797 -409211 -355949 208771 10880 -199563 72762
9211b511n8593k8112o35j03903i1936F1806J04012k6812a33018F281b71120B8825
$$ -2511 -61104 -89216 -89851 -193754 -91936 61806 165818 139006 -133018 6281 -271120 28825
9198H3733A1573f5477a8812k58851c9093r7813j73762e5806E49960H9217A6485
$$ 83733 11573 -65477 -18812 -277663 -39093 -136906 -310668 -55806 549960 89217 16485
9186C94711b14938d034A55622C9415j1854a57387J9658A46425a24024j43262A10024
$$ 394711 -214938 -4034 155622 39415 27561 -157387 -137729 146425 -124024 -267286 110024
9174C34574c10634J5811G5232f6241A72017a91757M9813j63905J30256l1932c4807
$$ 334574 -310634 -294823 75232 -66241 172017 -191757 -141944 -305849 -175593 -207525 -34807
9162a57735A69481h778n6866R400k735D3145a34281K5714j51817E542J16476F909
$$ -157735 169481 -8778 -65644 -56244 -58979 43145 -134281 -108567 -260384 5542 122018 6909
9149A03797c20587j0233a02703o2107O3553k99966a76867b1166l10008J41550
$$ 103797 -320587 -330820 -102703 -164810 -101257 -401223 -176867 -21166 -331174 -189624
9139a89624E8740b26000H7178f7285A77784f4147K8220A44998a1432n1301j1057
$$ -189624 58740 -226000 87178 -67285 177784 -64147 -35927 144998 -11432 -62733 -73790
9128g3790j85777a21995k43826J06674C08029c84751a68333B07463a01791C7781
$$ -73790 -259567 -121995 -365821 -259147 308029 -384751 -168333 207463 -101791 37781
9117a51660E8802c75094a06947d6658l8534b9829j7206j33295A6777a85447R2011
$$ -151660 58802 -375094 -106947 -46658 -85192 -29829 -47035 -180330 16777 -185447 -93436
9106i3436j72590A53052a93305e4819B21393p3998e3491F8236K16962b61270j7065
$$ -93436 -266026 153052 -193305 -54819 221393 147395 -53491 68236 285198 -261270 -278335
9095b78335P9700h1389j96854d3927A98143a61219B0099i317k88216B33581j07500
$$ -278335 -198635 -81389 -278243 -43927 198143 -161219 20099 -9317 -297533 233581 126081
9084A26081a53954H6478a35691A9530Q1377i2927A56528f7629F6310c9497m28282
$$ 126081 -153954 86478 -135691 19530 100907 -92927 156528 -67629 66310 -39497 -467779
9073d67779e3686k27881A5673d770l22005a60871j6776L7180k00531o0597J45109
$$ -467779 -53686 -281567 15673 -4770 -326775 -160871 -177647 -140467 -340998 -401595 -256486
9062b56486a18465J5248n3943D33135C8099b24109A9720N1053g7228d821l6640
$$ -256486 -118465 -103217 -157160 433135 38099 -224109 19720 70773 -77228 -4821 -41461
9051d1461A6197K67658D9012b22460C4847K6381b43720a07321j00836c5884l93880
$$ -41461 16197 283855 49012 -222460 34847 61228 -243720 -107321 -208157 -35884 -429764
9040d29764a39377B0114O879a61672K0281C41970e3825D44226D8321J7706b95786
$$ -429764 -139377 20114 26993 -161672 -141391 341970 -53825 444226 48321 66027 -295786
9028a38434B47834A09204b43238B1149a87218c0542k74231c4970C340L10022a58680
$$ -138434 247834 109204 -243238 21149 -187218 -30542 -304773 -34970 3340 313362 -158680
9016C14998j05603O6688a06062o4123k3104N4902e0669J9371N862m1674k26191
$$ 314998 209395 276083 -106062 -170185 -193289 -138387 -50669 -31298 -25436 -67110 -293301
9005b93301e8554k88610a16346H039b21338d5582b1697J0505m06345C4154a90506
$$ -293301 -58554 -347164 -116346 8039 -221338 -45582 -21697 -11192 -417537 34154 -190506
8993H9899b88542f0090I2113a00898o4808c3494A95694b70816A56261A0600R3856
$$ 89899 -288542 -60090 92113 -100898 -165706 -33494 195694 -270816 156261 10600 104456
8982A04456J45775h1239L4573K2733j49011O0230j10112k0528a4069l03963h2200
$$ 104456 250231 -81239 -46666 -23933 -172944 -112714 -222826 -243354 -14069 -318032 -82200
8970C34889G7336K1800L7985h3975d0514l17057a12201m7344r0869h3308A46191
$$ 334889 77336 99136 137121 -83975 -40514 -357571 -112201 -159545 -250414 -83308 146191
8958f9192j34717l0362D9042a03213E9771R9448b4439C5147J91261a4955D30436
$$ -69192 -203909 -234271 49042 -103213 59771 159219 -24439 35147 226408 -14955 430436
8946B13660K31053H175L77023a10791D8571K66826Q1748F1926L57905D3389a54644
$$ 213660 444713 8175 385198 -110791 48571 315397 397145 61926 419831 43389 -154644
8934B51889H5625K60806C6018J32277H0215K98376P7923J14549N62797K91643
$$ 251889 85625 346431 36018 168295 80215 378591 456514 571063 1133860 1425503
8924A425503O99834J532902k78013o03885m44075k97503m50890l3418m62742E09119
$$ 1425503 2125337 3658239 3380226 2776341 2332266 2034763 1583873 1550455 1087713 509119
8913G24757k38832O1002k06240J52535J45392A75732K41711n803C3115J46849
$$ 724757 485925 546927 340687 493222 638614 175732 417443 411640 33115 179964
8903A79964K88347d321A17626M7645n5433Q5169a43127m0026l768l2339A48101
$$ 179964 468311 -4321 117626 165271 109838 195007 -143127 -183153 -186921 -219260 148101
$$ [...]
##END NTUPLES=NMR SPECTRUM
##END=
