
##TITLE=AC1302_PERAH12114_6608382_PZ89wDSsjw
##JCAMPDX= 6.0         $$ Bruker NMR JCAMP-DX V2.0
##DATA TYPE= NMR SPECTRUM
##DATA CLASS= NTUPLES
##ORIGIN= BRUKER
##OWNER= Administrator
$$ 1.72 TOPSPIN		Version 2.1
$$ 2012-08-15 16:58:29.250 -0500  Administrator@TOPSPIN
$$ Compression mode = diff/dup
##.OBSERVE FREQUENCY= 400.02188249412
##.OBSERVE NUCLEUS= ^1H
##.ACQUISITION MODE= SIMULTANEOUS (DQD)
##.ACQUISITION SCHEME= undefined
##.AVERAGES= 64
##.DIGITISER RES= 22
##SPECTROMETER/DATA SYSTEM= spect
##.PULSE SEQUENCE= noesygpps1d.comp
##.SOLVENT NAME= COFFEE_meoh
##.SHIFT REFERENCE= INTERNAL, COFFEE_meoh, 1, 14.96022
##AUDIT TRAIL= $$ (NUMBER, WHEN, WHO, WHERE, PROCESS, VERSION, WHAT)
$$ ##TITLE= Audit trail, TOPSPIN		Version 2.1
$$ ##JCAMPDX= 5.01
$$ ##ORIGIN= Bruker BioSpin GmbH
$$ ##OWNER= Administrator
$$ $$ C:\Bruker\TOPSPIN/data/COFFEE/nmr/AC1302_PERAH12114_6608382_PZ89wDSsjw/42/pdata/1/auditp.txt
$$ ##AUDIT TRAIL=  $$ (NUMBER, WHEN, WHO, WHERE, PROCESS, VERSION, WHAT)
(   1,<2012-08-15 16:58:17.015 -0500>,<Administrator>,<TOPSPIN>,<go>,<TOPSPIN 2.1>,
      <created by zg
	started at 2012-08-15 16:46:46.312 -0500,
	POWCHK enabled, PULCHK disabled,
       configuration hash MD5:
       6B 1B 68 BB D9 2E 58 E2 7F 35 AD 54 07 DF 0E 41
       data hash MD5: 64K
       9E 44 8F E4 00 D3 B7 D1 EE B5 BB EB E8 5A 9B B1>)
(   2,<2012-08-15 16:58:25.734 -0500>,<Administrator>,<TOPSPIN>,<proc1d>,<TOPSPIN 2.1>,
      <Start of raw data processing
       efp LB = 0.3 FT_mod = 6 PKNL = 1 PHC0 = 0 PHC1 = 0 SI = 128K 
       data hash MD5: 128K
       0D A8 18 52 FD 13 70 89 0D A3 4A B8 9B B4 43 F0>)
(   3,<2012-08-15 16:58:27.984 -0500>,<Administrator>,<TOPSPIN>,<proc1d>,<TOPSPIN 2.1>,
      <pk PHC0 = 0.1812744 PHC1 = 0 
       data hash MD5: 128K
       E4 FC 1B B1 A2 62 58 0D A8 C4 1E 02 D8 0E E4 E9>)
(   4,<2012-08-15 16:58:28.718 -0500>,<Administrator>,<TOPSPIN>,<proc1d>,<TOPSPIN 2.1>,
      <abs ABSG = 1 
       data hash MD5: 128K
       81 25 1A 93 4C C7 99 25 F4 0E 41 82 DB 63 45 7E>)
(   5,<2012-08-15 16:58:28.828 -0500>,<Administrator>,<TOPSPIN>,<proc1d>,<TOPSPIN 2.1>,
      <abs ABSG = 2 
       data hash MD5: 128K
       93 63 B4 B7 4A 57 20 C8 95 B5 D4 33 BE 5F AE 64>)
(   6,<2012-08-15 16:58:28.906 -0500>,<Administrator>,<TOPSPIN>,<proc1d>,<TOPSPIN 2.1>,
      <abs ABSG = 3 
       data hash MD5: 128K
       FF 46 54 26 52 16 33 4B 7F 1A 5B 9B 5B DF 45 75>)
(   7,<2012-08-15 16:58:28.968 -0500>,<Administrator>,<TOPSPIN>,<proc1d>,<TOPSPIN 2.1>,
      <abs ABSG = 4 
       data hash MD5: 128K
       15 E5 87 D8 2F 4E A9 F2 F2 3B 44 63 3A 09 63 7B>)
(   8,<2012-08-15 16:58:29.031 -0500>,<Administrator>,<TOPSPIN>,<proc1d>,<TOPSPIN 2.1>,
      <abs ABSG = 5 
       data hash MD5: 128K
       91 C0 BF 89 3C 07 12 58 3B 5B 42 81 D6 7D 02 DD>)
$$ ##END=
$$ 
$$ $$ hash MD5
$$ $$ E4 EC 38 2A BC FF 87 13 18 0E A9 75 3C 4B B9 70
##$RELAX= 
##$RELAX= 
##$RELAX= 
##$RELAX= 
##$RELAX= 
##$RELAX= 
##$RELAX= 
##$RELAX= 
$$ Bruker specific parameters
$$ [...]
##$TP07= 0
##$TPNAME0= <>
##$TPNAME1= <>
##$TPNAME2= <>
##$TPNAME3= <>
##$TPNAME4= <>
##$TPNAME5= <>
##$TPNAME6= <>
##$TPNAME7= <>
##$TPOAL= (0..7)
0.5 0.5 0.5 0.5 0.5 0.5 0.5 0.5
##$TPOFFS= (0..7)
0 0 0 0 0 0 0 0
##$TUNHIN= 0
##$TUNHOUT= 0
##$TUNXOUT= 0
##$USERA1= <user>
##$USERA2= <user>
##$USERA3= <user>
##$USERA4= <user>
##$USERA5= <user>
##$V9= 5
##$VALIST= <valist>
##$VCLIST= <CCCCCCCCCCCCCCC>
##$VD= 0
##$VDLIST= <DDDDDDDDDDDDDDD>
##$VPLIST= <PPPPPPPPPPPPPPP>
##$VTLIST= <TTTTTTTTTTTTTTT>
##$WBST= 1024
##$WBSW= 4
##$XGAIN= (0..3)
0 0 0 0
##$XL= 0
##$YL= 0
##$YMAX_a= 14077369
##$YMIN_a= -10846126
##$ZGOPTNS= <>
##$ZL1= 120
##$ZL2= 120
##$ZL3= 120
##$ZL4= 120
##$ABSF1= 14.96022
##$ABSF2= -5.597961
##$ABSG= 5
##$ABSL= 3
##$ALPHA= 0
##$AQORDER= 0
##$ASSFAC= 0
##$ASSFACI= 0
##$ASSFACX= 0
##$ASSWID= 0
##$AUNMP= <proc_prof1d_extract.lims>
##$AXLEFT= 0
##$AXNAME= <>
##$AXNUC= <1H>
##$AXRIGHT= 0
##$AXTYPE= 0
##$AXUNIT= <>
##$AZFE= 0.1
##$AZFW= 0.1
##$BCFW= 0
##$BC_mod= 0
##$BYTORDP= 0
##$COROFFS= 0
##$CY= 15
##$DATMOD= 1
##$DC= 0
##$DFILT= <>
##$DTYPP= 0
##$F1P= 0
##$F2P= 0
##$FCOR= 0.5
##$FTSIZE= 131072
##$FT_mod= 6
##$GAMMA= 0
##$GB= 0
##$INTBC= 1
##$INTSCL= 1
##$ISEN= 128
##$LB= 0.3
##$LEV0= 0
##$LPBIN= 0
##$MAXI= 10000
##$MC2= 0
##$MEAN= 0
##$ME_mod= 0
##$MI= 0
##$NCOEF= 0
##$NC_proc= -4
##$NLEV= 6
##$NOISF1= 0
##$NOISF2= 0
##$NSP= 0
##$NTH_PI= 0
##$NZP= 0
##$OFFSET= 14.96022
##$PC= 1
##$PHC0= 0.1812744
##$PHC1= 0
##$PH_mod= 1
##$PKNL= yes
##$PPARMOD= 0
##$PPDIAG= 0
##$PPIPTYP= 0
##$PPMPNUM= 2147483647
##$PPRESOL= 1
##$PSCAL= 4
##$PSIGN= 0
##$PYNMP= <proc.py>
##$REVERSE= no
##$SF= 400.020009947011
##$SI= 131072
##$SIGF1= 0
##$SIGF2= 0
##$SINO= 400
##$SIOLD= 131072
##$SPECTYP= <>
##$SREGLST= <1H.CDCl3>
##$SSB= 0
##$STSI= 131072
##$STSR= 0
##$SW_p= 8223.68421052631
##$SYMM= 0
##$S_DEV= 0
##$TDeff= 65536
##$TDoff= 0
##$TI= <>
##$TILT= no
##$TM1= 0
##$TM2= 0
##$TOPLEV= 0
##$USERP1= <user>
##$USERP2= <user>
##$USERP3= <user>
##$USERP4= <user>
##$USERP5= <user>
##$WDW= 1
##$XDIM= 131072
##$YMAX_p= 453192318
##$YMIN_p= -272515602
##$CURPLOT= <Network HP LaserJet P1505>
##$CURPRIN= <$Network HP LaserJet P1505>
##$DFORMAT= <normdp>
##$LAYOUT= <+/1D_H.xwp>
##$LFORMAT= <normlp>
##$PFORMAT= <normpl>
##$SURQMSG= 1
$$ End of Bruker specific parameters
$$ ---------------------------------
##NTUPLES= NMR SPECTRUM
##VAR_NAME=  FREQUENCY,     SPECTRUM/REAL,   SPECTRUM/IMAG
##SYMBOL=    X,             R,               I
##VAR_TYPE=  INDEPENDENT,   DEPENDENT,       DEPENDENT
##VAR_FORM=  AFFN,          ASDF,            ASDF
##VAR_DIM=   131072,        131072,          131072
##UNITS=     HZ,            ARBITRARY UNITS, ARBITRARY UNITS
##FACTOR=    0.0627417313425164, 1,          1
##FIRST=     8223.62146879497, -1983,        -278828
##LAST=      0,             3548,            -280717
##MIN=       0,             -272515602,      0
##MAX=       8223.62146879497, 453192318,    0
$$ Real data points
##PAGE= N=1
##DATA TABLE= (X++(R..R)), XYDATA
$$ [...]
$$ plain form
63389 3828254 3788114 3744601 3699228 3654296 3611208 3570080 3530431 3492078 3455664 3422251 3392237
63378 3392237 3365125 3340716 3319849 3303212 3290081 3279342 3271188 3266487 3264989 3265999 3270560 3280766
63366 3280766 3296541 3315445 3336534 3361900 3392833 3426946 3461643 3498503 3540718 3586821 3630603
63355 3630603 3667983 3701070 3734288 3769110 3804447 3839976 3876121 3911197 3941228 3963508 3979353
63344 3979353 3992661 4006129 4018995 4028012 4030511 4026742 4019086 4008799 3994172 3972641 3944290 3912113
63332 3912113 3878831 3844790 3809434 3773356 3737501 3701067 3661867 3618962 3573928 3529528 3488154
63321 3488154 3451280 3418580 3386897 3351740 3311120 3267002 3222198 3177193 3131338 3085481 3041176
63310 3041176 2998319 2956171 2916143 2880418 2847576 2812978 2774959 2738006 2707632 2683838 2661665
$$ packed form
63389C828254m0140m3513m5373m4932m3088m1128l9649l8353l6414l3413l0014
63378C392237k7112k4409k0867j6637j3131j0739q154m701j498J010M561J0206
63366C280766J5775J8904K1089K5366L0933L4113L4697L6860M2215M6103M3782
63355C630603L7380L3087L3218L4822L5337L5529L6145L5076L0031K2280J5845
63344C979353J3308J3468J2866R017K499l769p656j0287j4627k1531k8351l2177
63332C912113l3282l4041l5356l6078l5855l6434l9200m2905m5034m4400m1374
63321C488154l6874l2700l1683l5157m0620m4118m4804m5005m5855m5857m4305
63310C041176m2857m2148m0028l5725l2842l4598l8019l6953l0374k3794k2173
$$ plain form
63299 2661665 2636699 2608018 2577082 2546451 2519308 2497733 2480640 2464474 2446245 2425328 2402852
63288 2402852 2380494 2359764 2341547 2326324 2314932 2308101 2304683 2301735 2297450 2292614 2287850 2281262 2271191
63275 2271191 2260011 2252262 2249407 2249122 2249512 2251002 2253593 2255295 2254664 2252944 2252438 2254165 2257711 2261754 2264355
63260 2264355 2264766 2265611 2270991 2281413 2292843 2302042 2310431 2320959 2333633 2346751 2360689 2377269 2396204
63247 2396204 2415323 2434401 2456058 2482073 2510834 2539551 2567938 2598719 2634698 2675583 2717774
63236 2717774 2757790 2796017 2836097 2880296 2927069 2974256 3022694 3074352 3128024 3179694 3227183
63225 3227183 3272135 3317204 3363524 3411245 3460107 3508350 3553051 3593078 3630484 3667729 3704605
63214 3704605 3739071 3769975 3797266 3820134 3836837 3846788 3851712 3853888 3853423 3847853 3835078 3816946
$$ packed form
63299B661665k4966k8681l0936l0631k7143k1575j7093j6166j8229k0917k2476
63288B402852k2358k0730j8217j5223j1392o831l418k948m285m836m764o588j0071
63275B271191j1180p749k855k85L90J490K591J702o31j720n06J727L546M043K601
63260B264355M11Q45N380J0422J1430R199Q389J0528J2674J3118J3938J6580J8935
63247B396204J9119J9078K1657K6015K8761K8717K8387L0781L5979M0885M2191
63236B717774M0016L8227M0080M4199M6773M7187M8438N1658N3672N1670M7489
63225C227183M4952M5069M6320M7721M8862M8243M4701M0027L7406L7245L6876
63214C704605L4466L0904K7291K2868J6703R951M924K176m65n570j2775j8132
$$ plain form
63202 3816946 3799126 3786243 3777160 3766309 3749937 3729774 3710263 3693948 3680847 3670750 3663865 3659570
63190 3659570 3656599 3655034 3656652 3662524 3671132 3679601 3686330 3692082 3699030 3709108 3722674 3738224 3753806
63177 3753806 3769071 3785544 3804461 3824916 3844952 3864109 3883730 3904445 3924289 3940081 3950232
63166 3950232 3955426 3956789 3954272 3947078 3934885 3918054 3896980 3871972 3843763 3813526 3782004 3748802
63154 3748802 3712802 3673389 3631251 3588075 3545528 3504537 3465466 3428626 3394146 3361308 3328613
63143 3328613 3295017 3260914 3227436 3194978 3162934 3130738 3098506 3066569 3035212 3005284 2978336
63132 2978336 2955418 2936100 2919394 2905437 2895394 2889563 2886231 2882712 2877063 2868815 2858906 2849506 2843223
63119 2843223 2841389 2843073 2846392 2850731 2856844 2864634 2871936 2876529 2878935 2882097 2888037 2895632 2902317 2907400
$$ packed form
63202C816946j7820j2883r083j0851j6372k0163j9511j6315j3101j0097o885m295
63190C659570k971j565J618N872Q608Q469O729N752O948J0078J3566J5550J5582
63177C753806J5265J6473J8917K0455K0036J9157J9621K0715J9844J5792J0151
63166C950232N194J363k517p194j2193j6831k1074k5008k8209l0237l1522l3202
63154C748802l6000l9413m2138m3176m2547m0991l9071l6840l4480l2838l2695
63143C328613l3596l4103l3478l2458l2044l2196l2232l1937l1357k9928k6948
63132B978336k2918j9318j6706j3957j0043n831l332l519n649q248r909r400o283
63119B843223j834J684L319M339O113P790P302M593K406L162N940P595O685N083
$$ plain form
63105 2907400 2912863 2921015 2932254 2945294 2958515 2970304 2978981 2984059 2987610 2992783 3000297 3007713 3013096
63092 3013096 3018057 3025625 3036211 3047873 3059966 3073743 3088936 3102718 3113723 3124808 3139449 3156940
63080 3156940 3173855 3189504 3207024 3228933 3254196 3280463 3307030 3334326 3362128 3389890 3418097
63069 3418097 3448156 3481403 3518958 3561888 3610640 3664583 3722517 3783130 3844798 3906044 3967214
63058 3967214 4031187 4101512 4179855 4265550 4357031 4453098 4553178 4657071 4764510 4874878
63048 4874878 4987596 5102698 5220341 5339688 5458987 5576943 5693433 5809050 5924937
63039 5924937 6042612 6162000 6279251 6388659 6487981 6580306 6669560 6755853 6836458 6909043
63029 6909043 6971494 7020460 7053627 7073048 7083218 7085819 7079058 7062221 7037736 7007995 6973163 6933514
$$ packed form
63105B907400N463Q152J1239J3040J3221J1789Q677N078L551N173P514P416N383
63092C013096M961P568J0586J1662J2093J3777J5193J3782J1005J1085J4641J7491
63080C156940J6915J5649J7520K1909K5263K6267K6567K7296K7802K7762K8207
63069C418097L0059L3247L7555M2930M8752N3943N7934O0613O1668O1246O1170
63058C967214O3973P0325P8343Q5695R1481R6067J00080J03893J07439J10368
63048D874878J12718J15102J17643J19347J19299J17956J16490J15617J15887
63039E924937J17675J19388J17251J09408R9322R2325Q9254Q6293Q0605P2585
63029F909043O2451M8966L3167J9421J0170K601o761j6837k4485k9741l4832l9649
$$ plain form
63017 6933514 6891199 6847689 6801687 6752097 6701646 6655003 6613993 6576772 6541317 6507692 6477026
63006 6477026 6450190 6427720 6409596 6394838 6382536 6373269 6368188 6366901 6368047 6372152 6381736 6397507
62994 6397507 6416265 6434238 6451234 6469615 6490005 6510309 6528840 6545991 6561859 6574046 6579331
62983 6579331 6576531 6566325 6548913 6523325 6488846 6445821 6394994 6337136 6273593 6206169 6135980
62972 6135980 6062832 5985853 5904216 5817436 5725970 5631836 5537885 5446065 5356588 5268327 5179149
62961 5179149 5086580 4990157 4893398 4801351 4715074 4630185 4542294 4452479 4365691 4284704 4207539
62950 4207539 4130516 4052083 3973578 3897542 3825675 3757822 3692949 3631228 3574253 3522542 3474066
62939 3474066 3426546 3380161 3336515 3295835 3257103 3220284 3186371 3155306 3125745 3096926 3069228
$$ packed form
63017F933514m2315m3510m6002m9590n0451m6643m1010l7221l5455l3625l0666
63006F477026k6836k2470j8124j4758j2302r267n081j287J146M105R584J5771
62994F397507J8758J7973J6996J8381K0390K0304J8531J7151J5868J2187N285
62983F579331k800j0206j7412k5588l4479m3025n0827n7858o3543o7424p0189
62972F135980p3148p6979q1637q6780r1466r4134r3951r1820q9477q8261q9178
62961E179149r2569r6423r6759r2047q6277q4889q7891q9815q6788q0987p7165
62950D207539p7023p8433p8505p6036p1867o7853o4873o1721n6975n1711m8476
62939C474066m7520m6385m3646m0680l8732l6819l3913l1065k9561k8819k7698
$$ plain form
62928 3069228 3042975 3018194 2995219 2973757 2951672 2926838 2900222 2875134 2853476 2834809 2818820
62917 2818820 2805726 2793786 2779610 2762356 2744985 2729826 2715398 2699489 2682956 2668024 2654603
62906 2654603 2641020 2627316 2615174 2604984 2595132 2584217 2572444 2561054 2551597 2545291 2541771 2538796
62894 2538796 2534275 2528318 2522585 2518220 2515022 2511714 2506423 2498344 2489759 2484632 2483806 2483336 2479382 2472966
62880 2472966 2467627 2463975 2459522 2452945 2445479 2438523 2432798 2429813 2431044 2434992 2437577 2436339 2432360 2427606
62866 2427606 2422685 2417951 2414523 2412759 2411329 2409068 2406648 2405515 2406167 2408241 2411278 2414809 2418550 2422773
62852 2422773 2427507 2431475 2433403 2434436 2437178 2441648 2444112 2441060 2432943 2423162 2414994 2410502 2410701 2415014
62838 2415014 2421447 2428557 2436509 2445464 2454297 2462071 2469460 2477300 2484946 2491612 2498119 2505419 2512326 2516902
$$ packed form
62928C069228k6253k4781k2975k1462k2085k4834k6616k5088k1658j8667j5989
62917B818820j3094j1940j4176j7254j7371j5159j4428j5909j6533j4932j3421
62906B654603j3583j3704j2142j0190r852j0915j1773j1390r457o306l520k975
62894B538796m521n957n733m365l198l308n291q079q585n127q26m70l954o416
62880B472966n339l652m453o577p466o956n725k985J231L948K585j238l979m754
62866B427606m921m734l428j764j430k261k420j133O52K074L037L531L741M223
62852B422773M734L968J928J033K742M470K464l052q117r781q168m492J99M313
62838B415014O433P110P952Q955Q833P774P389P840P646O666O507P300O907M576
$$ plain form
62824 2516902 2519717 2523489 2529430 2536124 2542584 2550335 2561236 2574619 2588209 2601234 2615034 2630538
62812 2630538 2646709 2662550 2679755 2701559 2728522 2757081 2783746 2809784 2839786 2875782 2914836
62801 2914836 2952879 2988919 3024549 3061360 3100458 3143232 3190760 3243098 3300339 3363320 3431970
62790 3431970 3504298 3578936 3657693 3743339 3835705 3932509 4033630 4141554 4257245 4378482
62780 4378482 4503302 4632388 4766488 4903660 5040829 5176099 5307558 5431719 5546044
62771 5546044 5652070 5753195 5849457 5936686 6010569 6069053 6110885 6135068 6143240 6140122 6129491
62760 6129491 6110789 6081093 6039118 5986011 5923941 5855996 5785914 5714931 5639507 5555391 5464283
62749 5464283 5373188 5285967 5198564 5104775 5004239 4901765 4800457 4699380 4597929 4498736
$$ packed form
62824B516902K815L772N941O694O460P751J0901J3383J3590J3025J3800J5504
62812B630538J6171J5841J7205K1804K6963K8559K6665K6038L0002L5996L9054
62801B914836L8043L6040L5630L6811L9098M2774M7528N2338N7241O2981O8650
62790C431970P2328P4638P8757Q5646R2366R6804J01121J07924J15691J21237
62780D378482J24820J29086J34100J37172J37169J35270J31459J24161J14325
62771E546044J06026J01125R6262Q7229P3883N8484M1832K4183Q172l118j0631
62760F129491j8702k9696m1975n3107o2070o7945p0082p0983p5424q4116r1108
62749E464283r1095q7221q7403r3789j00536j02474j01308j01077j01451r9193
$$ plain form
62739 4498736 4404594 4314915 4227209 4140887 4057938 3980715 3910548 3847859 3791755 3739448 3687686
62728 3687686 3635651 3585857 3541885 3505819 3477938 3457639 3443580 3433662 3426440 3422659 3424153 3430893
62716 3430893 3440511 3451587 3465887 3485861 3511168 3539955 3572904 3613024 3661072 3714310 3771303
62705 3771303 3835100 3909151 3992020 4079034 4167905 4259897 4356326 4457075 4562125 4671098 4780840
62694 4780840 4886560 4986298 5081616 5173128 5258332 5335166 5404426 5466276 5517000 5552363 5572866
62683 5572866 5582782 5584592 5576755 5556661 5523612 5478933 5424914 5363944 5297669 5227014 5153234 5077706
62671 5077706 4999895 4917446 4830176 4742196 4657450 4574482 4488829 4399920 4311782 4226531 4140973
62660 4140973 4051379 3958707 3866959 3778629 3694277 3614943 3541915 3474272 3408987 3343943 3279610
$$ packed form
62739D498736r4142q9679q7706q6322q2949p7223p0167o2689n6104n2307n1762
62728C687686n2035m9794m3972l6066k7881k0299j4059r918p222l781J494O740
62716C430893R618J1076J4300J9974K5307K8787L2949M0120M8048N3238N6993
62705C771303O3797P4051Q2869Q7014Q8871R1992R6429J00749J05050J08973J09742
62694D780840J05720R9738R5318R1512Q5204P6834O9260O1850N0724L5363K0503
62683E572866R916J810p837k0094l3049m4679n4019o0970o6275p0655p3780p5528
62671E077706p7811q2449q7270q7980q4746q2968q5653q8909q8138q5251q5558
62660D140973q9594r2672r1748q8330q4352p9334p3028o7643o5285o5044o4333
$$ plain form
62649 3279610 3217599 3158850 3103484 3051359 3002274 2956301 2914281 2877310 2845269 2816363 2788744
62638 2788744 2762407 2738845 2718849 2701326 2684521 2667661 2650771 2633595 2615994 2599174 2584954
62627 2584954 2573498 2563391 2554733 2550401 2552454 2558390 2563077 2564071 2563330 2563898 2566961 2572385 2580058 2589536
62613 2589536 2599598 2609285 2618902 2629624 2642860 2660103 2682115 2707605 2733829 2759477 2786240 2816671
62601 2816671 2851072 2887430 2924260 2962784 3006185 3056836 3114074 3174622 3235308 3295162 3354670
62590 3354670 3413798 3471541 3526539 3576679 3618817 3651156 3676040 3698075 3718663 3734308 3741236
62579 3741236 3739620 3731966 3719545 3702575 3682337 3660401 3636361 3608585 3577006 3543218 3508023 3470827
62567 3470827 3431577 3391473 3351386 3310918 3269334 3226454 3182786 3139921 3100241 3064521 3030272
$$ packed form
62649C279610o2011n8749n5366n2125m9085m5973m2020l6971l2041k8906k7619
62638B788744k6337k3562j9996j7523j6805j6860j6890j7176j7601j6820j4220
62627B584954j1456j0107q658m332K053N936M687R94p41N68L063N424P673R478
62613B589536J0062R687R617J0722J3236J7243K2012K5490K6224K5648K6763L0431
62601B816671L4401L6358L6830L8524M3401N0651N7238O0548O0686N9854N9508
62590C354670N9128N7743N4998N0140M2138L2339K4884K2035K0588J5645O928
62579C741236j616p654j2421j6970k0238k1936k4040k7776l1579l3788l5195l7196
62567C470827l9250m0104m0087m0468m1584m2880m3668m2865l9680l5720l4249
$$ plain form
62556 3030272 2994602 2958525 2925675 2896272 2865482 2829523 2791034 2756155 2728069 2705750 2687535
62545 2687535 2672750 2660268 2648583 2637960 2630187 2625358 2620914 2615071 2609637 2607950 2610961 2616594 2622342
62532 2622342 2627380 2632749 2640698 2653543 2671877 2693717 2716273 2738760 2762812 2790216 2821319 2856091
62520 2856091 2895652 2941522 2993491 3049254 3106453 3164483 3223804 3284098 3344144 3403616 3463867
62509 3463867 3525960 3588313 3647459 3701234 3750190 3795483 3836635 3872465 3903456 3931520 3957244
62498 3957244 3978812 3994406 4004858 4013064 4021268 4029880 4038802 4048846 4061172 4075730 4091063 4105915
62486 4105915 4120566 4136036 4152227 4167825 4182420 4197898 4216818 4239623 4263920 4285907 4301809
62475 4301809 4308952 4307335 4300339 4292319 4284780 4275661 4262331 4243775 4219777 4190057 4155363 4117738
$$ packed form
62556C030272l5670l6077l2850k9403l0790l5959l8489l4879k8086k2319j8215
62545B687535j4785j2482j1685j0623p773m829m444n843n434j687L011N633N748
62532B622342N038N369P949J2845J8334K1840K2556K2487K4052K7404L1103L4772
62520B856091L9561M5870N1969N5763N7199N8030N9321O0294O0046N9472O0251
62509C463867O2093O2353N9146N3775M8956M5293M1152L5830L0991K8064K5724
62498C957244K1568J5594J0452Q206Q204Q612Q922J0044J2326J4558J5333J4852
62486D105915J4651J5470J6191J5598J4595J5478J8920K2805K4297K1987J5902
62475D301809P143j617o996q020p539r119j3330j8556k3998k9720l4694l7625
$$ plain form
62463 4117738 4078253 4035661 3988514 3937274 3883022 3825899 3766862 3709238 3655470 3603177 3547724
62452 3547724 3488608 3430151 3375626 3324072 3273807 3225494 3179735 3134733 3089253 3045918 3008456
62441 3008456 2976750 2947168 2916986 2886034 2854861 2824273 2796634 2774622 2757742 2742073 2724273
62430 2724273 2704212 2683226 2661865 2640558 2620664 2603090 2586715 2569674 2551771 2534397 2518420
62419 2518420 2503350 2488586 2474290 2460568 2446541 2431192 2415298 2401880 2393787 2390605 2388651 2384538
62407 2384538 2377977 2370282 2361279 2349818 2337236 2327747 2324055 2324260 2324736 2324789 2326370 2329961 2333499 2335906
62393 2335906 2339333 2346232 2355352 2362406 2364500 2362782 2360832 2361643 2366396 2374971 2386592 2400104 2414387
62380 2414387 2428896 2443769 2459465 2476435 2495216 2516661 2541798 2571137 2604016 2638885 2674521
$$ packed form
62463D117738l9485m2592m7147n1240n4252n7123n9037n7624n3768n2293n5453
62452C547724n9116n8457n4525n1554n0265m8313m5759m5002m5480m3335l7462
62441C008456l1706k9582l0182l0952l1173l0588k7639k2012j6880j5669j7800
62430B724273k0061k0986k1361k1307j9894j7574j6375j7041j7903j7374j5977
62419B518420j5070j4764j4296j3722j4027j5349j5894j3418q093l182j954m113
62407B384538o561p695r003j1461j2582r489l692K05M76N3J581L591L538K407
62393B335906L427O899R120P054K094j718j950Q11M753Q575J1621J3512J4283
62380B414387J4509J4873J5696J6970J8781K1445K5137K9339L2879L4869L5636
$$ plain form
62369 2674521 2710986 2749357 2790764 2836121 2886343 2941841 3001457 3062939 3125312 3190241 3259927
62358 3259927 3333959 3409425 3484136 3558348 3632931 3707417 3781004 3854128 3926931 3996476 4057739
62347 4057739 4108271 4150509 4188308 4222134 4248936 4266182 4274459 4276026 4272267 4263339 4249408 4231169
62335 4231169 4209306 4184153 4155871 4124553 4090255 4053332 4014586 3974477 3932212 3886408 3837173
62324 3837173 3787022 3738884 3693013 3646203 3594494 3536790 3475867 3415866 3359059 3305341 3254461
62313 3254461 3207549 3165533 3126785 3087800 3046476 3003814 2962197 2923200 2887607 2856199 2829183
62302 2829183 2805309 2782716 2760632 2739715 2721113 2705837 2694388 2686094 2679171 2672300 2665710 2659894
62290 2659894 2654071 2647247 2640178 2634690 2631427 2630098 2631794 2638804 2651381 2666352 2680056 2691696 2703256
$$ packed form
62369B674521L6465L8371M1407M5357N0222N5498N9616O1482O2373O4929O9686
62358C259927P4032P5466P4711P4212P4583P4486P3587P3124P2803O9545O1263
62347D057739N0532M2238L7799L3826K6802J7246Q277J567l759q928j3931j8239
62335D231169k1863k5153k8282l1318l4298l6923l8746m0109m2265m5804m9235
62324C837173n0151m8138m5871m6810n1709n7704o0923o0001n6807n3718n0880
62313C254461m6912m2016l8748l8985m1324m2662m1617l8997l5593l1408k7016
62302B829183k3874k2593k2084k0917j8602j5276j1449q294o923o871o590n816
62290B659894n823o824p069n488l263j329J696P010J2577J4971J3704J1640J1560
$$ plain form
62277 2703256 2717243 2734870 2755162 2775366 2793619 2811644 2833228 2859622 2888526 2918525 2952071
62266 2952071 2992335 3039201 3090605 3145943 3205186 3265997 3325375 3384315 3447727 3518802 3595633
62255 3595633 3674220 3752717 3831428 3910135 3987070 4060149 4128336 4191617 4249567 4299897 4339359
62244 4339359 4366901 4384935 4396048 4399620 4393837 4380200 4362818 4342895 4317059 4282530 4241390 4197927
62232 4197927 4153885 4108463 4061250 4012560 3961743 3907805 3851749 3796255 3742650 3689721 3635913
62221 3635913 3581393 3527326 3474069 3420945 3367614 3315250 3266126 3221783 3181522 3143109 3105261
62210 3105261 3069054 3036590 3008758 2984704 2963027 2942957 2924722 2909302 2897759 2890611 2888005 2890326
62198 2890326 2897852 2909713 2924108 2939881 2956992 2974951 2991855 3005824 3016844 3026596 3037060 3049579
$$ packed form
62277B703256J3987J7627K0292K0204J8253J8025K1584K6394K8904K9999L3546
62266B952071M0264M6866N1404N5338N9243O0811N9378N8940O3412P1075P6831
62255C595633P8587P8497P8711P8707P6935P3079O8187O3281N7950N0330L9462
62244D339359K7542J8034J1113L572n783j3637j7382j9923k5836l4529m1140m3463
62232D197927m4042m5422m7213m8690n0817n3938n6056n5494n3605n2929n3808
62221C635913n4520n4067n3257n3124n3331n2364m9124m4343m0261l8413l7848
62210C105261l6207l2464k7832k4054k1677k0070j8235j5420j1543p148k606K321
62198B890326P526J1861J4395J5773J7111J7959J6904J3969J1020R752J0464J2519
$$ plain form
62186 3049579 3064261 3079682 3094170 3107931 3122784 3139367 3156481 3174168 3194981 3219951 3245503
62175 3245503 3267884 3289773 3318506 3357184 3401010 3443700 3484435 3526470 3571433 3617916 3664603
62164 3664603 3712119 3761671 3813352 3865487 3914478 3955957 3988055 4013789 4038678 4065128 4089912
62153 4089912 4107725 4116693 4119825 4121230 4121620 4117972 4107439 4090660 4070548 4048711 4024763 3999160
62141 3999160 3974497 3952613 3931799 3908782 3882841 3856163 3830324 3804383 3776929 3748426 3720663
62130 3720663 3694940 3671609 3650483 3630730 3611117 3591416 3573176 3558088 3545919 3535090 3525072
62119 3525072 3516892 3511107 3506675 3502608 3499563 3498405 3497729 3494427 3487130 3478045 3470768 3466803 3464686 3461975
62105 3461975 3457611 3452662 3449264 3448590 3449653 3450644 3451682 3455257 3462939 3472363 3478992 3481018 3481348 3484395 3491758
$$ packed form
62186C049579J4682J5421J4488J3761J4853J6583J7114J7687K0813K4970K5552
62175C245503K2381K1889K8733L8678M3826M2690M0735M2035M4963M6483M6687
62164C664603M7516M9552N1681N2135M8991M1479L2098K5734K4889K6450K4784
62153D089912J7813Q968L132J405L90l648j0533j6779k0112k1837k3948k5603
62141C999160k4663k1884k0814k3017k5941k6678k5839k5941k7454k8503k7763
62130C720663k5723k3331k1126j9753j9613j9701j8240j5088j2169j0829j0018
62119C525072q180n785m432m067l045j158o76l302p297r085p277l965k117k711
62105C461975m364m949l398o74J063R91J038L575P682R424O629K026L30L047P363
$$ plain form
62090 3491758 3501365 3509983 3516164 3521479 3529443 3542655 3560641 3580952 3602259 3625271 3650394 3676268
62078 3676268 3701879 3728842 3759787 3795059 3832976 3873109 3917101 3965465 4015492 4063904 4110635
62067 4110635 4158411 4208879 4260778 4312235 4363389 4415363 4467090 4514738 4555078 4588571 4617907
62056 4617907 4643821 4663945 4676316 4682458 4685506 4686055 4681643 4670135 4651815 4627767 4598007 4562416
62044 4562416 4522185 4478629 4431063 4377567 4318101 4255606 4193422 4132545 4072102 4011709 3952060
62033 3952060 3893207 3833533 3771343 3707045 3642823 3580198 3518781 3457732 3397582 3339926 3285833
62022 3285833 3235272 3187709 3142416 3098469 3055360 3013517 2973266 2933391 2892105 2849855 2809957
62011 2809957 2775509 2746393 2720141 2695201 2672366 2653270 2638295 2626108 2614819 2603522 2592806
$$ packed form
62090C491758R607Q618O181N315P964J3212J7986K0311K1307K3012K5123K5874
62078C676268K5611K6963L0945L5272L7917M0133M3992M8364N0027M8412M6731
62067D110635M7776N0468N1899N1457N1154N1974N1727M7648M0340L3493K9336
62056D617907K5914K0124J2371O142L048N49m412j1508j8320k4048k9760l5591
62044D562416m0231m3556m7566n3496n9466o2495o2184o0877o0443o0393n9649
62033C952060n8853n9674o2190o4298o4222o2625o1417o1049o0150n7656n4093
62022C285833n0561m7563m5293m3947m3109m1843m0251l9875m1286m2250l9898
62011B809957l4448k9116k6252k4940k2835j9096j4975j2187j1289j1297j0716
$$ plain form
62000 2592806 2583513 2575047 2565578 2554157 2541784 2529775 2517803 2504471 2489349 2473653 2459211 2447432
61988 2447432 2438727 2431827 2423991 2413155 2400128 2387827 2378165 2370355 2362321 2352946 2342761 2333200 2325472
61975 2325472 2319585 2314234 2308160 2301726 2296488 2293058 2290133 2286040 2280604 2274873 2269444 2263869 2257708 2251560
61961 2251560 2246589 2243324 2241492 2241051 2242574 2245948 2249536 2252003 2254769 2260876 2271093 2283040 2294995
61948 2294995 2308390 2324737 2341984 2356736 2369202 2383136 2401125 2422449 2445558 2469857 2494656
61937 2494656 2519062 2543722 2570191 2597749 2623550 2647089 2671569 2698913 2726133 2749354 2769219
61926 2769219 2789074 2809185 2826279 2838575 2848273 2858701 2871228 2885295 2899577 2912915 2925660
61915 2925660 2939917 2956604 2972682 2983803 2990022 2996424 3007188 3021245 3034942 3046845 3057960 3068425
$$ packed form
62000B592806r293q466r469j1421j2373j2009j1972j3332j5122j5696j4442j1779
61988B447432q705o900p836j0836j3027j2301r662p810q034r375j0185r561p728
61975B325472n887n351o074o434n238l430k925m093n436n731n429n575o161o148
61961B251560m971l265j832m41J523L374L588K467K766O107J0217J1947J1955
61948B294995J3395J6347J7247J4752J2466J3934J7989K1324K3109K4299K4799
61937B494656K4406K4660K6469K7558K5801K3539K4480K7344K7220K3221J9865
61926B769219J9855K0111J7094J2296R698J0428J2527J4067J4282J3338J2745
61915B925660J4257J6687J6078J1121O219O402J0764J4057J3697J1903J1115J0465
$$ plain form
61903 3068425 3076229 3079327 3077894 3074330 3071468 3070481 3069940 3066914 3059238 3046878 3031491 3015182 2999366
61890 2999366 2984036 2968116 2950960 2933067 2914602 2894193 2870979 2847527 2828448 2815407 2805242
61879 2805242 2793860 2780185 2764974 2747690 2727149 2704687 2683964 2666781 2650943 2633756 2616584
61868 2616584 2603993 2598200 2596114 2593065 2588367 2585356 2586436 2590548 2596432 2605916 2621767 2643521 2667939
61855 2667939 2693306 2721106 2753338 2790060 2829735 2870253 2909472 2946689 2983973 3023927 3065428
61844 3065428 3103668 3135525 3162990 3189845 3216766 3241703 3263798 3284493 3304903 3324081 3340407
61833 3340407 3353706 3365577 3378012 3391737 3405870 3419552 3433695 3449882 3467266 3482121 3491662
61822 3491662 3497228 3502203 3507305 3509236 3503877 3489908 3469544 3446533 3423261 3399147 3371862 3340330
$$ packed form
61903C068425P804L098j433l564k862r87n41l026p676j2360j5387j6309j5816
61890B999366j5330j5920j7156j7893j8465k0409k3214k3452j9079j3041j0165
61879B805242j1382j3675j5211j7284k0541k2462k0723j7183j5838j7187j7172
61868B616584j2591n793k086l049m698l011J080M112N884R484J5851K1754K4418
61855B667939K5367K7800L2232L6722L9675M0518L9219L7217L7284L9954M1501
61844C065428L8240L1857K7465K6855K6921K4937K2095K0695K0410J9178J6326
61833C340407J3299J1871J2435J3725J4133J3682J4143J6187J7384J4855R541
61822C491662N566M975N102J931n359j3969k0364k3011k3272k4114k7285l1532
$$ plain form
61810 3340330 3306089 3271619 3238208 3205767 3173513 3140035 3103816 3064935 3025588 2987974 2952323
61799 2952323 2917844 2884615 2853105 2822428 2790575 2756525 2721303 2687055 2655510 2626788 2599140
61788 2599140 2570552 2541206 2513407 2488424 2464751 2440604 2416655 2394520 2373738 2352575 2331299
61777 2331299 2312346 2297141 2284600 2273004 2261775 2251293 2242485 2236586 2233590 2230816 2224912 2215771
61765 2215771 2206804 2200722 2196834 2193432 2191032 2191475 2194618 2197671 2198016 2195665 2192716 2190919 2190241 2189697 2188940
61750 2188940 2188241 2187009 2183634 2177808 2172142 2170162 2172866 2178133 2182997 2185396 2184278 2179907 2174385 2170517
61736 2170517 2169582 2170805 2172872 2174970 2176372 2176222 2174063 2170046 2164929 2160573 2159477 2162105 2165186 2164830 2161557
61721 2161557 2160214 2164338 2172345 2179904 2184177 2184598 2181224 2174261 2164941 2155683 2149109 2146729 2147925 2150240
$$ packed form
61810C340330l4241l4470l3411l2441l2254l3478l6219l8881l9347l7614l5651
61799B952323l4479l3229l1510l0677l1853l4050l5222l4248l1545k8722k7648
61788B599140k8588k9346k7799k4983k3673k4147k3949k2135k0782k1163k1276
61777B331299j8953j5205j2541j1596j1229j0482q808n899k996k774n904r141
61765B215771q967o082l888l402k400M43L143L053L45k351k949j797o78n44p57
61750B188940o99j232l375n826n666j980K704N267M864K399j118m371n522l868
61736B170517r35J223K067K098J402j50k159m017n117m356j096K628L081l56l273
61721B161557j343M124Q007P559M273M21l374o963r320r258o574k380J196K315
$$ plain form
61707 2150240 2151532 2151850 2152456 2153432 2153593 2152213 2149033 2142926 2133184 2122405 2115175 2112483 2109739 2102012 2089469
61692 2089469 2076125 2065077 2056844 2050649 2045022 2038190 2029975 2022665 2018292 2016000 2013765 2011478 2010116
61679 2010116 2009008 2006750 2004435 2004919 2008476 2011677 2011401 2007782 2002277 1995068 1986002 1976571 1969005 1964039
61665 1964039 1961091 1960275 1962551 1967568 1972653 1974865 1973657 1970771 1967737 1964456 1960587 1957226 1955922 1956374
61651 1956374 1956490 1954911 1952221 1949456 1946963 1945461 1946482 1950118 1953453 1953139 1949217 1944776 1942008 1940227
61637 1940227 1937942 1935347 1934029 1935188 1938826 1944006 1949137 1952236 1951648 1947004 1939555 1931227 1923005 1914395
61623 1914395 1904911 1895599 1888142 1882815 1878650 1875420 1873584 1872142 1868903 1863811 1859431 1856505 1851553 1841501
61609 1841501 1828607 1817473 1808626 1798812 1787031 1775932 1766648 1756327 1742683 1727945 1716117 1708455
$$ packed form
61707B150240J292L18O06R76J61j380l180o107r742j0779p230k692k744p727j2543
61692B089469j3344j1048q233o195n627o832q215p310m373k292k235k287j362
61679B010116j108k258k315M84L557L201k76l619n505p209r066r431p566m966
61665A964039k948q16K276N017N085K212j208k886l034l281l869l361j304M52
61651A956374J16j579k690k765k493j502J021L636L335l14l922m441k768j781
61637A940227k285k595j318J159L638N180N131L099n88m644p449q328q222q610
61623A914395r484r312p457n327m165l230j836j442l239n092m380k926m952j0052
61609A841501j2894j1134q847r814j1781j1099r284j0321j3644j4738j1828p662
$$ plain form
61597 1708455 1703546 1699770 1695470 1688435 1677942 1666618 1658074 1652879 1648403 1642143 1633666 1623834 1614098
61584 1614098 1606687 1603641 1604675 1606696 1605946 1600523 1591140 1580289 1570815 1564499 1561197 1558979 1555146 1547883
61570 1547883 1537922 1528570 1522956 1520848 1519186 1516063 1512794 1511232 1510404 1507312 1500247 1490097 1479282 1471004
61556 1471004 1468463 1472363 1479073 1483592 1484974 1486789 1491321 1495580 1495077 1490232 1486503 1488260 1494640 1501763
61542 1501763 1506995 1509809 1509992 1507162 1502133 1497323 1495152 1496418 1500238 1504842 1508318 1509548 1509030 1508292 1507982
61527 1507982 1507129 1504777 1501589 1498951 1497115 1495419 1493965 1493618 1494285 1494656 1494140 1493765 1494418 1495313 1495230 1494531 1494840
61510 1494840 1497119 1500902 1505008 1508145 1509139 1507558 1504155 1500031 1495516 1490564 1485965 1483094 1482243 1482069 1481206
61495 1481206 1479965 1479989 1482355 1486203 1489140 1489064 1485960 1482086 1480375 1482547 1488415 1496260 1503580 1508349 1510497
$$ packed form
61597A708455m909l776m300p035j0493j1324q544n195m476o260q477r832r736
61584A614098p411l046J034K021p50n423r383j0851r474o316l302k218l833p263
61570A547883r961r352n614k108j662l123l269j562q28l092p065j0150j0815q278
61556A471004k541L900O710M519J382J815M532M259n03m845l729J757O380P123
61542A501763N232K814J83k830n029m810k171J266L820M604L476J230n18p38l10
61527A507982q53k352l188k638j836j696j454l47O67L71n16l75O53Q95q3o99L09
61510A494840K279L783M106L137R94j581l403m124m515m952m599k871q51j74q63
61495A481206j241K4K366L848K937p6l104l874j711K172N868P845P320M769K148
$$ plain form
61480 1510497 1511887 1514024 1515974 1515504 1512193 1508376 1506740 1507846 1510313 1512556 1513811 1514235 1514737 1516335 1519257
61465 1519257 1522949 1527105 1531853 1536559 1539532 1539953 1539456 1540616 1544157 1548592 1552150 1553815 1552873 1549382 1545544
61450 1545544 1544944 1549211 1556271 1562759 1567309 1570582 1573083 1574602 1575565 1577355 1580843 1585524 1590452 1595207
61436 1595207 1599485 1602480 1603488 1603095 1603321 1606282 1612375 1619615 1625073 1627488 1628524 1631260 1637502 1646498
61422 1646498 1655694 1662450 1665873 1667818 1671464 1677865 1684511 1688533 1690732 1694606 1701515 1708886 1713733 1715972
61408 1715972 1717224 1718163 1718570 1718775 1719565 1721453 1725149 1731649 1740457 1748747 1753863 1755804 1755820 1753745 1748965
61393 1748965 1743218 1739666 1738961 1738657 1737217 1736540 1739600 1747113 1757431 1768353 1778120 1785754 1791396 1795721
61379 1795721 1798704 1799948 1800267 1801528 1804501 1808228 1811829 1815341 1818422 1820341 1822088 1826283 1833534 1840875
$$ packed form
61480A510497J390K137J950m70l311l817j636J106K467K243J255M24N02J598K922
61465A519257L692M156M748M706K973M21m97J160L541M435L558J665r42l491l838
61450A545544o00M267P060O488M550L273K501J519R63J790L488M681M928M755
61436A595207M278K995J008l93K26K961O093P240N458K415J036K736O242Q996
61422A646498R196O756L423J945L646O401O646M022K199L874O909P371M847K239
61408A715972J252R39M07K05P90J888L696O500Q808Q290N116J941J6k075m780
61393A748965n747l552p05l04j440o77L060P513J0318J0922R767P634N642M325
61379A795721K983J244L19J261K973L727L601L512L081J919J747M195P251P341
$$ plain form
61365 1840875 1845628 1848944 1853443 1859133 1864305 1869008 1874454 1879905 1883675 1887221 1894608 1906970 1920568
61352 1920568 1931789 1941339 1951761 1963188 1974004 1984115 1995056 2007616 2021374 2036041 2051331
61341 2051331 2065940 2078625 2090256 2102880 2116417 2127959 2135111 2139008 2143356 2151102 2162335 2174673
61329 2174673 2185359 2193513 2200571 2208183 2215989 2222376 2227157 2232089 2238487 2245790 2253123 2260824 2269273 2277434
61315 2277434 2284213 2290663 2299197 2310657 2323632 2336751 2350274 2364980 2380720 2396934 2413792 2431811
61303 2431811 2450479 2467832 2481619 2491135 2498125 2505478 2514257 2522279 2526576 2527169 2527224 2529301 2532859 2535979
61289 2535979 2537999 2539440 2540564 2541457 2542594 2543835 2543559 2540348 2535119 2530124 2526371 2523661 2522649 2524420
61275 2524420 2527804 2529546 2528274 2526517 2527553 2531684 2536935 2541985 2546656 2550386 2552287 2552754 2553705 2557046
$$ packed form
61365A840875M753L316M499N690N172M703N446N451L770L546P387J2362J3598
61352A920568J1221R550J0422J1427J0816J0111J0941J2560J3758J4667J5290
61341B051331J4609J2685J1631J2624J3537J1542P152L897M348P746J1233J2338
61329B174673J0686Q154P058P612P806O387M781M932O398P303P333P701Q449Q161
61315B277434O779O450Q534J1460J2975J3119J3523J4706J5740J6214J6858J8019
61303B431811J8668J7353J3787R516O990P353Q779Q022M297N93N5K077L558L120
61289B535979K020J441J124Q93J137J241k76l211n229m995l753k710j012J771
61275B524420L384J742j272j757J036M131N251N050M671L730J901M67R51L341
$$ plain form
61261 2557046 2563631 2573399 2585476 2598275 2610536 2622472 2635284 2649528 2664461 2678809 2691653 2702992
61249 2702992 2714085 2726670 2740859 2754206 2763956 2769965 2774234 2777898 2780171 2780375 2779469 2779104 2780436 2784338
61235 2784338 2791332 2800411 2809053 2815582 2820901 2827182 2835597 2846051 2858114 2870972 2883115 2893340 2901892
61222 2901892 2909911 2918386 2928436 2941497 2957504 2973511 2986205 2995870 3006068 3019139 3033842 3047901
61210 3047901 3060924 3073775 3086799 3099990 3113492 3126468 3136800 3143783 3150294 3160379 3175101 3192406
61198 3192406 3210463 3228998 3247497 3264703 3280826 3298302 3318911 3341211 3362123 3380540 3398347
61187 3398347 3418015 3439717 3460784 3477975 3490440 3500085 3508665 3515587 3519872 3523130 3528012 3533821 3536615
61174 3536615 3534725 3531575 3531412 3534233 3536664 3535862 3530640 3520820 3508158 3496408 3487383 3477822 3463169 3443983
$$ packed form
61261B557046O585R768J2077J2799J2261J1936J2812J4244J4933J4348J2844J1339
61249B702992J1093J2585J4189J3347R750O009M269L664K273K04r06l65J332L902
61235B784338O994R079Q642O529N319O281Q415J0454J2063J2858J2143J0225Q552
61222B901892Q019Q475J0050J3061J6007J6007J2694R665J0198J3071J4703J4059
61210C047901J3023J2851J3024J3191J3502J2976J0332O983O511J0085J4722J7305
61198C192406J8057J8535J8499J7206J6123J7476K0609K2300K0912J8417J7807
61187C398347J9668K1702K1067J7191J2465R645Q580O922M285L258M882N809K794
61174C536615j890l150j63K821K431q02n222r820j2662j1750r025r561j4653j9186
$$ plain form
61160 3443983 3425481 3410904 3398734 3386923 3376214 3367596 3359412 3349422 3338108 3327917 3320358 3315441
61148 3315441 3312694 3310836 3307149 3299190 3287365 3274864 3264917 3258459 3254126 3250128 3246387 3244761 3246567
61135 3246567 3250358 3253665 3256879 3263436 3275552 3291841 3310158 3330607 3353903 3378583 3402397 3425665
61123 3425665 3450895 3479298 3509800 3541657 3576122 3614796 3657370 3701525 3744617 3785630 3826118
61112 3826118 3868985 3915551 3964101 4012005 4058710 4105645 4153665 4201806 4248374 4292186 4332909
61101 4332909 4371232 4408408 4444545 4477637 4505630 4529222 4551099 4572173 4590220 4602906 4610935
61090 4610935 4617129 4623084 4627708 4628902 4626088 4621041 4616530 4614198 4613755 4613932 4613548 4611373 4605976 4597105 4587276
61075 4587276 4580863 4580925 4587016 4596080 4605114 4613082 4621063 4631241 4645623 4665099 4688936 4714961 4741141
$$ packed form
61160C443983j8502j4577j2170j1811j0709q618q184r990j1314j0191p559m917
61148C315441k747j858l687p959j1825j2501r947o458m333l998l741j626J806
61135C246567L791L307L214O557J2116J6289J8317K0449K3296K4680K3814K3268
61123C425665K5230K8403L0502L1857L4465L8674M2574M4155M3092M1013M0488
61112C826118M2867M6566M8550M7904M6705M6935M8020M8141M6568M3812M0723
61101D332909L8323L7176L6137L3092K7993K3592K1877K1074J8047J2686Q029
61090D610935O194N955M624J194k814n047m511k332m43J77l84k175n397q871r829
61075D587276o413O2O091R064R034P968P981J0178J4382J9476K3837K6025K6180
$$ plain form
61062 4741141 4767946 4798710 4836246 4879143 4922926 4965116 5007435 5052554 5100906 5152116 5207486
61051 5207486 5268777 5335755 5407310 5484254 5568621 5660396 5756981 5855860 5956254 6058697 6164962
61040 6164962 6277947 6399299 6527233 6659130 6796301 6943455 7102796 7271228 7444460
61031 7444460 7621542 7804069 7993352 8190541 8398075 8618988 8855336 9108512 9380141
61022 9380141 9671719 9984727 10322611 10691515 11097476 11543665 12031811 12565321 13149297
61013 13149297 13788317 14486556 15250273 16088554 17011186 18026739 19142492 20364552 21697373
61004 21697373 23143509 24702926 26370263 28131357 29961802 31826204 33674762 35441345
60996 35441345 37054553 38463940 39663356 40688765 41590923 42407923 43157229 43839015 44432064
$$ packed form
61062D741141K6805L0764L7536M2897M3783M2190M2319M5119M8352N1210N5370
61051E207486O1291O6978P1555P6944Q4367R1775R6585R8879J00394J02443J06265
61040F164962J12985J21352J27934J31897J37171J47154J59341J68432J73232
61031G444460J77082J82527J89283J97189K07534K20913K36348K53176K71629
61022I380141K91578L13008L37884L68904M05961M46189M88146N33510N83976
61013A3149297O39020O98239P63717Q38281R22632J015553J115753J222060J332821
61004B1697373J446136J559417J667337J761094J830445J864402J848558J766583
60996C5441345J613208J409387J199416J025409R02158Q17000P49306O81786N93049
$$ plain form
60987 44432064 44884824 45124107 45088823 44763903 44184853 43413316 42509153 41517715 40469892
60978 40469892 39385527 38276767 37150880 36011270 34857967 33690736 32512926 31330579
60970 31330579 30147817 28965682 27785837 26612245 25448156 24294755 23154632 22033817
60962 22033817 20938367 19871777 18838273 17845879 16902740 16012095 15174038 14390481 13664399
60953 13664399 12994906 12377065 11806985 11284210 10808980 10380095 9995605 9652309 9343760
60944 9343760 9061937 8802365 8565075 8349157 8149081 7958722 7777072 7607160 7449984
60935 7449984 7301986 7158675 7018941 6885041 6759175 6640779 6527144 6416382 6309204
60926 6309204 6207164 6109514 6013064 5915646 5818825 5726554 5641701 5564391 5492839 5424743 5358100
$$ packed form
60987D4432064M52760K39283l5284l24920n79050p71537r04163r91438j047823
60978D0469892j084365j108760j125887j139610j153303j167231j177810j182347
60970C1330579j182762j182135j179845j173592j164089j153401j140123j120815
60962B2033817j095450j066590j033504r92394r43139q90645q38057p83557p26082
60953A3664399o69493o17841n70080n22775m75230m28885l84490l43296l08549
60944I343760k81823k59572k37290k15918k00076j90359j81650j69912j57176
60935G449984j47998j43311j39734j33900j25866j18396j13635j10762j07178
60926F309204j02040r7650r6450r7418r6821r2271q4853p7310p1552o8096o6643
$$ plain form
60915 5358100 5291886 5226705 5164565 5107473 5055783 5007866 4961682 4916803 4874561 4836131 4801094
60904 4801094 4768364 4737916 4710751 4687438 4667632 4650991 4637721 4627824 4620191 4612801 4603969 4593682
60892 4593682 4583684 4575777 4569949 4564808 4559756 4555527 4552328 4549216 4546208 4545048 4545941 4545069 4537943 4524615
60878 4524615 4509080 4493870 4477836 4459218 4437883 4413729 4385760 4354455 4322960 4293943 4266470
60867 4266470 4237475 4205331 4170707 4135057 4099513 4064192 4027230 3985636 3938707 3889724 3842579
60856 3842579 3797382 3751230 3702875 3654621 3609300 3566995 3525366 3482138 3436732 3390254 3344495
60845 3344495 3300616 3258527 3217632 3177964 3140232 3104980 3072113 3040802 3009478 2976566 2942251
60834 2942251 2909031 2879275 2852191 2824326 2793420 2760938 2730378 2703702 2679857 2656382 2631983
$$ packed form
60915E358100o6214o5181o2140n7092n1690m7917m6184m4879m2242l8430l5037
60904D801094l2730l0448k7165k3313j9806j6641j3270r897p633p390q832j0287
60892D593682r998p907n828n141n052m229l199l112l008j160Q93q72p126j3328
60878D524615j5535j5210j6034j8618k1335k4154k7969l1305l1495k9017k7473
60867D266470k8995l2144l4624l5650l5544l5321l6962m1594m6929m8983m7145
60856C842579m5197m6152m8355m8254m5321m2305m1629m3228m5406m6478m5759
60845C344495m3879m2089m0895l9668l7732l5252l2867l1311l1324l2912l4315
60834B942251l3220k9756k7084k7865l0906l2482l0560k6676k3845k3475k4399
$$ plain form
60823 2631983 2607484 2584359 2562594 2540655 2517899 2496118 2477627 2462256 2447553 2431868 2415793
60812 2415793 2400315 2385253 2370545 2357610 2347647 2339085 2328708 2315742 2303393 2295393 2291835 2289411
60800 2289411 2285310 2279703 2274307 2269684 2264762 2258434 2250538 2241272 2230763 2219841 2210273 2202895 2195751
60787 2195751 2185677 2172448 2160134 2152948 2150273 2147229 2140020 2129175 2117259 2105397 2093368 2081670
60775 2081670 2071388 2062431 2053782 2045506 2038754 2033495 2028050 2021542 2015098 2009685 2004449 1998665 1993724 1990960
60761 1990960 1988361 1981987 1970906 1958694 1949455 1943925 1940153 1936485 1932680 1928930 1924984 1920137 1913696
60748 1913696 1905857 1898383 1893765 1893095 1894996 1896915 1897093 1895283 1892382 1889936 1889426 1891213 1894024 1895676 1894384
60733 1894384 1889688 1882721 1875626 1870049 1865727 1860623 1852564 1840873 1826983 1813967 1804906 1800573 1798570
$$ packed form
60823B631983k4499k3125k1765k1939k2756k1781j8491j5371j4703j5685j6075
60812B415793j5478j5062j4708j2935r963q562j0377j2966j2349q000l558k424
60800B289411m101n607n396m623m922o328p896r266j0509j0922r568p378p144
60787B195751j0074j3229j2314p186k675l044p209j0845j1916j1862j2029j1698
60775B081670j0282q957q649q276o752n259n445o508o444n413n236n784m941k764
60761A990960k599o374j1081j2212r239n530l772l668l805l750l946m847o441
60748A913696p839p474m618o70J901J919J78j810k901k446n10J787K811J652j292
60733A894384m696o967p095n577m322n104q059j1691j3890j3016r061m333k003
$$ plain form
60720 1798570 1795302 1788789 1779306 1768210 1757373 1748990 1743955 1740381 1735500 1729258 1724061 1720562 1716047
60707 1716047 1708358 1699430 1692966 1689729 1687142 1682992 1677755 1673345 1670885 1669873 1668875 1667050 1665140 1664239
60693 1664239 1663453 1660322 1654435 1648977 1647103 1648036 1648745 1648671 1650626 1657082 1667228 1677738 1685167 1687967 1687665
60678 1687665 1688051 1692052 1699541 1708860 1719108 1729254 1736473 1738422 1737019 1737133 1741131 1747063 1752443 1756997
60664 1756997 1760783 1762506 1761501 1759594 1759353 1761869 1767191 1775015 1783505 1789304 1790657 1789391 1788401 1788555 1789364
60649 1789364 1790815 1792405 1792009 1788422 1784105 1782704 1784242 1785210 1783136 1778537 1772448 1764890 1756628 1750016
60635 1750016 1746579 1745153 1743542 1740900 1737661 1734222 1730740 1727582 1725181 1723865 1724063 1725891 1728246 1729278
60621 1729278 1728220 1725945 1723360 1720199 1716061 1711797 1709028 1708593 1709902 1711540 1712357 1712306 1712101 1711636 1709511
$$ packed form
60720A798570l268o513r483j1096j0837q383n035l574m881o242n197l499m515
60707A716047p689q928o464l237k587m150n237m410k460j012r98j825j910r01
60693A664239p86l131n887n458j874R33P09p4J955O456J0146J0510P429K800l02
60678A687665L86M001P489R319J0248J0146P219J949j403J14L998N932N380M554
60664A756997L786J723j005j907k41K516N322P824Q490N799J353j266r90J54Q09
60649A789364J451J590l96l587m317j401J538R68k074m599o089p558q262o612
60635A750016l437j426j611k642l239l439l482l158k401j316J98J828K355J032
60621A729278j058k275k585l161m138m264k769m35J309J638Q17n1k05m65k125
$$ plain form
60606 1709511 1705410 1702414 1704790 1713037 1723020 1730795 1736350 1741394 1745650 1747695 1748338 1750616 1756338 1764365
60592 1764365 1772333 1778703 1783076 1785857 1787856 1789347 1789621 1788249 1786351 1785518 1786066 1787896 1792619 1802654
60578 1802654 1817750 1834129 1847821 1857749 1865367 1872883 1882285 1894209 1906723 1916980 1925379 1936340
60566 1936340 1952987 1972246 1987490 1995505 1998632 2000507 2002537 2005423 2011448 2022821 2038430 2054056
60554 2054056 2065947 2073287 2077406 2079929 2082200 2085635 2091649 2101065 2113807 2129080 2145650 2162062 2177064
60541 2177064 2190196 2202126 2214358 2228461 2245180 2263814 2282326 2298308 2310259 2318343 2324273 2330451
60529 2330451 2338380 2347070 2353393 2355294 2354705 2355823 2360010 2364158 2365357 2365339 2368119 2374369 2381113 2386847 2393943
60514 2393943 2405026 2419388 2434254 2447596 2458505 2466925 2474888 2486345 2503732 2525806 2550455 2577944
$$ packed form
60606A709511m101k996K376Q247R983P775N555N044M256K045O43K278N722Q027
60592A764365P968O370M373K781J999J491K74j372j898q33N48J830M723J0035
60578A802654J5096J6379J3692R928P618P516R402J1924J2514J0257Q399J0961
60566A936340J6647J9259J5244Q015L127J875K030K886O025J1373J5609J5626
60554B054056J1891P340M119K523K271L435O014R416J2742J5273J6570J6412J5002
60541B177064J3132J1930J2232J4103J6719J8634J8512J5982J1951Q084N930O178
60529B330451P929Q690O323J901n89J118M187M148J199j8K780O250O744N734P096
60514B393943J1083J4362J4866J3342J0909Q420P963J1457J7387K2074K4649K7489
$$ plain form
60502 2577944 2609283 2643067 2676964 2711571 2749673 2791944 2836337 2881760 2928990 2976983 3021285
60491 3021285 3057739 3085739 3106572 3120776 3128833 3132359 3132264 3127055 3115180 3098211 3079547 3060344
60479 3060344 3038692 3012751 2983010 2951198 2918403 2884812 2850420 2815450 2780352 2745501 2710839
60468 2710839 2676202 2642171 2609826 2579025 2547641 2513405 2476205 2437971 2400778 2365580 2331967
60457 2331967 2298177 2262102 2223705 2186301 2154295 2129395 2109621 2091633 2073181 2053736 2034076
60446 2034076 2015622 1999395 1985385 1973262 1963340 1956047 1950684 1945578 1939575 1932845 1926525 1922105 1920502
60433 1920502 1920568 1918979 1913184 1904581 1897269 1893273 1890517 1886241 1880884 1877024 1875241 1873037 1868273 1862312
60419 1862312 1858575 1858498 1860132 1860980 1861035 1861976 1864057 1865348 1864280 1861619 1859365 1858827 1860505 1864688 1870928 1877488
$$ packed form
60502B577944L1339L3784L3897L4607L8102M2271M4393M5423M7230M7993M4302
60491C021285L6454K8000K0833J4204Q057L526r5n209j1875j6969j8664j9203
60479C060344k1652k5941k9741l1812l2795l3591l4392l4970l5098l4851l4662
60468B710839l4637l4031l2345l0801l1384l4236l7200l8234l7193l5198l3613
60457B331967l3790l6075l8397l7404l2006k4900j9774j7988j8452j9445j9660
60446B034076j8454j6227j4010j2123r922p293n363n106o003o730o320m420j603
60433A920502O6j589n795q603p312l996k756m276n357l860j783k204m764n961
60419A862312l737p7J634Q48N5R41K081J291j068k661k254n38J678M183O240O560
$$ plain form
60403 1877488 1882391 1884770 1884781 1883252 1882289 1884831 1891817 1900356 1906351 1908548 1908684 1908457 1908336 1908899 1911066 1914784
60387 1914784 1919293 1924798 1932003 1939827 1945655 1948473 1950086 1952909 1958184 1966248 1976095 1984383 1987746 1987239
60373 1987239 1987801 1991954 1996879 1999657 2002323 2008603 2017820 2025779 2030816 2035619 2043250 2054224 2067374 2080894
60359 2080894 2092183 2099070 2102036 2103893 2107367 2114244 2125865 2141859 2158667 2172035 2181248 2188694 2195432
60346 2195432 2200223 2203218 2207019 2212607 2217256 2218382 2216812 2214264 2210207 2203972 2197836 2194806 2194545 2194470 2193972
60331 2193972 2194435 2195601 2195182 2192490 2189579 2188066 2187102 2185354 2182807 2179669 2175486 2170619 2167012 2166143 2167375
60316 2167375 2169427 2172251 2176327 2181226 2186264 2191804 2198728 2207287 2217398 2229224 2242503 2256343 2270743
60303 2270743 2286954 2304637 2319975 2328978 2332095 2333073 2333607 2331973 2327187 2321230 2315768 2309561 2301422 2293511
$$ packed form
60403A877488M903K379J1j529r63K542O986Q539N995K197J36k27j21N63K167L718
60387A914784M509N505P205P824N828K818J613K823N275Q064R847Q288L363n07
60373A987239N62M153M925K778K666O280R217P959N037M803P631J0974J3150J3520
60359B080894J1289O887K966J857L474O877J1621J5994J6808J3368R213P446O738
60346B195432M791K995L801N588M649J126j570k548m057o235o136l030k61p5m98
60331B193972M63J166m19k692k911j513r64j748k547l138m183m867l607q69J232
60316B167375K052K824M076M899N038N540O924Q559J0111J1826J3279J3840J4400
60303B270743J6211J7683J5338R003L117R78N34j634m786n957n462o207q139p911
$$ plain form
60289 2293511 2288727 2285957 2280853 2271225 2259317 2248668 2240685 2234398 2227612 2217976 2204914 2191070 2180162
60276 2180162 2172880 2166486 2158620 2149143 2137669 2122509 2104285 2088055 2078531 2074332 2070019 2062984 2054939
60263 2054939 2046975 2037418 2026102 2017064 2014066 2015376 2015948 2013750 2011117 2010128 2009328 2005689 1997952 1987201
60249 1987201 1975570 1965297 1958051 1954117 1952590 1952771 1954676 1957840 1960703 1962288 1963822 1967488 1973717 1980751
60235 1980751 1986726 1991023 1993559 1994257 1994023 1994979 1998393 2002992 2006748 2010053 2015499 2024199 2033841 2041322 2046316
60220 2046316 2051034 2057081 2063958 2070715 2077964 2087517 2100161 2114022 2125383 2131708 2134239 2137072 2143166
60207 2143166 2151859 2161045 2170914 2183914 2201031 2219796 2236645 2250136 2261143 2271050 2280884 2291509
60195 2291509 2303216 2314921 2324631 2331076 2334607 2336471 2337541 2337914 2337614 2337424 2338499 2340835 2342518 2341302
$$ packed form
60289B293511m784k770n104r628j1908j0649p983o287o786r636j3062j3844j0908
60276B180162p282o394p866r477j1474j5160j8224j6230r524m199m313p035q045
60263B054939p964r557j1316r038k998J310N72k198k633r89q00l639p737j0751
60249A987201j1631j0273p246l934j527J81J905L164K863J585J534L666O229P034
60235A980751N975M297K536O98k34R56L414M599L756L305N446Q700R642P481M994
60220B046316M718O047O877O757P249R553J2644J3861J1361O325K531K833O094
60207B143166Q693R186R869J3000J7117J8765J6849J3491J1007R907R834J0625
60195B291509J1707J1705R710O445L531J864J070L73l00j90J075K336J683j216
$$ plain form
60181 2341302 2336792 2330331 2323048 2315323 2308170 2303324 2301069 2299367 2296180 2291535 2286424 2281325 2277302 2276720
60167 2276720 2280278 2284280 2283790 2278378 2272091 2267747 2264396 2261028 2259318 2260589 2262684 2262526 2260184 2257888
60153 2257888 2256290 2254428 2252645 2252690 2254825 2257319 2259250 2261689 2265459 2269641 2273237 2276831 2281577 2287660
60139 2287660 2294619 2302177 2309888 2316757 2322113 2326355 2330293 2334289 2338471 2342993 2347493 2351036 2353204 2354776
60125 2354776 2356872 2360019 2364352 2370001 2376977 2385407 2395973 2408780 2421500 2430442 2434532 2436647 2439732
60112 2439732 2443204 2444849 2444449 2442934 2439362 2432333 2424290 2420818 2424472 2431968 2438762 2443884 2448595 2452797
60098 2452797 2455315 2456309 2456789 2456408 2454057 2450422 2448043 2448657 2451760 2455505 2457830 2457404 2455159 2454333 2456950
60083 2456950 2460502 2460306 2455234 2448774 2444029 2440236 2435342 2429463 2423814 2418027 2410933 2402937 2395368 2387917
$$ packed form
60181B341302m510o461p283p725p153m846k255j702l187m645n111n099m023n82
60167B276720L558M002m90n412o287m344l351l368j710J271K095j58k342k296
60153B257888j598j862j783M5K135K494J931K439L770M182L596L594M746O083
60139B287660O959P558P711O869N356M242L938L996M182M522M500L543K168J572
60125B354776K096L147M333N649O976Q430J0566J2807J2720Q942M090K115L085
60112B439732L472J645m00j515l572p029q043l472L654P496O794N122M711M202
60098B452797K518R94M80l81k351l635k379O14L103L745K325m26k245q26K617
60083B456950L552j96n072o460m745l793m894n879n649n787p094p996p569p451
$$ plain form
60069 2387917 2378781 2367237 2354244 2340485 2325553 2309400 2293164 2278081 2264654 2253028 2242954
60058 2242954 2233183 2222375 2211118 2201561 2194348 2187406 2178978 2170441 2164262 2159891 2153973 2145092 2136516
60045 2136516 2132984 2135496 2140385 2143241 2142592 2139546 2135106 2129333 2123040 2118663 2118142 2120486 2122692 2123019 2122188
60030 2122188 2121340 2120332 2118696 2116920 2115605 2114219 2111992 2109351 2107040 2104341 2099841 2093815 2087899 2081995
60016 2081995 2073600 2061505 2048472 2038359 2031481 2024967 2017445 2010907 2007173 2004674 2000527 1994694 1989951
60003 1989951 1987904 1986970 1984865 1981476 1978064 1974585 1969320 1961191 1951531 1943458 1939958 1942253 1948927 1956376
59989 1956376 1960998 1961511 1958984 1954747 1949234 1943190 1938820 1938419 1941869 1946390 1949005 1948891 1947381 1946299 1946612
59974 1946612 1948230 1950414 1952167 1952682 1952052 1951517 1952317 1953929 1954194 1951995 1949190 1948607 1950387 1951968 1952060 1952959
$$ packed form
60069B387917r136j1544j2993j3759j4932j6153j6236j5083j3427j1626j0074
60058B242954r771j0808j1257r557p213o942q428q537o179m371n918q881q576
60045B136516l532K512M889K856o49l046m440n773o293m377n21K344K206L27q31
60030B122188q48j008j636j776j315j386k227k641k311k699m500o026n916n904
60016B081995q395j2095j3033j0113o878o514p522o538l734k499m147n833m743
60003A989951k047r34k105l389l412l479n265q129r660q073l500K295O674P449
59989A956376M622N13k527m237n513o044m370m01L450M521K615j14j510j082L13
59974A946612J618K184J753N15o30n35Q00J612K65k199k805n83J780J581R2Q99
$$ plain form
59958 1952959 1957741 1966204 1974863 1980374 1981974 1981158 1980170 1980505 1981836 1982509 1981714 1980714 1981206 1983123 1985053
59943 1985053 1986157 1986519 1986300 1985921 1986345 1987441 1986707 1981962 1975374 1972464 1976421 1985160 1994358 2001292 2005154
59928 2005154 2006324 2007126 2011177 2019620 2029097 2035382 2038076 2040062 2043523 2048664 2055456 2063894 2072559 2079228
59914 2079228 2083486 2087125 2091636 2096888 2102339 2107608 2111444 2112251 2110842 2110977 2115727 2124308 2133608 2141650
59900 2141650 2148080 2152459 2154270 2154580 2155782 2159131 2163844 2169169 2176067 2185771 2197271 2207486 2214127 2217966
59886 2217966 2222209 2229811 2241083 2253353 2262908 2267860 2269513 2270881 2273868 2278067 2282029 2285019 2287321
59873 2287321 2289488 2291835 2294268 2296123 2296523 2295495 2294519 2295266 2297796 2300313 2300511 2296984 2290067 2282160 2276732
59858 2276732 2275938 2279296 2285165 2292642 2300863 2307668 2311466 2314196 2319695 2328392 2336150 2339635 2340463 2342179
$$ packed form
59958A952959M782Q463Q659N511J600q16r88L35J331O73p95j000M92J917J930
59943A985053J104L62k19l79M24J096p34m745o588k910L957Q739R198O934L862
59928B005154J170Q02M051Q443R477O285K694J986L461N141O792Q438Q665O669
59914B079228M258L639M511N252N451N269L836Q07j409J35M750Q581R300Q042
59900B141650O430M379J811L10J202L349M713N325O898R704J1500J0215O641L839
59886B217966M243P602J1272J2270R555M952J653J368K987M199L962K990K302
59873B287321K167K347K433J855M00j028r76P47K530K517J98l527o917p907n428
59858B276732p94L358N869P477Q221O805L798K730N499Q697P758L485Q28J716
$$ plain form
59844 2342179 2345159 2347032 2346894 2346480 2347583 2350452 2354583 2359138 2362622 2363833 2363094 2361129 2357139 2349807 2340119
59829 2340119 2331260 2325438 2322362 2320812 2319787 2317707 2312560 2303962 2293957 2284907 2277371 2270334 2262578 2253622
59815 2253622 2244454 2237411 2233956 2232367 2229001 2222096 2212941 2203378 2194263 2186656 2181857 2178960 2174732 2167788
59801 2167788 2160951 2157170 2154558 2148219 2136595 2123648 2114749 2112137 2114186 2117040 2116660 2111329 2103304 2097073
59787 2097073 2095267 2096836 2099247 2101076 2101802 2100425 2095992 2089445 2083825 2082030 2084536 2089289 2093516 2095606
59773 2095606 2095795 2095648 2096756 2099303 2101687 2102067 2100584 2099388 2099936 2101037 2100584 2098675 2097563 2098568 2100605
59758 2100605 2102291 2104171 2107875 2113894 2121126 2128213 2134681 2141009 2148007 2155844 2163570 2169988 2175046 2179707
59744 2179707 2184409 2188465 2191151 2192630 2193806 2196306 2202462 2213608 2227768 2240621 2249767 2256811 2264158
$$ packed form
59844B342179K980J873j38m14J103K869M131M555L484J211p39j965l990p332r688
59829B340119q859n822l076j550j025k080n147q598j0005r050p536p037p756q956
59815B253622r168p043l455j589l366o905r155r563r115p607m799k897m228o944
59801B167788o837l781k612o339j1624j2947q899k612K049K854l80n331q025o231
59787B097073j806J569K411J829P26j377m433o547n620j795K506M753M227K090
59773B095606J89j47J108K547K384L80j483j196N48J101m53j909j112J005K037
59758B100605J686J880L704O019P232P087O468O328O998P837P726O418N058M661
59744B179707M702M056K686J479J176K500O156J1146J4160J2853R146P044P347
$$ plain form
59731 2264158 2271070 2274638 2274103 2272635 2274591 2281609 2291223 2298969 2302301 2302771 2303818 2306624 2309463 2311171
59717 2311171 2312985 2315952 2318738 2320031 2321342 2324853 2329342 2330992 2328264 2323887 2321763 2323553 2328366 2334131
59703 2334131 2338862 2341877 2344197 2346973 2349767 2351439 2352309 2353921 2356789 2359908 2362625 2365602 2369656 2374709
59689 2374709 2379825 2383190 2382490 2376972 2369161 2362713 2358300 2353306 2346099 2338823 2334912 2334982 2336160 2334883 2329844
59674 2329844 2322910 2317406 2314806 2313078 2309145 2302726 2296328 2291557 2287355 2282582 2278604 2277952 2281127 2285580
59660 2285580 2287504 2284560 2277792 2271005 2267161 2265307 2262295 2257407 2253251 2251608 2250749 2248290 2244853 2242934
59646 2242934 2243203 2243819 2242792 2239522 2234488 2228936 2224599 2222387 2221314 2219493 2215992 2211065 2205128 2198447
59632 2198447 2191416 2184269 2176861 2169421 2162932 2157965 2153758 2149266 2144391 2139224 2132955 2124919 2116080 2107985
$$ packed form
59731B264158O912L568n35j468J956P018R614P746L332M70J047K806K839J708
59717B311171J814K967K786J293J311L511M489J650k728m377k124J790M813N765
59703B334131M731L015K320K776K794J672Q70J612K868L119K717K977M054N053
59689B374709N116L365p00n518p811o448m413m994p207p276l911P0J178j277n039
59674B329844o934n504k600j728l933o419o398m771m202m773l978o52L175M453
59660B285580J924k944o768o787l844j854l012m888m156j643q59k459l437j919
59646B242934K69O16j027l270n034n552m337k212j073j821l501m927n937o681
59632B198447p031p147p408p440o489m967m207m492m875n167o269q036q839q095
$$ plain form
59618 2107985 2100790 2093922 2088219 2085178 2083847 2080639 2073471 2064662 2058453 2056466 2056745 2056633 2055348 2053874
59604 2053874 2053307 2053622 2053535 2051484 2047082 2041734 2037553 2035382 2033791 2030040 2022200 2010654 1997745 1986051
59590 1986051 1977033 1971209 1969100 1971349 1977749 1986466 1994637 2000090 2002804 2004840 2008547 2014382 2020283 2023186
59576 2023186 2021225 2014727 2005558 1995755 1986508 1978000 1970068 1962965 1957304 1953303 1950556 1948859 1948849 1951276
59562 1951276 1955738 1960644 1964523 1966954 1968237 1968788 1969254 1970705 1973946 1978618 1983623 1988637 1994588 2002202
59548 2002202 2010626 2018301 2025010 2032242 2041470 2052907 2066111 2080792 2096441 2111955 2126363 2139451
59536 2139451 2151056 2160412 2167077 2171942 2176299 2180279 2183409 2186575 2192146 2201717 2214390 2227410 2237765
59523 2237765 2243377 2244018 2241826 2240129 2240917 2243355 2244909 2243751 2240044 2235221 2230270 2224902 2218651 2212489
$$ packed form
59618B107985p195o868n703l041j331l208p168q809o209j987K79j12j285j474
59604B053874n67L15q7k051m402n348m181k171j591l751p840j1546j2909j1694
59590A986051r018n824k109K249O400Q717Q171N453K714K036L707N835N901K903
59576B023186j961o498r169r803r247q508p932p103n661m001k747j697j0K427
59562A951276M462M906L879K431J283N51M66J451L241M672N005N014N951P614
59548B002202Q424P675O709P232R228J1437J3204J4681J5649J5514J4408J3088
59536B139451J1605R356O665M865M357L980L130L166N571R571J2673J3020J0355
59523B237765N612O41k192j697P88K438J554j158l707m823m951n368o251o162
$$ plain form
59509 2212489 2208289 2206323 2204358 2200061 2193363 2185607 2177592 2169849 2163630 2159553 2155931 2150517 2143539 2136948
59495 2136948 2131128 2124913 2118649 2114186 2111243 2106830 2099546 2091637 2085240 2079312 2072607 2067349 2066933 2071159
59481 2071159 2076490 2080504 2083770 2087604 2092111 2096663 2100838 2104779 2109383 2115692 2123209 2129686 2133742 2136795
59467 2136795 2141026 2146286 2150624 2153261 2155536 2159422 2166454 2177302 2190796 2204068 2215306 2225664 2236776
59454 2236776 2247465 2255339 2261009 2267879 2277578 2288151 2297243 2304566 2310467 2314474 2316668 2318648 2321467
59441 2321467 2323760 2323347 2320094 2316285 2314667 2316574 2321197 2326266 2330199 2333669 2338056 2342399 2343689 2340866
59427 2340866 2336913 2336025 2340083 2348792 2361422 2376611 2391815 2405467 2419433 2437134 2458936 2481339
59415 2481339 2501460 2520532 2541423 2563687 2582950 2595343 2601146 2603724 2606225 2610179 2615941 2622738
$$ packed form
59509B212489m200j966j965m297o698p756q015p743o219m077l622n414o978o591
59495B136948n820o215o264m463k943m413p284p909o397n928o705n258m16M226
59481B071159N331M014L266L834M507M552M175L941M604O309P517O477M056L053
59467B136795M231N260M338K637K275L886P032J0848J3494J3272J1238J0358J1112
59454B236776J0689P874N670O870R699J0573R092P323N901M007K194J980K819
59441B321467K293m13l253l809j618J907M623N069L933L470M387M343J290k823
59427B340866l953q88M058Q709J2630J5189J5204J3652J3966J7701K1802K2403
59415B481339K0121J9072K0891K2264J9263J2393N803K578K501L954N762O797
$$ plain form
59403 2622738 2628705 2632715 2636208 2641315 2646950 2649036 2645562 2639080 2632310 2623509 2609191 2590307 2572238
59390 2572238 2558383 2546558 2532499 2514722 2495123 2476772 2462104 2451525 2442701 2432683 2421662
59379 2421662 2413157 2409531 2408947 2407960 2405407 2401977 2397446 2390965 2383925 2380218 2382831 2391174 2402191 2413213
59365 2413213 2423352 2432911 2442456 2452572 2463957 2477021 2491178 2505264 2519347 2535568 2555978 2579712
59353 2579712 2603583 2625677 2647171 2670323 2695974 2723434 2751274 2777303 2799291 2817145 2833590
59342 2833590 2851286 2869868 2886928 2901214 2913431 2924395 2934092 2942598 2950347 2956899 2960650 2960711 2958595
59329 2958595 2957181 2957924 2959400 2958676 2953925 2945467 2934425 2921139 2905708 2889697 2875894 2865615 2857069
59316 2857069 2847321 2835652 2824400 2816516 2812592 2810145 2805820 2798736 2791739 2788719 2790448 2793755 2795052
$$ packed form
59403B622738N967M010L493N107N635K086l474o482o770q801j4318j8884j8069
59390B572238j3855j1825j4059j7777j9599j8351j4668j0579q824j0018j1021
59379B421662q505l626n84r87k553l430m531o481p040l707K613Q343J1017J1022
59365B413213J0139R559R545J0116J1385J3064J4157J4086J4083J6221K0410K3734
59353B579712K3871K2094K1494K3152K5651K7460K7840K6029K1988J7854J6445
59342B833590J7696J8582J7060J4286J2217J0964R697Q506P749O552L751O1k116
59329B958595j414P43J476p24m751q458j1042j3286j5431j6011j3803j0279q546
59316B857069r748j1669j1252p884l924k447m325p084o997l020J729L307J297
$$ plain form
59303 2795052 2793827 2792254 2792354 2794395 2797193 2798818 2797347 2791993 2783639 2773876 2763972 2755192 2749162 2746636
59289 2746636 2746236 2745600 2743657 2740759 2736926 2731525 2724913 2718839 2714296 2710106 2704808 2699262 2696043 2696329 2698490
59274 2698490 2699960 2699557 2697638 2695058 2693020 2693228 2696600 2701525 2704745 2704713 2703110 2702139 2701322 2698523 2693571
59259 2693571 2688899 2686175 2684099 2680539 2675557 2670950 2667592 2664709 2661519 2658060 2654076 2648337 2639969 2629929
59245 2629929 2620272 2612158 2605409 2600212 2598182 2600658 2606200 2610961 2612038 2609818 2606719 2604442 2602967 2601247
59231 2601247 2597937 2592128 2584493 2577341 2572523 2569568 2566701 2563112 2559139 2555025 2551053 2548347 2547637 2547287
59217 2547287 2544469 2538583 2531942 2526906 2523826 2521797 2519472 2515008 2507538 2499287 2493976 2492167 2490345 2485722
59203 2485722 2479777 2475810 2475137 2477225 2481173 2484970 2485457 2481768 2477410 2476424 2478776 2482131 2486662 2494483 2504718
$$ packed form
59303B795052j225j573J00K041K798J625j471n354q354r763r904q780o030k526
59289B746636m00o36j943k898l833n401o612o074m543m190n298n546l219K86K161
59274B698490J470m03j919k580k038K08L372M925L220l2j603r71q17k799m952
59259B693571m672k724k076l560m982m607l358k883l190l459l984n739q368j0040
59245B629929r657q114o749n197k030K476N542M761J077k220l099k277j475j720
59231B601247l310n809p635p152m818k955k867l589l973m114l972k706p10l50
59217B547287k818n886o641n036l080k029k325m464p470q251n311j809j822m623
59203B485722n945l967o73K088L948L797M87l689m358r86K352L355M531P821J0235
$$ plain form
59188 2504718 2512901 2516222 2516754 2518460 2523139 2530292 2538945 2547957 2555540 2560015 2561191 2560748 2561337 2564905 2571287
59173 2571287 2578831 2586846 2596489 2608271 2619901 2628391 2633735 2638834 2646279 2656851 2670320 2685266 2698290
59160 2698290 2706022 2708532 2708849 2708803 2707492 2704391 2701593 2701515 2703855 2705984 2705415 2701263 2694543 2687740 2682938
59145 2682938 2679717 2675925 2670794 2665843 2662384 2659818 2657137 2654315 2651141 2646165 2638141 2627602 2616185
59132 2616185 2605462 2596900 2591308 2587282 2581907 2574479 2568100 2565959 2567258 2568686 2569005 2570055 2573608 2579205
59118 2579205 2585392 2591540 2597977 2605267 2613802 2623626 2634425 2645750 2656961 2666895 2674324 2679243 2683112
59105 2683112 2687426 2692780 2699610 2708635 2719718 2731267 2741631 2750268 2756878 2760682 2761763 2761917 2762643 2763180
59091 2763180 2762211 2760684 2760970 2763511 2766293 2767670 2767848 2767134 2764486 2758939 2751516 2744564 2739189 2733826 2725628
$$ packed form
59188B504718Q183L321N32J706M679P153Q653R012P583M475J176m43N89L568O382
59173B571287P544Q015R643J1782J1630Q490N344N099P445J0572J3469J4946J3024
59160B698290P732K510L17m6j311l101k798p8K340K129n69m152o720o803m802
59145B682938l221l792n131m951l459k566k681k822l174m976q024j0539j1417
59132B616185j0723q562n592m026n375p428o379k141J299J428L19J050L553N597
59118B579205O187O148O437P290Q535R824J0799J1325J1211R934P429M919L869
59105B683112M314N354O830R025J1083J1549J0364Q637O610L804J081J54P26N37
59091B763180r69j527K86K541K782J377J78p14k648n547p423o952n375n363q198
$$ plain form
59076 2725628 2713585 2700125 2688759 2679909 2670286 2657224 2642285 2629097 2618785 2609604 2600501 2592602
59064 2592602 2586723 2581329 2573797 2562809 2549316 2536254 2527197 2523558 2522604 2519464 2511570 2500315 2488720
59051 2488720 2479176 2473420 2472253 2474087 2475421 2473930 2469987 2464646 2458081 2451146 2446366 2445314 2446201 2446060
59037 2446060 2444494 2443490 2444272 2446304 2448894 2451877 2455000 2458579 2464674 2475510 2490183 2504491 2514689
59024 2514689 2520654 2525502 2533397 2547425 2567512 2589803 2609681 2626043 2641266 2656712 2670455 2680591
59012 2680591 2688647 2697640 2708074 2718014 2726485 2734498 2742712 2750211 2756291 2761925 2768418 2775360 2780866 2783688
58998 2783688 2784710 2786502 2791686 2801554 2815666 2831970 2846987 2857036 2861127 2862804 2867230 2875547 2883728
58985 2883728 2888171 2890409 2894194 2899810 2904506 2907683 2911706 2917128 2920929 2921271 2920965 2923998 2930983 2940364
$$ packed form
59076B725628j2043j3460j1366q850r623j3062j4939j3188j0312r181r103p899
59064B592602n879n394p532j0988j3493j3062r057l639r54l140p894j1255j1595
59051B488720r544n756j167J834J334j491l943n341o565o935m780j052Q87j41
59037B446060j566j004P82K032K590K983L123L579O095J0836J4673J4308J0198
59024B514689N965M848P895J4028K0087K2291J9878J6362J5223J5446J3743J0136
59012B680591Q056Q993J0434R940Q471Q013Q214P499O080N634O493O942N506K822
58998B783688J022J792N184R868J4112J6304J5017J0049M091J677M426Q317Q181
58985B883728M443K238L785N616M696L177M023N422L801L42l06L033O985R381
$$ plain form
58971 2940364 2951772 2965053 2977622 2986638 2993533 3002961 3016675 3031169 3042204 3049255 3054525 3059833
58959 3059833 3065886 3072957 3080513 3087086 3091650 3094442 3095812 3095329 3092616 3087743 3080196 3069260 3056574 3046054
58945 3046054 3039094 3031540 3018476 3001320 2986972 2979671 2976505 2971723 2962695 2950413 2936954 2924797
58933 2924797 2916657 2912992 2910486 2905540 2898857 2894088 2892160 2889725 2883789 2875178 2866252 2857672 2849297 2842328
58919 2842328 2838005 2835162 2831456 2826666 2822837 2821576 2823262 2828578 2838259 2850812 2862793 2872346 2880767
58906 2880767 2889807 2899431 2909410 2921116 2935768 2952071 2967415 2980604 2992059 3002571 3013837 3029148
58894 3029148 3050844 3077026 3103079 3126900 3150675 3177021 3205435 3233803 3261828 3291166 3322653
58883 3322653 3354698 3384496 3410114 3431335 3449107 3464580 3478564 3491323 3502206 3509523 3511955 3510694
$$ packed form
58971B940364J1408J3281J2569R016O895R428J3714J4494J1035P051N270N308
58959C059833O053P071P556O573M564K792J370m83k713m873p547j0936j2686j0520
58945C046054o960p554j3064j7156j4348p301l166m782r028j2282j3459j2157
58933B924797q140l665k506m946o683m769j928k435n936q611q926q580q375o969
58919B842328m323k843l706m790l829j261J686N316R681J2553J1981R553Q421
58906B880767R040R624R979J1706J4652J6303J5344J3189J1455J0512J1266J5311
58894C029148K1696K6182K6053K3821K3775K6346K8414K8368K8025K9338L1487
58883C322653L2045K9798K5618K1221J7772J5473J3984J2759J0883P317K432j261
$$ plain form
58871 3510694 3509236 3509903 3511156 3509442 3503178 3493719 3483074 3472440 3462774 3454741 3447430 3438497 3426341
58858 3426341 3411302 3394662 3377680 3361723 3347618 3334267 3319298 3301787 3283008 3263929 3243695
58847 3243695 3221808 3200198 3181442 3165754 3151294 3136808 3122430 3108360 3094439 3081218 3070137
58836 3070137 3061981 3055718 3049156 3040673 3030568 3020976 3014091 3010005 3006625 3001942 2995916 2989908 2985048 2981820
58822 2981820 2980498 2980976 2982317 2983201 2982959 2982077 2981923 2983855 2987784 2991490 2992410 2990669 2989412 2991358 2995855
58807 2995855 3000220 3003275 3006352 3010972 3016423 3019911 3018959 3013951 3008293 3005470 3005802 3006793 3006572 3005815 3006127
58792 3006127 3007918 3010244 3011378 3009288 3003642 2998207 2998870 3007364 3018661 3026452 3029616 3031150 3032594 3032741
58778 3032741 3031041 3028954 3027733 3027489 3028560 3031271 3034024 3034189 3031584 3028845 3027726 3027219 3026064 3024760 3023942
$$ packed form
58871C510694j458O67J253j714o264r459j0645j0634r666q033p311q933j2156
58858C426341j5039j6640j6982j5957j4105j3351j4969j7511j8779j9079k0234
58847C243695k1887k1610j8756j5688j4460j4486j4378j4070j3921j3221j1081
58836C070137q156o263o562q483j0105r592o885m086l380m683o026o008m860l228
58822B981820j322M78J341Q84k42q82j54J932L929L706R20j741j257J946M497
58807B995855M365L055L077M620N451L488r52n008n658k823L32R91k21p57L12
58792C006127J791K326J134k090n646n435O63Q494J1297P791L164J534J444J47
58778C032741j700k087j221k44J071K711K753J65k605k739j119n07j155j304q18
$$ plain form
58763 3023942 3022940 3021432 3020722 3021813 3023718 3025366 3027854 3033041 3040696 3048589 3054747 3058353 3059275 3058356 3057749
58748 3057749 3059425 3063422 3068725 3075472 3084834 3096677 3108905 3119878 3130498 3142949 3157618 3172143
58736 3172143 3183942 3193273 3203127 3215911 3230905 3245402 3257577 3267364 3275293 3282128 3289663 3300290
58724 3300290 3315043 3332789 3351432 3368979 3383636 3394591 3403330 3412902 3425243 3440217 3457241 3475935
58712 3475935 3494653 3510633 3522948 3533504 3543634 3551601 3555340 3555822 3555151 3552842 3547228 3539988 3535664
58699 3535664 3535951 3537215 3534900 3528285 3519654 3510668 3501317 3491307 3480688 3469379 3457320 3445131 3433901
58686 3433901 3424261 3415919 3407956 3399547 3390852 3383307 3378427 3376160 3374974 3373847 3373559 3375648 3380515 3386970
58672 3386970 3393418 3399154 3404618 3410634 3417627 3425765 3435628 3447866 3461887 3475732 3488023 3499297 3510542
$$ packed form
58763C023942j002j508p10J091J905J648K488N187P655P893O158L606R22r19o07
58748C057749J676L997N303O747R362J1843J2228J0973J0620J2451J4669J4525
58736C172143J1799R331R854J2784J4994J4497J2175R787P929O835P535J0627
58724C300290J4753J7746J8643J7547J4657J0955Q739R572J2341J4974J7024J8694
58712C475935J8718J5980J2315J0556J0130P967L739M82o71k309n614p240m324
58699C535664K87J264k315o615q631q986r351j0010j0619j1309j2059j2189j1230
58686C433901r640q342p963q409q695p545m880k267j186j127k88K089M867O455
58672C386970O448N736N464O016O993Q138R863J2238J4021J3845J2291J1274J1245
$$ plain form
58659 3510542 3521157 3529425 3534220 3534975 3531044 3523194 3515122 3510692 3509201 3505865 3497868 3487695 3479357 3473727
58645 3473727 3469385 3465865 3463322 3460149 3453891 3444666 3435606 3429506 3426369 3424395 3422192 3419912 3419089 3421166
58631 3421166 3425394 3428788 3429402 3429094 3431499 3437815 3446356 3455960 3467497 3481564 3496854 3511926 3526927
58618 3526927 3542341 3557323 3570767 3583339 3597208 3613923 3633128 3652827 3670446 3684500 3696237
58607 3696237 3709137 3725875 3745858 3766205 3784643 3800830 3815418 3828996 3842143 3855793 3870853
58596 3870853 3887292 3903655 3917882 3929003 3937927 3946292 3955039 3964768 3976916 3993144 4013495 4036209
58584 4036209 4059499 4082525 4104793 4126227 4148045 4171881 4197581 4223590 4250087 4279574 4313087
58573 4313087 4347874 4380647 4411579 4443168 4476626 4511585 4548224 4587098 4627325 4667349 4707331
$$ packed form
58659C510542J0615Q268M795P55l931p850q072m430j491l336p997j0173q338n630
58645C473727m342l520k543l173o258r225r060o100l137j974k203k280q23K077
58631C421166M228L394O14l08K405O316Q541R604J1537J4067J5290J5072J5001
58618C526927J5414J4982J3444J2572J3869J6715J9205J9699J7619J4054J1737
58607C696237J2900J6738J9983K0347J8438J6187J4588J3578J3147J3650J5060
58596C870853J6439J6363J4227J1121Q924Q365Q747R729J2148J6228K0351K2714
58584D036209K3290K3026K2268K1434K1818K3836K5700K6009K6497K9487L3513
58573D313087L4787L2773L0932L1589L3458L4959L6639L8874M0227M0024L9982
$$ plain form
58562 4707331 4748780 4792054 4836291 4881541 4928540 4976137 5021142 5061398 5097353 5130271 5160500
58551 5160500 5187770 5211650 5231648 5248359 5264122 5280412 5294965 5304424 5309905 5316549 5326524 5335891
58539 5335891 5340152 5339736 5337482 5333504 5325989 5315495 5304996 5296118 5288024 5279713 5271220 5262794 5255011 5249476
58525 5249476 5247475 5248043 5249033 5249687 5250350 5250259 5247909 5243626 5239552 5236816 5234714 5233108 5233528 5237116 5243213 5250849
58509 5250849 5260003 5270244 5279546 5285925 5289716 5293257 5298832 5307491 5319063 5332253 5345140 5356560 5367074
58496 5367074 5378196 5390792 5404562 5418760 5432980 5447408 5462686 5479464 5497762 5516805 5535686
58485 5535686 5554245 5573166 5593190 5614510 5637375 5663225 5694386 5731642 5772180 5810793 5843537
58474 5843537 5870129 5893270 5916423 5941630 5967856 5991398 6009664 6025014 6042975 6065825 6089977
$$ packed form
58562D707331M1449M3274M4237M5250M6999M7597M5005M0256L5955L2918L0229
58551E160500K7270K3880J9998J6711J5763J6290J4553R459N481O644R975R367
58539E335891M261m16k254l978p515j0494j0499q878q094q311q493q426p783n535
58525E249476k001N68R90O54O63r1k350m283m074k736k102j606M20L588O097P636
58509E250849R154J0241R302O379L791L541N575Q659J1572J3190J2887J1420J0514
58496E367074J1122J2596J3770J4198J4220J4428J5278J6778J8298J9043J8881
58485E535686J8559J8921K0024K1320K2865K5850L1161L7256M0538L8613L2744
58474E843537K6592K3141K3153K5207K6226K3542J8266J5350J7961K2850K4152
$$ plain form
58463 6089977 6111165 6130241 6151622 6177481 6206197 6235820 6266102 6296746 6326072 6352459 6375926
58452 6375926 6397896 6420289 6444570 6470313 6494869 6515824 6533524 6549749 6564644 6577413 6589766
58441 6589766 6605642 6626640 6650287 6674119 6699061 6726825 6755938 6782886 6806433 6828660 6851929
58430 6851929 6876571 6901600 6926301 6950795 6975960 7003123 7033172 7065467 7097763 7127527 7153904
58419 7153904 7178923 7206347 7238285 7272920 7306636 7338342 7370157 7403315 7435309 7462659 7485407
58408 7485407 7507069 7530563 7555934 7581839 7607380 7632032 7655559 7679216 7705829 7737013 7770647
58397 7770647 7802632 7831336 7859151 7889502 7923827 7962000 8003762 8047843 8091053 8130992 8169539
58386 8169539 8211103 8257083 8304610 8351434 8398961 8448688 8498548 8545680 8590867 8637014 8684537
$$ packed form
58463F089977K1188J9076K1381K5859K8716K9623L0282L0644K9326K6387K3467
58452F375926K1970K2393K4281K5743K4556K0955J7700J6225J4895J2769J2353
58441F589766J5876K0998K3647K3832K4942K7764K9113K6948K3547K2227K3269
58430F851929K4642K5029K4701K4494K5165K7163L0049L2295L2296K9764K6377
58419G153904K5019K7424L1938L4635L3716L1706L1815L3158L1994K7350K2748
58408G485407K1662K3494K5371K5905K5541K4652K3527K3657K6613L1184L3634
58397G770647L1985K8704K7815L0351L4325L8173M1762M4081M3210L9939L8547
58386H169539M1564M5980M7527M6824M7527M9727M9860M7132M5187M6147M7523
$$ plain form
58375 8684537 8731757 8779286 8830269 8885885 8943760 9001698 9060243 9120602 9182507 9245478 9310115
58364 9310115 9376898 9445553 9516639 9591859 9671342 9752304 9831844 9909592 9986183 10060744 10131940
58353 10131940 10200690 10269891 10341595 10415840 10492116 10570725 10652270 10736353 10821202 10904900 10987380
58342 10987380 11070880 11157689 11247700 11339172 11431661 11526808 11626058 11728862 11833430 11938132
58332 11938132 12042039 12145353 12249526 12355838 12463810 12572334 12682171 12795614 12913473
58323 12913473 13034005 13155011 13275442 13394993 13514143 13634850 13759213 13887179 14017629
58314 14017629 14151687 14292212 14439328 14589162 14738057 14885814 15034169 15184871 15340058
58305 15340058 15501152 15665637 15827928 15985671 16142809 16304729 16473264 16648471 16831726
$$ packed form
58375H684537M7220M7529N0983N5616N7875N7938N8545O0359O1905O2971O4637
58364I310115O6783O8655P1086P5220P9483Q0962P9540P7748P6591P4561P1196
58353A0131940O8750O9201P1704P4245P6276P8609Q1545Q4083Q4849Q3698Q2480
58342A0987380Q3500Q6809R0011R1472R2489R5147R9250J02804J04568J04702
58332A1938132J03907J03314J04173J06312J07972J08524J09837J13443J17859
58323A2913473J20532J21006J20431J19551J19150J20707J24363J27966J30450
58314A4017629J34058J40525J47116J49834J48895J47757J48355J50702J55187
58305A5340058J61094J64485J62291J57743J57138J61920J68535J75207J83255
$$ plain form
58296 16831726 17023447 17220125 17417524 17615614 17817395 18024330 18236093 18453362 18677203
58287 18677203 18906301 19138258 19373666 19616162 19868273 20129319 20397201 20670305 20948046
58278 20948046 21231414 21522524 21821875 22126840 22434591 22745670 23063075 23389303 23726249
58269 23726249 24076157 24439675 24814084 25196281 25586590 25987262 26398944 26822033 27259853
58260 27259853 27715904 28188159 28670401 29159649 29658367 30168803 30689570 31219570 31761408
58251 31761408 32318043 32888624 33470636 34065055 34676874 35310808 35968051 36647379 37348513
58242 37348513 38074108 38828627 39615610 40436537 41292171 42183525 43110733 44072333 45067057
58233 45067057 46095575 47159996 48263492 49411898 50613985 51878251 53210613 54616750
$$ packed form
58296A6831726J91721J96678J97399J98090K01781K06935K11763K17269K23841
58287A8677203K29098K31957K35408K42496K52111K61046K67882K73104K77741
58278B0948046K83368K91110K99351L04965L07751L11079L17405L26228L36946
58269B3726249L49908L63518L74409L82197L90309M00672M11682M23089M37820
58260B7259853M56051M72255M82242M89248M98718N10436N20767N30000N41838
58251C1761408N56635N70581N82012N94419O11819O33934O57243O79328P01134
58242C7348513P25595P54519P86983Q20927Q55634Q91354R27208R61600R94724
58233D5067057J028518J064421J103496J148406J202087J264266J332362J406137
$$ plain form
58225 54616750 56104937 57684443 59362352 61143659 63033010 65035089 67156319 69409695
58217 69409695 71817414 74407795 77212751 80271162 83632182 87351973 91488667 96101912
58209 96101912 101252536 106996830 113380805 120440152 128200971 136678414 145882638 155835587
58201 155835587 166583891 178197564 190766043 204399843 219222362 235342119 252826172
58194 252826172 271689882 291880494 313237703 335459914 358092352 380486256 401707161
58187 401707161 420522094 435639059 446147004 451842911 453192318 451008809 446147179
58180 446147179 439372764 431336372 422545208 413332575 403875198 394247426 384465177 374506457
58172 374506457 364324597 353859422 343043896 331815458 320138603 308025640 295540839
$$ packed form
58225E4616750J488187J579506J677909J781307J889351K002079K121230K253376
58217F9409695K407719K590381K804956L058411L361020L719791M136694M613245
58209I6101912N150624N744294O383975P059347P760819Q477443R204224R952949
58201A55835587J0748304J1613673J2568479J3633800J4822519J6119757J7484053
58194B52826172J8863710K0190612K1357209K2222211K2632438K2393904K1220905
58187D01707161J8814933J5116965J0507945N695907J349407k183509m861630
58180D46147179o774415q036392q791164r212633r457377r627772r782249r958720
58172C74506457j0181860j0465175j0815526j1228438j1676855j2112963j2484801
$$ plain form
58165 295540839 282791114 269912440 257052650 244351229 231922482 219843629 208145510
58158 208145510 196815685 185827017 175177474 164905088 155067850 145719803 136910105
58151 136910105 128691559 121113916 114206494 107971491 102390506 97429663 93038526 89151040
58143 89151040 85691987 82584665 79758211 77154951 74733684 72465752 70329279 68307537
58135 68307537 66388905 64564356 62825290 61164700 59577714 58058883 56601398 55200881
58127 55200881 53856814 52567630 51327527 50131250 48978748 47870875 46802900 45766985
58119 45766985 44759819 43783267 42838062 41921088 41029150 40161686 39318776 38499073 37700689
58110 37700689 36922489 36163955 35424656 34703554 33998198 33305935 32627197 31965800 31323945
$$ packed form
58165B95540839j2749725j2878674j2859790j2701421j2428747j2078853j1698119
58158B08145510j1329825j0988668j0649543j0272386r837238r348047q809698
58151A36910105q218546p577643o907422o235003n580985m960843m391137l887486
58143H9151040l459053l107322k826454k603260k421267k267932k136473k021742
58135F8307537j918632j824549j739066j660590j586986j518831j457485j400517
58127E5200881j344067j289184j240103j196277j152502j107873j067975j035915
58119D5766985j007166r76552r45205r16974q91938q67464q42910q19703p98384
58110C7700689p78200p58534p39299p21102p05356o92263o78738o61397o41855
$$ plain form
58101 31323945 30698404 30084118 29480462 28891445 28320458 27767102 27228457 26701294 26183775
58092 26183775 25677292 25185979 24712409 24254654 23809699 23378273 22963254 22564219 22177183
58083 22177183 21799754 21433198 21078800 20735094 20399794 20072245 19752962 19442377 19140626
58074 19140626 18847134 18560367 18279812 18008085 17748716 17501440 17262028 17027548 16799446
58065 16799446 16580344 16369821 16164991 15963754 15765895 15571957 15382625 15198872 15021556
58056 15021556 14850645 14685108 14523444 14364612 14209044 14058597 13914852 13777726 13646302
58047 13646302 13520168 13398785 13280603 13164785 13053096 12947729 12847534 12749012 12651164 12556408
58037 12556408 12465915 12377259 12288360 12200912 12117399 12036858 11956633 11876948 11800646 11728911 11660185
$$ packed form
58101C1323945o25541o14286o03656n89017n70987n53356n38645n27163n17519
58092B6183775n06483m91313m73570m57755m44955m31426m15019l99035l87036
58083B2177183l77429l66556l54398l43706l35300l27549l19283l10585l01751
58074A9140626k93492k86767k80555k71727k59369k47276k39412k34480k28102
58065A6799446k19102k10523k04830k01237j97859j93938j89332j83753j77316
58056A5021556j70911j65537j61664j58832j55568j50447j43745j37126j31424
58047A3646302j26134j21383j18182j15818j11689j05367j00195r8522r7848r4756
58037A2556408r0493q8656q8899q7448q3513q0541q0225p9685p6302p1735o8726
$$ plain form
58026 11660185 11593379 11529358 11468570 11409646 11351505 11294893 11240349 11186163 11130220 11073110 11017693
58015 11017693 10965804 10916957 10870296 10826186 10785160 10746532 10709199 10673112 10638728 10605290 10571062
58004 10571062 10535646 10500968 10469132 10439890 10410932 10380345 10348118 10315546 10284020 10254482 10227423
57993 10227423 10203003 10181247 10162055 10144936 10129018 10113689 10098993 10085054 10071378 10057136 10041831
57982 10041831 10025250 10007199 9988093 9969566 9953404 9939537 9925884 9910728 9894871 9880928 9870599
57971 9870599 9862935 9855363 9846189 9835890 9825990 9817167 9809043 9801490 9795028 9789510 9783437 9775478 9766187 9757528
57957 9757528 9751143 9747644 9746790 9747252 9746759 9743795 9739216 9735364 9733783 9734560 9737318 9741545 9746265 9750913 9756534
57942 9756534 9764708 9775202 9786094 9796280 9806275 9816263 9825198 9832523 9839125 9845726 9851958 9858052 9865665
$$ packed form
58026A1660185o6806o4021o0788n8924n8141n6612n4544n4186n5943n7110n5417
58015A1017693n1889m8847m6661m4110m1026l8628l7333l6087l4384l3438l4228
58004A0571062l5416l4678l1836k9242k8958l0587l2227l2572l1526k9538k7059
57993A0227423k4420k1756j9192j7119j5918j5329j4696j3939j3676j4242j5305
57982A0041831j6581j8051j9106j8527j6162j3867j3653j5156j5857j3943j0329
57971I870599p664p572r174j0299r900q823q124p553o462n518o073p959r291q659
57957I757528o385l499q54M62m93k964m579l852j581P77K758M227M720M648N621
57942I756534Q174J0494J0892J0186R995R988Q935P325O602O601O232O094P613
$$ plain form
57929 9865665 9875479 9885413 9893034 9898728 9904512 9910516 9914784 9916394 9916748 9917548 9918991 9920239 9920412 9919019 9916649
57914 9916649 9915165 9915719 9916523 9914340 9908646 9902610 9899268 9898378 9898185 9898735 9901636 9907136 9913031 9916529 9916492 9914200
57898 9914200 9912687 9914736 9920482 9927116 9931746 9934203 9936309 9939082 9942119 9945496 9950510 9957972 9967087 9976890
57884 9976890 9987792 10000588 10014465 10027285 10037974 10047767 10058718 10071425 10084582 10096430 10106254 10114485
57872 10114485 10121852 10128748 10135294 10141688 10148417 10156277 10165937 10177043 10187825 10196374 10202637 10208466 10215298
57859 10215298 10222708 10230140 10239110 10251889 10268019 10283941 10296776 10307135 10317340 10328272 10339275 10350197
57847 10350197 10361731 10373943 10386000 10397471 10408660 10419463 10429268 10438436 10448672 10461135 10475091
57836 10475091 10489265 10503632 10518714 10533677 10546614 10556982 10566748 10578664 10593954 10612022 10631782
$$ packed form
57929I865665R814R934P621N694N784O004M268J610L54Q00J443J248J73j393k370
57914I916649j484N54Q04k183n694o036l342q90j93N50K901N500N895L498l7k292
57898I914200j513K049N746O634M630K457K106K773L037L377N014P462R115R803
57884I976890J0902J2796J3877J2820J0689R793J0951J2707J3157J1848R824Q231
57872A0114485P367O896O546O394O729P860R660J1106J0782Q549O263N829O832
57859A0215298P410P432Q970J2779J6130J5922J2835J0359J0205J0932J1003J0922
57847A0350197J1534J2212J2057J1471J1189J0803R805R168J0236J2463J3956
57836A0475091J4174J4367J5082J4963J2937J0368R766J1916J5290J8068J9760
$$ plain form
57825 10631782 10652519 10673505 10693343 10710246 10723315 10733622 10743727 10755673 10769474 10783813 10797975
57814 10797975 10812417 10827582 10843048 10858307 10873565 10889055 10904193 10918410 10932477 10947824 10964377
57803 10964377 10980039 10992724 11002377 11010839 11020538 11033337 11049486 11067023 11083087 11096535 11108521 11120016
57791 11120016 11130175 11138373 11146457 11156896 11169373 11181477 11192608 11204639 11218298 11231665 11243736
57780 11243736 11257090 11274686 11295355 11314955 11331411 11346308 11361583 11376876 11390773 11403122 11415351
57769 11415351 11429481 11447179 11468569 11491271 11511572 11527546 11540761 11554592 11571347 11591215 11613043
57758 11613043 11635242 11656359 11675821 11694371 11713430 11733731 11754505 11773917 11790418 11804065 11816733
57747 11816733 11830828 11847602 11866733 11887476 11909777 11933958 11959411 11984002 12005195 12021962 12035490
$$ packed form
57825A0631782K0737K0986J9838J6903J3069J0307J0105J1946J3801J4339J4162
57814A0797975J4442J5165J5466J5259J5258J5490J5138J4217J4067J5347J6553
57803A0964377J5662J2685R653Q462R699J2799J6149J7537J6064J3448J1986J1495
57791A1120016J0159Q198Q084J0439J2477J2104J1131J2031J3659J3367J2071
57780A1243736J3354J7596K0669J9600J6456J4897J5275J5293J3897J2349J2229
57769A1415351J4130J7698K1390K2702K0301J5974J3215J3831J6755J9868K1828
57758A1613043K2199K1117J9462J8550J9059K0301K0774J9412J6501J3647J2668
57747A1816733J4095J6774J9131K0743K2301K4181K5453K4591K1193J6767J3528
$$ plain form
57736 12035490 12047965 12060946 12075149 12091066 12108626 12126213 12141211 12151993 12158553 12161056 12159287 12154416
57724 12154416 12149742 12148072 12149313 12152197 12157357 12166438 12178599 12190518 12200370 12209638 12220257 12232070 12244294
57711 12244294 12257496 12272160 12286553 12298210 12307295 12316750 12329054 12344286 12361543 12380784 12402426
57700 12402426 12426092 12450819 12476090 12501616 12526067 12547345 12565060 12581998 12601618 12624060 12646186
57689 12646186 12666213 12686651 12711218 12740042 12769937 12798876 12827929 12858673 12890908 12923828 12957650
57678 12957650 12992775 13028520 13064091 13100353 13139657 13183923 13233130 13284968 13335640 13381625 13421224
57667 13421224 13454327 13481244 13502868 13521513 13539459 13555946 13567277 13571222 13570323 13569971 13574112 13583426
57655 13583426 13596221 13609770 13621679 13631250 13639267 13646145 13651549 13656387 13663249 13673365 13684629 13694503
$$ packed form
57736A2035490J2475J2981J4203J5917J7560J7587J4998J0782O560K503j769m871
57724A2154416m674j670J241K884N160R081J2161J1919R852R268J0619J1813J2224
57711A2244294J3202J4664J4393J1657R085R455J2304J5232J7257J9241K1642
57700A2402426K3666K4727K5271K5526K4451K1278J7715J6938J9620K2442K2126
57689A2646186K0027K0438K4567K8824K9895K8939K9053L0744L2235L2920L3822
57678A2957650L5125L5745L5571L6262L9304M4266M9207N1838N0672M5985L9599
57667A3421224L3103K6917K1624J8645J7946J6487J1331L945q99l52M141R314
57655A3583426J2795J3549J1909R571Q017O878N404M838O862J0116J1264R874
$$ plain form
57643 13694503 13703595 13714337 13727156 13740384 13753393 13767131 13781392 13794018 13803585 13811016 13817743 13824047
57631 13824047 13830454 13839460 13854083 13874605 13897561 13918452 13935608 13951282 13968557 13987367 14004773
57620 14004773 14019556 14034721 14053879 14076436 14098579 14118209 14136393 14154203 14170987 14186513 14202254
57609 14202254 14219212 14236407 14253070 14270656 14290767 14312041 14331122 14346700 14361302 14378810 14400742
57598 14400742 14424789 14446691 14464022 14478482 14494013 14512682 14533446 14555111 14578500 14604235 14629894
57587 14629894 14651884 14670048 14688375 14710595 14736516 14763166 14787945 14809656 14827980 14843887 14860070
57576 14860070 14879002 14900033 14919807 14936312 14951339 14968009 14986966 15006498 15025509 15044264 15062213
57565 15062213 15077487 15089557 15100570 15112726 15125816 15138871 15152818 15169389 15188157 15206916 15224752
$$ packed form
57643A3694503R092J0742J2819J3228J3009J3738J4261J2626R567P431O727O304
57631A3824047O407R006J4623K0522K2956K0891J7156J5674J7275J8810J7406
57620A4004773J4783J5165J9158K2557K2143J9630J8184J7810J6784J5526J5741
57609A4202254J6958J7195J6663J7586K0111K1274J9081J5578J4602J7508K1932
57598A4400742K4047K1902J7331J4460J5531J8669K0764K1665K3389K5735K5659
57587A4629894K1990J8164J8327K2220K5921K6650K4779K1711J8324J5907J6183
57576A4860070J8932K1031J9774J6505J5027J6670J8957J9532J9011J8755J7949
57565A5062213J5274J2070J1013J2156J3090J3055J3947J6571J8768J8759J7836
$$ plain form
57554 15224752 15242612 15260754 15277681 15292128 15304419 15315468 15326078 15337643 15351590 15367312 15382500
57543 15382500 15396727 15413093 15434923 15462063 15491804 15522126 15552400 15582124 15611256 15641410 15674618
57532 15674618 15710699 15747323 15782882 15818048 15854580 15894142 15938562 15989455 16046402 16106187 16164618
57521 16164618 16218877 16268193 16313526 16357348 16402672 16450773 16499805 16546290 16588011 16625090 16658832
57510 16658832 16690601 16721807 16753735 16786458 16818426 16848072 16875804 16903636 16932614 16961359 16987727
57499 16987727 17011445 17034363 17058319 17083578 17109278 17134242 17157001 17176281 17192753 17209765 17230733
57488 17230733 17255521 17280434 17302219 17321162 17339755 17359474 17380075 17401338 17423879 17448102 17473616
57477 17473616 17500059 17527281 17554333 17579723 17603746 17629259 17658350 17688876 17716288 17739018 17760370
$$ packed form
57554A5224752J7860J8142J6927J4447J2291J1049J0610J1565J3947J5722J5188
57543A5382500J4227J6366K1830K7140K9741L0322L0274K9724K9132L0154L3208
57532A5674618L6081L6624L5559L5166L6532L9562M4420N0893N6947N9785N8431
57521A6164618N4259M9316M5333M3822M5324M8101M9032M6485M1721L7079L3742
57510A6658832L1769L1206L1928L2723L1968K9646K7732K7832K8978K8745K6368
57499A6987727K3718K2918K3956K5259K5700K4964K2759J9280J6472J7012K0968
57488A7230733K4788K4913K1785J8943J8593J9719K0601K1263K2541K4223K5514
57477A7473616K6443K7222K7052K5390K4023K5513K9091L0526K7412K2730K1352
$$ plain form
57466 17760370 17784700 17813306 17844656 17876879 17908791 17939808 17970460 18002359 18036386 18071521 18106718
57455 18106718 18143111 18182586 18224438 18265432 18303607 18340406 18378155 18416753 18454102 18489207 18523618
57444 18523618 18559648 18597886 18636717 18673923 18708402 18740415 18770760 18800252 18829803 18860061 18890609
57433 18890609 18920200 18948164 18974950 19001012 19026236 19051233 19078003 19107866 19139508 19170621 19200974
57422 19200974 19232100 19264055 19294586 19322118 19347911 19374273 19401758 19429284 19456457 19484886 19517211
57411 19517211 19554824 19596035 19636683 19673533 19707291 19741380 19777747 19815089 19851396 19886453 19920684
57400 19920684 19952867 19980729 20003591 20023279 20042449 20062816 20084795 20107781 20130427 20151224 20169374
57389 20169374 20185233 20199909 20214429 20229186 20244182 20259734 20276542 20294829 20313870 20332993 20352687
$$ packed form
57466A7760370K4330K8606L1350L2223L1912L1017L0652L1899L4027L5135L5197
57455A8106718L6393L9475M1852M0994L8175L6799L7749L8598L7349L5105L4411
57444A8523618L6030L8238L8831L7206L4479L2013L0345K9492K9551L0258L0548
57433A8890609K9591K7964K6786K6062K5224K4997K6770K9863L1642L1113L0353
57422A9200974L1126L1955L0531K7532K5793K6362K7485K7526K7173K8429L2325
57411A9517211L7613M1211M0648L6850L3758L4089L6367L7342L6307L5057L4231
57400A9920684L2183K7862K2862J9688J9170K0367K1979K2986K2646K0797J8150
57389B0169374J5859J4676J4520J4757J4996J5552J6808J8287J9041J9123J9694
$$ plain form
57378 20352687 20374095 20397746 20423510 20451274 20480396 20508816 20534465 20558113 20583420 20613292 20647026
57367 20647026 20681793 20716086 20750788 20787341 20825749 20864323 20900964 20934724 20966105 20995669 21022872
57356 21022872 21047240 21070526 21096227 21126240 21158648 21189345 21215444 21237177 21257284 21278667 21301754
57345 21301754 21324196 21344078 21363020 21384419 21408739 21432866 21454797 21476314 21499302 21521709 21539967
57334 21539967 21554302 21568691 21585569 21603170 21618827 21632840 21647767 21665116 21684149 21703485 21722689
57323 21722689 21742153 21762400 21784105 21808319 21835688 21865215 21894620 21922477 21949325 21976079 22002322
57312 22002322 22027301 22051547 22075642 22097975 22116091 22130351 22143855 22158264 22172183 22184575 22197067
57301 22197067 22211145 22225518 22238673 22252459 22270670 22294911 22323804 22355241 22387513 22419456 22451704
$$ packed form
57378B0352687K1408K3651K5764K7764K9122K8420K5649K3648K5307K9872L3734
57367B0647026L4767L4293L4702L6553L8408L8574L6641L3760L1381K9564K7203
57356B1022872K4368K3286K5701L0013L2408L0697K6099K1733K0107K1383K3087
57345B1301754K2442J9882J8942K1399K4320K4127K1931K1517K2988K2407J8258
57334B1539967J4335J4389J6878J7601J5657J4013J4927J7349J9033J9336J9204
57323B1722689J9464K0247K1705K4214K7369K9527K9405K7857K6848K6754K6243
57312B2002322K4979K4246K4095K2333J8116J4260J3504J4409J3919J2392J2492
57301B2197067J4078J4373J3155J3786J8211K4241K8893L1437L2272L1943L2248
$$ plain form
57290 22451704 22486754 22525228 22563032 22595221 22622403 22650221 22682184 22715910 22746966 22773324 22794737
57279 22794737 22810801 22822133 22831600 22841548 22850307 22853651 22849838 22841635 22833064 22825233 22815815 22801875 22782677
57266 22782677 22760024 22736394 22713065 22690084 22667698 22647275 22630493 22617688 22607295 22597170 22586515
57255 22586515 22575966 22565280 22551662 22531919 22506520 22479903 22455705 22432819 22407391 22377712 22345538
57244 22345538 22313159 22281100 22248952 22216895 22185686 22155901 22127662 22100532 22073426 22045138 22015338
57233 22015338 21985074 21956405 21931414 21910929 21893904 21878890 21866590 21860037 21861530 21870459 21885363 21907307
57221 21907307 21939811 21986019 22047373 22124708 22218972 22330568 22458888 22602536 22759315 22926391
57211 22926391 23101179 23281250 23462212 23636583 23796493 23937365 24057884 24157659 24237412 24300945
$$ packed form
57290B2451704L5050L8474L7804L2189K7182K7818L1963L3726L1056K6358K1413
57279B2794737J6064J1332R467R948Q759L344l813q203q571p831r418j3940j9198
57266B2782677k2653k3630k3329k2981k2386k0423j6782j2805j0393j0125j0655
57255B2586515j0549j0686j3618j9743k5399k6617k4198k2886k5428k9679l2174
57244B2345538l2379l2059l2148l2057l1209k9785k8239k7130k7106k8288k9800
57233B2015338l0264k8669k4991k0485j7025j5014j2300o553J493Q929J4904K1944
57221B1907307L2504M6208O1354P7335R4264J11596J28320J43648J56779J67076
57211B2926391J74788J80071J80962J74371J59910J40872J20519R9775P9753O3533
$$ plain form
57201 24300945 24353377 24395511 24421433 24423176 24397103 24345093 24270476 24173889 24052510 23902298 23720788
57190 23720788 23508003 23264962 22991886 22688403 22355146 21994632 21610945 21208955 20793115
57181 20793115 20366132 19929308 19484674 19035828 18585804 18135271 17684087 17233622 16786347
57172 16786347 16344317 15909428 15483413 15065290 14650021 14232173 13809914 13383120 12949270
57163 12949270 12504769 12049226 11584058 11106800 10611010 10092340 9550367 8983223 8384914
57154 8384914 7750212 7078312 6368872 5617752 4819916 3973834 3079384 2133170 1129357
57145 1129357 64008 -1064406 -2257741 -3518269 -4846681 -6242766 -7708121 -9246018
57137 -9246018 -10858957 -12548434 -14316734 -16166456 -18097813 -20108111 -22194338 -24355173
$$ packed form
57201B4300945N2432M2134K5922J743k6073n2010p4617r6587j21379j50212j81510
57190B3720788k12785k43041k73076l03483l33257l60514l83687m01990m15840
57181B0793115m26983m36824m44634m48846m50024m50533m51184m50465m47275
57172A6786347m42030m34889m26015m18123m15269m17848m22259m26794m33850
57163A2949270m44501m55543m65168m77258m95790n18670n41973n67144n98309
57154H384914o34702o71900p09440p51120p97836q46082q94450r46214j003813
57145A129357F4008a064406j193335j260528j328412j396085j465355j537897
57137i246018j612939j689477j768300j849722j931357k010298k086227k160835
$$ plain form
57129 -24355173 -26590332 -28898912 -31278210 -33723472 -36229415 -38793039 -41414347 -44093611
57121 -44093611 -46829289 -49620257 -52469079 -55380904 -58359314 -61404817 -64516939 -67695856
57113 -67695856 -70941921 -74255556 -77638806 -81097053 -84640113 -88283539 -92049997 -95970238
57105 -95970238 -100084456 -104444372 -109113362 -114162118 -119661128 -125672875 -132244477 -139400055
57097 -139400055 -147132778 -155396233 -164095929 -173087148 -182186912 -191197630 -199930035 -208219844
57089 -208219844 -215945650 -223049650 -229544456 -235493724 -240983888 -246113097 -250989372 -255701214
57081 -255701214 -260251984 -264504093 -268184927 -270952781 -272478602 -272515602 -270963214 -267923895
57073 -267923895 -263712283 -258771429 -253505283 -248103027 -242449810 -236178978 -228850530 -220172351
$$ packed form
57129b4355173k235159k308580k379298k445262k505943k563624k621308k679264
57121d4093611k735678k790968k848822k911825k978410l045503l112122l178917
57113f7695856l246065l313635l383250l458247l543060l643426l766458l920241
57105i5970238m114218m359916m668990n048756n499010o011747o571602p155578
57097a39400055p732723q263455q699696q991219r099764r010718q732405q289809
57089b08219844p725806p104000o494806n949268n490164n129209m876275m711842
57081b55701214m550770m252109l680834k767854j525821l7000J552388L039319
57073b67923895M211612M940854N266146N402256N653217O270832P328448Q678179
$$ plain form
57065 -220172351 -210146685 -199055397 -187293852 -175165595 -162776603 -150091317 -137091472
57058 -137091472 -123905360 -110801684 -98049125 -85753439 -73810669 -62025164 -50303572
57051 -50303572 -38774297 -27751794 -17592427 -8552813 -725491 5946548 11615294 16470179
57043 16470179 20697407 24459691 27889429 31086998 34121421 37033920 39843205 42551644
57035 42551644 45153908 47646752 50033371 52319674 54509609 56606314 58615257 60542373
57027 60542373 62389529 64154337 65833529 67423955 68921035 70319122 71613443 72800202
57019 72800202 73876644 74844469 75712704 76494347 77200584 77840872 78427109 78973365 79491492
57010 79491492 79990879 80482370 80977613 81482824 81996308 82512674 83025428 83524574 83996997
$$ packed form
57065b20172351J0025666J1091288J1761545J2128257J2388992J2685286J2999845
57058a37091472J3186112J3103676J2752559J2295686J1942770J1785505J1721592
57051e0303572J1529275J1022503J0159367h552813g25491E946548N668746M854885
57043A6470179M227228L762284L429738L197569L034423K912499K809285K708439
57035D2551644K602264K492844K386619K286303K189935K096705K008943J927116
57027F0542373J847156J764808J679192J590426J497080J398087J294321J186759
57019G2800202J076442R67825Q68235P81643P06237O40288N86237N46256N18127
57010G9491492M99387M91491M95243N05211N13484N16366N12754M99146M72423
$$ plain form
57001 83996997 84433092 84830867 85191816 85516482 85806978 86070330 86314759 86543670 86755883
56992 86755883 86949792 87123893 87274911 87399811 87500074 87581282 87648397 87703722 87748854 87785064
56982 87785064 87810060 87815671 87789314 87716750 87584032 87379925 87099071 86743119 86318159 85830642
56972 85830642 85285249 84685938 84038357 83350337 82629053 81878145 81099445 80297994 79483368
56963 79483368 78664635 77845567 77026664 76210885 75405118 74616075 73846284 73094050 72355876
56954 72355876 71628947 70912834 70209525 69521398 68849585 68195496 67563766 66961933 66396040
56945 66396040 65866816 65370585 64903453 64464164 64053480 63671997 63319143 62993252 62690779
56936 62690779 62404896 62126595 61848883 61569445 61288165 61003239 60711899 60414226 60113319
$$ packed form
57001H3996997M36095L97775L60949L24666K90496K63352K44429K28911K12213
56992H6755883J93909J74101J51018J24900J00263Q1208O7115N5325M5132L6210
56982H7785064K4996N611k6357p2564j32718k04107k80854l55952m24960m87517
56972H5830642n45393n99311o47581o88020p21284p50908p78700q01451q14626
56963G9483368q18733q19068q18903q15779q05767p89043p69791p52234p38174
56954G2355876p26929p16113p03309o88127o71813o54089o31730o01833n65893
56945F6396040n29224m96231m67132m39289m10684l81483l52854l25891l02473
56936F2690779k85883k78301k77712k79438k81280k84926k91340k97673l00907
$$ plain form
56927 60113319 59811280 59507648 59202453 58898061 58596724 58299020 58006585 57723747 57453579
56918 57453579 57193903 56939688 56687819 56436390 56180410 55912026 55625674 55320321 54996132
56909 54996132 54651533 54284961 53897809 53494261 53079107 52656680 52231281 51807859 51392238
56900 51392238 50990455 50607135 50244702 49905104 49592323 49312168 49069255 48864735 48696928
56891 48696928 48563306 48461540 48389129 48342349 48315381 48300469 48289083 48273043 48245252 48200777 48137597
56880 48137597 48055145 47951614 47824180 47672899 47502831 47320577 47129611 46930771 46726754
56871 46726754 46524200 46331249 46154119 45995587 45855395 45732170 45625774 45537003 45463970 45400114
56861 45400114 45337629 45271956 45200993 45121481 45029633 44925287 44811958 44691942 44564361 44429412
$$ packed form
56927F0113319l02039l03632l05195l04392l01337k97704k92435k82838k70168
56918E7453579k59676k54215k51869k51429k55980k68384k86352l05353l24189
56909E4996132l44599l66572l87152m03548m15154m22427m25399m23422m15621
56900E1392238m01783l83320l62433l39598l12781k80155k42913k04520j67807
56891D8696928j33622j01766p2411m6780k6968j4912j1386j6040k7791m4475o3180
56880D8137597q2452j03531j27434j51281j70068j82254j90966j98840k04017
56871D6726754k02554j92951j77130j58532j40192j23225j06396q8771p3033o3856
56861D5400114o2485o5673p0963p9512r1848j04346j13329j20016j27581j34949
$$ plain form
56851 44429412 44291789 44157720 44030192 43908788 43792701 43682005 43576944 43477821 43385169 43298758
56841 43298758 43217003 43138438 43063092 42991216 42921374 42851061 42778644 42703221 42622857 42534579 42436626
56830 42436626 42329851 42216577 42098761 41977620 41854543 41731740 41611631 41495346 41381815
56821 41381815 41268700 41154529 41039773 40925940 40814072 40704321 40596528 40490899 40388170
56812 40388170 40288994 40192634 40096276 39996321 39890634 39779134 39662368 39540464 39413885 39284324
56802 39284324 39154103 39024970 38897750 38772566 38648869 38525750 38402968 38281481 38162423
56793 38162423 38045600 37929562 37813353 37697880 37585112 37475841 37368527 37260904 37152511
56784 37152511 37044716 36937882 36829530 36716306 36597278 36474421 36350475 36227402 36106225
$$ packed form
56851D4429412j37623j34069j27528j21404j16087j10696j05061r9123r2652q6411
56841D3298758q1755p8565p5346p1876o9842p0313p2417p5423q0364q8278r7953
56830D2436626j06775j13274j17816j21141j23077j22803j20109j16285j13531
56821D1381815j13115j14171j14756j13833j11868j09751j07793j05629j02729
56812D0388170r9176r6360r6358r9955j05687j11500j16766j21904j26579j29561
56802C9284324j30221j29133j27220j25184j23697j23119j22782j21487j19058
56793C8162423j16823j16038j16209j15473j12768j09271j07314j07623j08393
56784C7152511j07795j06834j08352j13224j19028j22857j23946j23073j21177
$$ plain form
56775 36106225 35986688 35867150 35746402 35625780 35508069 35394137 35282143 35170329 35058858
56766 35058858 34948346 34838423 34728819 34620328 34513243 34405984 34296778 34186062 34075976
56757 34075976 33968088 33862601 33759053 33656469 33553233 33448042 33340911 33232702 33124238
56748 33124238 33016494 32910598 32806561 32703043 32599977 32500465 32407887 32321270 32235705 32147899
56738 32147899 32059576 31974551 31893935 31815278 31735443 31652996 31568306 31482624 31397406 31313953 31232959
56727 31232959 31153887 31074778 30993567 30910555 30829089 30752493 30680275 30608597 30534670 30459227 30384237
56716 30384237 30310029 30236083 30163169 30092460 30023149 29953325 29883508 29817010 29755707 29697209 29637737
56705 29637737 29576486 29515270 29454714 29393152 29329457 29264858 29201008 29137708 29073597 29008057 28941463
$$ packed form
56775C6106225j19537j19538j20748j20622j17711j13932j11994j11814j11471
56766C5058858j10512j09923j09604j08491j07085j07259j09206j10716j10086
56757C4075976j07888j05487j03548j02584j03236j05191j07131j08209j08464
56748C3124238j07744j05896j04037j03518j03066r9512r2578q6617q5565q7806
56738C2147899q8323q5025q0616p8657p9835q2447q4690q5682q5218q3453q0994
56727C1232959p9072p9109q1211q3012q1466p6596p2218p1678p3927p5443p4990
56716C0384237p4208p3946p2914p0709o9311o9824o9817o6498o1303n8498n9472
56705B9637737o1251o1216o0556o1562o3695o4599o3850o3300o4111o5540o6594
$$ plain form
56694 28941463 28874470 28808117 28743878 28682322 28622040 28560927 28498273 28434934 28372225 28311652 28254799
56683 28254799 28201635 28149280 28094363 28036747 27979283 27923678 27868501 27811808 27753902 27696423 27640182
56672 27640182 27585092 27531134 27478263 27426315 27375862 27328056 27282697 27237771 27192170 27147596 27106155
56661 27106155 27067200 27028522 26989838 26952824 26917940 26883393 26847393 26809403 26768958 26725487 26680324
56650 26680324 26637207 26599429 26567324 26539077 26512664 26486274 26458384 26428964 26399742 26371927 26344262
56639 26344262 26314561 26282527 26249632 26216744 26183542 26150267 26118321 26088519 26059960 26031364 26002562
56628 26002562 25973990 25945562 25917000 25888721 25861311 25834368 25806848 25778595 25750679 25723987 25698219
56617 25698219 25672658 25647425 25623509 25601738 25581985 25563129 25543601 25522404 25500002 25477950 25457180
$$ packed form
56694B8941463o6993o6353o4239o1556o0282o1113o2654o3339o2709o0573n6853
56683B8254799n3164n2355n4917n7616n7464n5605n5177n6693n7906n7479n6241
56672B7640182n5090n3958n2871n1948n0453m7806m5359m4926m5601m4574m1441
56661B7106155l8955l8678l8684l7014l4884l4547l6000l7990m0445m3471m5163
56650B6680324m3117l7778l2105k8247k6413k6390k7890k9420k9222k7815k7665
56639B6344262k9701l2034l2895l2888l3202l3275l1946k9802k8559k8596k8802
56628B6002562k8572k8428k8562k8279k7410k6943k7520k8253k7916k6692k5768
56617B5698219k5561k5233k3916k1771j9753j8856j9528k1197k2402k2052k0770
$$ plain form
56606 25457180 25436808 25415208 25392282 25369997 25350100 25331522 25310797 25285543 25257104 25228789 25201464
56595 25201464 25172324 25139145 25104511 25073497 25047208 25021141 24991097 24958524 24928073 24901530 24876850
56584 24876850 24852421 24829238 24808214 24787706 24765041 24739393 24712357 24686620 24664293 24645345 24627275
56573 24627275 24607531 24586555 24567068 24550324 24535117 24521006 24509818 24502105 24494351 24482605 24467974
56562 24467974 24455805 24449320 24446131 24441305 24432154 24419588 24406322 24394384 24383422 24370974 24355100 24336904
56550 24336904 24319570 24304645 24290203 24273213 24253256 24233397 24217474 24206398 24196881 24184110 24166164
56539 24166164 24145666 24126757 24110893 24096095 24079596 24060312 24039141 24017951 23998195 23979506 23959603
56528 23959603 23936349 23909958 23882721 23856958 23833998 23814496 23798220 23783318 23767060 23747957 23726625
$$ packed form
56606B5457180k0372k1600k2926k2285j9897j8578k0725k5254k8439k8315k7325
56595B5201464k9140l3179l4634l1014k6289k6067l0044l2573l0451k6543k4680
56584B4876850k4429k3183k1024k0508k2665k5648k7036k5737k2327j8948j8070
56573B4627275j9744k0976j9487j6744j5207j4111j1188p713p754j1746j4631
56562B4467974j2169o485l189m826r151j2566j3266j1938j0962j2448j5874j8196
56550B4336904j7334j4925j4442j6990j9957j9859j5923j1076r517j2771j7946
56539B4166164k0498j8909j5864j4798j6499j9284k1171k1190j9756j8689j9903
56528B3959603k3254k6391k7237k5763k2960j9502j6276j4902j6258j9103k1332
$$ plain form
56517 23726625 23704440 23682101 23659690 23637519 23616430 23597311 23580106 23563165 23544250 23522878 23501189
56506 23501189 23481701 23464628 23448105 23430423 23411065 23390366 23369529 23350469 23334161 23319438 23304688
56495 23304688 23289979 23275783 23260423 23241483 23219771 23199094 23181341 23164350 23145842 23127020 23110432
56484 23110432 23096137 23082077 23066984 23050905 23033826 23015962 22999033 22985301 22975179 22966960 22958726
56473 22958726 22949287 22937480 22922178 22903733 22884609 22867876 22854956 22844663 22834265 22821775 22807502
56462 22807502 22793192 22779734 22766365 22752166 22737264 22722035 22706068 22688842 22670837 22653232 22636724
56451 22636724 22621023 22604992 22587268 22567834 22549416 22535924 22528537 22524224 22518972 22511373 22502105 22491454
56439 22491454 22479234 22466238 22453695 22441438 22428461 22415325 22404306 22396567 22390520 22383729 22375683 22367889
$$ packed form
56517B3726625k2185k2339k2411k2171k1089j9119j7205j6941j8915k1372k1689
56506B3501189j9488j7073j6523j7682j9358k0699k0837j9060j6308j4723j4750
56495B3304688j4709j4196j5360j8940k1712k0677j7753j6991j8508j8822j6588
56484B3110432j4295j4060j5093j6079j7079j7864j6929j3732j0122q219q234
56473B2958726r439j1807j5302j8445j9124j6733j2920j0293j0398j2490j4273
56462B2807502j4310j3458j3369j4199j4902j5229j5967j7226j8005j7605j6508
56451B2636724j5701j6031j7724j9434j8418j3492p387m313n252p599r268j0651
56439B2491454j2220j2996j2543j2257j2977j3136j1019p739o047o791q046p794
$$ plain form
56427 22367889 22361450 22355077 22345966 22333039 22319016 22308372 22303096 22301523 22301198 22300904 22299079 22292727 22280218
56414 22280218 22263733 22246583 22229032 22209092 22186486 22162861 22138509 22112198 22084682 22059227 22037504
56403 22037504 22017556 21997140 21976554 21956515 21935681 21912547 21888036 21863854 21839755 21815124 21792153
56392 21792153 21774158 21760589 21746689 21729028 21709051 21689904 21672002 21654055 21637113 21624355 21616200
56381 21616200 21608063 21594942 21577315 21560639 21549403 21543573 21540869 21539831 21539059 21535597 21526982 21514502 21501955
56368 21501955 21491154 21480746 21469672 21459153 21450147 21441170 21430579 21419671 21411415 21406732 21403769 21400449
56356 21400449 21396016 21389990 21381346 21369766 21356985 21345988 21338572 21333779 21328870 21322062 21314184 21307308 21302015
56343 21302015 21296819 21290265 21282589 21275024 21268499 21263487 21260123 21257764 21255232 21252203 21249635 21248189 21247075 21245155
$$ packed form
56427B2367889o439o373r111j2927j4023j0644n276j573l25k94j825o352j2509
56414B2280218j6485j7150j7551j9940k2606k3625k4352k6311k7516k5455k1723
56403B2037504j9948k0416k0586k0039k0834k3134k4511k4182k4099k4631k2971
56392B1792153j7995j3569j3900j7661j9977j9147j7902j7947j6942j2758q155
56381B1616200q137j3121j7627j6676j1236n830k704j038p72l462q615j2480j2547
56368B1501955j0801j0408j1074j0519r006q977j0591j0908q256m683k963l320
56356B1400449m433o026q644j1580j2781j0997p416m793m909o808p878o876n293
56343B1302015n196o554p676p565o525n012l364k359k532l029k568j446j114j920
$$ plain form
56329 21245155 21242245 21238591 21234141 21229436 21226061 21224635 21223095 21218715 21211591 21204591 21199880 21196906 21194001 21190765
56315 21190765 21188374 21188155 21190057 21192352 21193258 21193065 21193600 21194965 21194476 21190429 21185387 21183303 21184271 21184991 21184197 21184470
56299 21184470 21188051 21193772 21199362 21204223 21208352 21210791 21211265 21211906 21215415 21222529 21232571 21244934 21258408
56286 21258408 21270672 21280676 21290430 21302331 21315735 21328492 21340841 21355061 21371857 21390189 21410708
56275 21410708 21436068 21466904 21500239 21533252 21566375 21601291 21638188 21676871 21718616 21764529 21813278
56264 21813278 21863082 21915568 21975378 22045583 22124934 22209843 22297971 22389919 22488557 22596696 22714428
56253 22714428 22838853 22967384 23100988 23242844 23394011 23552090 23714311 23879998 24049128
56244 24049128 24220031 24389765 24555595 24714697 24863405 24998798 25121112 25233048 25335946
$$ packed form
56329B1245155k910l654m450m705l375j426j540m380p124p000m711k974k905l236
56315B1190765k391k19J902K295R06j93N35J365m89m047n042k084R68P20p94K73
56299B1184470L581N721N590M861M129K439M74O41L509P114J0042J2363J3474
56286B1258408J2264J0004R754J1901J3404J2757J2349J4220J6796J8332K0519
56275B1410708K5360L0836L3335L3013L3123L4916L6897L8683M1745M5913M8749
56264B1813278M9804N2486N9810P0205P9351Q4909Q8128R1948R8638J08139J17732
56253B2714428J24425J28531J33604J41856J51167J58079J62221J65687J69130
56244B4049128J70903J69734J65830J59102J48708J35393J22314J11936J02898
$$ plain form
56235 25335946 25427374 25502824 25559263 25596877 25618107 25625526 25620228 25601612 25568635 25521154 25459931
56224 25459931 25385741 25299595 25204270 25104454 25003912 24902459 24796800 24684719 24567511 24447875
56214 24447875 24326450 24201591 24072153 23939320 23805602 23673093 23542924 23415448 23290206
56205 23290206 23166415 23044286 22925684 22813074 22708063 22611140 22522035 22439536 22361453 22285825
56195 22285825 22212332 22142084 22076308 22015754 21960929 21911891 21867798 21827361 21789586 21753502 21717787
56184 21717787 21682047 21648361 21619969 21597881 21579923 21563524 21548219 21534729 21523024 21512613 21504133
56173 21504133 21499351 21499627 21504695 21512332 21518828 21520929 21518589 21515534 21516334 21523364 21536851 21556350 21580480
56160 21580480 21606262 21631038 21655213 21681316 21710161 21739982 21770270 21804578 21847428 21898989 21954701
$$ packed form
56235B5335946R1428P5450N6439L7614K1230P419n298j8616l2977m7481o1223
56224B5459931p4190q6146r5325r9816j00542j01453j05659j12081j17208j19636
56214B4447875j21425j24859j29438j32833j33718j32509j30169j27476j25242
56205B3290206j23791j22129j18602j12610j05011r6923q9105q2499p8083p5628
56195B2285825p3493p0248o5776o0554n4825m9038m4093m0437l7775l6084l5715
56184B1717787l5740l3686k8392k2088j7958j6399j5305j3490j1705j0411q480
56173B1504133m782K76N068P637O496K101k340l055Q00P030J3487J9499K4130
56160B1580480K5782K4776K4175K6103K8845K9821L0288L4308M2850N1561N5712
$$ plain form
56149 21954701 22010726 22068682 22134098 22210692 22297270 22390289 22488036 22590968 22698785 22809285
56139 22809285 22920541 23032218 23143594 23252100 23355803 23456269 23556601 23657010 23754638
56130 23754638 23847975 23939091 24030475 24121378 24208540 24289404 24363350 24430388 24489863 24540454 24581214
56119 24581214 24612893 24638162 24659480 24676247 24684901 24682489 24669712 24650203 24627627 24603886 24579242
56108 24579242 24553422 24526918 24501517 24478925 24458702 24438527 24417141 24396239 24378810 24366194 24357408
56097 24357408 24350764 24345515 24342353 24342839 24347951 24356897 24367965 24380801 24397178 24419287 24448173 24484104
56085 24484104 24527066 24575912 24628242 24682570 24740211 24803907 24874906 24952132 25033673 25118046 25204571
56074 25204571 25293554 25385830 25481242 25578195 25675973 25776985 25884843 25999905 26118257 26236016
$$ packed form
56149B1954701N6025N7956O5416P6594Q6578R3019R7747J02932J07817J10500
56139B2809285J11256J11677J11376J08506J03703J00466J00332J00409R7628
56130B3754638R3337R1116R1384R0903Q7162Q0864P3946O7038N9475N0591M0760
56119B4581214L1679K5269K1318J6767Q654k412j2777j9509k2576k3741k4644
56108B4579242k5820k6504k5401k2592k0223k0175k1386k0902j7429j2616q786
56097B4357408o644n249l162M86N112Q946J1068J2836J6377K2109K8886L5931
56085B4484104M2962M8846N2330N4328N7641O3696P0999P7226Q1541Q4373Q6525
56074B5204571Q8983R2276R5412R6953R7778J01012J07858J15062J18352J17759
$$ plain form
56064 26236016 26353693 26475267 26603488 26737273 26873831 27012281 27154219 27300967 27451471
56055 27451471 27603571 27756703 27912452 28072866 28239304 28412684 28593326 28780076 28970759
56046 28970759 29164363 29362095 29565837 29776451 29994167 30219632 30453374 30694522 30940846
56037 30940846 31190118 31441323 31694993 31952707 32216027 32485968 32763841 33051967 33352494
56028 33352494 33665817 33991573 34330762 34685021 35053799 35434474 35825562 36227377 36638937
56019 36638937 37057481 37482940 37920083 38373350 38841258 39318733 39803799 40299300 40809176
56010 40809176 41336304 41883770 42454780 43050015 43667005 44303413 44960079 45640211 46346304
56001 46346304 47078356 47834830 48615207 49421419 50256475 51122276 52020155 52953386 53927479
$$ packed form
56064B6236016J17677J21574J28221J33785J36558J38450J41938J46748J50504
56055B7451471J52100J53132J55749J60414J66438J73380J80642J86750J90683
56046B8970759J93604J97732K03742K10614K17716K25465K33742K41148K46324
56037C0940846K49272K51205K53670K57714K63320K69941K77873K88126L00527
56028C3352494L13323L25756L39189L54259L68778L80675L91088M01815M11560
56019C6638937M18544M25459M37143M53267M67908M77475M85066M95501N09876
56010D0809176N27128N47466N71010N95235O16990O36408O56666O80132P06093
56001D6346304P32052P56474P80377Q06212Q35056Q65801Q97879R33231R74093
$$ plain form
55992 53927479 54948122 56021108 57154218 58355677 59629323 60974245 62390588 63882332
55984 63882332 65452458 67099858 68825245 70637788 72552635 74585053 76751956 79078167
55976 79078167 81597662 84350233 87380319 90736863 94469850 98627447 103258381 108413321
55968 108413321 114139029 120472688 127444234 135079326 143396354 152409662 162149653 172683776
55960 172683776 184117101 196579073 210213322 225162085 241530069 259346148 278551770
55953 278551770 299003943 320460966 342559243 364804428 386544621 406889590 424672082
55946 424672082 438636832 447870722 452189589 452159596 448749320 442917732 435407743 426752887
55938 426752887 417354560 407539919 397592640 387754204 378189346 368943613 359935630 350989844
$$ packed form
55992E3927479J020643J072986J133110J201459J273646J344922J416343J491744
55984F3882332J570126J647400J725387J812543J914847K032418K166903K326211
55976G9078167K519495K752571L030086L356544L732987M157597M630934N154940
55968A08413321N725708O333659O971546P635092Q317028R013308R739991J0534123
55960A72683776J1433325J2461972J3634249J4948763J6367984J7816079J9205622
55953B78551770K0452173K1457023K2098277K2245185K1740193K0344969J7782492
55946D24672082J3964750R233890M318867k9993l410276n831588p509989q654856
55938D26752887r398327r814641r947279r838436r564858r245733r007983q945786
$$ plain form
55930 350989844 341885042 332405679 322395511 311797698 300658063 289092823 277245590
55923 277245590 265253182 253225530 241241932 229362198 217641575 206139992 194928621
55916 194928621 184095869 173741567 163952988 154781040 146240658 138332184 131058411 124423503
55908 124423503 118422790 113035855 108225126 103938095 100112364 96681162 93577436 90738844
55900 90738844 88114935 85670874 83383090 81232412 79202503 77281545 75460613 73730097
55892 73730097 72080114 70503518 68995483 67550140 66159992 64818508 63521371 62265554
55884 62265554 61048876 59869876 58726484 57615505 56534632 55483583 54461889 53467554
55876 53467554 52499882 51561208 50652818 49770875 48909565 48066853 47243741 46439215 45649803
$$ packed form
55930C50989844r104802r479363j0010168j0597813j1139635j1565240j1847233
55923B77245590j1992408j2027652j1983598j1879734j1720623j1501583j1211371
55916A94928621j0832752j0354302r788579r171948q540382p908474p273773o634908
55908A24423503o000713n386935m810729m287031l825731l431202l103726k838592
55900I0738844k623909k444061k287784k150678k029909j920958j820932j730516
55892G3730097j649983j576596j508035j445343j390148j341484j297137j255817
55884F2265554j216678j179000j143392j110979j080873j051049j021694r94335
55876E3467554r67672r38674r08390q81943q61310q42712q23112q04526p89412
$$ plain form
55867 45649803 44873705 44111918 43365683 42636278 41926918 41240890 40577043 39930148 39296236
55858 39296236 38674800 38065680 37467327 36879236 36303263 35741112 35192421 34656088 34131821
55849 34131821 33620233 33123471 32645474 32188702 31750196 31323601 30905791 30498988 30106006
55840 30106006 29726312 29357548 28997752 28644795 28296751 27954941 27624253 27308153 27004774
55831 27004774 26709347 26418746 26132262 25850024 25572861 25302603 25040760 24787656 24543611
55822 24543611 24309273 24083384 23861999 23641923 23423986 23211377 23005886 22807521 22616665
55813 22616665 22434364 22260354 22092210 21926866 21762797 21601383 21446463 21301444 21166232
55804 21166232 21037761 20913732 20794041 20677903 20561980 20443529 20324262 20208992 20100719
$$ packed form
55867D5649803p76098p61787p46235p29405p09360o86028o63847o46895o33912
55858C9296236o21436o09120n98353n88091n75973n62151n48691n36333n24267
55849C4131821n11588m96762m77997m56772m38506m26595m17810m06803l92982
55840C0106006l79694l68764l59796l52957l48044l41810l30688l16100l03379
55831B7004774k95427k90601k86484k82238k77163k70258k61843k53104k44045
55822B4543611k34338k25889k21385k20076k17937k12609k05491j98365j90856
55813B2616665j82301j74010j68144j65344j64069j61414j54920j45019j35212
55804B1166232j28471j24029j19691j16138j15923j18451j19267j15270j08273
$$ plain form
55795 20100719 19998149 19897302 19794392 19688095 19580567 19475760 19375609 19278531 19182524 19088292
55785 19088292 18997591 18909698 18821898 18733161 18645266 18560212 18478198 18398271 18319371 18240536 18161499
55774 18161499 18083306 18006971 17931426 17854393 17775908 17699446 17628403 17562147 17496590 17428419 17358009
55763 17358009 17288087 17220122 17152685 17083697 17013760 16946097 16882889 16822697 16762296 16700151 16637031
55752 16637031 16573967 16511195 16449051 16388464 16330069 16273566 16218277 16163794 16109925 16056482 16003331
55741 16003331 15950481 15898196 15846917 15796603 15746168 15694633 15643293 15595471 15553210 15515208 15478959
55730 15478959 15443461 15408155 15370673 15328509 15282664 15237003 15193580 15150928 15107577 15064852 15024875
55719 15024875 14987696 14951913 14916685 14881572 14845622 14808275 14770415 14733101 14695950 14658249 14620903
$$ packed form
55795B0100719j02570j00847j02910j06297j07528j04807j00151r7078r6007r4232
55785A9088292r0701q7893q7800q8737q7895q5054q2014p9927p8900p8835p9037
55774A8161499p8193p6335p5545p7033p8485p6462p1043o6256o5557o8171p0410
55763A7358009o9922o7965o7437o8988o9937o7663o3208o0192o0401o2145o3120
55752A6637031o3064o2772o2144o0587n8395n6503n5289n4483n3869n3443n3151
55741A6003331n2850n2285n1279n0314n0435n1535n1340m7822m2261l8002l6249
55730A5478959l5498l5306l7482m2164m5845m5661m3423m2652m3351m2725l9977
55719A5024875l7179l5783l5228l5113l5950l7347l7860l7314l7151l7701l7346
$$ plain form
55708 14620903 14585533 14551981 14518433 14484105 14450269 14418342 14388303 14359345 14330814 14301834 14271161
55697 14271161 14238438 14205127 14173406 14144335 14117487 14091898 14066674 14040880 14013696 13985058 13955901
55686 13955901 13927488 13900433 13874288 13847938 13820447 13791851 13763412 13736972 13713521 13692117 13670449
55675 13670449 13646807 13621164 13594129 13565677 13536081 13507593 13483227 13463231 13444365 13423843 13402532
55664 13402532 13382735 13364186 13344752 13324499 13306106 13290439 13274273 13254053 13230278 13206351 13184188
55653 13184188 13162789 13140567 13117190 13093035 13068333 13043329 13018480 12994146 12970508 12947765 12925972
55642 12925972 12904879 12884331 12864403 12844568 12823333 12799597 12774127 12748839 12724880 12702012 12679387
55631 12679387 12656160 12631916 12607439 12584309 12562768 12541062 12518407 12497240 12479936 12464036 12444074
$$ packed form
55708A4620903l5370l3552l3548l4328l3836l1927l0039k8958k8531k8980l0673
55697A4271161l2723l3311l1721k9071k6848k5589k5224k5794k7184k8638k9157
55686A3955901k8413k7055k6145k6350k7491k8596k8439k6440k3451k1404k1668
55675A3670449k3642k5643k7035k8452k9596k8488k4366j9996j8866k0522k1311
55664A3402532j9797j8549j9434k0253j8393j5667j6166k0220k3775k3927k2163
55653A3184188k1399k2222k3377k4155k4702k5004k4849k4334k3638k2743k1793
55642A2925972k1093k0548j9928j9835k1235k3736k5470k5288k3959k2868k2625
55631A2679387k3227k4244k4477k3130k1541k1706k2655k1167j7304j5900j9962
$$ plain form
55620 12444074 12418582 12392042 12368679 12347424 12324998 12301199 12278197 12256276 12233607 12209840 12187223
55609 12187223 12167791 12151211 12135632 12119294 12101256 12081746 12061889 12042173 12021371 11997756 11971193
55598 11971193 11943567 11917786 11896662 11881218 11869086 11856170 11841276 11827330 11816220 11804555 11787502
55587 11787502 11765395 11743004 11723160 11704917 11687824 11673576 11662234 11650625 11636374 11620573 11604598
55576 11604598 11587316 11567992 11549637 11536378 11528480 11522109 11513236 11500264 11484030 11466972 11451270 11436462
55564 11436462 11420154 11402351 11387028 11377164 11369933 11359716 11344879 11328731 11314372 11301657 11289285
55553 11289285 11276895 11264285 11250781 11236352 11221765 11207192 11192377 11178658 11168666 11162846 11157854 11149882
55541 11149882 11138611 11126648 11115791 11105224 11093244 11079691 11066341 11055264 11047010 11040371 11033721 11026152
$$ packed form
55620A2444074k5492k6540k3363k1255k2426k3799k3002k1921k2669k3767k2617
55609A2187223j9432j6580j5579j6338j8038j9510j9857j9716k0802k3615k6563
55598A1971193k7626k5781k1124j5444j2132j2916j4894j3946j1110j1665j7053
55587A1787502k2107k2391j9844j8243j7093j4248j1342j1609j4251j5801j5975
55576A1604598j7282j9324j8355j3259p898o371q873j2972j6234j7058j5702j4808
55564A1436462j6308j7803j5323r864p231j0217j4837j6148j4359j2715j2372
55553A1289285j2390j2610j3504j4429j4587j4573j4815j3719r992n820m992p972
55541A1149882j1271j1963j0857j0567j1980j3553j3350j1077q254o639o650p569
$$ plain form
55529 11026152 11017175 11006053 10992251 10976303 10959598 10943544 10929352 10917879 10908504 10898460 10884581
55518 10884581 10866145 10845614 10826928 10813464 10806473 10803751 10800196 10791596 10778312 10763889 10750083 10735029
55506 10735029 10716787 10696683 10677863 10661955 10648563 10637108 10627486 10619141 10610730 10600856 10588657 10574016
55494 10574016 10557834 10541577 10525651 10508439 10487890 10463978 10438742 10413842 10389067 10363606 10337779
55483 10337779 10312661 10288571 10265143 10242816 10222857 10205317 10188190 10169871 10151706 10136348 10123667
55472 10123667 10110150 10092955 10072968 10053010 10034593 10017786 10002918 9990553 9980158 9970210 9959301
55461 9959301 9946401 9931184 9915422 9902773 9895053 9889483 9881742 9870950 9859175 9846916 9832623 9817018
55449 9817018 9804184 9796773 9792817 9788835 9783619 9777416 9770177 9762950 9758536 9757774 9756828 9751231 9741440 9731243
$$ packed form
55529A1026152q977j1122j3802j5948j6705j6054j4192j1473r375j0044j3879
55518A0884581j8436k0531j8686j3464o991k722l555q600j3284j4423j3806j5054
55506A0735029j8242k0104j8820j5908j3392j1455r622q345q411r874j2199j4641
55494A0574016j6182j6257j5926j7212k0549k3912k5236k4900k4775k5461k5827
55483A0337779k5118k4090k3428k2327j9959j7540j7127j8319j8165j5358j2681
55472A0123667j3517j7195j9987j9958j8417j6807j4868j2365j0395r948j0909
55461I959301j2900j5217j5762j2649p720n570p741j0792j1775j2259j4293j5605
55449I817018j2834p411l956l982n216o203p239p227m414p62r46n597r791j0197
$$ plain form
55435 9731243 9721578 9709525 9693560 9676521 9662472 9653090 9647920 9645773 9644592 9642022 9637578 9632950 9629156
55422 9629156 9624816 9618280 9609966 9601230 9592240 9582533 9572613 9563240 9553680 9542297 9528721 9514169 9499953
55409 9499953 9486930 9475984 9467227 9458647 9447423 9433354 9419541 9408622 9399652 9390023 9379485 9370368
55397 9370368 9364059 9359129 9353561 9347317 9341558 9336207 9329464 9319448 9305499 9288240 9269392 9251394 9236057
55384 9236057 9223231 9211420 9199805 9189014 9179968 9173082 9168814 9167649 9168527 9168143 9163065 9152435 9138049
55371 9138049 9122477 9107957 9096358 9088406 9082595 9076075 9067224 9056708 9045839 9034790 9022914 9009930
55359 9009930 8996133 8982242 8969905 8961691 8959198 8961065 8963722 8964237 8961634 8955542 8945249 8931366 8917343
55346 8917343 8907351 8902182 8898535 8892858 8884796 8876179 8867910 8859347 8849939 8839608 8827727 8813771 8799434
$$ packed form
55435I731243r665j2053j5965j7039j4049r382n170k147j181k570m444m628l794
55422I629156m340o536q314q736q990r707r920r373r560j1383j3576j4552j4216
55409I499953j3023j0946q757q580j1224j4069j3813j0919q970r629j0538r117
55397I370368o309m930n568o244n759n351o743j0016j3949j7259j8848j7998j5337
55384I236057j2826j1811j1615j0791r046o886m268j165Q78l84n078j0630j4386
55371I138049j5572j4520j1599p952n811o520q851j0516j0869j1049j1876j2984
55359I009930j3797j3891j2337q214k493J867K657N15k603o092j0293j3883j4023
55346H917343r992n169l647n677q062q617q269q563r408j0331j1881j3956j4337
$$ plain form
55333 8799434 8788005 8780325 8772956 8762047 8747907 8733865 8721574 8710016 8699022 8690697 8685911 8681689
55321 8681689 8674414 8664514 8655666 8649756 8644987 8639344 8633621 8629619 8626848 8622930 8616697 8609263 8602127 8595829
55307 8595829 8590716 8587364 8585242 8582065 8575753 8566569 8556436 8546683 8537479 8528839 8520736 8512412 8503093 8493546
55293 8493546 8485530 8479426 8473885 8468224 8463457 8459969 8455849 8449166 8440706 8432669 8425455 8417813 8409669 8402488
55279 8402488 8396586 8390318 8382772 8375343 8369315 8363345 8354960 8343729 8331415 8319530 8308350 8298123 8289431
55266 8289431 8281813 8273417 8262996 8251548 8241128 8232634 8225611 8219688 8214844 8210164 8203860 8195304 8186066
55253 8186066 8177875 8170411 8162575 8155411 8151602 8151519 8151636 8148180 8141036 8132565 8123629 8112940 8100085 8087025
55239 8087025 8075954 8067129 8059542 8052478 8045450 8037572 8028253 8018218 8008855 8000507 7992099 7982655 7972847
$$ packed form
55333H799434j1429p680p369j0909j4140j4042j2291j1558j0994q325m786m222
55321H681689p275r900q848n910m769n643n723m002k771l918o233p434p136o298
55307H595829n113l352k122l177o312r184j0133r753r204q640q103q324r319r547
55293H493546q016o104n541n661m767l488m120o683q460q037p214p642q144p181
55279H402488n902o268p546p429o028n970q385j1231j2314j1885j1180j0227q692
55266H289431p618q396j0421j1448j0420q494p023n923m844m680o304q556r238
55253H186066q191p464p836p164l809q3J17l456p144q471q936j0689j2855j3060
55239H087025j1071q825p587p064p028p878r319j0035r363q348q408r444r808
$$ plain form
55226 7972847 7964674 7959447 7956105 7951869 7944849 7935702 7926440 7918083 7910152 7902015 7893842 7886466 7881170 7879092
55212 7879092 7879474 7878729 7873035 7862368 7850729 7842087 7837486 7836085 7836575 7836477 7832423 7823344 7812075 7801923
55198 7801923 7792865 7783121 7773083 7764873 7758664 7752405 7745230 7738231 7731348 7722386 7710437 7697935 7687689
55185 7687689 7679774 7673122 7668510 7667636 7669855 7671821 7670404 7664808 7656135 7646105 7636104 7626646 7617682 7609588
55171 7609588 7602953 7596899 7589015 7578457 7568051 7561374 7558143 7554469 7547782 7539639 7533197 7529553 7527324
55158 7527324 7524288 7518299 7507865 7493546 7478646 7467162 7460567 7456935 7453245 7448047 7441884 7435689 7429405
55145 7429405 7422326 7414376 7406330 7398641 7390677 7381671 7372043 7363109 7355642 7349281 7343175 7336663 7329614 7322730
55131 7322730 7317196 7313306 7309893 7306068 7302868 7301648 7301121 7298032 7291166 7282815 7275520 7269258 7263000 7257068
$$ packed form
55226G972847q173n227l342m236p020r147r262q357p931q137q173p376n296k078
55212G879092L82p45n694j0667j1639q642m601j401M90r8m054r079j1269j0152
55198G801923r058r744j0038q210o209o259p175o999o883q962j1949j2502j0246
55185G687689p915o652m612q74K219J966j417n596q673j0030j0001r458q964q094
55171G609588o635o054p884j0558j0406o677l231l674o687q143o442l644k229
55158G527324l036n989j0434j4319j4900j1484o595l632l690n198o163o195o284
55145G429405p079p950q046p689p964r006r628q934p467o361o106o512p049o884
55131G322730n534l890l413l825l200j220n27l089o866q351p295o262o258n932
$$ plain form
55117 7257068 7252145 7247407 7241838 7236272 7231803 7227013 7219663 7210923 7204699 7201847 7198092 7189542 7177848 7167399
55103 7167399 7159048 7149711 7137746 7125669 7116881 7112017 7109719 7109039 7109347 7108932 7105810 7099824 7092459 7084441
55089 7084441 7075083 7064664 7056019 7052130 7052405 7052822 7050143 7044964 7040142 7037291 7035938 7035419 7035766 7036378 7035356
55074 7035356 7031419 7025757 7020700 7016770 7012188 7005330 6996408 6986387 6975647 6964785 6955574 6949398 6945039
55061 6945039 6939808 6933179 6927539 6924403 6921495 6915324 6905776 6896123 6888578 6881895 6874008 6865232 6857441 6851197
55047 6851197 6845225 6838318 6830358 6821662 6812673 6804508 6798547 6794886 6792131 6789251 6786710 6784923 6782461 6777363
55033 6777363 6770129 6763875 6760698 6758932 6755098 6748081 6740123 6733690 6728661 6723151 6716108 6708219 6700747 6694369
55019 6694369 6688902 6683438 6676917 6669216 6661511 6655045 6649966 6645986 6643418 6642210 6640414 6635485 6627371 6618603
$$ packed form
55117G257068m923m738n569n566m469m790p350q740o224k852l755q550j1694j0449
55103G167399q351r337j1965j2077q788m864k298o80L08m15l122n986p365q018
55089G084441r358j0419q645l889K75M17k679n179m822k851j353n19L47O12j022
55074G035356l937n662n057l930m582o858q922j0021j0740j0862r211o176m359
55061F945039n231o629n640l136k908o171r548r653p545o683p887q776p791o244
55047F851197n972o907p960q696q989q165n961l661k755k880k541j787k462n098
55033F777363p234o254l177j766l834p017p958o433n029n510p043p889p472o378
55019F694369n467n464o521p701p705o466n079l980k568j208j796m929q114q768
$$ plain form
55005 6618603 6610792 6602878 6593828 6585307 6579912 6577857 6577254 6576976 6577263 6577735 6576714 6573046 6567421 6561491 6556517
54990 6556517 6552903 6550065 6546678 6542022 6537143 6533703 6531620 6528949 6524301 6518401 6513001 6509225 6507163 6505946
54976 6505946 6503794 6499047 6491695 6483236 6474862 6466716 6459067 6452652 6447138 6440543 6431403 6420684 6410636
54963 6410636 6402555 6396654 6393216 6392373 6393101 6393701 6393181 6391288 6387622 6382056 6375892 6371146 6368252 6365505 6361197
54948 6361197 6355378 6349071 6342792 6336735 6331730 6328764 6327520 6326266 6323459 6318945 6313277 6306497 6298282 6289165
54934 6289165 6280811 6274685 6270668 6267295 6263140 6257858 6252166 6247185 6243651 6241394 6239566 6237577 6235769 6235164
54920 6235164 6236662 6240370 6245056 6248091 6246858 6241088 6233405 6226893 6222515 6219511 6217416 6216188 6214639 6210495
54906 6210495 6202606 6192219 6181696 6172718 6165736 6159977 6153602 6144937 6134220 6123494 6114496 6107300 6101120
$$ packed form
55005F618603p811p914r050q521n395k055o03k78K87M72j021l668n625n930m974
54990F556517l614k838l387m656m879l440k083k671m648n900n400l776k062j217
54976F505946k152m747p352q459q374q146p649o415n514o595r140j0719j0048
54963F410636q081n901l438q43P28O00n20j893l666n566o164m746k894k747m308
54948F361197n819o307o279o057n005k966j244j254k807m514n668o780q215r117
54934F289165q354o126m017l373m155n282n692m981l534k257j828j989j808o05
54920F235164J498L708M686L035j233n770p683o512m378l004k095j228j549m144
54906F210495p889j0387j0523q978o982n759o375q665j0717j0726q998p196o180
$$ plain form
54893 6101120 6095416 6089902 6084470 6079555 6075750 6072825 6070023 6067348 6065275 6063136 6059516 6054710 6050867 6048774
54879 6048774 6046426 6042210 6037669 6035200 6034514 6033639 6032444 6032497 6033514 6032466 6026996 6018179 6009113 6001679 5995345
54864 5995345 5988630 5981144 5974002 5968077 5962319 5954913 5946106 5938145 5931843 5925239 5916978 5908896 5903181 5898850
54850 5898850 5893881 5889231 5887140 5885999 5880921 5870056 5856926 5845418 5835796 5827322 5821554 5820082 5820773
54837 5820773 5819192 5813041 5803110 5790780 5777066 5763923 5754077 5748604 5745761 5742812 5738420 5733188 5728596
54824 5728596 5725655 5723957 5721740 5717176 5709911 5701444 5694068 5689223 5686420 5683645 5679267 5673758 5669228 5667160
54810 5667160 5666875 5666120 5662745 5656085 5647553 5640087 5636136 5635549 5635628 5633437 5628049 5621016 5615164 5612551 5612692
54795 5612692 5612932 5611262 5608343 5605907 5603963 5601274 5598183 5596652 5596995 5596579 5592957 5586928 5581392 5578171 5576765
$$ packed form
54893F101120n704n514n432m915l805k925k802k675k073k139l620m806l843k093
54879F048774k348m216m541k469o86q75j195N3J017j048n470q817r066p434o334
54864E995345o715p486p142n925n758p406q807p961o302o604q261q082n715m331
54850E898850m969m650k091j141n078j0865j3130j1508r622q474n768j472O91
54837E820773j581o151r931j2330j3714j3143r846n473k843k949m392n232m592
54824E728596k941j698k217m564p265q467p376m845k803k775m378n509m530k068
54810E667160k85p55l375o660q532p466l951n87P9k191n388p033n852k613J41
54795E612692K40j670k919k436j944k689l091j531L43m16l622o029n536l221j406
$$ plain form
54780 5576765 5575162 5571055 5563435 5554083 5546615 5543087 5542147 5541065 5538521 5534751 5530476 5527066 5526692 5530640
54766 5530640 5537698 5545092 5550471 5552323 5549665 5542798 5533831 5525215 5518034 5512383 5508578 5506934 5507175 5509060
54752 5509060 5512485 5515645 5514495 5506455 5494355 5484541 5480713 5481062 5481395 5479230 5474439 5467698 5459616 5450845
54738 5450845 5442304 5435165 5430223 5426638 5421900 5414182 5404667 5396550 5391721 5389213 5386636 5382227 5375914 5369562
54724 5369562 5366017 5366715 5370325 5374603 5379011 5384163 5389319 5392406 5392514 5390582 5387581 5383810 5380090 5377496
54710 5377496 5375320 5371368 5364983 5357724 5350174 5340516 5327967 5315435 5306391 5300450 5294565 5287657 5281356
54697 5281356 5276316 5270477 5261808 5250989 5240427 5231807 5225341 5220453 5216312 5212081 5207125 5200789 5192175
54684 5192175 5181050 5169186 5159812 5154980 5153689 5152918 5150260 5145541 5140525 5137321 5136370 5135409 5131029 5122131
$$ packed form
54780E576765j603m107p620r352p468l528r40j082k544l770m275l410l74L948
54766E530640P058P394N379J852k658o867q967q616p181n651l805j644K41J885
54752E509060L425L160j150q040j2100r814l828L49L33k165m791o741q082q771
54738E450845q541p139m942l585m738p718r515q117m829k508k577m409o313o352
54724E369562l545O98L610M278M408N152N156L087J08j932l001l771l720k594
54710E377496k176l952o385p259p550r658j2549j2532r044n941n885o908o301
54697E281356n040n839q669j0819j0562q620o466m888m141m231m956o336q614
54684E192175j1125j1864r374m832j291p71k658m719n016l204r51r61m380q898
$$ plain form
54670 5122131 5111726 5104405 5101707 5100566 5096755 5089326 5080875 5073653 5066763 5058092 5048191 5040595 5037793 5038099
54656 5038099 5037602 5034631 5030976 5028761 5027578 5025554 5022367 5019837 5019468 5020452 5020681 5019134 5016486 5013504 5009701
54641 5009701 5003970 4996052 4986967 4978281 4971545 4968106 4968403 4970975 4972835 4971651 4967568 4962551 4958138 4954433
54627 4954433 4951173 4948941 4948768 4950727 4953185 4953400 4949069 4940101 4929292 4920625 4915966 4913461 4909787 4903894
54613 4903894 4897827 4894003 4892722 4892618 4892333 4890933 4887653 4882643 4877676 4874733 4873546 4871504 4866525 4859412
54599 4859412 4852880 4848542 4845358 4841062 4834992 4829246 4826705 4827917 4830543 4832000 4831643 4829757 4825782 4819219
54585 4819219 4811596 4805573 4802075 4800020 4798820 4799064 4800245 4800019 4796802 4791413 4785210 4778546 4772253 4768369
54571 4768369 4767135 4765025 4758520 4748947 4740952 4736697 4734178 4731030 4727083 4722701 4717395 4711427 4706813 4705294
$$ packed form
54670E122131j0405p321k698j141l811p429q451p222o890q671r901p596k802L06
54656E038099m97k971l655k215j183k024l187k530l69R84K29j547k648k982l803
54641E009701n731p918r085q686o736l439K97K572J860j184m083n017m413l705
54627D954433l260k232j73J959K458K15m331q968j0809q667m659k505l674n893
54613D903894o067l824j281j04k85j400l280n010m967k943j187k042m979p113
54599D859412o532m338l184m296o070n746k541J212K626J457l57j886l975o563
54585D819219p623o023l498k055j200K44J181k26l217n389o203o664o293l884
54571D768369j234k110o505r573p995m255k519l148l947m382n306n968m614j519
$$ plain form
54557 4705294 4706349 4708068 4708849 4707651 4704097 4699309 4695495 4693785 4693442 4693708 4694899 4696729 4697293 4695433 4692935
54542 4692935 4692449 4693914 4694988 4694627 4694068 4694013 4693069 4690079 4686402 4684191 4683190 4681012 4676598 4671612 4667762
54527 4667762 4664202 4659008 4652247 4645682 4639681 4632793 4625122 4619766 4618968 4620337 4619310 4614690 4609353 4605695
54513 4605695 4602966 4599677 4596281 4594194 4593654 4593650 4592882 4590217 4585622 4581413 4580827 4584070 4587143 4585993 4580660
54498 4580660 4573923 4567146 4559312 4549453 4538087 4526427 4515774 4507626 4503069 4501963 4503550 4507354 4512263
54485 4512263 4515442 4514033 4508217 4501092 4495323 4491154 4487892 4485592 4484350 4483161 4480935 4478271 4477088 4478284
54471 4478284 4480475 4481572 4481364 4481845 4484730 4489324 4493587 4496733 4499288 4500728 4499033 4493355 4485323 4476561
54457 4476561 4466763 4456134 4448085 4446600 4451247 4457232 4460474 4460608 4459177 4457428 4456342 4456385 4456227 4453603 4448307
$$ packed form
54557D705294J055J719P81j198l554m788l814j710l43K66J191J830N64j860k498
54542D692935m86J465J074l61n59n5r44k990l677k211j001k178m414m986l850
54527D667762l560n194o761o565o001o888p671n356p98J369j027m620n337l658
54513D605695k729l289l396k087n40mp68k665m595m209n86L243L073j150n333
54498D580660o737o777p834r859j1366j1660j0653q148m557j106J587L804M909
54485D512263L179j409n816p125n769m169l262k300j242j189k226k664j183J196
54471D478284K191J097k08M81K885M594M263L146K555J440j695n678q032q762
54457D476561r798j0629q049j485M647N985L242J34j431j749j086M3j58k624n296
$$ plain form
54442 4448307 4442443 4436898 4429812 4419928 4409231 4400355 4393248 4386704 4381595 4379640 4379781 4378857 4375959 4373360
54428 4373360 4372519 4371785 4369283 4365999 4364190 4364118 4364207 4363798 4363982 4365802 4369034 4372769 4375725 4375537 4369289 4356411
54412 4356411 4340880 4329103 4324859 4326549 4329565 4330591 4329157 4326069 4322044 4318109 4315907 4316486 4319087 4321789
54398 4321789 4323087 4322599 4320794 4318639 4317116 4316414 4315830 4314912 4314221 4314210 4313770 4310908 4304909 4297090 4289420 4283200
54382 4283200 4279148 4277726 4278728 4280951 4282806 4283254 4282228 4280557 4279444 4279457 4279922 4279734 4278799 4278089 4278193 4278492
54366 4278492 4277951 4275985 4272350 4267134 4261392 4256888 4254303 4252387 4249914 4247821 4247967 4249863 4250355 4247394 4243037
54351 4243037 4241440 4244147 4248341 4249794 4246742 4240669 4234303 4229855 4228719 4231215 4235612 4238216 4235887 4228749
54337 4228749 4219689 4211119 4203207 4195448 4188419 4182696 4176826 4168189 4156334 4144526 4137417 4137267 4142255 4147838
$$ packed form
54442D448307n864n545p086r884j0697q876p107o544n109j955J41r24k898k599
54428D373360q41p34k502l284j809p2Q9m09J84J820L232L735K956j88o248j2878
54412D356411j5531j1777m244J690L016J026j434l088m025l935k202N79K601K702
54398D321789J298m88j805k155j523p02n84r18o91j1m40k862n999p819p670o220
54382D283200m052j422J002K223J855M48j026j671j113J3M65j88r35p10J04K99
54366D278492n41j966l635n216n742m504k585j916k473k093J46J896M92k961m357
54351D243037j597K707M194J453l052o073o366m448j136K496M397K604k329p138
54337D228749r060q570p912p759p029n723n870q637j1855j1808p109j50M988N583
$$ plain form
54323 4147838 4149763 4146627 4140126 4133056 4127122 4122575 4118987 4115460 4110610 4103587 4095176 4087000 4079695 4072940
54309 4072940 4067161 4063616 4062312 4061284 4058895 4055754 4053310 4051539 4049312 4046306 4043078 4039607 4035225 4029982
54295 4029982 4024831 4020155 4015222 4009512 4003753 3999167 3996296 3995048 3995348 3997034 3999132 3999762 3997351 3992238
54281 3992238 3986910 3983998 3983780 3984006 3982472 3979260 3976178 3974622 3974590 3975150 3975016 3972961 3968681 3963326 3958703
54266 3958703 3955796 3954162 3952404 3949053 3943842 3938616 3936085 3936833 3938381 3938124 3936065 3933320 3929304 3922853
54252 3922853 3915556 3911065 3910425 3910473 3908064 3904058 3901793 3902909 3906002 3908319 3907650 3903575 3898229 3895232 3896531
54237 3896531 3900308 3902543 3900290 3893461 3884519 3877042 3873198 3871469 3867814 3860329 3851957 3847304 3847385 3848913
54223 3848913 3848294 3844754 3839708 3834718 3830745 3828304 3827424 3827491 3827488 3826442 3823809 3819605 3814148 3807786 3801173 3795404
$$ packed form
54323D147838J925l136o501p070n934m547l588l527m850p023q411q176p305o755
54309D072940n779l545j304j028k389l141k444j771k227l006l228l471m382n243
54295D029982n151m676m933n710n759m586k871j248L00J686K098O30k411n113
54281C992238n328k912k18K26j534l212l082j556l2N60j34k055m280n355m623
54266C958703k907j634j758l351n211n226k531P48J548k57k059k745m016o451
54252C922853p297m491o40M8k409m006k265J116L093K317o69m075n346k997J299
54237C896531L777K235k253o829q942p477l844j729l655p485q372m653Q1J528
54223C848913o19l540n046m990l973k441q80O7lj046k633m204n457o362o613n769
$$ plain form
54207 3795404 3791176 3787991 3785203 3783660 3784819 3788122 3790987 3792001 3792364 3793224 3793368 3790945 3785891 3779141 3771057
54192 3771057 3762514 3755997 3753149 3752245 3750581 3748557 3748760 3751474 3754055 3754732 3754252 3753318 3751280 3748238 3745786
54177 3745786 3744292 3741603 3736042 3728945 3722706 3717842 3713654 3710489 3709434 3710348 3711804 3712811 3713485 3714227 3715089
54162 3715089 3715832 3716091 3715579 3714210 3711658 3707132 3700653 3694404 3691310 3691940 3694098 3695675 3696302 3695885 3693725
54147 3693725 3690168 3687147 3685567 3683786 3680270 3676158 3673287 3671115 3667702 3662684 3657028 3650920 3644507 3640067
54133 3640067 3640381 3644595 3648221 3647833 3643711 3637616 3630648 3624316 3620971 3621057 3621570 3619403 3615335 3612893 3613985
54118 3613985 3617474 3621501 3625117 3627529 3627813 3626262 3624612 3623816 3622417 3618302 3611688 3605283 3601557 3600667 3601053
54103 3601053 3601081 3599798 3597160 3594499 3594164 3597512 3603090 3607599 3608861 3607404 3605174 3603580 3602893 3602661 3602153
$$ packed form
54207C795404m228l185k788j543J159L303K865J014L63Q60J44k423n054o750q084
54192C771057q543o517k848r04j664k024K03K714K581O77m80r34k038l042k452
54177C745786j494k689n561p097o239m864m188l165j055R14J456J007O74P42Q62
54162C715089P43K59n12j369k552m526o479o249l094O30K158J577O27m17k160
54147C693725l557l021j580j781l516m112k871k172l413n018n656o108o413m440
54133C640067L14M214L626l88m122o095o968o332l345Q6N13k167m068k442J092
54118C613985L489M027L616K412K84j551j650p96j399m115o614o405l726q90L86
54103C601053K8j283k638k661l35L348N578M509J262j457k230j594o87k32n08
$$ plain form
54088 3602153 3601024 3600006 3600354 3602148 3603764 3603587 3601690 3599325 3597490 3596852 3598382 3602767 3609183 3615524 3619964
54073 3619964 3621725 3620569 3616619 3611080 3606457 3605381 3608961 3616060 3624087 3630855 3635964 3640224 3643905 3646563
54059 3646563 3648831 3652936 3660017 3667769 3672592 3674054 3675456 3679483 3684671 3687166 3685236 3681155 3678978 3681141
54045 3681141 3687150 3694954 3703054 3711140 3719104 3726402 3732712 3738245 3742660 3744679 3744157 3743834 3747128 3754102
54031 3754102 3761275 3765831 3768354 3770631 3772333 3771407 3767069 3760995 3755640 3752453 3751960 3754566 3760131 3766578
54017 3766578 3770032 3767981 3762516 3758727 3758726 3758728 3753825 3744398 3735190 3728775 3723188 3716325 3709181 3703163 3697168
54002 3697168 3689584 3680986 3672507 3663510 3653564 3645168 3641294 3640940 3640132 3637141 3633819 3631566 3628819 3623409
53988 3623409 3615268 3605891 3596916 3589913 3585756 3583152 3579193 3572428 3564420 3557833 3554130 3553455 3555074 3557113
$$ packed form
54088C602153j129j018L48J794J616j77j897k365j835o38J530M385O416O341M440
54073C619964J761j156l950n539m623j076L580P099Q027O768N109M260L681K658
54059C646563K268M105P081P752M823J462J402M027N188K495j930m081k177K163
54045C681141O009P804Q100Q086P964P298O310N533M415K019n22l23L294O974
54031C754102P173M556K523K277J702r26m338o074n355l187m93K606N565O447
54017C766578L454k051n465l789jKm903r427r208o415n587o863p144o018n995
54002C697168p584q598q479q997r946q396l874l54q08k991l322k253k747n410
53988C623409q141r377q975p003m157k604l959o765q008o587l703o75J619K039
$$ plain form
53974 3557113 3557311 3555063 3551757 3548664 3545937 3544301 3545750 3551087 3558186 3564318 3569210 3574229 3579402 3583092
53960 3583092 3584493 3584999 3586926 3591444 3597540 3602512 3604045 3602246 3599104 3596035 3593423 3592707 3596360 3604232
53946 3604232 3612127 3616328 3617940 3620307 3623905 3627140 3631067 3638898 3650297 3660104 3664487 3665391 3667140 3671129
53932 3671129 3676117 3681617 3688314 3696190 3704583 3713505 3722951 3731539 3737902 3743197 3750285 3760329 3772002
53919 3772002 3784349 3798544 3815657 3833981 3850251 3863418 3875906 3890532 3907050 3922831 3936690
53908 3936690 3950406 3965444 3979573 3988785 3992317 3993635 3995865 3998189 3997947 3994680 3990226 3985575 3979520
53895 3979520 3970543 3958781 3945694 3932475 3919199 3905488 3891892 3880039 3870568 3861212 3848454 3831506
53883 3831506 3813069 3795441 3777731 3758533 3739719 3724966 3714904 3706068 3695006 3681519 3667134
$$ packed form
53974C557113J98k248l306l093k727j636J449N337P099O132M892N019N173L690
53960C583092J401N06J927M518O096M972J533j799l142l069k612p16L653P872
53946C604232P895M201J612K367L598L235L927P831J1399R807M383R04J749L989
53932C671129M988N500O697P876Q393Q922R446Q588O363N295P088J0044J1673
53919C772002J2347J4195J7113J8324J6270J3167J2488J4626J6518J5781J3859
53908C936690J3716J5038J4129R212L532J318K230K324k42l267m454m651o055
53895C979520q977j1762j3087j3219j3276j3711j3596j1853r471r356j2758j6948
53883C831506j8437j7628j7710j9198j8814j4753j0062q836j1062j3487j4385
$$ plain form
53872 3667134 3651938 3634223 3612866 3589425 3567779 3551459 3540828 3532939 3524372 3513753 3501386 3487735
53860 3487735 3473638 3461193 3452606 3448057 3445772 3444001 3441727 3437798 3431200 3422613 3414328 3407986 3403255
53847 3403255 3398938 3394456 3390020 3386187 3383385 3381123 3377992 3373629 3370257 3370445 3373202 3374256 3371003 3365470
53833 3365470 3361374 3359718 3358693 3356773 3354170 3351486 3348298 3343457 3336332 3327625 3319032 3312015 3307073 3304504
53819 3304504 3305220 3309737 3316701 3323757 3329840 3335260 3339522 3340967 3339136 3335798 3332733 3330068 3327837 3327668
53805 3327668 3331303 3338323 3346653 3354663 3361840 3368264 3374582 3381611 3388775 3393775 3395197 3394868 3396277 3401071
53791 3401071 3408159 3415617 3422045 3426497 3428577 3428702 3427291 3423963 3418499 3412091 3406313 3401100 3395239 3388804
53777 3388804 3383490 3380033 3376597 3370740 3362401 3354170 3348664 3345980 3343750 3339568 3333186 3326209 3320088 3315207
$$ packed form
53872C667134j5196j7715k1357k3441k1646j6320j0631p889q567j0619j2367j3651
53860C487735j4097j2445q587m549k285j771k274l929o598q587q285o342m731
53847C403255m317m482m436l833k802k262l131m363l372J88K757J054l253n533
53833C365470m096j656j025j920k603k684l188m841p125q707q593p017m942k569
53819C304504P16M517O964P056O083N420M262J445j831l338l065k665k231j69
53805C327668L635P020Q330Q010P177O424O318P029P164N000J422l29J409M794
53791C401071P088P458O428M452K080J25j411l328n464o408n778n213n861o435
53777C388804n314l457l436n857q339q231n506k684k230m182o382o977o121m881
$$ plain form
53763 3315207 3311716 3309828 3308769 3306707 3302675 3297575 3292349 3286254 3278376 3269983 3263714 3260639 3259437 3258115
53749 3258115 3255344 3250628 3244820 3240260 3238623 3238364 3235926 3229999 3223280 3219321 3218681 3218977 3217979 3215817 3214352
53734 3214352 3214851 3216446 3217151 3216612 3217166 3221205 3227740 3232771 3233449 3231120 3229718 3231427 3234310 3234418 3230250
53719 3230250 3224647 3221617 3221887 3223100 3224200 3227146 3233295 3240550 3246132 3250178 3254105 3257160 3257987 3258662 3263323
53704 3263323 3272625 3282946 3291642 3299684 3308126 3315564 3321130 3326944 3334812 3342463 3345867 3344272 3340671 3338253
53690 3338253 3338518 3342020 3348424 3355727 3361319 3364167 3364949 3364330 3362419 3359863 3358213 3358844 3362051 3366872 3371283
53675 3371283 3373172 3372206 3370444 3370238 3371863 3373922 3375525 3376963 3378728 3381030 3384037 3387371 3389409 3388372
53661 3388372 3384443 3379911 3376924 3375764 3375636 3376430 3379054 3384096 3390503 3395812 3397855 3396195 3391804 3385815
$$ packed form
53763C315207l491j888j059k062m032n100n226o095p878q393o269l075j202j322
53749C258115k771m716n808m560j637k59k438n927o719l959o40K96r98k162j465
53734C214352M99J595P05n39N54M039O535N031O78k329j402J709K883J08m168
53719C230250n603l030K70J213J100K946O149P255N582M046L927L055Q27O75M661
53704C263323R302J0321Q696Q042Q442P438N566N814P868P651L404j595l601k418
53690C338253K65L502O404P303N592K848P82o19j911k556j650O31L207M821M411
53675C371283J889r66j762k06J625K059J603J438J765K302L007L334K038j037
53661C388372l929m532k987j160j28P94K624N042O407N309K043j660m391n989
$$ plain form
53647 3385815 3379268 3373645 3370338 3369298 3369412 3370518 3373711 3379113 3384899 3389569 3393672 3398056 3402094 3405501
53633 3405501 3410294 3418224 3427148 3433064 3435634 3438496 3443578 3448534 3451452 3454851 3462043 3471592 3479003 3483222
53619 3483222 3487974 3496189 3506283 3515434 3524021 3534458 3547072 3559886 3572313 3586495 3604048 3623117
53607 3623117 3640037 3653075 3663323 3672502 3681273 3689744 3698264 3706935 3714772 3720092 3721858 3720719 3718838
53594 3718838 3718679 3721681 3727885 3736469 3746049 3754465 3759350 3759875 3757675 3755248 3753628 3752065 3749515 3745787
53580 3745787 3741960 3740639 3744988 3755793 3769604 3781184 3787600 3788653 3784180 3773823 3759930 3747793
53568 3747793 3741244 3739608 3740285 3742610 3747539 3754984 3763316 3770632 3775207 3776079 3775025 3776890 3785661 3800470
53554 3800470 3816890 3831615 3844498 3857090 3871274 3888606 3908600 3927760 3942470 3952981 3962756
$$ packed form
53647C385815o547n623l307j040J14J106L193N402N786M670M103M384M038L407
53633C405501M793P930Q924N916K570K862N082M956K918L399P192R549P411M219
53619C483222M752Q215J0094R151Q587J0437J2614J2814J2427J4182J7553J9069
53607C623117J6920J3038J0248R179Q771Q471Q520Q671P837N320J766j139j881
53594C718838j59L002O204Q584R580Q416M885N25k200k427j620j563k550l728
53580C745787l827j321M349J0805J3811J1580O416J053m473j0357j3893j2137
53568C747793o549j636O77K325M929P445Q332P316M575Q72j054J865Q771J4809
53554C800470J6420J4725J2883J2592J4184J7332J9994J9160J4710J0511R775
$$ plain form
53543 3962756 3974031 3986161 3998475 4012317 4029408 4049899 4072803 4096845 4120418 4142400 4163861
53532 4163861 4187501 4214642 4244108 4274515 4306041 4339140 4373224 4407755 4443241 4480118 4518079
53521 4518079 4557674 4601032 4649380 4700981 4753157 4805525 4859534 4915467 4971822 5027560 5083298
53510 5083298 5139923 5197218 5254347 5311074 5368150 5426799 5487865 5551350 5616840 5684041 5752060
53499 5752060 5818430 5880528 5938759 5996720 6056821 6116884 6172950 6224898 6277388 6334922 6397127
53488 6397127 6459063 6515335 6564029 6607733 6651182 6697542 6746911 6797832 6848614 6896419 6937230
53477 6937230 6969125 6994771 7018271 7039990 7056997 7068472 7077553 7086914 7095206 7099447 7098724 7093741 7084817
53464 7084817 7072759 7060324 7049797 7039392 7024549 7003212 6977850 6951930 6926308 6899959 6872567
$$ packed form
53543C962756J1275J2130J2314J3842J7091K0491K2904K4042K3573K1982K1461
53532D163861K3640K7141K9466L0407L1526L3099L4084L4531L5486L6877L7961
53521D518079L9595M3358M8348N1601N2176N2368N4009N5933N6355N5738N5738
53510E083298N6625N7295N7129N6727N7076N8649O1066O3485O5490O7201O8019
53499E752060O6370O2098N8231N7961O0101O0063N6066N1948N2490N7534O2205
53488F397127O1936N6272M8694M3704M3449M6360M9369N0921N0782M7805M0811
53477F937230L1895K5646K3500K1719J7007J1475R081R361Q292M241p23m983q924
53464G084817j2058j2435j0527j0405j4843k1337k5362k5920k5622k6349k7392
$$ plain form
53453 6872567 6844840 6817036 6788617 6759480 6730766 6704235 6680942 6660408 6641033 6621554 6602082
53442 6602082 6583387 6565392 6547208 6528825 6511858 6497976 6487288 6479164 6474051 6473062 6475660 6479270
53430 6479270 6482360 6487109 6497540 6515083 6537495 6562631 6591608 6626797 6667813 6711673 6756741 6804245
53418 6804245 6855265 6908489 6962541 7018844 7080000 7146179 7215378 7287039 7363237 7445944 7534934
53407 7534934 7628934 7727128 7828658 7932059 8036294 8141504 8248009 8355548 8464343 8575969
53397 8575969 8692116 8812839 8936368 9059897 9180537 9297033 9411436 9527618 9646817
53388 9646817 9765707 9879945 9988358 10092301 10192309 10287373 10376602 10459501 10535083 10602698
53378 10602698 10663253 10717647 10764522 10801803 10830042 10851652 10866837 10873092 10869154 10856492 10835753
$$ packed form
53453F872567k7727k7804k8419k9137k8714k6531k3293k0534j9375j9479j9472
53442F602082j8695j7995j8184j8383j6967j3882j0688q124n113r89K598L610
53430F479270L090M749J0431J7543K2412K5136K8977L5189M1016M3860M5068M7504
53418F804245N1020N3224N4052N6303O1156O6179O9199P1661P6198Q2707Q8990
53407G534934R4000R8194J01530J03401J04235J05210J06505J07539J08795J11626
53397H575969J16147J20723J23529J23529J20640J16496J14403J16182J19199
53388I646817J18890J14238J08413J03943J00008R5064Q9229Q2899P5582O7615
53378A0602698O0555N4394M6875L7281K8239K1610J5185O255l938j2662k0739
$$ plain form
53367 10835753 10804732 10761805 10709271 10651182 10589444 10523880 10454304 10380116 10299245 10210588 10117280
53356 10117280 10024831 9935316 9845188 9749467 9646687 9539143 9429728 9319937 9210587 9103144
53346 9103144 8999367 8899639 8802458 8706262 8611208 8518138 8426308 8333867 8240623 8148397 8058118
53335 8058118 7968875 7881086 7798372 7723892 7655986 7589818 7522880 7457054 7395595 7339912 7289099
53324 7289099 7240970 7193565 7146911 7103155 7063867 7027800 6992629 6958093 6925574 6895243 6865912
53313 6865912 6837781 6813100 6793571 6778817 6767829 6760272 6755847 6754089 6755585 6762026 6774153 6790671
$$ packed form
53367A0835753l1021m2927n2534n8089o1738o5564o9576p4188q0871q8657r3308
53356A0117280r2449q9515r0128r5721j02780j07544j09415j09791j09350j07443
53346I103144j03777r9728r7181r6196r5054r3070r1830r2441r3244r2226r0279
53335H058118q9243q7789q2714p4480o7906o6168o6938o5826o1459n5683n0813
53324G289099m8129m7405m6654m3756l9288l6067l5171l4536l2519l0331k9331
53313F865912k8131k4681j9529j4754j0988p557m425j758J496O441J2127J6518
$$ [...]
##END NTUPLES=NMR SPECTRUM
##END=
