
##TITLE=AC1302_PERAH12114_6608382_PZ89wDSsjw
##JCAMPDX= 6.0         $$ Bruker NMR JCAMP-DX V2.0
##DATA TYPE= NMR SPECTRUM
##DATA CLASS= NTUPLES
##ORIGIN= BRUKER
##OWNER= Administrator
$$ 1.72 TOPSPIN		Version 2.1
$$ 2012-08-15 18:05:07.828 -0500  Administrator@TOPSPIN
$$ Compression mode = diff/dup
##.OBSERVE FREQUENCY= 400.02188249412
##.OBSERVE NUCLEUS= ^1H
##.ACQUISITION MODE= SIMULTANEOUS (DQD)
##.ACQUISITION SCHEME= undefined
##.AVERAGES= 32
##.DIGITISER RES= 22
##SPECTROMETER/DATA SYSTEM= spect
##.PULSE SEQUENCE= noesygpps1d.comp
##.SOLVENT NAME= COFFEE_meoh
##.SHIFT REFERENCE= INTERNAL, COFFEE_meoh, 1, 14.96054
##AUDIT TRAIL= $$ (NUMBER, WHEN, WHO, WHERE, PROCESS, VERSION, WHAT)
$$ ##TITLE= Audit trail, TOPSPIN		Version 2.1
$$ ##JCAMPDX= 5.01
$$ ##ORIGIN= Bruker BioSpin GmbH
$$ ##OWNER= Administrator
$$ $$ C:\Bruker\TOPSPIN/data/COFFEE/nmr/AC1302_PERAH12114_6608382_PZ89wDSsjw/52/pdata/1/auditp.txt
$$ ##AUDIT TRAIL=  $$ (NUMBER, WHEN, WHO, WHERE, PROCESS, VERSION, WHAT)
(   1,<2012-08-15 17:58:44.765 -0500>,<Administrator>,<TOPSPIN>,<go>,<TOPSPIN 2.1>,
      <acquisition in progress>)
(   2,<2012-08-15 18:05:02.531 -0500>,<Administrator>,<TOPSPIN>,<proc1d>,<TOPSPIN 2.1>,
      <Start of raw data processing
       efp LB = 0.3 FT_mod = 6 PKNL = 1 PHC0 = 0 PHC1 = 0 SI = 128K 
       data hash MD5: 128K
       27 02 08 1E 95 E1 4D 28 03 77 B0 4C 37 9D F5 BC>)
(   3,<2012-08-15 18:05:04.281 -0500>,<Administrator>,<TOPSPIN>,<proc1d>,<TOPSPIN 2.1>,
      <pk PHC0 = 1.983032 PHC1 = 0 
       data hash MD5: 128K
       21 60 DA B9 4B E6 2B 85 87 D6 C0 07 51 10 2F 9D>)
(   4,<2012-08-15 18:05:05.625 -0500>,<Administrator>,<TOPSPIN>,<proc1d>,<TOPSPIN 2.1>,
      <abs ABSG = 1 
       data hash MD5: 128K
       C0 4C 25 76 A0 44 3C AE 6C 3A C3 1E 60 59 7D FF>)
(   5,<2012-08-15 18:05:06.093 -0500>,<Administrator>,<TOPSPIN>,<proc1d>,<TOPSPIN 2.1>,
      <abs ABSG = 2 
       data hash MD5: 128K
       21 63 29 6B 34 61 68 39 E0 02 B9 CE 5F EE ED 70>)
(   6,<2012-08-15 18:05:06.484 -0500>,<Administrator>,<TOPSPIN>,<proc1d>,<TOPSPIN 2.1>,
      <abs ABSG = 3 
       data hash MD5: 128K
       6B CD EC CC 0D 17 DE 14 13 AB 05 46 BA 73 BE C8>)
(   7,<2012-08-15 18:05:06.890 -0500>,<Administrator>,<TOPSPIN>,<proc1d>,<TOPSPIN 2.1>,
      <abs ABSG = 4 
       data hash MD5: 128K
       4F 85 79 84 EF D8 44 9D 63 CC 9B 68 69 F3 AA 09>)
(   8,<2012-08-15 18:05:07.296 -0500>,<Administrator>,<TOPSPIN>,<proc1d>,<TOPSPIN 2.1>,
      <abs ABSG = 5 
       data hash MD5: 128K
       0E 61 53 1F 11 DC B2 49 7D 02 99 FA B4 C9 98 66>)
$$ ##END=
$$ 
$$ $$ hash MD5
$$ $$ 3C DF 05 CB D2 C7 3D 05 0B 21 C7 7E 6A B4 8A D7
##$RELAX= 
##$RELAX= 
##$RELAX= 
##$RELAX= 
##$RELAX= 
##$RELAX= 
##$RELAX= 
##$RELAX= 
$$ Bruker specific parameters
$$ --------------------------
##$DU= <C:\Bruker\TOPSPIN>
##$EXPNO= 52
##$NAME= <AC1302_PERAH12114_6608382_PZ89wDSsjw>
##$PROCNO= 1
##$TYPE= <nmr>
##$USER= <COFFEE>
##$ACQT0= -6.47421674871675
##$AMP= (0..31)
$$ [...]
150 150 150 150 150 150 150 150
##$TP07= 0
##$TPNAME0= <>
##$TPNAME1= <>
##$TPNAME2= <>
##$TPNAME3= <>
##$TPNAME4= <>
##$TPNAME5= <>
##$TPNAME6= <>
##$TPNAME7= <>
##$TPOAL= (0..7)
0.5 0.5 0.5 0.5 0.5 0.5 0.5 0.5
##$TPOFFS= (0..7)
0 0 0 0 0 0 0 0
##$TUNHIN= 0
##$TUNHOUT= 0
##$TUNXOUT= 0
##$USERA1= <user>
##$USERA2= <user>
##$USERA3= <user>
##$USERA4= <user>
##$USERA5= <user>
##$V9= 5
##$VALIST= <valist>
##$VCLIST= <CCCCCCCCCCCCCCC>
##$VD= 0
##$VDLIST= <DDDDDDDDDDDDDDD>
##$VPLIST= <PPPPPPPPPPPPPPP>
##$VTLIST= <TTTTTTTTTTTTTTT>
##$WBST= 1024
##$WBSW= 4
##$XGAIN= (0..3)
0 0 0 0
##$XL= 0
##$YL= 0
##$YMAX_a= 0
##$YMIN_a= 0
##$ZGOPTNS= <>
##$ZL1= 120
##$ZL2= 120
##$ZL3= 120
##$ZL4= 120
##$ABSF1= 14.96054
##$ABSF2= -5.597642
##$ABSG= 5
##$ABSL= 3
##$ALPHA= 0
##$AQORDER= 0
##$ASSFAC= 0
##$ASSFACI= 0
##$ASSFACX= 0
##$ASSWID= 0
##$AUNMP= <proc_prof1d_extract.lims>
##$AXLEFT= 0
##$AXNAME= <>
##$AXNUC= <1H>
##$AXRIGHT= 0
##$AXTYPE= 0
##$AXUNIT= <>
##$AZFE= 0.1
##$AZFW= 0.1
##$BCFW= 0
##$BC_mod= 0
##$BYTORDP= 0
##$COROFFS= 0
##$CY= 15
##$DATMOD= 1
##$DC= 0
##$DFILT= <>
##$DTYPP= 0
##$F1P= 0
##$F2P= 0
##$FCOR= 0.5
##$FTSIZE= 131072
##$FT_mod= 6
##$GAMMA= 0
##$GB= 0
##$INTBC= 1
##$INTSCL= 1
##$ISEN= 128
##$LB= 0.3
##$LEV0= 0
##$LPBIN= 0
##$MAXI= 10000
##$MC2= 0
##$MEAN= 0
##$ME_mod= 0
##$MI= 0
##$NCOEF= 0
##$NC_proc= -4
##$NLEV= 6
##$NOISF1= 0
##$NOISF2= 0
##$NSP= 0
##$NTH_PI= 0
##$NZP= 0
##$OFFSET= 14.96054
##$PC= 1
##$PHC0= 1.983032
##$PHC1= 0
##$PH_mod= 1
##$PKNL= yes
##$PPARMOD= 0
##$PPDIAG= 0
##$PPIPTYP= 0
##$PPMPNUM= 2147483647
##$PPRESOL= 1
##$PSCAL= 4
##$PSIGN= 0
##$PYNMP= <proc.py>
##$REVERSE= no
##$SF= 400.020009821528
##$SI= 131072
##$SIGF1= 0
##$SIGF2= 0
##$SINO= 400
##$SIOLD= 131072
##$SPECTYP= <>
##$SREGLST= <1H.CDCl3>
##$SSB= 0
##$STSI= 131072
##$STSR= 0
##$SW_p= 8223.68421052631
##$SYMM= 0
##$S_DEV= 0
##$TDeff= 65536
##$TDoff= 0
##$TI= <>
##$TILT= no
##$TM1= 0
##$TM2= 0
##$TOPLEV= 0
##$USERP1= <user>
##$USERP2= <user>
##$USERP3= <user>
##$USERP4= <user>
##$USERP5= <user>
##$WDW= 1
##$XDIM= 131072
##$YMAX_p= 527650927
##$YMIN_p= -33490
##$CURPLOT= <Network HP LaserJet P1505>
##$CURPRIN= <$Network HP LaserJet P1505>
##$DFORMAT= <normdp>
##$LAYOUT= <+/1D_H.xwp>
##$LFORMAT= <normlp>
##$PFORMAT= <normpl>
##$SURQMSG= 1
$$ End of Bruker specific parameters
$$ ---------------------------------
##NTUPLES= NMR SPECTRUM
##VAR_NAME=  FREQUENCY,     SPECTRUM/REAL,   SPECTRUM/IMAG
##SYMBOL=    X,             R,               I
##VAR_TYPE=  INDEPENDENT,   DEPENDENT,       DEPENDENT
##VAR_FORM=  AFFN,          ASDF,            ASDF
##VAR_DIM=   131072,        131072,          131072
##UNITS=     HZ,            ARBITRARY UNITS, ARBITRARY UNITS
##FACTOR=    0.0627417313425164, 1,          1
##FIRST=     8223.62146879497, -1373,        -153454
##LAST=      0,             2076,            -155630
##MIN=       0,             -33490,          0
##MAX=       8223.62146879497, 527650927,    0
$$ Real data points
##PAGE= N=1
##DATA TABLE= (X++(R..R)), XYDATA
$$ [...]
63539B016776L1006K3761J7931J3081P572J238m297q164j1382j4761j7240j7570
63527B037951j6726j7402k1349k8050l5594m2078m6317m8032m7806m6762m6161
63516A641674m6797m8168m8379m5847m1325l7320l5149l3541l0820k7390k4934
63505A222004k3855k2925k1244j9241j7466j5652j3481j1513j0596j0782j1183
63494A044066j0772r059o442m174l492m207m569l198j031n07k655n665o739m898
63480I76658j449J824M154N601O187N625L597L49k774l698j593J570K593O99j570
63465I97773j809p94p46j809k339k071k438l554l426j291N74J00j336j016J028
63450I76846K563L076M398P423J0711J3031J4971J7065J8542J9347K1342K5414
$$ plain form
63539 2016776 2047782 2071543 2089474 2102555 2110127 2111365 2107068 2098904 2087522 2072761 2055521 2037951
63527 2037951 2021225 2003823 1982474 1954424 1918830 1876752 1830435 1782403 1734597 1687835 1641674
63516 1641674 1594877 1546709 1498330 1452483 1411158 1373838 1338689 1305148 1274328 1246938 1222004
63505 1222004 1198149 1175224 1153980 1134739 1117273 1101621 1088140 1076627 1066031 1055249 1044066
63494 1044066 1033294 1024235 1017793 1013619 1010127 1005920 1001351 998153 997122 996615 993960 988295 981556 976658
63480 976658 975209 977033 981187 986788 992975 998600 1002197 1002546 999772 996074 994481 996051 998644 999343 997773
63465 997773 995964 995170 994424 992615 990276 988205 985767 982213 978787 977496 978070 978170 976834 975818 976846
63450 976846 979409 982485 986883 994306 1005017 1018048 1033019 1050084 1068626 1087973 1109315 1134729
63438A134729K9033K9221K7162K7192L1353L7349M2074M4662M5307M3621L9844
63427A531547L5990L3824L2652L0729K7994K5912K5367K6289K8755L2608L6321
63416A867988L8194L8792M0408M3652M6147M5269M0896L4821K8519K2195J5215
63405B262096P078j334p623j0218j0838j2829j6784j9982k1083k2846k8147l5272
63393B082218l9913m1021m1714m4361m7396m7957m5794m3204m2002m1688m0318
63382A606850l6665l1531k6970k4100k1993j9041j4944j0754p507n549m663l871
63370A399262j531L180R138J4537J8961K3048K6633K8776K9668L0867L3258L6179
63358A651976L9020M2428M7022N1832N4810N4543N1136M5883M0346L5327L0520
$$ plain form
63438 1134729 1163762 1192983 1220145 1247337 1278690 1316039 1358113 1402775 1448082 1491703 1531547
63427 1531547 1567537 1601361 1634013 1664742 1692736 1718648 1744015 1770304 1799059 1831667 1867988
63416 1867988 1906182 1944974 1985382 2029034 2075181 2120450 2161346 2196167 2224686 2246881 2262096
63405 2262096 2269174 2267840 2260217 2249999 2239161 2226332 2209548 2189566 2168483 2145637 2117490 2082218
63393 2082218 2042305 2001284 1959570 1915209 1867813 1819856 1774062 1730858 1688856 1647168 1606850
63382 1606850 1570185 1538654 1511684 1487584 1465591 1446550 1431606 1420852 1413345 1407796 1403133 1399262
63370 1399262 1397731 1400911 1410049 1424586 1443547 1466595 1493228 1522004 1551672 1582539 1615797 1651976
63358 1651976 1690996 1733424 1780446 1832278 1887088 1941631 1992767 2038650 2078996 2114323 2144843
63347B144843K5427K0242J5338J0389N054L2l786o942j0665j4678j7444j8924
63335B148886k1268k6013l2026l7060m0202m1919m2781m3099m3008m2135l9953
63324A739422l7013l4969l4700l5032l3864k9955k3661j7090j3600j5407k0914
63313A443217k5816k7691k8033k9080l0438l0408k8788k6518k3786k0605j8320
63302A153734j8210j9010j8093j5117j2520j2110j2920j2946j1523r302p133n693
63290I99157n471o468q114r699j0598j0313q974p456o404n426m021k739k287j968
63276I09219n37J434J727n20l347m200k600L3K077K413M74k925n243m044L40M823
63260H99124O701O331O154P412Q800Q629P396P085Q333R637R715R255R488J0200
$$ plain form
63347 2144843 2170270 2190512 2205850 2216239 2221293 2221325 2217539 2210597 2199932 2185254 2167810 2148886
63335 2148886 2127618 2101605 2069579 2032519 1992317 1950398 1907617 1864518 1821510 1779375 1739422
63324 1739422 1702409 1667440 1632740 1597708 1563844 1533889 1510228 1493138 1479538 1464131 1443217
63313 1443217 1417401 1389710 1361677 1332597 1302159 1271751 1242963 1216445 1192659 1172054 1153734
63302 1153734 1135524 1116514 1098421 1083304 1070784 1058674 1045754 1032808 1021285 1011983 1004850 999157
63290 999157 993686 987218 979104 969405 958807 948494 939520 932064 925660 920234 916213 913474 911187 909219
63276 909219 908682 910116 911843 911323 907976 903776 901176 901209 903286 905699 906173 903248 898005 893961 894301 899124
63260 899124 905825 912156 918310 925722 934522 943151 950547 957632 965965 975602 985317 994572 1004060 1014260
63246A014260J0505J0866J2673J5879J8622J9639J9880K1024K3164K4880K5355
63235A216747K5701K7923L2686L8272M1907M2165L9966L7457L6391L7441M0049
63224A616705M2410M2516M0197L7584L6662L6921L6302L4026L1142K8536K5891
63213B008892K2869J9902J7144J3625Q319J575n195j0923j5557j9557k3268k6644
63201A991182k9312l0890l1414l1324l0919k9928k7775k4350k0459j7222j4843
63190A702746j2290q599m175nM057Q924J4027J7225J7957J8935K2830K8114L0474
63177A840220K8437K5491K5745K8977L1264K9731K5280K0817J7990J6140J3824
63166B103916J0381N903M76n739j1956j7202k1443k5525k9797l3654l6654l9177
$$ plain form
63246 1014260 1024765 1035631 1048304 1064183 1082805 1102444 1122324 1143348 1166512 1191392 1216747
63235 1216747 1242448 1270371 1303057 1341329 1383236 1425401 1465367 1502824 1539215 1576656 1616705
63224 1616705 1659115 1701631 1741828 1779412 1816074 1852995 1889297 1923323 1954465 1983001 2008892
63213 2008892 2031761 2051663 2068807 2082432 2090751 2092326 2087131 2076208 2060651 2041094 2017826 1991182
63201 1991182 1961870 1930980 1899566 1868242 1837323 1807395 1779620 1755270 1734811 1717589 1702746
63190 1702746 1690456 1681857 1677682 1677677 1681734 1690658 1704685 1721910 1739867 1758802 1781632 1809746 1840220
63177 1840220 1868657 1894148 1919893 1948870 1980134 2009865 2035145 2055962 2073952 2090092 2103916
63166 2103916 2114297 2120200 2120676 2114937 2102981 2085779 2064336 2038811 2009014 1975360 1938706 1899529
63154A899529m1459m3004m3557m3743m4019m3893m2883m1306l9360l6618l3432
63143A446255l1450l1222l0477k6785k1206j7222j6345j6614j5422j2164q058
63132A219290m863l722m002l551j457J53j125m100n200l251m03J688L692N998
63118A199147P358P390P766R188R548P229M301L888N631O218M031J080L03K444
63104A275522N625P026N186J540o36M07K980M156L120J513R93J675K605K806K001
63089A316519R77J010K441M168N058N215N333N603O034P065Q820J0229J0140R172
63075A397784R430J2053J5618J7447J6490J4706J5086J8209K1547K2908K3424
63064A584702K5553K9084L1628L2962L5912M1961M8654N3065N5662N8762O2903
$$ plain form
63154 1899529 1858070 1815066 1771509 1727766 1683747 1639854 1596971 1555665 1516305 1479687 1446255
63143 1446255 1414805 1383583 1353106 1326321 1305115 1287893 1271548 1254934 1239512 1227348 1219290
63132 1219290 1214427 1210705 1206703 1203152 1201695 1201848 1200723 1196623 1191423 1188172 1187769 1189457 1193149 1199147
63118 1199147 1206505 1213895 1221661 1230849 1240397 1247626 1251927 1255815 1261446 1267664 1271695 1272775 1273078 1275522
63104 1275522 1281147 1288173 1293359 1294899 1294263 1294670 1297650 1301806 1304926 1306439 1307432 1309107 1311712 1314518 1316519
63089 1316519 1317496 1318506 1320947 1325115 1330173 1335388 1340721 1346324 1352358 1359423 1368243 1378472 1388612 1397784
63075 1397784 1407214 1419267 1434885 1452332 1468822 1483528 1498614 1516823 1538370 1561278 1584702
63064 1584702 1610255 1639339 1670967 1703929 1739841 1781802 1830456 1883521 1939183 1997945 2060848
63053B060848O6976P0655P4388P7897Q0726Q3500Q6721Q9127Q9339Q8469Q8952
63042B957598R1234R3624R4987R5480R5013R3228R0970Q9476Q7946Q4096P7362
63031C951014O9467O1461N2388M1495K9598J7396M336r765k3749l6769m9295o1221
63019D046356p0596p5714p7389p7684p7455p6438p4777p2833o9997o5253n8660
63008C249560n1041m2582l3044k3164j4268o249K631J3228K3784L1632L6072L8549
62996C225108M0285M0930M0041L8914L9675M2646M5484M5461M1981L6639L1380
62985C668544K7018K2913J7439R325q33j0846j9331k7347l6802m7771n8347o6893
62973C477069p3319p8358q2607q6309q9237r0750r0599q9401q7636q4780q0447
$$ plain form
63053 2060848 2127824 2198479 2272867 2350764 2431490 2514990 2601711 2690838 2780177 2868646 2957598
63042 2957598 3048832 3142456 3237443 3332923 3427936 3521164 3612134 3701610 3789556 3873652 3951014
63031 3951014 4020481 4081942 4134330 4175825 4205423 4222819 4227155 4217390 4193641 4156872 4107577 4046356
63019 4046356 3975760 3900046 3822657 3744973 3667518 3591080 3516303 3443470 3373473 3308220 3249560
63008 3249560 3198519 3155937 3122893 3099729 3085461 3079212 3081843 3095071 3118855 3150487 3186559 3225108
62996 3225108 3265393 3306323 3346364 3385278 3424953 3467599 3513083 3558544 3600525 3637164 3668544
62985 3668544 3695562 3718475 3735914 3745239 3744406 3733560 3714229 3686882 3650080 3602309 3543962 3477069
62973 3477069 3403750 3325392 3242785 3156476 3067239 2976489 2885890 2796489 2708853 2624073 2543626
62962B543626p5820p2472p0087o6993o2826n8853n5578n1947m7574m3956m2414
62951A895106m2288m2117m1328l9845l7380l4412l2650l2991l3772l2533k9006
62940A496784k5079k2266k0612j9863k0165k1286k2126k1431j8720j4512j0213
62929A280511p578p520r224j0807j0936r616p622n623l974l094l671o002q917
62916A185927j0069q337n605m888o574p990p119n158m408n075n630n273m335k851
62902A102615n57J703K229N16j995l589l838l324k637k117j991k416l430m787
62888A076382n684n106k859P4K596M337M989L845J049j507j975q19O3J02L10J015
62872A076812J180K12j165k228k911k788j151J256K332J343r4p95j897m377o472
$$ plain form
62962 2543626 2467806 2395334 2325247 2258254 2195428 2136575 2080997 2029050 1981476 1937520 1895106
62951 1895106 1852818 1810701 1769373 1729528 1692148 1657736 1625086 1592095 1558323 1525790 1496784
62940 1496784 1471705 1449439 1428827 1408964 1388799 1367513 1345387 1323956 1305236 1290724 1280511
62929 1280511 1272933 1265413 1256189 1245382 1234446 1224830 1217208 1211585 1207611 1204517 1200846 1194844 1185927
62916 1185927 1175858 1167521 1161916 1157028 1150454 1142464 1135345 1130187 1125779 1120704 1115074 1109801 1105466 1102615
62902 1102615 1102058 1103761 1105990 1106506 1104511 1100922 1097084 1093760 1091123 1089006 1087015 1084599 1081169 1076382
62888 1076382 1070698 1065592 1062733 1062807 1065403 1069740 1074729 1078574 1079623 1078116 1076141 1075322 1075385 1075487 1075797 1076812
62872 1076812 1077992 1078204 1077039 1074811 1071900 1069112 1067961 1069217 1071549 1072892 1072798 1072003 1070106 1065729 1059257
62857A059257n777k940q27n79p53j73O63J230J914K701K788K165J962K429K300
62842A066360J059J25L91K08k267n667o510l490J039L933M129K455P7k051l099
62827A056692k647r68J219L157M378M935N230N302M709L577L135M342O358P499
62813A106918P441P362Q025R057J0196J1759J3457J4238J4031J4368J6277J8598
62801A251727J9477J8712J7626J7360J8298K0593K4112K8212L2444L7014M1775
62790A527350M5608M8024N0689N5692O2622O9033P3946P9212Q6787R5971J04143
62779B299077J09526J12517J14836J17762J20872J22305J20732J16908J12621
62770C347156J08166J01881R2307P9662O4872M8295L0165J1375p039k4658m1192
$$ plain form
62857 1059257 1053480 1050540 1049713 1049134 1048381 1048208 1048871 1050101 1052015 1054716 1057504 1059669 1061631 1064060 1066360
62842 1066360 1067419 1067544 1067935 1068143 1065876 1060209 1053699 1050209 1051248 1055181 1059310 1061765 1061842 1059791 1056692
62827 1056692 1054045 1053077 1054296 1057453 1061831 1066766 1071996 1077298 1082007 1085584 1088719 1093061 1099419 1106918
62813 1106918 1114359 1121721 1129746 1138803 1148999 1160758 1174215 1188453 1202484 1216852 1233129 1251727
62801 1251727 1271204 1289916 1307542 1324902 1343200 1363793 1387905 1416117 1448561 1485575 1527350
62790 1527350 1572958 1620982 1671671 1727363 1789985 1859018 1932964 2012176 2098963 2194934 2299077
62779 2299077 2408603 2521120 2635956 2753718 2874590 2996895 3117627 3234535 3347156
62770 3347156 3455322 3557203 3649510 3729172 3794044 3842339 3872504 3883879 3876840 3852182 3810990
62759C810990n5893o8324p9262q9841r9723j06999j10211j10150j09190j08861
62749B872536j08368j05959j01651r7599r5189r2784q7928q1256p6035p3448p0521
62738A881798o4142n5453m8300m4246m1321l7455l2994k9299k6533k3895k1106
62727A457054j8639j6776j5075j2724r283n317k210p80r6J679N099Q892J1909
62714A403733J4691J8293K2447K6065K9306L3660L9572M5249M8799N0876N4034
62703A786725N9706O6829P3579P9312Q4367Q8965R3072R6858J00392J03192J04689
62692B737686J04714J02940R8429R0783Q1343P1949O2526N1231L7166K1598N999
62681C466364r740k6319m3124n8376p0545p9118q4667q8757r2885r6758r8627
$$ plain form
62759 3810990 3755097 3686773 3607511 3517670 3417947 3310948 3200737 3090587 2981397 2872536
62749 2872536 2764168 2658209 2556558 2458959 2363770 2270986 2183058 2101802 2025767 1952319 1881798
62738 1881798 1817656 1762203 1713903 1669657 1628336 1590881 1557887 1528588 1502055 1478160 1457054
62727 1457054 1438415 1421639 1406564 1393840 1384557 1379240 1377030 1376250 1376154 1377833 1382932 1391824 1403733
62714 1403733 1418424 1436717 1459164 1485229 1514535 1548195 1587767 1633016 1681815 1732691 1786725
62703 1786725 1846431 1913260 1986839 2066151 2150518 2239483 2332555 2429413 2529805 2632997 2737686
62692 2737686 2842400 2945340 3043769 3134552 3215895 3287844 3350370 3401601 3438767 3460365 3466364
62681 3466364 3456624 3430305 3387181 3328805 3258260 3179142 3094475 3005718 2912833 2816075 2717448
62670B717448r8074r7186r7616r7780r5008q9694q4860q1672p7866p1374o3359
62659A762959n6425n1549m8153m5859m4497m3145m0827l7751l4603l1093k6626
62648A302431k2119j9491j9179j9544j9088j7898j6389j4095j0827p930o978p572
62636A121321p785o690n296m831n212n657n781n476m451k798j496j336j629j080
62622A061803J32L55j082k618k483r53N61J942M199O998Q293P244O166Q131J3193
62607A111881J8347K1014K1427K1479K2451K4406K7058L0319L4089L7919M1108
62596A411498M3330M5255M8095N1980N5315N6694N6968N7960N9130N7520N1749
62585A995494M4173L7639L1704K4158J4974O258j281r039j7481k5006l0649l5586
$$ plain form
62670 2717448 2619374 2522188 2424572 2326792 2231784 2142090 2057230 1975558 1897692 1826318 1762959
62659 1762959 1706534 1654985 1606832 1560973 1516476 1473331 1432504 1394753 1360150 1329057 1302431
62648 1302431 1280312 1260821 1241642 1222098 1203010 1185112 1168723 1154628 1143801 1135871 1128893 1121321
62636 1121321 1113536 1106846 1101550 1096719 1091507 1085850 1080069 1074593 1070142 1067344 1065848 1064512 1062883 1061803
62622 1061803 1061935 1062290 1061208 1058590 1056107 1055154 1055715 1057657 1061856 1068854 1077147 1084391 1090557 1098688 1111881
62607 1111881 1130228 1151242 1172669 1194148 1216599 1241005 1268063 1298382 1332471 1370390 1411498
62596 1411498 1454828 1500083 1548178 1600158 1655473 1712167 1769135 1827095 1886225 1943745 1995494
62585 1995494 2039667 2077306 2109010 2133168 2148142 2154400 2153119 2144080 2126599 2101593 2070944 2035358
62573B035358m0768m5093m7423m8615m9797n0183m8572m5845m3884m2834m1531
62562A530813l9982l9058l8072l5165l0403k6148k3751k2041j9929j8343j8074
62551A219847j7581j5085j1733j0432j1720j2926j1820r344p633o671m558q34
62539A099510K239K505R27M85K442N056O148N591M733M503N001O203Q011J0104
62525A163458J2426J5342J8753K2031K5484L0604L7508M3281M4843M2969M1619
62514A498318M3497M7897N2676N6429N8661N9545N9895O0026N8703N4630M8688
62503B098965M2963L7798L1833K4695J7292R581Q43p524j2611j4385j6293k0002
62491B193155k2530k0726j5919j1529q306m734m62L622P582J2002J6148J9059
$$ plain form
62573 2035358 1994590 1949497 1902074 1853459 1803662 1753479 1704907 1659062 1615178 1572344 1530813
62562 1530813 1490831 1451773 1413701 1378536 1348133 1321985 1298234 1276193 1256264 1237921 1219847
62551 1219847 1202266 1187181 1175448 1165016 1153296 1140370 1128550 1119206 1111573 1104902 1100344 1099510
62539 1099510 1101749 1104254 1105181 1105666 1108108 1113164 1119312 1124903 1129636 1134139 1139140 1145343 1153354 1163458
62525 1163458 1175884 1191226 1209979 1232010 1257494 1288098 1325606 1368887 1413730 1456699 1498318
62514 1498318 1541815 1589712 1642388 1698817 1757478 1817023 1876918 1936944 1995647 2050277 2098965
62503 2098965 2141928 2179726 2211559 2236254 2253546 2263127 2263970 2256446 2243835 2229450 2213157 2193155
62491 2193155 2170625 2149899 2133980 2122451 2114145 2109411 2108949 2112571 2120153 2132155 2148303 2167362
62479B167362K1568K4902K8091K9281K8786K8123K6717K2488J5610Q762L303k232
62467B402761r366j7774k6641l5577m3470m8605n0923n2451n4638n6871n8296
62456A948149n9400o0667o1183n9813n6854n3544n0544m7535m3697l8377l2013
62445A384522k6463k3390k2315k1173j8750j5405j1694p915m982l849l797l071
62433A221718j715j845m333p075p707o541n591n939p329r408j1939j4274j5477
62420A122545j4914j2614r804q770j0750j3794j4420j1786q410o343m918l413
62408A002609l336n822q536p964m117o07k02k164m047m506l912l239k747j644
62394I49766O53K943L293K164K688O370J0305J0782Q345O643P138P978P916Q102
$$ plain form
62479 2167362 2188930 2213832 2241923 2271204 2299990 2328113 2354830 2377318 2392928 2401690 2404993 2402761
62467 2402761 2393395 2375621 2348980 2313403 2269933 2221328 2170405 2117954 2063316 2006445 1948149
62456 1948149 1888749 1828082 1766899 1707086 1650232 1596688 1546144 1498609 1454912 1416535 1384522
62445 1384522 1358059 1334669 1312354 1291181 1272431 1257026 1245332 1237417 1232435 1228586 1224789 1221718
62433 1221718 1220003 1218158 1213825 1206750 1199043 1192502 1186911 1180972 1173643 1164235 1152296 1138022 1122545
62420 1122545 1107631 1095017 1085213 1076443 1065693 1051899 1037479 1025693 1017283 1010940 1006022 1002609
62408 1002609 999273 993451 984915 976951 972834 972227 972025 969861 965814 961308 957396 954157 951410 949766
62394 949766 950419 953362 956655 958819 961507 967877 978182 988964 997309 1003952 1011090 1019068 1026984 1035086
62380A035086R213R910R617J0241J3026J5780J5805J4256J4713J7908K0872K1738
62368A208165K2633K6309L2056L6952L9990M2641M5858M8915N1555N5081O0220
62357A670375O5496O9043P0883P2170P3272P4023P4794P5422P3894O8259N9650
62346B447281N1157M3703L5286K4605J2995J980q706j9349k8646l5606m1243m6565
62334B436892n0404n1444n1212n2602n5852n8054n6664n1994m6465m2789m2493
62323A876919m4654m6199m4770m1131l7612l4998l2602l0699l0523l1805l2514
62312A469412l1495k9618k7815k5803k3465k1780k1316k1063j9674j7072j4240
62301A216071j2370j2368j3838j4296j1237n725k033k460m427m320k408j485j975
$$ plain form
62380 1035086 1044299 1054209 1063826 1074067 1087093 1102873 1118678 1132934 1147647 1165555 1186427 1208165
62368 1208165 1230798 1257107 1289163 1326115 1366105 1408746 1454604 1503519 1555074 1610155 1670375
62357 1670375 1735871 1804914 1875797 1947967 2021239 2095262 2170056 2245478 2319372 2387631 2447281
62346 2447281 2498438 2542141 2577427 2602032 2615027 2617007 2608301 2588952 2560306 2524700 2483457 2436892
62334 2436892 2386488 2335044 2283832 2231230 2175378 2117324 2060660 2008666 1962201 1919412 1876919
62323 1876919 1832265 1786066 1741296 1700165 1662553 1627555 1594953 1564254 1533731 1501926 1469412
62312 1469412 1437917 1408299 1380484 1354681 1331216 1309436 1288120 1267057 1247383 1230311 1216071
62301 1216071 1203701 1191333 1177495 1163199 1151962 1146237 1144204 1141744 1137317 1132997 1130589 1129104 1127129
62288A127129j486R31L157L523L320M375O083O693O248O209O867P279P585R241
62274A197154J2428J5032J5285J4232J4389J6890K1023K5722L0067L3003L4334
62263A429559L5761L9229M4150M8062N0408N3688N9792O6981P2004P4071P5077
62252B048782P6722P8916Q0495P9886P5513O7128N6713M6595L6817K5692J2879
62241B686138K98j0277j9049k7216l5509m4174n3032o0761o5383o6585o6742o8460
62229B169248p1441p2786p0361o5205o0399n7908n6804n4676n0586m5986m2383
62218A520713l9144l4716k9390k5212k3038k1418j8837j5592j2636r928p098m806
62206A278898m022m406m364k632Q18M905P976Q861Q212Q193J0050J2565J3802
$$ plain form
62288 1127129 1125643 1126574 1129731 1133254 1136574 1140949 1147032 1153725 1159973 1166182 1173049 1180328 1187913 1197154
62274 1197154 1209582 1224614 1239899 1254131 1268520 1285410 1306433 1332155 1362222 1395225 1429559
62263 1429559 1465320 1504549 1548699 1596761 1647169 1700857 1760649 1827630 1899634 1973705 2048782
62252 2048782 2125504 2204420 2284915 2364801 2440314 2507442 2564155 2610750 2647567 2673259 2686138
62241 2686138 2686436 2676159 2657110 2629894 2594385 2550211 2497179 2436418 2371035 2304450 2237708 2169248
62229 2169248 2097807 2025021 1954660 1889455 1829056 1771148 1714344 1659668 1609082 1563096 1520713
62218 1520713 1481569 1446853 1417463 1392251 1369213 1347795 1328958 1313366 1300730 1290802 1283704 1278898
62206 1278898 1274876 1270470 1266106 1263474 1264292 1269197 1277173 1286034 1294246 1302439 1312489 1325054 1338856
62193A338856J3672J3667J4465J5259J5293J4754J3941J2681J1029R623R042R321
62181A491603J0291J1700J2915J3358J3350J3666J4159J3911J3131J3514J6003
62170A637601J9341K2008K4587K8690L4226L9466M3560M7134N0187N1426N0560
62159B048786M9387M9191M8263M3842L5866K7139K0061J4666R759M350k343j0765
62147B338202k0198k8915l5605l9987m2146m2543m2549m3358m3968m2033l7412
62136A919488l2987l1000l0388k9067k6930k4746k1944j7918j4023j1592r164
62125A669729m741K6J627M99J000M771Q056P509N124M644N794N527L163R03p1
62110A713560q18k010k836k916l250m649o797r077j0936j1350r573o749n055m863
$$ plain form
62193 1338856 1352528 1366195 1380660 1395919 1411212 1425966 1439907 1452588 1463617 1473240 1482282 1491603
62181 1491603 1501894 1513594 1526509 1539867 1553217 1566883 1581042 1594953 1608084 1621598 1637601
62170 1637601 1656942 1678950 1703537 1732227 1766453 1805919 1849479 1896613 1946800 1998226 2048786
62159 2048786 2098173 2147364 2195627 2239469 2275335 2302474 2322535 2337201 2346960 2351310 2348967 2338202
62147 2338202 2318004 2289089 2253484 2213497 2171351 2128808 2086259 2042901 1998933 1956900 1919488
62136 1919488 1886501 1855501 1825113 1796046 1769116 1744370 1722426 1704508 1690485 1678893 1669729
62125 1669729 1664988 1665014 1666641 1667140 1668140 1672911 1680967 1688476 1693600 1698244 1704038 1709565 1712728 1713631 1713560
62110 1713560 1712742 1710732 1707896 1704980 1701730 1697081 1690284 1681207 1670271 1658921 1649348 1642599 1637544 1632681
62096A632681m199j729J303L126M123O034R105J1611J2288J2022J2453J3631J4155
62083A726604J3702J4238J7590K2412K5305K5257K5098K7422L0729L1611K9791
62072A989759K8634L0698L4978L8964M1495M2645M2539M1609M1056M1813M3407
62061B417597M4597M4710M3784M1849L8676L3948K7518K0009J3061Q005M015j245
62049B736524q763j7067k4576l1521l8478m4403m7917m9755n2106n5728n9286
62038B306924o1581o2803o3451o3369o2391o0754n8394n4928n0785m7348m5236
62027A675884m3393m0606l7168l4221l2061l0091k8134k6673k5785k4691k2681
62016A330380k0051j7888j7094j7608j8366j8133j6651j4955j4158j3908j2489
$$ plain form
62096 1632681 1628482 1626753 1628056 1631182 1635305 1641339 1650444 1662055 1674343 1686365 1698818 1712449 1726604
62083 1726604 1740306 1754544 1772134 1794546 1819851 1845108 1870206 1897628 1928357 1959968 1989759
62072 1989759 2018393 2049091 2084069 2123033 2164528 2207173 2249712 2291321 2332377 2374190 2417597
62061 2417597 2462194 2506904 2550688 2592537 2631213 2665161 2692679 2712688 2725749 2733754 2737769 2736524
62049 2736524 2727761 2710694 2686118 2654597 2616119 2571716 2523799 2474044 2421938 2366210 2306924
62038 2306924 2245343 2182540 2119089 2055720 1993329 1932575 1874181 1819253 1768468 1721120 1675884
62027 1675884 1632491 1591885 1554717 1520496 1488435 1458344 1430210 1403537 1377752 1353061 1330380
62016 1330380 1310329 1292441 1275347 1257739 1239373 1221240 1204589 1189634 1175476 1161568 1149079
62005A149079q624l079J737L795L040J040p75k175l356l722k420p2J235L95j138
61990A134960j292l90q09l678p337r533r884r458r069r134j0165j1859j2134r013
61976A031205l694j82j010m600p587q478p755n680k266Q75J095j883m699l952
61962I81389j17L451M670M306L705K854J370q9n18N5R58K138L886N584O017N429
61946A025088O089R871J5640J9914K0203J7232J3971J3074J5350J9811K4450K7340
61934A228033K7834K6960K6209K5919K5250K3709K1946K0672J9499J7454J4283
61923A477768J0606P149M432K784J936R39n45j335k54J702K343J613K104N448
61909A516690R815J2188J1875J0375Q941P912P720Q662R848R837Q155N060N00
$$ plain form
62005 1149079 1140455 1137376 1139113 1142908 1145948 1146988 1146213 1144038 1140682 1136960 1134540 1134468 1135703 1136098 1134960
61990 1134960 1133668 1133278 1132469 1128791 1121454 1111921 1102037 1092579 1083510 1074376 1064211 1052352 1040218 1031205
61976 1031205 1027511 1027329 1026319 1021719 1014132 1005654 997899 992219 989953 990828 991923 990040 985341 981389
61962 981389 981272 984723 989393 993699 997404 1000258 1001628 1001539 1001021 1001076 1002034 1004172 1008058 1013642 1019659 1025088
61946 1025088 1031177 1041048 1056688 1076602 1096805 1114037 1128008 1141082 1156432 1176243 1200693 1228033
61934 1228033 1255867 1282827 1309036 1334955 1360205 1383914 1405860 1426532 1446031 1463485 1477768
61923 1477768 1488374 1495523 1499955 1502739 1504675 1505614 1505069 1503734 1503480 1505182 1507525 1509138 1511242 1516690
61909 1516690 1526505 1538693 1550568 1560943 1569884 1577796 1585516 1594178 1604026 1613863 1622018 1627078 1627578
61896A627578n088r546j0819j0064j0762j4204j7898j9205j8668j8624k0097k2361
61884A450242k4216k4623k3099k0523j8576j7533j5999j3681j2673j4458j7206
61873A247655j7960j6372j4231j2239r640o555m215k813j174J053K710L137L328
61860A172684M530O882R892J3130J6106J8470K0651K3360K6379K8928L1200L4237
61848A406449L8069M1269M2671M2327M0562L7440L3596L0202K7504K4478K0638
61837A785205J6888J4001J1345Q073M590J960N75J66M37R65J209J332K446N215
61823A854407Q687J1160J1764J0671Q300N000J178k826o941j1205j5634k0204
61811A854357k4711k8686l1899l4699l7248l8873l9105l8755l8693l8034l5331
$$ plain form
61896 1627578 1622490 1612944 1602125 1592061 1581299 1567095 1549197 1529992 1511324 1492700 1472603 1450242
61884 1450242 1426026 1401403 1378304 1357781 1339205 1321672 1305673 1291992 1279319 1264861 1247655
61873 1247655 1229695 1213323 1199092 1186853 1177213 1170658 1166443 1163630 1162456 1163509 1166219 1169356 1172684
61860 1172684 1177214 1184096 1193988 1207118 1223224 1241694 1262345 1285705 1312084 1341012 1372212 1406449
61848 1406449 1444518 1485787 1528458 1570785 1611347 1648787 1682383 1712585 1740089 1764567 1785205
61837 1785205 1802093 1816094 1827439 1835512 1840102 1842062 1842637 1842803 1843240 1844205 1845414 1846746 1849192 1854407
61823 1854407 1863094 1874254 1886018 1896689 1904989 1909989 1911167 1908341 1901400 1890195 1874561 1854357
61811 1854357 1829646 1800960 1769061 1734362 1697114 1658241 1619136 1580381 1541688 1503654 1468323
61800A468323l1359k8683k8125k7699k5681k2720k0126j8090j6753j7035j8834
61789A213218k0103j9324j7432j5753j3738j0627p870p444q726r484r324r695
61777A063698j0635j0122p108l322j172j157j958k141j180M82J983K815L006K556
61763A035745J318k29r95o65j00J66O91J704K314K130K154K901L213K369J625
61748A054341J922J995Q79K63J524K346r6l890m496j612L89q41k588j842O67K668
61732A051629L404K775L03l194n235m638k929j591k32J450K532L158N220Q854
61718A061506J0941R301N851L317J314j402l237j972Q53J477p79l029l348k716
61704A078077k463k726l713n942q463r051o901l692j479r49j894l929o261p842
$$ plain form
61800 1468323 1436964 1408281 1380156 1352457 1326776 1304056 1283930 1265840 1249087 1232052 1213218
61789 1213218 1193115 1173791 1156359 1140606 1126868 1116241 1108371 1100927 1092201 1082717 1073393 1063698
61777 1063698 1053063 1042941 1035833 1032511 1031339 1030182 1028224 1026083 1024903 1025385 1027368 1030183 1033189 1035745
61763 1035745 1037063 1036834 1035839 1035174 1035074 1035240 1035931 1037635 1039949 1042079 1044233 1047134 1050347 1052716 1054341
61748 1054341 1056263 1058258 1059137 1059400 1060924 1063270 1063174 1059284 1054788 1053176 1053565 1052724 1050136 1048294 1048961 1051629
61732 1051629 1055033 1057808 1058111 1054917 1049682 1045044 1042115 1040524 1040292 1041742 1044274 1047432 1052652 1061506
61718 1061506 1072447 1081748 1087599 1090916 1092230 1090828 1087591 1085619 1086472 1087949 1087170 1084141 1080793 1078077
61704 1078077 1075614 1072888 1069175 1063233 1054770 1045719 1038818 1035126 1033647 1032698 1030804 1026875 1020614 1012772
61690A012772q065o768m000p35J036M30q42q35m54k079n511p770p103m824k642
61675I62610m93J907L217J874j488m194l928p60K718L452R65j934k389r17j62
61660I60478q78j365q10o17j653k494j741l63m7n54k50J435L442M471L960K104
61644I65118k00j800k224j867j052K89J825K760L053L556M340M032J704j629m254
61629I73651n534n626m563k828j834k365l226k859j780j750k909l477k576j608
61615I30716k099l504m304m475n414p428q699p611n276m377n523o352n049l262
61601H57343l885o821r051q784p276o119n061l716l396n328q249r724r124p730
61587G63079o467n237m198l924m199m088l384k891l096l597l896l691k427J08
$$ plain form
61690 1012772 1004707 997939 993939 993204 994240 994670 993828 992993 992539 990460 984949 977179 970076 965252 962610
61675 962610 962117 964024 967241 969115 967627 963433 959505 958745 961463 964915 965880 963946 961557 960640 960478
61660 960478 959600 958235 957425 956808 955155 952661 950920 950557 950510 949956 949706 951141 954583 959054 963014 965118
61644 965118 964918 963118 960894 959027 957975 958264 960089 962849 965902 969458 973798 977830 979534 977905 973651
61629 973651 968117 962491 957928 955100 953266 950901 947675 944816 943036 941286 938377 934900 932324 930716
61615 930716 928617 925113 920809 916334 910920 903492 894793 887182 881906 877529 872006 865654 860605 857343
61601 857343 853458 846637 837586 828802 821526 815407 810346 806630 803234 797906 789657 779933 770809 763079
61587 763079 756612 751375 747177 743253 739054 734966 731582 728691 725595 721998 718102 714411 711984 712092
61573G12092K541K628l0l050l859k472q53k03n4J72N5p79j422p17P46R55o33j759
61555G03358k51K618L484J419r93j585j306j697j794J39K957L382M15l113l832
61540G03201j224K575N091N216L736K639L187M583N028L878J908m1j565k251k029
61525G33932j659j704j455l28M18o46k391k567j603j950l458k966L79L001K209
61510G19212L21O21J971J034k073m337m905n508o183m619m14L500M758M063K827
61495G10268J223k62k09J186J552Q8o31J179L028J723j458k577r42L04o31j866
61479G11975j274O26K260L140L259K450J635K726N721P516N517J280j480j485
61465G43866m47M43J996M588O439N527K086j702l795l611k151j350k378l999l662
$$ plain form
61573 712092 714633 717261 717231 714181 710322 707850 706997 706794 706740 706912 706967 706188 704766 704049 704795 705750 705117 703358
61555 703358 703107 705725 709209 710628 709635 708050 706744 705047 703253 703392 706349 709731 710146 707033 703201
61540 703201 701977 704552 709643 714859 718595 721234 724421 729004 734032 737910 739818 739777 738212 735961 733932
61525 733932 732273 730569 729114 728786 729204 728558 726167 723600 721997 720047 716589 713623 714002 717003 719212
61510 719212 719533 720154 722125 723159 721086 716749 711844 706336 700153 695534 695120 698620 703378 707441 710268
61495 710268 711491 711229 711020 712206 713758 713846 713215 714394 717422 719145 717687 715110 714168 714472 713841 711975
61479 711975 710701 711327 713587 716727 719986 722436 724071 726797 732518 740034 745551 746831 745351 743866
61465 743866 743419 743862 745858 750446 756885 762412 764498 762796 759001 755390 753239 751889 749511 745512 741850
61450G41850r32J400Q46j255j529P95L241M068M463N739O537M779J252r37k38
61435G70079J888L543M597N636O260N713M482L909M444N146M895L390J020j413
61421H23589k762k032O70L946O153O496N219L216J633J330K184L089K974J794
61407H57499L42o75j130j258j364j673k072k041j193l6K93p18k161k554j396L72
61391H40235J506J829K141K822K984J503j184l084k788j072K94P85J296K169K392
61376H51828J203l84n90R60K827L367K224L71r10j038l74N03J580L028M251M276
61360H73122L334K964L915N120N677O504Q424R822Q584N959N732Q990J2281J2198
61346I72626R582P490O867O565O386P395R480J0976J1038J0518R963Q596O037
$$ plain form
61450 741850 740918 742318 743164 741909 740380 741175 744416 748484 752947 758686 765223 770002 771254 770317 770079
61435 770079 771967 775510 780107 785743 792003 797716 802198 806107 810551 815697 820592 823982 825002 823589
61421 823589 820827 818795 819465 823411 829564 836060 841279 844495 846128 847458 849642 852731 855705 857499
61407 857499 857841 857166 856036 854778 853414 851741 849669 847628 846435 846399 846692 845974 843813 841259 839863 840235
61391 840235 841741 843570 845711 848533 851517 853020 851836 848752 845964 844892 845186 845971 847267 849436 851828
61376 851828 853031 852647 852057 853017 855844 859211 861435 861806 860896 859858 859484 859987 861567 864595 868846 873122
61360 873122 876456 879420 883335 888455 894132 900636 909060 918882 927466 933425 939157 948147 960428 972626
61346 972626 982208 989698 996565 1003130 1009516 1016911 1026391 1037367 1048405 1058923 1068886 1077482 1083519
61333A083519L606K749L108L250K660K014J814J781J595J375J282J123P46N51
61319A111173J148K372L051K321J110J533M289P405Q408P321O426P194Q897J0456
61305A183104J2254J4937J7443J7825J5992J4174J4057J4411J2599Q057L100Q8
61293A328041j169k450m382n952o460o527o825p143p495q777j1199j3001j2322
61280A234339r826p927p580p366n804l064r6K490M136M247L108J884J116K54p25
61265A209186n46J447L745M478M125M834P215R317R345Q177Q273J0407J2450J1834
61251A304287Q812O377O656Q283Q342O232M053L192K398P1l131n183n232l979
61237A341178k250m54R69J742K103K142J355k34j158K7K747N187O691P907Q816
$$ plain form
61333 1083519 1087125 1089874 1092982 1096232 1098892 1100906 1102720 1104501 1106096 1107471 1108753 1109876 1110622 1111173
61319 1111173 1112321 1114693 1117744 1120065 1121175 1122708 1126997 1134402 1142810 1150131 1156557 1163751 1172648 1183104
61305 1183104 1195358 1210295 1227738 1245563 1261555 1275729 1289786 1304197 1316796 1324853 1327953 1328041
61293 1328041 1326872 1324422 1320040 1314088 1307628 1301101 1294276 1287133 1279638 1270861 1259662 1246661 1234339
61280 1234339 1224513 1216586 1209006 1201640 1195836 1192772 1192676 1195166 1199302 1203549 1206657 1208541 1209657 1209911 1209186
61265 1209186 1208640 1210087 1213832 1218310 1222435 1227269 1234484 1243801 1253146 1261323 1269596 1280003 1292453 1304287
61251 1304287 1313099 1319476 1326132 1334415 1342757 1348989 1353042 1356234 1358632 1358703 1355572 1350389 1345157 1341178
61237 1341178 1338928 1338474 1339443 1341185 1343288 1345430 1346785 1346551 1345393 1345420 1348167 1353354 1360045 1367952 1376768
61222A376768Q401O660N367N955P685Q729Q353P396P088Q018R784J1225J1322
61209A482751J0264R192Q677P989O309M154K899L065L860M535N615P981J1026
61196A568317J2722J2114J1038J2172J5705J9139K0397J9605J7595J4558J1188
61185A734550R288R465R579P496M305K632K484J388j538m285n105m636m266m516
61171A756841n680p971j0171j0268q596q219j0796j4070j5068j3954j2741j1985
61159A627322j1126j0811j2128j4186j5052j4786j5090j6027j5650j3281j0838
61148A478347r954r845r078p801o911o348n666n401o337p817q086o412m074l031
61134A381586l914n363n194k553J039L201L593M616Q644J4853J9684K0541J8404
$$ plain form
61222 1376768 1385169 1391829 1397196 1403151 1410836 1419565 1427918 1435314 1442402 1450420 1460204 1471429 1482751
61209 1482751 1493015 1502207 1510884 1518873 1525182 1529336 1532235 1535300 1539160 1543695 1549310 1557291 1568317
61196 1568317 1581039 1593153 1604191 1616363 1632068 1651207 1671604 1691209 1708804 1723362 1734550
61185 1734550 1743838 1753303 1762882 1770378 1774683 1777315 1779799 1781187 1779649 1775364 1770259 1765623 1761357 1756841
61171 1756841 1751161 1743190 1733019 1722751 1714155 1705936 1695140 1681070 1666002 1652048 1639307 1627322
61159 1627322 1616196 1605385 1593257 1579071 1564019 1549233 1534143 1518116 1502466 1489185 1478347
61148 1478347 1468393 1458548 1449470 1441669 1434758 1428410 1422744 1417343 1411006 1403189 1395103 1388691 1384617 1381586
61134 1381586 1377672 1372309 1367115 1364562 1365601 1368802 1372395 1377011 1385655 1400508 1420192 1440733 1459137
61121A459137J6562J7229J9955K3030K5551K7733K9852L1801L3488L4920L5728
61110A754986L5415L4296L3449L3450L3769L3723L3143L1819K9418K6601K4869
61099B104938K4161K1800J5586P191N66k628m179o219r189j3061j8171k3769k7735
61086B069291k9003k8920k9016k8951k8061k7450k8394k9564k8172k3892j9715
61075A768153j8398j9470k0446j9798j7821j5313j2423q946n294k640j789j979
61063A623836j433N72K809L842M009M890P170J0072J2687J4877J6920J9108K1733
61050A741092K4663K7069K8427K9616L1903L4885L6911L7777L9439M3270M8085
61039B123137N2061N5311N8996O2794O5250O6489O8673P3284P9378Q5209R0436
$$ plain form
61121 1459137 1475699 1492928 1512883 1535913 1561464 1589197 1619049 1650850 1684338 1719258 1754986
61110 1754986 1790401 1824697 1858146 1891596 1925365 1959088 1992231 2024050 2053468 2080069 2104938
61099 2104938 2129099 2150899 2166485 2173676 2174242 2171614 2167435 2161216 2152027 2138966 2120795 2097026 2069291
61086 2069291 2040288 2011368 1982352 1953401 1925340 1897890 1869496 1839932 1811760 1787868 1768153
61075 1768153 1749755 1730285 1709839 1690041 1672220 1656907 1644484 1635538 1630244 1627604 1625815 1623836
61063 1623836 1622403 1622975 1625784 1629626 1633635 1638525 1645695 1655767 1668454 1683331 1700251 1719359 1741092
61050 1741092 1765755 1792824 1821251 1850867 1882770 1917655 1954566 1992343 2031782 2075052 2123137
61039 2123137 2175198 2230509 2289505 2352299 2417549 2484038 2552711 2625995 2705373 2790582 2881018
61028B881018R5787J01464J06986J12319J18125J24867J32353J40462J50034J63012
61018D126427J81671K07363K39515K75932L14806L56669M04094M59140N21484
61009G087101N89364O62094P41046Q28417R26180J036464J161462J301458J454075
61000A5787661J617312J790719J965568K108160K158172K058381J799298J438086
60992C0723357J069649P73442N80654M79694M38127M13057L50342J94116q5327
60983C4937111m65994q78253j241085j503945j663714j749115j790801j801827
60975B3842377j779030j717204j620811j504374j384155j269965j163680j063701
60967A2339457r69602q82593q03022p29103o58539n90838n27602m71023m22340
$$ plain form
61028 2881018 2976805 3078269 3185255 3297574 3415699 3540566 3672919 3813381 3963415 4126427
61018 4126427 4308098 4515461 4754976 5030908 5345714 5702383 6106477 6565617 7087101
61009 7087101 7676465 8338559 9079605 9908022 10834202 11870666 13032128 14333586 15787661
61000 15787661 17404973 19195692 21161260 23269420 25427592 27485973 29285271 30723357
60992 30723357 31793006 32566448 33147102 33626796 34064923 34477980 34828322 35022438 34937111
60983 34937111 34471117 33592864 32351779 30847834 29184120 27435005 25644204 23842377
60975 23842377 22063347 20346143 18725332 17220958 15836803 14566838 13403158 12339457
60967 12339457 11369855 10487262 9684240 8955137 8296598 7705760 7178158 6707135 6284795
60958F284795l81184l45704l13492k83041k54517k28817k06085j85714j67604
60949C918637j52446j40328j29975j20300j12026j06496j02950r8493r1397q3255
60939B780971p6964p3282p0480o6875o2413n7853n3717n0334m7907m6084m4224
60928B130838m2380m1183m0327l8221l3976k9013k5666k4480k3729k1502j7691
60917A792670j4028j2447j3188j4235j3121r578n705l127j177J242L279L459K790
60904A716834M356R310J4998J7901J7389J5751J5378J6771J8713J9719J9489J9397
60892A906006K1137K4617K7739K8501K6770K3682K0017J5972J2151R874J0001
60881B126467J1553J1933R142L976n81k713l756o057r548j2063j2739j3272j5360
$$ plain form
60958 6284795 5903611 5557907 5244415 4961374 4706857 4478040 4271955 4086241 3918637
60949 3918637 3766191 3625863 3495888 3375588 3263562 3157066 3054116 2955623 2864226 2780971
60939 2780971 2704007 2630725 2560245 2493370 2430957 2373104 2319387 2269053 2221146 2175062 2130838
60928 2130838 2088458 2047275 2006948 1968727 1934751 1905738 1880072 1855592 1831863 1810361 1792670
60917 1792670 1778642 1766195 1753007 1738772 1725651 1716073 1710368 1707241 1706064 1707306 1710585 1714044 1716834
60904 1716834 1721190 1730500 1745498 1763399 1780788 1796539 1811917 1828688 1847401 1867120 1886609 1906006
60892 1906006 1927143 1951760 1979499 2008000 2034770 2058452 2078469 2094441 2106592 2116466 2126467
60881 2126467 2138020 2149953 2159095 2163071 2162490 2159777 2156021 2149964 2140416 2128353 2115614 2102342 2086982
60868B086982j8583k1614k4067k6029k6948k6330k4914k3972k3809k3877k3944
60857A822895k4237k4737k5049k4920k4361k3541k2904k2831k2974k2627k2086
60846A562628k2650k4523k5863k4905k2210j9791j8732j8750j9352k0054j9934
60835A325864j8385j6173j4759j4717j5629j6961j8009j7615j5330j2481j0719
60824A155086r867q593o804n739n814o103o012n826n460m405l248l278m109l594
60810A076234j040J268J089q34k231k376j998j283K3J065M45j583l130l143k476
60795A060030k161j964j283l88J20L61P27P80l84k691m769n432m986m623m856
60780A028481n173n189n490o822q784r937r338p672o599o971p869p549n424k806
$$ plain form
60868 2086982 2068399 2046785 2022718 1996689 1969741 1943411 1918497 1894525 1870716 1846839 1822895
60857 1822895 1798658 1773921 1748872 1723952 1699591 1676050 1653146 1630315 1607341 1584714 1562628
60846 1562628 1539978 1515455 1489592 1464687 1442477 1422686 1403954 1385204 1365852 1345798 1325864
60835 1325864 1307479 1291306 1276547 1261830 1246201 1229240 1211231 1193616 1178286 1165805 1155086
60824 1155086 1145219 1136626 1129822 1124083 1118269 1112166 1106154 1100328 1094868 1090463 1087215 1083937 1079828 1076234
60810 1076234 1075194 1076462 1077551 1076717 1074486 1072110 1070112 1068829 1068852 1069917 1070362 1068779 1065649 1062506 1060030
60795 1060030 1057869 1055905 1054622 1054234 1054354 1054715 1055442 1056222 1055838 1053147 1048378 1042946 1037960 1033337 1028481
60780 1028481 1023308 1018119 1012629 1005807 997023 987086 977748 970076 963477 956506 948637 941088 935664 932858
60766I32858j371j173q95M1O81K74m00l86l33j502l486m413l534k166j625j500
60750I11070o45R64K158J921L64j299j474L82K901M022L380K625K958L473K685
60735I35485P68r46k002l104m599o055p309q631r528q655n713k496j196k055l472
60720H70492m020l559k688k029k121l178m691n762o043n842n401m713l952l190
60706H13303j678J143L622K827j382n017m679k069j191k335k256j24Q73r38k381
60691G97718k24L635M898K837K54j219k273k832j383K034M957N639N015M777N202
60676H29035N732O178O550O773P190Q236R263Q830O600L909K259K121L173M468
60662I10317M412K083j253l304l383k538j357L33J567O58j825k812o90K499M103
$$ plain form
60766 932858 931487 930314 929419 929460 930141 930415 930015 929629 929296 927794 924308 919895 916361 914195 912570 911070
60750 911070 910425 911389 913547 915468 915832 914533 913059 913441 916342 920364 923744 926369 929327 932800 935485
60735 935485 936253 935307 933305 930201 925602 919547 912238 903607 894079 885424 879711 877215 876019 873964 870492
60720 870492 866472 862913 860225 858196 856075 852897 848206 842444 836401 830559 825158 820445 816493 813303
60706 813303 811625 812768 816390 819217 817835 812818 808139 806070 804879 802544 800288 800164 801037 800099 797718
60691 797718 797494 801129 806027 808864 809118 807899 805626 802794 801411 803445 808402 814041 819056 823833 829035
60676 829035 834767 840945 847495 854268 861458 869694 878957 887787 894387 898296 900555 902676 905849 910317
60662 910317 914729 916812 915559 912255 908872 906334 904977 905310 906877 907535 905710 902898 902208 904707 908810
60647I08810M134M010L771K535M34j764m107o833q985r300q081o809o183n752
60633H65880n077m267l631l484l896m055k753j33K004K454K025J722Q05j772m956
60618H40866o362n068k204P94L139M226L797K671K086K175J924O50j293l111m050
60603H40240l516j528Q11J991J384k24j128J76L496O342O012K844K59P51L036
60588H60946M169L230J494P1p86p17N00J891K126J532J878L969O555P889P476
60573I02223O139N158N450P021R125J1147J3031J4644J5335J4615J2671R882O668
60560A033109M143L627M841N753N132L886K993J821m7j042J93K170K451J346J319
60545A071695L232N568P229Q799J0870J3083J5074J6662J7035J5581J3599J3285
$$ plain form
60647 908810 912944 916954 920725 923260 923694 921930 917823 910990 902005 892705 884624 877815 871632 865880
60633 865880 860803 856536 852905 849421 845525 841470 838717 838584 840588 843042 845067 846789 847594 845822 840866
60618 840866 834504 829436 827232 828026 831165 835391 839188 841859 843945 846120 848044 848694 847401 844290 840240
60603 840240 836724 835196 836007 837998 839382 839158 838030 838206 841702 848044 854056 856900 857159 857910 860946
60588 860946 865115 868345 869839 869910 869124 868407 868907 870798 872924 874456 876334 880303 886858 894747 902223
60573 902223 908362 913520 918970 925991 935116 946263 959294 973938 989273 1003888 1016559 1026441 1033109
60560 1033109 1037252 1040879 1045720 1051473 1056605 1060491 1063484 1065305 1065258 1064216 1064409 1066579 1069030 1070376 1071695
60545 1071695 1074927 1080495 1087724 1096523 1107393 1120476 1135550 1152212 1169247 1184828 1198427 1211712
60533A211712J4679J5211J2742P745K278j842l760l830l433l476l317k268j385
60520A241056k054l437l548k447j839j624K22L808O329O133N357O707R637J1703
60506A276003J2315J3212J5824J9874K4344K8654L2672L6192L8747M0136M1099
60495A579072M2797M5162M6795M7166M7377M7301M3911L5118K3845J4871Q273
60484A981688n0j1426k2420l0634l7867m5406n0420n0367m7785m6932m7854m7525
60472A543002m5352m3608m3050m1690l8206l3785k9990k6968k4287k1954k0174
60461A173938j9162j9181j9800j9610j7784j5433j4035j3165j1351q791p435q346
60449I99845j0387j1702j1397r670p355n521m892n368o293o856o170l945j386
$$ plain form
60533 1211712 1226391 1241602 1254344 1262089 1264367 1262525 1258765 1254935 1251502 1248026 1244709 1242441 1241056
60520 1241056 1239002 1235565 1232017 1229570 1227731 1226107 1226329 1230137 1236466 1242599 1247956 1254663 1264300 1276003
60506 1276003 1288318 1301530 1317354 1337228 1361572 1390226 1422898 1459090 1497837 1537973 1579072
60495 1579072 1621869 1667031 1713826 1760992 1808369 1855670 1899581 1934699 1958544 1973415 1981688
60484 1981688 1981638 1970212 1947792 1917158 1879291 1833885 1783465 1733098 1685313 1638381 1590527 1543002
60472 1543002 1497650 1454042 1410992 1369302 1331096 1297311 1267321 1240353 1216066 1194112 1173938
60461 1173938 1154776 1135595 1115795 1096185 1078401 1062968 1048933 1035768 1024417 1015626 1008191 999845
60449 999845 989458 977756 966359 956689 949334 943813 938921 933553 927260 920404 914234 910289 908903
60436I08903k78o47p34J09L59o76r75J016L100K000j721m212l322n13K048L551
60420I08008L628J997k31j137n73l30j169j636o94N00M57n08j224j319p96P98
60404I05771L475N923O757N993M444K375k45k768m214m257l149j054J732M325
60390I25108N881O497O890P282P297O780O152N884O036O304O268N661M634L686
60376A010360L180L071L282M001N289O506O721N710M225K962J757L15n20O85L747
60361A061291O141N688L419K344L461M740M480L792M437N923O651O935Q414J0795
60347A138511J1724J0302Q427P647O890M931L232L787N127L286k864r641j2802
60334A178557j1956r422o474k857P05K137O07k166m118n108o203p728q962r046
$$ plain form
60436 908903 908625 907978 907244 907353 907712 907036 906061 907077 910177 912177 910456 906244 902922 902409 904457 908008
60420 908008 911636 913633 913402 912265 911692 911362 910193 908557 907863 908363 908820 908312 907088 905769 904973 905771
60404 905771 909246 915169 921926 927919 932363 934738 934493 931725 927511 923254 920105 919051 920783 925108
60390 925108 930989 937486 944376 951658 958955 965735 971887 977771 983807 990111 996379 1002040 1006674 1010360
60376 1010360 1013540 1016611 1019893 1023894 1029183 1035689 1042410 1048120 1052345 1055307 1057064 1057379 1056859 1057544 1061291
60361 1061291 1067432 1073120 1076539 1078883 1082344 1087084 1091564 1095356 1099793 1105716 1112367 1119302 1127716 1138511
60347 1138511 1150235 1160537 1168964 1176611 1183501 1188432 1191664 1195451 1200578 1203864 1201000 1191359 1178557
60334 1178557 1166601 1157179 1150705 1147848 1148553 1150690 1151297 1149131 1145013 1139905 1133702 1125974 1117012 1107966
60320A107966p398m069m95J148L77o56M6J734K800M066P606J2664J5750J5494
60306A157033J4786J6669K0262K2495K2339K1336K0755K0065J7937J3521O915
60295A354113o73p438j2278j5386j7246j7793j6886j4830j1989q858o867p694
60283A216175j0956j3869j4226j2728j1403j0964j0871j0811j0739j0319r586
60272A089703r249r279q319n820l524l277m473n322n536n830n811m605l034k792
60258A012832l754m215l644l054k702j648J11J183J019Q29J597K651K813J787
60244A005805K5j595j886m66R99J41l110o081o224l365R13M662O205N052K781
60229A003856J844K922M362M495L378K156J846L028N485P911Q958Q728Q128P097
$$ plain form
60320 1107966 1100568 1096499 1096004 1097152 1097529 1096873 1096919 1098653 1101453 1105519 1113125 1125789 1141539 1157033
60306 1157033 1171819 1188488 1208750 1231245 1253584 1274920 1295675 1315740 1333677 1347198 1354113
60295 1354113 1353440 1346002 1333724 1318338 1301092 1283299 1266413 1251583 1239594 1230736 1223869 1216175
60283 1216175 1205219 1191350 1177124 1164396 1152993 1142029 1131158 1120347 1109608 1099289 1089703
60272 1089703 1080454 1071175 1062856 1057036 1053512 1050235 1045762 1040440 1034904 1029074 1023263 1018658 1015624 1012832
60258 1012832 1009078 1004863 1001219 998165 995463 993815 993926 995109 996128 996957 998554 1001205 1004018 1005805
60244 1005805 1005830 1004235 1002349 1001883 1002882 1003023 999913 993832 987608 984243 985156 989818 996023 1001075 1003856
60229 1003856 1005700 1008622 1012984 1017479 1020857 1023013 1024859 1027887 1033372 1041283 1050241 1058969 1067097 1074194
60215A074194N051K914K724M831P234Q354Q718R379J0344J1241J1936J1770R973
60202A178663P556O916Q525R879R129P729P718Q075O278K524j29K92K523M005
60188A259683L382R34k043l905l793k543j795k080k584k878l911o629j0136j2060
60174A209642j0853p434m268k999l229l597l444l029k630k174j559p29M06J544
60160A165647J747L72j929l805m588m386l325j713m55k3O59K837N510O143M008
60145A166699J236N4M74J318K060K749L333L921M858N981O668P031P824Q733Q211
60130A231150N806L326K599L305M032M327M442M119L139K403L038M686N890N956
60116A288218N308M282K793J336J177K881N109N601L603Q96j89L25J75j646k999
$$ plain form
60215 1074194 1079245 1082159 1084883 1089714 1096948 1105302 1114020 1123399 1133743 1144984 1156920 1168690 1178663
60202 1178663 1186219 1193135 1201660 1211539 1220668 1228397 1236115 1244190 1250468 1252992 1252863 1253155 1255678 1259683
60188 1259683 1263065 1263999 1261956 1258051 1254258 1251715 1249920 1247840 1245256 1242378 1238467 1231838 1221702 1209642
60174 1209642 1198789 1191355 1187087 1184088 1180859 1177262 1173818 1170789 1168159 1165985 1164426 1163697 1164103 1165647
60160 1165647 1167394 1167766 1165837 1162032 1157444 1153058 1149733 1148020 1147565 1147542 1148201 1151038 1156548 1162691 1166699
60145 1166699 1167935 1167989 1168463 1169781 1171841 1174590 1177923 1181844 1186702 1192683 1199351 1206382 1214206 1222939 1231150
60130 1231150 1236956 1240282 1242881 1246186 1250218 1254545 1258987 1263106 1266245 1268648 1271686 1276372 1282262 1288218
60116 1288218 1293526 1297808 1300601 1301937 1303114 1305995 1311104 1316705 1320308 1321204 1321015 1321340 1321515 1319869 1316870
60101A316870j715O08L42k831n016l382L0J293m25k576k848j318M94J274Q74M91
60085A302165J626M196O208N901L702J482L75j31j306l681o085o413m182j957
60071A301900k909o900j0651j1944j1920j2610j4085j5038j4774j3558j2011j0900
60059A164600j0462r627p365m902m672o635p963p131n709n065m098k037o20j065
60045A087249j346P84L970N384M977M637M657M303M598O913R504R076N684K622
60031A153012J398J98k084l748l400k297k075k376k325k502l841n875p475q434
60017A108176r229r877r905q977p205n312m474n189o371o574n886n427n230m178
60003A014342k226j024j695l231l790k706p31R00J201p1k065l336k860o09K566
$$ plain form
60101 1316870 1315155 1315763 1316105 1313274 1308258 1304876 1304906 1306199 1305774 1303198 1300350 1299032 1299526 1300800 1301674 1302165
60085 1302165 1303791 1307987 1314195 1320096 1323798 1325280 1325655 1325524 1324218 1320537 1314452 1308039 1303857 1301900
60071 1301900 1298991 1292091 1281440 1269496 1257576 1244966 1230881 1215843 1201069 1187511 1175500 1164600
60059 1164600 1154138 1144511 1137146 1132244 1127572 1120937 1112974 1105843 1100134 1095069 1090971 1088934 1088314 1087249
60045 1087249 1085903 1086687 1090657 1096041 1101018 1105655 1110312 1114615 1119213 1126126 1135630 1144706 1150390 1153012
60031 1153012 1154410 1154608 1152524 1148776 1145376 1143079 1141004 1138628 1136303 1133801 1129960 1124085 1116610 1108176
60017 1108176 1098947 1089070 1079165 1070188 1062983 1057671 1053197 1048008 1041637 1035063 1029177 1023750 1018520 1014342
60003 1014342 1012116 1011092 1009397 1006166 1002376 999670 998939 999839 1001040 1000969 998904 995568 992708 992099 994665
59988I94665N162N806M454K527J395J262J802K713L100J835m52j345O7J585J241
59973A025817L05O92J216m29l331m367k892j050J25J302J746m48m378o263m425
59958A003620j127J493L830N886N692K908P25J541L285K865J048Q75K665L748
59944A039054K500Q2j481j111J009L299L530J133j690k392r55P17J234M00j370
59929A043959k864k288P05L966N256M855M448M337L572K247J790L023N221O908
59915A085135O872M929K559J944L412M823M500L505L564M146L694K554K305K776
59901A136718K329R86O44J762K195M75j717j685Q25L577M610L997L194L383M557
59886A165850N840O551O790O923P031P203P783Q720R182Q473O966N473M226L182
$$ plain form
59988 994665 999827 1005633 1010087 1012614 1014009 1015271 1017073 1019786 1022886 1024721 1024269 1022924 1022991 1024576 1025817
59973 1025817 1026122 1026814 1028030 1027601 1024270 1019903 1017011 1015961 1016086 1017388 1019134 1018686 1014308 1008045 1003620
59958 1003620 1002493 1003986 1007816 1013702 1019394 1022302 1023027 1024568 1027853 1030718 1031766 1032641 1035306 1039054
59944 1039054 1041554 1041636 1040155 1039044 1040053 1043352 1046882 1048015 1046325 1043933 1042978 1043695 1044929 1045329 1043959
59929 1043959 1041095 1038807 1039512 1043478 1048734 1053589 1058037 1062374 1065946 1068193 1069983 1073006 1078227 1085135
59915 1085135 1092007 1096936 1099495 1101439 1104851 1109674 1114174 1117679 1121243 1125389 1129083 1131637 1133942 1136718
59901 1136718 1139047 1140033 1140677 1142439 1144634 1145109 1143392 1141707 1142532 1146109 1150719 1154716 1157910 1161293 1165850
59886 1165850 1171690 1178241 1185031 1191954 1198985 1206188 1213971 1222691 1231873 1240346 1247312 1252785 1257011 1260193
59872A260193K555K066M38k875o031o576m882l965n470p382o758l529m93L2j497
59857A215826k877k727j650r14m56J118M388P832R338Q589P085O164N980O063
59843A263759N907M942K996J040N26J676L022K934J007k136n551q206r283q926
59829A253707q178p714p070n660m141l974n583p649q487p701o192m865m005l792
59815A168696m650o494q231q681p805o416m882k981r69J58k49j888m100o282p527
59800A097699o831m257j216P88J135j12k281l767l111j036pq82j534jK549L677
59784A080813L153K526K115R17q90j775j355q40o51K52J991K843J792K09l02j36
59768A090662m01p50l43J10p44k367k680j048P27R48K17L05J759L475M219L873
$$ plain form
59872 1260193 1262748 1264814 1265252 1262377 1256346 1249770 1244888 1240923 1235453 1228071 1221313 1217784 1217291 1217323 1215826
59857 1215826 1212949 1210222 1208572 1207658 1207202 1208320 1212708 1220540 1229878 1238467 1245552 1251716 1257696 1263759
59843 1263759 1269666 1274608 1277604 1278644 1279170 1280846 1283868 1286802 1287809 1285673 1280122 1271916 1262633 1253707
59829 1253707 1245529 1237815 1230745 1225085 1220944 1216970 1211387 1203738 1195251 1187550 1181358 1176493 1172488 1168696
59815 1168696 1164046 1157552 1149321 1140640 1132835 1126419 1121537 1118556 1117587 1117745 1117496 1115608 1111508 1105226 1097699
59800 1097699 1090868 1086611 1085395 1086183 1087318 1087206 1084925 1081158 1078047 1077011 1077004 1076122 1074588 1074587 1077136 1080813
59784 1080813 1083966 1086492 1088607 1089524 1088634 1086859 1085504 1084664 1084013 1084265 1086256 1089099 1090891 1091100 1090798 1090662
59768 1090662 1090261 1089511 1089168 1089278 1088534 1086167 1083487 1082439 1083166 1084114 1084331 1084636 1086395 1089870 1094089 1097962
59752A097962L292L474M657N967O073M732L501M348P362J0358J1171R900Q300
59739A181097P311O233M615L691M807O959P373M841J303n42l19L65N49P87J432
59724A230502J634P71k52k10N47N54o75k140k877k872k419j677j147j371j730
59709A216638p63J621L456L278K185K114L098L748L622L269K505P86q89n77J708
59694A245799L647L782L272L674M664M995M377L204J516n52k083k155r59M68J017
59679A274666j65l077o201p633p306o915p221p123o010n018m808m106k178q62
59665A206043k030m505n720n287m482l372j307M26l14k723l385j067J490J732
59651A175499P18R72K834M675N395M966L445J060j198k390k921m047o079p769
$$ plain form
59752 1097962 1101254 1104728 1109385 1115352 1121425 1126157 1129658 1134006 1141368 1151726 1162897 1172797 1181097
59739 1181097 1188408 1194641 1199256 1202947 1207754 1214713 1222086 1226927 1228230 1227688 1227369 1227734 1228283 1229070 1230502
59724 1230502 1232136 1232907 1232655 1232445 1232992 1233546 1232871 1230731 1227854 1224982 1222563 1220886 1219739 1218368 1216638
59709 1216638 1215875 1217496 1220952 1224230 1226415 1228529 1231627 1235375 1238997 1242266 1244771 1245557 1244668 1244091 1245799
59694 1245799 1249446 1253228 1256500 1260174 1264838 1269833 1274210 1277414 1278930 1278378 1276295 1274140 1273181 1273649 1274666
59679 1274666 1274501 1271424 1265223 1257590 1250284 1243369 1236148 1229025 1223015 1217997 1213189 1209083 1206905 1206043
59665 1206043 1204013 1199508 1193788 1188501 1184019 1180647 1179340 1179766 1179452 1176729 1173344 1172277 1173767 1175499
59651 1175499 1176217 1177189 1180023 1184698 1190093 1195059 1198504 1199564 1198366 1195976 1193055 1189008 1182929 1175160
59637A175160p569n336k796k229m202o698p128n225l150k683l308l462k687j763
59623A116924j363j490k016l046m559o088o911o655n688m771m302m070l763l201
59609A059001j991K52K852M094L152J215k13j279k765l893l134r14M89J82j94
59594A056854O49J394J65k426l912l220j755j184j350r82J23N57q11k965l673
59579A037464k324p49p07j579j678r47q18j823l059l953m802n257m118j386R76
59564A005240J309K29n83n87m03l85k13M87J728L033L472K551J352J852M467P227
59548A030776Q079P168O027N541N910P693J1171J4790J5912J3801J0914J0573
59536A148355J3614J7656J9342J6994J1479N156K74j988j732j04J426K075K141
$$ plain form
59637 1175160 1167591 1162255 1159459 1157230 1153028 1146330 1139202 1133977 1130827 1128144 1124836 1121374 1118687 1116924
59623 1116924 1115561 1114071 1112055 1109009 1104450 1098362 1091451 1084796 1079108 1074337 1070035 1065965 1062202 1059001
59609 1059001 1057010 1057262 1060114 1064208 1067360 1068575 1068362 1067083 1064318 1060425 1057291 1056377 1056866 1057048 1056854
59594 1056854 1057503 1058897 1059062 1056636 1052724 1049504 1047749 1046565 1045215 1044233 1044356 1044913 1044102 1041137 1037464
59579 1037464 1035140 1034391 1033684 1032105 1030427 1029480 1028662 1026839 1023780 1019827 1015025 1009768 1005650 1004264 1005240
59564 1005240 1006549 1006778 1006195 1005608 1005205 1004820 1004607 1005094 1006822 1009855 1013327 1015878 1017230 1019082 1023549 1030776
59548 1030776 1038855 1046023 1052050 1057591 1063501 1071194 1082365 1097155 1113067 1126868 1137782 1148355
59536 1148355 1161969 1179625 1198967 1215961 1227440 1232596 1232870 1230882 1229150 1229046 1230472 1232547 1234688
59523A234688K177K066J357L01k42kK58j92j099j687j908k742n044q080r737q806
59507A201308o837o585q489j0044r350p723p499q626r247q649p524o023l920k361
59493A098431k940m851n363l532j299m46p84j805l533m817l459M39L588L679K290
59478A075598J978K701L275M206O311Q101P602N795N382O532O699M571J731K31
59464A140713O41K682N668P929P759N591L803L951N455P040Q113Q493Q261Q107
59450A224206Q574Q884P844N947M901N022M895L900L176L152K104j369n563p182
59436A268491n332k758k722n307p313n956k240J74n00k168k066l62J120K407N087
59421A240555R023J2069J3270J4006J5412J6969J8386K0654K4109K7343K9019
$$ plain form
59523 1234688 1236865 1238931 1240288 1240589 1240347 1240345 1240603 1240411 1239312 1237625 1235717 1232975 1227931 1219851 1210114 1201308
59507 1201308 1194471 1187886 1179397 1169353 1160003 1152280 1144781 1136155 1126908 1118259 1110735 1104712 1100792 1098431
59493 1098431 1095491 1090640 1085277 1081745 1080446 1080000 1079216 1077411 1073878 1069061 1065602 1066041 1069629 1073308 1075598
59478 1075598 1077576 1080277 1083552 1087758 1094069 1102170 1109772 1115567 1120949 1127481 1134180 1138751 1140482 1140713
59464 1140713 1141354 1144036 1149704 1157633 1165392 1170983 1174786 1178737 1184192 1191232 1199345 1207838 1216099 1224206
59450 1224206 1232780 1241664 1249508 1255455 1260356 1265378 1270273 1274173 1277349 1280501 1282605 1281236 1275673 1268491
59436 1268491 1263159 1260401 1257679 1252372 1245059 1239103 1236863 1237037 1236537 1234369 1232303 1231941 1233061 1235468 1240555
59421 1240555 1249578 1261647 1274917 1288923 1304335 1321304 1339690 1360344 1384453 1411796 1440815
59410A440815K9017K6914K1476J3175N242L65k246m962q286j0769j0954p949j808
59397A490030M711O640J572p197j4477j8875k2194k4809k5238k3680k2270k1562
59385A322651k0063j7618j5889j4642j1234n318p44n95l071m634m767m768m032
59372A215276j003L197N458M765K969J654Q72Q24K149L974M366L555M486Q766
59358A261308J3876J6043J4821J3243J4037J6989J9900K1141K1070K1336K2874
59347A456638K4713K5094K3612K1611K0451K0126J9874J9359J8819J8459J7995
59336A686751J6596J3430Q720L999O93j379l368n682p914j0102j2667j5235j6910
59323A656932j7827j8854j9674j8955j6793j5014j4314j3107j0355p736p433r169
$$ plain form
59410 1440815 1469832 1496746 1518222 1531397 1536639 1537004 1534758 1529796 1521510 1510741 1499787 1491838 1490030
59397 1490030 1494741 1501381 1502953 1495756 1481279 1462404 1440210 1415401 1390163 1366483 1344213 1322651
59385 1322651 1302588 1284970 1269081 1254439 1243205 1237887 1237143 1236548 1233477 1228843 1224076 1219308 1215276
59372 1215276 1214273 1217470 1222928 1227693 1230662 1232316 1233188 1234012 1236161 1240135 1244501 1248056 1252542 1261308
59358 1261308 1275184 1291227 1306048 1319291 1333328 1350317 1370217 1391358 1412428 1433764 1456638
59347 1456638 1481351 1506445 1530057 1551668 1572119 1592245 1612119 1631478 1650297 1668756 1686751
59336 1686751 1703347 1716777 1725497 1729496 1730189 1728810 1725442 1719760 1711846 1701744 1689077 1673842 1656932
59323 1656932 1639105 1620251 1600577 1581622 1564829 1549815 1535501 1522394 1512039 1504303 1496870 1487701
59311A487701j0932j1320r722n740l00L905N107M816N532P263Q428R198J1030
59298A504966J3176J2608Q042J797l074n765p258q542r997j1320j1653j0807j0175
59285A461998j1039j2299j1688r037o295m484k999j995k477l459k067K059N283
59272A401501M901L081L649O938J0348J2376J3234J2698J0308P351N869N594M215
59259A502063Q83k628m696n777o905q025q759r552j0914j2344j2912j2359j1012
59246A397063r164p209n861n371m706k550O10K281P32k444l697j592J744L669
59232A363505M059M168M024L053K288L176M406K776k032o389p516o802o731p005
59218A354980o034m404m006m839n209m689m471n038n473n136m379l635l025k637
$$ plain form
59311 1487701 1476769 1465449 1455727 1449987 1449687 1453592 1458699 1463515 1469047 1476310 1484738 1493936 1504966
59298 1504966 1518142 1530750 1538792 1540589 1537515 1531750 1524492 1515950 1505953 1494633 1482980 1472173 1461998
59285 1461998 1450959 1438660 1426972 1417935 1411640 1407156 1404157 1402162 1399685 1396226 1394159 1396218 1401501
59272 1401501 1406402 1409483 1413132 1420070 1430418 1442794 1456028 1468726 1479034 1486385 1492254 1497848 1502063
59259 1502063 1502946 1500318 1495622 1489845 1482940 1474915 1466156 1456604 1445690 1433346 1420434 1408075 1397063
59246 1397063 1387899 1380690 1374829 1369458 1364752 1362202 1362812 1365093 1365825 1363381 1359684 1358092 1359836 1363505
59232 1363505 1367564 1371732 1375756 1378809 1381097 1384273 1388679 1391455 1389423 1383034 1375518 1368716 1361985 1354980
59218 1354980 1348946 1344542 1340536 1335697 1330488 1325799 1321328 1316290 1310817 1305681 1301302 1297667 1294642 1292005
59204A292005k109o30J482K216O00j118j88K556L837K761J843K934M720N114M127
59189A320150L375L987N694P093O689M705L462M554O294N928L798K753L622M217
59175A386321L275K249K204J869N11J1J928M609N508M829M639N682P261R186J1467
59160A451549J2913J2261J0314Q896P958N760J909j666l093k528j493j416k949
59147A498415n587p747q186p414o988p530q377q920r213r247q730p798p100o984
59133A388594p273p733q106p849o660n163m184l504k273m66J096K057K706K996
59119A344238K734K832M657P546Q677O677M109M667Q543J2260J3000J1550J0444
59106A441934J0567J0764J0168R545R884J0536R655O577K982J260J908L090K733
$$ plain form
59204 1292005 1289896 1289266 1290748 1292964 1293564 1292446 1292258 1294814 1298651 1301412 1303255 1306189 1310909 1316023 1320150
59189 1320150 1323525 1327512 1333206 1340299 1346988 1351693 1355155 1359709 1366003 1371931 1375729 1378482 1382104 1386321
59175 1386321 1389596 1391845 1394049 1395918 1396429 1396440 1398368 1402977 1408485 1413314 1417953 1423635 1430896 1440082 1451549
59160 1451549 1464462 1476723 1487037 1495933 1503891 1509651 1511560 1509894 1506801 1504273 1502780 1501364 1498415
59147 1498415 1492828 1485081 1476895 1469481 1462493 1454963 1446586 1437666 1428453 1419206 1410476 1402678 1395578 1388594
59133 1388594 1381321 1373588 1365482 1357633 1350973 1345810 1341626 1338122 1335849 1335383 1336479 1338536 1341242 1344238
59119 1344238 1346972 1349804 1354461 1362007 1370684 1377361 1381470 1386137 1394680 1406940 1419940 1431490 1441934
59106 1441934 1452501 1463265 1473433 1482978 1492862 1503398 1513053 1519630 1522612 1523872 1525780 1528870 1531603
59093A531603O54j429j706m0J913K257P08j298k535l546n538q090r263q341p183
59078A488166p854r871j1047j0564r599r065q391p155o303o788q036q982r748
59065A374763j0891j1622j0529q007o200o099o284n352m135m279n615o432n901
59052A283417m797l946l201k164r55M5N24Q1j541l790n424n612m651l491k946
59037A241549l296m127m373l104m34K697N581Q011R548R549Q308P423Q271J0522
59023A296125J2771J4248J5248J6074J6365J5628J3938J1862J0035Q911Q599Q650
59011A448454Q260P098N823N315N298M451K408J016K427N955Q180O853L582J613
58997A516733J804K336J866J260J788L205M351M608L929K403P56M48J926L258
$$ plain form
59093 1531603 1532257 1530828 1529122 1529082 1530995 1533252 1533960 1532662 1530127 1526581 1521043 1512953 1503690 1495349 1488166
59078 1488166 1480312 1470441 1459394 1448830 1439231 1430166 1421775 1414620 1408317 1401529 1393493 1384511 1374763
59065 1374763 1363872 1352250 1341721 1333714 1327514 1321415 1315131 1309779 1305644 1301365 1295750 1289318 1283417
59052 1283417 1278620 1274674 1271473 1269309 1268354 1268399 1268923 1269004 1267463 1263673 1258249 1252637 1247986 1244495 1241549
59037 1241549 1238253 1234126 1229753 1226649 1226215 1228912 1234493 1242504 1252052 1261601 1269909 1277332 1285603 1296125
59023 1296125 1308896 1323144 1338392 1354466 1370831 1386459 1400397 1412259 1422294 1431205 1439804 1448454
59011 1448454 1456714 1463812 1469635 1474950 1480248 1484699 1487107 1488123 1490550 1496505 1504685 1511538 1515120 1516733
58997 1516733 1518537 1520873 1522739 1523999 1525787 1528992 1533343 1537951 1541880 1544283 1545039 1545487 1547413 1550671
58983A550671J967j607m131l021M78K842K307M80J9J683M093N857P098Q820J1306
58968A588862J3687J5009J5369J5714J6570J7203J6225J3179R310O599O026O938
58956A740691P951P983O355K676k576p609j0366j0566j0319j2099j6043j9568
58944A676510j9913j6924j3132j1217j1744j3326j4404j4457j3838j3001j2012
58933A522542j0593q684o967o364o768o870n853m529m018l928l081j584o04k86
58919A452413L37J217R99n28j557r36N9l6m14M06J837K298K262L835P287J0164
58903A479643J0596R808J0347J2728J4949J5242J4508J5472J9247K3312K3941
58892A649793K0655J6950J6377J9151K3292K7180K9694K9503K6431K2662K0652
$$ plain form
58983 1550671 1552638 1551031 1546900 1543879 1544357 1547199 1549506 1549986 1550005 1551688 1555781 1561638 1568736 1577556 1588862
58968 1588862 1602549 1617558 1632927 1648641 1665211 1682414 1698639 1711818 1721128 1727727 1733753 1740691
58956 1740691 1748642 1756625 1762980 1765656 1763080 1755471 1745105 1734539 1724220 1712121 1696078 1676510
58944 1676510 1656597 1639673 1626541 1615324 1603580 1590254 1575850 1561393 1547555 1534554 1522542
58933 1522542 1511949 1503265 1496298 1489934 1483166 1476296 1470443 1465914 1461896 1457968 1454887 1453303 1452699 1452413
58919 1452413 1452750 1453967 1454966 1454438 1452881 1451945 1452004 1451968 1451554 1451960 1453797 1456095 1458357 1462192 1469479 1479643
58903 1479643 1490239 1500047 1510394 1523122 1538071 1553313 1567821 1583293 1602540 1625852 1649793
58892 1649793 1670448 1687398 1703775 1722926 1746218 1773398 1803092 1832595 1859026 1881688 1902340
58881A902340K0224J9384J7307J4789J2306R651P035M655J560l031p645j0037
58869A988538j0562j1617j3701j4624j3286j1657j1976j3963j5935j6994j7110
58858A837113j6591j6421j7752k0167k1705k1283j9824j8500j7459j6725j6655
58847A634031j6812j6057j4472j3411j3063j1947r771q488r320j0694j0760j0034
58835A489202r865j0013r583q846q265p136n024l287l137l435k424o01K41p3k95
58820A417459j03j25j96L36J118J510K288M402O523O283L887K069K188K738K223
58805A452600J238O92L7j324k455k258j445j553k561k933j963q63j088k463l550
58790A430111l558l029k596j971q35m8p22k378l293k765j627m28J244L013L241
$$ plain form
58881 1902340 1922564 1941948 1959255 1974044 1986350 1996001 2003036 2007691 2009251 2006220 1998575 1988538
58869 1988538 1977976 1966359 1952658 1938034 1924748 1913091 1901115 1887152 1871217 1854223 1837113
58858 1837113 1820522 1804101 1786349 1766182 1744477 1723194 1703370 1684870 1667411 1650686 1634031
58847 1634031 1617219 1601162 1586690 1573279 1560216 1548269 1538498 1530010 1520690 1509996 1499236 1489202
58835 1489202 1479337 1469324 1459741 1450895 1442630 1435494 1430470 1427183 1424046 1420611 1418187 1417586 1417827 1417754 1417459
58820 1417459 1417356 1417231 1417035 1417371 1418489 1419999 1422287 1426689 1433212 1439495 1443382 1445451 1447639 1450377 1452600
58805 1452600 1453838 1454530 1454567 1453243 1450788 1448530 1447085 1445532 1442971 1440038 1438075 1437212 1436124 1433661 1430111
58790 1430111 1426553 1423524 1420928 1418957 1418122 1418074 1417352 1414974 1411681 1408916 1407289 1406861 1408105 1411118 1414359
58775A414359J441m83q42n72j322k603k841k267k306k822k377j204j376l500n372
58760A385913m819k333K5J143J381J509J984K756L319L264K900K876L194L334
58746A406446L236L435M267N717P832J0351J1998J1367Q843O655O640Q556J0875
58733A506218J2507J3298J3418J2746J0932Q027N144M019N456Q449J1272J3117
58721A624603J4065J4006J2579J0248Q474Q429R857J1403J2053J2094J2456J2902
58709A763169J1597P502K658M21J203J917K86k462m424o263r410j2819j4395j4752
58695A724228j6495j9825k1664j9809j5767j2651j2009j3329j5031j5174j2660
58684A549814q668n835n362n981o110n621m900l702k110j364k249l331k314Q98
$$ plain form
58775 1414359 1415800 1415317 1414475 1413903 1412581 1409978 1407137 1404870 1402564 1399742 1397365 1396161 1394785 1391285 1385913
58760 1385913 1381094 1378761 1378786 1379929 1381310 1382819 1384803 1387559 1390878 1394142 1397042 1399918 1403112 1406446
58746 1406446 1409682 1413117 1417384 1423101 1430933 1441284 1453282 1464649 1473492 1480147 1486787 1495343 1506218
58733 1506218 1518725 1532023 1545441 1558187 1569119 1577146 1582290 1586309 1591765 1600214 1611486 1624603
58721 1624603 1638668 1652674 1665253 1675501 1683975 1692404 1702261 1713664 1725717 1737811 1750267 1763169
58709 1763169 1774766 1782268 1784926 1785347 1786550 1788467 1788753 1786291 1781867 1775604 1766194 1753375 1738980 1724228
58695 1724228 1707733 1687908 1666244 1646435 1630668 1618017 1606008 1592679 1577648 1562474 1549814
58684 1549814 1541146 1535311 1529949 1523968 1517858 1512237 1507337 1503635 1501525 1500161 1497912 1494581 1492267 1493165
58670A493165L776M125K598J801L340O406R087J0342J0370R663Q584P591P010
58657A577858O475N376L858K545J405J22n06P31K976L485J291j194j527m01J55
58642A602649K0L45J001J144J380K904M947N485M390L687M595O211P209P095N668
58627A658730K991K25r58l5K222M912P171P921P018O094O602P700P919P966R558
58612A736036J2066J3037J1779R845Q114O196M758N366P474Q444P387O317O585
58599A843404O929O190N330N317N407M991M933N552N483M208L521M644N939N717
58585A917565N439P620J1696J4564J4622J3100J1795J1516J2539J4824J7512J9349
58573B072141J9859J9432J8593J8001J8608K0793K3398K4712K4530K4660K6941
$$ plain form
58670 1493165 1496941 1501066 1503664 1505465 1508805 1515211 1524298 1534640 1545010 1554673 1563257 1570848 1577858
58657 1577858 1584333 1589709 1593567 1596112 1597517 1597639 1597133 1597864 1600840 1604325 1605616 1604422 1602895 1602494 1602649
58642 1602649 1602669 1603014 1604015 1605159 1606539 1609443 1614390 1619875 1624265 1627952 1632547 1638758 1645967 1653062 1658730
58627 1658730 1661721 1661946 1660988 1660953 1663175 1668087 1675258 1683179 1690197 1696291 1702893 1710593 1718512 1726478 1736036
58612 1736036 1748102 1761139 1772918 1782763 1790877 1797073 1801831 1807197 1814671 1823115 1830502 1836819 1843404
58599 1843404 1850333 1856523 1861853 1867170 1872577 1877568 1882501 1888053 1893536 1897744 1901265 1905909 1911848 1917565
58585 1917565 1923004 1930624 1942320 1956884 1971506 1984606 1996401 2007917 2020456 2035280 2052792 2072141
58573 2072141 2092000 2111432 2130025 2148026 2166634 2187427 2210825 2235537 2260067 2284727 2311668
58562B311668L0907L3837L3687L1819L1688L4229L6049L3615K7892K2684J9439
58551B647514J6534J3279J1192J0624R276N524Q49k533m388n530o144o639q330
58538B681228j1735j5620j8890k1709k3761k3590k1223j9260j9465k0170j9058
58527B466747j6627j4528j2343q808m980l164l326l337k439j863k094k025j161
58514B390052m77n18m86J99Q95R72Q17R22R92O33K80P42J959K737J960J16p79
58497B401016O80L498N361N329M341L355K653L089N835J0060J2782J2423J0952
58484B481374J0998J2305J2805J2101J1905J3597J6915K0675K3528K4562K4274
58473B665039K4287K4993K4452K1020J5963J1830R034O199L331K209L275M268
$$ plain form
58562 2311668 2342575 2376412 2410099 2441918 2473606 2507835 2543884 2577499 2605391 2628075 2647514
58551 2647514 2664048 2677327 2688519 2699143 2708419 2713943 2714792 2712259 2707871 2702341 2696197 2689558 2681228
58538 2681228 2669493 2653873 2634983 2613274 2589513 2565923 2544700 2525440 2505975 2485805 2466747
58527 2466747 2450120 2435592 2423249 2414441 2409461 2406297 2402971 2399634 2397195 2395332 2393238 2391213 2390052
58514 2390052 2389575 2389057 2388571 2388770 2389665 2390637 2391454 2392376 2393368 2394001 2394281 2395023 2396982 2399719 2401679 2401795 2401016
58497 2401016 2401696 2405194 2410555 2415884 2420225 2423580 2426233 2429322 2435157 2445217 2457999 2470422 2481374
58484 2481374 2492372 2504677 2517482 2529583 2541488 2555085 2572000 2592675 2616203 2640765 2665039
58473 2665039 2689326 2714319 2738771 2759791 2775754 2787584 2796618 2802817 2806148 2808357 2811632 2815900
58461B815900L022K91j210J74L838Q167J1979J4741J6205J6404J5892J5444J5375
58448B936222J5421J5266J4520J2283P926K804l65q17q52k172k974j121J637J976
58434B999754N90J442N454Q982R462Q750R313J0681J1656J2986J5529J8095J9270
58421C131964J9374J8921J7346J4896J3406J3469J3166J1269R080P422M909J369
58409C276591l79J086K815K200J401L158N162L559Mk06L811P607Q560Q986J1097
58394C335452J3139J2494R688P474P726J0350J3824J6218J6837J6953J7845J8672
58382C496672J7787J5461J3556J3060J3671J5084J6840J7705J7186J6948J8691
58371C672661K1467K3130K3565K4135K4949K5144K5166K6096K7292K7334K6876
$$ plain form
58461 2815900 2818922 2819213 2818003 2818177 2822015 2830182 2842161 2856902 2873107 2889511 2905403 2920847 2936222
58448 2936222 2951643 2966909 2981429 2993712 3001638 3004442 3004077 3003260 3002408 3000236 2997262 2996141 2997778 2999754
58434 2999754 3000344 3001786 3007240 3016222 3025684 3034434 3043747 3054428 3066084 3079070 3094599 3112694 3131964
58421 3131964 3151338 3170259 3187605 3202501 3215907 3229376 3242542 3253811 3262891 3270313 3275222 3276591
58409 3276591 3276212 3277298 3280113 3282313 3283714 3286872 3292034 3295593 3295597 3295391 3299202 3306809 3315369 3324355 3335452
58394 3335452 3348591 3361085 3370773 3378247 3385973 3396323 3410147 3426365 3443202 3460155 3478000 3496672
58382 3496672 3514459 3529920 3543476 3556536 3570207 3585291 3602131 3619836 3637022 3653970 3672661
58371 3672661 3694128 3717258 3740823 3764958 3789907 3815051 3840217 3866313 3893605 3920939 3947815
58360C947815K7848L0194L1999L2757L3823L5396L5664L3485L0090K7566K7034
58349D293671K8291K9998L0478K9382K7938K6754K4903K2546K2308K5745L0268
58338D592282L2445L2833L4537L8095M1042M1835M1230M0292L9697M0293M1813
58327E016394M1983L9513L6817L6809L8376L8419L7110L7180L8795L9294L7822
58316E438512L6291L5682L5225L5361L7766M1801M4551M5142M5875M8249N0825
58305E895280N1844N1376N0190M8964M9118N2107N7158O1447O2889O1543N8965
58294F500881N7689O0068O5499P0127P1533P2124P5199P9684Q2128Q2296Q2951
58283G300179Q5196Q7760R0042R2465R4723R6583R9193J02820J05482J06825J10289
$$ plain form
58360 3947815 3975663 4005857 4037856 4070613 4104436 4139832 4175496 4208981 4239071 4266637 4293671
58349 4293671 4321962 4351960 4382438 4411820 4439758 4466512 4491415 4513961 4536269 4562014 4592282
58338 4592282 4624727 4657560 4692097 4730192 4771234 4813069 4854299 4894591 4934288 4974581 5016394
58327 5016394 5058377 5097890 5134707 5171516 5209892 5248311 5285421 5322601 5361396 5400690 5438512
58316 5438512 5474803 5510485 5545710 5581071 5618837 5660638 5705189 5750331 5796206 5844455 5895280
58305 5895280 5947124 5998500 6048690 6097654 6146772 6198879 6256037 6317484 6380373 6441916 6500881
58294 6500881 6558570 6618638 6684137 6754264 6825797 6897921 6973120 7052804 7134932 7217228 7300179
58283 7300179 7385375 7473135 7563177 7655642 7750365 7846948 7946141 8048961 8154443 8261268 8371557
58272H371557J17550J24266J26288J26662J30571J36692J40421J42865J48725
58263I565597J57085J62585J64910J68815J75100J79894J83283J90108K00856
58254A1148233K09768K13866K16764K21756K27992K34986K44190K54504K62892
58245A3234951K70608K82180K97404L11390L23314L37632L55821L74674L93598
58236A6181572M15305M38560M59183M79407N06661N41362N75877O07803O43977
58227B0849707O88218P35562P82692Q34276Q94792R63184J039308J126510J224763
58218B9139012J331020J449019J588063J749852J928657K127439K360351K635952
58210D4309365K952828L316969L748478M265043M873258N580761O399501P330905
$$ plain form
58272 8371557 8489107 8613373 8739661 8866323 8996894 9133586 9274007 9416872 9565597
58263 9565597 9722682 9885267 10050177 10218992 10394092 10573986 10757269 10947377 11148233
58254 11148233 11358001 11571867 11788631 12010387 12238379 12473365 12717555 12972059 13234951
58245 13234951 13505559 13787739 14085143 14396533 14719847 15057479 15413300 15787974 16181572
58236 16181572 16596877 17035437 17494620 17974027 18480688 19022050 19597927 20205730 20849707
58227 20849707 21537925 22273487 23056179 23890455 24785247 25748431 26787739 27914249 29139012
58218 29139012 30470032 31919051 33507114 35256966 37185623 39313062 41673413 44309365
58210 44309365 47262193 50579162 54327640 58592683 63465941 69046702 75446203 82777108
58202H2777108Q366079R506328J0761897J2123457J3561350J5065772J6663481
58195A68825472J8384712K0244226K2264508K4470390K6832156K9254207L1628026
58188C41903697L3774167L5193509L4929142L1921436K5731976J7002268P194732
58181E27650927k156822j0078548j6302006k1006104k4452669k6769553k7977383
58174C98907842k8158901k7554606k6476854k5160237k3719148k2213135k0696064
58167B24928897j9203499j7742015j6313015j4928470j3597972j2323191j1114289
58160A19706446r994629q981093q072207p259259o535225n888875n304272m772633
58152F2898253m295111l870712l491415l151668k852317k592048k364319k165124
$$ plain form
58202 82777108 91143187 100649515 111411412 123534869 137096219 152161991 168825472
58195 168825472 187210184 207454410 229718918 254189308 281021464 310275671 341903697
58188 341903697 375677864 410871373 445800515 477721951 503453927 520456195 527650927
58181 527650927 525494105 515415557 499113551 478107447 453654778 426885225 398907842
58174 398907842 370748941 343194335 316717481 291557244 267838096 245624961 224928897
58167 224928897 205725398 187983383 171670368 156741898 143143926 130820735 119706446
58160 119706446 109711817 100730724 92658517 85399258 78864033 72975158 67670886 62898253
58152 62898253 58603142 54732430 51241015 48089347 45237030 42644982 40280663 38115539
58144C8115539j994456j847864j715934j594731j487992j396437j313535j234549
58136B5530041j161497j096045j035204r77154r24099q76125q28699p79273p30575
58127A7121370o84811o40284n95956n53872n14872m77029m40046m06309l76375
58118A2431816l48448l23015l02580k86109k69605k52866k39439k29046k16765
58109I963943k01383j87788j78863j71324j62189j53292j46659j41032j35861
58100H485552j33245j32865j30185j22973j14846j09240j04541r8393r2272q8199
58090G358793q4814q0214p5337p1603o8381o5341o3798o3453o1584n7988n6478
58079F609802n8633o0253n7638n3288n1437n1539n0738m9722n1044n3519n3279
$$ plain form
58144 38115539 36121083 34273219 32557285 30962554 29474562 28078125 26764590 25530041
58136 25530041 24368544 23272499 22237295 21260141 20336042 19459917 18631218 17851945 17121370
58127 17121370 16436559 15796275 15200319 14646447 14131575 13654546 13214500 12808191 12431816
58118 12431816 12083368 11760353 11457773 11171664 10902059 10649193 10409754 10180708 9963943
58109 9963943 9762560 9574772 9395909 9224585 9062396 8909104 8762445 8621413 8485552
58100 8485552 8352307 8219442 8089257 7966284 7851438 7742198 7637657 7539264 7446992 7358793
58090 7358793 7273979 7193765 7118428 7046825 6978444 6913103 6849305 6785852 6724268 6666280 6609802
58079 6609802 6551169 6490916 6433278 6379990 6328553 6277014 6226276 6176554 6125510 6071991 6018712
58068F018712m9683m6004m4375m3537m1852l9763l8648l8942l9664l9028l6043
58057E561173l2123l0033l0516l1364l0597k8877k7735k7222k6605k5833k4935
58046E245333k3363k1140j9395j8837j8972j9453k0557k1767k1741k0387j9013
58035E020708j7844j5650j2629j1165j2534j5175j7317j8927j9939j9299j7413
58024D842816j6789j8303j9228j7217j3950j2406j2558j2364j1454j1007j1110
58013D686430j0763r880r089q121o250l834j821k84J082J664N79j751l879m624
57999D629459l454m79K957M667L632R54j715l537l876k078J041L054K573Q11m93
57984D633516j158j492q99P60J905J186l98r75m04J92M60P28O23l98j618j695
$$ plain form
58068 6018712 5969029 5923025 5878650 5835113 5793261 5753498 5714850 5675908 5636244 5597216 5561173
58057 5561173 5529050 5499017 5468501 5437137 5406540 5377663 5349928 5322706 5296101 5270268 5245333
58046 5245333 5221970 5200830 5181435 5162598 5143626 5124173 5103616 5081849 5060108 5039721 5020708
58035 5020708 5002864 4987214 4974585 4963420 4950886 4935711 4918394 4899467 4879528 4860229 4842816
58024 4842816 4826027 4807724 4788496 4771279 4757329 4744923 4732365 4720001 4708547 4697540 4686430
58013 4686430 4675667 4665787 4656698 4648577 4642327 4638493 4636672 4636388 4637470 4639134 4639713 4637962 4634083 4629459
57999 4629459 4626005 4625526 4628483 4633150 4636782 4637736 4636021 4632484 4628608 4626530 4627571 4630625 4633198 4634009 4633516
57984 4633516 4632358 4630866 4629967 4630727 4632632 4633818 4633420 4632445 4632041 4632233 4632693 4633421 4634044 4633646 4632028 4630333
57968D630333n07P52J046K29j107j737m31K710O154Q597R811R613P570M588L002
57953D680623L803N179N195M548N065O733Q028Q309Q208Q326R007J0617J2725
57940D776366J3842J3406J3123J4738J7395J9000J9330J9824K0776K0927J9850
57929D968577J8759J8494J8251J6848J4196J0998P909N381L774L279L916N341
57917E095723O497O139M376K999L365M409L858J108k022l351k323K2K251L538
57903E126589L939L917L661L103K520K632L906O201R026J1611J2912J2521J1531
57890E214069J1475J2395J3040J3013J3318J4510J5804J6419J6433J5904J4700
57879E371080J3625J3908J4918J4395J1930J0123J0799J2101J1407R502R452J2115
$$ plain form
57968 4630333 4629826 4630578 4631624 4631853 4630746 4629009 4628578 4631288 4637442 4646039 4655850 4665463 4673033 4677621 4680623
57953 4680623 4684426 4689605 4694800 4699348 4704413 4711146 4719174 4727483 4735691 4744017 4753024 4763641 4776366
57940 4776366 4790208 4803614 4816737 4831475 4848870 4867870 4887200 4907024 4927800 4948727 4968577
57929 4968577 4987336 5005830 5024081 5040929 5055125 5066123 5074032 5079413 5083187 5086466 5090382 5095723
57917 5095723 5102220 5108359 5112735 5115734 5119099 5123508 5127366 5128474 5126452 5123101 5120778 5120800 5123051 5126589
57903 5126589 5130528 5134445 5138106 5141209 5143729 5146361 5150267 5156468 5165494 5177105 5190017 5202538 5214069
57890 5214069 5225544 5237939 5250979 5263992 5277310 5291820 5307624 5324043 5340476 5356380 5371080
57879 5371080 5384705 5398613 5413531 5427926 5439856 5449979 5460778 5472879 5484286 5493788 5503240 5515355
57867E515355J5065J5730J3954J1556J0621J1940J4174J4989J3745J2314J2552
57856E661995J4145J5929J7838K0101K1765K1735K0340J8473J6282J4201J3814
57845E856618J5700J7656J7393J5963J6071J7730J8410J7077J5306J4307J3655
57834F035886J3361J4605J7448K0049K1055K1073K0928K0378J9476J9358K0462
57823F244079K1456K1312K1193K2759K5422K6726K5206K1838J8883J7959J8968
57812F485801K0278K0118J8301J6355J5702J6118J6420J6177J6082J6667J7422
57801F675441J7475J6861J6485J6806J7231J7209J7323J8358J9726K0187K0035
57790F873137K0937K3114K4523K3883K2823K3442K5097K5654K4989K4951K6100
$$ plain form
57867 5515355 5530420 5546150 5560104 5571660 5582281 5594221 5608395 5623384 5637129 5649443 5661995
57856 5661995 5676140 5692069 5709907 5730008 5751773 5773508 5793848 5812321 5828603 5842804 5856618
57845 5856618 5872318 5889974 5907367 5923330 5939401 5957131 5975541 5992618 6007924 6022231 6035886
57834 6035886 6049247 6063852 6081300 6101349 6122404 6143477 6164405 6184783 6204259 6223617 6244079
57823 6244079 6265535 6286847 6308040 6330799 6356221 6382947 6408153 6429991 6448874 6466833 6485801
57812 6485801 6506079 6526197 6544498 6560853 6576555 6592673 6609093 6625270 6641352 6658019 6675441
57801 6675441 6692916 6709777 6726262 6743068 6760299 6777508 6794831 6813189 6832915 6853102 6873137
57790 6873137 6894074 6917188 6941711 6965594 6988417 7011859 7036956 7062610 7087599 7112550 7138650
57779G138650K6828K6165K5527K6838L0045L3232L4469L3310L1136L0002L0375
57768G466577L0339K8208K5492K5393K8297L0877L0501K8537K7872K8685K8851
57757G779629K7699K6966K7723K8453K7366K5233K4302K5077K6004K6388K7621
57746H072461L0488L2994L2783L0704K9740L0671L1247L0069K8816K9434L1336
57735H410743L2992L4434L6194L7186L6020L3544L1878L1429L1145L1219L2935
57724H779719L5581L6225L3715L0890L1245L4521L7121L6448L3567L1538L1942
57713I152512L3649L4788L5261L6506L8962M1004M1031L9570L8444L8741M0570
57702I571038M3745M7273M8927M7084M2943L9532L8641L9786M1668M3262M3856
$$ plain form
57779 7138650 7165478 7191643 7217170 7244008 7274053 7307285 7341754 7375064 7406200 7436202 7466577
57768 7466577 7496916 7525124 7550616 7576009 7604306 7635183 7665684 7694221 7722093 7750778 7779629
57757 7779629 7807328 7834294 7862017 7890470 7917836 7943069 7967371 7992448 8018452 8044840 8072461
57746 8072461 8102949 8135943 8168726 8199430 8229170 8259841 8291088 8321157 8349973 8379407 8410743
57735 8410743 8443735 8478169 8514363 8551549 8587569 8621113 8652991 8684420 8715565 8746784 8779719
57724 8779719 8815300 8851525 8885240 8916130 8947375 8981896 9019017 9055465 9089032 9120570 9152512
57713 9152512 9186161 9220949 9256210 9292716 9331678 9372682 9413713 9453283 9491727 9530468 9571038
57702 9571038 9614783 9662056 9710983 9758067 9801010 9840542 9879183 9918969 9960637 10003899 10047755
57691A0047755M3558M3742M5537M8110M9735N0215N0713N1715N2988N5159N8984
57680A0598211O3139O5250O5550O7026P1089P5615P8486Q0650Q3944Q8012R1669
57669A1428641R5713J01518J07478J09481J05202R6042Q4655P2436O0345N0456
57659A2311967M4880M3387M3337M2338M0311L8628L7979L7990L8628M0638M4197
57648A2764280M8261N1895N5281N8609O1052O2045O2604O3997O5901O7553O9778
57637A3431256P3717P8013P9892P9254P9194Q1796Q5587Q8072Q8687Q8243Q7438
57626A4341149Q7359Q9508R3587R6623R6210R3568R1809R2170R3657R5541R8061
57615A5369242J00917J03078J04374J05834J08067J10288J11431J11450J11344
$$ plain form
57691 10047755 10091313 10135055 10180592 10228702 10278437 10328652 10379365 10431080 10484068 10539227 10598211
57680 10598211 10661350 10726600 10792150 10859176 10930265 11005880 11084366 11165016 11248960 11336972 11428641
57669 11428641 11524354 11625872 11733350 11842831 11948033 12044075 12128730 12201166 12261511 12311967
57659 12311967 12356847 12400234 12443571 12485909 12526220 12564848 12602827 12640817 12679445 12720083 12764280
57648 12764280 12812541 12864436 12919717 12978326 13039378 13101423 13164027 13228024 13293925 13361478 13431256
57637 13431256 13504973 13582986 13662878 13742132 13821326 13903122 13988709 14076781 14165468 14253711 14341149
57626 14341149 14428508 14518016 14611603 14708226 14804436 14898004 14989813 15081983 15175640 15271181 15369242
57615 15369242 15470159 15573237 15677611 15783445 15891512 16001800 16113231 16224681 16336025
57606A6336025J12293J14774J18046J20561J21283J20609J19895J20389J22705
57597A7406580J26472J30151J32057J32276J32754J34801J37505J39756J42774
57588A8615126J48729J57055J64240J67904J69636J72685J77816J82804J85760
57579B0141755J87610J90781J96201K02463K07847K12359K17273K23047K28317
57570B2007653K30667K27755K17802K00184J76468J50625J27310J09131R5326
57561B3542921Q3079P0382N7628M6414L7317K9646K3254J9211J8143J9205K1606
57550B3968806K5751L1320L5621L6230L4673L4976L8514M2872M6247N0059N5849
57539B4400918O2023O5793O6862O7158O7925O8958O9994P1037P1562P0894O9467
$$ plain form
57606 16336025 16448318 16563092 16681138 16801699 16922982 17043591 17163486 17283875 17406580
57597 17406580 17533052 17663203 17795260 17927536 18060290 18195091 18332596 18472352 18615126
57588 18615126 18763855 18920910 19085150 19253054 19422690 19595375 19773191 19955995 20141755
57579 20141755 20329365 20520146 20716347 20918810 21126657 21339016 21556289 21779336 22007653
57570 22007653 22238320 22466075 22683877 22884061 23060529 23211154 23338464 23447595 23542921
57561 23542921 23626000 23696382 23754010 23800424 23837741 23867387 23890641 23909852 23927995 23947200 23968806
57550 23968806 23994557 24025877 24061498 24097728 24132401 24167377 24205891 24248763 24295010 24345069 24400918
57539 24400918 24462941 24528734 24595596 24662754 24730679 24799637 24869631 24940668 25012230 25083124 25152591
57528B5152591O8633O9237P0899P2356P2150O9857O7318O7526P1097P4963P5897
57517B5932524P4441P3625P4600P5675P5422P4518P3996P3509P2209P0030O7329
57506B6737878O4333O1687O0599O1410O2851O3712O4645O7110P0689P2847P1861
57495B7459622O9140O7789O9209P2009P4177P5329P6388P7853P9284P9956P9254
57484B8280010P6790P3225P0728P1240P4027P6158P5828P4137P3043P2740P2019
57473B9089945P0450O9054O9017P0337P1735P1686O9934O7954O7290O7509O6884
57462B9851795O5134O3962O4329O4916O4342O3451O3884O5663O7860P0587P4163
57451C0580086P6996P6671P3446P0616P0763P3207P5724P7193P7509P6315P3492
$$ plain form
57528 25152591 25221224 25290461 25361360 25433716 25505866 25575723 25643041 25710567 25781664 25856627 25932524
57517 25932524 26006965 26080590 26155190 26230865 26306287 26380805 26454801 26528310 26600519 26670549 26737878
57506 26737878 26802211 26863898 26924497 26985907 27048758 27112470 27177115 27244225 27314914 27387761 27459622
57495 27459622 27528762 27596551 27665760 27737769 27811946 27887275 27963663 28041516 28120800 28200756 28280010
57484 28280010 28356800 28430025 28500753 28571993 28646020 28722178 28798006 28872143 28945186 29017926 29089945
57473 29089945 29160395 29229449 29298466 29368803 29440538 29512224 29582158 29650112 29717402 29784911 29851795
57462 29851795 29916929 29980891 30045220 30110136 30174478 30237929 30301813 30367476 30435336 30505923 30580086
57451 30580086 30657082 30733753 30807199 30877815 30948578 31021785 31097509 31174702 31252211 31328526 31402018
57440C1402018P0429O9199P0237P1746P1861P0747O9950P0098P0244O9664O9311
57429C2175504P0559P2938P4365P3682P2005P1113P1413P2064P2354P2162P1575
57418C2969734P0862P0601P1218P2372P3230P3253P2588P1754P1107P0490O9567
57407C3756776O8627O8439O8758O7770O4336O0116N7713N6866N4764N0465M6663
57396C4421293M5764M6310M5082M1367L7359L5269L5771L8333M1427M2857M1698
57385C4872530L9656L9284M1070M3369M4656M4677M3747M2164M0185L7760L4560
57374C5323658L0866K7743K5665K3933K2219K1575K2790K4855K6259K6780K6853
57363C5603196K6541K6362K7484K9361K8876K4232J8229J5069J5063J5341J4733
$$ plain form
57440 31402018 31472447 31541646 31611883 31683629 31755490 31826237 31896187 31966285 32036529 32106193 32175504
57429 32175504 32246063 32319001 32393366 32467048 32539053 32610166 32681579 32753643 32825997 32898159 32969734
57418 32969734 33040596 33111197 33182415 33254787 33328017 33401270 33473858 33545612 33616719 33687209 33756776
57407 33756776 33825403 33893842 33962600 34030370 34094706 34154822 34212535 34269401 34324165 34374630 34421293
57396 34421293 34467057 34513367 34558449 34599816 34637175 34672444 34708215 34746548 34787975 34830832 34872530
57385 34872530 34912186 34951470 34992540 35035909 35080565 35125242 35168989 35211153 35251338 35289098 35323658
57374 35323658 35354524 35382267 35407932 35431865 35454084 35475659 35498449 35523304 35549563 35576343 35603196
57363 35603196 35629737 35656099 35683583 35712944 35741820 35766052 35784281 35799350 35814413 35829754 35844487
57352C5844487J4544J4981J4455J2855J2277J3658J5543J6932J8611K0701K1535
57341C6020579K0269J8370J7303J6736J6056J5500J4785J2720R432O781N335L155
57329C6177021q70m873p049q782j2228j6466j8872j9406k0926k5176l0486l3776
57317C5978111l3764l2073l1861l4966m0012m3998m6017m7933n0876n3118n2867
57306C5510626n1319n0865n1662n2387n3241n5596n9076o1731o3149o4883o7359
57295C4879358o8853o8631o8789p1323p4810p6074p4430p2388p2108p2955p3240
57284C4085757p2913p3215p4355p5152p5128p5384p6761p8459p9647q1082q3485
57273C3240176q5243q3955q0164p7293p7474p9464q1392q3480q6815r1138r5536
$$ plain form
57352 35844487 35859031 35874012 35888467 35901322 35913599 35927257 35942800 35959732 35978343 35999044 36020579
57341 36020579 36040848 36059218 36076521 36093257 36109313 36124813 36139598 36152318 36161750 36168531 36173866 36177021
57329 36177021 36176151 36171278 36164229 36155447 36143219 36126753 36107881 36088475 36067549 36042373 36011887 35978111
57317 35978111 35944347 35912274 35880413 35845447 35805435 35761437 35715420 35667487 35616611 35563493 35510626
57306 35510626 35459307 35408442 35356780 35304393 35251152 35195556 35136480 35074749 35011600 34946717 34879358
57295 34879358 34810505 34741874 34673085 34601762 34526952 34450878 34376448 34304060 34231952 34158997 34085757
57284 34085757 34012844 33939629 33865274 33790122 33714994 33639610 33562849 33484390 33404743 33323661 33240176
57273 33240176 33154933 33070978 32990814 32913521 32836047 32756583 32675191 32591711 32504896 32413758 32318222
57262C2318222j00365j06889j15483j25019j33680j39960j43906j47721j53798
57253C1151401j61466j67317j69664j70868j73883j78200j81223j82203j82362
57244B9584215j81937j79597j74826j68865j62988j57302j51286j44243j35321
57235B8127850j24362j12612j01366r0250p8266o6115n5627m6882l7878k7657
57225B7386835j8051j1462p961n583k743L79K512K743J373n73k461m170n135m530
57211B7331173l101l322o247r419j0104r597j1570j6388k0441k2311k6667l9627
57199B7152379o1849q8106j12355j31051j42734j47895j50075j54583j64111j76140
57189B5823480j85641j89795j89351j86195j81199j74528j66752j58866j51778
$$ plain form
57262 32318222 32217857 32110968 31995485 31870466 31736786 31596826 31452920 31305199 31151401
57253 31151401 30989935 30822618 30652954 30482086 30308203 30130003 29948780 29766577 29584215
57244 29584215 29402278 29222681 29047855 28878990 28716002 28558700 28407414 28263171 28127850
57235 28127850 28003488 27890876 27789510 27699260 27620994 27554879 27499252 27452370 27414492 27386835
57225 27386835 27368784 27357322 27349361 27343778 27341035 27341414 27343926 27346669 27348042 27347469 27345008 27340838 27335703 27331173
57211 27331173 27328072 27324750 27318503 27309084 27298980 27289383 27277813 27261425 27240984 27218673 27192006 27152379
57199 27152379 27090530 27002424 26890069 26759018 26616284 26468389 26318314 26163731 25999620 25823480
57189 25823480 25637839 25448044 25258693 25072498 24891299 24716771 24550019 24391153 24239375
57180B4239375j46278j42995j41954j42760j45630j51321j59209j66583j71496
57171B2871149j75629j82357j92100k01778k09244k16024k24682k35535k47214
57162B0986586k58602k68617k75715k79683k82805k87344k92688k96772k99289
57153A8445071l01437l03180l03090l00610k96442k90752k82868k72819k61544
57144A5832329k49790k38309k28672k21765k15718k07426j96207j83997j72122
57135A3918323j60345j49090j39913j33011j26810j20997j17532j17433j18783
57126A2734409j19484j20092j22252j25907j29678j32634j34098j32821j27933
57117A1589510j19857j09146r5271p7366n4797k6080J1044N7150J10339J69516
$$ plain form
57180 24239375 24093097 23950102 23808148 23665388 23519758 23368437 23209228 23042645 22871149
57171 22871149 22695520 22513163 22321063 22119285 21910041 21694017 21469335 21233800 20986586
57162 20986586 20727984 20459367 20183652 19903969 19621164 19333820 19041132 18744360 18445071
57153 18445071 18143634 17840454 17537364 17236754 16940312 16649560 16366692 16093873 15832329
57144 15832329 15582539 15344230 15115558 14893793 14678075 14470649 14274442 14090445 13918323
57135 13918323 13757978 13608888 13468975 13335964 13209154 13088157 12970625 12853192 12734409
57126 12734409 12614925 12494833 12372581 12246674 12116996 11984362 11850264 11717443 11589510
57117 11589510 11469653 11360507 11265236 11187870 11133073 11106993 11118037 11175187 11285526 11455042
57107A1455042K36744L14702M03821N04579O21193P59831R23315J110146J318491
57098A7647864J548302J798493K063545K333491K596963K846317L083425L321821
57090C7240221L581426L878888M219708M593625M972857N316937N585176N744811
57082G5133649N762539N590833N177768M506566L630089K660778J719075Q82391
57074A05063688J69650m39413r73576j448309j861324k203952k477319k698457
57066I3130988k891217l071845l241991l391412l504560l567106l571815l521387
57058F6369655l425644l296020l143156k978128k812146k652793k501412k355102
57050D3205254k210427k064569j914898j759954j601008j441206j283245j129421
$$ plain form
57107 11455042 11691786 12006488 12410309 12914888 13536081 14295912 15219227 16329373 17647864
57098 17647864 19196166 20994659 23058204 25391695 27988658 30834975 33918400 37240221
57090 37240221 40821647 44700535 48920243 53513868 58486725 63803662 69388838 75133649
57082 75133649 80896188 86487021 91664789 96171355 99801444 102462222 104181297 105063688
57074 105063688 105233338 104793925 103820349 102372040 100510716 98306764 95829445 93130988
57066 93130988 90239771 87167926 83925935 80534523 77029963 73462857 69891042 66369655
57058 66369655 62944011 59647991 56504835 53526707 50714561 48061768 45560356 43205254
57050 43205254 40994827 38930258 37015360 35255406 33654398 32213192 30929947 29800526
57042B9800526r84287q55287p48830o65557o00321n47080n03432m70327m48114
57033B3977291m33919m23220m13207m03812l96064l91212l91824m01723m22632
57024B0299678m50918m78879m99260n07825n02702m83898m54387m19730l84629
57015A6117450l50024l14304k76832k39187k03394j70163j39280j10963q6272
57006A4227031o6093m9881l5610k1318o750O772J7998K6765L3457L8573M3232
56995A4214176M9140N6839O4386O8972O9978O9619P0363P2588P5234P7918Q1242
56984A4970455Q5163Q8147Q8582Q6613Q3881Q1598P9651P7647P5918P4905P4204
56973A5866764P3093P1731P1010P1273P2055P2938P3861P4506P4417P3994P4408
$$ plain form
57042 29800526 28816239 27960952 27212122 26546565 25946244 25399164 24895732 24425405 23977291
57033 23977291 23543372 23120152 22706945 22303133 21907069 21515857 21124033 20722310 20299678
57024 20299678 19848760 19369881 18870621 18362796 17860094 17376196 16921809 16502079 16117450
57015 16117450 15767426 15453122 15176290 14937103 14733709 14563546 14424266 14313303 14227031
57006 14227031 14160938 14111057 14075447 14054129 14047379 14054151 14072149 14098914 14132371 14170944 14214176
56995 14214176 14263316 14320155 14384541 14453513 14523491 14593110 14663473 14736061 14811295 14889213 14970455
56984 14970455 15055618 15143765 15232347 15318960 15402841 15484439 15564090 15641737 15717655 15792560 15866764
56973 15866764 15939857 16011588 16082598 16153871 16225926 16298864 16372725 16447231 16521648 16595642 16670050
56962A6670050P6022P7627P7950P7201P6463P6006P4988P2455O7921O1315N3271
56951A7461269M5432L9621L6447L5049L4343L3964L3987L4246L4398L4360L4290
56940A7857406L4261L4253L4602L6064L9169M3627M8648N3610N7950O0493N9721
56929A8359804N5163M8082M0323L3115K7246K3585K2209K1566J9746J6690J4200
56918A8681729J3755J5178J7354J9230K0102K0037K0203K1642K3641K4496K4090
56907A8901457K4282K6239K8895L0843L2387L4569L7292L9588M0981M1561M1523
56896A9279617M1564M2895M5859M9315N2309N5353N8973O2335O4820O7707P2118
56885A9892865P6081P6033P1275O4772N9289N4738M9909M4806M0345L7078L5212
$$ plain form
56962 16670050 16746072 16823699 16901649 16978850 17055313 17131319 17206307 17278762 17346683 17407998 17461269
56951 17461269 17506701 17546322 17582769 17617818 17652161 17686125 17720112 17754358 17788756 17823116 17857406
56940 17857406 17891667 17925920 17960522 17996586 18035755 18079382 18128030 18181640 18239590 18300083 18359804
56929 18359804 18414967 18463049 18503372 18536487 18563733 18587318 18609527 18631093 18650839 18667529 18681729
56918 18681729 18695484 18710662 18728016 18747246 18767348 18787385 18807588 18829230 18852871 18877367 18901457
56907 18901457 18925739 18951978 18980873 19011716 19044103 19078672 19115964 19155552 19196533 19238094 19279617
56896 19279617 19321181 19364076 19409935 19459250 19511559 19566912 19625885 19688220 19753040 19820747 19892865
56885 19892865 19968946 20044979 20116254 20181026 20240315 20295053 20344962 20389768 20430113 20467191 20502403
56874B0502403L4835L5388L5878L6220L7422L9869M2482M4375M6399N0136N5891
56863B0961298O2391O8000P1711P3324P2999P0326O4124N4006M1832L0247J9932
56852B1590190J0118J882j818o04J504J131M10L864J1727J9808K5689L1434L9448
56839B1734783M8935N8063O6992P6653Q6198R3588R7263R5524Q5909O7762M4634
56828B2556304K1761J591j6157l0815m0184m3942m4709m4685m3430m0064l5427
56817B2240243l0523k4733j7345r261j398P053J6731K5923L2712L7974M3267M6533
56805B2367176M3351L2642J7970K716j2622k7330l8431m4257m7267n0327n2202
56794B2191419m9957m4497m0105l8620l7318l3094k6069j8275j1086n129q30K369
$$ plain form
56874 20502403 20537238 20572626 20608504 20644724 20682146 20722015 20764497 20808872 20855271 20905407 20961298
56863 20961298 21023689 21091689 21163400 21236724 21309723 21380049 21444173 21498179 21540011 21570258 21590190
56852 21590190 21600308 21602190 21600372 21599768 21601272 21602403 21602813 21606677 21618404 21638212 21663901 21695335 21734783
56839 21734783 21783718 21841781 21908773 21985426 22071624 22165212 22262475 22357999 22443908 22511670 22556304
56828 22556304 22578065 22579656 22563499 22532684 22492500 22448558 22403849 22359164 22315734 22275670 22240243
56817 22240243 22209720 22184987 22167642 22158381 22156983 22164036 22180767 22206690 22239402 22277376 22320643 22367176
56805 22367176 22410527 22443169 22461139 22463855 22451233 22423903 22385472 22341215 22293948 22243621 22191419
56794 22191419 22141462 22096965 22056860 22018240 21980922 21947828 21921759 21903484 21892398 21887269 21886439 21888808
56782B1888808N935J0067J2508J0751M705l768j3131k2721l1560l8063m1241m1556
56770B1740734m0558m0015m1095m3641m6189m7181m6300m4452m2678m1356m0078
56759B1267191l7790l3448k7361k1844j9564k0839k3252k4343k3938k3263k2556
56748B0988993k0947j8453j6556j6198j6393j5821j4986j5457j7215j8103j6324
56737B0802540j2619r494q736j0109j2135j3614j4366j4725j4675j4029j3271
56726B0664767j3356j4245j4512j3339j2043j2482j4506j6266j6635j5832j4151
56715B0507400j1953j0635j1492j3417j3944j3040j3425j6218j8782j8402j5917
56704B0350175j3825j2834j2459j3233j5532j7413j6599j4071j3036j4553j6663
$$ plain form
56782 21888808 21894743 21904810 21917318 21928069 21932774 21929006 21915875 21893154 21861594 21823531 21782290 21740734
56770 21740734 21700176 21660161 21619066 21575425 21529236 21482055 21435755 21391303 21348625 21307269 21267191
56759 21267191 21229401 21195953 21168592 21146748 21127184 21106345 21083093 21058750 21034812 21011549 20988993
56748 20988993 20968046 20949593 20933037 20916839 20900446 20884625 20869639 20854182 20836967 20818864 20802540
56737 20802540 20789921 20780427 20771691 20761582 20749447 20735833 20721467 20706742 20692067 20678038 20664767
56726 20664767 20651411 20637166 20622654 20609315 20597272 20584790 20570284 20554018 20537383 20521551 20507400
56715 20507400 20495447 20484812 20473320 20459903 20445959 20432919 20419494 20403276 20384494 20366092 20350175
56704 20350175 20336350 20323516 20311057 20297824 20282292 20264879 20248280 20234209 20221173 20206620 20189957
56693B0189957j7810j8542j9476j9930j9469j8938j9132j9740k0402k1566k3637
56682A9971315k5984k7156k5722k1529j6934j5689j8800k2391k1862j7745j4784
56671A9742719j5446j7421j8072j8121j9327k1173k1890k1026j9103j6282j3097
56660A9541761j1211j1593j2985j3766j4193j5231j6335j6430j6096j6704j7817
56649A9379400j7675j6118j4980j5333j6199j6481j6462j6577j6148j4635j3107
56638A9205685j3109j4332j4794j3447j1523j0610j0392r428p731o994q000r349
56626A9075976r611r344r698j0306j0487j1555j5454k1169k4947k4736k2448k1243
56614A8884978k2455k5867l0887l6087l9299l9743l9006l8857l9300l9771m0485
$$ plain form
56693 20189957 20172147 20153605 20134129 20114199 20094730 20075792 20056660 20036920 20016518 19994952 19971315
56682 19971315 19945331 19918175 19892453 19870924 19853990 19838301 19819501 19797110 19775248 19757503 19742719
56671 19742719 19727273 19709852 19691780 19673659 19654332 19633159 19611269 19590243 19571140 19554858 19541761
56660 19541761 19530550 19518957 19505972 19492206 19478013 19462782 19446447 19430017 19413921 19397217 19379400
56649 19379400 19361725 19345607 19330627 19315294 19299095 19282614 19266152 19249575 19233427 19218792 19205685
56638 19205685 19192576 19178244 19163450 19150003 19138480 19127870 19117478 19108050 19100319 19093325 19085325 19075976
56626 19075976 19066365 19057021 19047323 19037017 19026530 19014975 18999521 18978352 18953405 18928669 18906221 18884978
56614 18884978 18862523 18836656 18805769 18769682 18730383 18690640 18651634 18612777 18573477 18533706 18493221
56603A8493221m1150l9977l6047l1647l0116l1827l3988l4064l1822k8524k5812
56592A8128247k5164k6758k8673k8562k6252k3662k2217k1465k0334j8774j7946
56581A7868440j9142k2286k5165k5051k1945j9178j9556k1830k2543k0599j8070
56570A7633075j6884j6818j6899j6736j5945j3944j1249r572r863j1196j2075
56559A7481894j1888j0608q385o212n833p886j0866j2986j4409j6545j9401k0997
56547A7335878j9831j7015j5279j6111j8457k0352k1300k2598k5480k9435l2580
56536A7097440l3343l1766k9528k8673k9765l1184l0906k9159k8473l0500l3627
56525A6760516l4590l2081k7988k5327k5649k8318l1562l3986l5213l5195l3450
$$ plain form
56603 18493221 18452071 18412094 18376047 18344400 18314284 18282457 18248469 18214405 18182583 18154059 18128247
56592 18128247 18103083 18076325 18047652 18019090 17992838 17969176 17946959 17925494 17905160 17886386 17868440
56581 17868440 17849298 17827012 17801847 17776796 17754851 17735673 17716117 17694287 17671744 17651145 17633075
56570 17633075 17616191 17599373 17582474 17565738 17549793 17535849 17524600 17515028 17505165 17493969 17481894
56559 17481894 17470006 17459398 17451013 17444801 17438968 17431082 17420216 17407230 17392821 17376276 17356875 17335878
56547 17335878 17316047 17299032 17283753 17267642 17249185 17228833 17207533 17184935 17159455 17130020 17097440
56536 17097440 17064097 17032331 17002803 16974130 16944365 16913181 16882275 16853116 16824643 16794143 16760516
56525 16760516 16725926 16693845 16665857 16640530 16614881 16586563 16555001 16521015 16485802 16450607 16417157
56514A6417157k9814k5775k3677k4136k5332k5613k5460k6061k7144k7615k7397
56503A6129133k7189k6928k5957k4306k2569k0956j9595j9295k0593k2471k3360
56492A5875914k3070k2492k1922k1253k1152k2152k2845k1287j8370j7438j9924
56481A5644009k3331k4621k3744k2541k1787k1133k0872k1757k3206k3301k0958
56470A5396758j7348j4962j5583j8987k2935k4602k2865j9575j8058j9843k2984
56459A5179016k4109k2127j9361j8653k0042k1172k0559j9172j8599j9094k0098
56448A4956030k1424k2750k2923k1165j8574j7123j7301j7743j7228j6176j6055
56437A4747568j7745k0488k2263k1629j9325j7438j6918j6977j7166j8330k0699
$$ plain form
56514 16417157 16387343 16361568 16337891 16313755 16288423 16262810 16237350 16211289 16184145 16156530 16129133
56503 16129133 16101944 16075016 16049059 16024753 16002184 15981228 15961633 15942338 15921745 15899274 15875914
56492 15875914 15852844 15830352 15808430 15787177 15766025 15743873 15721028 15699741 15681371 15663933 15644009
56481 15644009 15620678 15596057 15572313 15549772 15527985 15506852 15485980 15464223 15441017 15417716 15396758
56470 15396758 15379410 15364448 15348865 15329878 15306943 15282341 15259476 15239901 15221843 15202000 15179016
56459 15179016 15154907 15132780 15113419 15094766 15074724 15053552 15032993 15013821 14995222 14976128 14956030
56448 14956030 14934606 14911856 14888933 14867768 14849194 14832071 14814770 14797027 14779799 14763623 14747568
56437 14747568 14729823 14709335 14687072 14665443 14646118 14628680 14611762 14594785 14577619 14559289 14538590
56426A4538590k2741k3174k2681k2283k1617k0533k0538k2370k3667k1888j8516
56415A4298582j7335j9151k1314k2089k2229k2117k0854j9089j9413k2512k5504
56404A4066975k5688k3725k1641j9802j7691j5943j5612j6332j6793j6366j5426
56393A3861956j4737j5065j6436j7465j6714j4974j4620j6320j8182j8670j8446
56382A3680327j8543j8676j8495j8622j9320j9700j9331j9013j8958j8094j6367
56371A3475208j5695j7194j9249j9951j9584j9061j7770j5084j2432j1639j2333
56360A3295216j3056j3741j5033j6227j6118j5169j4728j4856j4873j5305j6947
56349A3129163j8567j7876j4853j2163j2019j4111j6531j7416j5916j2979j1003
$$ plain form
56426 14538590 14515849 14492675 14469994 14447711 14426094 14405561 14385023 14362653 14338986 14317098 14298582
56415 14298582 14281247 14262096 14240782 14218693 14196464 14174347 14153493 14134404 14114991 14092479 14066975
56404 14066975 14041287 14017562 13995921 13976119 13958428 13942485 13926873 13910541 13893748 13877382 13861956
56393 13861956 13847219 13832154 13815718 13798253 13781539 13766565 13751945 13735625 13717443 13698773 13680327
56382 13680327 13661784 13643108 13624613 13605991 13586671 13566971 13547640 13528627 13509669 13491575 13475208
56371 13475208 13459513 13442319 13423070 13403119 13383535 13364474 13346704 13331620 13319188 13307549 13295216
56360 13295216 13282160 13268419 13253386 13237159 13221041 13205872 13191144 13176288 13161415 13146110 13129163
56349 13129163 13110596 13092720 13077867 13065704 13053685 13039574 13023043 13005627 12989711 12976732 12965729
56338A2965729j1442j3075j3675j2857j1942j1815j2490j4105j6540j8439j8415
56327A2810934j6930j5453j4160j2317j0539j0566j2774j5670j8016j9754k0725
56316A2644030k0294j8609j6931j6265j6548j7134j7121j5753j3702j3087j4565
56305A2464021j5387j2753q372o768r115j1872j2101j0926j0444j0277r307q442
56293A2338257r136j0607j0940r961q911p949o101l477j653j711l147m706n294
56280A2254664m238j894J66O73M38J486M347P280Q493Q221Q275J0227J4319J9279
56266A2331736K2845K3433K2077K2120K6094L3185M0547M6587N1900N7345O2892
56255A2740761O8766P6093Q5225R4599J02725J10390J19346J29390J38635J46412
$$ plain form
56338 12965729 12954287 12941212 12927537 12914680 12902738 12890923 12878433 12864328 12847788 12829349 12810934
56327 12810934 12794004 12778551 12764391 12752074 12741535 12730969 12718195 12702525 12684509 12664755 12644030
56316 12644030 12623736 12605127 12588196 12571931 12555383 12538249 12521128 12505375 12491673 12478586 12464021
56305 12464021 12448634 12435881 12427509 12420741 12411626 12399754 12387653 12376727 12366283 12356006 12346699 12338257
56293 12338257 12329121 12318514 12307574 12297613 12288702 12280753 12274652 12271175 12269522 12267811 12264664 12259958 12254664
56280 12254664 12250426 12248532 12248698 12249371 12249809 12251295 12255642 12262922 12271415 12279636 12287911 12298138 12312457 12331736
56266 12331736 12354581 12378014 12400091 12422211 12448305 12481490 12522037 12568624 12620524 12677869 12740761
56255 12740761 12809527 12885620 12970845 13065444 13168169 13278559 13397905 13527295 13665930 13812342
56245A3812342J53772J60861J65894J67490J66045J61781J53444J40625J25682
56236A5207936J11261R6756P9281N7623L3413Q771j5359l8426n9775p9358r7775
56225A5304348j14959j29795j41340j49772j55864j60149j62741j63547j62561
56216A3963620j60154j56783j52227j45787j37754j29860j23476j18169j12856
56207A2726554j07364j01759r5269q7711q1023p7205p5044p1256o5031n9203n6192
56196A1849497n4963n3005m9516m5161m0161l4575k9861k8157k9768l2384l3150
56185A1418796l0924k6574k1847j8324j6793j6907j7366j6858j5136j3047j1558
56174A1213462j0932j0932j1269j1386j0310p643m495k541k121k097j537m70R49
$$ plain form
56245 13812342 13966114 14126975 14292869 14460359 14626404 14788185 14941629 15082254 15207936
56236 15207936 15319197 15415953 15495234 15552857 15586270 15595041 15579682 15541256 15481481 15402123 15304348
56225 15304348 15189389 15059594 14918254 14768482 14612618 14452469 14289728 14126181 13963620
56216 13963620 13803466 13646683 13494456 13348669 13210915 13081055 12957579 12839410 12726554
56207 12726554 12619190 12517431 12422162 12334451 12253428 12176223 12101179 12029923 11964892 11905689 11849497
56196 11849497 11794534 11741529 11692013 11646852 11606691 11572116 11542255 11514098 11484330 11451946 11418796
56185 11418796 11387872 11361298 11339451 11321127 11304334 11287427 11270061 11253203 11238067 11225020 11213462
56174 11213462 11202530 11191598 11180329 11168943 11158633 11150990 11146495 11143954 11141833 11139736 11138199 11137729 11138678
56161A1138678K734M362N146N698P493J0565J3252J4981J7516K2298K8132L2936
56149A1303791L6342L9173M1817M4813M9694N7349O6530P5653Q4944R4964J04287
56138A1999357J10869J14785J17226J17664J14589J08627J02302R6791R1318Q5591
56128A3059119Q0293P4965O7879N8499M7890L6447K3639J0592K28o531j2583k1270
56116A3419167l2803m5336n7908p0430q1851r0330r5366r8381j00887j02592j01770
56105A2541513r7551r1454q5966q1533p6076o8250n9841n3453m8849m3645l7225
56094A1797670l1714k8590k6358k2477j6416r931n046k496j523p30Q07L124N918
56081A1662238Q887J1353J2490J2530J2887J4383J6318J8062K0322K3797K7672
$$ plain form
56161 11138678 11141412 11145774 11150920 11156618 11164111 11174676 11187928 11202909 11220425 11242723 11270855 11303791
56149 11303791 11340133 11379306 11421123 11465936 11515630 11572979 11639509 11715162 11800106 11895070 11999357
56138 11999357 12110226 12225011 12342237 12459901 12574490 12683117 12785419 12882210 12973528 13059119
56128 13059119 13139412 13214377 13282256 13340755 13388645 13425092 13448731 13459323 13459551 13453020 13440437 13419167
56116 13419167 13386364 13341028 13283120 13212690 13130839 13040509 12945143 12846762 12745875 12643283 12541513
56105 12541513 12443962 12352508 12266542 12185009 12108933 12040683 11980842 11927389 11878540 11834895 11797670
56094 11797670 11765956 11737366 11711008 11688531 11672115 11662184 11657138 11654642 11653119 11652389 11653196 11656320 11662238
56081 11662238 11671125 11682478 11694968 11707498 11720385 11734768 11751086 11769148 11789470 11813267 11840939
56070A1840939L0559L1890L1528K9492K7227K7436L1026L5672L8809M0303M0853
56059A2205734M0121L8643L9049M2553M6282M7127M6290M6697M8068M8481M9074
56048A2698119N2569N7957O1222O1167O0477O1183O2902O5431O9128P2685P4444
56037A3397284P5900P9994Q5804Q9172Q9103Q9406R3171R9319J05393J10258J13258
56026A4428062J14222J15136J18656J24486J30108J34945J40294J45589J48981
56017A5600479J51792J57937J68265J79427J88797J96656K03447K09215K15952
56008A7271967K26146K38557K49713K59549K71118K84858K98182L10617L24252
55999A9734959L39155L53846L69859L90011M12577M33591M54503M80421N11081
$$ plain form
56070 11840939 11871498 11903388 11934916 11964408 11991635 12019071 12050097 12085769 12124578 12164881 12205734
56059 12205734 12245855 12284498 12323547 12366100 12412382 12459509 12505799 12552496 12600564 12649045 12698119
56048 12698119 12750688 12808645 12869867 12931034 12991511 13052694 13115596 13181027 13250155 13322840 13397284
56037 13397284 13473184 13553178 13638982 13728154 13817257 13906663 13999834 14099153 14204546 14314804 14428062
56026 14428062 14542284 14657420 14776076 14900562 15030670 15165615 15305909 15451498 15600479
56017 15600479 15752271 15910208 16078473 16257900 16446697 16643353 16846800 17056015 17271967
56008 17271967 17498113 17736670 17986383 18245932 18517050 18801908 19100090 19410707 19734959
55999 19734959 20074114 20427960 20797819 21187830 21600407 22033998 22488501 22968922 23480003
55990B3480003N41537N71941O08099O51492O97617P45451P99397Q60418R24861
55981B9880816R94009J074773J168731J271043J382842J513507J667588J841445
55973D0794754K036643K264149K531086K837189L190095L610244M114177M706776
55965F6085113N395421O194683P108877Q127561R246845J0474546J1803035J3200891
55957A37636972J4649766J6170718J7800224J9565887K1501103K3643652K5984102
55950B76952424K8444163L0920556L3242164L4931956L5024678L2353716K6295237
55943D98164894J7376323P163700k515519j0418290j6239685k0375297k3387030
55936D49769096k5580313k6943830k7389356k6993977k6014416k4728084k3311911
$$ plain form
55990 23480003 24021540 24593481 25201580 25853072 26550689 27296140 28095537 28955955 29880816
55981 29880816 30874825 31949598 33118329 34389372 35772214 37285721 38953309 40794754
55973 40794754 42831397 45095546 47626632 50463821 53653916 57264160 61378337 66085113
55965 66085113 71480534 77675217 84784094 92911655 102158500 112633046 124436081 137636972
55957 137636972 152286738 168457456 186257680 205823567 227324670 250968322 276952424
55950 276952424 305396587 336317143 369559307 404491263 439515941 471869657 498164894
55943 498164894 515541217 522704917 520189398 509771108 493531423 473156126 449769096
55936 449769096 424188783 397244953 369855597 342861620 316847204 292119120 268807209
55929B68807209k1848799k0380027j8925675j7489860j6077615j4702583j3374689
55922A46007961j2097271j0884212r764606q760944p872817p087084o391910n775002
55914G7374115n220571m717327m262685l854252l484983l150710k853887k594948
55906D7234752k367397k165454j989161j837705j704829j585197j479087j386929
55898C2718993j305040j230069j161977j099847j040673r84735r35806q93151
55890B4067695q49685q01100p50668p02109o54394o07078n63929n26664m91009
55881A8121059m53860m19183l91825l70002l48895l27884l09314k93315k78343
55872A4928438k64438k52107k40306k28557k18509k10718k02745j93132j84176
$$ plain form
55929 268807209 246958410 226578383 207652708 190162848 174085233 159382650 146007961
55922 146007961 133910690 123026478 113261872 104500928 96628111 89541027 83149117 77374115
55914 77374115 72153544 67436217 63173532 59319280 55834297 52683587 49829700 47234752
55906 47234752 44867355 42701901 40712740 38875035 37170206 35585009 34105922 32718993
55898 32718993 31413953 30183884 29021907 27922060 26881387 25896652 24960846 24067695
55890 24067695 23218010 22416910 21666242 20964133 20309739 19702661 19138732 18612068 18121059
55881 18121059 17667199 17248016 16856191 16486189 16137294 15809410 15500096 15206781 14928438
55872 14928438 14664000 14411893 14171587 13943030 13724521 13513803 13311058 13117926 12933750
55863A2933750j77849j72090j64282j55544j48388j42690j37042j31737j27507
55854A1576621j23472j19041j15589j13784j11485j06727j00624r5148r0509q6889
55844A0513353q5829q7145q7227q3486p8230p5188p4398p3547p2100p0845o9205
55833I656153o6411o4045o4081o5424o5265o3019o0349n8206n6470n5581n5980
55822H981322n6621n6333n5901n6530n6997n4900n0380m6186m3996m2769m0965
55811H419744l8715l7175l6801l6764l5928l4309l3340l3896l4357l2155k7320
55800H038984k2713k0306j9209j8122j7640j8818k1132k3130k3873k3083k1461
55789G809497k1299k4380k8556k9190k5420k2134k3621k8072l0922l1155l1068
$$ plain form
55863 12933750 12755901 12583811 12419529 12263985 12115597 11972907 11835865 11704128 11576621
55854 11576621 11453149 11334108 11218519 11104735 10993250 10886523 10785899 10690751 10600242 10513353
55844 10513353 10427524 10340379 10253152 10169666 10091436 10016248 9941850 9868303 9796203 9725358 9656153
55833 9656153 9589742 9525697 9461616 9396192 9330927 9267908 9207559 9149353 9092883 9037302 8981322
55822 8981322 8924701 8868368 8812467 8755937 8698940 8644040 8593660 8547474 8503478 8460709 8419744
55811 8419744 8381029 8343854 8307053 8270289 8234361 8200052 8166712 8132816 8098459 8066304 8038984
55800 8038984 8016271 7995965 7976756 7958634 7940994 7922176 7901044 7877914 7854041 7830958 7809497
55789 7809497 7788198 7763818 7735262 7706072 7680652 7658518 7634897 7606825 7575903 7544748 7513680
55778G513680l1529l1234k9956k9257k9826l0569l0573l0035k9077k7373k5133
55767G189118k3321k2767k3676k5565k7155k7314k6737k7384k9419l0382k8680
55756F896718k6145k5307k5799k5722k5311k6658l0158l3552l4583l3025l0151
55745F580307k7529k6208k5967k5594k4463k3071k1511j8874j5313j3057j3775
55734F344945j6201j8084j9104j9963k0080j8773j7613j8753k1148k1230j7570
55723F136426j2777j0368j1513j4880j7980j8418j5692j2194j1018j2421j3726
55712E985439j2885j0694r201r341j0686j2357j3397j2991j1074q686p549r039
55700E857539j2945j6968j8396j6889j4819j4251j4571j4080j2713j1782j1921
$$ plain form
55778 7513680 7482151 7450917 7420961 7391704 7361878 7331309 7300736 7270701 7241624 7214251 7189118
55767 7189118 7165797 7143030 7119354 7093789 7066634 7039320 7012583 6985199 6955780 6925398 6896718
55756 6896718 6870573 6845266 6819467 6793745 6768434 6741776 6711618 6678066 6643483 6610458 6580307
55745 6580307 6552778 6526570 6500603 6475009 6450546 6427475 6405964 6387090 6371777 6358720 6344945
55734 6344945 6328744 6310660 6291556 6271593 6251513 6232740 6215127 6196374 6175226 6153996 6136426
55723 6136426 6123649 6113281 6101768 6086888 6068908 6050490 6034798 6022604 6011586 5999165 5985439
55712 5985439 5972554 5961860 5952659 5943318 5932632 5920275 5906878 5893887 5882813 5874127 5866578 5857539
55700 5857539 5844594 5827626 5809230 5792341 5777522 5763271 5748700 5734620 5721907 5710125 5698204
55689E698204j2763j3982j5130j5072j3223j0935j0058j0457j0411r213p769o819
55677E562372o191n870o239p063p376o781n892n500o043p620r657j0910j0857
55664E466373j0663j1599j3015j3156j1647r829q892r065j0225j1818j2348j0654
55652E333462p788o141o586p823q583q859q776p867o264n353o418r102j1739j2950
55638E219213j2970j3685j6690k0804k2406j9574j4925j2741j3831j5217j4523
55627E041847j2416j0446q798p203o337p055r144j1679j3796j4765j4229j2856
55615D913123j1878j1677j1650j1504j1658j2232j2739j2973j3048j2600j1279
55604D779885j0044j0287j1495j1590j0027q581q378q307p632p910j0378j3090
$$ plain form
55689 5698204 5685441 5671459 5656329 5641257 5628034 5617099 5607041 5596584 5586173 5576960 5569191 5562372
55677 5562372 5556181 5550311 5544072 5537009 5529633 5522852 5516960 5511460 5505417 5497797 5488140 5477230 5466373
55664 5466373 5455710 5444111 5431096 5417940 5406293 5396464 5387572 5378507 5368282 5356464 5344116 5333462
55652 5333462 5325674 5319533 5312947 5305124 5296541 5287682 5278906 5271039 5264775 5259422 5253004 5243902 5232163 5219213
55638 5219213 5206243 5192558 5175868 5155064 5132658 5113084 5098159 5085418 5071587 5056370 5041847
55627 5041847 5029431 5018985 5010187 5002984 4996647 4989592 4980448 4968769 4954973 4940208 4925979 4913123
55615 4913123 4901245 4889568 4877918 4866414 4854756 4842524 4829785 4816812 4803764 4791164 4779885
55604 4779885 4769841 4759554 4748059 4736469 4726442 4717861 4709483 4701176 4693544 4685634 4675256 4662166
55592D662166j2990j0014o911n564n520n943o652p040o039m116l653o072r524
55579D572128j0771q890o001m483m648n368n904o198o011n039l972m185n725o680
55565D488253n692m286n042p744r394q468p223q370j1074j2189j0767r029q777
55552D380198q986p942o196n784p240q953r359q544p415o450n807n844o763q013
55538D276902q592p838n801l341j957k696m688n688m848m013n137p223p479n146
55524D202455k402j447k418m299o137o932o173n223o380r649j2132j1740r880
55511D117643r109r825j0823j1600j2168j1680r361o185l858k770k424k946m432
55498D020462n698n633n083n375n824m889l023j925j597r22o17k485n745p461
$$ plain form
55592 4662166 4649176 4639162 4632251 4626687 4621167 4615224 4608572 4601532 4595493 4591377 4587724 4581652 4572128
55579 4572128 4561357 4552467 4546466 4541983 4537335 4531967 4526063 4519865 4513854 4508815 4504843 4500658 4494933 4488253
55565 4488253 4482561 4478275 4473233 4465489 4456095 4447627 4440404 4432034 4420960 4408771 4398004 4388975 4380198
55552 4380198 4371212 4363270 4357074 4351290 4344050 4335097 4325738 4317194 4309779 4303329 4297522 4291678 4284915 4276902
55538 4276902 4268310 4260472 4254671 4251330 4249373 4246677 4241989 4236301 4231453 4227440 4222303 4215080 4207601 4202455
55524 4202455 4200053 4198606 4196188 4191889 4185752 4178820 4172647 4167424 4161044 4151395 4139263 4127523 4117643
55511 4117643 4108534 4098709 4087886 4076286 4064118 4052438 4043077 4036892 4033034 4030264 4027840 4024894 4020462
55498 4020462 4014764 4009131 4004048 3998673 3992849 3987960 3984937 3983012 3981415 3980493 3979876 3977391 3971646 3964185
55484C964185p024o860p798p350m232j287j517l848n412n874o735q004q417p949
55470C881878p506p007o080n775p087q442p372m465l048m690p443q909q819p927
55456C787308o489m922m312n018n863n603m426l330k939l324m024l900k233l63
55442C730562p79l799o822p811p772q176p865n105j610j173m313p352p639o750
55428C653596o944p254n704l326k775l956m356l579m081o677q603p755o156o792
55414C575638q901r123o400l087j521j860l386n703q003q900p880n885m002k542
55400C498445j638j513j714j274k63j46j861m372n894n896n355n444o515p926
55386C448634q446p342n337l982l926m468m928n489o227o389n455m173l602l681
$$ plain form
55484 3964185 3957161 3950301 3942503 3935153 3930921 3929634 3928117 3924269 3918857 3912983 3906248 3898244 3889827 3881878
55470 3881878 3874372 3867365 3861285 3855510 3848423 3839981 3832609 3828144 3825096 3820406 3812963 3804054 3795235 3787308
55456 3787308 3780819 3775897 3771585 3766567 3760704 3755101 3750675 3747345 3744406 3741082 3737058 3733158 3730925 3730562
55442 3730562 3729783 3725984 3719162 3711351 3703579 3695403 3687538 3682433 3680823 3679650 3675337 3667985 3660346 3653596
55428 3653596 3646652 3639398 3633694 3630368 3627593 3623637 3619281 3615702 3611621 3604944 3596341 3588586 3582430 3575638
55414 3575638 3566737 3557614 3551214 3548127 3546606 3544746 3541360 3535657 3527654 3518754 3510874 3504989 3500987 3498445
55400 3498445 3496807 3495294 3493580 3492306 3492043 3491897 3490036 3485664 3479770 3473874 3468519 3463075 3456560 3448634
55386 3448634 3440188 3432846 3427509 3423527 3419601 3415133 3410205 3404716 3398489 3392100 3386645 3382472 3378870 3375189
55372C375189l707l713m269n095n028l681k256k205l551n002n462m902l890k801
55358C319627j857j546k431m358o366p571p886p601o778n447l990k789j691l70
55344C258946R79J771J646M94j688m366o223o252n089m386m851n519n136l650
55330C216676k272k294l876n781o592o266n838n536m551l218l620o376q536p124
55316C144796l746k683m749o321m934k484j611k015k355l112m868n725l658m12
55302C096123J69k513n043m988m007m806p025p848n795k281L46J062K86j363l534
55287C048783n499o026m573k273p95l86j0N30j0k194m523n328n122n603o810o897
55271B993264m896k289j208j914k880k919k357k055k073j931j807k583m445o212
$$ plain form
55372 3375189 3371482 3367769 3363500 3358405 3353377 3349696 3347440 3345235 3341684 3336682 3331220 3326318 3322428 3319627
55358 3319627 3317770 3316224 3313793 3309435 3303069 3295498 3287612 3280011 3273233 3267786 3263796 3261007 3259316 3258946
55344 3258946 3259925 3261696 3263342 3263836 3262148 3257782 3251559 3245307 3240218 3235832 3230981 3225462 3220326 3216676
55330 3216676 3214404 3212110 3208234 3202453 3195861 3189595 3183757 3178221 3173670 3170452 3166832 3160456 3151920 3144796
55316 3144796 3141050 3138367 3133618 3127297 3122363 3119879 3118268 3116253 3113898 3110786 3105918 3100193 3096535 3096123
55302 3096123 3096292 3093779 3088736 3083748 3079741 3074935 3067910 3060062 3054267 3051986 3052332 3053394 3053680 3052317 3048783
55287 3048783 3043284 3037258 3032685 3030412 3029617 3029231 3029221 3029751 3029741 3027547 3023024 3017696 3012574 3006971 3000161 2993264
55271 2993264 2988368 2986079 2984871 2982957 2980077 2977158 2974801 2972746 2970673 2968742 2966935 2964352 2959907 2953695
55257B953695o630n694m147k427r72p17j984l431l716l674n034p346q377p608
55243B891938o745o314m614j328P15n13k893l273k070j853k839l108k649l657
55229B850797o557q709p980n275k670j059n85j436l026l935l720l543m082m268
55215B793952l187j814j499j825j718j692l144n695p142o420m969m516m686l849
55201B741796j534J034K405J976k60l817p213q465o988m514l187l053k421o16
55187B705143Q40K67j892l604l472j833m2O31k69k084l468l584k865k437k971
55172B678360m207n310n474m543l176k171j607j157j105k224m301n784n432l704
55158B628165k013j202j239j770k365k646k623k532k298j875k065l765o074o643
$$ plain form
55257 2953695 2947065 2941371 2937224 2934797 2933825 2933108 2931124 2927693 2923977 2920303 2915269 2907923 2899546 2891938
55243 2891938 2885193 2878879 2874265 2872937 2873652 2873139 2870246 2866973 2864903 2863050 2860211 2857103 2854454 2850797
55229 2850797 2844240 2835531 2827551 2822276 2819606 2818547 2817962 2816526 2813500 2809565 2805845 2802302 2798220 2793952
55215 2793952 2790765 2788951 2787452 2785627 2783909 2782217 2779073 2773378 2766236 2759816 2754847 2750331 2745645 2741796
55201 2741796 2740262 2741296 2743701 2745677 2745417 2741600 2734387 2725922 2718934 2714420 2711233 2708180 2705759 2705143
55187 2705143 2705983 2706250 2704358 2700754 2697282 2695449 2695407 2696038 2695769 2693685 2690217 2686633 2683768 2681331 2678360
55172 2678360 2674153 2668843 2663369 2658826 2655650 2653479 2651872 2650715 2649610 2647386 2643085 2637301 2631869 2628165
55158 2628165 2626152 2624950 2623711 2621941 2619576 2616930 2614307 2611775 2609477 2607602 2605537 2601772 2595698 2589055
55144B589055m623j877l38L71J331J811L02k715m948n053l818k718k487k864k740
55129B558689j142J114J585o61l130k896o18M90q47k869m048m845n854o403o010
55114B522555n332m729l494j609q57k776o270q391p231l499L70K311K282J974
55100B485304K519K869J309j884m563n354m845m077l396k943k919k970k652k593
55086B453805l784n494n684l973k433k659l678l824l061k253j394O3J854K947
55072B420432K489K84k784m633l684j085L35j49l96P41J165j227m997p113o881
55057B392497n798m649l196j918j631j791j403j287l078o021p197n300k221k33
55043B346774N54J165J602Q66j543m725o641n553j945J374K034N31j178k502l960
$$ plain form
55144 2589055 2584432 2582555 2582217 2582588 2583919 2585730 2586032 2583317 2578369 2573316 2569498 2566780 2564293 2561429 2558689
55129 2558689 2557547 2558661 2560246 2559585 2556455 2553559 2552941 2553431 2552584 2549715 2545667 2540822 2534968 2528565 2522555
55114 2522555 2517223 2512494 2509000 2507391 2506534 2503758 2497488 2489097 2481866 2478367 2478737 2481048 2483330 2485304
55100 2485304 2487823 2490692 2492001 2490117 2485554 2480200 2475355 2471278 2467882 2464939 2462020 2459050 2456398 2453805
55086 2453805 2450021 2444527 2438843 2434870 2432437 2429778 2426100 2422276 2419215 2416962 2415568 2415631 2417485 2420432
55072 2420432 2422921 2423205 2420421 2415788 2412104 2411019 2411354 2411205 2410809 2411550 2412715 2411488 2406491 2399378 2392497
55057 2392497 2386699 2382050 2378854 2376936 2375305 2373514 2372111 2370824 2367746 2361725 2354528 2349228 2347007 2346774
55043 2346774 2347328 2348493 2350095 2350961 2349418 2344693 2338052 2332499 2330554 2331928 2333962 2334493 2333315 2330813 2326853
55028B326853m899m033k151j761l563n562o167n809m878k860o68q81l639n061
55014B274921k438J327J718o85j348J061K867J234j866l081k197j244j059q94
55000B268316l20K60N18M09q9p47j112j256j706k287k317k414m368q010j0039
54985B234838p876l344k32P88K083M217M435R51l837o200n535m179l767l717l018
54970B205607j867j216j525k368k963k949k778l063l581l449k548j900k163k499
54956B170738j799m92Po80j498j703j900k870m161m518l439j658k15L31k46k076
54940B143821m659o460n996l613j409r55j541j332L50K603M223M433K925M18j191
54925B131617p31M43K62n97O13M169O698N886L881L738M598L380K13j317M71K790
$$ plain form
55028 2326853 2321954 2317921 2315770 2314009 2310446 2304884 2298717 2292908 2288030 2285170 2284502 2283621 2279982 2274921
55014 2274921 2272483 2273810 2275528 2274843 2273495 2274556 2277423 2278657 2276791 2273710 2271513 2270269 2269210 2268316
55000 2268316 2267996 2268256 2268774 2269183 2269094 2268347 2267235 2265979 2264273 2261986 2259669 2257255 2252887 2244877 2234838
54985 2234838 2226962 2223618 2223386 2224174 2226257 2230474 2234909 2235860 2232023 2225823 2220288 2216109 2212342 2208625 2205607
54970 2205607 2203740 2202524 2200999 2198631 2195668 2192719 2189941 2186878 2183297 2179848 2177300 2175400 2173237 2170738
54956 2170738 2168939 2168447 2168454 2167774 2166276 2164573 2162673 2159803 2155642 2151124 2147685 2146027 2145812 2146143 2145897 2143821
54940 2143821 2139162 2132702 2126706 2123093 2121684 2120729 2119188 2117856 2118206 2120809 2125032 2129465 2132390 2132808 2131617
54925 2131617 2130886 2131329 2131591 2130994 2131607 2135776 2142474 2148360 2152241 2155979 2160577 2163957 2164170 2162853 2163324 2166114
54909B166114K202j142m421n647m963l595k932m020o650r091r506p790n580m552
54895B098427m952n691n639m665l395k141o24J084K055J552J44r17j068n75K27
54880B073822J053J390J051Q59J841L816N462N789M860L264J588L29l27o73j077
54865B103047j718k883m810o784p493o989p031q388r254q042o344o795q827r248
54851B008441o816l644j878j484j806k809l956l988k851k027k095j823n86J89
54837A972867q34k893m382m772m349l446k750k880l037j765K36K28k547n339n815
54822A928522n151n228n008k489J375L573K981R22j437l656m537k937o9J259J1
54807A908131k206l631l873l060j459j20p6o14OJ802K740J497r92l126m227m144
$$ plain form
54909 2166114 2168316 2167174 2162753 2157106 2152143 2148548 2145616 2141596 2134946 2125855 2116349 2108559 2102979 2098427
54895 2098427 2093475 2087784 2082145 2077480 2074085 2071944 2071320 2072404 2074459 2076011 2076155 2075238 2074170 2073595 2073822
54880 2073822 2074875 2076265 2077316 2078175 2080016 2083832 2089294 2095083 2099943 2103207 2104795 2105124 2104797 2104124 2103047
54865 2103047 2101329 2098446 2093636 2086852 2079359 2072370 2065339 2056951 2047697 2039655 2033311 2026516 2017689 2008441
54851 2008441 2001625 1997981 1996103 1994619 1992813 1990004 1986048 1982060 1979209 1977182 1975087 1973264 1972678 1972867
54837 1972867 1972033 1969140 1964758 1959986 1955637 1952191 1949441 1946561 1943524 1941759 1941995 1942223 1939676 1934337 1928522
54822 1928522 1923371 1918143 1913135 1910646 1912021 1915594 1918575 1919497 1918060 1914404 1909867 1906930 1906861 1908120 1908131
54807 1908131 1905925 1902294 1898421 1895361 1893902 1893782 1893706 1893092 1893098 1894900 1897640 1899137 1898145 1895019 1890792 1886648
54791A886648k832j069l10r76j830j680q52m40r06j879k693k766j997r81k40N73
54775A865770K060L814M861N103N117M657K893M06o49Q41L442N027N056M264L164
54760A915826J995J341J599K083J618q3k253m104n407o158o261n818n298n145
54746A883935n159m556l088j993l061o202q758q196n149k541j882j787n13J445
54732A832495K237J281j23o79o88j461l365m887l997n61L118M605L725K140J126
54717A834966Q24J247K470L606L065O73j595j962j121j123k586m132m481m052
54703A825799m223n666p685q830q050n602l011j855k372l419l863l703l492l147
54689A760881k170j107j617m156o390n528k119K76k58j539q91N42n17m215o841
$$ plain form
54791 1886648 1883816 1882747 1882437 1881461 1879631 1877951 1877099 1876659 1875753 1873874 1871181 1868415 1866418 1865437 1865197 1865770
54775 1865770 1867830 1871644 1876505 1881608 1886725 1891382 1894275 1894681 1894032 1894873 1898315 1903342 1908398 1912662 1915826
54760 1915826 1917821 1919162 1920761 1922844 1924462 1924379 1922126 1918022 1912615 1906457 1900196 1894378 1889080 1883935
54746 1883935 1878776 1874220 1871132 1869139 1866078 1859876 1851118 1842922 1837773 1835232 1833350 1831563 1831050 1832495
54732 1832495 1834732 1836013 1835890 1835211 1834523 1833062 1829697 1824810 1820813 1820252 1823370 1827975 1831700 1833840 1834966
54717 1834966 1835790 1837037 1839507 1843113 1846178 1846851 1845256 1843294 1842173 1841050 1838464 1834332 1829851 1825799
54703 1825799 1821576 1815910 1808225 1799395 1791345 1785743 1782732 1780877 1778505 1775086 1771223 1767520 1764028 1760881
54689 1760881 1758711 1757604 1755987 1751831 1745441 1739913 1737794 1738070 1737812 1736273 1735382 1735924 1735407 1731192 1724351
54674A724351n798k829j077r46q41n44j474l796n573n433m467m484n452n807m667
54659A671163k708j013p1K02L32J162K860M007K857j08k171j776o55j246l059
54644A669776l511j892l96q78k482l205k465j350j244k709m738m925j746L001
54630A641236N644M939L109K000N98k141m414m055k327k399m718o555n890l392
54616A621635o83J081R06j363l619k982M42L188K705L60r61o96o45k050m124n275
54600A607919m751k969q09J135K559L027K108K51j124j042n2N61Q1j518l836n671
54584A595869n484l345j326p55l70J240K805K238J92r83j090j836k992k172Q85
54569A582876K976J570k101n313o867o596m175k24L038L963L108J724Q4j537j920
$$ plain form
54674 1724351 1718553 1715724 1714647 1713701 1712860 1712316 1710842 1707046 1701473 1696040 1691573 1687089 1681637 1675830 1671163
54659 1671163 1668455 1667442 1667371 1667573 1667905 1669067 1671927 1675934 1678791 1678683 1676512 1674736 1674081 1672835 1669776
54644 1669776 1666265 1664373 1663977 1663099 1660617 1657412 1654947 1653597 1652353 1649644 1644906 1639981 1638235 1641236
54630 1641236 1646880 1651819 1654928 1656928 1657526 1655385 1650971 1646916 1644589 1642190 1637472 1630917 1625027 1621635
54616 1621635 1620952 1622033 1622939 1621576 1617957 1614975 1615417 1618605 1621310 1621670 1620709 1620013 1619368 1617318 1613194 1607919
54600 1607919 1603168 1600199 1599390 1600525 1603084 1606111 1608219 1608470 1607346 1606304 1606252 1606813 1606894 1605376 1601540 1595869
54584 1595869 1590385 1587040 1585714 1584959 1584589 1585829 1588634 1590872 1591064 1590081 1588991 1587155 1584163 1581991 1582876
54569 1582876 1585852 1587422 1585321 1580008 1573141 1566545 1562370 1562146 1565184 1569147 1572255 1573979 1574063 1572526 1570606
54554A570606n05J338K004J589R89K24j132k888m586n943o260m722j980qM58N62
54538A549746Q88M89n02J1K482L800J491k153l107j253J22m79j417j326p72k25
54522A547795P77J910J793K62j012r20m16r25k403l663l826l049k260k214k512
54507A529337k203j698k707n285o613m612j336l18j557k030o86L20m46j590j792
54492A496784j977l224m620m723l608k122m99J060J748J313P47P93Q66M34L03
54477A483275J257K433K330P31j414l233l981k778J56K534J896j372m110l787
54463A473937j023J538K187J406O21M06L72M47J319L034L960K408q98l302l509
54448A482903l021l683n078n520m708l849l374k147M91L020L149O85j965k530
$$ plain form
54554 1570606 1570101 1571439 1573443 1575032 1576021 1576245 1575113 1572225 1567639 1561696 1555436 1550714 1548734 1548726 1549184 1549746
54538 1549746 1550634 1551123 1550621 1550632 1553114 1556914 1558405 1556252 1553145 1551892 1552014 1551535 1550118 1548792 1548020 1547795
54522 1547795 1548572 1550482 1552275 1552537 1551525 1550605 1550189 1549264 1546861 1543198 1539372 1536323 1534063 1531849 1529337
54507 1529337 1527134 1525436 1522729 1517444 1510831 1506219 1504883 1504565 1503008 1500978 1500292 1500612 1500166 1498576 1496784
54492 1496784 1494807 1491583 1486963 1482240 1478632 1476510 1476011 1477071 1478819 1480132 1480879 1481672 1482538 1482972 1483275
54477 1483275 1484532 1486965 1489295 1490026 1488612 1485379 1481398 1478620 1478776 1481310 1483206 1481834 1477724 1473937
54463 1473937 1472914 1474452 1476639 1478045 1478666 1479072 1479444 1479891 1481210 1484244 1488204 1490612 1489714 1486412 1482903
54448 1482903 1479882 1476199 1471121 1465601 1460893 1457044 1453670 1451523 1452014 1455034 1458183 1458868 1456903 1454373
54434A454373j442j017k359m022m029k251p9J502K428K561J347j230m082n769
54420A435931n557l890k125j495j799j483K95K174K187M79q01k56J281K261K218
54405A429420J640R79L83j05l96k90K26L66j051l706n206l701m92J684K254K606
54389A424611K757J142j913l504k294o46r47k170k225j534j501j241R08L623L800
54374A418866J371l31M10J362J10k398l599k690o95J287K316J393j186l159k625
54359A410432n33P19N99P07J891L105L496L801M640M816K890k34j965j318j12
54344A432934k76j189r38M20M43k429o468q470p428n196l769l181k530j855j877
54329A388191k495k793k539k496k988l228k579j497m21J189L445M480K264k050
$$ plain form
54434 1454373 1452931 1451914 1449555 1445533 1441504 1439253 1439174 1440676 1443104 1445665 1447012 1445782 1441700 1435931
54420 1435931 1430374 1426484 1424359 1422864 1421065 1419582 1419877 1422051 1424238 1424717 1423916 1423660 1424941 1427202 1429420
54405 1429420 1431060 1432039 1432422 1432317 1431921 1431631 1431857 1432223 1431172 1427466 1422260 1418559 1418067 1419751 1422005 1424611
54389 1424611 1427368 1428510 1426597 1423093 1420799 1420153 1419206 1417036 1414811 1413277 1411776 1410535 1411443 1415066 1418866
54374 1418866 1420237 1419906 1420316 1421678 1421788 1419390 1415791 1413101 1412406 1413693 1416009 1417402 1416216 1413057 1410432
54359 1410432 1409899 1410618 1411217 1411924 1413815 1416920 1420416 1424217 1428857 1433673 1436563 1436329 1434364 1433046 1432934
54344 1432934 1432658 1431469 1430531 1430951 1431394 1428965 1422497 1414027 1406599 1401403 1397634 1394453 1391923 1390068 1388191
54329 1388191 1385696 1382903 1380364 1377868 1374880 1371652 1369073 1367576 1367155 1368344 1371789 1376269 1378533 1376483
54315A376483m665l652j252o08j909l310m205n321o212n185k051J094K498K530
54301A344235K102R41j372l973n549n836n193l571j208L79l19k634m090l144o75
54286A310093J247J319k22j950k400j415l27k59o32j86R57J432O17p33j939l001
54270A302601l490k389J17K070K067J165J187K008K124J444J624L308M649L466
54256A321951K1l262m383l421j864r58q85j187j517j701j261K94K307L007J522
54241A308663o90j633j487j937l073l036j340l35j947m607n322l645j701j081
54227A276829j735l284n208n802l439P64L565L484K108R32o72l065m230k312J076
54212A259011K488R43j418k619k757k588k149j528j483k241k529r45J809K985
$$ plain form
54315 1376483 1371818 1368166 1366914 1366306 1364397 1361087 1356882 1351561 1345349 1340164 1338113 1339207 1341705 1344235
54301 1344235 1346337 1347278 1345906 1341933 1336384 1330548 1325355 1321784 1320576 1320955 1320636 1318002 1313912 1310768 1310093
54286 1310093 1311340 1312659 1312437 1310487 1308087 1306672 1306345 1306086 1305454 1305268 1306225 1307657 1308274 1307541 1305602 1302601
54270 1302601 1299111 1296722 1296839 1298909 1300976 1302141 1303328 1305336 1307460 1308904 1310528 1313836 1318485 1321951
54256 1321951 1321972 1318710 1314327 1310906 1309042 1308084 1307199 1306012 1304495 1302794 1301533 1301827 1304134 1307141 1308663
54241 1308663 1307973 1306340 1304853 1302916 1299843 1296807 1295467 1295132 1293185 1288578 1283256 1279611 1277910 1276829
54227 1276829 1275094 1271810 1266602 1260800 1257361 1258125 1261690 1265174 1267282 1268214 1267542 1264477 1260247 1257935 1259011
54212 1259011 1261499 1262442 1261024 1258405 1255648 1253060 1250911 1249383 1247900 1245659 1243130 1242185 1243994 1246979
54198A246979P01l459n653m005q47K39j041j832n15J246J494O88J39k88j030j116
54182A231700J41J021n10l362m496l026p56R88K339K791J227j361k086k43J321
54167A225688L30j735k317j563j258j538j149j48k0j130j949j150P71K220K029
54152A217081L19j524j939r06k65j531l748m538l230j842k355l850l266Q95O340
54137A195641R076P439L296n80l080m301m149k740j160k03Q18K335K753O90j811
54122A204024j465J062J647j007l229k041N73J428R29J098J356l1k011k050m87
54107A199796K0r02r08P83J944R68r07j931j991j538n23N14K74j302k497k240
54091A189560j512j425j572j292j006j052n68J041K585K345L74j608k129j145
$$ plain form
54198 1246979 1247680 1244221 1238568 1234563 1233716 1233955 1232914 1231082 1230567 1231813 1233307 1233995 1234134 1233846 1232816 1231700
54182 1231700 1231841 1232862 1232352 1228990 1224494 1221468 1220712 1221700 1224039 1226830 1228057 1226696 1224610 1224367 1225688
54167 1225688 1226018 1224283 1221966 1220403 1219145 1217607 1216458 1216310 1216290 1215160 1213211 1212061 1212832 1215052 1217081
54152 1217081 1217400 1215876 1213937 1213031 1212766 1211235 1207487 1202949 1199719 1197877 1195522 1191672 1188406 1189301 1195641
54137 1195641 1204717 1212156 1215452 1214872 1211792 1207491 1203342 1200602 1199442 1199239 1200057 1202392 1205145 1205835 1204024
54122 1204024 1202559 1203621 1205268 1204261 1201032 1198991 1199564 1200992 1201921 1203019 1204375 1204344 1202333 1200283 1199796
54107 1199796 1199816 1198914 1198006 1198789 1200733 1201701 1200794 1198863 1196872 1195334 1194811 1195325 1195599 1194297 1191800 1189560
54091 1189560 1188048 1186623 1185051 1183759 1182753 1181701 1181133 1182174 1184759 1187104 1187478 1185870 1183741 1182596
54077A182596L07J127J276J928L703N069L980J206J5J813M195M529L497L301L988
54062A222530L891K779K214L124M897O835Q699R861R500P832N866L922J644n96
54048A292998j823k031k178k370j625J97J724K006J808K139K713K785K565K746
54034A301654L252L440L034K283J649J872L586O084P317O077L604J990J623J278
54020A348743L16n95q79q91j135j664k403l200l499k961k417l157m998o324o363
54005A308573o194o752p144o077m061k904l381m580n313n188m360l127j956j365
53991A246171j649k878m774o381o488n046l546l311m014m570m665m329l006n88
53977A190926J349J131l92p84M63J395Q63J59O12J471J421N89j88o73n90R75M085
$$ plain form
54077 1182596 1182903 1184030 1185306 1187234 1190937 1196006 1199986 1201192 1201207 1203020 1207215 1211744 1215241 1218542 1222530
54062 1222530 1226421 1229200 1231414 1234538 1239435 1246270 1254969 1264830 1274330 1282162 1288028 1291950 1293594 1292998
54048 1292998 1291175 1289144 1286966 1284596 1282971 1283168 1284892 1286898 1288706 1290845 1293558 1296343 1298908 1301654
54034 1301654 1304906 1308346 1311380 1313663 1315312 1317184 1320770 1326854 1334171 1340248 1343852 1345842 1347465 1348743
54020 1348743 1349059 1348464 1347585 1346694 1345559 1343895 1341492 1338292 1334793 1331832 1329415 1326258 1321260 1314936 1308573
54005 1308573 1302379 1295627 1288483 1282406 1278345 1275441 1272060 1267480 1262167 1256979 1252619 1249492 1247536 1246171
53991 1246171 1244522 1241644 1236870 1230489 1224001 1218955 1215409 1212098 1208084 1203514 1198849 1194520 1191514 1190926
53977 1190926 1192275 1193406 1193014 1192230 1192693 1194088 1194951 1195110 1195722 1197193 1198614 1199203 1199015 1198342 1197752 1198727 1202812
53960A202812O947P832P031N681L858J438l12o1J467K610L360M584N279L293r79
53945A254840m147l851j186J627L816N210M946K863R25J266L547N731O933P900
53931A290420Q985R351Q530P524P707R134J0395J0007P878N480M520N431P349
53918A392711R386J1119J1969J1368J0271J1075J4698J8495J8870J5721J2602
53907A538285J2331J4160J5725J5829J4093R667K485m995r561j0912j1698j3629
53895A571780j5455j5578j4690j4376j4579j4393j4371j5737j7657j7706j5486
53884A401752j3601j4037j5441j5244j3075j0562q820p779p274p126o608n382
53872A276803m771o351r209j0331q296n137l715m445n603n956n749n505n140m527
$$ plain form
53960 1202812 1209759 1217591 1224622 1230303 1234161 1235599 1235287 1235226 1236693 1239303 1242663 1247247 1252526 1255819 1254840
53945 1254840 1250693 1246842 1245656 1247283 1251099 1256309 1261255 1264118 1265043 1266309 1269856 1275587 1282520 1290420
53931 1290420 1299405 1308756 1317286 1324810 1332517 1341651 1352046 1362053 1369931 1375411 1379931 1385362 1392711
53918 1392711 1402097 1413216 1425185 1436553 1446824 1457899 1472597 1491092 1509962 1525683 1538285
53907 1538285 1550616 1564776 1580501 1596330 1610423 1620090 1622575 1617580 1608019 1597107 1585409 1571780
53895 1571780 1556325 1540747 1526057 1511681 1497102 1482709 1468338 1452601 1434944 1417238 1401752
53884 1401752 1388151 1374114 1358673 1343429 1330354 1319792 1310972 1303193 1295919 1288793 1282185 1276803
53872 1276803 1272032 1265681 1256472 1246141 1237845 1232708 1228993 1224548 1218945 1212989 1207240 1201735 1196595 1192068
53858A192068l999l795l480k547j427j209k216l444l941l990m145l680j586R84
53844A153593J210j518m032l326p56j24k229l940k910q14o69k661m317l895k030
53829A121582k85N94P64N74L37M03Q92J272O42j068k390j582J120L355L444K553
53813A132207K987M908O261N889N075N354O039N035J780j652k529k72L043N097
53799A179222N819O772Q313Q915P904P015P699Q320O394K650J84k1J65j55L82
53784A249578J987K278n2k814l742l918n214o460n378l023k722n029o969o595
53770A201927n342n084n415n196m736n032o115p325q191q154o539l804j838j878
53756A127278k925l324l188l837n173n279l118m59N4j637k612n60K996M184J423
$$ plain form
53858 1192068 1188069 1184274 1180794 1178247 1176820 1175611 1173395 1169951 1166010 1162020 1157875 1154195 1152609 1153593
53844 1153593 1154803 1153285 1149253 1145927 1145171 1145047 1142818 1138878 1135968 1135154 1134485 1131824 1127507 1123612 1121582
53829 1121582 1121297 1121891 1122655 1123229 1123566 1123969 1124861 1126133 1126775 1125707 1123317 1121735 1122855 1126210 1129654 1132207
53813 1132207 1135194 1140102 1146363 1152252 1157327 1162681 1168720 1173755 1175535 1173883 1171354 1171082 1174125 1179222
53799 1179222 1185041 1191813 1200126 1209041 1216945 1223960 1231659 1239979 1246373 1249023 1249207 1249186 1249351 1249196 1249578
53784 1249578 1251565 1253843 1253791 1250977 1247235 1243317 1238103 1231643 1226265 1223242 1220520 1215491 1208522 1201927
53770 1201927 1196585 1191501 1186086 1180890 1176154 1171122 1165007 1157682 1149491 1141337 1134798 1130994 1129156 1127278
53756 1127278 1124353 1121029 1117841 1114004 1108831 1103552 1100434 1099975 1100029 1098392 1095780 1095220 1098216 1102400 1103823
53741A103823k607m190k736o43K74M99J036J504Q37j015k949l775k905m32K780
53726A089501N345O268N558L777J407r41k204j609K64K001L077M354O341P774
53712A130913P120N210M774O739Q493P238M068K507L386L653J133j934j766K036
53698A183570O423Q612P998N243J881L89K109M830M689J056k555l197j873j057
53684A218118r87l70P47J035K34m80l12M46J225J526Q53m95j053Q2J573J409k56
53667A223295j481j557j677k584l435l501l115k383q60O97L65j904l232j617R68
53652A197979J424k1p59k47l33j399j446K14J313K20j151j29K722M570M311L493
53636A210761L602M371M727M035K292K75m82Q82L083L837K778K108L854P362J0169
$$ plain form
53741 1103823 1101216 1097026 1094290 1093647 1093921 1094420 1095456 1096960 1097797 1096782 1093833 1090058 1087153 1086721 1089501
53726 1089501 1094846 1101114 1106672 1110449 1111856 1110915 1108711 1107102 1107366 1109367 1112444 1116798 1123139 1130913
53712 1130913 1138033 1143243 1148017 1154756 1163249 1170487 1174555 1177062 1180448 1184101 1185234 1183300 1181534 1183570
53698 1183570 1189993 1198605 1206603 1211846 1213727 1214116 1216225 1221055 1225744 1226800 1224245 1221048 1219175 1218118
53684 1218118 1217131 1216761 1217508 1218543 1218777 1218297 1217985 1218431 1219656 1221182 1222035 1221540 1220487 1220569 1222142 1223551 1223295
53667 1223295 1221814 1220257 1218580 1215996 1212561 1209060 1205945 1203562 1202702 1203399 1203764 1201860 1198628 1197011 1197979
53652 1197979 1199403 1199382 1198623 1198376 1198043 1196644 1195198 1195412 1196725 1196945 1195794 1195665 1198387 1202957 1207268 1210761
53636 1210761 1214363 1218734 1223461 1227496 1229788 1230063 1229581 1230463 1233546 1237383 1240161 1242269 1246123 1253485 1263654
53621A263654J0665R164O790M192J707K86J332M957Q701R309O330K970K438M303
53607A336798N739N712O065Q404J1563J3026J1800R143P046O530O889O335L828
53594A438878M20j793k001j151l59M2k01j500l462m934n580o271p273p433o052
53579A391330m314l607l565l118k484k454k523j622l82o29k344l086j203J804
53565A361803L169K083jj592k423k693k219p59J315L163M119L994K990J666R40
53550A375555J455K748L582L584L915N550P482P858O656N803O448P715Q677R934
53536A456962J2056J3926J4196J3594J4161J6559J9516K1570K2106K1160J9646
53525A645452J9488K1919K5661K8214K8956K9395L0276L0489K9553K9247L1260
$$ plain form
53621 1263654 1274319 1283483 1290273 1294465 1296172 1296458 1297790 1302747 1311448 1320757 1327087 1330057 1332495 1336798
53607 1336798 1342537 1348249 1354314 1362718 1374281 1387307 1399107 1408250 1415296 1421826 1428715 1435050 1438878
53594 1438878 1439298 1437505 1435504 1434353 1433994 1434036 1433835 1432335 1428873 1423939 1418359 1412088 1404815 1397382 1391330
53579 1391330 1387016 1383409 1379844 1376726 1374242 1371788 1369265 1367643 1367261 1366632 1364288 1361202 1359999 1361803
53565 1361803 1364972 1367055 1367054 1365462 1363039 1360346 1358127 1357368 1358683 1361846 1365965 1369959 1372949 1374615 1375555
53550 1375555 1377010 1379758 1383340 1386924 1390839 1396389 1403871 1411729 1418385 1424188 1430636 1438351 1447028 1456962
53536 1456962 1469018 1482944 1497140 1510734 1524895 1541454 1560970 1582540 1604646 1625806 1645452
53525 1645452 1664940 1686859 1712520 1740734 1769690 1799085 1829361 1859850 1889403 1918650 1949910
53514A949910L4595L6978L8104L9746M2751M5595M6303M4856M3060M2651M3942
53503B408491M5828M6757M6014M4419M3384M3078M2098L9605L7246L7595M0512
53492B875027M2411M0265L5407L1999L2169L4186L5382L5134L4335L3404L2086
53481C261805L0272K8084K5640K3490K2508K2424K1226J7206J1211N791K302j18
53469C471841k937o536j0133j2734j4110j5177j7106j9821k2132k3669k5572k8488
53457C273426l1128l2058l1892l2125l2803l3118l3660l5741l8596l9435l6781
53446B896089l2072k7575k4151k1542j9341j7123j4719j2742j1873j1559j0657
53435B692735r237q127o730l340J873O180P571P155P428R582J3391J8179K2761
$$ plain form
53514 1949910 1984505 2021483 2059587 2099333 2142084 2187679 2233982 2278838 2321898 2364549 2408491
53503 2408491 2454319 2501076 2547090 2591509 2634893 2677971 2720069 2759674 2796920 2834515 2875027
53492 2875027 2917438 2957703 2993110 3025109 3057278 3091464 3126846 3161980 3196315 3229719 3261805
53481 3261805 3292077 3320161 3345801 3369291 3391799 3414223 3435449 3452655 3463866 3469657 3471959 3471841
53469 3471841 3468904 3462368 3452235 3439501 3425391 3410214 3393108 3373287 3351155 3327486 3301914 3273426
53457 3273426 3242298 3210240 3178348 3146223 3113420 3080302 3046642 3010901 2972305 2932870 2896089
53446 2896089 2864017 2836442 2812291 2790749 2771408 2754285 2739566 2726824 2714951 2703392 2692735
53435 2692735 2683498 2675371 2668641 2665301 2667174 2673354 2680925 2688080 2695508 2705090 2718481 2736660 2759421
53422B759421K5720K6960K8072L0300L3188L5937L8677M1483M3518M4554M6089
53411C153919M9593N4518N9228O2980O5908O8093O9939P2506P6190P9850Q2313
53400C895037Q3942Q5652Q7518Q9479R2143R5382R7493R7469R6895R7595R8556
53389D917161R7516R4768R2717R1889R0019Q5398P8825P1800O4812N8174N2645
53378E795724M8183M3380L7003K9320K1439J4134P476P37p281j6928k6942l5990
53366E910255m4442n3193o1331o6978p0200p3022p6526q0036q3245q6623q9284
53355E125375q9267q6954q5566q6723q8055q7068q5121q5038q6472q6478q3677
53344D174956p9328p4857p0667o7112o4348o1426n7470n3560n1323m9869m6640
$$ plain form
53422 2759421 2785141 2812101 2840173 2870473 2903661 2939598 2978275 3019758 3063276 3107830 3153919
53411 3153919 3203512 3258030 3317258 3380238 3446146 3514239 3584178 3656684 3732874 3812724 3895037
53400 3895037 3978979 4064631 4152149 4241628 4333771 4429153 4526646 4624115 4721010 4818605 4917161
53389 4917161 5014677 5109445 5202162 5294051 5384070 5469468 5548293 5620093 5684905 5743079 5795724
53378 5795724 5843907 5887287 5924290 5953610 5975049 5989183 5996659 5997396 5990115 5973187 5946245 5910255
53366 5910255 5865813 5812620 5751289 5684311 5614111 5541089 5464563 5384527 5301282 5214659 5125375
53355 5125375 5036108 4949154 4863588 4776865 4688810 4601742 4516621 4431583 4345111 4258633 4174956
53344 4174956 4095628 4020771 3950104 3882992 3818644 3757218 3699748 3646188 3594865 3544996 3498356
53333C498356m1610l8043l8034l9509l9174l6741l4320l2822l1155k8790k6987
53322C111171k6770k6954k5265k1214j6945j4890j5067j5267j3841j1358r199
53311B914401p414n040j927J191M329Q440J3488J7610J9237J9176J9669K1934
53299C025094K5554K9725L3835L6960L8131L7675L7391L8659M0724M1558M0308
53288C425614L8143L6553L5495L3794L0971K7783K4960K2247J9114J5633J1850
53277C722157P098J011n134r504j2200j5242j9673k4136k7203k9623l2862l6428
53265C518261l8563l9290m0731m4137m8210n1060n2487n3374n3977n3979n3615
53254B988838n3591n4063n4500n4260n2743m9535m5359m2458m2720m5292m7177
$$ plain form
53333 3498356 3456746 3418703 3380669 3341160 3301986 3265245 3230925 3198103 3166948 3138158 3111171
53322 3111171 3084401 3057447 3032182 3010968 2994023 2979133 2964066 2948799 2934958 2923600 2914401
53311 2914401 2906987 2901947 2900020 2901211 2905540 2913980 2927468 2945078 2964315 2983491 3003160 3025094
53299 3025094 3050648 3080373 3114208 3151168 3189299 3226974 3264365 3303024 3343748 3385306 3425614
53288 3425614 3463757 3500310 3535805 3569599 3600570 3628353 3653313 3675560 3694674 3710307 3722157
53277 3722157 3729255 3730266 3725132 3715628 3703428 3688186 3668513 3644377 3617174 3587551 3554689 3518261
53265 3518261 3479698 3440408 3399677 3355540 3307330 3256270 3203783 3150409 3096432 3042453 2988838
53254 2988838 2935247 2881184 2826684 2772424 2719681 2670146 2624787 2582329 2539609 2494317 2447140
53243B447140m6533m4471m3030m2446m1364l9206l7068l6045l5591l4222l1486
53232B015678k8650k7180k7050k6840k5299k2462j9387j7436j7760k0549k4291
53221A758774k6481k5983k4342k3908k5040k6065k5749k4529k3211k1885k0672
53210A490909k0294k0864k1030j9469j6837j5122j5333j6715j8122j9084j9448
53199A288591j8873j7216j4930j2706j0996r961r637r964j0675j1224j0893r397
53187A142119p587o968p981r281r377q514p915p581o235l632j530j725m048p020
53173A052725r464j0616r602o204j900J122K031J575M54j276l117l827l063k270
53159A006568k932m570n531n326n010n288n533m969l844k794j854q69k12j70R3
$$ plain form
53243 2447140 2400607 2356136 2313106 2270660 2229296 2190090 2153022 2116977 2081386 2047164 2015678
53232 2015678 1987028 1959848 1932798 1905958 1880659 1858197 1838810 1821374 1803614 1783065 1758774
53221 1758774 1732293 1706310 1681968 1658060 1633020 1606955 1581206 1556677 1533466 1511581 1490909
53210 1490909 1470615 1449751 1428721 1409252 1392415 1377293 1361960 1345245 1327123 1308039 1288591
53199 1288591 1269718 1252502 1237572 1224866 1213870 1203909 1194272 1184308 1173633 1162409 1151516 1142119
53187 1142119 1134532 1127564 1119583 1110302 1100925 1092411 1084496 1076915 1070680 1067048 1065518 1063793 1059745 1052725
53173 1052725 1043261 1032645 1023043 1016839 1014939 1016061 1018092 1019667 1020121 1018845 1015728 1011901 1008838 1006568
53159 1006568 1003636 999066 993535 988209 983199 977911 972378 967409 963565 960771 958917 958048 957836 957666 957759
$$ [...]
##END NTUPLES=NMR SPECTRUM
##END=
