
##TITLE=AC1302_PERAH12114_6608382_PZ89wDSsjw
##JCAMPDX= 6.0         $$ Bruker NMR JCAMP-DX V2.0
##DATA TYPE= NMR SPECTRUM
##DATA CLASS= NTUPLES
##ORIGIN= BRUKER
##OWNER= Administrator
$$ 1.72 TOPSPIN		Version 2.1
$$ 2012-08-15 18:24:00.609 -0500  Administrator@TOPSPIN
$$ Compression mode = diff/dup
##.OBSERVE FREQUENCY= 400.02188249412
##.OBSERVE NUCLEUS= ^1H
##.ACQUISITION MODE= SIMULTANEOUS (DQD)
##.ACQUISITION SCHEME= undefined
##.AVERAGES= 8
##.DIGITISER RES= 22
##SPECTROMETER/DATA SYSTEM= spect
##.PULSE SEQUENCE= zg30
##.SOLVENT NAME= COFFEE_meoh
##.SHIFT REFERENCE= INTERNAL, COFFEE_meoh, 1, 14.98509
##AUDIT TRAIL= $$ (NUMBER, WHEN, WHO, WHERE, PROCESS, VERSION, WHAT)
$$ ##TITLE= Audit trail, TOPSPIN		Version 2.1
$$ ##JCAMPDX= 5.01
$$ ##ORIGIN= Bruker BioSpin GmbH
$$ ##OWNER= Administrator
$$ $$ C:\Bruker\TOPSPIN/data/COFFEE/nmr/AC1302_PERAH12114_6608382_PZ89wDSsjw/50/pdata/1/auditp.txt
$$ ##AUDIT TRAIL=  $$ (NUMBER, WHEN, WHO, WHERE, PROCESS, VERSION, WHAT)
(   1,<2012-08-15 18:23:45.906 -0500>,<Administrator>,<TOPSPIN>,<go>,<TOPSPIN 2.1>,
      <created by zg
	started at 2012-08-15 18:22:39.078 -0500,
	POWCHK enabled, PULCHK disabled,
       configuration hash MD5:
       6B 1B 68 BB D9 2E 58 E2 7F 35 AD 54 07 DF 0E 41
       data hash MD5: 64K
       40 2A D4 C6 65 F2 1E A9 67 7F 97 4D 12 0E 67 18>)
(   2,<2012-08-15 18:23:52.156 -0500>,<Administrator>,<TOPSPIN>,<proc1d>,<TOPSPIN 2.1>,
      <Start of raw data processing
       efp LB = 0 FT_mod = 6 PKNL = 1 PHC0 = 0 PHC1 = 0 SI = 32K 
       data hash MD5: 32K
       9F 30 53 14 C8 25 A0 12 A3 CF B0 DC 97 EB B9 FE>)
(   3,<2012-08-15 18:23:53.000 -0500>,<Administrator>,<TOPSPIN>,<proc1d>,<TOPSPIN 2.1>,
      <pk PHC0 = 180.6592 PHC1 = 0 
       data hash MD5: 32K
       A1 38 B0 E2 98 AE 73 D9 AF A4 7E 27 32 EC 71 A4>)
(   4,<2012-08-15 18:23:53.500 -0500>,<Administrator>,<TOPSPIN>,<proc1d>,<TOPSPIN 2.1>,
      <abs ABSG = 1 
       data hash MD5: 32K
       94 7C FB F9 B2 A5 93 AA BF 95 76 8C 33 F8 D8 63>)
(   5,<2012-08-15 18:23:53.937 -0500>,<Administrator>,<TOPSPIN>,<proc1d>,<TOPSPIN 2.1>,
      <abs ABSG = 2 
       data hash MD5: 32K
       23 E6 E5 4F C1 AD C9 89 08 D0 71 73 B6 AE 65 AD>)
(   6,<2012-08-15 18:23:54.437 -0500>,<Administrator>,<TOPSPIN>,<proc1d>,<TOPSPIN 2.1>,
      <abs ABSG = 3 
       data hash MD5: 32K
       5E EF DA 2E D0 A8 0C A4 57 C8 54 9E 57 B3 48 98>)
(   7,<2012-08-15 18:23:54.984 -0500>,<Administrator>,<TOPSPIN>,<proc1d>,<TOPSPIN 2.1>,
      <abs ABSG = 4 
       data hash MD5: 32K
       DA 9C 6E 68 12 D6 C2 97 C4 3D 08 0D 33 0F 1A B5>)
(   8,<2012-08-15 18:23:55.500 -0500>,<Administrator>,<TOPSPIN>,<proc1d>,<TOPSPIN 2.1>,
      <abs ABSG = 5 
       data hash MD5: 32K
       48 D7 D0 E6 0A 82 C8 24 CF 2F 4B C2 7E 41 B3 F2>)
$$ ##END=
$$ 
$$ $$ hash MD5
$$ $$ 28 02 C8 C2 CD 43 72 00 DD 32 50 DA 46 0A 17 52
##$RELAX= 
##$RELAX= 
##$RELAX= 
##$RELAX= 
##$RELAX= 
##$RELAX= 
##$RELAX= 
$$ Bruker specific parameters
$$ --------------------------
$$ [...]
##$TP= (0..7)
150 150 150 150 150 150 150 150
##$TP07= 0
##$TPNAME0= <>
##$TPNAME1= <>
##$TPNAME2= <>
##$TPNAME3= <>
##$TPNAME4= <>
##$TPNAME5= <>
##$TPNAME6= <>
##$TPNAME7= <>
##$TPOAL= (0..7)
0.5 0.5 0.5 0.5 0.5 0.5 0.5 0.5
##$TPOFFS= (0..7)
0 0 0 0 0 0 0 0
##$TUNHIN= 0
##$TUNHOUT= 0
##$TUNXOUT= 0
##$USERA1= <user>
##$USERA2= <user>
##$USERA3= <user>
##$USERA4= <user>
##$USERA5= <user>
##$V9= 5
##$VALIST= <valist>
##$VCLIST= <CCCCCCCCCCCCCCC>
##$VD= 0
##$VDLIST= <DDDDDDDDDDDDDDD>
##$VPLIST= <PPPPPPPPPPPPPPP>
##$VTLIST= <TTTTTTTTTTTTTTT>
##$WBST= 1024
##$WBSW= 4
##$XGAIN= (0..3)
0 0 0 0
##$XL= 0
##$YL= 0
##$YMAX_a= 505079
##$YMIN_a= -654469
##$ZGOPTNS= <>
##$ZL1= 120
##$ZL2= 120
##$ZL3= 120
##$ZL4= 120
##$ABSF1= 14.98509
##$ABSF2= -5.573092
##$ABSG= 5
##$ABSL= 3
##$ALPHA= 0
##$AQORDER= 0
##$ASSFAC= 0
##$ASSFACI= 0
##$ASSFACX= 0
##$ASSWID= 0
##$AUNMP= <proc_prof1d_extract_pilot.lims>
##$AXLEFT= 0
##$AXNAME= <>
##$AXNUC= <1H>
##$AXRIGHT= 0
##$AXTYPE= 0
##$AXUNIT= <>
##$AZFE= 0.1
##$AZFW= 0.1
##$BCFW= 0
##$BC_mod= 0
##$BYTORDP= 0
##$COROFFS= 0
##$CY= 15
##$DATMOD= 1
##$DC= 0
##$DFILT= <>
##$DTYPP= 0
##$F1P= 0
##$F2P= 0
##$FCOR= 0.5
##$FTSIZE= 32768
##$FT_mod= 6
##$GAMMA= 0
##$GB= 0
##$INTBC= 1
##$INTSCL= 1
##$ISEN= 128
##$LB= 0
##$LEV0= 0
##$LPBIN= 0
##$MAXI= 10000
##$MC2= 0
##$MEAN= 0
##$ME_mod= 0
##$MI= 0
##$NCOEF= 0
##$NC_proc= -8
##$NLEV= 6
##$NOISF1= 0
##$NOISF2= 0
##$NSP= 0
##$NTH_PI= 0
##$NZP= 0
##$OFFSET= 14.98509
##$PC= 1
##$PHC0= 180.6592
##$PHC1= 0
##$PH_mod= 1
##$PKNL= yes
##$PPARMOD= 0
##$PPDIAG= 0
##$PPIPTYP= 0
##$PPMPNUM= 2147483647
##$PPRESOL= 1
##$PSCAL= 4
##$PSIGN= 0
##$PYNMP= <proc.py>
##$REVERSE= no
##$SF= 400.02
##$SI= 32768
##$SIGF1= 0
##$SIGF2= 0
##$SINO= 400
##$SIOLD= 32768
##$SPECTYP= <>
##$SREGLST= <1H.CDCl3>
##$SSB= 0
##$STSI= 32768
##$STSR= 0
##$SW_p= 8223.68421052631
##$SYMM= 0
##$S_DEV= 0
##$TDeff= 65536
##$TDoff= 0
##$TI= <>
##$TILT= no
##$TM1= 0
##$TM2= 0
##$TOPLEV= 0
##$USERP1= <user>
##$USERP2= <user>
##$USERP3= <user>
##$USERP4= <user>
##$USERP5= <user>
##$WDW= 1
##$XDIM= 32768
##$YMAX_p= 458930709
##$YMIN_p= -742700
##$CURPLOT= <Network HP LaserJet P1505>
##$CURPRIN= <$Network HP LaserJet P1505>
##$DFORMAT= <normdp>
##$LAYOUT= <+/1D_H.xwp>
##$LFORMAT= <normlp>
##$PFORMAT= <normpl>
##$SURQMSG= 1
$$ End of Bruker specific parameters
$$ ---------------------------------
##NTUPLES= NMR SPECTRUM
##VAR_NAME=  FREQUENCY,     SPECTRUM/REAL,   SPECTRUM/IMAG
##SYMBOL=    X,             R,               I
##VAR_TYPE=  INDEPENDENT,   DEPENDENT,       DEPENDENT
##VAR_FORM=  AFFN,          ASDF,            ASDF
##VAR_DIM=   32768,         32768,           32768
##UNITS=     HZ,            ARBITRARY UNITS, ARBITRARY UNITS
##FACTOR=    0.250966925370066, 1,           1
##FIRST=     8223.43324360094, 80203,        -889
##LAST=      0,             -103567,         12430
##MIN=       0,             -742700,         0
##MAX=       8223.43324360094, 458930709,    0
$$ Real data points
##PAGE= N=1
##DATA TABLE= (X++(R..R)), XYDATA
$$ [...]
$$ plain form
19532 -393093 80352 96961 -463220 -165865 -249100 260872 -334921 -88133 146506 -136862
19521 -52304 -222933 -235884 2097 100093 275606 88114 -32676 -186449 -57090 172803 -24262
19509 110054 -118654 -58092 -296470 193865 -90888 274017 134628 -22872 -262964 -268305
19499 -268305 11517 -19424 -100194 -106445 61443 -165789 -229136 -95736 -55181 9534 -198195
19487 -107730 55830 155433 -276665 -60022 -185243 267236 60395 26066 -219721 30945 -248297
19475 111765 47456 -54317 -111755 -21167 57781 147438 202236 -310504 270939 -151030 -458740
19464 -458740 8040 -212486 62411 -196394 169450 -8613 439994 65494 148627 145461 20581
19452 99400 -56827 147807 -192786 117021 165331 281726 157421 294368 -155133 -187577
$$ packed form
19532c93093H0352J6609d63220a65865q3235B60872c34921h8133A46506a36862
19521e2304j70629j2951B097R7996J75513H8114c2676j53773e7090A72803b4262
19509A10054a18654e8092k38378A93865i0888B74017A34628b2872k40092n341
19499b68305A1517a9424q0770o251F1443a65789o3347i5736M0555I534a98195
19487a07730E5830R9603b76665f0022j25221B67236F0395B6066b19721C0945b48297
19475A11765D7456e4317n7438b1167E7781Q9657N4798c10504B70939a51030l07710
19464d58740H040b12486F2411a96394A69450h613D39994F5494Q3133l166B0581
19452I9400e6827A47807a92786A17021M8310J16395j24305J36947a55133l2444
$$ plain form
19442 -187577 231810 -109139 -518877 -85717 -148643 -77410 -16575 57111 -124716 -428086
19432 -428086 20780 -115421 -393694 -142453 -310402 -187057 -262309 77334 30737 40024 -78298
19420 393899 -194023 -339916 97745 5484 159882 -227436 -88507 -428042 64634 189711
19410 189711 -133907 -79204 -227333 616 -36772 -308442 -64898 -73885 -76360 -146672 442694
19398 -282481 -152494 -89512 -102812 -209165 -460768 61853 142605 13053 102297 -125909 -238010
19387 -238010 -147996 124930 -31552 -31357 114984 6850 39252 -62352 -120263 -113136 -235136 21291
19374 -206707 -85777 231434 -147879 -238212 1611 -12973 -216986 -4549 -72404 56116 144033
19363 144033 -153507 222176 71148 -66174 -109791 -150517 -278384 -67423 -53299 -149145 -79634
$$ packed form
19442a87577B31810a09139m09738h5717o2926P1233a6575E7111a24716l03370
19432d28086B0780a15421k78273a42453j67949J23345p5252G7334C0737R287g8298
19420C93899a94023j45893I7745E484J54398b27436h8507l39535F4634J25077
19410A89711a33907N4703j48129F16c6772k71670f4898q987k475p0312D42694
19398b82481J29987O2982j3300j06353k51603F1853Q0752A3053Q9244a25909j12101
19387b38010R0014A24930c1552J95A14984F850L2402f2352n7911P127j22000B1291
19374b06707h5777B31434a47879r0333A611a2973k04013d549o7855E6116Q7917
19363A44033a53507B22176G1148f6174m3617m0726j27867f7423J4124r5846O9511
$$ plain form
19352 -79634 52480 55603 -297895 310698 -236912 -4771 -317311 -86453 -267030 -26589 -512559
19341 -512559 25600 -359980 -204519 -62597 -277051 -64748 6841 -297419 25022 -12131 135656
19329 95948 83890 118111 -227584 20854 125994 -67159 -288865 -370212 174134 45615 -168948
19317 -252170 237224 -195654 -172625 -555966 49086 174945 -42257 -200272 -125980 -23842
19306 -49997 -77065 -406247 -342969 -39276 -29495 -20609 -494637 125068 -5116 -96285 -43315 162901
19293 -293550 223497 92468 -356842 -253476 166509 -220375 -54290 101374 -236653 -79669
19282 -184554 78985 -153002 -149981 107067 -320729 64909 -109199 142166 42256 45006 -211347
19270 -10657 -542566 -52911 -59452 -98459 -110383 473265 109429 -260661 -50526 44064 135071
$$ packed form
19352g9634E2480L123b97895C10698b36912d771l12540h6453j80577b6589m85970
19341e12559B5600c59980J55461f2597k14454f4748F841b97419B5022a2131A35656
19329I5948j2058L4221b27584B0854J05140f7159k21706q1347A74134D5615a68948
19317b52170B37224a95654K3029l83341D9086J25859d2257j58015P4292b3842
19306d9997k7068l29182O3278c9276R781Q886m74028A25068e116r1169d3315A62901
19293b93550B23497I2468c56842J03366A66509b20375e4290A01374b36653g9669
19282a84554G8985a53002L021A07067c20729F4909a09199A42166D2256K750b11347
19270a0657n31909e2911o541l9007j1924D73265A09429b60661e0526D4064R1007
$$ plain form
19259 135071 13653 -21699 -68945 28229 130601 -8644 -108302 -392746 -6061 -83096 -141122
19248 -141122 -245584 3495 40447 378508 61164 214530 -227185 21614 24637 109066 -95779
19236 -314116 -309042 52679 -184650 -28741 -56074 92063 -95167 -95868 75692 -204862 -69672 -21050
19223 205608 240983 227219 -200882 95529 -321764 154106 -117966 -343760 -110217 -287765
19213 -287765 -374457 132271 10586 19543 169274 -187103 -308560 -88763 -104835 -206615 -272402
19202 -272402 -247105 -50505 -68367 12790 223869 -88598 -232763 -154264 55235 -241641 -25005
19190 -200297 -169203 136996 77106 -17447 -144446 -13751 26623 83051 -239272 67647 -18778
19178 -93409 -85601 -55321 127152 -113909 327011 -104476 -16284 -172356 -224481 193414 158286
$$ packed form
19259A35071A3653b1699m7246B8229J02372h644r9658k84444f061p7035n8026
19248a41122j04462C495L6952L38061F1164J53366b27185B1614L023Q4429i5779
19236c14116N074E2679a84650b8741k7333I2063i5167p01G5692b04862f9672b1050
19223B05608L5375j3764b00882I5529c21764A54106a17966k25794a10217j77548
19213b87765q6692A32271A0586Q957J49731a87103j21457h8763j6072j01780o5787
19202b72402K5297e0505j7862A2790K11079h8598j44165P8499E5235b41641b5005
19190b00297L1094A36996n9890a7447j26999a3751B6623N6428b39272F7647a8778
19178i3409P808L0280A27152a13909C27011a04476a6284j56072n2125A93414l5128
$$ plain form
19167 158286 72348 159252 -170050 -86857 -91486 -189580 -246046 64850 96066 -30388 -52981
19156 -52981 -10558 -301325 45051 33205 26368 -54581 296895 -341278 -152202 -161117 -31331
19144 198648 152442 -70804 -328550 -280313 -143915 -177003 -237680 91467 -260365 73736 -113427
19132 -76038 35906 -159158 161042 -376330 -209062 -151239 57502 -179989 -66426 -188845
19122 -188845 -244599 329431 -508569 210935 -49855 8116 -294068 -92767 82414 84423 -140079
19110 -227977 -87770 -151031 -364504 -21412 -467343 -21700 -44044 260056 -240950 -67645 -13858
19098 127755 230474 -184814 -190186 233176 -277584 -196833 -270850 -192375 241947 -87888 201177
19086 116656 -120872 -333257 -286106 194016 -114170 -407343 276547 161229 59414 119205
$$ packed form
19167A58286G2348Q6904a70050Q3193m629r8094n6466F4850L1216c0388k2593
19156e2981a0558k90767D5051j1846o837e4581B96895c41278a52202q915c1331
19144A98648m6206g0804k57746M8237J36398l3088o0677I1467b60365G3736a13427
19132g6038C5906a59158A61042c76330J67268N7823E7502a79989f6426j22419
19122a88845n5754C29431e08569B10935d9855H116b94068i2767H2414K009a40079
19110b27977h7770o3261k13473b1412m45931b1700k2344B60056b40950f7645a3858
19098A27755J02719a84814n372B33176b77584Q0751p4017P8475B41947h7888B01177
19086A16656a20872k12385M7151A94016a14170k93173B76547j15318E9414N9791
$$ plain form
19076 119205 -63141 -160897 -133271 113594 -121116 -141670 56163 -12087 -174645 -69881 23824
19064 365021 156523 76203 -131963 -8556 217247 -218063 -267920 -203054 92079 31072 -130408
19052 -86580 158300 -329444 -239023 -403425 -205447 -204870 196175 149694 -132172 -41002 -146409
19041 -146409 155476 -71281 -17818 -94161 -107449 250948 97407 -314851 273530 -111927
19030 326511 107929 259218 32240 -117404 360720 274127 178652 4814 -80435 -77625 -134913
19019 -134913 -195449 -123492 33967 418226 -84932 31205 -153983 -213937 20476 35121 81308
19008 81308 31775 129672 99892 -54994 -32135 56429 -236023 118330 200678 -122919 -427479
18997 -427479 297158 94472 -133931 -11485 -145523 -245351 -2386 -60206 -200688 53003 -102998
$$ packed form
19076A19205f3141r7756K7626A13594a21116k0554E6163a2087j62558f9881B3824
19064C65021A56523G6203a31963h556B17247b18063m9857O4866I2079C1072a30408
19052h6580A58300c29444R0421j64402J97978N77A96175m6481a32172d1002j05407
19041a46409A55476g1281a7818p6343j3288B50948I7407c14851B73530a11927
19030C26511A07929J51289C2240a17404C60720q6593r5475D814h0435K810n7288
19019a34913o0536P1957C3967L84259h4932C1205a53983n9954B0476J4645M6187
19008H1308C1775R7897k9780e4994K2859E6429b36023A18330Q2348a22919l04560
18997d27479B97158I4472a33931a1485j34038r9828b386n7820j40482E3003a02998
$$ plain form
18985 149666 -340310 4798 -223441 -7468 146061 60540 40097 -212998 -12809 -248282 -21442
18973 129140 249688 154423 -60584 -220592 -345835 -173735 76366 -169828 -219451 -74385
18962 -74758 -100297 -212048 -154004 -101339 -12219 -96558 -188019 -61589 -24742 -237526 -28547
18950 -322502 142388 -9756 -118534 -122924 -431126 -68359 -274870 -1046 105053 10805 -52132
18938 -179564 -231787 177350 -11307 -147315 68818 144949 -119543 -264011 -50486 -140961 -231294
18927 -231294 263478 -100748 -56757 -127948 -217448 218564 -296498 63208 394249 29273
18916 -227530 -239136 57274 -214112 156239 65013 -127606 -41987 -59977 13190 -77873 -316921
18905 -316921 -155532 155994 -87374 104688 -250863 -498446 -165577 -84314 -126051 186660
$$ packed form
18985A49666c40310D798b23441g468A46061F0540k0443b12998a2809k35473b1442
18973A29140J20548r5265f0584j60008j25243J72100G6366a69828m9623g4385
18962g4758k5539j11751N8044N2665a2219q4339r1461f1589b4742k12784b8547
18950c22502A42388i756j08778m390l08202f8359k06511a046A05053A0805e2132
18938a79564n2223A77350a1307j36008F8818P6131a19543j44468e0486r0475r0333
18927b31294B63478a00748M3991p1191q9500B18564b96498F3208L31041B9273
18916b27530j1606E7274b14112A56239F5013a27606d1987j7990A3190g7873k39048
18905c16921a55532A55994h7374A04688b50863k47583a65577Q1263m1737A86660
$$ plain form
18894 -63337 157793 -145933 -327918 161647 15524 -78520 -12983 -31915 221855 163835 142434
18883 142434 -226885 -26436 -169041 -80558 -539782 -147550 -259374 -335307 466739 -71388
18872 -20878 -13223 -271115 309684 158732 314958 71174 -156152 -36800 42855 -4823 -110030
18861 -110030 55173 -313852 -302620 -28015 -326446 73701 -343041 -40580 43204 -158934 -147800
18850 -147800 219004 -15636 -117818 -97199 -30568 -173392 155929 259268 59857 -47110
18839 -32142 -147034 80150 -254650 -102831 -306871 19801 28987 -285501 -127741 -46096 -115836
18828 -115836 -78719 -468722 124041 -250960 -308978 -32952 -281072 194145 13888 -71924
18817 245333 137665 175960 148349 158137 181333 256570 141875 15873 138014 89254 -116285
$$ packed form
18894f3337A57793a45933j81985A61647A5524g8520a2983j8932B21855n8020k1401
18883A42434b26885b6436j42605h0558m59224a47550j11824p5933D66739g1388
18872b0878P655k57892C09684j50952J56226G1174a56152c6800D2855d823j05207
18861a10030E5173c13852J1232b8015k98431G3701c43041d0580D3204a58934J1134
18850a47800B19004a5636j02182K0619c0568j42824A55929J03339E9857d7110
18839c2142j14892H0150b54650a02831k04040A9801R186b85501a27741d6096o9740
18828a15836L7117l90003A24041b50960n8018c2952k48120A94145A3888g1924
18817B45333j07668L8295k7611R788K3196P5237j14695A5873J22141m8760a16285
$$ plain form
18805 -139639 61539 -393828 47797 78851 -129301 -132441 145846 236267 -97436 111421 -18788
18793 -127519 -298361 -26261 127289 -172153 97867 142747 107275 -577702 -194310 144119
18782 -150888 283291 -47779 -154326 -41421 -292371 18784 36871 36847 -208285 88001 -181835
18770 -128712 80479 -133111 -36946 -117906 -179805 282408 -41459 -49891 273009 -324072 -235543
18759 -235543 -9013 -128477 -263612 -195563 127655 -148612 56310 -303320 -95404 39758 265364
18748 265364 -16800 -144136 -129928 -42379 -61404 -18550 -373679 215985 -120786 179261
18737 -416438 -52121 46100 -119462 -263869 211059 -67284 -51151 -220488 380776 -21954
18726 -156735 -38743 -581171 -260867 18920 -348873 35136 34735 236725 -34674 -9599 -39384
$$ packed form
18805a39639F1539c93828D7797L1054a29301l140A45846R0421i7436A11421a8788
18793a27519j70842b6261A27289a72153I7867M4880l5472e77702a94310A44119
18782a50888B83291d7779j06547d1421k50950A8784J8087k4b08285H8001a81835
18770a28712H0479a33111c6946q0960o1899B82408d1459q432B73009c24072Q8529
18759b35543i013j19464j35135O8049A27655a48612E6310c03320i5404C9758K25606
18748B65364a6800j27336J4208d2379j9025a8550l55129B15985a20786A79261
18737d16438e2121D6100a19462j44407B11059f7284J6133j69337C80776b1954
18726a56735c8743n42428b60867A8920c48873C5136m01K01990c4674i599k9785
$$ plain form
18715 -39384 -389001 -122288 65764 59092 84285 -235350 187682 -264613 -261669 6278 -156571
18703 -109382 143500 51467 21295 72256 -168902 216183 10905 -284700 -140066 -218389
18693 -218389 -223450 -22590 324492 -176704 -103394 78434 48002 -156149 227080 29134 -95578
18681 159624 244081 78527 -132526 -76488 -239814 -130660 126157 -157805 -21669 -142604
18671 -142604 -198308 -9791 -10747 162961 -169454 -222543 71338 32397 -86022 144518 181136
18660 181136 157398 -198732 91213 -40894 -9975 75195 81581 -405800 267789 122238 36740
18648 -6600 37666 -11916 -169690 -323258 -45343 -64763 -332600 -128044 -97893 150165 -165171
18636 -610173 -397000 -415822 113807 -102 -306217 152139 220374 -32808 -26015 86127 51274
$$ packed form
18715c9384l49617a22288F5764o672K5193b35350A87682b64613K944F278a56571
18703a09382A43500E1467B1295N0961a68902B16183A0905b84700a40066p8323
18693b18389n061b2590C24492a76704P3310G8434l0432a56149B27080B9134i5578
18681A59624Q4457G8527a32526N6038j63326J09154A26157a57805b1669j20935
18671a42604n5704i791r56A62961a69454n3089G1338C2397h6022A44518L6618
18660A81136k3738a98732I1213d0894i975G5195O386d05800B67789A22238C6740
18648f600C7666a1916j57774j53568d5343j9420k67837a28044L0151A50165a65171
18636f10173K13173j8822A13807a02l06115A52139O8235c2808O793H6127l4853
$$ plain form
18625 51274 -338481 -42976 144231 11876 120474 130529 -95034 -548443 36666 -117098 -154692
18614 -154692 -143912 -66755 194474 -363314 -13759 -341309 -46452 -402256 124619 184724
18604 184724 -122878 34467 112699 -166657 3869 -173256 -128803 -84417 -156504 87412 -52769
18592 -168205 83527 -12999 -46675 -39403 157776 -82729 -158129 152970 -166946 64327 -9102
18580 -276165 83008 -57693 -346095 -7350 -173390 -216747 -154652 181790 -279591 -339859 -508001
18569 -508001 -64886 -5499 73918 -4579 81032 -59263 150586 -162222 130603 -151218 -208556
18558 -208556 -186065 -314230 -227920 -106039 -57675 95534 5425 274653 327094 -100762 -330609
18547 -330609 19533 310406 -90955 22245 167368 371839 -133383 91160 -348588 -51224
$$ packed form
18625E1274c38481d2976A44231A1876J08598J0055i5034m53409C6666a17098l7594
18614a54692J0780f6755A94474c63314a3759l27550d6452l55804A24619O0105
18604A84724a22878C4467P8232a66657C869a73256M4453M4386p2087H7412e2769
18592a68205H3527a2999l3676P272A57776h2729p5400A52970a66946F4327i102
18580b76165H3008e7693k88402g350j66040m3357O2095A81790b79591o0268j68142
18569e08001f4886e499G3918d579H1032e9263A50586a62222A30603a51218n7338
18558b08556K2491j28165Q6310a06039M8364I5534E425K69228N2441a00762k29847
18547c30609A9533K90873i0955B2245J45123K04471a33383I1160c48588e1224
$$ plain form
18536 -203111 116210 139292 330901 -351996 67859 -28694 41903 -279514 -56123 172816
18525 269003 -230906 -385080 -103665 -212817 35136 50831 -165782 70971 72806 -244020
18514 230518 -130000 -284265 69094 -29173 -519789 -257211 -51291 -340460 -294654 -50231
18503 -150780 189006 92475 -236960 87551 -59362 54199 91830 259407 -175244 -34052 -35482
18492 -35482 -146980 90442 58172 264155 -209854 23032 -47906 -325504 -199604 165534
18481 -184753 -156179 -44868 -257784 -153482 -152795 -243347 -34857 190782 51312 44857 -170130
18469 23098 -36129 -154194 39458 10979 -48518 18496 19564 287995 184978 -469997 -360353
18458 -360353 188636 -254285 -302905 -318440 167132 394429 155179 85621 -53678 -136703
$$ packed form
18536b03111A16210K3082J91609c51996F7859b8694D1903b79514e6123A72816
18525B69003b30906j54174a03665j09152C5136J5695a65782G0971J835b44020
18514B30518a30000j54265F9094b9173m90616b57211e1291k89169M5806e0231
18503a50780A89006I2475b36960H7551e9362E4199L7631J67577a75244c4052j430
18492c5482j11498I0442l2270K05983b09854B3032d7906k77598J25900A65534
18481a84753K8574d4868k12916J04302O87r0552c4857A90782E1312o455a70130
18469B3098c6129j18065C9458A0979d8518A8496J068K68431j03017d69997J09644
18458c60353A88636b54285m8620j5535A67132K27297A55179o9558e3678q3025
$$ plain form
18448 -136703 -284533 167353 -488818 147824 -100265 176657 79835 -53482 75975 -84120
18437 -476079 -17019 149062 75809 -138512 -413920 -247167 85191 164185 -160129 64943
18426 8250 -464505 153721 204272 -291655 -216389 90820 -217102 -154846 -250852 -73498 56099
18414 95251 -78824 40434 -86850 -82282 184914 133489 329916 -54283 376932 -226670 -325573
18403 -325573 42662 59856 25749 142044 -236342 -33303 70041 -132383 -164362 198839 -177882
18391 87711 -14969 145664 -300530 -206484 -186631 -195204 -310237 17117 14121 -262498 -93141
18379 194847 128382 -31255 55232 97993 -253464 331200 1335 213195 -75879 273901 -210717
18367 221618 134132 -17234 84933 37299 24123 -78827 -169639 -147877 -107450 -272477 119576
$$ packed form
18448a36703j47830A67353d88818A47824a00265A76657G9835e3482G5975h4120
18437d76079a7019A49062p3253a38512k75408J66753H5191P8994a60129F4943
18426H250d64505A53721N0551b91655P5266I0820b17102O2256r6006g3498E6099
18414I5251g8824D0434h6850M568A84914n1425J96427e4283C76932b26670r8903
18403c25573D2662J7194B5749J16295b36342c3303G0041a32383l1979A98839a77882
18391H7711a4969A45664c00530R4046J9853q573j15033A7117k996b62498i3141
18379A94847o6465c1255E5232M2761b53464C31200A335K11860g5879B73901b10717
18367B21618q7486a7234H4933C7299j3176g8827r0812K1762M0427j65027A19576
$$ plain form
18355 471894 19575 -88643 20603 -150923 90927 -34319 178087 33373 -154615 -209838 66723
18343 -212088 294289 202616 -40127 -285609 7902 -47840 11058 -150675 -370181 87608 258209
18332 258209 76062 108467 -2162 -48719 221158 -324728 -356947 -177000 -486 -71998 77540
18320 79517 -36250 -316042 -20603 45554 -269250 138702 -395576 -34928 -163816 20912 -5505
18308 -97534 -229055 145928 123863 -52049 -264280 -69920 7906 -208566 15943 88704 -118236
18296 -299480 170972 118544 -146896 144309 -293480 -236335 236225 -26435 -274909 -74350
18285 42583 -104998 60771 164160 61407 -211370 -127469 90258 -157243 5087 185868 -193929
18273 -90868 -85850 38134 -200133 -48019 -40834 175324 -41396 -250045 -108453 145315 -132401
$$ packed form
18355D71894A9575h8643B0603a50923I0927c4319A78087C3373a54615n5223F6723
18343b12088B94289r1673d0127k45482G902d7840A1058a50675k19506H7608J70601
18332B58209G6062L2405b162m6557B21158c24728l2219a77000d86p1512G7540
18320G9517c6250k79792b0603D5554b69250A38702c95576c4928j28888B0912e505
18308i7534j31521A45928k2065e2049k12231f9920G906b08566A5943P2761a18236
18296b99480A70972n2428a46896A44309b93480N7145B36225b6435k48474g4350
18285D2583a04998F0771J03389F1407b11370Q3901I0258a57243E087J80781a93929
18273i0868N018C8134b00133d8019P185A75324d1396k08649a08453A45315a32401
$$ plain form
18261 -92829 122301 75057 -361652 52880 -116840 179599 -155101 -188625 15400 -251618
18250 43348 -35752 200873 53060 -168529 149146 -169087 110989 -258925 -16821 -86581
18240 -86581 -14411 282338 -181052 -88104 12584 -59925 -175492 -243503 153962 70874 9020
18228 234757 -173120 12562 26664 -89814 -44882 25934 -96132 -38623 166811 168252 -200879
18216 -132224 -666281 -241795 -162429 45732 -47478 230367 -243801 150876 -426794 107549
18205 435291 -70581 100461 93819 -279559 404530 -146814 -246133 -177857 78175 -117295 -42860
18193 -176632 -196693 -93986 -102008 -10250 -122753 2946 -102763 -40587 204435 124746 -395974
18181 -283287 -16186 -129876 -186672 -177588 110791 -41636 65176 -59930 -255024 -107033 124231
$$ packed form
18261i2829A22301m7244c61652E2880a16840A79599a55101l3524A5400b51618
18250D3348c5752B00873E3060a68529A49146a69087A10989b58925a6821o9760
18240h6581a4411B82338a81052h8104A2584e9925j15567o8011A53962G0874I020
18228B34757a73120A2562J4102h9814d4882B5934i6132c8623A66811J441b00879
18216a32224n34057b41795P9366D5732d7478B30367b43801A50876d26794A07549
18205D35291g0581A00461o642b79559D04530a46814r9319O8276G8175a17295d2860
18193a76632k0061i3986q022a0250j12503B946a02763d0587B04435p9689c95974
18181b83287a6186j13690n6796R084A10791d1636F5176e9930j95094a07033A24231
$$ plain form
18169 5183 -9153 -44971 -203288 117953 27370 43892 -121726 80729 -242037 -420915 -140821
18157 89981 -21046 -177443 44227 701 -15168 -334417 -32831 124819 80921 -94196 -220105
18146 -220105 -383212 193043 135489 -95173 -17437 153490 -112278 83760 79703 113535 60865
18135 60865 8887 -1539 175069 -124167 -198360 -78009 253393 -98037 -224945 1839 -382109
18123 85534 -469651 -221121 111109 155645 68934 -446625 147594 75250 -180225 335406
18112 -87599 -118535 99039 309456 -123891 -200217 88030 75601 -287222 -127099 92955 134891
18101 134891 -333212 58100 253107 125441 -27624 -101952 -94915 -221154 -114370 -88158 -48062
18090 -48062 17002 26 -401300 35303 -76342 -365006 -12508 130520 25130 214181 46348
$$ packed form
18169E183i153l5818j58317A17953B7370J6522a21726H0729b42037j78878a40821
18157H9981b1046j56397D4227G01a5168l19249c2831A24819m3898i4196j25909
18146b20105j63107A93043n7554i5173a7437A53490a12278H3760m057L3832n2670
18135F0865H887a539A75069a24167p4193g8009B53393i8037j26908A839c82109
18123H5534d69651b21121A11109M4536F8934d46625A47594p2344a80225C35406
18112h7599l0936I9039K10417a23891p6326H8030j2429b87222a27099I2955M1936
18101A34891c33212E8100J95007A25441b7624p4328P037j26239J06784K6212M0096
18090d8062A7002B6d01300C5303g6342k88664a2508A30520B5130J89051D6348
$$ plain form
18078 -89592 -61665 -13285 -96817 -211365 21386 -444190 -201734 -50877 -276012 -80640 -43074
18067 -43074 155973 -219248 -38122 -61319 55711 -62546 102152 -170783 -7984 227572 218141
18056 218141 -327161 -221830 20584 -273023 104071 -130308 343007 93535 -16895 156405
18045 -14018 -72960 -150760 138239 -58954 -103698 -170424 209502 -318766 3024 104304 -314249
18033 -208794 37895 370632 -141512 -219210 -244660 -140856 90672 -55195 13298 174396 67181
18021 11568 30302 -12570 -17991 -24478 -112401 231844 -51234 4763 11241 -42513 -82243 237005
18008 -94583 51593 -2716 170282 200352 -265738 87775 -254279 510497 133071 -221892 112299
17996 255749 235711 -65242 -270468 -13537 -155946 -202404 16144 -323650 49713 30591 57261
$$ packed form
18078h9592K7927a3285q3532j14548B1386d44190b01734e0877k25135h0640L7566
18067d3074A55973b19248c8122k3197E5711f2546A02152a70783g984B27572r431
18056B18141c27161J05331B0584b73023A04071a30308C43007I3535a6895A56405
18045a4018n8942p7800A38239e8954m4744o6726B09502c18766C024J01280c14249
18033b08794C7895L32737a41512p7698k5450J03804I0672e5195A3298J61098F7181
18021A1568J8734a2570n421o487q7923B31844e1234D763O478d2513l9730B37005
18008i4583E1593b716A70282L0070b65738H7775b54279E10497A33071b21892A12299
17996B55749k0038f5242k05226a3537j42409m6458A6144c23650D9713j9122K6670
$$ plain form
17985 57261 -216620 62994 -173223 -95286 252864 26323 37975 -231422 -153269 230845 -118521
17973 84675 -98649 158044 -86717 59995 -199669 17907 4068 -140409 97855 83387 -111575
17961 -303710 -59624 242955 259850 272330 192262 -191075 225053 -157330 298403 -177483
17950 -132841 -12198 493 111238 -39224 -208000 -220138 -25848 74851 -136871 -311730 -72053
17938 100719 -168286 10347 -36483 25114 333624 -244158 -46724 -88108 -331823 163912
17927 -50500 -66255 72777 534 -383770 129169 33440 -168148 212923 -99188 -113741 136758
17915 -144260 -187505 56425 197138 12671 105671 -16497 29545 135347 -371304 -25216 263887
17903 -199546 319630 4947 184590 225934 -380641 99117 46297 -337742 165753 64698 52560
$$ packed form
17985E7261b16620F2994a73223P7937B52864B6323J1652b31422P8153B30845a18521
17973H4675i8649A58044h6717E9995a99669A7907D068a40409I7855j4468a11575
17961c03710e9624B42955J6895J2480q0068a91075B25053a57330B98403a77483
17950a32841a2198D93J10745c9224j68776j2138b5848G4851a36871j74859g2053
17938A00719a68286A0347c6483B5114L08510b44158d6724m1384k43715A63912
17927e0500j5755G2777E34c83770A29169C3440a68148B12923i9188j4553A36758
17915a44260m3245E6425J40713A2671R3000a6497B9545J05802c71304b5216B63887
17903a99546C19630D947J79643M1344c80641I9117D6297c37742A65753F4698j2138
$$ plain form
17892 52560 -107422 -7755 120090 -15453 -261355 110825 231833 -101182 -467352 35182
17881 -2364 183374 -51864 244261 -220910 -69722 -65040 130412 111366 -133163 228643 -29085
17869 -42749 -184476 -254470 -271392 347255 101547 51915 -1101 -166248 -345353 -113036 -67808
17858 -67808 218529 240839 -56520 -147251 -50149 65999 54446 -121971 293804 -45463 -285012
17847 -285012 -201659 249573 327932 307991 -92500 -151160 193463 315321 -216934 51340 184642
17836 184642 82784 80281 150833 -71939 -211775 154533 -39606 -321200 48212 -138496 -103804
17825 -103804 56537 -124849 14350 47404 217381 -288276 9533 47264 70952 -132156 -145762
17814 -145762 359815 130327 144146 -71482 170449 -11261 338779 -419457 -24148 118648
$$ packed form
17892E2560a07422g755A20090a5453k45902A10825J21008a01182l66170C5182
17881b364A83374e1864B44261b20910f9722M682A30412j9046a33163B28643b9085
17869d2749j41727o9994j6922C47255A01547m9632a101j65147j79105a13036M5228
17858f7808B18529K2310e6520r0731e0149F5999j1553a21971B93804d5463k39549
17847b85012Q3353B49573P8359j9941i2500n8660A93463J21858b16934E1340J33302
17836A84642H2784k503P0552g1939j39836A54533c9606k81594D8212a38496L4692
17825a03804E6537a24849A4350L3054J69977b88276I533L7731K3688a32156j3606
17814a45762C59815A30327J3819g1482A70449a1261C38779d19457b4148A18648
$$ plain form
17803 264095 203967 135112 -118361 -20393 23890 -65220 141538 -128790 -127178 234189 341615
17792 341615 142636 21127 37672 11775 188790 -341963 -9392 -86448 -55829 -137177 79530
17780 13306 -117670 -166413 -41713 91158 -240797 46033 -281151 -55165 -162408 -177505 -98223
17769 -98223 11356 1318 226792 231056 -272806 -80938 17333 18564 342398 -28557 -42969 -174271
17757 -174271 -192218 -18450 23501 403823 276963 -311751 -301509 169654 102223 123628 -185896
17745 69166 202204 73053 274843 28136 -156396 68639 150184 404693 -152023 217113
17734 279478 27434 -10989 -72208 89865 -104852 -114791 191474 692396 -23746 -143328 61153
17722 58523 -98803 21773 -352286 136937 280453 -198782 -246054 72416 -187597 344592
$$ packed form
17803B64095o0128o8855a18361b0393B3890f5220A41538a28790J612B34189J07426
17792C41615A42636B1127J6545A1775J77015c41963i392p7056L0619q1348G9530
17780A3306a17670m8743d1713I1158b40797D6033b81151e5165j07243j5097P9282
17769i8223A1356A318K25474M264b72806h0938A7333J231L23834b8557j4412j31302
17757a74271j7947a8450B3501L80322j26860c11751J0242A69654o7431K1405a85896
17745F9166J33038G3053K01790B8136a56396F8639Q1545K54509a52023B17113
17734B79478B7434a0989o1219H9865a04852r939A91474N00922b3746j19582F1153
17722E8523i8803B1773c52286A36937J43516a98782m7272G2416a87597C44592
$$ plain form
17711 143649 53213 51853 -55497 -110824 -145994 -14100 327353 -61035 15439 21264 -42569 107587
17698 183181 108624 -323052 35894 -447667 -48526 -80994 63354 -290110 105448 -12406 123006
17686 180838 129676 20549 133454 89875 -77600 336116 4726 180213 221237 102331 200160
17675 200160 94730 -36640 179254 99555 -142971 247356 286228 -223753 117481 -259151
17664 -115376 110505 288026 20945 -71217 107310 142014 -55907 -23910 -309403 210172
17653 121191 273497 -424310 -112515 449813 69462 -3781 152153 -131691 325365 -49888
17642 -85722 -86674 -366893 -93119 139382 -250715 -17723 -5363 44005 -223489 275563 -71101
17630 -42456 468498 -49570 -184300 44308 115332 -143977 79146 3959 134831 19288 8216
$$ packed form
17711A43649E3213j360e5497n5327l5170a4100C27353f1035A5439N825d2569A07587
17698A83181p4557c23052C5894d47667d8526l2468F3354b90110A05448a2406A23006
17686A80838n1162B0549J12905m3579g7600C36116D726J75487M1024A02331R7829
17675B00160I4730c6640A79254p9699a42971B47356L8872b23753A17481b59151
17664a15376A10505J77521B0945g1217A07310L4704e5907b3910k85493B10172
17653A21191J52306d24310a12515D49813F9462c781A52153a31691C25365d9888
17642h5722r52k80219i3119A39382b50715a7723e363D4005b23489B75563g1101
17630d2456D68498d9570j34730D4308P1024a43977G9146C959J30872A9288H216
$$ plain form
17618 104020 -7017 82730 -245345 -45363 -31908 138141 26187 231558 76125 65553 35126
17607 35126 105849 294275 104408 93064 -17830 113293 276929 -157180 -61570 64905 147332
17596 147332 189004 307005 -37548 364042 121327 23152 208738 374620 165756 -224488
17585 165771 128972 98472 79218 189556 262717 -151223 224485 170623 -81588 209470 -70684
17573 40987 -187777 204045 -284397 -51057 231861 85803 -82732 127763 371614 22513
17562 -78504 339252 20024 240310 -120062 94015 -7618 166450 -81113 141077 152869 -3679
17550 15592 -190978 -8786 -54054 -93405 -256978 75368 53173 69645 159033 35613 -145990
17538 627757 89402 100571 85730 87124 231356 250145 -90363 -64722 -102539 17128 43162
$$ packed form
17618A04020g017H2730b45345d5363J3455A38141B6187K05371G6125j0572l0427
17607C5126P0723J88426A04408j1344a7830A13293J63636a57180f1570F4905Q2427
17596A47332M1672J18001c7548C64042A21327B3152J85586J65882A65756b24488
17585A65771l6799l0500j9254J10338P3161a51223B24485n3862h1588B09470g0684
17573D0987a87777B04045b84397e1057B31861H5803h2732A27763K43851B2513
17562g8504C39252B0024K20286a20062I4015g618A66450h1113A41077J1792c679
17550A5592a90978h786m5268l9351j63573G5368k2195J6472Q9388C5613a45990
17538F27757H9402J1169j4841J394J44232J8789i0363K5641l7817A7128K6034
$$ plain form
17527 43162 130938 18256 272269 202270 -258662 304041 -80096 -94219 -69732 183851 -136900
17515 -147500 -101144 232179 32529 252434 -43268 213026 195326 -87807 -30919 -59298 324805
17503 213719 265165 22825 359970 -27979 -134126 62294 -120304 335486 129237 168599
17493 168599 219418 107671 401490 171634 227781 -46544 18120 -94401 275980 110188
17482 188354 275321 -252324 -245572 287706 -144403 176814 363101 212850 466836 590250
17472 590250 166436 -23014 251915 368929 -58040 195951 37693 -96603 215829 -39015
17461 44759 -264775 234301 -202657 293100 35142 343443 340921 -134812 517882 465783
17451 465783 451701 175084 178820 481131 20915 220578 309994 35330 113400 298917 -24914
$$ packed form
17527D3162Q7776A8256K54013o9999b58662C04041h0096j4123K4487A83851a36900
17515a47500M6356B32179C2529K19905d3268B13026j7700h7807c0919k8379C24805
17503B13719N1446B2825L37145b7979j06147F2294a20304C35486A29237L9362
17493A68599N0819A07671K93819A71634N6147d6544A8120i4401B75980A10188
17482A88354Q6967b52324O752B87706a44403A76814J86287j50251K53986J23414
17472E90250A66436b3014B51915J17014e8040A95951C7693i6603B15829c9015
17461D4759b64775B34301b02657B93100C5142L08301k522a34812E17882n2099
17451D65783j4082A75084L736L02311B0915J99663Q9416C5330P8070J85517b4914
$$ plain form
17439 277 444723 111222 280558 69422 264288 215096 121071 207648 406664 327579 586880
17428 586880 107729 223661 174723 250590 -256493 161756 216358 252675 407375 173141
17417 284594 87236 397904 170966 9994 129553 -75870 125573 -9773 231291 243653 224323
17406 224323 189547 278927 8579 77026 -104405 286683 135025 -78812 205512 100966 45863
17394 142667 142599 -176453 408644 218800 288881 346966 378540 215392 174871 135289 42424
17382 20929 158468 97373 294823 154067 194327 -7263 181011 53012 320830 284021 52353
17370 721 5683 549013 300016 -100157 -108161 231052 27434 207203 -5405 -141099 69196
17358 240126 -29708 579 50827 165516 288124 465835 -172879 25055 19699 362514 267979
$$ packed form
17439B77M44446A11222J69336F9422J94866m9192r4025Q6577J99016p9085K59301
17428E86880A07729J15932m8938P5867b56493A61756N4602L6317J54700A73141
17417B84594H7236L10668A70966I994J19559g5870A25573i773B31291J2362j9330
17406B24323l4776Q9380H579O8447a04405B86683A35025g8812B05512A00966D5863
17394A42667o8a76453D08644j89844P0081N8085L1574j63148m0521l9582D2424
17382B0929J37539o1095J97450j40756M0260g263A81011E3012K67818l6809E2353
17370G21M962N43330k48997a00157q004B31052B7434J79769e405j35694F9196
17358B40126b9708E79N0248J14689J22608J77711a72879B5055n356L42815r4535
$$ plain form
17347 267979 30157 -21131 151053 -78778 253732 396361 98886 375930 359093 87012 -226914
17335 -115920 203817 184213 64632 326460 -57126 54500 -104479 102645 169862 289549
17325 289549 126455 -42216 327687 329657 -19305 -29870 -133173 159582 113989 370303 28226
17313 -83736 103501 210086 145682 150033 197714 170614 326665 112052 234392 -46616 -1695
17301 126086 183882 328094 -37590 329098 -101440 77595 74362 323610 460311 170687
17290 23474 -43033 404404 138244 56355 -56349 89317 -78372 35418 65911 -36074 -209589
17279 -209589 164654 -128317 201800 -11358 -73689 121538 -237956 59641 205832 122755
17269 122755 149657 300476 209810 322587 276287 101215 511917 125596 239940 341355
$$ packed form
17347B67979C0157b1131A51053g8778B53732J42629I8886K77044j6837H7012b26914
17335a15920B03817j9604F4632K61828e7126E4500a04479A02645O7217J19687
17325B89549A26455d2216C27687J970a9305j0565j03303A59582m5593K56314B8226
17313h3736A03501J06585o4404M351M7681k7100J56051A12052J22340d6616a695
17301A26086N7796J44212c7590C29098a01440G7595l233K49248J36701A70687
17290B3474d3033D04404A38244E6355e6349H9317g8372C5418L0493c6074j73515
17279b09589A64654a28317B01800a1358o2331A21538b37956E9641J46191q3077
17269A22755K6902J50819r0666J12777m6300A01215M10702A25596J14344J01415
$$ plain form
17259 341355 290653 134983 107108 -47628 477258 329892 58476 335805 27132 74000 705707
17248 705707 413620 257577 516075 380870 242222 549363 4784 98245 275527 468228
17238 468228 112956 110242 78502 461842 82071 172286 249754 117320 274633 461408 178583
17226 319244 319570 319075 334865 597868 12083 189931 145128 -165829 227015 247260 201172
17215 201172 217884 130676 187828 -16055 40843 34022 252064 195789 97785 376987 178947
17203 296378 138434 498020 343097 371802 367762 315523 -93323 289399 291102 177842 428510
17192 428510 295891 13340 17767 190028 158573 335060 251604 157105 309377 574431 200746
17180 152672 80021 -427 487742 246648 275479 343929 270252 99850 359041 -67311 316174
$$ packed form
17259C41355n0702A34983k7875d7628D77258j47366E8476K77329B7132M6868O31707
17248G05707k92087j56043K58498j35205j38648L07141D784R3461J77282J92701
17238D68228A12956k714l1740L83340H2071R0215P7468A17320J57313J86775A78583
17226C19244L26m95J5790K63003A2083J77848m4803a65829B27015K0245m6088
17215B01172J6712q7208N7152a6055D0843o821K18042n6275I7785K79202A78947
17203B96378A38434L59586j54923K8705m040n2239i3323B89399J703j13260K50668
17192D28510j32619A3340M427J72261l1455J76487q3456r4499J52272K65054B00746
17180A52672p2651d27D87742k41094K8831O8450p3677I9850K59191f7311C16174
$$ plain form
17168 329900 369455 450332 93554 437819 388454 214750 -8096 96373 402299 227490 466112
17157 466112 124850 -103431 261991 311142 208237 -84705 436681 396586 562252 303434
17147 303434 638377 269228 342172 90562 102383 275234 338570 570404 320901 253362
17137 253362 467735 617915 427424 19757 413569 332352 397598 334944 655037 331823
17127 331823 445733 279546 69268 391746 188921 89496 446897 127562 194722 270105
17117 270105 541629 289790 381444 695412 214985 -30899 220092 297169 408848 631534
17107 631534 426211 283689 375125 424028 241600 379715 477171 261084 169322 167915 274346
17096 274346 745014 672896 197102 614272 585628 584336 372083 295617 437509 484957 362605
$$ packed form
17168C29900L9555Q0877I3554L44265m9365j73704h096I6373L05926j74809K38622
17157D66112A24850a03431B61991M9151j02905h4705D36681m0095J65666k58818
17147C03434L34943B69228P2944I0562J1821J72851O3336K31834k49503o7539
17137B53362K14373J50180j90491A9757L93812q1217O5246o2654L20093l23214
17127C31823J13910j66187F9268L22478A88921H9496L57401A27562O7160P5383
17117B70105K71524k51839R1654L13968B14985c0899B20092P7077J11679K22686
17107F31534k05323j42522R1436M8903j82428J38115R7456k16087r1762j407J06431
17096B74346M70668p2118A97102M17170k8644j292k12253p6466J41892M7448j22352
$$ plain form
17085 362605 237030 373768 628681 385129 765954 766562 215870 369899 542614 793066
17075 793066 551121 429870 383460 464658 771755 500360 549745 602637 476392 622201
17065 622201 476109 651436 398286 489653 312337 573562 307653 12317 473805 706092
17055 706092 428023 248314 649427 510513 597443 676762 726838 606285 678802 468110
17045 468110 652999 465546 450920 435518 665433 694226 744469 528947 386461 760771
17035 760771 214800 636286 652601 338934 589974 750829 933993 210515 326886 387484
17025 387484 416532 967394 578414 980069 607748 740550 883468 452096 280983 744515
17015 744515 712134 920202 662144 642321 578107 894061 320834 606092 765128 695554
$$ packed form
17085C62605j25575J36738K54913k43552L80825O08B15870J54029J72715K50452
17075G93066k41945j21251m6410Q1198L07097k71395M9385N2892j26245J45809
17065F22201j46092J75327k53150R1367j77316K61225k65909A2317M61488K32287
17055G06092k78069j79709M01113j38914Q6930P9319N0076j20553P2517k10692
17045D68110J84889j87453j4626j5402K29915K8793N0243k15522j42486L74310
17035G60771B14800M21486J6315l13667K51040J60855J83164B10515J16371O0598
17025C87484K9048N50862l88980M01655l72321J32802J42918m31372j71113M63532
17015G44515l2381K08068k58058j9823o4214L15954C20834K85258J59036o9574
$$ plain form
17005 695554 798719 1106995 654414 528231 795224 704436 583429 412991 706828 990991
16995 990991 991430 411545 912194 784771 838782 843842 1035465 801019 1034978 917595 673317
16984 673317 891486 780806 848648 1104956 1054479 809094 970966 941128 896140 759540
16974 759540 887023 1043864 949128 1103330 888901 1128272 902556 953151 860478 1009881
16964 1009881 846253 847797 979773 1045934 1378822 1349414 920515 766422 986124 1071848
16954 1071848 1154276 1097211 1231833 1154211 1329341 1286111 838518 1219621 1166399 1118846
16944 1118846 1295576 1430600 1141289 1236252 1223574 1222511 1401073 1053850 1453079 1071456
16934 1071456 1316783 1341075 1449806 1512235 1013170 1554679 1318939 1296442 1318712 1450691
$$ packed form
17005F95554J03165L08276m52581j26183K66993r0788j21007j70438K93837K84163
16995I90991M39D11545N00649j27423N4011N060J91623k34446K33959j17383k44278
16984F73317K18169j10680O7842K56308n0477k45385J61872k9838m4988j36600
16974G59540J27483J56841r4736J54202k14429K39371k25716N0595r2673J49403
16964A009881j63628J544J31976O6161L32888k9408m28899j54093K19702Q5724
16954A071848Q2428n7065J34622p7622J75130m3230m47593L81103n3222m7553
16944A118846J76730J35024k89311R4963j2678j063J78562l47223L99229l81623
16934A071456K45327K4292J08731O2429m99065N41509k35740k2497K2270J31979
$$ plain form
16924 1450691 1728106 1700557 1539850 1851434 1773701 1819160 1466125 1439931 1586290 1512500
16914 1512500 1616422 1433510 1912500 1668044 1806545 1594179 1522883 2051860 1822479 1713499
16904 1713499 1694646 2042536 2008033 1924781 2060646 2231953 2105257 2024154 1854894 2174772
16894 2174772 2243855 1862614 2355639 2437188 2346633 2080952 2201819 2041709 2559919 2307450
16884 2307450 2240096 2316970 2206635 2412545 2407434 2649652 2546536 2748389 2491625 2605851
16874 2605851 2904742 2713034 2505847 2583314 2587677 3083555 2861533 3142277 3416398 3046947
16864 3046947 2925426 3137454 3137090 3403721 3115067 3565508 3469086 3459607 3581266 3452024
16854 3452024 3329343 3922715 3811748 3589507 3688947 4293222 3490303 3695775 4118792 4395036
$$ packed form
16924A450691K77415k7549j60707L11584p7733M5459l53035k6194J46359p3790
16914A512500J03922j82912M78990k44456J38501k12366p1296N28977k29381j08980
16904A713499j8853L47890l4503q3252J35865J71307j26696q1103j69260L19878
16894B174772O9083l81241M93025Q1549r0555k65681J20867j60110N18210k52469
16884B307450o7354P6874j10335K05910n111K42218j03116K01853k56764J14226
16874B605851K98891j91708k07187P7467M363M95878k22022K80744K74121l69451
16864C046947j21521K12028l64K66631k88654M50441r6422r479J21659j29242
16854C452024j22681N93372j10967k22241R9440O04275q02919K05472M23017K76244
$$ plain form
16844 4395036 4034000 4098763 4286629 4140398 4230946 4486917 4640921 4810348 4633664 4658203
16834 4658203 4989272 5132145 5119596 4971736 5121883 5008242 5436573 5647693 5391113 5734268
16824 5734268 5597214 5634144 5816029 6047125 6293608 6132619 6045789 6506361 6605678 6798285
16814 6798285 6917211 6758446 7271476 7036453 7530738 7502220 7567594 7669154 7914990 8233194
16804 8233194 8335989 8459381 8665058 8533651 8627557 9391970 9127501 9884477 9364732 9737266
16794 9737266 10337902 10538531 10656626 10989659 11163248 11380450 11783850 11893028 11959688 12567303
16784 12567303 12919106 13054942 13501384 14011506 14320376 14895305 15299283 15577337 15976787
16775 15976787 16931935 16840520 17147192 18208723 18514843 18593845 19642446 20132345 21024321
$$ packed form
16844D395036l61036O4763J87866j46231R0548K55971J54004J69427j76684K4539
16834D658203L31069J42873j2549j47860J50147j13641M28331K11120k56580L43155
16824E734268j37054L6930J81885K31096K46483j60989q6830M60572R9317J92607
16814F798285J18926j58765N13030k35023M94285k8518O5374J01560K45836L18204
16804H233194J02795J23392K05677j31407R3906P64413k64469P56976n19745L72534
16794I737266O00636K00629J18095L33033J73589K17202M03400J09178O6660O07615
16784A2567303L51803J35836M46442N10122L08870N74929M03978K78054L99450
16775A5976787R55148r1415L06672J061531L06120P9002J048601M89899Q91976
$$ plain form
16766 21024321 21812407 21970359 22906854 23918136 24791195 25182638 26704658 27285967 28432637
16757 28432637 29573229 30336226 32260484 33182378 34568416 35926612 37850323 39273167
16749 39273167 41060773 42874150 44755449 46862306 49350027 51808000 53849088 56883735
16741 56883735 59825617 63256614 66217808 70092388 74202474 77942912 82751985 86980010
16733 86980010 92273776 97880383 103753489 109071166 115920228 122724110 129197722 136757169
16725 136757169 143901799 150851791 158637175 165467093 172245520 178030587 183152497 187657382
16717 187657382 191119454 192781790 193852995 193190438 191155501 188271981 184234458 179390639
16709 179390639 173609164 166755636 159801667 152768544 145251675 137712732 130309735 123112400
$$ packed form
16766B1024321P88086J57952R36495J011282Q73059L91443J522020N81309J146670
16757B8432637J140592P62997J924258R21894J386038J358196J923711J422844
16749C9273167J787606J813377J881299K106857K487721K457973K041088L034647
16741E6883735K941882L430997K961194L874580M110086L740438M809073M228025
16733H6980010N293766N606607N873106N317677O849062O803882O473612P559447
16725A36757169P144630O949992P785384O829918O778427N785067N121910M504885
16717A87657382L462072J662336J071205o62557k034937k883520m037523m843819
16709A79390639n781475o853528o953969p033123p516869p538943p402997p197335
$$ plain form
16701 123112400 115940826 109538474 102927794 96804235 91461558 86277858 81081665 76441271
16693 76441271 72215056 67913071 64322221 60663779 57373283 54608605 51631681 49272718
16685 49272718 46670794 44486044 42221614 40275047 38417033 36754282 34980433 33347937
16677 33347937 32002796 30890075 29240524 28233200 26682568 26145490 24688295 23746538
16669 23746538 23284817 22114110 21425618 20499671 19935601 19236276 18506450 17784300 17106573
16660 17106573 16622100 16157719 15765007 15525327 14747605 14391301 13890496 13404578 13201089
16651 13201089 12912314 12326811 11751792 11709486 11580715 10630819 10831667 10162518 10443265
16642 10443265 9605262 9732387 9534571 9091874 9269246 8395981 8217605 8223692 8114274 7983704
$$ packed form
16701A23112400p171574o402352o610680o123559n342677n183700n196193m640394
16693G6441271m226215m301985l590850l658442l290496k764678k976924k358963
16685D9272718k601924k184750k264430j946567j858014j662751j773849j632496
16677C3347937j345141j112721j649551j007324j550632n37078j457195r41757
16669B3746538m61721j170707o88492r25947n64070o99325p29826p22150o77727
16660A7106573m84473m64381l92712k39680p77722l56304n00805m85918k03489
16651A3201089k88775n85503n75019m2306j28771r49896K00848o69149K80747
16642A0443265q38003J27125j97816m42697J77372q73265j78376O087j09418j30570
$$ plain form
16632 7983704 8012203 7562267 7272810 6909150 6914410 6792706 6872220 6304684 6169168 6470768
16622 6470768 6174609 6008800 5755421 5772530 5630715 5554128 5573923 5290682 4914493 4805743
16612 4805743 5030475 4670174 4816469 4537845 4820828 4631494 4634806 4259999 4538337 4146810
16602 4146810 4007660 4041275 4025665 3864164 3784040 3808624 3691966 3834331 3840767 3227014
16592 3227014 3523447 3605499 3550466 3356410 3244664 3049110 2984735 3248757 3168796 2826262
16582 2826262 2921415 2955549 2867502 2691948 2655730 2794618 2960012 2782955 2876990 2577412
16572 2577412 2476938 2462968 2511073 2492659 2553763 2722653 2246492 2510567 2479170 2363545
16562 2363545 2356089 2280010 2121641 2116154 2320923 2003258 2185871 1973568 1823474 2037082
$$ packed form
16632G983704K8499m49936k89457l63660N260j21704P9514n67536j35516L01600
16622F470768k96159j65809k53379J7109j41815p6587J9795k83241l76189j08750
16612D805743K24732l60301J46295k78624K82983j89334L312l74807K78338l91527
16602D146810j39150L3615j5610j61501q0124K4584j16658J42365O436o13753
16592C227014K96433Q2052n5033j94056j11746j95554o4375K64022p9961l42534
16582B826262R5153L4134q8047j75554l6218J38888J65394j77057R4035k99578
16572B577412j00474j3970M8105j8414O1104J68890m76161K64075l1397j15625
16562B363545p456p6079j58369n487K04769l17665J82613k12303j50094K13608
$$ plain form
16552 2037082 1930363 1716541 1880535 1565878 1775117 1724018 1771345 1783708 1591521 1754124
16542 1754124 2107702 1624870 1657777 1491122 1724543 1438183 1761199 1711531 1619318 1583458
16532 1583458 1519553 1717095 1514846 1733517 1342908 1534828 1357345 1525769 1400452 1479409
16522 1479409 1387532 1667581 1172215 1278890 1172690 1146127 1155722 1480437 1357791 1283420
16512 1283420 1229984 956590 1148751 1067273 769011 1021077 1330694 1078187 1185452 791843
16502 791843 1037007 925599 843031 1026022 1109427 1049854 1060377 1077052 1303578 835304
16492 835304 940538 1150794 1092535 1027830 856576 1079724 1096182 1109388 1059378 1283293
16482 1283293 1017104 993084 452576 950222 911829 796043 808560 904276 1061629 910407
$$ packed form
16552B037082j06719k13822J63994l14657K09239n1099M7327J2363j92187J62603
16542A754124L53578m82832L2907j66655K33421k86360L23016m9668r2213l5860
16532A583458o3905J97542k02249K18671l90609J91920j77483J68424j25317P8957
16522A479409r1877K80049m95366J06675j06200k6563R595L24715j22646p4371
16512A283420n3436k73394J92161q1478k98262K52066L09617k52507J07265l93609
16502G91843K45164j11408q2568J82991Q3405n9573J0523J6675K26526m68274
16492H35304J05234K10256n8259o4705j71254K23148J6458J3206n0010K23915
16482A283293k66189k4020D52576M97646l8393j15786J2517R5716J57353j51222
$$ plain form
16472 910407 1152429 971496 782980 1035729 694303 822466 708225 436130 798421 587718
16462 587718 592812 1111451 972267 541256 503957 895076 940480 446234 622514 510583
16452 510583 680502 510950 606649 798811 306248 519446 689519 825532 459876 822219
16442 822219 559463 496126 628103 575166 251530 807460 420128 468966 513118 642114
16432 642114 568564 684659 351789 574137 665061 660531 501043 720734 623039 953541
16422 953541 443178 713848 374550 554544 603015 515533 304837 260843 629883 787220
16412 787220 770563 715840 672518 697534 564774 303595 497880 593576 303438 485603
16402 485603 267524 371422 280143 594349 492597 464084 248624 -37653 115311 363195
$$ packed form
16472I10407K42022j80933j88516K52749l41426J28163j14241k72095L62291k10703
16462E87718N094N18639j39184m31011l7299L91119M5404D46234J76280j11931
16452E10583J69919j69552R5699J92162C06248K13198J70073J36013l65656L62343
16442H22219k62756o3337J31977n2937B51530N55930l87332M8838M4152J28996
16432F42114p3550J16095l32870K22348R0924m530j59488K19691r7695L30502
16422I53541D43178K70670l39298J79994M8471q7482k10696m3994L69040J57337
16412G87220j6657n4723m3322K5016j32760k61179J94285R5696k90138J82165
16402D85603k18079J03898r1279L14206j01752k8513k15460c7653A15311K47884
$$ plain form
16392 363195 199087 23800 164471 335669 472390 558060 558287 578127 437631 503422 69411
16380 387127 56638 138753 482849 276619 62325 625693 54566 200061 255929 559224
16370 559224 316089 542192 300682 343901 346484 396206 303540 705928 543038 446773 322658
16359 322658 346666 552614 92656 219636 681947 270620 444366 413986 -78805 156582
16348 402064 564012 355144 405210 264234 387932 382233 149861 -135801 244034 111180
16337 223602 125405 277913 541882 423352 260644 111120 441554 161970 401865 320887
16327 320887 481241 145403 397137 421240 471983 402871 73665 746706 117355 -145558
16316 -84715 137532 640384 340557 329836 413306 159682 230768 318939 123288 230214
$$ packed form
16392C63195j64108B3800J40671J71198J36721Q5670K27J9840j40496O5791F9411
16380C87127E6638Q2115L44096k06230F2325N63368E4566J45495N5868L03295
16370E59224k43135K26103k41510M3219K583M9722r2666M02388j62890r6265j24115
16359C22658K4008K05948I2656J26980M62311B70620J73746l0380g8805A56582
16348D02064J61948k08868N0066j40976J23698n699A49861a35801B44034A11180
16337B23602r8197J52508K63969j18530j62708A11120L30434A61970K39895q0978
16327C20887J60354A45403K51734K4103N0743o9112G3665O73041A17355a45558
16316h4715A37532N02852k99827j0721Q3470A59682P1086Q8171A23288J06926
$$ plain form
16306 230214 324261 -35816 90435 411451 456771 380479 -124720 -55843 631 319668 354297
16295 354297 -82565 259481 55460 -20472 158120 144652 138494 33334 106087 -111703 76498
16283 125158 361921 325286 207542 92811 215733 349275 216926 182868 190606 264805 116551
16271 250710 219809 69697 251385 442668 45188 342192 161828 399585 55622 -264958
16260 222049 -190647 163593 1522 11240 55504 -66965 238935 146173 57085 -2117 -9505 88469
16247 20383 14578 -57388 181310 11634 115723 185167 125444 -244046 -48614 32146 -36785
16235 -100366 -93368 126865 -166561 323788 331762 -93204 116343 -211744 24230 333351 164363
16223 311741 342416 -409188 5341 230246 360413 385407 219203 304221 57241 217805 -156675
$$ packed form
16306B30214R4047c5816I0435L21016M5320p6292a24720e5843F31L19037L4629
16295C54297h2565B59481E5460b0472A58120j3468o158C3334P2753a11703G6498
16283A25158K36763l6635j17744I2811J22922J33542j32349l4058P738P4199A16551
16271B50710l0901F9697J81688J91283D5188K97004A61828K37757E5622b64958
16260B22049a90647A63593A522R718M4264f6965B38935r2762E7085b117p388H8469
16247B0383n805e7388A81310A1634J04089O9444n9723b44046d8614C2146c6785
16235a00366O998A26865a66561C23788P974i3204A16343b11744B4230L09121A64363
16223C11741L0675d09188E341K24905J30167K4994j66204Q5018E7241J60564a56675
$$ plain form
16211 -115718 91010 271447 147448 226021 262514 220665 312320 220713 -379253 92491 -12533
16199 -101694 -6774 8251 -161763 234109 104728 73780 71274 126718 258010 140566 332770
16188 332770 -235739 57038 39593 87482 134110 -84754 302567 -78289 -116363 22347 78044
16177 78044 -183054 -19331 -127019 351544 341906 -205962 31895 118513 334129 -16656 302131
16165 248742 180001 45056 79084 79855 -269635 -116514 59334 13990 -217529 234119 224929
16154 224929 20749 388418 116333 220659 118307 463321 -377771 -141448 24862 -71898
16143 -139891 181912 19624 -79587 130234 226754 100950 169533 -254429 -60262 456595
16132 -153450 127817 -187219 -15543 113231 -7651 84228 86613 -132251 -154134 87261 37296
$$ packed form
16211a15718I1010J80437j23999P8573L6493m1849R1655r1607c79253I2491a2533
16199a01694f774H251a61763B34109A04728l0948k506N5444J31292j17444J92204
16188C32770b35739E7038j7445M7889M6628h4754C02567g8289l8074B2347N5697
16177G8044a83054a9331j07688C51544r638b05962C1895Q6618K15616a6656C02131
16165B48742o8741D5056L4028P71b69635a16514E9334A3990b17529B34119r190
16154B24929B0749L67669A16333J04326j02352L45014c77771a41448B4862g1898
16143a39891A81912A9624g9587A30234R6520A00950O8583b54429f0262D56595
16132a53450A27817a87219a5543A13231g651H4228K385a32251k1883H7261C7296
$$ plain form
16120 -13614 105281 -117761 168004 -238847 -17847 238978 357256 261608 -253236 130654
16109 271112 77556 -145351 130180 -111058 147237 -3974 319598 227682 163593 -84567 101606
16097 114367 432200 -61955 -167526 -65223 350816 -144351 -67830 -136632 -363917 -153922
16086 -208671 62041 -145070 256527 -152140 137529 -35000 -102520 49695 -404085 93689
16075 365988 -108880 -235576 145179 -319519 208150 -237648 173626 3109 12075 277092
16065 277092 31224 -213818 58195 69461 15916 -109622 -99802 -137193 414554 -82718 -135037
16054 -135037 121149 -89760 -102536 39536 34725 -12002 -271346 -406437 243682 -139059 238870
16042 313770 42636 201269 175266 25097 -303886 -288011 241095 -472880 -138540 -184305
$$ packed form
16120a3614A05281a17761A68004b38847a7847B38978J18278r5648b53236A30654
16109B71112G7556a45351A30180a11058A47237c974C19598r1916o4089h4567A01606
16097A14367L17833f1955j05571f5223C50816a44351f7830o8802k27285a53922
16086b08671F2041a45070B56527a52140A37529c5000o7520D9695d04085I3689
16075C65988a08880j26696A45179c19519B08150b37648A73626C109Q966K65017
16065B77092C1224b13818E8195J1266A5916a09622R820l7391D14554h2718n2319
16054a35037A21149h9760j2776C9536m811a2002k59344j35091B43682a39059B38870
16042C13770D2636J58633k6003B5097c03886J5875B41095d72880a38540m5765
$$ plain form
16032 -184305 -112358 -13292 -123433 -123999 31735 15711 -112637 192447 -83817 -371650 154705
16020 353044 -40375 99941 -363457 121825 45279 -115324 218981 80809 -29743 95210 209117
16009 209117 -168487 -106473 41697 1451 61543 145254 -264549 -165875 25771 -71271 -161710
15998 -161710 -212389 129150 -383892 -71531 -210668 197037 -48086 96264 -190198 -273757
15988 -273757 23744 -110740 238661 -122468 192148 247967 400572 -38515 260311 17048
15977 101805 288064 -255737 315256 -239448 -407797 341377 111394 246270 -131022 -92087
15967 -92087 -23272 -115867 -345014 -88767 21290 158453 -4715 -30064 8511 -21363 5418 91762
15955 91762 -72458 68837 -63905 210531 -145480 -367880 12162 41750 4742 88245 60249
$$ packed form
16032a84305P1947a3292j10141n66C1735A5711a12637A92447h3817k87833A54705
16020C53044d0375I9941c63457A21825D5279a15324B18981H0809b9743I5210J13907
16009B09117a68487O2014D1697A451O0092Q3711b64549R8674B5771g1271r0439
15998a61710n0679A29150c83892g1531j39137A97037d8086I6264a90198q3559
15988b73757B3744a10740B38661a22468A92148N5819J52605c8515B60311A7048
15977A01805J86259b55737C15256b39448j68349C41377A11394J34876a31022L8935
15967i2087b3272r2595k29147h8767B1290J37163d715k5349H511b1363E418Q6344
15955I1762g2458F8837f3905B10531a45480k22400A2162K9588D742Q3503k7996
$$ plain form
15944 60249 45858 -37053 44351 -194652 44508 -52045 -61418 -66311 81104 332963 317522 263624
15932 263624 -50903 -248705 -169538 -49953 -331998 313725 22772 -43526 -191335 240041
15921 435043 139672 188695 217512 277915 -168944 -51848 -351070 -249188 -216026 -109585
15911 -109585 -268635 -5124 -60516 -95090 -127539 -99349 73555 -141379 -7062 202981 38303
15899 213125 50093 -82302 113317 -119838 -269988 133517 238534 -6897 -42952 92527 177664
15888 177664 -205946 -139050 -43653 213121 -302134 50018 306613 39189 101697 75629 -394274
15876 146278 53022 -430609 76835 -55885 -65516 -14557 54761 -168062 -290887 81122 -45852
15864 88148 -129026 82050 195275 163769 -45034 99904 23393 -229537 35375 288775 26785
$$ packed form
15944F0249j4391c7053D4351a94652D4508e2045r373m893H1104K51859j5441n3898
15932B63624e0903j97802P9167d9953k82045C13725B2772d3526j47809B40041
15921D35043A39672M9023K8817O0403a68944e1848k99222J01882L3162J06441
15911a09585j59050e124n5392l4574l2449K8190G3555a41379g062B02981C8303
15899B13125E0093h2302A13317a19838j50150A33517J05017f897l6055I2527Q5137
15888A77664b05946O6896d3653B13121c02134E0018K56595C9189O2508k6068c94274
15876A46278E3022d30609G6835e5885r631a4557E4761a68062j22825H1122d5852
15864H8148a29026H2050J13225l1506d5034I9904B3393b29537C5375K53400B6785
$$ plain form
15852 142449 -10326 -260692 -7485 36191 -98065 342036 281294 294665 -21225 -233928 -184485
15841 -184485 185002 -139541 -274693 116599 -193902 -56345 170660 178823 38512 -102162
15830 -523691 -282497 -101999 252510 -160246 -199422 -498415 126558 -352812 1504 -202811
15819 -41901 125304 -218443 163347 31431 -155711 -38728 100037 -70277 -197062 -246685
15809 -246685 102113 185509 -23597 -148133 -200112 42005 127796 229100 -264221 -13303 -360687
15798 -360687 -371686 -371518 -98350 31883 -265296 31309 109600 145548 -168358 24589 -312590
15786 -179326 28136 -211931 -305604 -294643 -94767 135967 -420022 306210 -232680 101743
15775 112921 -110999 -57507 -80951 -106370 -371029 13585 -119939 -203943 180410 -61203 43056
$$ packed form
15852A42449a0326k50366g485C6191i8065C42036o0742J3371b1225k12703M9443
15841a84485A85002a39541j35152A16599a93902e6345A70660Q163C8512a02162
15830e23691K41194a01999B52510a60246l9176k98993A26558c52812A504b02811
15819d1901A25304b18443A63347C1431a55711c8728A00037g0277j26785m9623
15809b46685A02113Q3396b3597j24536n1979D2005Q5791J01304b64221a3303l47384
15798c60687j0999J68i8350C1883b65296C1309P8291L5948a68358B4589c12590
15786a79326B8136b11931r3673J0961i4767A35967d20022C06210b32680A01743
15775A12921a10999N3492k3444k5419k64659A3585a19939q4004A80410f1203D3056
$$ plain form
15763 -24316 66928 84195 101754 -8788 -258223 29418 -7469 -37175 89287 124021 177364 200669
15751 200669 -11934 106868 154357 40314 -24519 83167 63716 -235287 -38980 188784 246212
15740 246212 -252045 -125424 -108427 47361 -277901 -200624 -174912 266190 -200619 69249
15729 -215780 -75633 -30681 -32188 76034 27548 132712 193673 -186147 -62977 101819 -135289
15717 326420 -44142 49016 -95941 -205636 -274833 48954 216884 -161668 -182178 -16156 -214260
15706 -214260 43197 -30195 -123504 -36641 74292 15194 -223392 -353361 63063 -16313 67524
15694 57562 98820 -186524 -122628 -472235 174512 -151562 4347 68730 283679 -150993 -10775
15682 -56462 97995 -144137 -69086 388104 -253321 202944 -94250 -262692 64692 78823 202675
$$ packed form
15763b4316F6928J7267J7559h788k49435B9418g469k9706H9287L4734N3343K3305
15751B00669a1934A06868M7489D0314b4519H3167j9451b35287c8980A88784N7428
15740B46212b52045a25424J6997D7361b77901P7277K5712B66190b00619F9249
15729b15780g5633c0681j507G6034B7548J05164O0961a86147f2977A01819a35289
15717C26420d4142D9016i5941j09695o9197D8954J67930a61668k0510a6156j98104
15706b14260D3197c0195r3309c6641G4292A5194b23392j29969F3063a6313F7524
15694E7562M1258a86524O3896l49607A74512a51562D347O4383K14949a50993a0775
15682e6462I7995a44137f9086C88104b53321B02944i4250j68442F4692J4131J23852
$$ plain form
15671 202675 27150 -282950 -84743 112468 -2462 228433 -9256 -248087 -193209 -239843 -29127
15659 21380 101176 -198450 328274 -83839 -85660 -193744 -149627 -22340 -136907 -65170 13979
15647 184644 -69449 102418 173508 162519 -105260 -209255 46364 55516 -155915 -109601 -244789
15636 -244789 166009 57029 -152978 224744 275232 23128 162906 -117469 86811 335300
15626 335300 41117 -201935 297150 -165940 -617408 -139599 -208317 218255 -22206 8600
15615 -24297 211193 -167776 33512 -162827 143381 358934 80577 -147176 53566 -186037
15604 20516 20029 82112 213246 295405 246932 -280129 -56421 -214521 293669 232337 143745
15593 143745 -44473 -102871 98780 148828 -69744 -110497 -195987 -179245 101181 224357 52161
$$ packed form
15671B02675B7150b82950h4743A12468b462B28433i256k38831N4878m6634b9127
15659B1380P9796a98450C28274h3839j821j08084M4117b2340j14567f5170A3979
15647A84644f9449A02418P1090j0989a05260j03995D6364R152a55915M6314j35188
15636b44789A66009E7029a52978B24744N0488B3128J39778a17469H6811K48489
15626C35300D1117b01935B97150a65940m51468a39599o8718B18255b2206H600
15615b4297B11193a67776C3512a62827A43381K15553H0577a47176E3566a86037
15604B0516m87O2083J31134Q2159m8473b80129e6421j58100B93669o1332q8592
15593A43745d4473n8398I8780N0048f9744m0753q5490J6742A01181J23176E2161
$$ plain form
15581 -182630 -121150 -39270 -170828 58306 219122 -43206 58802 538914 114364 358453
15571 358453 -285675 99068 -181558 -79038 -369893 -207725 113137 -89663 205566 173443
15561 173443 253246 18633 -14231 30844 55880 82818 185394 -155130 -207547 128788 -260769
15549 125520 -235785 -93593 -297814 212033 78805 194028 -96280 11292 -150347 85309
15538 -57347 202239 -94640 152734 -293378 -110697 -31983 -341244 48588 -227064 -143277
15528 -143277 125188 -171383 -7575 -210475 107405 94265 -130947 -212042 -78982 94858 17247
15516 -17822 70323 -39574 -167521 -368097 -109832 180274 -2298 -52546 -28816 -58609 201971
15504 137503 -123051 184144 139776 -67854 -113707 -43346 -241674 39608 413774 311264
$$ packed form
15581a82630O1480c9270j31558E8306J60816d3206E8802M80112A14364K44089
15571C58453b85675I9068a81558g9038k90855J62168A13137h9663B05566l2123
15561A73443P9803A8633a4231C0844K5036K6938J02576a55130n2417A28788b60769
15549A25520b35785i3593k04221B12033G8805J15223i6280A1292a50347H5309
15538e7347B02239i4640A52734b93378a10697c1983l09261D8588b27064Q3787
15528a43277A25188a71383g575k02900A07405j3140a30947q1095g8982I4858A7247
15516a7822G0323c9574j27947k00576a09832A80274b298n0248K3730k9793B01971
15504A37503a23051A84144m4368f7854m5853d3346j98328C9608L74166j02510
$$ plain form
15494 311264 -141720 59251 30892 -9980 51668 88922 271533 -188727 87131 115198 2852
15482 14327 30139 55985 -167806 -164647 -238723 -204663 -400460 -137905 2110 -199736 94960
15470 -43024 -188191 54366 -33814 -31406 -560755 -95481 125528 4647 -372482 205838 106185
15459 106185 137793 -94115 -119257 41392 -148222 141156 93448 -101671 94925 -25056 -110239
15448 -110239 -97870 -292448 -31481 -54194 -4709 -68727 28635 -61657 96596 -131944 102986
15436 124014 148098 -23130 184299 75783 -213487 364847 -199646 19743 -26369 291738
15425 -230056 -296389 -70330 -4051 -62743 34815 -70205 178622 155730 -367736 -19996 272102
15413 100316 32143 -162742 11283 -17475 223026 164565 -33314 -86099 35314 -14410 -97860
$$ packed form
15494C11264a41720E9251k8359i980E1668L7254J82611a88727H7131K8067B852
15482A4327J5812K5846a67806L159p4076L4060j95797a37905B110a99736I4960
15470d3024j45167E4366c3814K408n29349i5481A25528D647c72482B05838r9653
15459A06185L1608i4115k5142D1392a48222A41156m7708a01671I4925b5056q5183
15448a10239J2369j94578c1481k2713d709o4018B8635f1657I6596a31944A02986
15436A24014K4084b3130A84299G5783b13487C64847a99646A9743b6369B91738
15425b30056o6333g0330d051n8692C4815g0205A78622k2892c67736a9996B72102
15413A00316C2143a62742A1283a7475B23026n8461c3314n2785C5314a4410q3450
$$ plain form
15402 -97860 -161242 -110117 -327028 -181578 -192452 -266151 -121191 18420 -168285 -94497 -302154
15391 -302154 183435 -131887 169018 206327 -98046 74983 -58956 114893 -230074 216684
15380 301865 -197413 241430 265635 -185449 -186861 -95014 66155 -81146 44637 -331627 -141792
15368 -86035 -60399 -114176 38351 -34233 94311 -92417 112654 3745 -44274 -75226 -132016 -38898
15355 102512 -183004 54223 -18085 254866 263421 -43001 244103 -76944 -272379 37134 5539
15343 -159974 -212546 -137838 113476 466018 139951 -126626 -516713 -225905 -160562 -151967
15333 -151967 -164552 13624 16509 -138372 -247574 213739 -32068 -54104 200026 -167940 96235
15321 -86090 91113 127735 59171 -20380 -169536 -40401 61368 121443 189132 3968 -177078
$$ packed form
15402i7860o3382N1125k16911J45450j0874p3699a21191A8420a68285P3788k07657
15391c02154A83435a31887A69018L7309i8046G4983e8956A14893b30074B16684
15380C01865a97413B41430K4205a85449j412R1847F6155h1146D4637c31627a41792
15368h6035K5636n3777C8351c4233I4311i2417A12654C745d4274l0952n6790c8898
15355A02512a83004E4223a8085B54866Q555d3001B44103g6944j95435C7134E539
15343a59974n2572P4708A13476L52542A39951a26626l90087b25905O5343Q595
15333a51967j2585A3624K885a38372j09202B13739c2068k2036B00026a67940I6235
15321h6090I1113L6622E9171b0380j49156d0401F1368O0075O7689C968a77078
$$ plain form
15309 118343 58957 194892 162114 -70341 78662 41567 -47417 197307 84675 183536 -25367
15297 15864 -79544 2842 -69933 309174 17209 -27284 69127 165455 36752 -71394 -210027
15286 -210027 38408 259089 128507 -185885 149807 79989 148057 172288 53122 -195705
15275 98746 199855 58676 108550 -950 19973 259747 -81717 232602 304987 127811 120527
15264 120527 194427 174236 316141 -34967 -2317 -10733 286192 140191 335295 197100 268788
15253 268788 210586 303222 458443 567664 820043 1052749 1105796 1247041 1023984 471122
15242 196723 55542 143549 -148064 142756 175147 219881 -30904 280149 271985 -56117 193955
15230 111675 75980 182273 -28743 -152868 336433 -66754 175941 83378 374912 30597
$$ packed form
15309A18343E8957J35935l2778g0341G8662l7095d7417A97307H4675R8861b5367
15297A5864g9544B842f9933C09174A7209b7284F9127R6328C6752g1394j38633
15286b10027C8408K20681A28507a85885A49807o9818O8068K4231E3122a95705
15275I8746J01109E8676M9874i50A9973K39774h1717B32602P2385A27811p284
15264A20527P3900k0191J41905c4967b317q416B86192A40191J95104j38195P1688
15253B68788n8202R2636J55221J09221K52379K32706N3047J41245k23057D71122
15242A96723E5542Q8007a48064A42756L2391M4734c0904B80149q164e6117A93955
15230A11675l5695J06293b8743j24125C36433f6754A75941H3378K91534C0597
$$ plain form
15219 250364 99305 -37161 127600 -242074 293951 44397 194263 56138 238908 -12536
15208 -19081 184296 257727 101481 269765 85264 242824 167061 -252473 38300 175957
15198 175957 395052 55943 29993 118006 -50855 365909 339693 -14201 13105 -159373 36308
15186 -35068 309399 106431 142652 -7047 -209815 220066 149850 202573 -160279 367084 327944
15175 327944 -90863 1428 -185566 208705 -41853 142052 383829 177957 182013 145927 83002
15164 83002 -76247 80884 -2879 -68676 298809 -44950 -24059 109972 273538 -330655 250499
15152 -11570 302956 142218 122342 -9793 72867 99967 -238283 -227104 180944 59856 216814
15141 216814 137139 -17314 43961 146459 246828 -100765 147672 202602 21933 2624 -222537
$$ packed form
15219B50364I9305c7161A27600b42074B93951D4397J49866E6138J82770a2536
15208a9081A84296P3431A01481J68284H5264J57560p5763b52473C8300J37657
15198A75957K19095E5943k5950Q8013e0855C65909k6216a4201A3105a59373C6308
15186c5068C09399A06431L6221g047k02768B20066p0216N2723a60279C67084l9140
15175C27944i0863A428a85566B08705d1853A42052K41777A77957M056l6086o2925
15164H3002g6247H0884b879o5797B98809d4950K0891A09972J63566c30655B50499
15152a1570C02956A42218j9876i793G2867K7100b38283J1179A80944E9856J56958
15141B16814p9675a7314D3961J02498J00369a00765A47672N4930B1933B624b22537
$$ plain form
15129 440574 105253 -35791 352471 -14883 176318 210004 172213 361595 200478 167418
15119 167418 205232 146663 368148 387192 131945 175736 132431 238831 -66245 24567 212192
15108 212192 -151648 -222614 364610 -57667 432370 154295 127419 94905 376972 198692
15098 198692 228479 -189736 112594 -68173 130053 18664 -59204 -125971 373662 246134
15088 246134 401026 156306 -159805 131960 370411 -26586 -227727 185074 -272327 283559
15077 -29291 -167470 46405 -40744 110778 117752 37071 120277 114699 237780 -155170 270638
15065 -272719 -57158 150660 -93345 276344 51209 -130278 289045 171301 32104 41668 534652
15054 534652 -249584 -1773 -18872 100657 -169395 118090 351864 107044 338744 21957
$$ packed form
15129D40574A05253c5791C52471a4883A76318L3686l7791J89382j61117l3060
15119A67418L7814n8569K21485J9044A31945M3791m3305J06400f6245B4567J87625
15108B12192a51648p0966C64610e7667D32370A54295k6876l2514K82067j78280
15098A98692K9787a89736A12594f8173A30053A8664e9204o6767C73662j27528
15088B46134J54892A56306a59805A31960K38451b6586k01141A85074b72327B83559
15077b9291j38179D6405d0744A10778O974C7071Q3206n578J23081a55170B70638
15065b72719e7158A50660i3345B76344E1209a30278B89045j17744C2104R564M92984
15054E34652b49584a773j7099A00657a69395A18090K33774A07044K31700B1957
$$ plain form
15043 43950 237331 -2153 138722 111060 35418 873277 175140 103134 338113 18228 375931
15032 375931 170190 23120 25856 275498 44272 159145 -92492 66951 356787 -91834 114574
15020 331801 293443 489137 471138 74380 -6933 45068 535582 409358 123920 158517 -114732
15008 389299 71871 273926 387499 159747 147067 268240 211724 472109 430799 -25309
14997 321169 54495 52403 -170049 -49266 94308 384669 233844 76416 339811 -33891 468358
14985 108943 131141 267327 320387 342208 250048 138333 208663 117878 -275484 213974 210775
14974 210775 -79649 138428 339672 -166769 159096 297636 313410 174652 182015 178299 141705
14963 141705 201337 147143 170250 371014 78842 157784 -132766 276835 109964 383745
$$ packed form
15043D3950J93381b153A38722k7662C5418Q37859A75140p2006K34979A8228L57703
15032C75931A70190B3120K736K49642D4272J14873i2492F6951K89836i1834A14574
15020C31801l8358J95694j7999G4380f933D5068M90514j26224A23920L4597a14732
15008C89299G1871K02055J13573A59747j2680J21173n6516K60385m1310b5309
14997C21169E4495k092a70049d9266I4308K90361j50825G6416K63395c3891D68358
14985A08943K2198J36186N3060K1821r2160j11715P0330r0785b75484B13974l199
14974B10775g9649A38428K01244a66769A59096J38540J5774j38758P363l716l6594
14963A41705N9632n4194K3107K00764G8842P8942a32766B76835A09964K73781
$$ plain form
14953 383745 599961 208887 114653 428343 172333 413309 238544 113812 149349 378609
14943 378609 55968 499690 433571 276202 249195 80128 180160 -4068 560143 609492 307735
14932 307735 129104 323295 166368 395658 219407 370094 418092 120243 491094 512168
14922 512168 158363 621478 398438 336281 398990 166719 334551 606771 209812 172972
14912 172972 422078 620364 452700 328555 239179 31346 254199 548043 226517 225983
14902 225983 274265 292819 233919 184446 490744 363547 265864 221388 513668 466785 381352
14891 381352 254494 260172 522527 417950 297310 348347 285713 514446 226955 282697
14881 282697 96005 237244 219831 197336 373043 341926 130812 334216 359496 296992 334407
$$ packed form
14953C83745K16216B08887r4234L13690A72333K40976j74765A13812L5537K29260
14943C78609E5968M43722o6119j57369k7007H0128J00032d068E60143M9349l01757
14932C07735A29104J94191j56927K29290j76251J50687M7998A20243L70851K1074
14922E12168A58363M63115k23040o2157O2709A66719J67832K72220B09812l6840
14912A72972K49106J98286j67664j24145q9376C1346K22853K93844B26517n34
14902B25983M8282J8554n8900m9473L06298j27197r7683m4476K92280m6883q5433
14891C81352j26858N678K62355j04577j20640N1037o2634K28733B26955N5742
14881B82697I6005J41239j7413k2495J75707l1117A30812K03404K5280o2504L7415
$$ plain form
14870 334407 191690 672780 393231 621998 563629 67896 868847 431899 154998 217778
14860 217778 576621 887394 354619 354046 301396 357900 607899 623495 394432 287132 665174
14849 665174 618438 329074 218801 710236 693511 264304 638405 379545 458009 497194
14839 497194 314747 690950 350734 789822 301707 95419 507677 260441 245283 518345
14829 518345 353649 489270 371848 597497 759688 850420 516963 664839 791078 367905
14818 278688 451550 355342 465273 682110 672912 166347 721078 807478 417130 1071021
14808 1071021 474959 598350 416220 179977 505036 726354 933855 260295 552873
14799 552873 652672 432077 474660 685825 666914 421807 525909 736940 946394 421982
$$ packed form
14870C34407j42717M81090k79549K28767n8369F7896Q00951D31899A54998O2780
14860B17778L58843L10773C54619n73n2650N6504K49999J5596k29063j07300L78042
14849F65174m6736k89364j10273M91435j6725B64304L74101k58860P8464L9185
14839D97194j82447L76203l40216M39088C01707I5419M12258k47236j5158K73062
14829E18345j64696J35621j17422K25649J62191R0732l33457J47876J26239C67905
14818B78688J72862r6208J09931K16837r198A66347N54731Q6400l90348O53891
14808A071021D74959J23391j82130A79977L25059K21318K07501B60295K92578
14799E52873R9799k20595M2583K11165j8911k45107J04102K11031K09454D21982
$$ plain form
14788 641748 472464 687838 484749 646390 266030 778580 771862 594049 550879 853601
14778 853601 668682 677015 673107 764473 586053 650545 755899 599476 324222 753137 635263
14767 635263 489939 336113 353884 823827 785151 675239 536228 694147 590879 715411
14757 715411 752083 848261 870550 540160 536270 754221 701781 779543 756506 1039311 670110
14746 670110 491602 776021 852498 636938 919598 650972 1026945 812735 919580 741934
14736 741934 880989 1275709 916302 816027 807988 796531 631555 668350 779273 1008791
14726 1008791 1227267 1019693 744440 1079876 589888 991846 933705 859101 730798 749042
14716 749042 751239 652985 904025 893101 850065 914093 655020 913103 737115 893248 776215
$$ packed form
14788F41748j69284K15374k03089J61641B66030N12550o718j77813m3170L02722
14778H53601j84919Q333l908R1366j78420O4492J05354j56423k75254M28915j17874
14767F35263j45324j53826J7771M69943l8676j09912j39011J57919j03268J24532
14757G15411L6672R6178K2289l30390l890K17951n2440P7762k3037K82805l69201
14746F70110j78508K84419P6477k15560K82660k68626L75973k14210J06845j77646
14736G41934J39055L94720l59407j00275q039j1457j64976L6795J10923K29518
14726A008791K18476k07574k75253L35436m89988M01958n8141p4604j28303J8244
14716G49042K197r8254K51040j0924m3036O4028k59073K58083j75988J56133j17033
$$ plain form
14705 776215 1020642 804924 669547 835157 745078 1166342 895376 1032211 934507 1145094
14695 1145094 1079339 866917 1136357 865722 1298381 1003398 938538 781716 1150149 976148
14685 976148 955329 947213 843218 1325154 1349142 1198216 1301162 749478 1119293 1137611
14675 1137611 1221842 951076 1123836 1046694 948055 1036425 1242064 1236557 922724 1434382
14665 1434382 1337508 1331383 1271394 1254746 1269845 1432196 1240085 1105638 1075290 1087041 1316010
14654 1316010 1158764 1268094 1250985 1157174 1278271 1174616 877362 1307766 1287427 1463982
14644 1463982 1560545 1430581 1090266 1556282 1468615 1253358 1557467 1474125 1395009 1606170
14634 1606170 1415464 1546414 1758616 1753384 1426199 1618094 1730752 1574862 1661164 1545933
$$ packed form
14705G76215K44427k15718j35377J65610r0079M21264k70966J36835r7704K10587
14695A145094o5755k12422K69440k70635M32659k94983o4860j56822L68433j74001
14685I76148k0819q116j03995M81936K3988j50926J02946n51684L69815J8318
14675A137611Q4231k70766J72760p7142r8639Q8370K05639n507l13833N11658
14665A434382r6874o125n9989j6648J5099J62351j92111j34447l0348J1751K28969
14654A316010j57246J09330j7109r3811J21097j03655k97254M30404k0339J76555
14644A463982R6563j29964l40315M66016q7667k15257L04109q3342p9116K11161
14634A606170j90706J30950K12202n232l27185J91895J12658j55890Q6302j15231
$$ plain form
14624 1545933 1545946 1341628 1514267 1484924 1167590 1512216 1708480 1135308 1454999 1557035
14614 1557035 1550396 1538623 1902295 1801927 1734812 2098672 1671351 1578293 1755689 1838997
14604 1838997 1832695 1778057 1348539 1779062 1776738 2058920 1706175 2124831 2035208 1943322 1757083
14593 1757083 1971426 1989255 2016486 1962358 2053982 2317911 2037317 2179513 2236811 2206079
14583 2206079 2266790 2305099 2256300 2185635 2299586 2384529 2455898 2416367 2545802 2656082 2366280
14572 2366280 2753647 2400967 2543314 2826740 2742096 2643846 2731599 2940238 2978869 2914705
14562 2914705 2861757 2909856 3060632 3243073 3417679 3554514 3695811 3938451 3865312 4566860
14552 4566860 4559510 5880107 6869720 9356850 13726748 20369344 29681150 30442607 19834879
$$ packed form
14624A545933J3k04318J72639k9343l17334L44626J96264n73172L19691J02036
14614A557035o639j1773L63672j00368o7115L63860m27321r3058J77396Q3308
14604A838997o302n4638m29518M30523k324K82182l52745M18656q9623r1886j86239
14593A757083K14343J7829K7231n4128R1624K63929k80594J42196N7298l0732
14583B206079O0711L8309m8799p0665J13951Q4943P1369l9531J29435J10280k89802
14572B366280L87367l52680J42347K83426q4644r8250Q7753K08639L8631o4164
14562B914705n2948M8099J50776J82441J74606J36835J41297K42640p3139P01548
14552D566860p350J320597R89613K487130M369898O642596R311806P61457j0607728
$$ plain form
14543 19834879 12920781 8823613 5843359 4115446 3816753 3176439 2830879 2924687 2987342
14534 2987342 2726076 2558532 2688300 2468277 2697862 2289869 2632203 2721226 2600025 2902630
14524 2902630 2669262 2828638 3265914 2993931 2908498 2896898 3380375 2944013 3243887 3217176
14514 3217176 3048537 3158639 3596964 3097367 3576955 3582600 3181887 3199987 3191255 3467468
14504 3467468 3713972 3803009 3590145 3981284 3415253 3983122 3749229 3641611 3934196 3722584
14494 3722584 4299984 4180280 3840286 3774819 4149244 4113369 4225236 4439663 4167289 4382487
14484 4382487 4492680 4681965 4321329 4606105 4753438 4653342 4365491 4517608 4710571
14475 4710571 4898568 5195925 4534897 5032947 5127742 5240621 5202045 4943212 5598555 5572328
$$ packed form
14543A9834879o914098m097168k980254j727913k98693o40314l45560R3808O2655
14534B987342k61266j67544J29768k20023K29585m07993L42334Q9023j21201L02605
14524B902630k33368J59376M37276k71983q5433j1600M83477m36362K99874k6711
14514C217176j68639J10102M38325m99597M79588N645m00713J8100q732K76213
14504C467468K46504Q9037k12864L91139n66031N67869k33893j07618K92585k11612
14494C722584N77400j19704l39994o5467L74425l5875J11867K14427k72374K15198
14484D382487J10193J89285l60636K84776J47333j00096k87851J52117J92963
14475D710571J87997K97357o61028M98050R4795J12879l8576k58833O55343k6227
$$ plain form
14465 5572328 5402053 5490216 5696323 5622242 5589153 5816815 5959939 5770821 6115720 5924074
14455 5924074 6057168 5957346 6295093 6432777 6399536 6507691 6387840 6762783 6475760 6613001
14445 6613001 6886504 6976701 7185006 7305615 7553693 7513493 7761191 7457101 7916249 8000100
14435 8000100 8202337 8126114 8385331 8142949 8427178 8314478 8623700 8740630 9081455 9162539
14425 9162539 9060768 9256594 9399066 9234387 10006218 9648357 10066560 9964341 10333979
14416 10333979 10380141 10377091 10624140 10947514 11101015 11504165 11388380 11491071 11839854 12069417
14406 12069417 12275755 12634123 12736731 12891237 13485293 13531609 13232720 14091503 14217018
14397 14217018 14281403 14553780 14667012 14951839 15222122 15635601 15264068 15819520 15843316 16431193
$$ packed form
14465E572328j70275Q8163K06107p4081l3089K27662J43124j89118L44899j91646
14455E924074J33094r9822L37747J37684l3241J08155j19851L74943k87023J37241
14445F613001K73503R0197K08305J20609K48078m0200K47698l04090M59148Q3851
14435H000100K02237p6223K59217k42382K84229j12700L09222J16930L40825Q1084
14425I162539j01771J95826J42472j64679P71831l57861M18203j02219L69638
14416A0333979M6162l050K47049L23374J53501M03150j15785J02691L48783K29563
14406A2069417K06338L58368J02608J54506N94056M6316k98889Q58783J25515
14397A4217018O4385K72377J13232K84827K70283M13479l71533N55452K3796N87877
$$ plain form
14387 16431193 16249959 16579590 16704422 17214371 17652982 17655213 18131873 18269350 18530784 19130931
14377 19130931 19215062 19621183 20109481 20461778 20736679 21408581 21683750 21660268 22315074 22684516
14367 22684516 23013112 23520098 24018680 24514647 24915649 25603470 25895287 26457075 26911807
14358 26911807 27434420 28303212 28749212 29105507 29669267 30747342 31390308 31921861 32445264
14349 32445264 33603159 33951384 34853946 36020841 36335915 37286905 38158301 39194331 39447330
14340 39447330 40980384 42034254 42796836 44372619 45368822 46551004 47704460 49375045
14332 49375045 50435263 51904545 53384696 54922346 56346502 58145755 59702188 61524511
14324 61524511 63392645 65284164 67154293 69560797 71795765 74152268 76315109 79594142
$$ packed form
14387A6431193j81234L29631J24832N09949M38611K231M76660J37477K61434O00147
14377A9130931Q4131M06121M88298L52297K74901O71902K75169k3482O54806L69442
14367B2684516L28596N06986M98582M95967M01002O87821K91817N61788M54732
14358B6911807N22613Q68792M46000L56295N63760J078075O42966N31553N23403
14349C2445264J157895L48225R02562J166895L15074R50990Q71396J036030K52999
14340C9447330J533054J053870P62582J575783R96203J182182J153456J670585
14332D9375045J060218J469282J480151J537650J424156J799253J556433J822323
14324F1524511J868134J891519J870129K406504K234968K356503K162841L279033
$$ plain form
14316 79594142 81751466 84529366 88063917 90566215 94201599 97181310 101200311 104862660
14308 104862660 109040990 113365887 117772779 122159258 127709013 132915560 138339115 144342827
14300 144342827 150772329 157339253 164306636 171552467 179148177 187372505 195723612 205205373
14292 205205373 214694940 225287932 235904144 247112919 258889160 271420318 284480108
14285 284480108 298274626 312371850 326456753 341294813 355940818 370706885 385542739
14278 385542739 400261746 414268185 427273008 439147164 448402852 453987842 456233044
14271 456233044 457429030 458930709 455513523 448679256 442219012 436908336 431871742 424021977
14263 424021977 413223453 401467486 388527465 374943102 360943738 346002211 330572852
$$ packed form
14316G9594142K157324K777900L534551K502298L635384K979711M019001L662349
14308A04862660M178330M324897M406892M386479N549755N206547N423555O003712
14300A44342827O429502O566924O967383P245831P595710Q224328Q351107R481761
14292B05205373R489567J0592992J0616212J1208775J1776241J2531158J3059790
14285B84480108J3794518J4097224J4084903J4838060J4646005J4766067J4835854
14278C85542739J4719007J4006439J3004823J1874156R255688N584990K245202
14271D56233044J195986J501679l417186o834267o460244n310676n036594p849765
14263D24021977j0798524j1755967j2940021j3584363j3999364j4941527j5429359
$$ plain form
14256 330572852 314634008 299594421 284934739 271162115 257519068 245124610 233199637
14249 233199637 221893803 211196634 200861621 191510724 182572043 174826822 166477362
14242 166477362 158995525 152138951 145189870 138976163 133329448 127895493 122702227 117733163
14234 117733163 112591636 108187350 104135876 100473870 96466929 93065280 89433883 86293148
14226 86293148 83174817 80114125 77153905 74711372 72126654 70153575 67656068 65279178
14218 65279178 63561752 61330576 59534070 57593840 56240940 54665518 52758168 51597277
14210 51597277 49985261 48253194 47040882 46183696 44905761 43735964 42521596 41128781
14202 41128781 40109540 38971570 38171484 37083733 36354195 35304827 34565935 33826860 33215485
$$ packed form
14256C30572852j5938844j5039587j4659682j3772624j3643047j2394458j1924973
14249B33199637j1305834j0697169j0335013r350897q938681p745221q349460
14242A66477362p481837o856574o949081o213707n646715n433955n193266m969064
14234A17733163n141527m404286m051474l662006m006941l401649l631397l140735
14226H6293148l118331l060692k960220k442533k584718j973079k497507k376890
14218F5279178j717426k231176j796506j940230j352900j575422j907350j160891
14210E1597277j612016j732067j212312q57186j277935j169797j214368j392815
14202D1128781j019241j137970q00086j087751p29538j049368p38892p39075o11375
$$ plain form
14193 33215485 32309970 31468326 30559640 30143844 29570674 28525034 27793042 27461551 26894683
14184 26894683 26154868 25854573 24826934 24245331 24079900 23194483 22689644 22468396 22123662
14175 22123662 21660070 21437303 20685946 20350852 19985363 19556200 18917826 19038318 18505874
14166 18505874 18175682 17804447 17540736 17335301 16754229 16714054 16454955 16038725 15904571
14157 15904571 15472007 14903832 15121806 15000247 14614418 14407830 14076113 14211647 13735321
14148 13735321 13679613 13326724 13307736 12908636 12331582 12240201 12506666 11908718 11716745 11708824
14138 11708824 11500672 10989867 11328700 11054614 10837367 10725272 10604311 10517310 10576745 9760199
14128 9760199 10527633 9728450 9679770 9398687 9508898 8945176 9188508 9104906 8890359 8861520
$$ packed form
14193C3215485r05515q41644r08686m15796n73170j045640p31992l31491n66868
14184B6894683p39815l00295j027639n81603j65431q85417n04839k21248l44734
14175B2123662m63592k22767p51357l35094l65489m29163o38374J20492n32444
14166A8505874l30192l71235k63711k05435n81072m0175k59099m16230j34154
14157A5904571m32564n68175K17974j21559l85829k06588l31717J35534m76326
14148A3735321n5708l52889j8988l99100n77054r1381K66465n97948j91973p921
14138A1708824k08152n10805L38833k74086k17247j12095j20961q7001N9435q16546
14128I760199P67434p99183m8680k81083J10211n63722K43332q3602k14547k8839
$$ plain form
14118 8861520 8663484 8828597 8813309 8230813 8287828 8096677 8401642 8185849 8104471 7561158
14108 7561158 7628137 7741923 7518512 7453586 7443382 7326889 7033827 7262056 7113195 6591274
14098 6591274 6809645 6839032 6935473 6614105 6466110 6349578 6443255 6543522 6222184 6310509
14088 6310509 6089411 5823215 5450075 5723713 5877867 5652159 5538789 6067665 5591058
14079 5591058 5554792 5349044 5619639 5361494 5395667 5555510 5352604 5121900 4976564 4982197
14069 4982197 4642976 5099975 5052361 4866463 4778223 4791816 4941176 4653654 4527018 4946672
14059 4946672 4859217 4414476 4678783 4499290 4260808 4539129 4490546 4373584 4344318 4165065
14049 4165065 4049043 4357216 3926969 4085500 4102500 3976100 3968425 3982764 3804507 3793076
$$ packed form
14118H861520j98036J65113j5288n82496N7015j91151L04965k15793q1378n43313
14108G561158O6979J13786k23411o4926j0204j16493k93062K28229j48861n21921
14098F591274K18371K9387R6441l21368j47995j16532R3677J00267l21338Q8325
14088F310509k21098k66196l73140K73638J54154k25708j13370N28876m76607
14079E591058l6266k05748K70595k58145L4173J59843k02906k30704j45336N633
14069D982197l39221M56999m7614j85898q8240J3593J49360k87522j26636M19654
14059D946672q7455m44741K64307j79493k38482K78321m8583j16962k9266j79253
14049D165065j16022L08173m30247J58531J7000j26400p675J4339j78257j1431
$$ plain form
14039 3793076 3773302 3722855 3685275 3418987 3646998 3726700 3873430 4001833 3553260 3393158
14029 3393158 3564458 3647467 3449824 3553848 3175231 3419150 3311300 3327199 3491045 2982628
14019 2982628 2964946 2866378 3168283 3059819 2798068 2837880 3162082 2783741 2982301 2947279
14009 2947279 2838932 2944029 3014523 3082102 2867220 2846048 2824520 2787498 2640770 2752406
13999 2752406 2757187 2726364 2936197 2673894 3274893 3066280 3125194 3472874 3647826 4239912
13989 4239912 6202339 9098306 15576972 25389939 30316541 21068357 15308009 11806783
13981 11806783 8503157 6827102 5344095 4947312 4461168 3822430 3669102 3499252 3127428
13972 3127428 3036991 3179632 3322454 3296468 2752144 2705976 2869760 2753939 3068112 2688481
$$ packed form
14039C793076j9774n0447l7580k66288K28011P9702J46730J28403m48573j60102
14029C393158J71300Q3009j97643J04024l78617K43919j07850J5899J63846n08417
14019B982628j7682r8568L01905j08464k61751L9812L24202l78341J98560l5022
14009B947279j08347J05097P0494O7579k14882k1172k1528l7022j46728J11636
13999B752406M781l0823K09833k62303O00999k08613N8914L47680J74952N92086
13989D239912J962427K895967O478666R812967M926602r248184n760348l501226
13981A1806783l303626j676055j483007l96783m86144o38738j53328j69850l71824
13972C127428r0437J42641J42822k5986n44324m6168J63784j15821L14173l79631
$$ plain form
13962 2688481 2372691 2717283 2649643 2460088 2445335 2518608 2347761 2447333 2552900 2349462
13952 2349462 2343689 2264288 2525350 1997860 2032570 2224987 2050909 2161777 2403784 1807627
13942 1807627 2155273 2081030 1909911 2258088 1930288 2481187 2329079 1678544 2306627 2195633
13932 2195633 1576823 1955688 1980052 1844230 1965418 1919171 1928861 2006547 1668916 2068293
13922 2068293 1753458 1871141 1317056 1718388 1968430 1905497 2021791 1649239 1880244 1339497
13912 1339497 1640051 1733221 1558078 1807619 1932075 1715886 1786053 1770245 1623653 1512564
13902 1512564 1526040 1654907 1160042 1529382 1305556 1142596 1545253 1482963 1654054 1610584
13892 1610584 1235711 1475490 1727724 1553756 1370400 1448191 1440682 1810752 1092522 1422970
$$ packed form
13962B688481l15790L44592o7640j89555j4753P3273j70847R9572J05567k03438
13952B349462n773p9401K61062n27490L4710J92417j74078J10868K42007n96157
13942A807627L47646p4243j71119L48177l27800N50899j52108o50535O28083j10994
13932B195633o18810L78865K4364j35822J21188m6247R690P7686l37631L99377
13922B068293l14835J17683n54085M01332K50042o2933J16294l72552K31005n40747
13912A339497L00554R3170j75143K49541J24456k16189P0167j5808j46592j11089
13902A512564J3476J28867m94865L69340k23826j62960M02657o2290J71091m3470
13892A610584l74873K39779K52234j73968j83356P7791p509L70070p18230L30448
$$ plain form
13882 1422970 1564890 1334643 1538443 1145036 1662597 1109849 1439508 1123468 1277336
13873 1277336 1288939 1302063 1163420 1258382 1369829 1365019 1220038 1063446 1591620 1117550
13863 1117550 1047060 1199375 1368265 1061879 1167943 1103458 1249694 1240737 1342052 1331004
13853 1331004 904339 1391993 764283 1251889 1304942 1244036 1384487 1268173 1436738 856990
13843 856990 933984 1257016 1086577 825974 986173 1177567 1079424 1185974 1321935 841443
13833 841443 1178184 1000320 847499 958720 787571 904721 1199419 970393 896964 850198
13823 850198 792127 971466 870464 683406 1319979 1048351 1374636 802132 928189 1233332
13813 1233332 1072752 977242 997482 1086739 1024522 1132028 908819 935886 1115510 1019631
$$ packed form
13882A422970J41920k30247K03800l93407N17561n52748L29659l16040J53868
13873A277336J1603J3124j38643R4962J11447m810j44981j56592N28174m74070
13863A117550p0490J52315J68890l06386J06064o4485J46236q957J01315j1048
13853A331004m26665M87654o27710M87606N3053o0906J40451j16314J68565n79748
13843H56990P6994L23032j70439k60603J60199J91394r8143J06550J35961m80492
13833H41443L36741j77864j52821J11221j71149J17150K94698k29026p3429m6766
13823H50198n8071J79339j01002j87058O36573k71628L26285n72504J26057L05143
13813A233332j60580r5510K0240Q9257o2217J07506k23209K7067J79624r5879
$$ plain form
13803 1019631 843099 817525 1074304 1037071 861012 1258830 658594 679262 940832 550081
13793 550081 790338 815676 545640 717986 879172 629431 680639 846423 716482 651576
13783 651576 889080 893528 574181 758786 901005 951817 932084 640864 728314 616214
13773 616214 942642 623134 806447 997474 908572 347983 607244 831976 572559 819264
13763 819264 826826 833886 821179 706170 514039 816925 651292 910759 598456 703638
13753 703638 927894 566136 930769 739335 717924 752232 567935 696494 798924 551506
13743 551506 867058 840647 907606 556776 619286 676464 441008 916240 633451 889501
13733 889501 371633 388240 601975 659507 520794 788733 631954 631969 769765 863615 823323
$$ packed form
13803A019631j76532k5574K56779l7233j76059L97818o00236K0668K61570l90751
13793E50081K40257K5338k70036J72346J61186k49741N1208J65784j29941o4906
13783F51576K37504M448l19347J84605J42219N0812j9733k91220Q7450j12100
13773F16214L26428l19508J83313J91027q8902C47983K59261K24732k59417K46705
13763H19264P562P060j2707j15009j92131L02886j65633K59467l12303J05182
13753G03638K24256l61758L64633j91434k1411L4308j84297J28559J02430k47418
13743E51506L15552k6411O6959l50830O2510N7178k35456M75232k82789K56050
13733H89501C71633J6607K13735N7532j38713K67939j56779J5J37796R3850m0292
$$ plain form
13722 823323 440712 643774 688496 376219 368318 537522 645774 577895 752280 959128
13712 959128 468775 644464 613698 815493 633293 927041 429575 519774 468817 602861
13702 602861 741522 632221 561252 677326 297535 735623 713029 645814 447825 627470
13692 627470 836579 417800 579668 164011 566870 346781 704265 852226 568435 711797
13682 711797 698606 395070 655605 458348 403268 724528 412192 536641 646489 386758
13672 386758 729898 441864 268673 549768 338868 460258 344576 675087 584743 678434
13662 678434 638089 476551 532421 931459 471814 261314 682200 451887 242957 148931
13652 148931 546573 397802 101700 587887 392276 468315 433862 602798 529027 682893
$$ packed form
13722H23323l82611K03062M4722l12277p901J69204J08252o7879J74385K06848
13712I59128D68775J75689l0766K01795j82200K93748D29575R0199n0957J34044
13702F02861J38661j09301p0969J16074B97535M38088k2594o7215j97989J79645
13692F27470K09109D17800J61868A64011M02859k20089L57484J47961k83791J43362
13682G11797j3191l03536K60535j97257n5080L21260l12336J24449J09848k59731
13672C86758L43140k88034j73191K81095k10900J21390j15682L30511r0344R3691
13662F78434m0345j61538N5870L99038m59645k10500M20886k30313k08930r4026
13652A48931L97642j48771A01700M86187j95611P6039l4453J68936p3771J53866
$$ plain form
13642 682893 672802 250000 188711 454143 735064 258141 566464 553181 205570 342475
13632 342475 258176 499732 615029 570948 102843 463161 654370 338416 381249 821342
13622 821342 588708 547511 442401 227626 535805 506473 647559 486395 341656 289199
13612 289199 405791 678972 952972 358744 82308 453113 729286 605731 503917 257176
13602 257176 -124519 122911 438974 502289 141607 267435 162806 431791 547828 730402
13592 730402 248891 179845 340027 460113 307972 366751 717232 401837 79404 355334
13582 355334 353835 231997 342782 272798 493104 237319 259647 208130 332493 474278
13572 474278 474370 442315 539096 588044 762375 433503 543039 383392 226993 370437 700725
$$ packed form
13642F82893j0091B50000o1289K65432K80921B58141L08323j3283B05570J36905
13632C42475q4299K41556J15297m4081A02843L60318J91209l15954M2833M40093
13622H21342k32634m1197j05110k14775L08179k9332J41086j61164j44739n2457
13612B89199J16592K73181K74000C58744H2308L70805K76173j23555j01814k46741
13602B57176a24519A22911L16063O3315A41607J25828j04629K68985J16037J82574
13592G30402B48891o9046J60182J20086j52141N8779L50481l15395G9404K75930
13582C55334j499j21838J10785o9984K20306B37319K2328n1517J24363J41785
13572D74278R2l2055R6781M8948J74331l28872J09536j59647j56399J43444L30288
$$ plain form
13561 700725 165011 28095 205341 211039 561213 246251 455212 402114 206208 9072 586463
13550 586463 323210 350231 396382 213527 812040 459254 486430 410660 147839 260997
13540 260997 394551 438124 227410 122946 394791 232643 451161 485057 244278 188707
13530 188707 -48058 246155 317591 325712 488043 200675 599830 294481 288030 131930 242733
13519 242733 253219 181031 289190 111331 184618 422883 345267 162925 140825 444784
13509 444784 101557 561651 383498 793807 299457 -233159 126321 369730 128442 203160
13499 203160 -11444 214921 371413 309511 21055 248939 320554 378655 435784 105827 -136013
13487 78114 556046 569771 350469 204319 238782 123573 354094 334804 -14679 247414
$$ packed form
13561G00725A65011B8095J77246N698L50174B46251K08961n3098j95906I072N77391
13550E86463k63253K7021M6151j82855N98513l52786K7176p5770A47839J13158
13540B60997J33554M3573k10714j04464K71845j62148K18518L3896k40779n5571
13530A88707d8058B46155P1436Q121J62331B00675L99155B94481o451A31930J10803
13519B42733J0486p2188J08159A11331P3287K38265p7616A62925k2100L03959
13509D44784A01557M60094j78153M10309B99457b33159A26321K43409A28442P4718
13499B03160a1444B14921J56492o1902B1055K27884P1615N8101N7129A05827a36013
13487G8114M77932J3725k19302j46150L4463j15209K30521j9290a4679B47414
$$ plain form
13476 151008 402465 124698 -31586 143917 267307 235863 273486 432777 20440 166034
13466 166034 54825 169961 488607 -12246 424156 76395 65040 209682 192634 367835
13456 367835 143760 228955 105437 434329 -11241 373060 410711 59882 422850 369791
13446 369791 349398 108058 248385 272739 65352 267222 -3064 306249 405860 127446 77054
13435 77054 118881 266618 398385 324242 87142 171532 149399 152625 441055 127211 -6890
13423 448465 314251 289647 265388 219536 277847 197978 33106 443092 298642 233954 252610
13412 252610 -11375 26277 232932 341512 555407 124991 158087 194594 90017 359687
13402 359687 267000 45820 471167 -38697 349774 33063 215381 298886 281089 137420 357994
$$ packed form
13476A51008K51457A24698c1586A43917J23390l1444L7623J59291B0440J45594
13466A66034E4825J15136L18646a2246D24156G6395j1355J44642j7048J75201
13456C67835A43760Q5195A05437L28892a1241C73060L7651E9882L62968n3059
13446C69791k0393A08058J40327K4354F5352K01870c064C06249R9611A27446n0392
13435G7054M1827J47737J31767p4143H7142Q4390k2133L226K88430A27211f890
13423D48465j34214k4604k4259m5852N8311p9869C3106M09986j44450o4688J8656
13412B52610a1375B6277K06655J08580K13895A24991L3096L6507I0017K69670
13402C59687r2687D5820M25347c8697C49774C3063J82318Q3505j7797A37420K20574
$$ plain form
13391 357994 328953 333664 49188 103937 74295 449900 184663 429378 36216 279873 412389
13380 412389 159008 268179 167263 -122582 431893 97515 354654 156042 238219 124424
13370 124424 410187 432549 -57217 314550 327966 254198 401850 530978 405053 428063
13360 428063 165167 -89806 291511 243339 121837 51989 517646 -57755 21579 474544
13350 474544 266517 300611 308493 244384 304467 288721 712951 90408 288928 340933 28714
13338 95556 422837 111554 150699 241424 11383 143195 305666 114340 564981 284733
13328 284733 89881 92213 288906 134913 419212 156641 213230 293271 352049 89770 403790
13317 403790 392521 332249 29692 359422 190401 -16956 202434 67642 137615 367579 410709
$$ packed form
13391C57994k9041M711D9188N4749k9642L75605A84663K44715C6216K43657J32516
13380D12389A59008J09171j00916a22582D31893I7515K57139A56042Q2177j13795
13370A24424K85763K2362e7217C14550J3416p3768J47652J29128j25925K3010
13360D28063A65167h9806B91511m8172j21502E1989M65657e7755B1579M52965
13350D74544k08027L4094P882o4109O0083j5746M24230I0408J98520N2005B8714
13338I5556L27281A11554L9145R0725A1383J31812J62471A14340M50641k80248
13328B84733H9881K332J96693A34913K84299A56641N6589Q0041N8778H9770L14020
13317D03790j1269o0272B9692L29730j69021a6956B02434F7642O9973K29964M3130
$$ plain form
13306 410709 31148 -25747 120052 10425 306167 -23095 373923 288599 124063 -76762 189698
13294 230393 47625 417835 429938 74513 425149 -9385 213042 43608 -7191 169184 140627
13283 140627 42795 417030 80952 -69982 60759 361146 265867 85619 421635 16643 112946
13272 112946 183000 314095 246035 81114 -222931 14986 112867 316029 178952 -27641 196556
13260 -34323 49306 -194560 -70102 23506 36601 286556 333996 -70925 143704 -61320 -48380
13249 -48380 462248 435681 -105708 19445 1373 -125378 300914 381686 206533 255581 172293
13238 172293 400396 384536 -20101 117847 -218885 94033 -13784 233146 326611 -231975
13227 169837 54990 -114775 59280 19792 -45727 125727 -162756 95130 354924 112242
$$ packed form
13306D10709C1148b5747A20052A0425K95742b3095C73923q5324A24063g6762A89698
13294B30393D7625L70210J2103G4513L50636i385B13042D3608g191A69184k8557
13283A40627D2795L74235H0952f9982F0759L00387r5279H5619L36016A6643R6303
13272A12946P0054J31095o8060H1114b22931A4986R7881K03162j37077b7641A96556
13260c4323D9306a94560g0102B3506J3095K49955M7440g0925A43704f1320J2940
13249d8380D62248k6567a05708A9445A373a25378C00914Q0772j75153M9048q3288
13238A72293K28103j5860b0101A17847b18885I4033a3784B33146R3465b31975
13227A69837E4990a14775E9280A9792d5727A25727a62756I5130K59794A12242
$$ plain form
13216 287656 149076 160919 72073 316945 -98501 207638 -127491 1817 157611 43191 135453
13205 135453 229130 168069 284414 -134622 291966 154354 176363 129633 32905 -114599
13194 -2730 196449 -170832 31286 23432 -110199 248035 279533 -5578 -131518 -144236 203565
13182 119921 202940 278415 27630 256920 3297 404365 -153554 -217420 299594 -57585 187895
13170 276568 191363 77396 -75783 66804 189023 -28456 126018 79517 -153593 58490 -226788
13158 17447 218003 290053 214329 -230820 -72061 171423 242900 -1642 86713 96335 -191671
13146 64710 132950 430821 289528 -54253 53708 -16457 333244 202643 -215510 131315
13135 69261 106613 365655 -13115 38166 75096 78118 221396 47086 402783 -279696 189686
$$ packed form
13216B87656j38580J1843G2073K44872i8501B07638a27491A817J55794D3191R2262
13205A35453R3677o1061J16345a34622B91966j37612K2009m6730C2905a14599
13194b730A96449a70832C1286p854a10199B48035L1498e578j25940j2718B03565
13182A19921Q3019P5475B7630K29290C297M01068a53554o3866B99594e7585A87895
13170B76568q5205G7396g5783F6804J22219b8456A26018m6501a53593E8490b26788
13158A7447K00556P2050p5724b30820g2061A71423P1477a642H6713R622a91671
13146F4710O8240K97871j41293e4253E3708a6457C33244j30601b15510A31315
13135F9261L7352K59042a3115C8166L6930L022J43278D7086L55697b79696A89686
$$ plain form
13123 -64174 314159 238666 154253 180329 221501 136910 -57138 275911 -57334 200708 274011
13112 274011 106115 56173 130515 203372 234466 -247803 -201433 74798 -151862 126089 130071
13101 130071 192330 25437 56817 323176 -15319 -143003 76620 45350 -184540 -194011 357231
13089 -190460 -2031 91834 -27481 50386 -107746 198022 284150 6045 167280 -38790 67806
13077 131691 224583 194804 350237 -138073 14957 296299 -45974 303291 68701 -39926 79454
13065 -72402 255919 404997 312655 155177 342781 -96520 250425 -13300 292061 452968
13055 452968 112316 283280 -122727 301878 -349757 54967 127712 376704 141514 442336
13045 442336 386192 -81593 -67620 84071 -101279 134326 506057 442412 39580 245503 -2140
$$ packed form
13123f4174C14159p5493q4413K6076M1172q4591e7138B75911e7334B00708P3303
13112B74011A06115m9942P4342P2857L1094b47803M6370G4798a51862A26089L982
13101A30071O2259B5437L1380K66359a5319j27684G6620l1270a84540r471C57231
13089a90460b031I1834b7481E0386a07746A98022Q6128F045J61235c8790F7806
13077A31691R2892k9779J55433a38073A4957K81342d5974C03291F8701c9926G9454
13065g2402B55919J49078r2342A55177J87604i6520B50425a3300B92061J60907
13055D52968A12316J70964a22727C01878c49757E4967P2745K48992A41514L00822
13045D42336n6144h1593J3973H4071a01279A34326L71731o3645C9580K05923b140
$$ plain form
13033 -96626 -201411 293741 286909 -42679 -112582 23431 -185440 101544 -226735 291029 323180
13022 323180 294331 36760 -106262 20495 -12207 134928 152236 222342 67114 -330740 176852
13010 108238 34650 42211 201646 326028 65541 -86767 -6233 2239 56422 -201349 92622
12998 16072 -289836 95249 -245232 299870 87949 -87328 -53480 -253164 59437 -133298 188018
12986 5079 457262 -145219 448927 115592 -8797 76853 101763 15473 252344 -83571 244787
12974 126845 -197560 -172840 -20801 -142843 -56086 -98195 -144067 170965 267072 66181 166066
12963 166066 -136555 29402 -249561 -32803 48480 47988 12566 -54130 3562 -61495 34280 -224084
12950 -129955 -50162 -79778 -47811 189764 65756 -78674 -116680 88464 -31031 -113155 367205
$$ packed form
13033i6626j04785B93741o832d2679o9903B3431a85440A01544b26735B91029L2151
13022C23180k8849C6760a06262B0495a2207A34928J7308P0106F7114c30740A76852
13010A08238C4650P561J59435J24382F5541h6767f233B239N4183b01349I2622
12998A6072b89836I5249b45232B99870H7949h7328L3848j99684E9437a33298A88018
12986E079M52183a45219D48927A15592h797G6853K4910A5473K36871h3571B44787
12974A26845a97560K4720b0801j22042e6086m2109m5872A70965R6107F6181R9885
12963A66066a36555B9402b49561c2803D8480m92A2566e4130C562f1495C4280b24084
12950a29955e0162k9616L1967A89764F5756g8674l8006H8464c1031q2124C67205
$$ plain form
12938 -143437 -83255 63770 11464 -114418 17929 53871 -29777 91617 -99058 280951 -225527
12926 87328 104532 84440 -102747 178993 47271 -178585 -56395 245210 196942 173960 93802
12915 93802 -122 249884 117093 119967 -83570 -64610 394818 200249 382912 -223415 274460
12903 165912 -248889 -167551 -264686 -83855 78490 14210 392504 -22177 306339 -209218 -7722
12891 87113 -195714 67775 -318890 -153829 -197879 -137487 -165990 119459 24666 259782 248537
12880 248537 -128966 115396 114875 -87170 270632 44459 88964 143678 -9201 248584 119521
12868 71220 103669 -212254 239157 194131 228405 -13418 92453 -30454 159074 -122752 114591
12856 -140667 82212 -124632 72342 -267880 75109 102912 -215956 -57603 172497 -51122 -112542
$$ packed form
12938a43437O0182F3770A1464a14418A7929L5942b9777I1617i9058B80951b25527
12926H7328J7204k0092a02747A78993D7271a78585e6395B45210m8268k2982q0158
12915I3802a22B49884A17093K874h3570J8960C94818j94569J82663b23415B74460
12903A65912b48889Q1338r7135h3855G8490A4210L78294b2177C06339b09218g722
12891H7113a95714F7775c18890a53829m4050O0392k8503A19459B4666K35116j1245
12880B48537a28966A15396n21h7170B70632D4459M4505N4714i201B48584A19521
12868G1220L2449b12254B39157m5026L4274a3418I2453c0454A59074a22752A14591
12856a40667H2212a24632G2342b67880G5109K7803b15956e7603A72497e1122o1420
$$ plain form
12845 -112542 16431 249132 72269 181512 12174 -65142 152835 42073 320896 352074 159106
12833 181210 202892 115816 -52620 270049 194252 -273552 -23722 -69500 -298031 170283 75218
12821 60737 -114600 314981 -48414 123094 226942 -179080 -220911 -139623 9599 314062 -77861
12809 -25617 338603 112011 138572 245641 -192258 272151 -72952 -158626 -216294 218567
12798 -158975 -122964 77680 212175 158047 -10035 -94126 125735 -22576 237887 -125529 -4983
12786 -253628 -104918 135710 -188040 -20615 290846 140881 59144 -166702 -99416 -52800
12776 -52800 -42069 100687 244267 219641 -131616 271913 86596 112928 -37669 94232 197683
12765 197683 225170 -57221 127980 67912 -475842 -95973 220367 -102696 173927 -4979 158865
$$ packed form
12845a12542A6431K32701G2269J09243A2174f5142A52835D2073K78823L1178A59106
12833A81210K1682q7076e2620B70049p5797b73552b3722m5778k28531A70283G5218
12821F0737a14600C14981d8414A23094J03848a79080m1831Q1288I599L04463g7861
12809b5617C38603A12011K6561J07069a92258B72151g2952q5674n7668B18567
12798a58975L6011G7680J34495n4128a0035q4091A25735b2576B37887a25529d983
12786b53628a04918A35710a88040b0615B90846A40881E9144a66702O7286M6616
12776e2800J0731A00687J43580k4626a31616B71913H6596K6332c7669I4232J03451
12765A97683K7487e7221A27980o0068d75842i5973B20367a02696A73927d979A58865
$$ plain form
12753 45255 -345728 284546 -53264 420133 -26536 -20977 31223 78091 -8172 24727 115861
12742 115861 -154401 276782 201701 7712 -194754 33283 187559 -139191 51213 -117690
12731 214674 369435 99566 224520 164708 -28602 163580 -119806 -251331 -34868 147314
12720 -230531 178707 206535 -59435 8745 16944 148270 60320 228535 -91079 44175 575888
12709 575888 146892 147759 -38408 -64301 344508 220177 -79662 477282 395355 -87828 396459
12697 135094 -26368 -163036 30780 170243 -134470 -192901 -68810 -146737 184348 -461901
12686 85782 -229375 -177786 166602 79335 -258406 127666 -45779 113094 -101664 203313
12675 68923 256874 -133298 376871 -112216 -190494 -95030 -62543 50994 63854 -114635 -71405
$$ packed form
12753D5255c45728B84546e3264D20133b6536N559C1223M6868h172B4727R1134
12742A15861a54401B76782p5081G712a94754C3283J54276a39191E1213a17690
12731B14674J54761I9566J24954n9812b8602A63580a19806j31525c4868A47314
12720b30531A78707K7828e9435H745Q199J31326F0320J68215i1079D4175N31713
12709E75888A46892Q67c8408k5893C44508j24331g9662D77282q1927h7828C96459
12697A35094b6368j36668C0780J39463a34470n8431f8810p7927A84348d61901
12686H5782b29375N1589A66602G9335b58406A27666d5779A13094a01664B03313
12675F8923J87951a33298C76871a12216p8278i5030L2487E0994J2860a14635M3230
$$ plain form
12664 -71405 28219 254850 -183349 -99443 219862 259963 -10568 296167 -50162 178978 525521
12653 525521 -2544 195848 66331 234662 186585 -65787 115829 17995 -34318 87889 -201282
12641 -160369 353672 -131506 84066 -112439 18606 21622 126255 194999 198899 -215970 -175879
12630 -175879 292420 245045 380671 333305 364638 -63163 269651 162193 591271 163001
12619 253794 -153068 19775 160090 16154 -175424 269322 -121502 248284 -283693 -362177
12609 -362177 -157270 -294627 192175 -194682 141678 -64676 -4907 80780 409421 187099
12598 -126704 -66266 486449 75744 56975 251496 57227 431637 107913 236746 70033
12587 2501 100448 -30208 7803 415 44982 -420371 -138540 -26817 32225 134333 -148416 94565
$$ packed form
12664g1405B8219K26631a83349Q3906B19862M0101a0568B96167e0162A78978L46543
12653E25521b544A95848F6331J68331m8077f5787A15829A7995c4318H7889b01282
12641a60369C53672a31506H4066a12439A8606L016J04633O8744L900b15970M0091
12630a75879B92420m7375J35626m7366L1333f3163B69651j07458M29078A63001
12619B53794a53068A9775J40315A6154a75424B69322a21502B48284b83693p8484
12609c62177a57270j37357A92175a94682A41678f4676d907H0780L28641A87099
12598a26704O0438D86449G5744j8769J94521E7227L74410A07913J28833G0033
12587B501R7947c0208G803D15M4567d20371a38540b6817C2225J02108a48416I4565
$$ plain form
12574 -54449 17535 319733 140333 -354765 48281 145657 295852 353933 -179665 -449059
12564 -449059 156785 -104443 -49566 -180885 253301 -57451 17855 150888 -17535 245596
12553 44891 24203 -14617 -289783 -65776 -24729 115341 72792 19291 -45959 172361 -438979
12541 -111149 -266636 134778 81142 -379735 -231830 24759 -53422 -72388 -1082 -39366 104430
12529 -19338 18690 320927 -13279 13909 -73669 203742 -208755 -115417 52588 434472 82871
12517 -217938 9197 36075 -359465 54785 32461 -340237 214316 30093 -145386 -88007 88952
12505 293176 -66437 -256187 -131785 -76454 -257964 120048 -197235 -21183 335936 62824
12494 -9421 207251 124518 253044 111507 72808 -320433 58610 -26230 -219948 89939 -85813
$$ packed form
12574e4449A7535L02198A40333c54765D8281R7376J50195N8081a79665k69394
12564d49059A56785a04443d9566j31319B53301e7451A7855J33033a7535B45596
12553D4891k0688a4617k75166f5776b4729A15341m2549A9291d5959A72361d38979
12541a11149j55487A34778n3636c79735J47905B4759e3422j8966a082l8284A04430
12529a9338A8690L02237a3279A3909g3669B03742b08755R3338E2588L81884H2871
12517b17938I197K6878c59465E4785k2324c40237B14316C0093a45386N7379H8952
12505B93176f6437j89750J24402N5331j81510A20048a97235b1183C35936F2824
12494i421B07251q2733J28526A11507l8699c20433E8610b6230j93718H9939h5813
$$ plain form
12482 -146118 -273384 -280620 -220123 -30063 -409251 -125418 158733 125755 -156109 34265 97451
12471 97451 -151808 371378 17925 -60380 75032 99106 219769 51847 485273 -102602 318633
12459 -48206 270128 -377704 -181891 -87258 -45159 173975 350789 58456 -40679 -80239 228630
12447 9097 80916 123904 -35940 7848 -400677 299867 45555 -31501 -196376 146713 -70763
12435 -8840 -412059 -115520 378959 -358164 -63253 298741 217569 74146 -42326 -101850 -269781
12424 -269781 46158 -228803 118696 -65417 438 100023 265090 -141683 -209140 -3473 303551
12412 61486 186767 -3994 227759 52447 179749 -163919 32492 18691 -95411 -171634 228465
12400 -51912 101494 116413 88149 88998 -169849 180447 25938 96493 -93740 98352 -320450
$$ packed form
12482a46118j27266p236O0497c0063l79188a25418A58733l2978a56109C4265O3186
12471I7451a51808C71378A7925f0380G5032K4074J20663E1847M33426a02602C18633
12459d8206B70128c77704a81891h7258M2099A73975J76814E8456d0679l9560B28630
12447I097P1819M2988c5940G848d00677B99867D5555c1501j64875A46713g0763
12435h840m03219a15520C78959c58164f3253B98741q1172G4146d2326n9524j67931
12424b69781D6158b28803A18696f5417D38R9585J65067a41683o7457c473C03551
12412F1486J25281c994B27759E2447J27302a63919C2492j3801i5411p6223B28465
12400e1912A01494J4919k8264Q49a69849A80447B5938P0555i3740I8352c20450
$$ plain form
12388 -53159 -138099 74585 -177767 93737 -46281 -91099 -203554 -260015 -25496 31565 227539
12377 227539 35903 -77996 -118776 -29533 66160 -17931 -154530 -376322 297887 184415 45761
12365 -251216 60285 -41305 -33331 172568 92617 206038 122929 -47690 -136117 185326 -40136
12353 -69329 179684 -157930 -57450 79266 -143745 4054 7023 159973 42206 115359 -80891
12341 -274874 84170 94392 -18549 239974 36355 346521 -14018 109295 189151 147971 -299061
12329 86371 -170409 -62317 -286691 311181 -320602 284055 207147 -23654 -27634 194093 -189586
12317 6662 -170490 -129944 -176093 -110610 208921 448730 41545 -56692 50612 4094 190644
12306 190644 -57304 -107900 -180257 -58248 246085 -35507 -88459 155915 298205 127177 83014
$$ packed form
12388e3159q4940G4585a77767I3737d6281m4818j12455n6461b5496C1565J95974
12377B27539C5903g7996m0780b9533F6160a7931j36599k21792B97887j13472D5761
12365b51216F0285d1305P974A72568p9951J13421q3109d7690q8427A85326d0136
12353f9329A79684a57930e7450G9266a43745D054K969J52950D2206P3153h0891
12341b74874H4170J0222a8549B39974C6355L10166a4018A09295P9856m1180b99061
12329H6371a70409f2317k24374C11181c20602B84055p6908b3654l980A94093a89586
12317F662a70490M0546m6149O5483B08921K39809D1545e6692E0612D094J86550
12306A90644e7304n0596p2357e8248B46085c5507n2952A55915J42290A27177m4163
$$ plain form
12295 83014 -11676 -205409 -304315 -45187 104166 202153 -265455 -114439 -123011 141293 -163377
12283 63432 -13335 -214669 -147144 341393 -190228 -154047 186943 323858 201937 197151 12974
12271 449825 -395080 -35538 162601 -9091 148123 251648 194382 -5982 1486 -263509 74786
12259 -125542 132819 257184 208086 -14498 128703 96078 123861 49374 17748 128474 17449
12247 435620 -15624 31013 259526 374278 47545 -125628 -245040 82208 319388 429323
12237 429323 -227589 -26964 585269 13401 73347 -12415 139310 121902 -6525 455118 254126
12226 254126 95500 -10227 -99814 3055 -60031 331333 649545 43131 465058 -33894 181243
12214 79590 37951 377837 264308 129764 -12152 331394 28673 171086 105747 157065 202532
$$ packed form
12295H3014a1676j93733r8906d5187A04166R7987b65455a14439q572A41293a63377
12283F3432a3335k01334O7525C41393a90228L6181A86943J36915j21921m786A2974
12271D49825c95080c5538A62601i091A48123J03525n7266e982A486b63509G4786
12259a25542A32819J24365m9098a4498A28703l2625K7783D9374A7748J10726A7449
12247D35620a5624C1013K28513J14752D7545a25628j19412H2208K37180J09935
12237D29323b27589b6964E85269A3401N9946a2415A39310j7408f525D55118k00992
12226B54126I5500a0227q9587C055f0031C31333L18212D3131M21927c3894A81243
12214G9590C7951L39886j13529A29764a2152C31394B8673J42413o5339N1318M5467
$$ plain form
12203 202532 18255 -272135 134935 224249 125378 172521 -186235 171736 -334138 314647
12192 168169 67473 136254 73374 52474 95805 14544 182200 212202 77465 -147284 129895
12180 40670 -43730 -62538 -82452 333688 52103 89070 -98487 63361 167914 104354 199281
12169 199281 183101 293734 -7813 293862 101035 -178845 -7131 -229824 456505 150695
12158 -51977 -135604 67979 229596 -36609 148484 28149 115301 -61428 471072 -873 104224
12146 243902 -66010 284378 194304 -190058 -63902 88200 286923 -179216 -332741 27640
12135 222102 -158865 -233114 -426251 -45816 150766 181274 37469 11947 454954 -77573 -159308
12124 -159308 -19791 380079 29039 -2712 -155197 -45868 -122883 16596 223012 -74495 -367245
$$ packed form
12203B02532A8255b72135A34935Q9314r8871M7143a86235A71736c34138C14647
12192A68169F7473O8781o2880k0900M3331A4544J67656L0002G7465a47284A29895
12180D0670d3730j8808j9914C33688E2103L6967i8487F3361J04553o3560R4927
12169A99281j6180J10633g813B93862A01035a78845g131k22693D56505A50695
12158e1977q3627F7979J61617c6609A48484B8149Q7152f1428D71072h73A04224
12146B43902f6010B84378r0074a90058f3902H8200J98723a79216j53525B7640
12135B22102a58865p4249j93137d5816A50766L0508C7469A1947M43007g7573q1735
12124a59308a9791C80079B9039b712j52485d5868p7015A6596K06416g4495k92750
$$ plain form
12113 -367245 -144651 45087 -107697 1193 141735 173582 85200 90820 66203 83534 -30111
12101 -135824 -80566 398032 -226909 -239051 -106622 -146019 -52379 -103880 -161311 13565 227440
12090 227440 6550 13543 -124706 -120537 -133073 113296 250950 -35625 231804 171943 -231410
12078 -20080 -217382 168201 -22817 -229415 -258242 99894 414496 535609 908736 1033677
12068 1033677 1000929 391461 204088 45894 183774 -142708 -224446 -101024 33475 210723
12058 210723 244723 47591 -128295 240288 51835 -354416 201068 209726 265188 -126173 438260
12046 -165600 -91468 120071 -574688 -336324 213043 -44460 -46785 -70261 -57144 -49532 -101451
12035 -101451 -82878 -83478 -382315 -318897 9477 -13610 -248998 -9708 -194012 81341 -385774
$$ packed form
12113c67245a44651D5087a07697A193J40542L1847H5200N620k4617J7331c0111
12101a35824N5258C98032b26909j2142a06622l9397e2379n1501n7431A3565K13875
12090B27440F550O993a24706M169j2536A13296J37654c5625B31804n9861b31410
12078b0080j97302A68201b2817k06598k8827I9894L14602J21113L73127J24941
12068A033677l2748C91461j87373D5894J37880a42708q1738a01024C3475J77248
12058B10723L4000D7591a28295B40288E1835c54416B01068Q658N5462a26173D38260
12046a65600P4132A20071e74688K38364B13043d4460k325k3476J3117P612n1919
12035a01451J8573o00k98837O3418I477a3610k35388i708j84304H1341c85774
$$ plain form
12023 -9203 -39819 -344075 -261518 195833 -220607 -107531 43694 -343695 60534 -147705 -234711
12012 -234711 199305 157511 -96006 -179221 -428158 -474870 -203437 -402010 71242 88138 113452
12001 113452 334080 -282345 -229616 -106384 26572 222844 140818 66357 -276714 22593
11990 365763 181754 159022 187408 -135337 -77405 96609 -68600 168270 182430 -11808 -146547
11979 -146547 100541 -27807 -148506 -194145 -238095 -214875 -105534 325746 -216036 265192
11968 -137225 103464 13389 -242080 242834 -87700 29955 525215 36825 80950 25499 186909
11957 186909 -363947 -53625 -30941 -326656 119004 39466 -218617 232067 -107343 120261
11946 -158876 171691 323769 -173611 -174478 154026 -258905 116547 -183804 -9217 -230995
$$ packed form
12023i203l0616l04256Q2557A95833b20607a07531D3694c43695F0534a47705q7006
12012b34711A99305m1794i6006q3215k48937m6712b03437j98573G1242J6896K5314
12001A13452K20628b82345N2729a06384B6572J96272q2026F6357b76714B2593
11990C65763A81754k2732K8386a35337N7932I6609f8600A68270J4160a1808j34739
11979a46547A00541b7807j20699m5639m3950K3220a05534C25746b16036B65192
11968a37225A03464A3389b42080B42834h7700B9955M95260C6825M4125B5499J61410
11957A86909c63947e3625K2684k95715A19004C9466b18617B32067a07343A20261
11946a58876A71691J52078a73611q67A54026b58905A16547a83804i217k21778
$$ plain form
11936 -230995 -58164 104246 190309 -300838 -18883 -122202 138140 -11653 -185210 -290369
11926 -290369 -301489 -49408 -158669 -193861 101205 3990 116756 -7377 -93726 -247647 -100804
11914 -138073 -163882 -121784 219387 223961 128991 244553 -214550 46523 -65833 2849 5954
11903 5954 24022 -67486 6066 321585 346805 15204 -119883 -279374 -27559 -296155 -229755
11892 -229755 252505 15910 169104 64372 76111 -18188 -346592 46865 243367 72372 40395
11881 40395 -85344 -82184 66963 -115045 -93390 -47711 -52735 -189553 -58134 -39292 100200
11869 -229766 183649 168899 37044 -240330 -125167 -39546 -176940 64102 -126560 79505
11858 293495 -16558 102639 -23298 -455613 -114133 98994 -102587 -60728 -44761 254373
$$ packed form
11936b30995e8164A04246Q6063c00838a8883j03319A38140a1653j73557j05159
11926b90369j1120d9408j09261l5192A01205C990J12766g377q6349j53921a00804
11914a38073k5809M2098B19387M574r4970J15562b14550D6523f5833B849L105
11903E954J8068f7486F066L15519K5220A5204a19883j59491b7559k68596O6400
11892b29755B52505A5910J53194F4372J1739a8188l28404D6865J96502G2372l1977
11881D0395h5344L160F6963a15045K1655M5679n024j36818e8134J8842A00200
11869b29766A83649j4750C7044b40330J15163c9546j37394F4102a26560G9505
11858B93495a6558A02639b3298m32315a14133I8994a02587M1859J5967B54373
$$ plain form
11847 -174299 72775 -112910 37325 249168 -167448 -40694 47550 47513 20286 -174597 -153688
11836 -153688 25154 -133580 -154103 -32559 -365914 57772 238384 -175280 -77221 106078
11825 98681 198966 -154010 -16355 -12289 -20563 -138830 427484 -6754 -48429 -253016 186990
11813 264122 79331 91675 -209877 -24734 56769 -144356 234475 246824 -6818 3912 -171209
11801 79910 140385 97650 -239194 140076 -238047 10978 59571 -93573 150577 -85357 -301869
11790 -301869 144599 101164 155996 -99290 147083 -51032 40284 75789 73140 -173483 21301
11778 81413 -11448 196053 -277310 -11426 103781 -81398 -23705 -66331 177311 -193612 -41816
11766 -290289 -307467 -115940 93805 -49891 14581 -64196 66793 77154 100677 62108 74323
$$ packed form
11847a74299G2775a12910C7325K11843a67448d0694D7550l7B0286a74597K0909
11836a53688B5154a33580k0523c2559l33355E7772J80612a75280g7221A06078
11825I8681J00285a54010a6355M066q274j18267D27484f754m1675k04587A86990
11813B64122G9331J2344b09877b4734E6769a44356B34475J2349f818C912a71209
11801G9910O0475m2735b39194A40076b38047A0978M8593i3573A50577h5357k16512
11790c01869A44599m3435N4832i9290A47083e1032D0284L5505k649a73483B1301
11778H1413a1448A96053b77310a1426A03781h1398b3705m2626A77311a93612d1816
11766b90289j7178a15940I3805d9891A4581f4196F6793J0361K3523l8569J2215
$$ plain form
11755 74323 -220853 54507 135512 24775 413091 -310665 -104101 88268 126136 51889 126798
11744 126798 -113994 37302 -92804 -151314 -290397 97395 245045 -197374 -4773 -197399 -109765
11733 -109765 58488 81545 34313 -43241 -54349 -238321 129787 95895 -292369 185428 353270
11722 353270 89140 -259093 228719 -237851 324865 93542 -217143 178822 -251055 -651207
11712 -651207 -32839 118358 33444 -31131 -128378 111966 155415 155978 57620 51117 223098
11701 223098 -133304 25675 -160020 -467908 128265 180160 260675 -239849 369383 -105964
11690 25654 212590 -233120 287869 207992 78188 186679 -246 -136347 101524 -37586 262568
11678 27748 -365691 132808 -4743 -115761 -114460 -173918 233937 199793 -9727 -297179 14405
$$ packed form
11755G4323b20853E4507Q1005B4775L88316c10665a04101H8268L7868E1889P4909
11744A26798a13994C7302i2804n8510j39083I7395J47650a97374d773j92626Q7634
11733a09765E8488K3057C4313d3241j1108j83972A29787l3892b92369A85428J67842
11722C53270H9140b59093B28719b37851C24865I3542b17143A78822b51055m00152
11712f51207c2839A18358C3444c1131r7247A11966M3449N63E7620o503J71981
11701B23098a33304B5675a60020l07888A28265N1895Q0515b39849C69383a05964
11690B5654J86936b33120B87869p9877G8188J08491b46j36101A01524c7586B62568
11678B7748c65691A32808d743j11018J301n9458B33937l4144i727k87452A4405
$$ plain form
11666 161796 -238919 -127793 -247862 8945 334133 119518 -28750 -261357 -255925 148152
11655 158269 232045 256432 11182 265543 73301 -159814 187996 342329 -172360 -317630
11645 -317630 193920 -133576 72223 -125631 72272 -150053 191809 -37792 86704 -178980
11634 82911 -169031 18001 -168365 -10062 88067 122473 141161 95702 -106261 18907 162861
11623 162861 170410 -326235 -48327 63384 -58359 331790 -214596 -124881 67780 320741 -209024
11611 -33590 133876 250752 46591 164373 143697 338405 185884 11642 -36828 -285424
11601 -285424 202482 98463 247334 408566 75796 142664 -192060 45328 189548 303127
11591 303127 -97425 122701 -144530 300059 -258418 -2915 -45425 457262 554239 170563
$$ packed form
11666A61796b38919J11126j20069H945L25188A19518b8750k32607N432A48152
11655A58269P3776K4387A1182K54361G3301a59814A87996J54333a72360j45270
11645c17630A93920a33576G2223a25631G2272a50053A91809c7792H6704a78980
11634H2911a69031A8001a68365a0062H8067L4406J8688m5459a06261A8907J43954
11623A62861P549c26235d8327F3384e8359C31790b14596Q9715F7780K52961b09024
11611c3590A33876J16876D6591J17782k0676J94708j52521A1642c6828k48596
11601b85424B02482I8463J48871J61232G5796O6868a92060D5328J44220J13579
11591C03127i7425A22701a44530C00059b58418b915m2510D57262R6977A70563
$$ plain form
11580 287022 167363 235588 -29284 455857 -311353 70810 41116 71423 -151984 242769
11569 151781 -320795 299153 -109039 50931 335625 220209 64516 -82780 218752 53616
11558 -49641 -15966 52533 149703 -33768 -9447 849 239004 -73559 291315 126149 199947 87184
11545 70956 -194324 -71564 71834 82806 -7677 -121057 147438 315666 264172 77159 336391
11534 336391 40901 88356 -141027 -219354 197640 -5425 -139854 119693 103142 -42829 -182985
11523 -182985 70683 514964 79424 72038 510487 -142827 252870 -67129 -66964 22436 176043
11512 176043 165798 -16037 -203468 217076 37477 -157077 129816 71126 50407 125417 486309
11501 486309 82509 146645 61918 -321521 18531 382593 -62948 -1734 35242 -166749 218790
$$ packed form
11580B87022j19659O8225b9284D55857c11353G0810k9694L0307a51984B42769
11569A51781c20795B99153a09039E0931K84694j15416F4516h2780B18752E3616
11558d9641a5966E2533R7170c3768i447H49K38155g3559B91315A26149P3798H7184
11545G0956a94324g1564G1834J0972g677j13380A47438J68228n1494G7159K59232
11534C36391D0901M7455a41027p8327A97640e425j34429A19693j6551d2829j40156
11523a82985G0683M44281G9424p386M38449a42827B52870f7129J65B2436J53607
11512A76043j0245a6037j87431B17076C7477a57077A29816n8690k0719P5010L60892
11501D86309H2509O4136F1918c21521A8531L64062f2948a734C5242a66749B18790
$$ plain form
11489 -35417 269301 211344 331491 189405 -16390 352987 196999 -30664 30668 47224 22155
11477 139532 66931 267446 207427 94011 115992 452837 -109449 154122 197668 466079
11467 466079 301135 29374 482339 331267 369988 -146126 8594 -115343 266531 106705
11456 234332 232779 105290 -198892 100702 -168943 -201590 111121 33662 -138799 -108916
11446 -108916 21281 98865 -88904 -220070 250905 41155 64454 73548 48951 97206 23951
11434 543102 -71692 -28423 249746 172584 -27823 -70456 268281 -252409 -319880 41904 49762
11423 49762 85635 239315 -74523 -79084 -33267 214176 -46157 248826 -206349 -129897 379825
11411 79113 141538 221677 70811 154813 -254026 89539 -24656 248252 22825 119870 161990
$$ packed form
11489c5417B69301n7957J20147j42086a6390C52987j55988c0664C0668J6556B2155
11477A39532F6931K00515o0019I4011K1981L36845a09449A54122M3546K68411
11467D66079j64944B9374M52965j51072L8721a46126H594a15343B66531A06705
11456B34332j553A05290a98892A00702a68943l2647A11121C3662a38799K9883
11446a08916B1281P7584h8904j31166B50905D1155K3299R094k4597M8255B3951
11434E43102g1692b8423B49746p7162b7823m2633B68281b52409o7471D1904P858
11423D9762L5873J53680g4523m561c3267B14176d6157B48826b06349P6452C79825
11411G9113O2425Q0139G0811Q4002b54026H9539b4656B48252B2825R7045M2120
$$ plain form
11400 161990 22022 -4912 178320 -133576 228559 -241553 168550 -9801 65888 34800 334224
11389 334224 248076 71231 -197352 -168294 -55496 -223538 -213853 -178715 259434 -133744 -87796
11378 -87796 153463 19230 58801 138093 -183295 233432 -2777 83678 -176994 181891 70552
11366 27683 -240705 225624 102971 -113812 63136 191253 100050 -104492 16515 83039
11356 83039 -79444 -298611 189168 43976 -42898 -127242 -113393 25327 240901 -48446 -208042
11345 -208042 282349 -1143 -631888 -288404 177298 -170847 198205 188270 -128715 -71751
11335 -71751 21363 -50247 206541 262090 -7020 9747 20065 167756 63576 -75715 -15919 12546
11322 97758 -134141 -136864 113205 79313 -77643 -45894 -230674 -78953 -80722 98294 126774
$$ packed form
11400A61990B2022d912A78320a33576B28559b41553A68550i801F5888l1088K99424
11389C34224q6148G1231a97352K9058e5496j68042R685L5138B59434a33744M5948
11378h7796A53463A9230L9571P9292a83295B33432b777H3678a76994A81891G0552
11366B7683b40705B25624A02971a13812F3136J28117r1203a04492A6515O6524
11356H3039g9444k19167A89168D3976d2898q4344J3849B5327K15574d8446j59596
11345b08042B82349a143o30745b88404A77298a70847A98205r935a28715N6964
11335g1751B1363e0247B06541N5549g020I747J0318J47691F3576g5715a5919A2546
11322I7758a34141k723A13205l3892g7643L1749j84780g8953j769I8294K8480
$$ plain form
11311 126774 31641 -118950 -217790 -177015 -173515 10301 126276 -67297 -41454 -148548 7040
11299 -17169 56481 165689 97595 -23112 100915 -387137 -73878 -101627 199915 -322026 -53731
11287 -170750 -228062 -119128 -261111 -26555 187390 -183558 35047 -88027 469934 -121453
11276 108592 74178 -116824 -247602 118587 -377268 49350 -213075 -122706 -41921 -1406 -182043
11265 -182043 206621 -300465 289313 -140245 163580 403447 111496 -14076 94115 480778
11255 480778 252986 -176939 -72461 -108238 -186067 38792 163987 -221000 -257644 231928
11244 59727 -147832 -95180 -28211 -190595 -16778 189191 -96946 -356012 3740 360628 -277184
11232 -15074 -55318 52697 -179967 155403 232164 359141 -13677 39041 18228 154707 232432
$$ packed form
11311A26774C1641a18950r8840M0775L500A0301J15975f7297K5843j07094G040
11299a7169E6481J09208o8094b3112A00915c87137g3878k7749A99915c22026e3731
11287a70750n7312J08934j41983b6555A87390a83558C5047h8027D69934a21453
11276A08592l4414a16824j30778A18587c77268D9350b13075R0369d1921a406j80637
11265a82043B06621c00465B89313a40245A63580K39867A11496a4076I4115L86663
11255D80778k27792a76939g2461l5777p7829C8792J25195b21000l6644B31928
11244E9727a47832N2652b8211j62384a6778A89191i6946k59066C740L56888b77184
11232a5074m0244E2697a79967A55403P6761J26977a3677C9041A8228J36479P7725
$$ plain form
11221 232432 -164574 109511 91444 -154200 -120722 -39288 -112950 221458 259511 -55989 -143558
11210 -143558 -28815 48759 -132667 199494 45868 -252364 266408 -214268 181880 -37473
11199 15219 -271581 74001 108844 24809 12250 168586 192616 -224925 -128507 33990 -136629
11187 -151089 100969 138429 128494 -200966 181582 88921 41235 -17751 -361670 319346 109452
11175 -101760 194802 -21396 -61079 -80047 -22351 66939 58518 403635 -88730 209039 -49616
11163 -200054 -109706 -369348 220364 -102724 46823 284887 -246513 251806 103015 203848
11153 203848 54155 202088 -109663 390898 38603 30198 -11286 87199 64424 103097 32015
11141 115917 -194110 164948 -16514 47412 74659 -130509 -374090 59600 -115827 -121172 -31078
$$ packed form
11221B32432a64574A09511j8067a54200L3478c9288p3662B21458L8053e5989q7569
11210a43558b8815D8759a32667A99494D5868b52364B66408b14268A81880c7473
11199A5219b71581G4001L4843B4809A2250J56336K4030b24925R6418C3990a36629
11187a51089A00969L7460r935b00966A81582H8921D1235a7751l43919C19346A09452
11175a01760A94802b1396l9683j8968b2351F6939q421L45117h8730B09039d9616
11163b00054R0348k59642B20364a02724D6823K38064b46513B51806A03015J00833
11153B03848E4155J47933a09663C90898C8603q405a1286H7199k2775L8673C2015
11141A15917a94110A64948a6514D7412K7247a30509k43581E9600a15827n345c1078
$$ plain form
11129 -333172 261732 -50404 199910 45032 234400 -106857 143255 184081 -218984 -27772
11118 -36072 -16857 22313 203306 -261284 356144 115590 398882 129166 260247 -181536
11107 290032 96648 -24249 49909 -41765 77468 -36410 148160 33962 -47830 212040 267043
11096 267043 327434 39926 314111 148194 253570 321698 -56798 109214 76519 131397 369574
11085 369574 -69429 228485 405066 -96584 -604 172751 106324 122688 149732 283612 404645
11074 404645 213038 81450 439325 289929 -99006 287411 426963 463448 284288 528184
11064 528184 622146 280509 410483 483104 605205 295417 847353 633371 715463 479088
11054 479088 1056034 575692 636279 760370 711850 865106 362417 891030 723455 816834
$$ packed form
11129c33172B61732e0404A99910D5032J89368a06857A43255M0826b18984b7772
11118c6072a6857B2313J80993b61284C56144A15590K83292A29166J31081a81536
11107B90032I6648b4249D9909d1765G7468c6410A48160C3962d7830B12040N5003
11096B67043O0391C9926K74185A48194J05376O8128e6798A09214l2695N4878K38177
11085C69574f9429B28485J76581i6584f04A72751o6427J6364K7044J33880J21033
11074D04645j91607H1450L57875j49396i9006B87411J39552L6485j79160K43896
11064E28184R3962B80509J29974P2621J22101B95417N51936k13982Q2092k36375
11054D79088N76946m80342O0587J24091m8520J53256C62417N28613j67575R3379
$$ plain form
11044 816834 867383 771427 909925 959121 659919 929865 757538 752631 724426 624718 903149
11033 903149 711078 713382 708311 814012 451334 605411 727341 845257 562803 543361
11023 543361 311715 838788 512266 578030 549351 666382 749006 657260 832803 710676
11013 710676 537264 475824 594882 827485 809627 788379 330030 495761 950191 930113
11003 930113 732966 660157 824087 399795 763710 674616 728630 457199 724791 860056
10993 860056 693403 778653 742684 914574 864292 912568 816258 895192 971534 999841 893990
10982 893990 1223324 1202000 1293421 1615925 1449003 1460683 1913602 2241766 2423713 2467892
10972 2467892 2452380 2683096 2722411 2536474 2348806 1943309 2089192 2167870 2029722 1505796
$$ packed form
11044H16834N0549r5956J38498M9196k99202K69946j72327m907k8205r9708K78431
11033I03149j92071K304n071J05701l62678J54077J21930J17916k82454j9442
11023E43361k31646N27073l26522O5764k8679J17031Q2624r1746J75543j22127
11013G10676j73412o1440J19058K32603j7858k1248C30030J65731M54430k0078
11003I30113j97147p2809J63930C99795L63915q9094N4014k71431K67592J35265
10993H60056j66653Q5250l5969J71890n0282M8276r6310P8934P6342K8307j05851
10982H93990L29334k1324R1421L22504j66922J1680M52919L28164J81947M4179
10972B467892j5512K30716L9315j85937j87668m05497J45883P8678j38148n23926
$$ plain form
10962 1505796 2082460 1422630 1564735 1805539 1645830 1542965 1794565 1479454 1665213
10953 1665213 1555264 1115172 971228 893418 1036674 570958 376630 965175 214960 486920
10943 486920 379800 214336 375671 427745 28096 129315 510537 154632 186578 133835
10933 133835 -70250 101256 143222 78494 198070 134658 318669 53118 -245112 -1958 48910
10921 257545 -62721 -145514 311983 154165 -197448 214871 -1341 -216248 -106373 16757
10910 233763 -39924 -33777 -146776 -163285 -2937 -23834 54514 44079 -172721 -164547 140927
10898 80054 -20913 -242038 284686 -34548 257309 104033 -51963 -69069 -239834 52505 39277
10887 39277 -15009 80131 156515 97378 -307772 -297512 -135262 -288112 -282391 -148301 -49944
$$ packed form
10962A505796N76664o59830J42105K40804j59709j02865K51600l15111J85759
10953A665213j09949m40092j43944p7810J43256m65716j94328N88545B14960K71960
10943D86920j07120j65464J61335N2074B8096J01219L81222A54632L1946n2743
10933A33835g0250A01256M1966o4728J19576o3412J84011E3118b45112a958D8910
10921B57545f2721q2793C11983A54165a97448B14871a341k14907a06373A6757
10910B33763c9924O147j12999j6509b937k0897E4514j0435a72721Q174A40927
10898H0054b0913k21125B84686c4548B57309A04033e1963j7106j70765E2505j3228
10887C9277a5009H0131P6384n9137c07772J0260a35262j52850N721J34090d9944
$$ plain form
10875 -349121 -74191 -142904 -197779 114921 -185090 379781 228857 249666 -127194 53151
10864 93830 -212295 -147421 -63509 288456 -4877 -82098 -132604 7152 -53537 -443775 -108209
10852 -55487 15911 -285750 4265 -124569 330240 179261 152284 -191293 213123 158570 180204
10841 180204 47637 -252146 -96430 -52656 48013 25365 -159674 -265225 -147709 53989 -260357
10829 -40952 -84077 188420 -99044 -214199 -167659 46112 -398571 155815 -95602 -99787 55929
10817 185702 -128522 142655 -199294 191583 285606 -79611 -239453 -70219 123881 29055
10806 46395 89163 213756 -245861 -91548 -63114 -171505 -173433 -142520 -171909 -140314 -200115
10795 -200115 277432 -21945 69483 -94616 121546 59911 -159512 -356600 98599 -166582
$$ packed form
10875c49121g4191o8713n4875A14921a85090C79781j50924K0809a27194E3151
10864I3830b12295O4874f3509B88456d877p7221n0506G152e3537l90238a08209
10852e5487A5911b85750D265a24569C30240j50979k6977a91293B13123n4553K1634
10841A80204D7637b52146i6430M3774D8013k2648a59674j05551J17516E3989b60357
10829d0952m3125A88420i9044j15155M6540D6112c98571A55815i5602m185E5929
10817A85702a28522A42655a99294A91583R4023g9611j59842g0219A23881B9055
10806D6395M2768J24593b45861i1548K8434j08391j928L0913k9389L1595n9801
10795b00115B77432b1945F9483i4616A21546E9911a59512j97088I8599a66582
$$ plain form
10784 -27560 -202247 -219955 27548 26210 -4968 -88286 -143091 -90992 98958 203506 155640 81082
10772 81082 -200769 54592 59606 -59253 -163452 -159385 48574 152342 180370 330056 100521
10760 -12583 -277030 -151821 -177728 -213540 95595 76124 -60971 -215596 63757 85361 308145
10749 308145 -370427 88097 19796 -183538 -125002 437002 -254700 151163 -4259 -383198
10739 -383198 -49968 -373970 229584 34567 -15023 187966 1866 246972 -70609 305944 -126913
10727 -55718 -36965 32220 53245 20154 44506 230030 105124 -217677 -94804 140992 412842
10716 412842 -280380 -33784 -111225 108021 279865 -82402 175243 -122678 -408773 -91131
10705 75358 109059 50455 16837 315312 57875 -60685 -49446 116234 -222021 -118545 -299740
$$ packed form
10784b7560j74687j7708B7548j338d968q3318n4805N2099I8958J04548m7866p4558
10772H1082b00769E4592N014e9253j04199M067D8574J03768K8028J49686A00521
10760a2583k64447J25209k5907l5812I5595j9471f0971j54625F3757K1604K22784
10749C08145c70427H8097A9796a83538N8536D37002b54700A51163d259l78939
10739c83198d9968l24002B29584C4567a5023A87966A866K45106g0609C05944a26913
10727e5718J8753C2220K1025B0154K4352J85524A05124b17677i4804A40992K71850
10716D12842b80380c3784p7441A08021J71844h2402A75243a22678k86095i1131
10705G5358L3701E0455A6837K98475E7875f0685J1239A16234b22021J03476j81195
$$ plain form
10694 -299740 123664 -145823 -278901 86088 -215632 -163709 89394 33605 -94045 153475
10683 -13764 -59531 171067 152251 -142890 -53409 -165458 -185853 -18210 -70035 78055 -90107
10671 246129 -260634 38905 -55346 -6422 238175 -572957 -14449 -331536 -101018 -199835 -94174
10659 52702 -33340 312177 84493 194641 -178745 -48621 288459 -117264 53983 -19601 -94151
10648 -94151 -299742 -76117 -124171 -78810 -163232 -28400 -112784 -69304 -272322 280351 -79334
10636 -137641 -126014 -126098 -43703 206308 200359 97634 119117 77712 110311 -5045 -294366 -57644
10623 90824 -2926 -270698 206116 -75396 54182 -77057 101023 -109577 46282 187075 9225
10611 -27945 58677 -25103 -9167 124659 -60296 -109454 -245138 -40029 -40858 -116678 -89047 220117
$$ packed form
10694b99740A23664a45823j33078H6088b15632N1923H9394C3605i4045A53475
10683a3764m5767A71067j8816a42890e3409j12049k0395a8210n1825G8055i0107
10671B46129b60634C8905e5346f422B38175e72957a4449l17087a01018r8817i4174
10659E2702c3340C12177H4493J10148a78745d8621B88459a17264E3983a9601p4550
10648i4151k05591g6117m8054M5361q4422b8400q4384M3480k03018B80351g9334
10636a37641J1627q4d3703B06308n949I7634K1483m1405L2599e045k89321e7644
10623I0824b926k67772B06116g5396E4182g7057A01023a09577D6282J40793I225
10611b7945E8677b5103i167A24659f0296m9158j35684d0029q29p5820K7631B20117
$$ plain form
10598 -162145 68281 163784 -18124 -394041 -194164 107832 174115 -73569 -137850 -93018 87391
10586 31055 142027 -23677 -74826 117787 -33385 -305228 173256 -197863 234072 207104
10576 207104 81575 79786 -265418 -77888 -131889 -286599 -103959 10408 -143290 276832 -234401
10564 183 82517 -324823 100034 -102426 -120587 -135895 -95586 -174549 -9091 95332 -75301 -56563
10552 -56563 -60399 -64497 -99312 -166772 94837 104300 21013 -256939 35522 298642 -146188 -279236
10540 -279236 46213 -255692 112922 -36457 -226998 -22821 -422300 25547 82597 -493549
10529 188893 -477546 -149527 -211970 192734 -119887 -91716 132681 221291 -15788 349471
10518 53836 106328 -258468 -267684 14644 241008 281925 -268949 -101201 1875 -51071 272956
$$ packed form
10598a62145F8281R5503a8124l75917a94164A07832O6283g3569o4281M4832H7391
10586C1055J10972b3677n1149A17787c3385k71843A73256a97863B34072k6968
10576B07104H1575j789b65418g7888n4001j54710a03959A0408a43290B76832b34401
10564A83Q2334c24823A00034a02426j8161j5308M0309p8963i091I5332g5301J8738
10552e6563l836m098l4815o7460I4837R463B1013b56939C5522K63120a46188j33048
10540b79236D6213b55692A12922c6457j90541b2821l99479B5547N7050d93549
10529A88893d77546a49527o2443A92734a19887K8171A32681Q8610a5788C49471
10518E3836N2492b58468r216A4644K26364M0917b68949a01201A875e1071B72956
$$ plain form
10506 11588 -127330 82834 -123347 -137246 64700 85904 -71787 79378 -304453 -109833 32581
10494 -185302 -215636 -462155 -160637 56793 92279 -118793 116830 104500 275724 -202729
10483 -297099 -278089 298249 194347 187511 195491 231244 51647 81633 526165 -297419 -202311
10472 -202311 -313485 83880 4802 220796 131281 -37076 145204 -204551 -162708 36275 125895
10461 125895 -116170 -1677 102441 -256809 -233866 -76675 -230976 23748 88645 55729 69440
10450 69440 18545 119016 -168388 -90418 241961 51238 -189727 -18746 69025 149113 247224
10439 247224 -28853 -185200 338982 239754 -239488 -174862 -81384 -128185 -76510 283264 -129262
10427 193958 -146066 -340281 -59781 38957 -49670 -229128 103269 -212547 -218382 254073
$$ packed form
10506A1588a27330H2834a23347j3899F4700K1204g1787G9378c04453a09833C2581
10494a85302l0334k46519a60637E6793L5486a18793A16830j2330J71224b02729
10483b97099J9010B98249j03902o836P980L5753E1647K9986M44532b97419R5108
10472b02311j11174H3880D802K15994q9515c7076A45204b04551M1843C6275Q9620
10461A25895a16170a677A02441b56809K2943g6675j54301B3748O4897l2916J3711
10450F9440A8545J00471a68388P7970B41961E1238a89727a8746F9025Q0088R8111
10439B47224b8853j56347C38982r9228b39488O4626h1384m6801N1675B83264a29262
10427A93958a46066j94215e9781C8957d9670j79458A03269b12547n835B54073
$$ plain form
10416 -127555 -48756 38276 -37308 41196 49851 -72467 -366878 -15703 15992 -115594 -222883
10405 -222883 313190 -104437 39970 293161 -20338 107617 -33864 190554 113538 5057 186587
10394 186587 157367 75583 48213 -20666 279728 40830 23424 210259 251062 -12877 355794
10382 199930 123615 122427 37068 293744 48887 203386 354299 239982 141012 119414 -71391
10370 584823 88749 6237 455210 431371 550427 262955 465462 306225 272056 174898 81420
10358 119029 -63429 213960 425498 43400 362367 224156 276076 834937 715149 475682
10348 475682 542380 -90431 196590 669507 539702 188589 93073 259270 -20706 60640
10337 15656 383606 534504 94466 126818 297388 44360 167 -117374 86624 -166400 81549
$$ packed form
10416a27555d8756C8276c7308D1196Q655g2467k94411a5703A5992a15594j07289
10405b22883C13190a04437C9970K53191b0338A07617c3864A90554p7016E057J81530
10394A86587k9220G5583k7370b0666B79728D0830j7406J86835M0803a2877C55794
10382A99930p6315j188C7068K56676D8887J54499J50913j14317r8970k1598g1391
10370E84823H8749F237M48973k3839J19056B62955K02507j59237l4169r7158H1420
10358A19029f3429B13960K11538D3400L18967j38211N1920N58861j19788k39467
10348D75682O6698i0431A96590M72917j29805A88589I3073J66197b0706F0640
10337A5656L67950J50898I4466L2352J70570D4360A67a17374H6624a66400H1549
$$ plain form
10325 441348 111989 212783 11598 238439 291854 -135193 266689 51216 200456 193169
10315 193169 82957 -120514 -55911 61186 117998 277801 35957 8325 -54439 81330 252093
10304 252093 -321555 125496 202672 -25809 343960 166366 48971 33569 21938 -22603 237570
10292 99923 42282 -223734 -33109 -161271 -97798 -70244 123942 145535 59795 -179861 169548
10280 -233493 -406865 -57771 122000 35105 -6642 22760 -6428 34623 56373 -222783 -123043
10269 -123043 -141999 92942 45407 -167221 -165128 -451553 320628 346798 501591 11661 356750
10258 356750 29337 -118089 345568 79226 151445 303783 16364 -42837 -185378 8981 -204917
10246 -58657 24366 -204355 213035 71339 -239387 219966 -210706 -226056 -417160 -233569
$$ packed form
10325D41348A11989J00794A1598K26841N3415a35193B66689E1216J49240p287
10315A93169H2957a20514e5911F1186N6812J59803C5957H325e4439H1330J70763
10304B52093c21555A25496P7176b5809C43960A66366D8971j5402j1631b2603B37570
10292I9923D2282b23734c3109j28162O3473K7554A23942K1593E9795a79861A69548
10280b33493j73372e7771A22000C5105f642B2760f428C4623K1750b22783R9740
10269a23043j8956I2942D5407a67221K093k86425C20628K6170J54793A1661L45089
10258C56750B9337a18089C45568G9226P2219J52338A6364d2837j42541H981b04917
10246e8657B4366b04355B13035G1339b39387B19966b10706j5350j91104J83591
$$ plain form
10236 -233569 -186430 -61287 -902 -80969 -77450 -159484 55178 -43428 209317 -69483 273529 123487
10223 69747 80009 116965 135391 126913 141033 -256721 10732 -42311 -216553 -190860 -82257
10211 109013 -137210 -130912 219236 356015 31500 -312912 249254 -185535 -48570 -168462
10201 -168462 245796 -279221 -57642 -75272 -136022 140383 285876 -435 -243003 8477 217276
10190 217276 -299029 -233964 -526302 -204862 111785 27137 7017 -296865 -178515 -371440
10180 -371440 -221868 -96789 -346133 -38934 -174614 -128319 160739 -50096 -249131 71207
10169 -54050 -84819 -48037 -133184 86721 -371754 -189166 171687 122254 74152 -256126 75387
10157 -11451 494308 113894 51564 -48570 -255505 -51180 39781 -75610 5436 -75374 -396090
$$ packed form
10236b33569M7139f1287i02q0067L519q2034E5178d3428B09317f9483B73529A23487
10223F9747J0262L6956J8426q478J4120b56721A0732d2311j74242K5693h2257
10211A09013a37210O298B19236J36779C1500c12912B49254a85535d8570j19892
10201a68462B45796b79221e7642j7630o0750A40383J45493d35k42568H477K08799
10190B17276b99029O5065k92338b04862A11785B7137G017b96865J18350j92925
10180c71440J49572i6789k49344c8934j35680M6295A60739e0096j99035G1207
10169e4050l0769L6782q5147H6721c71754J82588A71687m9433m8102b56126G5387
10157a1451D94308A13894E1564d8570k06935e1180C9781g5610E436g5374l20716
$$ plain form
10146 -396090 -17459 -84334 75707 262408 23732 -39781 -80738 -96065 45274 139087 198243
10135 198243 -178887 -22903 79839 61437 -65824 -414165 -343863 -263680 -279906 51583 271982
10124 271982 -263850 -295492 80950 133551 -319114 -211915 -270461 -200001 -118794 9687 24673
10113 24673 63795 111524 244338 30834 50668 -284870 92744 -251921 241471 73984 -194811
10101 113424 -388701 62668 273614 -99886 -210028 -226770 75362 202445 -63069 -42967 -174314
10090 -174314 85190 -137740 -188096 -299062 -338815 -78440 69886 279972 -141981 176502
10079 129372 -145220 91610 -236888 -7395 -351776 -239264 -18700 39530 -29880 23503 65967
10068 65967 -150653 139547 -337614 -116618 17978 -40610 -18123 -15930 -272693 -126997 -292570
$$ packed form
10146c96090a7459o6875G5707J86701B3732c9781m0957j5327D5274R3813N9156
10135A98243a78887b2903G9839j8402f5824l48341P0302Q0183j6226E1583K20399
10124B71982b63850l1642H0950N2601c19114J07199n8546P0460Q1207I687J4986
10113B4673L9122M7729J32814C0834J9834b84870I2744b51921B41471G3984a94811
10101A13424c88701F2668K10946i9886j10142j6742G5362J27083f3069K0102j31347
10090a74314H5190a37740n0356j10966l9753g8440F9886K10086a41981A76502
10079A29372a45220I1610b36888g395l44381J12512a8700C9530b9880B3503M2464
10068F5967a50653A39547c37614a16618A7978d0610a8123K193k56763a26997j65573
$$ plain form
10057 -292570 165314 -111322 -378058 121452 -80202 -239402 62725 -117952 53956 -19366
10046 164555 17310 -135613 265000 121165 -30841 -16015 -10478 -92254 -96124 24697 -241497
10034 62049 -246608 185190 -146820 34129 183907 -131169 -173941 81649 -402407 140612
10023 -113675 146467 -145980 -265670 -137637 -36443 -82366 -371416 -232549 -50568 42241
10012 -156903 46439 -87141 -150866 -13874 -199396 37698 49559 -127892 50852 82650 -60155
10000 -91387 -308170 196662 -332112 -40929 -142981 -111582 -136926 -246039 -181797 69870 188836
9989 188836 -8525 -94403 -20192 -202902 269 14214 64885 -187543 -58692 814 243706 -68247
9976 -137375 36166 -120647 -162161 -284309 -51000 71053 480507 -7212 200913 -81154 -295704
$$ packed form
10057b92570A65314a11322k66736A21452h0202j59200F2725a17952E3956a9366
10046A64555A7310a35613B65000A21165c0841J4826N537q1776l870B4697b41497
10034F2049b46608A85190a46820C4129J49778a31169m2772H1649d02407A40612
10023a13675A46467a45980j19690J28033c6443m5923k89050J38867e0568D2241
10012a56903D6439h7141o3725a3874j85522C7698J1861a27892E0852L1798f0155
10000i1387k16783A96662c32112d0929j02052L1399k5344j09113O4242F9870J18966
9989A88836h525q5878b0192j82710B69J3945N0671a87543e8692H14K42892f8247
9976a37375C6166a20647m1514j22148e1000G1053M09454g212B00913h1154k14550
$$ plain form
9965 -295704 -24616 -59213 117592 -103778 -236528 218276 -192750 47493 -144515 -125702
9955 -125702 -91884 -144392 -97898 -137016 250456 312969 -473544 -256320 -174397 -335650 -192406
9944 -192406 -144643 -110428 -335625 -102662 -16295 -115691 -119389 -39514 -78130 -374103 -40575
9932 -113178 -110803 117802 -188217 -138969 -47620 44230 222214 352644 127105 5216 21579
9921 21579 170211 88198 87007 -154125 -273220 5377 256961 -185867 292008 7549 -65474
9909 -227634 -84202 161993 -100025 -138565 -98239 25854 -268200 -30643 -128161 -126862 31243
9897 -20454 -136534 122900 -487956 263058 -172697 111050 -393575 161146 -286284 -447649
9887 -447649 -316410 -238068 227534 -20496 211084 128372 -61106 132460 66310 -222679 -179059
$$ packed form
9965b95704b4616l4597A17592a03778j32750B18276a92750D7493a44515J8813
9955a25702L3818n2508M6494l9118B50456O2513d73544K17224Q1923j61253J43244
9944a92406M7763L4215k25197a02662a6295r9396l698c9514l8616k95973d0575
9932a13178K375A17802a88217M9248d7620D4230J77984J30430A27105E216J6363
9921B1579J48632q2013j191a54125j19095E377K51584a85867B92008G549f5474
9909b27634h4202A61993a00025l8540M0326B5854b68200c0643r7518J299C1243
9897b0454j16080A22900d87956B63058a72697A11050c93575A61146b86284j61365
9887d47649J31239P8342B27534b0496B11084q2712f1106A32460o6150b22679M3620
$$ plain form
9876 -179059 2406 -83402 232890 -187997 -333081 -278737 -70233 -188750 -162749 -158005 -426978
9865 -426978 -426629 14365 -27915 -73147 -28621 70071 77306 -318975 168855 -66094 -339743 -169424
9852 203189 -51474 -40100 160312 -291127 -166127 117440 160610 -172577 -351372 122763
9841 -196539 346335 -360073 -13908 153776 -282676 -197690 -114923 66282 -428828 -158752
9830 182420 -292572 -47196 373021 47172 -172870 -13468 -161292 -235433 -49615 -46735 -159066
9819 -159066 64487 47247 -300446 239486 44548 47649 -194640 122219 -45081 13878 243077
9808 243077 35019 41895 -263739 163009 91774 -136183 100007 -238516 237642 17475 -179668
9796 83979 244161 -140046 -387436 -329210 -287593 -182269 -237436 -134440 -65396 29068 -226274
$$ packed form
9876a79059B406h3402B32890a87997j45084N4344g0233j18517K6001M744k68973
9865d26978L49A4365b7915m5232b8621G0071P235c18975A68855f6094k73649a69424
9852B03189e1474J1374A60312b91127J25000A17440M3170a72577j78795A22763
9841a96539C46335c60073a3908A53776b82676Q4986Q2767F6282d28828a58752
9830A82420b92572d7196C73021D7172a72870a3468j47824p4141d9615K880j12331
9819a59066F4487j7240c00446B39486D4548L101a94640A22219d5081A3878K29199
9808B43077C5019O876b63739A63009p1235a36183A00007b38516B37642A7475a79668
9796H3979J60182a40046k47390N8226M1617J05324n5167J02996f5396B9068b26274
$$ plain form
9784 -106587 -204274 113665 51436 -272012 38605 -125276 163140 -132945 -31584 -14003 80792
9772 -58346 -26400 -379254 -7766 -407138 58545 -8138 79405 169770 -21197 -84747 -123803 -204221
9760 -204221 -28287 -185925 -108620 -72722 -569010 -237561 -12125 -46683 71100 85764 -197297
9748 53707 -80921 40554 -73176 285846 -69166 40779 -299652 -182558 -18378 160113 251455
9737 251455 184598 -115280 -172901 -228871 -236881 -13202 45682 19269 121391 -114735 3825
9725 -64786 -290192 -182387 -127117 -72424 215422 -146761 52205 -161515 265088 -77784 -90780
9714 -90780 -160240 -489909 -60874 47476 -179318 -413289 10623 123560 -150555 139518 -226422
9702 -177967 224466 130771 425099 -100934 -34395 -18623 2989 -135003 -238438 63333 -1558
$$ packed form
9784a06587r7687A13665E1436b72012C8605a25276A63140a32945c1584a4003H0792
9772e8346b6400l52854g766l99372E8545h138G9405R0365b1197o3550l9056q0418
9760b04221b8287j57638P7305L5898m96288b37561a2125l4558G1100J4664a97297
9748E3707h0921D0554g3176B85846f9166D0779b99652J17094a8378A60113R1342
9737B51455o6857a15280n7621n5970q010a3202D5682A9269J02122a14735C825
9725f4786k25406J07805N5270N4693B15422a46761E2205a61515B65088g7784j2996
9714i0780o9460l29669f0874D7476a79318k33971A0623J12937a50555A39518b26422
9702a77967B24466r3695K94328a00934c4395J5772B989a35003j03435F3333a558
$$ plain form
9690 62080 162025 -153949 102964 -211204 -130868 -126362 96275 -116888 -143899 10653 -120083
9678 -200562 -143463 -198655 -283387 -317602 57295 -204669 115786 -25009 -14729 114222 -176987
9666 -66241 -271984 -406480 -276691 -128671 90748 -43696 -246742 -125121 -489 160930 -179098
9654 151578 -178997 -410485 -117290 -161576 -72496 111471 -169108 174650 -100668 -61459
9644 -61459 199557 -289287 112357 -187279 147279 -64123 -375528 -17600 89464 -349274
9633 -44743 127513 2352 -50630 -68028 -89986 -397773 97312 -105309 -186839 -112705 73244
9621 -76984 -115941 49535 -217505 5560 -146795 -207840 169857 300058 55767 11214 520123
9610 520123 -270204 -302364 68114 35453 46870 16672 -12120 -54078 -270339 -91625 -165761
$$ packed form
9690F2080R9945a53949A02964b11204Q0336M506I6275a16888k7011A0653a20083
9678b00562N7099n5192q4732l4215E7295b04669A15786b5009J0280A14222a76987
9666f6241k05743j34496J29789a28671I0748d3696k03046J21621d89A60930a79098
9654A51578a78997k31488a17290m4286g2496A11471a69108A74650a00668L9209
9644f1459A99557b89287A12357a87279A47279f4123l11405a7600H9464c49274
9633d4743A27513B352e0630j7398k1958l07787I7312a05309q1530P4134G3244
9621g6984l8957D9535b17505E560a46795o1045A69857J30201E5767A1214N08909
9610E20123b70204l2160F8114l2661J1417A6672a2120m1958k16261i1625p4136
$$ plain form
9599 -165761 36257 -133767 136129 -103562 2096 -42370 -85087 -448043 10648 -333316 -193817
9588 -193817 83938 33355 -30316 87415 310295 -328760 -242509 -152459 -253459 -52820 -155754
9577 -155754 12584 -210123 -3301 -208428 338034 -135747 -190671 -83300 -123225 -35934 20528
9565 -171747 -251815 -25216 33563 73451 -111228 -234478 -346787 -979 377543 -81280 82228
9553 -329041 195282 -112513 276168 -144790 -33654 78429 -6747 -169854 -42328 879 -184571
9541 262475 -15293 13745 -70583 83050 -264784 46083 6359 -282887 -383409 -34721 216325
9529 106836 -115566 -37087 -310525 -44942 29375 27974 -190268 -389380 -160778 -109179 112700
9517 339438 62532 -316874 149298 -2849 99648 -260951 -62147 -28951 -207732 -225763 -195104
$$ packed form
9599a65761C6257a33767A36129a03562B096d2370m2717l62956A0648c33316J39499
9588a93817H3938C3355c0316H7415K22880c28760Q6251R0050j01000e2820j02934
9577a55754A2584b10123c301k05127C38034a35747n4924h3300l9925c5934B0528
9565a71747q0068b5216C3563L9888a11228j23250j12309i79C77543h1280H2228
9553c29041A95282a12513B76168a44790c3654G8429f747j63107d2328H79a84571
9541B62475a5293A3745g0583H3050b64784D6083F359b82887j00522c4721B16325
9529A06836a15566c7087k73438d4942B9375j401a90268j99112a60778N1599A12700
9517C39438F2532c16874A49298b849I9648b60951f2147b8951j78781j8031L0659
$$ plain form
9506 -195104 173899 74497 -40355 -307337 -361861 158636 48760 65693 -99792 -162376 -470544
9495 -470544 116926 -206595 -292777 -152546 156630 68209 -48852 -214297 2510 91178 -135034
9483 177646 -117380 -31481 165757 -211304 -238431 57190 228202 -17257 137832 -138732
9472 -269305 -634537 161586 148856 -353772 94774 16552 -205389 -540835 -242314 35311
9461 2914 -74787 -277169 -277052 -25384 -124562 -18398 107256 -40974 315761 -178030 -252578 78442
9448 5075 -143287 107091 -12213 243155 13660 54724 93581 -37606 -75543 285829 58416
9436 18677 -29448 155117 60153 98053 -101507 -179270 147332 -19021 75637 -157512 -79773
9425 -79773 -69700 -81201 -57844 308123 -55263 -64742 53412 126291 -108521 165146 -155749
$$ packed form
9506a95104A73899G4497d0355k66982n4524A58636D8760J6933i9792o2584l08168
9495d70544A16926b06595q6182J40231A56630F8209d8852j65445B510Q8668a35034
9483A77646a17380c1481A65757b11304k7127E7190J71012a7257A37832a38732
9472b69305l65232A61586j2730c53772I4774A6552b05389l35446b42314C5311
9461B914g4787k02382J17b5384r9178a8398A07256d0974C15761a78030p4548G8442
9448E075a43287A07091a2213B43155A3660M1064L8857c7606l7937B85829E8416
9436A8677b9448A55117F0153L7900a01507p7763A47332a9021G5637a57512P7739
9425g9773J0073j1501K3357C08123e5263r479E3412P2879a08521A65146a55749
$$ plain form
9413 -188908 -256077 -58465 -39545 -162917 -85952 -87489 -326501 -315251 16034 -169590 110250
9401 -224908 -258731 -60118 -158568 -309257 -35743 -158503 -214228 236792 -361133 -172283 175423
9389 74154 -262354 26150 27535 -379598 232524 -102768 -227132 195626 -103747 45205 -182208
9377 -203982 -4745 -162893 59462 -205214 -146110 -165469 -262507 132566 89756 -215359 -150623
9366 -150623 -270716 278140 -67014 -5170 184436 -86893 103243 -96042 -82485 -189505 7841
9354 -57010 100199 338623 -158351 -30334 132542 -102068 -322204 -432187 285148 -465068
9343 -136305 -136023 344608 -274449 -269842 42294 49374 39563 -14805 -78230 -39292 108467 -88603
9330 -133952 91654 34469 -33679 222174 -180842 146423 -370017 -406204 -14912 -156260 -296048
$$ packed form
9413a88908o7169e8465J8920j23372P6965j537k39012J1250A6034a69590A10250
9401b24908l3823f0118r8450j50689c5743j22760n5725B36792c61133a72283A75423
9389G4154b62354B6150J385c79598B32524a02768j24364A95626a03747D5205a82208
9377b03982d745j58148E9462b05214N9104j9359r7038A32566m2810b15359O4736
9366a50623j20093B78140f7014e170A84436h6893A03243i6042J3557j07020G841
9354e7010A00199K38424a58351c0334A32542a02068k20136j09983B85148d65068
9343a36305K82C44608b74449M607D2294P080r811a4805o3425L8938A08467h8603
9330a33952I1654C4469c3679B22174a80842A46423c70017l6187a4912j41348j39788
$$ plain form
9319 -296048 -174909 -227135 -281828 -305251 -320630 -1166 -191663 -97313 -262759 -67993 -171597
9308 -171597 73682 286711 -200031 -259866 -72340 -183559 161059 134878 -927 -131554 -194797
9297 -194797 -103234 44024 34621 -55858 -471431 141478 -123132 201010 -96742 -176809 3015
9285 -138433 -122568 -30519 -131430 -78062 -33347 49249 68477 168007 -98554 -301090 170826
9273 137533 -8203 89130 121060 -304295 44726 -340128 35977 138693 291659 -49135 7415
9261 -228289 -81835 -288850 -38632 -160493 177932 -167985 -163478 -80592 -23301 -8572 108857
9249 -111488 -22515 -144950 -423374 -262106 -214808 5085 -103065 -40313 42854 -109464 168794
9237 -89035 -109930 -148376 162065 -167280 -89857 -81329 -424416 -45199 -21087 -25043 66304 -3712
$$ packed form
9319b96048J21139n2226n4693k3423j5379a166j90497R4350j65446f7993j03604
9308a71597G3682K13029b00031n9835g2340j11219A61059k6181i27j30627o3243
9297a94797R1563D4024r403e5858m15573A41478a23132B01010i6742q0067C015
9285a38433J5865c0519j00911N3368c3347D9249J9228R9530i8554k02536A70826
9273A37533h203H9130L1930c04295D4726c40128C5977J02716J52966d9135G415
9261b28289h1835k07015c8632j21861A77932a67985M507h0592b3301h572A08857
9249a11488b2515j22435k78424J61268M7298E085a03065d0313D2854a09464A68794
9237h9035k0895l8446A62065a67280P7423Q528l43087d5199b1087l956F6304c712
$$ plain form
9224 -199683 284042 40490 -268323 214518 113928 6024 11590 145335 -53746 28024 -52629
9212 -12269 -129300 -237576 207397 -188089 -30087 48499 81845 -57211 86347 -114151 -168372
9201 -168372 100029 12334 40035 201597 240389 -54901 205375 163400 321830 -308362 -174900
9190 -174900 -327228 204116 187686 -204523 -207912 35663 193079 113164 -173870 59774 -3761
9178 -270906 -375023 78477 -266720 -214292 -308018 -256702 130120 -71044 97846 -122379 107755
9166 94505 -110149 -76535 227191 -434288 -215118 -119406 236139 -152481 247509 -153120
9155 -180065 -74716 125004 -144582 -191167 17562 9078 64613 -144607 119873 -45220 -83298
9144 -83298 -132962 -234474 -84253 50391 263804 4017 -36110 323874 -36599 -60497 -52246 129062
$$ packed form
9224a99683B84042D0490b68323B14518j00590F024N566J33745e3746B8024e2629
9212a2269j17031j08276B07397a88089c0087D8499L3346e7211H6347a14151n4221
9201a68372A00029A2334K7701J61562L8792e4901B05375m1975J58430c08362J33462
9190a74900j52328B04116j6430b04523l389C5663J57416p9915a73870E9774c761
9178b70906j04117G8477b66720N2428r3726N1316A30120g1044I7846a22379A07755
9166I4505a10149L3614B27191d34288b15118R5712B36139a52481B47509a53120
9155a80065g4716A25004a44582m6585A7562q484N5535a44607A19873d5220l8078
9144h3298m9664j01512h4253E0391K13413D017c6110C23874c6599k3898Q251A29062
$$ plain form
9131 -335318 -176222 -59032 90437 -205955 -327552 205840 101818 -492454 -353809 -132368
9120 -232942 15039 17501 -185552 -629423 162751 15612 102870 207590 -47067 -14193 -138835
9109 -138835 221336 79773 63794 -43633 -204103 111728 -9450 -312465 -218490 222133 -360
9097 -214472 24977 94828 -37493 -115169 -159824 -85724 -167755 -68210 -140407 -196033 -273954 159973
9084 224343 -238808 -310590 -59988 -74267 51322 -36640 -26145 -185936 57514 60975 61612 -25886
9071 -123684 207833 57499 -271948 -472781 -167304 27373 -47534 96810 -372498 -276007 21002
9059 -51803 -329616 394344 46273 -71520 -69644 -164542 152873 -192500 81528 -292494 -175272
9048 -175272 -267835 24216 -336867 115667 -61738 34014 118255 -136604 -282992 -386303 53269
$$ packed form
9131c35318J59096e9032I0437b05955j21597B05840A01818d92454J38645a32368
9120b32942A5039K462a85552m43871A62751A5612Q7258J04720d7067a4193j24642
9109a38835B21336G9773j5979d3633j60470A11728i450l03015R3975B22133c60
9097b14472B4977O9851c7493p7676m4655P4100q2031f8210p2197n5626p7921A59973
9084B24343b38808p1782e9988j4279E1322c6640J0495j59791E7514L461O37b5886
9071a23684B07833E7499b71948k00833a67304B7373d7534I6810c72498R6491B1002
9059e1803k77813C94344D6273g1520J876r4898A52873a92500H1528b92494J17222
9048a75272r2563B4216c36867A15667f1738C4014Q4241a36604j46388j03311E3269
$$ plain form
9036 -84029 -200033 -82207 111847 149095 184527 -171776 63568 -226714 -268454 -20149 -380670
9025 -380670 -98323 -125673 -206809 -217901 167558 -45944 -313130 159837 -139900 245335 -41658
9013 -113490 117860 -44727 -35565 135506 -134832 -153823 186624 -27369 197762 -268731 82167
9001 -47927 -265821 -82386 -38827 -273889 147197 -93079 -268979 41418 -420445 33768 241123
8990 241123 -174484 -14061 -103910 -73692 -42822 -106748 129098 -136284 -236245 -103937 231210
8978 -258766 -170955 21308 110769 -378614 4825 -79818 -276927 433421 197969 -207771 103847
8966 -34940 -155802 226813 256345 65939 -410666 -188159 34293 -55187 -63899 -96776 -168167
8955 -168167 64456 80142 -138650 41214 28957 -63673 65296 -120951 34712 77674 -443891
$$ packed form
9036h4029j16004h2207A11847L7248L5432a71776F3568b26714m1740b0149l60521
9025c80670i8323k7350q1136j1092A67558d5944k67186A59837a39900B45335d1658
9013a13490A17860d4727R162A35506a34832j8991A86624b7369A97762b68731H2167
9001d7927k17894h2386c8827k35062A47197i3079j75900D1418d20445C3768K07355
8990B41123a74484a4061q9849L0218L0870o3926A29098a36284r9961a03937B31210
8978b58766Q7811B1308Q9461c78614D825g9818j97109D33421A97969b07771A03847
8966c4940j20862B26813K9532F5939d10666a88159C4293e5187q712l2877p1391
8955a68167F4456J5686a38650D1214j2257f3673F5296a20951C4712M2962d43891
$$ plain form
8943 -43262 6874 -157754 72037 208156 -136804 -3787 126237 -53422 537075 340516 149742
8931 78113 189443 117607 81886 199421 486288 525023 1037565 2286109 4974788 9764643
8921 9764643 5122590 2509016 2150063 1418879 604904 268446 300450 577870 214344
8911 105117 210736 431260 299512 -14660 23022 55653 -49477 220337 89630 88137 -383281
8899 -378161 72129 62656 168592 10352 323224 -75386 -73290 119740 36756 209474 233691
$$ packed form
8943d3262F874a57754G2037J36119a36804c787A26237e3422E37075j96559A49742
8931G8113J11330p1836l5721J17535K86867L8735N12542J248544K688679M789855
8921I764643m642053B509016l58953p31184F04904B68446L2004K77420B14344
8911A05117J05619K20524j31748a4660B3022L2631d9477B20337H9630j493c83281
8899c78161G2129r473J05936A0352L12872g5386K096A19740C6756J72718K4217
$$ [...]
##END NTUPLES=NMR SPECTRUM
##END=
