
##TITLE=AC1302_PERAH12114_6608382_PZ89wDSsjw
##JCAMPDX= 6.0         $$ Bruker NMR JCAMP-DX V2.0
##DATA TYPE= NMR SPECTRUM
##DATA CLASS= NTUPLES
##ORIGIN= BRUKER
##OWNER= Administrator
$$ 1.72 TOPSPIN		Version 2.1
$$ 2012-08-15 19:12:48.625 -0500  Administrator@TOPSPIN
$$ Compression mode = diff/dup
##.OBSERVE FREQUENCY= 400.02188249412
##.OBSERVE NUCLEUS= ^1H
##.ACQUISITION MODE= SIMULTANEOUS (DQD)
##.ACQUISITION SCHEME= undefined
##.AVERAGES= 8
##.DIGITISER RES= 22
##SPECTROMETER/DATA SYSTEM= spect
##.PULSE SEQUENCE= zg30
##.SOLVENT NAME= COFFEE_meoh
##.SHIFT REFERENCE= INTERNAL, COFFEE_meoh, 1, 14.98509
##AUDIT TRAIL= $$ (NUMBER, WHEN, WHO, WHERE, PROCESS, VERSION, WHAT)
$$ ##TITLE= Audit trail, TOPSPIN		Version 2.1
$$ ##JCAMPDX= 5.01
$$ ##ORIGIN= Bruker BioSpin GmbH
$$ ##OWNER= Administrator
$$ $$ C:\Bruker\TOPSPIN/data/COFFEE/nmr/AC1302_PERAH12114_6608382_PZ89wDSsjw/50/pdata/1/auditp.txt
$$ ##AUDIT TRAIL=  $$ (NUMBER, WHEN, WHO, WHERE, PROCESS, VERSION, WHAT)
(   1,<2012-08-15 19:12:14.062 -0500>,<Administrator>,<TOPSPIN>,<go>,<TOPSPIN 2.1>,
      <created by zg
	started at 2012-08-15 19:11:05.328 -0500,
	POWCHK enabled, PULCHK disabled,
       configuration hash MD5:
       6B 1B 68 BB D9 2E 58 E2 7F 35 AD 54 07 DF 0E 41
       data hash MD5: 64K
       AE 32 DD 69 97 82 BD 29 43 75 F9 F6 14 EE 79 3C>)
(   2,<2012-08-15 19:12:39.484 -0500>,<Administrator>,<TOPSPIN>,<proc1d>,<TOPSPIN 2.1>,
      <Start of raw data processing
       efp LB = 0 FT_mod = 6 PKNL = 1 PHC0 = 0 PHC1 = 0 SI = 32K 
       data hash MD5: 32K
       D9 92 06 FD FB 70 A0 C4 29 F6 81 9D 30 E7 41 19>)
(   3,<2012-08-15 19:12:40.312 -0500>,<Administrator>,<TOPSPIN>,<proc1d>,<TOPSPIN 2.1>,
      <pk PHC0 = 176.8524 PHC1 = 0 
       data hash MD5: 32K
       6B D8 63 98 00 D1 F4 D6 12 52 2C 8C A4 3C 51 6B>)
(   4,<2012-08-15 19:12:40.781 -0500>,<Administrator>,<TOPSPIN>,<proc1d>,<TOPSPIN 2.1>,
      <abs ABSG = 1 
       data hash MD5: 32K
       64 6F 5C 78 DB D4 6C B1 B6 64 6F C2 69 DA 40 21>)
(   5,<2012-08-15 19:12:41.156 -0500>,<Administrator>,<TOPSPIN>,<proc1d>,<TOPSPIN 2.1>,
      <abs ABSG = 2 
       data hash MD5: 32K
       04 E0 2A FC CC A5 EF EC 4A 2E 8C 16 25 A2 0C 13>)
(   6,<2012-08-15 19:12:41.531 -0500>,<Administrator>,<TOPSPIN>,<proc1d>,<TOPSPIN 2.1>,
      <abs ABSG = 3 
       data hash MD5: 32K
       F8 37 24 B0 79 04 F0 61 96 B1 EA 1E DF FA EF 9C>)
(   7,<2012-08-15 19:12:41.890 -0500>,<Administrator>,<TOPSPIN>,<proc1d>,<TOPSPIN 2.1>,
      <abs ABSG = 4 
       data hash MD5: 32K
       17 E4 40 A3 2C 85 B2 C4 46 D7 F8 0B 94 72 70 01>)
(   8,<2012-08-15 19:12:42.281 -0500>,<Administrator>,<TOPSPIN>,<proc1d>,<TOPSPIN 2.1>,
      <abs ABSG = 5 
       data hash MD5: 32K
       E1 49 D2 EE D9 4A AD 3F B1 61 AF BC F6 ED A9 26>)
$$ ##END=
$$ 
$$ $$ hash MD5
$$ $$ DC 4E B7 A5 A3 DA 1B DC 0C 9A CA 73 4A 42 ED C4
##$RELAX= 
##$RELAX= 
##$RELAX= 
##$RELAX= 
##$RELAX= 
##$RELAX= 
##$RELAX= 
$$ Bruker specific parameters
$$ --------------------------
$$ [...]
##$TP= (0..7)
150 150 150 150 150 150 150 150
##$TP07= 0
##$TPNAME0= <>
##$TPNAME1= <>
##$TPNAME2= <>
##$TPNAME3= <>
##$TPNAME4= <>
##$TPNAME5= <>
##$TPNAME6= <>
##$TPNAME7= <>
##$TPOAL= (0..7)
0.5 0.5 0.5 0.5 0.5 0.5 0.5 0.5
##$TPOFFS= (0..7)
0 0 0 0 0 0 0 0
##$TUNHIN= 0
##$TUNHOUT= 0
##$TUNXOUT= 0
##$USERA1= <user>
##$USERA2= <user>
##$USERA3= <user>
##$USERA4= <user>
##$USERA5= <user>
##$V9= 5
##$VALIST= <valist>
##$VCLIST= <CCCCCCCCCCCCCCC>
##$VD= 0
##$VDLIST= <DDDDDDDDDDDDDDD>
##$VPLIST= <PPPPPPPPPPPPPPP>
##$VTLIST= <TTTTTTTTTTTTTTT>
##$WBST= 1024
##$WBSW= 4
##$XGAIN= (0..3)
0 0 0 0
##$XL= 0
##$YL= 0
##$YMAX_a= 465321
##$YMIN_a= -601651
##$ZGOPTNS= <>
##$ZL1= 120
##$ZL2= 120
##$ZL3= 120
##$ZL4= 120
##$ABSF1= 14.98509
##$ABSF2= -5.573092
##$ABSG= 5
##$ABSL= 3
##$ALPHA= 0
##$AQORDER= 0
##$ASSFAC= 0
##$ASSFACI= 0
##$ASSFACX= 0
##$ASSWID= 0
##$AUNMP= <proc_prof1d_extract_pilot.lims>
##$AXLEFT= 0
##$AXNAME= <>
##$AXNUC= <1H>
##$AXRIGHT= 0
##$AXTYPE= 0
##$AXUNIT= <>
##$AZFE= 0.1
##$AZFW= 0.1
##$BCFW= 0
##$BC_mod= 0
##$BYTORDP= 0
##$COROFFS= 0
##$CY= 15
##$DATMOD= 1
##$DC= 0
##$DFILT= <>
##$DTYPP= 0
##$F1P= 0
##$F2P= 0
##$FCOR= 0.5
##$FTSIZE= 32768
##$FT_mod= 6
##$GAMMA= 0
##$GB= 0
##$INTBC= 1
##$INTSCL= 1
##$ISEN= 128
##$LB= 0
##$LEV0= 0
##$LPBIN= 0
##$MAXI= 10000
##$MC2= 0
##$MEAN= 0
##$ME_mod= 0
##$MI= 0
##$NCOEF= 0
##$NC_proc= -8
##$NLEV= 6
##$NOISF1= 0
##$NOISF2= 0
##$NSP= 0
##$NTH_PI= 0
##$NZP= 0
##$OFFSET= 14.98509
##$PC= 1
##$PHC0= 176.8524
##$PHC1= 0
##$PH_mod= 1
##$PKNL= yes
##$PPARMOD= 0
##$PPDIAG= 0
##$PPIPTYP= 0
##$PPMPNUM= 2147483647
##$PPRESOL= 1
##$PSCAL= 4
##$PSIGN= 0
##$PYNMP= <proc.py>
##$REVERSE= no
##$SF= 400.02
##$SI= 32768
##$SIGF1= 0
##$SIGF2= 0
##$SINO= 400
##$SIOLD= 32768
##$SPECTYP= <>
##$SREGLST= <1H.CDCl3>
##$SSB= 0
##$STSI= 32768
##$STSR= 0
##$SW_p= 8223.68421052631
##$SYMM= 0
##$S_DEV= 0
##$TDeff= 65536
##$TDoff= 0
##$TI= <>
##$TILT= no
##$TM1= 0
##$TM2= 0
##$TOPLEV= 0
##$USERP1= <user>
##$USERP2= <user>
##$USERP3= <user>
##$USERP4= <user>
##$USERP5= <user>
##$WDW= 1
##$XDIM= 32768
##$YMAX_p= 436667652
##$YMIN_p= -724697
##$CURPLOT= <Network HP LaserJet P1505>
##$CURPRIN= <$Network HP LaserJet P1505>
##$DFORMAT= <normdp>
##$LAYOUT= <+/1D_H.xwp>
##$LFORMAT= <normlp>
##$PFORMAT= <normpl>
##$SURQMSG= 1
$$ End of Bruker specific parameters
$$ ---------------------------------
##NTUPLES= NMR SPECTRUM
##VAR_NAME=  FREQUENCY,     SPECTRUM/REAL,   SPECTRUM/IMAG
##SYMBOL=    X,             R,               I
##VAR_TYPE=  INDEPENDENT,   DEPENDENT,       DEPENDENT
##VAR_FORM=  AFFN,          ASDF,            ASDF
##VAR_DIM=   32768,         32768,           32768
##UNITS=     HZ,            ARBITRARY UNITS, ARBITRARY UNITS
##FACTOR=    0.250966925370066, 1,           1
##FIRST=     8223.43324360094, -1821,        81018
##LAST=      0,             21880,           -149133
##MIN=       0,             -724697,         0
##MAX=       8223.43324360094, 436667652,    0
$$ Real data points
##PAGE= N=1
##DATA TABLE= (X++(R..R)), XYDATA
$$ [...]
23844 -255944 207734 5297 221012 -30537 79923 168800 99348 13869 136033 85049 214030
23833 214030 -494938 54569 -57979 372876 -929 18865 343854 289079 -4051 62341 -272419
23821 332313 41117 131369 -462168 15506 217103 -195345 -73252 -63339 -178423 -212389 -12888
23809 -208963 152666 -158188 10043 -169709 -40824 -84458 -249952 -68985 -66368 82899 142412
23798 142412 -200220 1693 59022 72603 165616 -177695 159001 34894 -326443 41669 -189874
23786 227846 41920 -244146 -7358 -139488 -21704 -184962 102643 356861 58744 34524 157567
23775 157567 106164 62557 183817 -227003 -27943 -37134 -288303 80264 -128757 -41989 -20496
23763 78860 155540 -3374 -136890 -12124 208729 -181571 41786 44284 296407 -39139 330359
23751 -76034 -216953 -37370 -120155 111188 -78803 -84394 -39252 311177 18204 233709 -33229
23739 -94167 97560 -55384 -161034 -138973 -198018 100906 -427874 42289 123009 -17820 -138417
23728 -138417 398840 -237970 132957 190407 135789 127491 -118705 61586 -183035 -65230 -72570
23717 -72570 93815 -228364 197171 121027 -254404 234653 115712 218792 218116 -284833 -367228
23706 -367228 -78320 199741 -103933 185694 -20846 -51773 -600067 -179566 -302694 -93179
23695 113012 102603 190060 413397 -101341 -215698 122394 97264 -160240 -167650 269741
23684 8224 204600 -25140 121650 175570 177558 149538 -274314 97084 103755 -171277 -100141
23673 -100141 -29300 -199598 298640 39363 -443038 -4115 268578 86788 -58320 75909 104666
23662 104666 -27497 -163987 -293973 -111004 118159 32849 -596085 -188762 -118199 -78109
23652 -78109 113426 205455 -209091 -136247 29389 -222057 -120361 -54593 -62018 78995 341963
23641 341963 -112824 -256333 34 233646 -11713 -44683 183960 161107 73228 317195 46961
23629 76992 214863 -32016 223368 50693 -53471 1516 158782 301709 21591 961 254274
23618 254274 54449 56738 -146680 135722 164992 -168399 94619 -68816 -65309 -58279 -19797
23606 30351 -153320 1349 122652 -78857 87994 52102 -262466 103977 291327 33885 52743
23595 52743 -70418 27080 380575 183948 5274 305794 -10484 -304858 70584 205726 -306436
23583 42857 -178606 183129 30534 -33874 -225137 64130 360134 -92268 -145247 -239615 228857
23571 -13611 -156430 127852 206360 -229168 -126380 1356 30669 -65639 39834 -53856 -102914
23560 -102914 -83037 -148789 4474 154251 -67919 -171443 243225 -111553 156577 45581 90159
23549 90159 214197 -13997 83621 5642 155272 -176224 38822 47745 -51676 226165 -169218
23537 7738 -251372 99671 -292432 176251 -397647 -68778 -67151 79198 -272221 -181781 382025
23525 115840 -151271 547113 1602 124575 -384185 215858 67731 93976 50409 -75656 78545
23513 -317116 -7012 -540186 -55677 68467 -147377 159684 80363 -7929 -122294 -195235 -86600
23501 88016 349534 -137683 127040 -90801 -276507 -251886 -95189 -86865 12460 -188189 172059
23489 -115243 235330 5506 56717 -34179 281110 -140253 -102111 -75100 36197 -197907 -134620
23478 -134620 -394591 -122687 -395910 -149469 -31168 91435 -49353 -30420 16362 -135471
23467 -114512 -200746 -126508 -169631 110788 -40686 -105117 -428746 99600 6437 -68660 89194
23455 -153957 84564 16489 -35431 57779 102418 -136809 71830 -292670 330879 -101491 -7425
23443 118336 99264 4728 -235411 -247960 47392 -126925 -18325 137738 192806 156736 83275
23432 83275 222390 -13749 -107808 -83854 19455 -30877 78433 -181464 -212151 -103820 -101882
23421 -101882 -36523 -395974 -487748 170291 240876 -293668 55095 -42493 -10009 -124898 133343
23409 -53487 -32797 -70932 -26723 212267 -252552 -30114 -417964 260994 99276 -58742 14612
23397 -29980 192290 -68332 -366743 136242 25879 -145010 107671 9287 47658 166370 -292011
23385 -246913 -4064 512967 -2286 65598 -135516 9255 -194501 257686 82720 417568 54133
23373 62245 193183 -157111 -154751 -205171 40862 238805 -4355 -204663 9216 174721 -410686
23361 -143159 24241 -388057 -20515 -57702 -242247 -164833 182437 -209842 -512646 -71663
23350 -104965 -485341 295147 23340 -97974 -61561 -205381 -89572 -167375 255943 -24253 39325
23338 291410 385504 -2253 48978 -180672 22733 -146798 160717 -51294 -37804 27537 -264493
23326 -8704 -161961 -25302 -25640 107838 -26671 -181076 -99409 -129178 434087 -15923 92703
23314 54100 249956 -328652 -216635 -85716 -262113 197185 -144382 223961 -57449 17759
23303 -133975 61408 -189366 -170276 -97664 72429 170445 -88399 138531 19600 160222 -253017
23291 141281 -258686 -208410 -334572 244010 -59537 169338 96151 56873 155742 -77261 -46088
23280 -46088 180921 -18048 138874 268360 42919 212372 -410785 -140616 142862 72543
23270 72543 -159503 48615 232344 -234060 -54902 -174247 -126940 70529 -92720 -290245 18927
23258 132080 -75847 -158030 102864 275617 -111552 80371 217828 -293189 57333 -111604
23247 -74087 1638 116775 424235 92629 11126 -70361 199167 -32029 188731 -224133 -228788
23236 -228788 85382 -24283 26535 -23616 13698 -190901 253581 78345 -125418 -8005 -21944
23225 -21944 -26797 166504 210291 91670 126568 4245 109614 -133333 -171451 176462 20569
23213 413757 115828 74199 -106312 -189701 -10838 107103 -185656 -155828 -179119 -296545
23203 -296545 127521 -87897 44875 -53683 115926 27443 -325869 -49535 241556 -184597
23192 103550 -98530 -20750 -48409 58805 23170 -348656 -227445 34090 259930 -145625 -348059
23181 -348059 -76365 -279733 -245255 273903 241678 -38362 354335 -310044 88592 -308576
23170 197208 -79645 167098 -136013 -18613 375870 -57318 -227891 148552 -290818 175984
23159 262995 -222635 -1836 -28472 -127830 -214821 62474 -159420 1608 -152694 -47082 -98583
23148 -98583 120544 -297629 -38151 56944 -19049 -224077 -116972 466494 -88759 75696 -332628
23136 -131418 3804 -259281 -262844 137204 84358 167020 87445 -151736 -109701 94987 -21560
23124 87664 155149 177954 193980 168979 111916 75315 231964 236601 -50536 -256895 -18554
23112 -192003 98476 -177708 68829 19950 -57582 -94542 45601 -62372 10287 -38880 95510
23100 102691 29761 -137350 -153991 -213343 -46189 14482 -209752 -260737 -75041 -119424 -57999
23088 2201 301367 -117207 30620 53979 145435 127825 229751 -167583 12360 -184184 -141317
23077 -141317 146339 78012 205766 -150834 47236 -121647 -211442 56044 334209 -146248
23066 34466 -118296 124027 -8593 19577 -120350 -47081 119191 425181 63152 3234 -31202
23054 -258032 -154587 25021 347634 -554169 407146 130394 287627 63585 -131144 -38421
23043 -54731 42501 96255 -127422 -92251 44838 -143215 -134083 59717 -39086 1467 107064
23032 107064 -8343 229329 112126 32924 151589 57217 -258855 34835 38588 -457331 147928
23020 -5944 -236252 -174646 77203 -22074 -68360 -292935 -11521 -159032 -187470 182985 -210144
23008 70914 1166 182452 196239 65620 -57029 203001 -25505 174320 -64726 364452 373805
22997 373805 13474 82289 -153103 -37817 -144195 -282338 -229574 108186 -7518 -332739 -37391
22985 79740 -146486 -150968 52256 -285679 -271979 137888 -30063 -180701 -198026 274402 -47232
22973 185099 150972 56478 230703 -409503 52739 -114860 181645 -185580 -70192 -87646
22963 -87646 -188537 -114092 -164194 -403657 -202057 284338 204434 6888 -78528 243095 -193261
22951 17284 63688 -303455 182465 -187742 -214190 25190 -239141 163530 -279407 130725
22940 -235475 -145497 126178 49959 82707 -49817 -146028 100483 -2219 35018 -130126 326908
22928 83865 58682 144217 -372739 -144149 128538 -325143 296965 68104 -103888 -191091
22918 -191091 -100997 217491 -147927 -2420 -84497 -174772 41543 -28089 252200 47134 33312
22907 33312 -55395 -5791 14634 -65005 -237523 -73627 -86827 -86746 -190756 -40042 167524 19083
22894 279567 -29536 -327074 -120704 136672 -234711 -185817 -81968 -10188 150659 -342079
22883 -192388 -483536 -169731 -447662 -119374 131426 -164297 -356735 -248266 19597 103267
22873 103267 17899 22551 -515642 -188772 22625 -400128 189697 -136497 -57158 -10316 -31591
22862 -31591 34451 146625 -171074 -226589 -219767 -75206 196989 253490 -177919 -62127 195350
22850 -142666 148098 -204540 -48207 182810 149664 -47097 12047 -180158 -310926 -143493
22839 -152824 -96084 -213773 131703 -71888 -64900 202341 -258040 17938 -103913 104262
22828 -26331 29442 37053 91120 -75526 -161516 -79954 286846 -44457 77983 694 129402 111815
22816 111815 -143519 63879 78470 117427 -120238 -89326 133394 -190111 75327 104382 -78855
22804 -26817 83829 90838 -45509 190802 40948 -192648 68797 -234152 -32839 -58606 267951
22792 148853 17459 -246010 61229 -219757 1280 88972 -343822 135609 -464300 -76535 295243
22780 -127594 202483 -113976 39756 -266602 184728 10134 -453847 -58758 20790 -160555
22769 -108023 -407511 9386 -168183 222749 -20451 50379 -101104 97974 -112036 40575 92751
22758 92751 -131422 46164 265485 -130338 22439 -109917 -281053 176283 66995 -432603
22747 -14636 -212025 -278291 -207228 -6197 168515 -32424 -31838 -58877 -62821 -255393 -57421 41065
22734 -56079 -94404 -28335 -253436 76640 -51817 -58359 -156465 -60476 77699 -13470 -77108 -55253
22722 -55253 94617 -258246 -140169 -111344 -1565 -207113 -151752 -18386 -228464 48887 42287
22711 42287 75250 -12306 -78499 -205076 -25125 -28560 175640 -31499 157133 11497 164511
22700 164511 113150 196177 108047 238293 -55385 -291913 -393916 215644 -12071 90141 -58790
22688 322555 -178289 6368 -249155 96683 -29619 -309678 147815 212253 -199600 257669
22677 -20229 -476661 137200 59484 138086 288244 -69820 325917 8135 307202 18676 23381
22666 23381 -49513 169499 -37478 -192463 -27871 103388 -137240 104796 -15361 281508
22655 -30860 210893 -10135 -262801 -161957 -2504 275831 -122426 33209 -11971 -255127 85740
22643 48434 -15585 -54169 -212709 287976 244697 -94766 238075 -187412 -667298 44615 -245842
22631 64471 -423122 162985 -209234 -196904 -227124 37757 206749 55137 124380 44887 -324397
22619 7746 83110 -264114 -195656 -186443 -54802 -198167 -144310 -147616 -156351 -284937 207584 197264
22607 197264 -129048 46593 -43880 -105291 78169 -64629 123761 -29065 57155 -467334 3002
22595 -75826 -8751 261252 -252763 51693 -6701 -102074 35855 50683 -22622 238636 263930
22584 263930 118085 -138059 -94418 -330677 196618 -16882 313577 256153 -26045 -104067
22574 -104067 90261 -59928 103884 -27210 -75235 -148961 30074 -179690 -42771 -90779 -236144
22563 -236144 118267 -123869 57223 -145592 90260 174320 318965 -146859 -92596 -40970
22552 -71297 287591 -140934 21964 -103767 -120231 371485 -58214 -114606 -142289 43806 -231869
22540 -42373 9284 -120026 24161 -276339 236413 295956 -150409 100057 -139499 18568 88339
22529 88339 -63223 -194217 -280742 -278568 -195208 134554 90457 8539 161230 -174908 -57188
22517 -148258 141108 -74879 -320582 106745 -222611 -124648 -119218 -79943 152804 33160 -38964
22505 -36433 -36574 -479496 68388 -34503 39178 71037 -133525 -177804 23939 -71400 19988 -35218
22492 64983 126439 -68787 -260732 -271816 -536984 -364791 249003 -133505 -69540 -257688
22482 -257688 31914 -383898 -163867 21696 283859 39033 94859 -149436 -110542 -55559 -77871
22471 -77871 11214 228534 -24908 -169713 167185 173081 -202029 36902 -106125 -320808 -72995
22459 3407 363110 45550 1538 29047 31547 -591123 20011 51860 188570 -110123 -20737
22447 64286 -152520 3497 -97676 222571 -309752 126461 -54835 53923 5001 10419 23487
22436 23487 190125 -120536 45360 -38489 -127788 163463 -190572 -192605 155831 -101719 61992
22424 2930 118560 -125317 124972 127835 11153 -112236 -91493 -18177 -77524 -88328 -106722
22413 -106722 119223 501898 -134633 45861 118819 91605 2478 -332496 -73337 -94942 40719
22401 -155628 93539 156912 -116134 60914 -72412 -79895 -239511 -418044 -169917 -366658 -95956
22389 -164022 -122017 190867 25792 -19069 -78308 -232972 -247374 174223 296416 -240619
22378 -206099 -274452 -39419 -183889 238331 -4776 -452964 -81948 -53599 279936 -24518 91526
22366 -72214 17800 -76018 99475 -49893 76164 22052 98604 277803 -106556 -110487 28670
22354 132191 188458 293433 266655 363606 345660 16002 -251033 -167679 -287690 142560 149760
22343 149760 37069 83174 -42977 -170306 -40110 -176767 -176365 -217701 -66594 76799 -137781
22331 -75204 32735 -328561 265590 -488388 -142996 -68191 125246 -120296 41991 257169
22321 257169 295547 -89624 -110788 -267938 94083 222700 -133926 315352 -15414 167119
22310 133850 -279003 -150081 -200359 251331 -269581 121298 -206446 -632754 195080 198269
22300 198269 -28493 -150382 281608 124628 -147493 -106744 -342820 252503 164587 167480
22290 167480 -32368 -97198 265724 58151 -73940 63362 89261 140054 -42817 53710 63613
22279 63613 82759 -73052 7983 -219768 -400069 59952 149789 -173972 31720 37873 -251157
22267 352039 -399127 -36453 -91039 169918 -235963 -202338 -148928 -25555 18806 -5336 -155720
22256 -155720 260443 17120 -103485 -258559 -507554 194662 24119 159388 -135112 212309
22245 -167682 -1843 109587 144 246901 -82673 352072 5841 111818 -19816 -221854 -77019
22233 30519 119142 -87284 52699 101843 -197151 -233710 -30743 -112384 337878 -272016 -233070
22222 -233070 -59630 -80538 -112399 32372 -67870 -162480 -179300 237072 46081 166108 -112944
22210 -87604 56209 268157 -146092 -21867 141320 -31030 -140355 -130087 150124 -95499 -13534
22198 -60129 -52036 13797 30068 33635 -189448 24339 -220000 -182414 40745 -165153 -24493
22186 195963 264713 57660 190114 496 -113031 50700 10509 90892 58375 37324 93746
22175 93746 -152189 -59077 -253212 -279653 358748 20733 -60169 19879 28503 74069 -99206
22163 -30962 -486088 16961 -356739 -99518 234221 -165084 175321 93286 -10109 -202032
22153 -202032 -68410 87928 41732 -163562 -62726 176633 186037 171153 104353 -258279 106555
22141 -456043 -210260 159122 13241 -3345 -163747 -124213 -124096 -286380 -81255 -119558 -222482
22130 -222482 -423769 172639 -172826 -53349 -120723 137947 250646 -114598 247304 243779
22120 243779 -294462 -31940 -158254 -83722 34001 -36453 140773 -127474 81311 41807 -214110
22108 634210 -136738 5978 93665 -22196 -102592 -355436 -25989 132420 -109500 -70478 26796
22096 -89346 -94094 68076 -5641 109012 -120144 -210538 -62778 -144086 17405 -116833 -237994
22085 -237994 -152184 27007 -198103 87025 223950 2479 -244070 -203920 49474 -288749 -8788
22073 -51220 -239661 49688 -445258 94397 -199089 -31913 41889 14124 182816 -169895 -265984
22062 -265984 -112901 13166 -221865 -71430 -62090 -353748 131536 4843 23164 -59398 -34743
22051 -34743 237826 -44049 -228157 76389 48315 114522 73013 -368658 11394 -135088 237643
22039 -76212 44644 184532 -283148 368242 432 -50618 231633 -21903 -212273 -408658 -362571
22028 -362571 160556 -12823 77091 95274 -108562 397674 37860 -200771 -184426 -116985 -231467
22017 -231467 -318115 93142 -158068 273945 -69242 -138374 47891 -112332 -128316 47072 -202175
22005 -298618 114145 97481 83033 243353 -141847 47186 -58988 -90093 -232517 -32130 -24236
21994 -24236 150101 310928 -64148 -37847 -31447 -404748 41249 -236260 -214897 -277712 74831
21982 -105421 -226302 -89905 -68659 -72249 28093 -119327 -223256 130993 -113567 329620
21971 -9322 -307650 400921 115067 -307300 84575 -210377 163397 18052 -328780 -53780
21960 99027 64526 -66546 47158 -145566 -110371 -198810 -42340 -168765 12265 -127501 -33270
21948 68170 45769 -204781 -240476 -321513 -113652 -60764 -17594 36011 58838 -457989 -207686
21936 88750 205204 -54966 -55310 -171166 -116496 -87927 -32285 -308572 -328674 58293 -173114
21924 130234 -106644 -220049 170716 179788 127362 -103742 80831 130497 -368939 51846 48297
21913 48297 179583 -41630 100842 -256735 -264009 -265998 -170453 174581 -227807 -78997 178030
21901 -322747 -267774 -72583 172336 -124802 267318 28905 255103 -87528 -271412 -108107
21890 -81835 125787 -75743 -200376 154549 -124421 279945 -214152 235220 -5230 -242577
21880 -242577 94779 122856 440115 -39377 -35786 100709 -67160 -330991 -111824 -147386 204922
21868 -20703 -162396 -266291 112467 -111447 44959 -296380 -67677 -87838 158244 234302
21858 234302 -55312 -59651 238758 287988 -172245 22435 116109 108856 -232699 124001 -6564
21846 -5530 -141657 -119567 -61560 174148 135105 -24905 -11766 92815 -42959 -120935 65145
21834 134445 -131799 -276059 199469 -237399 125771 73965 51393 49282 -81280 -401639
21824 -401639 -171156 -37425 4221 -20893 -82506 -15859 -163175 15189 -184736 70348 -152743
21812 -214735 -91387 181617 -65868 70840 229325 -210911 -209793 -250278 -305349 268721 -15068
21800 -6216 -176484 -306144 -66644 -153195 35464 -362507 56742 -195777 -61435 -239049 186723
21788 -28006 -56415 -46591 58935 1062 154155 -31554 -27479 -99071 98379 163354 83049 32938
21775 235023 96914 -234246 113214 12611 -15296 -237340 29288 -17588 -208787 -38012 87165
21763 69942 -220644 -126117 -123219 18 7461 -146079 83093 105144 -133726 -222030 17415 -103468
21750 -416212 131179 -44542 -54039 70273 205465 -3182 -150657 47555 166550 -94503 101761
21738 -285244 56653 63756 -327618 -129719 -83975 80894 233664 260980 -188819 7700 -25707
21726 224961 -138347 17392 -57341 332873 261500 -98499 -42789 26679 -41271 -124779 -168026
21715 -168026 80309 259530 236248 78300 -140154 79424 -20871 -436691 -116657 141559
21704 -259040 185964 -182044 32454 -57340 319038 -177620 13137 -208974 139360 240266
21694 240266 -175506 -98302 146437 292331 -335199 -150535 -392965 -65184 -250464 -95133
21683 -19947 -155855 -144566 -46494 271051 -388582 -33993 11285 16886 72326 47360 104603
21672 104603 -198350 156825 -50803 -148547 -97217 230387 330625 130564 -112709 126471
21661 -212371 -12838 -215949 -150320 -99468 49411 -311056 -239266 32494 187121 345806 -95485
21649 271769 -226299 97162 9649 -22365 -188422 -415389 -166761 -110650 131540 -49921 263777
21637 55429 -130414 -6515 -195451 279297 -232548 -71656 -71051 8243 -82346 99373 53831 -16363
21624 -221039 -27142 123056 90981 -105444 119429 72795 -30775 -136695 463872 -217255
21613 -142082 15974 -160885 -39681 27112 -181793 101786 -128261 157041 -135652 -101481
21603 -101481 -86385 -8006 -93816 98182 -187014 -14345 -331720 26598 -269516 -91876 -186848
21592 -186848 -640011 -42622 -281446 -242173 53361 -52155 -48908 148874 -98713 129507 -115498
21580 -144673 -191867 73478 234551 -36278 -323539 16542 239208 -158709 -24712 165076
21569 201004 127067 -354244 -217992 -52958 349401 -286032 219269 -247656 -314339 -18746
21558 -31037 63766 -92163 -538 -347913 76726 -261649 71771 -130575 -197146 -302944 -20423
21546 -224530 -29910 -211241 155680 -125105 -107044 10609 -63185 -98874 -306947 -41348 -53479
21535 -53479 209016 -156984 -431415 -46276 -65343 28778 182789 183077 -127180 -49757 -127172
21524 -127172 152758 384062 43732 -115799 93965 -73978 106935 -536260 -238853 316117
21513 61956 134892 -71275 -261966 -276926 296646 -161349 69759 -21911 -233299 215587 194895
21502 194895 -187242 189685 -326458 -173159 111802 -78130 -195100 6467 -89399 -128244
21492 -128244 35603 56200 -136789 -244150 55907 -197524 -174375 -179798 -117871 -183274 9341
21480 53001 -186338 -133762 210196 -102158 -49298 151710 -81875 -153935 7916 193634 26159
21468 -164441 46187 -80405 -230227 184367 -8367 54712 306098 -240067 -39390 -310254 -36753
21456 -207743 -360971 -73097 30555 9705 99774 100731 127097 16668 151172 110795 129366 -107884
21443 184146 57169 119167 109033 131286 -27608 387275 -25150 91396 16623 275471 -35760
21431 -161320 128727 -153135 -22223 220066 -30890 -78153 -139100 -303323 -238751 -92142 -111206
21420 -111206 -136987 28162 -239700 -150059 154554 28699 67311 301886 40945 104426 -65539
21408 -51526 -105175 -103908 -9274 142253 -63051 -22505 -402381 -4755 -63650 -121908 17663 -160229
21395 -510839 -62917 -48508 -93293 26856 -147971 21775 -53640 -11569 -271240 -48269 -72891
21384 -72891 14192 52832 124535 -128961 23017 2607 -6296 -249143 -100312 46716 -990 -36315
21372 -36315 -189454 -58485 -99567 79515 -343581 82105 66103 -204220 -32607 81771 -340230
21360 68630 29583 345292 -63542 68800 347260 -104518 39795 -99557 198212 23946 -123890
21348 59547 -92672 -143510 31386 -34565 60348 73221 -263880 194174 160334 54476 -250086
21336 -75927 237517 -72602 156078 9246 101928 199291 -181431 -144074 73462 -385874 -168456
21324 -24621 -147997 -18869 21530 -214486 -122876 -244562 -40114 123656 -18552 -142302 -279956
21313 -279956 -71261 -15424 -194358 -17562 251053 96201 -164671 18792 -327402 -27806 -125085
21302 -125085 51155 114953 -213563 404560 -34497 308420 -407590 280272 -24261 -276003
21292 -276003 -58205 -215805 161572 -97858 118234 -246957 186209 -21934 152574 -143565
21281 -343266 113366 53971 -108995 -284179 -138412 314291 -321253 -76912 171140 368010
21271 368010 -150598 -249855 74334 -85674 -77037 -252640 -150351 104667 -87654 -137738 -37247
21259 -35067 211624 -148116 -213081 34617 -62309 86106 -395641 -55458 158194 -73255 306680
21247 -42167 59039 -278982 55025 82696 -207457 -54241 -361859 -92913 -298741 -47842 84955
21235 143662 79037 91419 -202665 -173023 -115059 -57575 -101631 -14418 23704 288672 143819
21223 111529 -198743 -221094 -202451 -256027 107586 78457 -129882 -34122 -338130 -309513 -9245
21211 9186 111080 -91896 221658 -121618 -9863 -24945 -212957 -42518 83983 189480 185548
21200 185548 -85622 -63015 106311 -69123 -309626 -106916 -107511 -75479 -20246 23047 97281
21189 97281 -225047 -307500 -240977 -147786 89939 -125183 -101669 -202951 854 161450 -107691
21177 -161859 128858 -19592 223078 -6371 187122 -14871 175823 -82701 -166125 261893 -72364
21165 212712 -256006 -26768 -428334 -30722 -238338 156333 40573 -30603 304294 194294
21155 194294 3965 -172140 -179686 -2780 -237315 -85262 -100746 -146342 -138770 -110984 49951 20764
21142 -327013 -20899 70222 203757 135373 117405 -74641 -4329 -19658 -375435 132409 -140817
21130 -172555 119047 -85864 -271240 167486 -84778 -65172 230064 -134620 61422 170963
21120 170963 24697 -153798 176434 155265 -239188 -194557 -301583 75876 38085 61485 36967
21109 36967 -133792 -463931 -265987 -260016 62243 -66287 416175 -54514 59761 -155051 102942
21097 -205938 -286332 -110544 -110493 56266 307168 -4097 -207348 245270 -133775 -62160 -40842
21086 -40842 -28659 -404425 47441 -361699 -150034 123000 27780 -223252 -115339 331236
21075 272239 -27905 137889 -28882 -392210 127350 -14288 -122404 99542 211848 -487008
21064 -168195 16387 71926 -174760 -228800 262973 -221012 93581 -230975 159518 -452645
21053 62076 -403447 353508 178916 -52149 76377 -66236 176331 95252 380117 -98417 -469026
21042 -469026 -221777 -34194 -40644 -105993 -71332 128672 -199415 30559 150625 -191294 110078
21030 -126492 3947 -50036 -19526 -110932 -201806 -323298 133408 -163740 31517 -145972 99080
21018 341267 17420 -152984 -176615 -30721 -155483 112217 219548 -336149 3293 -221227
21007 -136279 -44122 -29648 -218836 198877 226019 157045 142773 -23337 -224805 -357832 -18158
20995 185641 44272 -86498 -130049 242632 88194 27835 -81433 -1372 101087 -70827 -392491
20984 -392491 116597 -157498 -117072 17129 106618 -193463 251202 -14888 -67763 -104255 -61055
20973 -61055 -93756 170838 236117 -362933 -407714 49394 -202313 -244309 -158511 -151053 -458126
20962 -458126 231026 -235706 -269754 -137703 -26273 -322984 -133294 -67870 -282006 160822
20951 50969 -143136 186712 34367 257233 -334378 14850 218538 -15342 -16209 -255553 -89580
20939 89817 164041 9332 -169804 134172 21876 -11650 284889 36607 -61114 189881 51351
20927 -96950 -180998 -158812 -105621 -194731 -160147 -7675 2846 9654 28771 28122 138816 12360
20914 -193052 -40332 159915 -51257 134595 26628 -8384 44337 -8026 141361 -353906 938
20902 -24002 -106956 20195 -64242 -37377 -25796 268382 -371280 -35129 -295680 -271100 -172129
20891 -172129 12726 -23616 -27765 240196 -142173 -192077 -356138 -175223 -5327 -323518 22457
20879 -370471 -143793 -228 12116 -219169 91411 -111997 -207530 -227560 25037 39140 -88039
20867 47946 140082 145098 95929 -83397 107836 -35848 -161585 124861 -408239 -154594 -283220
20856 -283220 42039 -59555 -297440 -265993 -97779 140697 -78809 190477 -52924 -232387 -305928
20845 -305928 -38534 -51650 -114577 161106 -246926 -3756 92482 33525 25332 -78422 -267917
20834 -267917 179069 168458 -283137 171457 -123782 61151 19398 148105 283776 -193905
20823 -92931 64380 -131212 -253051 55696 -287279 -95831 151680 -23664 282187 -47571 -26635
20812 -26635 -121421 -358695 -350874 -88300 229754 -56869 -243908 -64715 -115425 -282171 236953
20800 -33036 -115217 -162883 -165758 -94617 112462 -29371 -1574 49551 -102893 -310769 29486
20788 -110971 -45153 76328 35438 -145645 43251 -140413 294574 -9444 -31563 -220047 -189566
20777 -189566 -63243 82565 129509 8640 70547 -315189 191686 -68814 -284800 211309 -298558
20765 27848 29914 334601 -314607 -21495 31384 40301 34890 -27917 287758 74559 -267708
20753 -223238 328606 -40239 34302 -264628 188765 -208116 24217 262145 -84960 -154 -62425
20742 -62425 -221349 186596 211037 -59030 -257581 -35978 136845 97997 61536 -104649 -205099
20731 -205099 421 -195770 145091 -93912 55100 -70113 -297442 141581 -181412 127312 -142909
20719 253894 233322 -40092 -94583 -160606 -164356 30860 255780 -43391 36135 21303 38641
20708 38641 112498 68706 -133984 81235 176423 -290961 134250 -132643 -197352 -121132 121782
20696 14594 262879 -106468 -50219 78837 19579 -258663 -170049 -156793 -53108 -52819 -21013
20684 -220739 59621 87286 -281567 93983 -284946 63174 120079 -190151 -181637 -401693 -68985
20672 -98147 -237226 -192640 102067 113992 -111154 -213834 -246830 63764 -114847 -26432 -268791
20661 -268791 -185736 109799 -84138 -47276 -110972 -251683 -42214 -87703 57620 -138716 125927
20649 29447 -167408 -103833 -275891 -184025 -376414 -384702 268761 -274890 -56490 -183669 -248034
20638 -248034 249480 -252389 117372 82853 77031 -10234 -198820 356256 39406 140835
20628 140835 -65371 156017 -34210 211185 -218558 -61133 6733 91656 -37776 -151964 79530
20616 -176601 -123245 -314293 -150269 -42002 74698 -89897 -196999 171835 -126656 -141281
20606 -141281 -124524 -292134 -237337 66078 -189613 -68646 258311 168530 15289 169464 -68157
20594 -387755 -136315 -17514 136954 -86339 -4223 -232220 206927 -153100 212440 25923
20583 14381 -35803 18290 98229 92196 -144139 -5279 -169556 -13384 37356 92476 -256111
20571 7271 -203325 26345 -82048 -21973 -48404 -101550 -315875 -97061 -86150 -159727 -165487 133836
20558 -375832 -80563 -39309 20348 -76229 50977 314676 121078 -154260 -276993 69486 -160094
20546 -208670 38682 60765 36826 -109850 -197230 28535 -193128 -115361 -438772 -19749 -114368
20535 -114368 182372 233558 -321312 165185 133886 93423 -126093 211470 24886 260187
20525 260187 44804 -38116 -141411 36308 -179953 -360080 264924 4828 38087 -64778 78492
20513 -6237 76614 -295060 -17772 -77033 -115557 6174 -227968 -252744 64866 -58625 -78425 -184202
20501 -184202 -100601 -353079 -213720 -368379 -154013 -211302 315581 6489 178840 -107787
20490 -141338 -110333 -102207 -87112 48621 -38337 60005 -27813 -244079 -110023 -56134 20059
20478 -214616 -270559 104753 -146248 17011 -315112 8206 93724 -293938 -508921 -270871
20468 -270871 37946 -59834 -36592 36758 -415443 172503 -238438 -272621 273102 -117817
20457 336741 -5603 250458 153024 -126443 72303 112656 12035 -305875 -120126 -186402 46664
20445 302816 -110370 -311226 -97598 -284783 71979 -106658 -153280 -151335 141177 -153075
20434 -220020 36481 127370 -103004 -328223 207980 126946 342400 84026 -90590 55361 32374
20423 32374 99510 -91313 -372391 -6701 299319 83123 -37784 -97534 -347970 47827 -165242
20411 -129207 -203309 -35597 85534 131103 -116099 -176914 -204102 -89545 96835 351981 -219548
20399 -29389 142661 -87219 -159134 143768 -182755 -122805 -54928 126943 -97743 101339 -47158
20387 218338 -126664 128341 -90812 147084 -296594 -281119 -45501 -310172 -174269 -74572
20376 62076 164552 242146 92652 -191595 -132424 -347742 -265001 2888 -503842 -283437 -330227
20365 -330227 -47485 -142354 -234516 -138757 102125 -267787 -261312 -118135 -194513 -278321 -570
20353 -224984 -171103 -224784 5498 -125926 -16299 20377 -144555 66778 -111284 -203059 72587
20341 61432 -231170 122232 -148378 -76243 208815 81925 -213550 -148978 229670 307834
20331 307834 52552 80825 73078 15954 -229055 -224628 -98193 -285172 -130123 43681 -120829
20319 23124 41115 -15262 299993 -298751 -166387 49624 295474 166883 62038 -130090
20308 357911 -157675 -5146 -110744 -98707 87835 22362 90439 -20523 17388 56632 117138
20297 117138 34456 153288 -54108 76970 77151 104542 9967 -303755 -264890 197523 123712
20286 123712 25342 -109838 -93113 -122980 118558 -151303 -69044 -38557 -127772 -48255 60199
20274 67428 82451 60855 96249 110844 -252015 -99042 139340 -165272 43340 -156234 137890
20262 -235161 39488 -223861 75428 -61687 -193470 33840 -168779 -198282 -359529 -211375
20252 -211375 -31151 -276597 212528 286773 -7119 -36639 -376900 -149895 -360672 -291464 179616
20240 -52538 -283923 28888 -188688 -255044 -99953 -74370 16995 -159666 -84780 -45588 -32855
20229 -32855 111397 -89862 9315 -218768 -91966 127832 -522933 -344880 76138 32395 -153532
20217 175475 -408587 159433 -82590 -40638 23506 84964 103106 -164272 82778 -223853 16616
20205 -137702 -167715 338107 199207 -231027 -78838 -295114 287897 -121061 104076 -71128
20194 -44776 -195040 -137013 -313094 -327607 -70105 -154098 -291876 -355832 -110067 -436768 -84971
20182 -12997 -199520 273709 -61613 -155845 -56554 -253351 -178433 -89133 122262 -306164 -228902
20171 -228902 91845 -154317 9484 41782 67865 -144171 48781 -41676 -103333 22625 -15232
20159 60840 77330 -240255 75992 -51520 -9021 138669 332050 -163594 205308 40836 170570
20148 170570 14965 -95043 18485 -278039 -90029 -60934 -306673 -102570 330091 -430989
20137 66982 -108354 80576 -278639 -300768 -12031 141823 -115060 -77227 -10303 -129283 -211434
20126 -211434 -326880 -51575 -1556 -116997 -126109 12751 -212169 -70443 -93072 -42553 -193378
20115 -193378 -340538 20621 -52088 -54451 -174073 152212 -167693 -179121 -60050 -159644 -10164
20103 -84754 158657 72015 -302501 5002 -21542 60269 -60859 -54507 -79428 -1592 21145 -256793
20090 -115447 -146956 -46671 -248023 42399 -282370 -39416 93973 -238900 -187230 -28418 -291213
20079 -291213 96988 244122 94089 -161291 -216327 124106 -49268 188049 29649 -90016 -196921
20068 -196921 61974 -484766 -86915 -1191 -358228 192558 -55111 -186873 64478 18430 -47673
20056 180471 -22987 -86457 11327 -380166 -29839 53844 44647 -41610 112694 60107 141568
20045 141568 25962 5328 182020 -253068 -79915 49662 7565 -206244 114918 128427 107526
20034 107526 -83761 174474 115178 208903 56966 11531 -105957 -100794 -311246 -33140 33574
20022 290207 -283743 56054 -15393 48622 129730 31821 -86752 -121780 -243913 -74631 95267
20010 47221 44801 -211624 -140807 -183141 -161154 140297 201908 -31265 -70289 -452145 123461
19998 -254905 191448 -34815 -185054 -27987 -34996 -90802 11166 -354502 35138 41071 -223215
19986 22496 156823 386214 -149131 -241429 80747 23605 -68906 -81830 -152066 -205223 -164345
19975 -164345 -103967 -101757 95491 -105502 -167918 -178226 -56529 -260436 163599 112713 333033
19964 333033 -161856 51637 -267023 -160658 131899 11102 115890 196188 56660 -287788
19953 378205 -161075 16798 -88731 -330636 -286704 -269988 38168 -397127 128550 801 44683
19942 44683 -115209 -137337 -33998 16233 -88520 -270278 -78739 162117 -187657 -259992 135993
19930 -88570 -56637 27011 -68992 36314 -203965 92996 -58082 -20843 -11033 163584 353235
19919 353235 -129062 204152 -257809 -141201 179758 -289286 -87266 -256179 -328989 -353380
19909 -353380 -168590 -77839 -153656 126046 98714 -274633 -445462 22476 200742 -227990
19898 81773 -40628 -75114 -151881 -137935 -36087 -179814 -342777 -232979 -189843 -45652 -367080
19887 -367080 -21191 -214225 100638 149156 106661 -72070 -34202 125053 -262508 -59685 -215197
19876 -215197 -133763 -18123 -176404 -266951 -466312 -14867 -269485 -12800 203526 37016 1329
19864 136308 -225553 -166035 -8472 78477 -110739 32714 -248200 -173260 -64409 -42454 -210243
19853 -210243 148230 -26112 -412944 -2539 -149842 -60617 -89964 124349 329697 44108 259236
19842 259236 -204966 133119 -206553 145747 -222844 -46023 -110434 -90309 -342740 -203425
19832 -203425 -62901 -168464 -507554 -125096 100344 -178961 -132682 57091 159294 144102
19822 144102 120745 -83609 -209388 166273 -146430 -200365 -47066 -61092 6014 -34559 187110
19810 -61314 18530 24958 -63773 39363 -164726 139599 173215 -38281 -232317 -149865 -51495
19798 32930 172768 159728 -227750 149569 -345585 89394 -70960 -365792 -346827 -472939
19788 -472939 -93040 268626 -94794 -43916 -308286 -519622 24553 -42165 -14444 -321890 77262
19776 -4487 -292185 87646 -216467 -109846 -117717 160806 -111012 -225637 -271448 -3627 37608
19764 -257613 123338 192170 12013 -320177 -138305 228071 -102932 -163574 244934 -154717
19753 -95135 64231 -225886 -495505 241077 -203918 -25358 -256169 -93123 244635 144347
19743 144347 218450 -195544 -43849 -196341 -146241 -355729 51310 27980 -9261 74110 -277649
19731 -276376 -68657 -37235 68680 -331053 67748 40950 -291512 73335 19862 116722 -124313
19719 -154780 -290772 -430202 144920 112822 137771 -40567 288795 -109263 63551 -262166
19708 4767 261357 -141068 -1772 238370 -137485 -303943 -107435 203737 252670 639888
19698 639888 -126160 -25624 -35756 -146860 178187 319307 -110393 176681 -230933 -103191
19687 11013 -70278 42347 -86071 158012 28988 -304639 -13513 168517 -148152 -74671 -59178
19676 -59178 -128487 -17223 -65502 -140511 57902 26068 -29508 -215857 60418 227360 115391
19665 115391 -90191 1277 -42689 -525881 16526 106537 -49609 345652 -80815 -112240 -3029
19653 -106481 197632 -122504 -77776 -92289 48275 -142189 -221503 -113072 -89859 79705 -134782
19641 79190 56341 45607 137822 130112 101204 -125234 -333527 -214265 -166595 -142722 -169981
19630 -169981 -74001 -182188 160496 66370 -220979 11608 -299555 -46841 -183633 30601
19619 374883 26199 17798 157832 -373524 -116917 287402 -110533 -25064 -468491 -101574
19608 -150116 -89568 -132626 -264736 80708 164816 422258 -106740 96425 29602 163749 -62942
19596 -379228 -41960 -367398 -300306 75921 202597 -1905 -360754 -181425 30882 93663 121309
19585 121309 -136591 -145396 -37974 305966 17505 19535 16146 -103104 -150670 -114869 -143917
19574 -143917 119232 -27105 125800 348639 -28866 -307865 -146447 -72030 -225798 -181940
19564 -181940 -55057 558726 -94584 3059 27392 -21078 -294305 -112861 -22714 171314 117965
19553 117965 -236781 -287381 128461 -101441 -195167 87791 95329 96089 44932 -111104 125938
19541 -126247 -372959 382437 -137064 208435 185764 141252 -185663 -64825 -101293 -121591
19531 -121591 -560512 -340026 -188279 -232134 -11229 -274631 -135716 31474 20821 274976
19521 274976 -173986 -68728 75458 -205322 -63141 -123892 47864 -97818 -40317 250454 -95614
19509 -180428 -21874 19230 -196031 -138632 -174350 -20053 -95075 -222683 -215790 171983 -5004
19497 62300 228157 176271 104672 -50788 -38277 -173847 -194940 -233950 -216463 -317449 -257256
19486 -257256 -164812 -159295 158789 -35614 -184051 -225325 187732 -27200 97517 -62035 -189594
19475 -189594 -62820 -178216 174151 140987 -170480 46514 -23047 308856 -69577 24719 28814
19464 28814 -103288 202900 45919 30751 -225543 130014 -246942 -29715 -107526 -284985
19454 -284985 -160161 -452432 -91086 21597 -107287 -128903 119641 123309 -195243 -128958 276179
19442 266861 -147642 -10488 170183 61218 118116 -87312 -65738 -240334 -203148 122502 -95723
19430 202864 -429565 -472038 -126268 -238777 -121585 -242964 64489 46328 -127327 -83687
19420 -83687 -422 205771 -106560 213477 -419381 -281133 47056 -234523 -235634 -45116 -44017
19409 -44017 -40580 -408263 115958 -522034 -131935 -84480 203168 50195 -306024 -55692 -45680
19398 -45680 -20720 -164852 -128195 22233 -267975 -429451 -46873 443348 -193056 26151 327854
19387 327854 -123101 -4365 14706 9379 -74639 -207635 111642 -170922 219189 -316438 -29941
19375 -326686 -97045 46180 -65900 114641 -90494 143835 55253 175241 -211975 -57297 -51020
19364 -51020 -54762 -171023 -235137 -82194 14121 -260756 28693 -296933 105481 -93474 20845
19352 -392778 91773 -261390 -90285 -183825 -28456 -308971 -174297 68223 533566 -103239
19341 -2974 -81842 -117445 5877 -26262 48861 -108625 248191 34889 158341 95714 82358
19330 82358 -228973 -246436 52080 -242682 265432 -195057 -170254 12343 -181631 -93985 115091
19318 -33250 267277 -111432 -139863 -49427 13224 33540 -203959 -125435 19462 50339 49071
19307 49071 -82352 -148990 -124962 49261 13447 50654 74705 321709 -134316 -260163 -130598
19296 -130598 -100241 159489 -403581 -77697 -102839 -58446 -428544 -292368 -55992 56482 10806
19284 -169549 -72299 -63063 56742 -233592 280182 -187394 -116723 -128920 -86067 -209997 -464440
19273 -464440 355193 -216449 -185391 -84040 -105706 256461 66827 -86790 -70270 -258182 1360
19261 -77886 -433777 -78716 -14746 -125108 88004 -52130 195586 -134993 -26577 113083 -140561
19249 -113497 10282 56641 -370689 -14755 106828 224436 -144734 -117503 226188 -103196
19238 -251484 8242 334712 -52628 -157164 46377 371684 -173823 -137370 -26025 -306455 34844
19226 94482 -103270 -166121 8239 65802 -542356 -301939 -195262 -136533 -43914 -123519 156905
19214 141530 -205897 -32339 -133076 -62162 -226667 4459 -193091 157964 80762 70888 49700
19203 49700 -55680 -22786 31145 384395 -97908 264952 -189335 -337541 -170166 -136123 -67034
19191 276750 74988 -120565 187519 -23471 -54214 -205076 -34985 -105166 -164945 58970 61346
19180 61346 -186654 9365 339783 -247011 -179859 -225633 52218 -417564 49018 -116285 140960
19168 -147740 40063 40172 -514685 -59641 338518 -110450 -239274 -339189 -124907 -54768 -129824
19157 -129824 47591 154202 74448 -119723 -11843 -29092 -131984 504 102983 162969 66517
19145 -156687 -57693 -266125 -188711 -251868 -89753 -50182 11691 225477 39253 -81149 -73937
19134 -73937 -388645 -35220 -52938 -145611 -67255 32378 -342 -237199 68149 -454802 -128946
19122 -108537 -72456 -38967 -169231 32285 -12528 -91866 -77861 37504 -47444 1088 277614
19111 277614 -185919 -197618 110297 286590 -257443 -132963 -90186 -20060 10088 -187732
19100 -70399 89771 172063 -29452 -2012 -152026 38179 110923 107945 -172266 264739 284758
19089 284758 -261606 49113 -322230 -350273 287513 81563 194626 1506 -383723 346217
19078 -73502 -90270 95199 -22813 8793 -276047 -983 69011 238633 -71403 -69233 -364 199661
19065 -149001 -89800 -125548 219458 -74900 -187818 -185328 -295909 -302083 -58498 -408553 -26068
19053 144968 -217903 -107709 22410 81155 63761 -75664 152054 -77134 182579 317912
19043 317912 -7103 -36895 -14286 -188230 32330 153453 -173470 -129367 157329 -12618 -103725
19032 -103725 -255046 21361 67737 -126033 -87302 -239125 -127266 -110322 -53107 148778
19021 75620 7230 -180796 91296 -178317 -42344 115566 59982 153857 -6748 -274745 -188576
19010 -188576 -280826 -131334 110055 -268420 -195562 -380130 -24736 171286 9432 -153642
18999 -414178 -177337 -44884 -63863 -466298 -227882 -133027 -268877 -90153 179857 -1949 -89140
18988 -89140 -124503 193532 -61182 -388188 120175 -343718 -340523 194161 -115787 236286
18977 -481601 119650 57017 -163202 -311121 188841 103986 148878 -56842 -349630 43443
18966 -264025 -240511 -186100 71264 -78347 -177037 -224729 65810 -45506 -272680 -180658 195869
18954 131545 425625 73132 -220448 -78889 -380166 -108401 -304460 -329183 -414390 232345
18943 -188551 105523 39848 371776 64462 209029 -242670 125678 -316651 -126150 -202581
18933 -202581 -272503 60133 82981 -354589 68924 -140964 -187138 17310 -323905 -38384 -273757
18922 -273757 -275709 119703 129923 -70335 -49109 292707 130112 -332756 173070 47971 31171
18911 31171 355279 29703 -130823 35652 29251 167745 -195796 -397438 6481 245129 -22508
18899 90621 -283082 107088 -118165 91848 -67649 159407 128137 -11987 -220657 -45348 -163318
18888 -163318 -341591 -60766 -74349 -98094 192622 92985 478216 -79621 -305190 -364104 96922
18876 206923 112629 -171106 -41614 -379138 -76674 64736 -441053 226693 -320494 -141463
18865 234905 -283646 -153622 -167670 -74233 314907 -255062 -187143 -82521 19813 149479
18855 149479 -177744 129686 -37802 28068 -27160 -69308 -23141 245699 22338 159207 41313
18843 143872 55841 -57138 -361210 -97676 -342825 240604 194137 -123749 -237095 -61259
18832 -36634 -138775 -167836 188741 80172 171559 274107 41784 -362818 -225728 -102190
18821 -111954 -362053 -33112 -185827 46128 -334503 112419 234298 -321923 -183357 -31936
18810 93781 13423 -31847 204672 -2022 -345651 143350 -63370 21323 -282939 -88730 -198866
18799 -198866 -18600 253861 12543 155551 238600 -115919 306164 -60826 39598 64125 -149244
18787 -115058 -63884 -111112 37108 76969 150794 -112188 -17355 112213 71917 -101563 147941
18775 25687 -81964 165656 -27472 -261650 191078 23196 224275 -28620 -83043 -185036 -404380
18764 -404380 18940 83929 -169406 -195649 99385 -409629 -59570 -11012 180012 -9926 41851
18752 -126752 -26120 158691 -250561 186931 -231538 -20141 31875 43062 -82937 94084 -211209
18740 188173 110887 104547 -330598 101576 -204360 -132877 -200527 -112902 -162342 214492 -305751
18728 -105419 13557 14875 -224013 -153920 136916 119343 5978 35832 216380 169692 -318489
18716 -93991 30116 326449 -208037 -153632 -143003 122032 115765 -576476 -326320 -69358 -29071
18704 -260207 -19463 -204275 -130873 -541873 -153197 -162977 -138741 -164305 4305 -155298 -166837
18693 -166837 -14691 -218356 -124249 -19543 -94619 93718 -36437 -292770 191306 8053 -257360
18681 -97454 -342970 -437252 19018 -147818 119493 -187306 18197 154095 181312 -105741
18670 -21572 342018 7422 -17447 167570 244993 -264365 -384236 -140165 10503 -56337 6002
18658 -190478 -594080 -113140 -237117 -85384 -409503 170762 -50904 -45457 -80210 35950 -73684
18646 -243833 134660 -359018 -103392 -113131 -59836 73954 160366 -120125 -310358 24827 -187760
18634 -129470 -112382 -46430 143764 42793 -117275 240701 7488 -146490 -230631 -200892 -365507
18623 -365507 108756 -157533 19457 -19171 -266083 -39410 -288547 7343 43716 -51654 -38826
18612 -38826 289375 -96394 -21483 -54346 -137361 -99056 180926 -108834 99773 37226 -49994
18600 -92208 -47096 -82730 -64373 29089 -189946 -83342 -50368 -251990 -235444 -165043 -209486
18589 -209486 202794 -389204 -9047 -35031 86243 -47088 27551 133122 -174742 -209690 -412694
18578 -412694 35383 154398 228755 77460 -29598 -144817 -243214 -214630 -6776 -170963 62777
18566 115129 154095 130418 22366 -31771 198014 -89315 2462 -100696 -293372 105936 199374
18555 199374 -126757 146407 -24194 38718 -214196 -144986 42468 -97287 274380 -68598 -177357
18544 -177357 13781 108440 -329768 -104509 243600 -348739 -229491 9707 308129 -97943
18533 122508 212671 205911 -102503 2088 -150233 -230091 -73480 49804 -76319 295023 119471
18521 -210710 138759 -36665 283452 94466 80233 -33427 -132460 -80261 -374803 11936 -74140
18509 -71439 -271999 -2165 -35264 135511 -315079 -231389 92401 -128750 218935 -185266 -49593
18497 -198762 -617 -360184 -273098 -136020 -93712 -65878 -188008 -154836 168644 -354101 2593
18485 -123110 28858 -92401 21759 -287172 -62555 -102652 31633 229027 -61587 -142912 -99956
18474 -99956 63880 -95128 98589 -18464 -147855 -100932 -229459 -15194 228762 -153845 -219343
18463 -219343 -320468 72294 -149390 200704 -288385 -131540 -71889 -343863 -58938 200607
18452 -106583 -96532 157354 66112 65223 -215674 -49752 -236436 -225502 -38185 63549 -207594
18440 285531 158162 -197163 146159 30899 477313 51578 -355262 -78337 -88927 -6786 146498
18428 72223 -242688 511709 124185 2288 -237210 115623 -114399 -296192 299613 -97485
18417 -94909 324871 -213197 8689 -447647 -85512 -347147 -199111 86471 355223 -329052
18406 -105256 -23666 43315 93527 213047 -200491 -316618 -6827 1295 -17906 114187 -300528
18394 -199345 -96872 541647 -428415 -213480 -10227 -17675 27089 -158467 -46229 239603 -255541
18382 -12770 378117 -56391 -253763 10202 180680 -328336 119754 -263358 178669 361280
18372 361280 -267584 173859 -5946 -111594 16568 -249423 232196 19471 -27962 79590 -128215
18360 -94809 -155867 -257556 39284 -95372 -44876 73115 31528 -136916 247027 -152886 -142497
18349 -142497 -89335 53821 124913 -47677 -362266 -17130 -14730 -167205 -143213 -92490 -89246
18338 -89246 175772 53949 138596 -33658 -57708 -301453 -274714 -257830 -578621 -136088 -107108
18327 -107108 303011 331631 274729 -88028 -15053 -122503 -83658 -259305 47663 -270924 210088
18315 15088 -415733 -51031 -168392 -45619 22705 -153415 95096 -497446 -372195 -42892 102227
18303 -523914 -292807 -29646 -21583 -76188 -29915 204059 322071 -249405 -1461 203534 138804
18292 138804 131367 119055 -161461 19550 75169 175170 -89557 29523 -247849 -208605 -111936
18281 -111936 -42690 68329 -18809 -257000 240885 -132283 -9739 -527184 -108840 -132110 -85562
18270 -85562 51902 90267 -110566 -92570 -61164 -306198 8704 -85616 -113166 -211163 -221707
18259 -221707 85703 -97040 122297 -56194 54779 77621 189676 193808 -132750 205222 349579
18248 349579 318155 317880 -34778 201253 -103915 -211217 -190230 10486 -519817 -178762 -51837
18236 242557 75867 -70794 -160481 -147966 -52889 73889 170392 31107 59945 84516 83050 -246724
18223 43881 100833 42167 -262744 7799 -96556 272022 -231429 -63189 -236613 -378554 -106049
18211 4753 82985 -162075 -79278 216481 186 -146536 17669 440943 -201239 223164 163709
18200 163709 185869 32048 -306101 -55982 54359 152089 17327 -102408 -226519 23349 35981
18189 35981 -302611 -80451 -148226 -13403 -201574 20302 197108 -104148 318799 -213770
18178 129648 74545 -204589 -99637 335222 26669 -108510 -188513 -67268 -58942 -375097 57327
18166 287631 -291721 -60167 59557 236242 123729 -251601 -133087 -14295 -323584 -75040
18155 -151939 -265753 77725 208003 233975 71314 190557 249965 -208814 188655 -265814
18144 -247968 147399 32070 -153013 64225 59238 -75894 -160706 181190 -260944 -50760 44758
18132 -321700 -135492 -30719 -292996 -82519 221868 478831 -2910 159566 34390 -483854
18121 85174 268343 -14639 206699 -171264 -313006 17820 36290 69634 -122845 -71978 165808
18109 -132268 172060 212342 -462790 248098 57785 61185 -255946 -208051 53180 -29146 2935
18097 165043 -24228 231545 -295285 -175028 305268 90154 -201013 -5083 198580 165173
18087 165173 -58559 -112686 176031 -400891 -129272 56462 103155 149786 -162805 101053
18076 -56970 105300 -73669 -446815 5845 -151247 77247 -198418 96042 66078 -208699 -102040
18064 228827 77827 66806 75836 -149214 -45667 -177214 32409 -166328 -124240 -125903 -66788
18053 -66788 -84138 -81075 -313619 -62320 2882 -222568 -28149 -77324 -240321 128795 -240221
18041 273931 102183 -65127 228603 -87167 53758 245536 4394 189423 -349821 196120
18030 -202086 -56331 90669 -519792 -225308 -174740 -21512 -424654 181634 -124574 179917
18019 133104 10920 114337 39996 -134070 11935 -82177 5939 160943 -257597 4703 73450
18008 73450 148323 -140605 191037 -339070 -57875 -13012 -299067 -186196 194904 -114020
17997 51631 -425187 -171776 -86638 101888 -194642 55700 -325906 188 15826 42544 -137937
17985 -189278 -254006 -209976 70440 150624 125784 -119357 -84390 176308 200742 -248300 -155291
17974 -155291 -19576 83403 68275 292179 159824 -1137 130256 55753 -317515 108933 -206557
17962 143929 381245 -111059 -128908 -345378 -177727 -245287 54003 72877 -38569 73168 -150997
17950 167883 -108811 -240787 164936 -45008 -250750 -20245 -259205 103622 7529 100814
17940 100814 50296 -107205 78904 -294177 17760 39423 50820 -89618 -144847 111393 78638
17929 78638 176323 -132544 375555 -80003 -164422 259914 75065 8567 -162861 71206 137102
17918 137102 45715 89737 72646 -188473 -55389 -257417 467397 -37707 87699 201268 -3384
17906 191043 52597 -176070 -36991 -2800 -13259 -73214 -194677 84048 147049 536282 89720
17894 14539 146533 -256442 35460 -137143 -217393 -199502 -371906 -231013 -155490 -60841 107460
17882 291851 -103176 -174706 145182 50699 -219827 166469 -35453 85076 -48235 121127
17871 -105162 448345 80783 -109774 -65330 -46495 -49311 40938 -61939 188129 189240 -60096
17859 -454594 -377195 72778 311557 -15032 -173769 66985 110009 -243928 -192816 -126388 -157607
17848 -157607 -158769 47582 -205931 -270171 165582 -7580 102914 -360749 66213 -144257 -519518
17837 -519518 27432 -147151 178288 -219696 187675 142147 36802 -92944 69237 122244 -67828
17825 -54257 50501 306672 184771 -7988 158922 18679 -446999 322656 -27445 10492 -98564
17813 99233 -45556 -180906 70285 75871 134519 161957 -299654 197656 41751 59652 9231
17801 152995 154543 -234154 -135673 -85286 -294702 61051 -277930 13296 167319 -119805 70070
17789 22523 -98637 -23198 233886 -8833 -293397 -25388 -96025 58350 -95824 20810 397029
17778 397029 -344601 -296540 213601 -55832 51160 39554 26523 -322319 -198506 49431 15409
17766 81498 47301 243573 11292 1473 -295781 -75773 54336 -179907 -73819 46472 -195041
17754 -198129 -72642 214012 -193886 56826 -22178 347580 55094 4843 195410 -84695 -139023
17743 -139023 106342 193063 298838 260182 42671 -83891 -234467 -387994 72820 47324 1520
17731 -279338 -185326 -89281 -86820 284559 -156101 -144284 -187603 -160501 -186701 368052 118484
17719 11684 -351237 -14215 -54713 -350386 -345666 108241 247491 8337 -63283 1197 -5905 70843
17706 -196800 -219711 92515 226698 236139 -21458 -178787 96722 108819 38239 -175178 62883
17694 -33291 164727 38077 245706 158646 165799 142303 205316 -480 -208603 -100091 204101
17682 -333009 -216215 215724 31019 -296831 -484895 -55185 -13706 -83588 -201248 -18824
17671 54902 205678 245007 -192321 -39881 214892 27554 -146263 43511 181788 11884 -420177
17659 260999 77450 367139 -14375 -169577 101481 -94737 -19727 16458 -101773 -156194 76012
17647 214011 32441 -131754 -222874 -30345 -81337 -40068 161363 -12379 -77988 -204872 -77664
17635 -42674 86982 -186723 -6251 89244 -63369 -92142 -247061 180460 17383 55137 -168607
17623 67936 -237181 335450 9078 6598 -93654 -60705 -82850 23240 -56939 375632 99504
17611 -100095 261240 -82921 -80404 -71517 -48903 54753 75394 405793 48046 163876 -54105
17599 38955 180990 61000 -277235 -51823 -228144 -46426 221350 -34386 -26512 160132 27027
17587 191125 -11657 252624 281682 -421538 74691 -64478 -223208 278259 230115 231568 243017
17576 243017 -8558 -259523 169788 307659 128747 178739 471429 -16317 -401162 278857
17565 -327403 -239559 335047 -161775 369956 -99800 -109968 -82932 -172290 150181 557609
17555 557609 -187547 112423 -140323 56284 298085 -202378 -71443 80050 -17511 -14639 -55661
17544 -55661 -89833 7655 117657 312518 -55141 93121 -205477 -28400 80774 162670 199506
17533 199506 -322242 195718 86145 356056 393110 21157 98986 7815 258529 -427445 -273263
17522 -273263 -156533 135049 87064 -14289 322602 -79806 409443 -129984 42440 283174
17512 283174 -49573 -97661 250067 14955 -116907 152985 -72400 170274 147400 -78050 262820
17500 -60997 95000 87012 171979 21723 -12444 91677 212084 13975 -4559 -50471 101309 175003
17488 175003 -199566 -85838 60534 -169038 -98561 -73068 91952 -171162 275761 -51308 186990
17476 94464 95903 -85858 -27750 177931 208405 22596 167322 57066 273928 -54632 -78607
17465 -78607 -128498 -35080 173731 681 328942 9829 49789 147854 50631 -77882 202301 -203259
17452 440707 84646 126100 161775 279659 234182 214837 225967 34181 41200 357594 200389
17441 200389 86251 288483 195530 628209 355252 393393 48444 74570 54775 219637 157369
17430 157369 383441 184307 402376 124020 143503 184834 50568 56608 181321 36526 213895
17419 213895 402091 318778 283482 276633 170013 196145 240498 38489 -27093 228083 200427
17408 200427 62890 139164 260817 -30629 20828 80141 192865 45737 -63074 -72805 215969
17396 289271 -9616 151154 95512 29263 346065 432348 444983 180053 77323 66501 20896
17384 416607 159072 35610 354288 61882 196341 220452 15410 90218 370160 -921 268559
17372 52601 -231882 94561 -227910 11713 -48870 -257287 -227399 -22186 209458 95283 150498
17361 150498 -64286 54386 127574 217498 -231226 172075 -265591 62362 -127086 -37999 -54292
17350 -54292 366020 205820 -93863 144713 -223878 138808 -115220 -285109 138770 112546
17340 112546 71826 21864 103923 266751 -149947 -31351 187206 103958 -6175 165162 244556
17329 244556 -68031 336978 138539 251709 -81818 226659 382546 255840 149121 174284
17319 174284 135198 214435 -89195 95268 230278 69638 37253 230179 -62396 142176 42963
17307 -23197 196945 96880 86698 406893 181639 -10260 -41554 310693 185833 76566 128585
17296 128585 45353 200578 102353 99119 193063 203309 311667 164773 31889 48839 -86589
17284 199626 101869 264884 527971 -71730 355271 71498 239635 99317 87187 -153670
17273 128481 42634 120438 -197133 463796 216671 84758 552445 52456 -34493 -13325 346787
17261 -108445 49608 -80850 145674 382305 278494 102676 44362 16887 14267 238768 -5053
17249 107280 186126 -135747 196304 338994 -60354 34307 185572 206456 121492 501688
17239 501688 138491 74626 128534 -229419 191033 511747 236374 175030 561919 178920
17228 179257 -227299 121123 147790 166684 385324 280750 224026 -36535 -84862 426861
17217 51464 191265 -10922 349236 94528 100602 175660 84747 136366 212982 762023 260355
17205 -53693 282989 192686 356242 8406 315870 326294 380993 56844 481446 334779 464647
17194 464647 468919 239521 99566 77331 321242 392645 250973 129819 120793 168680 156092
17183 156092 300133 27252 -50879 482059 299336 160690 138754 59166 133068 304360
17173 304360 419441 83155 -73528 345515 28376 52595 274680 164773 -20422 40046 398096
17162 398096 318408 419870 234885 270299 594235 199210 56375 593950 190762 328065
17152 328065 458413 49838 578057 174349 157003 234054 424015 165104 331492 291817
17142 291817 248566 290655 188056 78794 -7512 203045 39789 -31845 229642 112217 473657
17131 473657 16136 27219 622955 352436 586813 675727 282303 286413 417730 -30304 52181
17119 300689 381327 637586 181566 14904 372080 676031 294135 540620 590818 475841
17109 475841 324125 180716 373284 253854 499831 197384 281841 -14936 400702 525686
17099 525686 289923 -142983 289421 232807 635814 571692 441478 253742 95142 432257
17089 432257 284665 358611 422665 211594 38204 561000 239197 276669 283500 482681 300254
17078 300254 412963 202747 513625 371308 498052 611081 411960 528182 678572 429695
17068 429695 299084 93948 463168 478718 359298 67209 684196 385096 381888 280950
17058 280950 244965 138381 544128 319086 794640 666323 343637 436018 715502 306166
17047 424963 366732 557042 658522 623614 374137 258473 536847 667997 650528 750663
17037 750663 379777 559722 652795 380985 387350 357106 603758 509076 493295 818229 783344
17026 783344 602809 630943 492761 617472 487795 761738 650184 516381 524987 439371
17016 439371 653205 508536 526425 451075 868706 700980 688938 424853 973484 697827
17006 697827 542527 379491 855545 826854 771750 757348 590507 351109 622808 720599
16996 720599 801490 590708 912977 676426 563755 799029 724215 786083 829750 985546
16986 985546 453483 591395 295335 841852 930385 638434 676135 548526 659053 946556
16976 946556 980504 904925 705001 715155 795347 391086 677629 518258 944627 1056850
16966 1056850 795561 807978 927254 1313950 853744 614024 771184 1047854 778867 1050504
16956 1050504 905549 956700 905429 1028284 1102695 737472 845758 1136483 853495 1073191
16946 1073191 1009826 893614 995528 896403 715078 907806 1189653 1184611 879242 1104652
16936 1104652 973534 908185 1277895 1490410 1016188 1308693 1434557 870734 1453469 1327831
16926 1327831 1132232 1355982 1392482 1171965 1196601 1064207 1107122 1369710 1456077 1179147
16916 1179147 1204008 1368638 1699185 1321403 1655353 1444721 1552261 1426181 1756698 1162948
16906 1162948 1682773 1684564 1343126 1521128 1788504 1700896 1419155 1534750 1878550 1763967
16896 1763967 1678577 2022697 1635745 1872754 2057481 1780992 1809321 1966509 1709707 1938768
16886 1938768 1998820 2066708 1931885 1781353 1798117 1839577 2043024 1834519 1999383 2424597
16876 2424597 2341920 2209409 2307435 2166559 2223927 2201085 2695470 2809594 2517433 2409465
16866 2409465 2409230 2265777 2491490 2872713 2445253 2962681 2921277 2647220 2791793 2728528
16856 2728528 2768910 3399938 3040280 3094848 2910578 3091513 2852909 2992382 3157445 3163186
16846 3163186 3187259 3485411 3307447 3288222 3247762 3595379 3608489 3856200 3960874 4235437
16836 4235437 4075141 4002153 4251390 4342203 4185045 4501668 4574009 4657970 4866767 4590765
16826 4590765 4704269 4902442 4864283 5108567 4916355 5196958 5317922 5384138 5354315 5721464
16816 5721464 5326001 5724435 6017096 6126148 6333946 6120349 6092682 6876634 6704503 7026844
16806 7026844 7031237 7149241 7557296 7556225 7574176 7921858 7695780 8205851 8499458 8891921
16796 8891921 8864580 8919316 9247243 9468349 9636662 9874576 10364853 10750229 10871232 11277440
16786 11277440 11123993 11800732 12009973 12442620 12261736 12621675 12909238 13733341 14276649
16777 14276649 14756409 14753038 15597830 16073503 16629504 17109511 17477101 18269932 18486434 19233770
16767 19233770 20277037 20844267 21553703 22434820 23209770 23748149 24666697 25511163 26687750
16758 26687750 27889070 28885423 30213453 31340656 32523313 33936692 35257915 36972875
16750 36972875 38309835 40517508 42559295 44547759 46519971 49032949 51756610 53780633
16742 53780633 56979183 60189426 63532760 66979204 70643833 74590905 79169869 83312444
16734 83312444 88336980 93490677 99000443 104976075 110698129 117590692 124019864 130514679
16726 130514679 137827448 144529246 151794652 158191328 164391541 169763741 174985088 178700150
16718 178700150 181175924 182779827 182996400 181791289 179755195 176087636 171380607 166075118
16710 166075118 160190420 153172578 146113515 139055542 131912158 124693577 117949273 111410768
16702 111410768 104845336 98985613 93127447 87916480 83074425 78190953 74097239 70160443
16694 70160443 66131225 62745730 59284299 56182031 53340223 50718358 48228334 45867527
16686 45867527 43842800 41534124 40065218 38293254 36506242 35037896 33567678 32022909
16678 32022909 30556467 29331805 28252680 27184556 26599200 25521512 24417277 23220742
16670 23220742 22689540 21169143 21205340 20314225 19762716 18858294 18157386 17490680 16771933
16661 16771933 16534043 15936333 15537815 14925452 14508516 13777707 13737181 13234906 13105706
16652 13105706 12476831 12484189 12190957 11311300 11029732 10846819 10451408 10243016 10245642 9792916
16642 9792916 9358132 9610256 9073897 8981507 8730717 8573151 8253006 8060659 7593986 7744172
16632 7744172 7324574 7270759 7211945 7080123 6872059 6669821 6620865 6513551 6226857 6134657
16622 6134657 6260568 5971613 5945650 5691944 5541166 5317939 4854059 5362955 4951690 4825403
16612 4825403 5057267 4815617 4480598 4596712 4524120 4746293 4162537 4337850 4006054 3919372
16602 3919372 4185463 4213777 4130635 3616091 3942917 4143398 3653942 3397694 3475348 3555975
16592 3555975 3694061 3488144 3274285 3666267 3232194 3336603 3077464 3220286 3042441
16583 3042441 3130990 3334926 2991215 2813025 2381180 2814406 2836896 2705484 2470833 2421123
16573 2421123 2750330 2663501 2478037 2405858 2706241 2497033 2397872 2363810 2510352 2647856
16563 2647856 2414571 2176411 2138688 1985726 2070212 1989974 2017305 1864914 1840755 1866865
16553 1866865 1828260 2163243 1695261 1701482 1812869 1945781 1735688 1768578 1711285 1691028
16543 1691028 1722779 1532109 1669944 1865350 1640772 1735669 1514263 1662315 1318875 1993429
16533 1993429 1578780 1358096 1748426 1113732 987625 1612778 1771500 1543383 1307192
16524 1307192 1461086 1415918 1319247 1306476 1372579 1355165 1366377 1351252 1096155 1017699 1070785
16513 1070785 1253656 1410057 1169354 1120133 1347429 1243511 1062380 1172487 1307590 1003159
16503 1003159 1189651 1195257 976432 1399305 681320 978774 967668 1226910 1198624 1119444
16493 1119444 714774 929486 959966 1043478 883991 794568 985834 904010 868662 709535
16483 709535 871335 1015928 1080587 640288 1029182 1063743 584669 872647 834255 453088
16473 453088 601292 952510 920940 800575 860273 530405 734542 748810 648819 582743
16463 582743 739041 824436 637737 496699 288564 713432 942215 769078 863737 368251
16452 607273 396175 688333 498154 433725 410068 698503 168946 847758 548022 452792
16442 452792 847812 629066 572728 592486 610714 616565 953726 1022284 570522 402011 471768
16431 471768 544110 323546 707401 802917 537510 585151 465098 595678 160944 376550
16421 376550 466916 441905 465276 325072 419195 569498 338687 9470 429424 593215 483585
16410 483585 466800 324021 739501 203440 566211 499962 548611 179899 256341 436066
16400 436066 410427 113207 579113 513875 457795 408077 537821 140265 412647 372059
16390 372059 828069 435955 322176 698136 56199 157928 598142 167549 514310 161664
16379 511296 383407 388666 548102 590562 437533 687445 219702 170359 149766 434130
16369 434130 447800 248249 442171 344952 629034 16505 320595 197975 521554 717912
16359 717912 470929 582069 488340 503662 268712 426512 405887 531350 549429 184023
16348 465485 150249 171400 380950 251363 157790 248755 253075 -155130 208314 183316 512359
16337 512359 407562 179614 468376 -178607 485864 200275 279426 326330 183715 203410
16327 203410 248856 335959 -53137 323072 469051 -87222 205741 -144554 119283 250254
16317 250254 413989 39297 505471 298315 319352 473350 35510 341754 353167 291522
16307 291522 77132 258290 185054 156055 -8279 -61150 461126 199023 85832 425470 -80455
16295 185605 123704 175488 136206 -177639 -40038 179210 172627 264157 301226 282108 262831
16284 262831 197230 267317 52217 357851 297830 162915 225257 -103541 382605 275941
16274 275941 -209220 70756 422633 129360 163599 45127 168104 293630 118951 98614
16264 98614 251070 226625 59053 121171 385921 349677 142552 158208 418216 327579 125513
16252 -18343 181924 -147104 43409 247104 152945 272517 49661 134019 -35355 158790 370316
16241 370316 -60660 163368 159419 4778 323097 7759 -281477 132335 -144246 287294 153859
16230 153859 65379 224760 186987 12405 333926 60456 183251 318506 -37591 111207
16219 -35957 374384 120852 115781 127905 265686 285550 111326 -95099 374777 10999 24090
16208 24090 -540840 226426 53834 61637 -96680 18708 -207758 -14807 87000 15438 98561
16197 98561 114783 291791 322284 7548 164155 237937 29100 197901 245465 35985 -38225
16185 166716 44376 400702 -28534 249260 146397 123116 -111253 300539 345106 72149
16174 163413 3535 86528 -109619 157262 -164416 216897 252679 -370003 -92600 112320
16163 71144 294042 -43097 -112314 -254967 232080 4090 236543 26612 256114 12561 35005
16152 35005 -6036 297231 201037 80157 -13452 154291 142732 -16332 177176 203313 20986
16140 -231411 58459 4540 91417 -244448 202540 -122959 119910 57292 312415 -110819
16129 -70399 -169550 442963 107434 73165 98508 -58830 -163326 -73650 50640 113142 -32056
16117 -117038 -362412 30093 -370635 -75210 323410 -221181 -32493 32083 327024 198822
16107 198822 92535 -61807 -272793 -404796 -111111 -3316 154053 262939 -166243 -222124
16097 -222124 130717 7834 349355 -104694 104929 240307 151640 -260715 -33425 -131221
16087 -131221 52979 -47978 70280 -264478 -115581 143515 50113 -108147 54697 -47630 -127826
16076 -127826 211435 261133 -190706 -301881 -146333 -115278 90648 145813 -137386 -142251 284436
16064 -119229 321540 172907 469492 -57478 -224134 -79878 161802 7611 -338478 210077
16053 -140312 289270 149727 342 -219586 79858 -314509 63150 87328 96903 -305053 135297
16041 28074 15215 -86349 -101563 -297619 -177480 252350 -152415 -152660 -224424 62530 -255993
16029 303195 -155956 -16820 173344 142763 -316149 -23763 -89943 -90633 252275 262951 80417
16017 17243 40341 66817 -185969 4978 -120098 -159940 361908 -47653 -148413 33486 -290632
16005 -13242 -236060 83487 274487 -408863 442923 86428 151700 -194614 -300563 -116871
15994 9085 368103 -217632 -107477 -4619 66793 214628 -62984 16907 263095 464521 84421
15982 237255 317248 -54915 443883 -10312 79868 -291761 -106338 232756 -184313 -83362
15971 -100959 120615 102886 61040 -188332 349 -82 192848 158863 -149182 142667 -53367
15959 181947 -157689 140861 -170562 130438 8496 -106977 -196793 59617 -181601 -126959
15949 -126959 -81264 135271 -284124 90473 -36761 -30863 -85164 29213 108695 -260031 -29068
15937 100247 -232590 -116718 33943 2697 -142613 -62534 29976 -337657 -347719 97704 -247678
15925 -270383 -13577 -89089 -205538 -203575 129065 80406 -323561 -88610 21693 -55922 -120046
15914 -120046 -66966 -98724 -95444 137361 -214936 -229996 -114015 108056 58620 -193771 -110646
15903 -110646 20478 -81458 -77365 50994 -265618 48770 -127166 -338310 134069 102691 149433
15892 149433 290409 -197027 -341182 -249238 100016 -165684 -188948 1767 155352 331599
15882 331599 194952 -184146 28404 -131854 102829 33345 -281201 -40877 -170636 -287713
15872 -287713 105377 -453889 79823 -6667 198088 -163752 60760 -229085 268052 62613
15861 -271868 19018 285188 108869 21989 147548 18017 -100832 271984 100354 158353
15851 158353 -136867 -132387 -169486 83480 -141994 33175 237067 -107377 36092 64667 -163825
15839 230076 44840 -18157 -3732 184408 -397772 149374 212055 -193833 -170385 -143079 2500
15827 -153715 166894 248690 -54705 -175907 -236603 -331521 60956 -301736 -134245 153088
15816 -229306 -30298 -140631 -184248 -41683 133536 147464 74520 -345962 -88307 -33993 19376
15804 167986 5481 -129721 165563 -107174 -505002 47344 -88910 -239101 258145 -92768
15793 -334481 -110383 131785 -39827 142153 -226824 -347509 -231539 133510 -515087 -41546
15782 -143094 146154 67219 -117228 169084 -32035 94989 -24460 148938 -116420 -123499 177050
15770 -23178 -314997 -107639 -279652 65842 -414758 75391 -180446 -315511 -160570 -44623
15759 -132873 64000 17837 194510 -216211 -109060 6389 -48220 -213546 104881 -146997
15748 -86317 -7218 -175466 74468 -39998 212425 54610 428032 261162 125769 -154842 -61375
15736 44529 -361235 -72905 298267 180113 -39042 -107354 38487 196231 -205410 -194905 74350
15724 -30289 -316941 280302 -9888 -25130 183570 135877 -72055 -2022 -58292 -395879 -105994
15712 -91462 113997 64817 -12283 17813 87472 317553 -26482 -73434 -85307 -146072 -13795
15700 -192078 -145604 -150601 -3101 30410 -100692 -74222 -80080 -62865 -74585 84845 5905 -119229
15687 83946 36978 -260597 66086 -76712 -67617 -164148 -81455 -146592 471117 -36650 -63783
15676 -63783 -76749 127406 175953 110564 71242 286118 -85569 -3189 134954 100500 192210
15665 192210 -160523 283924 -63536 -248081 -149464 22056 -372632 -4943 88186 2276 -8968
15653 -376332 11707 -54199 -36687 -71797 -95389 10905 -105645 138268 58903 -52694 -139082
15642 -139082 -196477 95305 -185575 158370 -39329 -381155 -127246 -187164 -168422 -430473
15632 -430473 169128 -234139 166987 -95473 -157972 86353 62958 110795 30015 -117896 106204
15620 143091 89410 91008 -459645 69109 -237978 -148369 -228217 210955 110237 -105838 -34410
15608 -27351 -49641 -336154 53750 30026 -878 -934 130462 -54886 24203 -149951 200497 -159237
15595 -84449 -227358 86549 -150417 -71159 -7838 -98776 94907 -92520 -46767 273787 2685
15583 314013 -215886 89247 -269744 17764 221087 -50137 -4217 -41679 -125463 299630 -187385
15571 159643 -12076 -250258 39685 -11660 -158748 -76846 178962 -70965 -2640 -35829 237650
15559 -95015 23305 185686 192372 -63930 272722 177792 -84556 -179072 -150844 -50267 -71617
15548 -71617 194854 103578 115131 -117935 59033 374733 -356983 165207 -177815 -114508
15538 -114508 49212 -163658 79788 131930 -115489 -86691 9976 -141160 122954 293176 -340072
15526 -367162 -218968 -45611 -3542 285022 54937 516 59303 -302117 -102749 147974 -307954
15514 307685 170338 169615 -154098 75153 -77879 -334301 52912 111440 66154 -264890 17328
15502 -141561 286671 93180 -114021 105749 10295 34262 -74418 -5098 37084 -73910 -287616
15491 -287616 -86307 -74368 -140552 -151371 -330397 9916 116993 -48195 -111171 44435 95438
15480 95438 162518 -146487 -11526 130692 -40519 370984 -121674 16504 752884 221683
15469 87832 270497 25521 49149 50567 -209709 -155940 9642 219232 111583 126188 160588
15458 160588 8698 -176837 32472 92968 263073 -75561 30452 -234529 -28012 -151936 -9129
15446 -230766 91148 -66260 54181 52492 -234762 -185501 -188250 115494 -188846 -52315 -240528
15435 -240528 210808 -265124 -22320 17858 178958 20206 -81740 -16921 -122956 -115370 -17073
15423 135710 -74410 66666 -142708 91077 -317369 91418 250938 -173184 -141453 -182599 -15588
15411 196461 275309 -12470 125419 -191548 107590 157619 -91239 -221964 -236998 -187499 162324
15399 125679 -8001 308538 -253982 459842 -7917 129168 -119256 -16338 -239191 -214968 35664
15387 119002 179392 -394182 -280660 15894 -35648 36380 -222865 -14069 279163 64055 263109
15376 263109 -163473 -25268 266487 -85312 -65842 -114522 167086 280122 125294 2522 -204503
15364 -84634 -152423 -190385 243342 169827 112706 115714 114285 33648 -34754 -59102 235803 93563
15351 -190591 261572 -41697 166165 -212002 -51967 -412405 -114190 50233 17983 -173876
15340 -11547 225600 -189728 344786 -124573 -309928 611623 65882 197973 47002 -51420
15329 1744 -150953 201735 61865 191415 318644 -204083 357783 106658 -228221 255074
15318 45449 -15569 159810 -66385 -46828 -88754 138610 134299 -43958 -78276 93901 328813
15307 328813 -7247 155916 31170 -199127 -176333 -87045 -447199 -176578 265106 -250122
15296 -130777 28762 35801 294246 -215363 -228196 -169751 -157913 566549 -57098 -149445 108082
15284 -211043 77367 53799 -304074 -40001 -192673 -82134 -192235 158243 159245 337322 -47807
15272 112215 9830 -45523 -189176 -139658 -14978 238423 -330330 48022 -3655 -2745 -28726 68374
15259 -120131 -34143 227609 -155344 10316 -60167 -403908 220272 109779 205364 160441
15249 160441 338071 984255 768485 1157365 1095738 520757 349536 196641 -97644 78194
15238 92392 205539 224029 99004 631331 35605 220917 20176 59124 -48742 17370 42951
15227 42951 -456862 -126132 112343 -69842 -121686 -187754 -24372 -24723 141160 5737 116164
15216 116164 38960 95237 -57859 -152145 335573 238261 455673 141063 -80391 8806 -46535
15204 253870 -13250 -91181 -98965 -180204 -141159 1514 89137 142069 89108 -120810 -36670 28487
15191 -7858 -93001 349508 91685 190364 78610 158097 243974 206828 53851 88066 -70186 163960
15178 33375 2855 103509 270662 -102728 -73696 114668 -208557 325494 484745 177158
15167 -4326 52148 -13622 75430 270844 32770 124282 -251635 -39979 334648 -96101 62699
15155 121612 22197 -16779 212490 449162 238991 73562 -1899 -72453 242791 267979 187858
15144 187858 210374 253793 60110 222516 97024 172360 333659 252931 -11476 282399 336022
15133 336022 198078 145485 157521 216404 208847 46364 -84318 118696 323238 374254 236487
15122 236487 393435 131508 -131778 140423 -133956 124194 315641 287436 230323 68069
15111 -151833 57301 62048 133888 58945 53773 236879 217169 83634 383739 97497 -99387
15099 82477 225396 256657 100822 150985 131903 226426 351367 25390 -18230 -98497 -39357
15087 254365 -140299 -111600 135474 106334 193260 84461 307183 24361 52435 207581 -127467
15075 234372 470242 -178028 41029 -10007 -167275 63266 119273 -115336 104011 342997
15065 342997 537855 -49385 53273 118923 6699 -39012 146959 80306 166006 32129 111050
15054 111050 24455 -31582 -134453 338616 389810 265072 284577 154742 -150578 -141647 108526
15042 56139 210710 172482 34174 261684 267179 149413 174979 89051 18072 149662 -179855
15030 536561 207821 392912 192976 333287 196620 275456 287735 86574 -330137 414791
15019 128994 63998 205744 -189706 474804 -95787 57269 116847 286274 86791 288159
15009 288159 42722 200488 280231 113982 254606 188106 49102 46705 120494 -42134 275707
14997 -112950 73678 -220652 4983 15901 423563 230899 16800 66673 492 555057 14761
14985 86426 -20900 -4846 -60488 153576 435644 145271 607177 186579 6086 123774 240950
14974 240950 389708 511715 313718 277343 250644 203971 253789 170914 200601 234635 232182
14963 232182 236165 235070 333104 269647 212740 67588 -136081 288175 200786 179599 441290
14952 441290 233689 124864 41723 283414 104872 107730 365689 97184 318899 491507
14942 491507 305508 319964 384514 293636 175398 27582 343442 232512 350468 -122902
14931 669124 473342 419990 93857 376664 387539 128012 234964 224275 410814 265260
14921 265260 390683 76051 226071 607074 247877 163234 462184 -99479 480098 353975
14911 353975 156349 112114 142002 102344 404476 184029 300630 117437 317638 316536
14901 316536 370175 424802 253353 524222 382911 223927 509413 255173 113120 379431
14891 379431 315498 293583 382524 463675 570348 370170 415767 198124 310768 236469 -82503
14879 199195 84578 259921 559408 227181 -93971 288924 547851 314210 180244 305547
14869 305547 511948 493221 409303 443432 244556 365341 544289 245709 607714 277345
14858 576216 223904 116427 556510 455591 819084 271792 498693 356464 170264 99109
14848 99109 289539 731788 304349 265594 171705 425010 617416 501903 439852 329634
14838 329634 343372 563301 246181 266291 410210 321237 126493 522245 574312 586847
14828 586847 780239 377060 473302 480279 329466 -44790 372782 496888 386182 313570
14818 313570 497735 291821 395746 171374 503383 384047 653199 373351 200797 391768
14808 391768 470476 687188 450013 361841 444122 643217 627631 316944 527765 444338
14798 444338 377553 500566 112888 515097 547005 177299 158771 624576 732275 555846
14788 555846 395026 564046 449221 394975 620451 353530 203276 844632 574792 336598
14778 336598 577378 947587 375544 583973 826194 390787 396382 864049 806383 454110
14768 454110 564290 410685 676395 588090 446654 514128 597039 461938 374923 175689
14757 622159 557319 449479 737140 845459 790278 646561 986181 539156 467708 435670
14747 435670 709914 598357 877673 688824 897827 780267 283201 832004 780479 804308
14737 804308 578818 587404 749835 630782 513581 811079 486888 908123 790802 603776
14727 603776 603715 687895 577032 611314 714076 415169 796026 856475 920076 706233 846906
14716 846906 836585 719055 798124 909200 883133 545485 723014 549650 959409 999712
14706 999712 1134580 974054 796600 907137 654874 402501 904958 1252518 1105987 904801
14696 904801 852819 754797 737564 973187 945630 946693 635125 916012 1026922 764349 851049
14685 851049 864226 923430 458203 775277 828283 1160473 775805 883087 1087546 841604
14675 841604 1091286 976186 837557 511004 996363 604392 906272 795263 1280791 1092409
14665 1092409 1014519 794093 1047599 1001881 990934 954148 1364268 913153 1096541 862003
14655 862003 583672 853116 1181422 1202789 1414209 1247718 969739 1172639 1300434 1084006
14645 1084006 1193042 1133670 1069385 841023 1376670 1067031 1203810 1290831 1343208 1189433
14635 1189433 1765064 1440594 1262244 1347062 1417219 1406562 1363535 1347200 1360793 1491581
14625 1491581 1442270 1681762 1202652 1396673 1339251 1811141 1568203 1765338 1503703 1257734
14615 1257734 1537972 1274011 1543502 1672814 1359487 1647967 1456158 1267297 1630332
14606 1630332 1787969 1677425 1581043 1490378 1591790 1392883 1389881 1497445 1608041 1581433
14596 1581433 1434483 1397095 1854882 1872180 1342099 1793220 1592972 1978744 2117962 1797974
14586 1797974 1951544 1900028 1890445 1922558 1761865 1976017 1838337 1903705 1978515 2149042
14576 2149042 1873526 2024421 2497053 2197539 2106373 2180612 2289230 2301180 2361763 2430778
14566 2430778 2440026 2026830 2631819 2299905 2910397 3012776 2650232 2713750 2787829 2924454
14556 2924454 3048111 3640699 3871009 4278523 4625249 5317623 6276236 8061632 11717487
14547 11717487 18837307 29801161 31957092 20674349 11300684 6630196 3906175 2850703
14539 2850703 2765349 2617240 2380924 2335872 2348059 2200257 2345888 2341836 2622369 2317079
14529 2317079 2449555 2155039 2462398 2524950 2765606 2734481 2460773 2759708 2427750 2584071
14519 2584071 2809705 2939570 2794864 2725558 2733243 2874986 3076759 2698478 2936738 2377449
14509 2377449 3044730 3139143 3010645 3095787 3298314 2760984 3233176 3108685 3013998 3045807
14499 3045807 3295030 3219880 3447649 3360923 3344751 3420456 3557915 3726866 3571839 3719059
14489 3719059 3516152 3701455 3629256 3849298 3350776 3515219 3680616 4196262 3999645 3932152
14479 3932152 4208338 4194211 3999366 3952296 4471528 4324458 4284111 4473064 4365599 4467670
14469 4467670 4435860 4928357 4737721 4544426 4623285 5013319 4904251 4934655 4733152 4868772
14459 4868772 4863516 4967531 5047511 5134437 5124058 5397224 5341302 5533091 5716453 5701591 5488700
14448 5488700 5740719 5933411 5882926 5788180 5656913 6202168 6019926 6209949 6178241 6441705
14438 6441705 6605696 6740134 6488477 6899149 7301054 6870183 7013082 7036257 6964419 7123278
14428 7123278 7192551 7371371 7744726 7383895 7857273 7800921 7997530 7899499 8097400 8116498
14418 8116498 8736009 8636790 8573930 8877436 9118240 8946632 9234431 9390984 9783303 9832253
14408 9832253 9698224 9713846 9963709 10460266 10715662 10324993 10694604 10959765 11038072 11364079
14398 11364079 11552170 11414861 11967235 12196601 12306267 12647750 12818148 12601281 13443340
14389 13443340 13526811 13419695 13890330 14284431 14240322 14944978 14717735 15315188 15467503 15663796
14379 15663796 16159660 16498457 16695171 17038850 17346122 17629560 18213087 18184963 18588498
14370 18588498 19173544 19663408 19622916 20612964 20725915 21453480 21752386 22283710 22635755
14361 22635755 23172755 23894813 24315995 24378980 25457532 25523653 26255494 27292352 27491112
14352 27491112 27994127 29069073 29606573 30483847 31176187 31881183 32908721 33311877 34541664
14343 34541664 35317965 36433025 37254020 38370020 39414120 40276673 41462840 42821255
14335 42821255 43809714 44883772 46393682 47694618 49089954 50617712 52254016 53758653
14327 53758653 55539589 57109681 58964860 60865797 62701412 64804509 67184094 69589839
14319 69589839 71638281 74170429 76779665 79888288 82473510 85421380 88791477 91834967
14311 91834967 95439211 99365947 102961514 106964877 111739513 116164021 120409216 125584739
14303 125584739 130673560 136657218 142301872 148363367 155370323 161900046 169681029 177211951
14295 177211951 185390944 194060787 203649808 213174695 223233522 233809471 245264970
14288 245264970 256886242 268796141 281461191 294467894 307609044 321122855 334778548
14281 334778548 348657585 362244026 375922733 388540508 400977442 412183165 422102776
14274 422102776 430303100 435590135 436667652 435215584 433587540 428224907 422605883 417067872
14266 417067872 410619023 402262126 389180443 374286142 359018848 343717655 328515565
14259 328515565 313412887 298641269 284373322 270712244 258100492 246498158 234718807
14252 234718807 223580213 213549531 203145586 193845673 185101970 176674413 168964484
14245 168964484 161519440 154854247 148112940 142045039 136110943 130925882 125406932 120634900
14237 120634900 116097673 111483568 107182400 103198196 98932076 95978885 92466449 89433418
14229 89433418 85774221 82938881 80059852 77599188 74931956 72264033 69943333 67745090
14221 67745090 65665616 63669572 61573621 59755056 57742173 56318407 54494541 53178663
14213 53178663 51541345 50343483 49048527 47703444 46583416 45365009 44224368 42845060
14205 42845060 41838298 40468541 39498778 38665281 37607517 36710967 36008313 35032445 34226908
14196 34226908 33118456 32515851 32069685 31285939 30102136 29660348 28858265 27936078 27633522
14187 27633522 27010090 26416792 25991767 25555930 24770422 24218059 23875151 23231883 22757972
14178 22757972 22073203 21967837 21442966 20964628 20457891 20383510 20077057 19415578 19348348 18963338
14168 18963338 18402521 18437812 17781722 17108042 17345051 16596042 16611104 16063660 15922860 15888262
14158 15888262 15481045 15289140 15056103 14876852 14355206 14027337 13947104 13665847 13608234 13430603
14148 13430603 13532920 13077461 13060732 12733209 12335573 12102216 11971126 11772180 11866641 11512254
14138 11512254 11488375 11440519 10954473 10736122 10831125 10710679 10474385 10486776 9956596 10074901
14128 10074901 9913736 9756638 9264908 9218301 9210561 9607468 9265500 8799241 9099460 8811801
14118 8811801 8655081 8492021 8151599 8400898 8214712 8225025 7816937 7827672 7851595 7326885
14108 7326885 7616565 7900146 7559537 7268540 7508033 7251999 7072695 7027953 6965561 7043489
14098 7043489 6645241 6605085 6787405 6239792 6271975 6222645 6534962 6199823 6172611 6273938
14088 6273938 5980397 5875998 5848611 5895658 5669662 5662261 5499776 5553762 5415729 5416143 5449611
14077 5449611 5555641 5472048 5372268 5106430 5231644 5283146 5220297 4893557 4880579 4698481
14067 4698481 4948915 4708661 4708789 4987073 4489940 4580635 4359035 4436399 4691913 4602250
14057 4602250 4759174 4516531 4189861 4371369 4436295 4048768 4343111 3952594 3822065 4194259
14047 4194259 3899362 3937165 4110520 4117332 3927665 3798797 3987738 3735750 3837778 3843825
14037 3843825 3568858 3656663 3718792 3814353 3476735 3271126 3295101 3692419 3449880 3478138
14027 3478138 3304406 3056866 3449847 3331357 3530773 2732185 3300855 2922172 2865898 3288144
14017 3288144 2987817 2945524 2975050 2902498 3183193 2964316 2892327 3052332 2888939 2717978
14007 2717978 2896206 2712445 2806935 2575764 2570099 2862424 2788953 2603699 2767175 2833081
13997 2833081 2860689 2907580 3020924 2976236 2854657 3253735 3323477 3874928 4645526 7885934
13987 7885934 13911899 24975894 32008010 22350830 14443164 9499069 7121198 5512361
13979 5512361 4813045 4191943 4043605 3670033 3716140 3127401 3118645 2787446 2925990 3182284
13969 3182284 2940373 2594663 2656018 2310844 2639545 2717829 2861174 2726953 2505228 2426679
13959 2426679 2700253 2484762 2389984 2492513 2465914 2795369 2289437 2197460 2170305 2512015
13949 2512015 2078710 2240051 2478408 1986330 2047412 2161383 1961088 1909478 2300510 1780349
13939 1780349 1805510 2065886 2212299 1784170 2021723 2255392 1568912 2018619 1960707 1960109
13929 1960109 1926854 1655503 1555596 1741989 1574864 1891202 1852281 1777961 1864831 1604709
13919 1604709 1913632 1748378 1555966 1500121 1689019 1466597 1718591 1410128 1929390 1572115
13909 1572115 1496262 1579411 1680259 1813069 1418238 1457888 1520097 1480464 1444389 1612080
13899 1612080 1523762 1625035 1523921 1396603 1553989 1535990 1590074 1459803 1038481 1589297
13889 1589297 1570870 1097326 1366911 1291879 1329518 1437327 1733003 1493693 1405473 1107998
13879 1107998 1523752 1581164 1234440 1320138 1128123 1143187 1134659 978377 1361579 1439630
13869 1439630 1154947 982597 1209573 998587 1550533 1303415 977534 1243888 1201743 1425194
13859 1425194 1317424 1232033 1137191 1231136 1579073 1412264 855746 1006651 1012470 605267
13849 605267 1262452 1093209 1096427 999285 997348 918976 1194421 1148597 1127623 1091229 1028332
13838 1028332 1155600 1270581 1076791 1360130 1213676 1220083 914964 746435 1227834 759230
13828 759230 837654 1055350 1126981 1209503 1104823 1254018 978179 986548 982870 939437 1108391
13817 1108391 602899 803749 1209527 888165 1192073 1149355 1100316 828260 781577 1164540
13807 1164540 928415 1027479 1073753 995649 1015489 1075938 1235074 856074 1216203 896167
13797 896167 954837 559110 1018456 983270 978226 839177 807808 1132872 903246 779970
13787 779970 760547 578324 661841 1010553 659347 962829 922968 767859 935328 755807
13777 755807 890028 1127901 763415 738328 750178 650556 545953 954110 629402 686661
13767 686661 841785 820866 815258 772821 667898 642381 970974 870382 882184 430577 727551
13756 727551 854882 881463 283616 626562 634291 839236 662010 993415 921977 683228
13746 683228 638433 532622 449399 545622 800391 838696 929141 466433 766352 561258
13736 561258 594146 794727 936092 697631 839924 637057 547062 639825 784331 573503
13726 573503 967573 859588 798321 654963 518649 750425 643906 814681 782029 609354
13716 609354 889615 503480 775238 584527 781191 672663 734896 455968 178229 294860
13706 294860 445426 750595 298903 813453 337176 778375 654595 451171 636578 451063
13696 451063 729329 823112 428885 633218 647920 436849 555635 672600 456853 586361
13686 586361 529068 520702 750915 200060 565768 685915 473293 552397 759715 405563
13676 405563 562798 459748 693876 757844 426461 576803 644808 716477 668425 755844
13666 755844 656814 470519 433877 373698 499874 349218 682279 289790 605724 500840
13656 500840 633272 450790 459707 352613 523092 680774 333146 383985 183132 488045
13646 488045 410860 493838 570273 724678 195072 451433 415782 419834 276255 418760 709676
13635 709676 741768 436316 620842 580326 588494 588072 202107 471216 310827 563001 396368
13624 396368 222272 525013 661730 330782 361099 461162 243975 468423 473628 913033
13614 913033 405623 351404 627126 492251 663191 605227 355640 248238 540115 135490
13603 452731 673616 495565 559406 209239 126775 706878 586600 548801 218727 367610
13593 367610 439816 769306 334905 546872 589473 252387 331058 482693 285926 260381
13583 260381 723922 371669 418512 367450 61748 274054 328547 391920 364231 461804 463445
13572 463445 196576 152958 -47730 345315 392858 585572 441611 123934 165482 300527
13562 300527 569064 458548 -20779 421802 208110 109258 538204 472954 425630 463521
13552 463521 -9515 651595 383238 128074 267364 587294 723053 382237 408711 220747
13542 220747 462340 87550 161769 279922 220592 621202 57590 314094 204151 357277
13532 357277 348208 241702 388496 202725 525877 29560 715118 500853 141616 351262
13522 351262 -78434 224250 612393 88081 214237 399266 707576 558830 207092 305618
13512 305618 212365 153832 65607 498150 16152 133428 147600 376741 265184 413371
13502 413371 452708 622872 426109 227088 440905 34730 308021 253705 27759 340640
13492 340640 416309 354772 259910 -80477 41243 83022 420479 205425 135102 69296 75839
13481 75839 347703 -109194 292093 202180 47405 624215 186458 466080 503784 347145
13471 347145 535246 526672 385849 417257 257562 154807 396184 488063 143081 239205
13461 239205 59454 296118 425677 314945 243039 212175 67670 15635 232694 341007
13451 341007 321979 121889 189820 492439 285802 55413 414894 -77720 308510 368020
13441 368020 228074 119892 507918 379111 441999 141745 -122277 139472 477069 458743
13431 458743 41839 260279 571725 275067 209515 438607 -264523 415516 -15235 61602
13420 374692 163854 -32867 -20723 493080 256256 353928 233555 370811 282020 368280
13410 368280 -125972 179383 25410 84688 285615 80365 138409 175804 469072 104615
13399 63460 220438 215462 101102 46496 170509 115324 487548 146775 349237 104751
13388 41247 400252 167004 313829 394067 571685 205962 158814 339007 234691 352911
13378 352911 510482 200107 125134 80045 66133 572564 299645 471163 126447 194059
13368 194059 29646 424611 251845 285273 118673 341871 -8344 489255 222681 260110
13358 260110 144980 460219 78082 535649 525707 454830 359116 62397 548507 287186 59177
13346 473666 11147 176331 461682 173254 65785 49606 -89119 72851 -1463 204223 295808
13335 295808 412473 396021 538939 505169 271796 -86397 179942 357436 300634 429367
13325 429367 232675 436125 17625 334182 554402 590863 374349 146541 177913 171117
13315 171117 309941 78027 268395 303944 -5090 14334 -26697 159498 249185 259613 41530
13303 282004 -46582 -207139 106611 126534 138022 503458 92836 375270 33341 104317 171341
13292 171341 193070 242517 324701 397769 159792 408051 136465 175215 123897 188424 107046
13281 107046 201100 208032 103238 14604 419434 -194352 23402 284456 -52156 172913 181323
13270 181323 171056 227712 266749 -21570 137415 244868 120914 131208 296546 387727 236560
13259 236560 435816 -213461 154738 -27349 -99931 15230 158677 176503 267161 221834 152227
13248 152227 324452 101903 509757 81170 150081 63408 558910 65458 529787 252647
13237 218271 58980 176114 50791 567302 50287 241360 82375 325837 93277 120447 382146
13226 382146 89461 -77023 383523 -128410 79259 -6657 238793 267614 260324 343153 65470
13214 -158036 301460 -91403 43109 -148571 76080 325941 44869 -72847 122110 469850
13204 469850 -28418 17037 69556 79243 52299 -13041 -103186 178379 177049 40 138631 -79935
13191 -43883 165012 106035 -144925 160328 6928 90302 47661 292172 304955 133018 232399
13180 232399 -100867 -129204 -125278 27146 184921 -79290 -16211 338676 -254305 175909 91389
13169 91389 25173 -46476 -155829 -10204 60962 294823 -37676 -34701 305814 -184856 -31241
13157 116238 -135498 136060 253227 -100937 168400 56141 -59770 65969 85741 21333
13146 -6617 90631 268352 142033 125025 586535 380022 83599 102274 243010 51457 -45517
13134 -23925 89902 -220817 153083 34064 155551 -139091 155575 184140 186217 -99569 84185
13122 -49088 -147369 -213221 365595 421931 184790 13570 361814 27679 97050 430115 206485
13110 234505 193398 284752 314548 113586 106471 -52065 -72449 -283921 111254 16659 78859
13099 78859 -84402 -141966 -399274 7439 -192408 124979 -374852 -54923 140447 -43696 99288
13087 76335 119232 -138780 139689 9093 272760 37487 145427 265042 283857 437987 389739
13076 389739 -248247 236937 -144031 147995 2016 34763 36559 -95892 -16809 98594 -154036
13064 57713 -73930 279477 98535 -235850 167324 449419 1403 -185341 277604 84203 -60445
13052 187173 454536 -7475 122719 151052 -71777 163662 385263 51249 210267 102580
13041 -306016 271022 87137 141119 476431 300667 320716 -48776 244155 254260 16343 273186
13030 273186 389400 -43682 88345 160711 290904 -100330 203721 269689 376730 208866
13020 208866 -41503 359997 7519 392789 -105792 -8868 378616 130471 249847 -171726
13009 42312 78651 -197933 128733 290919 -117341 125092 5784 328458 156597 82671
12999 82671 47771 188148 -137434 278067 36472 408935 105926 -52882 177282 98845
12989 98845 -33690 -5161 217335 172039 -250311 313119 -193237 161710 131836 42866 -498393
12977 -157123 -10837 86702 41706 -141504 198333 100637 290720 -171683 -52622 -90086 48876
12965 364820 260418 271185 109161 173636 -1840 20642 -37111 270001 209944 -481 215007
12953 53760 -67792 52977 229947 -3822 106101 113981 4860 -175083 147501 259000 -75227
12941 4410 123305 300531 189998 -338379 -6016 302781 -79048 -107186 461372 29810 81107
12930 81107 101645 31374 187299 277363 190823 3493 -18350 82020 213296 -446187 -13192
12918 209246 -5953 322091 -72889 -160861 -32740 151482 95379 272387 122387 -34295 322897
12906 -79668 -111779 65708 -147912 -298734 47082 -147333 -218980 337887 -60721 -5124 -11902
12895 -11902 -14836 -96592 -156580 -181789 433407 167226 248538 -33146 103586 106696 251983
12884 251983 -231287 -77081 -187770 256534 -379046 261269 211951 8598 140537 176637
12874 176637 403827 16905 -183278 71290 239113 81455 40116 141867 15428 -16124 218034
12862 205737 52392 37480 106714 58351 4422 221233 85087 17643 240411 140397 -55454
12850 43483 -28292 169714 161685 132862 285572 -151612 -19291 201533 329023 210961 -17562
12838 176947 277076 -110347 381548 257887 -199606 121599 -282551 16805 424579 170606
12827 -180681 284872 -313435 10041 -237512 157504 -157753 287763 242730 43906 172734
12817 172734 -89490 85188 -145133 -98725 93592 58054 -112273 397598 18192 -131422 -182681
12806 -182681 -73216 145404 25879 22357 26928 137502 92611 -252229 134086 159954 49799
12794 206719 -141352 115338 6965 129766 39747 -256058 426713 -107471 116945 278796
12784 278796 42431 -74660 -175830 199622 -95501 88856 350124 62213 78222 207942 -229125
12772 -272742 214373 6915 -272985 25850 -9307 40678 102749 -106150 144428 334869 22536
12760 -49577 71112 157669 102213 -1555 42362 -66339 115624 -218397 -7141 81274 -6375 -132280
12748 -132280 11142 347332 -374046 252144 21682 148350 49167 -83329 220783 -87861
12737 109747 106346 183234 -14500 422348 160706 -199418 19131 165616 -113953 10185 247634
12726 247634 -111391 246544 92160 34585 188102 212553 -57302 14904 -24903 -68051 -314029
12715 -314029 -146508 -108864 359855 54959 64683 82183 100926 97400 305586 90097 274985
12704 274985 206358 341987 128753 -103433 208366 409126 164015 263027 175563 -341986
12693 364924 195307 -253963 151074 -185933 -43495 25497 -105550 360469 24440 -75023
12682 211153 -42183 457977 -22887 247674 -14616 -224695 7277 269194 287521 112514 -60426
12670 -123875 -92113 348375 -149451 284003 -85771 30086 -67190 78687 61412 121561 -102742
12658 -198112 445012 159479 -64512 317009 376206 546454 -23488 -54526 32061 171811
12648 171811 -124604 -164194 -65256 139097 -16128 -23519 -112446 177537 203064 346424 218007
12637 218007 85460 253052 291741 61676 -131670 234163 44996 205372 642561 284305
12626 341716 307176 -217633 379772 352734 49257 -209413 320368 399913 200173 105272
12616 105272 -12049 106244 279654 52033 36409 -54656 74503 -42938 -54716 198836 -72319
12604 356546 107955 42379 138847 -123162 327932 162427 122304 189834 3150 -86927 214916
12592 186893 169228 948 276841 330209 34419 218796 16246 158566 91090 98741 81508
12581 81508 282425 26363 -415962 -118406 -86289 65714 85849 73311 53282 332093 139923
12569 511442 -93393 -214456 99945 -82202 157289 43746 -269180 120094 -60877 127268
12558 -61900 -158277 203151 -176929 40952 25145 111616 7858 168536 -144221 -2029 29233
12546 127417 -145848 182819 53976 162139 -244970 137127 317367 -40520 -113670 -164151
12536 -164151 -29292 222532 -98061 -27229 156661 -204578 251583 64186 -282984 165731
12525 23024 111794 30818 -24805 459460 -192277 -46738 14927 219616 269635 291663 -120014
12513 186992 -209289 161503 -56619 78155 130511 106594 102758 168232 -72555 -148179 -300906
12502 -300906 16041 61781 100734 -439111 -157663 108812 -115685 214444 -10239 123924
12491 33945 13623 9797 62269 -438183 247459 56519 -99240 -207450 249934 -47643 18161
12479 -32108 28444 -4413 -314788 103 94020 106297 54471 85836 27960 -244159 69151 -161723
12466 181506 95821 337378 103120 -90442 -399827 -281059 -208023 168588 -352350 -225134
12456 -225134 153273 38792 -151809 445239 150554 -127673 13006 -293643 136460 -39777
12445 -90279 -44239 314700 -50971 -72253 -97735 -62226 75647 61979 -90493 108716 260161
12434 260161 218812 190012 208336 20294 -2839 -204520 335150 -26582 -16161 -262107 -221806
12423 -221806 -186795 -50854 -150088 -57582 -74503 -113119 -128030 -380488 -341769 109080 -136493
12411 171332 -149389 -74292 -222734 -5027 214882 21880 -326962 190409 72485 -133708
12400 -308003 -85236 74071 -68009 32666 -363489 -162847 -94824 1910 -89727 -189759 -331931
12389 -331931 44536 -52958 -11715 174900 -103194 291499 133898 -67460 -50875 -20634 175291
12377 245123 37500 -187980 70703 70928 33312 254413 22111 -23887 20942 201196 220518
12366 220518 -100460 -316612 -31791 101492 323853 130764 -289359 37946 64404 194657
12356 194657 -125136 -2650 5040 34588 -148936 -318155 -39930 61053 -241683 19463 -435595
12344 65470 307342 145299 28659 72244 -8262 -146462 -158359 -229694 128756 50152 -65728
12332 -98886 271677 67816 429049 -103854 25945 94345 107913 127257 -8228 11125 181645
12321 181645 -107706 -106001 246862 -204787 -125855 109231 80219 3382 -112419 24750 -97301
12309 56062 52981 115192 -13788 151497 -235595 -26534 152758 -242277 394844 269848 158205
12298 158205 105432 21482 165563 -65495 279481 250061 -37183 279195 312606 82943 114051
12287 114051 -156549 78509 -140736 193000 8622 -202305 241261 -3353 257565 360450
12277 360450 58306 314359 -10581 172978 405780 -35285 102819 47152 331359 -23255
12266 -250016 -95471 54094 -61858 78068 -312077 82754 66740 -88274 49151 139841 101185
12255 101185 147911 355996 212556 -159391 640583 -235010 119648 310131 -128688 85113
12244 440532 265019 367844 176094 201821 22650 -2162 143875 -16243 136090 60006 114793
12233 114793 144661 -78317 52854 313606 212335 301245 -109547 569899 -25806 142599
12222 222513 196443 -137304 504928 149789 73406 185004 98344 -39762 183588 62385
12211 110571 -139257 126961 22282 392203 298761 358176 -226961 101252 340636 -53438
12200 204972 234051 -1263 -88580 395039 300784 43979 74414 474189 -51248 76998 7986
12188 24774 -66468 223207 119339 159982 -89331 154127 211417 64367 130466 54437 52992
12177 52992 279103 133406 47927 364145 186032 59857 16236 7030 -104735 300122 134836
12165 11756 463530 -89288 216265 338343 152862 11782 177667 384232 207227 137878
12155 137878 7172 241311 140552 -19833 78841 102895 -1821 -325403 184948 6274 63412
12144 63412 -162575 229846 -111144 178022 219055 107651 -403157 -338168 100708 -149650
12133 263819 -92232 241806 -33896 77043 -73084 -11305 128228 76932 -6945 -55824 210998
12121 -207560 78086 -202576 391302 119265 -47987 293005 -80038 41908 -164925 -203687
12111 -203687 44349 39986 75949 -126570 -21165 84138 -87176 -132568 -29666 -128717 -136157 -32574
12098 44452 347101 -200976 -426236 -174610 -167821 -59151 -268785 -187199 -80810 210066 -79295
12086 -93194 114855 59695 -121606 78866 131908 317036 85238 241148 28649 438437 -83609
12074 -12569 -234265 180335 468664 400380 798692 1406074 775702 470911 252045 185900
12064 185900 -120954 -184577 241024 -29772 -491902 212356 96584 138587 73746 -67508 293883
12052 -129088 224559 -105180 -48328 -221099 42254 -198632 271610 -131597 163337 57983
12041 -241468 -38272 -36373 266449 75069 -113508 -3682 36748 -132562 -122520 -154973 -119324
12030 -119324 72746 225755 65514 187600 11569 -255894 255298 21677 181932 -235479
12019 154285 -17600 -126522 114959 -45641 213129 68383 289838 193027 198985 -30765 -75565
12008 -75565 -151213 -51076 14285 -239043 -57414 -42185 154392 31975 131597 -86347 -107130
11997 -107130 180548 29367 -319496 -29753 136692 -168989 39290 -68946 -318825 117996
11986 -197263 46994 278106 71124 -3744 -185244 239644 -587019 -171638 58007 349907
11976 349907 150005 -162330 43747 -32660 66825 69803 90680 122497 286996 -94240 -169294
11965 -169294 46402 -53407 -42517 7039 -241472 98030 -78351 -210052 -163487 16979 22468
11954 22468 -294079 82828 -59009 -175039 11192 115624 118256 215246 163360 3759 226941
11943 226941 -374762 133584 -84637 115302 -235179 -32840 -227642 -63077 -293932 10250
11932 258290 129501 94714 124465 -253878 -2040 62395 93887 -201876 -375705 -4951 96951
11920 -116547 -139526 25853 -363227 -123844 -221802 -327417 237766 106111 296918 -195438
11909 -200276 -110504 -10099 -229078 -52157 -52477 -70181 30244 102637 60499 -83232 43633 -55285
11896 134555 335400 72675 21678 134891 -166338 -364724 183956 -151612 -228130 23752
11885 -249209 35230 -80609 9617 -119127 83617 19565 -158099 -66755 -93447 184710 225305
11874 225305 5910 -65790 -285866 -243967 179341 -115703 -19759 54428 -44808 -181220 82011
11862 19251 285514 73397 -212643 395903 -16840 176226 154164 157410 -47464 225838 54562
11850 73120 -99406 195181 132264 -411985 -203172 15979 112924 205498 279048 -153504 -99955
11839 -99955 -64732 -257437 222621 -116287 -174904 -252138 42314 -255555 -462495 185208
11828 -156946 46371 -186334 -24882 99289 -115288 -133854 116662 282124 173723 341593
11818 341593 65357 -70807 70022 38977 -356301 -313774 -281870 -6830 55853 62674 -176205
11806 -181346 147890 -48012 56572 -222018 212343 103253 138365 -116018 250440 -221793
11795 -69691 122643 -3706 -181212 -393187 -102318 -89132 -298554 83707 -65602 -332273 32310
11783 -62630 -141105 -124537 302338 69175 96790 96299 -117099 -26090 -158445 -116914 -57732
11771 -252557 -159914 60214 -58051 3557 -167433 359534 -1906 -194765 -89005 105899 -80124
11759 259736 183579 22699 -69272 41741 -74596 -4569 120613 -142981 -209557 22422 186606
11748 186606 71895 51847 201479 -10767 -71800 162601 -394456 -122492 43599 -85659 209106
11736 17079 -106534 294917 109490 18515 14020 57314 -237565 -126275 98588 -106020 -13965
11724 -177712 -141647 -106958 -99056 -130508 163345 186419 -101225 237097 -258140 128509 -57852
11712 -85304 248690 -3009 213066 1567 195364 225149 -29702 33423 274392 -329096 -34773
11700 -114103 126714 224264 -297302 -40698 84462 96150 -8671 -11208 141307 74766 256367
11689 256367 248938 -490707 -25650 180386 -43722 86202 355079 -16211 -199569 10859 -385462
11677 -392607 69900 305927 -21013 260682 -231757 157153 -108073 114474 -254614 123960
11666 126632 118337 -121023 81182 117369 -53409 -124823 -38193 18717 34660 67867 -215627
11654 -11909 87294 -128176 114256 157094 -15637 -160048 32296 -172729 -213826 -216449 328271
11642 180994 -253640 6702 -198904 -123663 -83453 -100584 495414 -9573 -37782 174876 -88296
11630 75848 18900 -129703 -188631 477391 89544 63229 -179828 253617 -51129 294970 94705
11618 -3589 13999 142958 164488 65800 -480899 86767 -369139 424727 362999 -76407 256382
11606 35893 133308 -1942 155700 -135686 74894 -126129 216583 423456 98066 141989 363566
11595 363566 47258 -103419 -158090 -117611 -4188 -91355 119981 90107 186286 336044 181745
11584 181745 435723 -109821 78053 66399 -6696 207530 310862 289003 -23986 102171 113835
11573 113835 -87610 -236085 -23105 12743 -238625 -289752 46228 -88271 64634 -52346 65848
11561 26085 385219 329936 204469 68940 162242 -120931 472557 25961 10797 -37674 -52156
11550 -52156 -146598 -58219 207399 136904 -258783 45440 236481 108729 -118057 33522 160243
11539 160243 395627 144225 -54975 100483 281410 14894 296753 196856 -68163 292554
11528 -137816 247558 241583 486844 -54559 -70664 129995 53417 -92995 467418 300851 -173248
11516 52537 524603 -1876 -30743 -70046 -59451 208678 185442 -24797 89407 -115110 222600
11504 -31050 78080 254734 279620 76769 -4459 198186 272526 274858 229902 203139 171807 85777
11491 -63366 385668 45151 203497 292630 223327 29639 65586 357867 41344 -175066 -44982
11479 182946 474129 95397 -88277 193703 137867 43168 -53950 193136 354405 71055 291364
11468 291364 115584 216477 99854 228707 69845 -15205 263750 164111 207081 146281 -221918
11456 315113 37058 -18672 -267352 32430 53006 -119580 -26882 360916 -126784 73805 -23447
11444 226462 132789 449144 80225 165276 149090 353608 -31258 376315 34222 -126286 -312595
11433 -312595 -88148 113849 88978 -232258 -272128 19906 42692 -69588 395583 203787 -98739
11421 132181 57515 97937 16974 186510 29832 -66309 369403 -94719 -160140 68966 -135516
11409 118189 100695 410722 211005 192405 36027 -258020 156296 69469 32943 175499
11399 175499 -92345 30857 -131020 -64960 -295070 -36229 -55673 -89373 -209001 -54011 -300744
11388 -300744 -69177 244174 -428797 -327775 -173122 -18942 63302 14695 66183 -81005 -124465
11377 -124465 -107146 -114795 133929 197161 93702 49247 -74050 382102 13752 305155 -293715
11365 -131386 173912 89777 -72288 -6505 267036 -38612 -86435 80582 -71735 247901 138426
11354 138426 -114774 541191 -73790 334818 122534 8843 247459 -45193 -26859 -89265 -6237
11342 -305740 76483 -61116 -131600 114454 77078 130037 -219511 98041 107487 109641 -2249 -25084
11330 -25084 -14755 467450 -125834 -205499 -270165 65412 -410375 53233 -62276 -55461 -39272
11319 -39272 -189139 80278 236715 -119776 -301569 348322 66936 -28278 -133814 -174995
11309 -174995 -50078 -65444 -364477 -25682 -31869 -10073 -126525 -79779 -309086 337672 159141
11297 384224 -28711 -81849 -30559 -140810 -8449 -80183 -140034 -45404 -316211 197221 -220229
11285 -202589 -72207 20051 195198 -94518 10961 -231929 -108220 36458 131033 86036 -13161
11273 184209 -41933 25509 56495 -143406 -368658 -394187 264608 -298806 97739 246523
11263 246523 -129022 -54988 -102604 176773 236231 -201642 -161312 150361 -189149 56715
11252 -212711 -31762 52217 318077 -232937 -78869 398852 167492 -212692 127382 -148656
11241 215239 93300 40217 -206109 -23026 106428 -47946 -163927 150938 583 -56815 -154586
11230 -154586 -247314 -290698 14296 210 131099 -324815 -37445 79337 -128281 211343 -18004
11218 -238834 -187705 -138547 -266100 -114727 256940 -66788 173683 186551 -24453 -82860 -53854
11207 -53854 51492 -55821 -117591 -155268 -289291 41171 -63840 9772 -110883 -186213 80829
11195 182211 22662 -321608 -22933 -184318 252979 223463 173249 35243 -414777 35685 63786
11184 63786 143720 108646 296023 -59728 -207263 -15691 20183 46380 -88360 89261 -115570
11172 -5085 -119275 -49006 -86896 199175 95172 105463 -65038 161792 183542 171158 -166991
11160 104444 -144995 -246432 302122 -20187 4667 145384 285124 119358 14374 -87123
11149 -404377 137979 -250724 -25402 206102 -97318 -109354 186217 205236 -304275 -30195
11138 94754 389695 374107 20107 -2677 25325 76824 386551 331130 -102091 137813 -43869
11126 -494819 98614 -161735 139942 291567 173039 -338101 -163725 -12746 200689 270452
11116 270452 -138164 373115 -211080 -100562 -10206 285209 -4500 101331 40865 150255
11106 150255 427383 58202 304759 -196659 242075 -21747 166141 172540 79594 49600 374449
11095 374449 580724 -56766 106312 206752 -134201 197361 125448 403794 178973 456879
11085 456879 7672 243711 65917 -158000 311179 145462 135067 134625 -20061 368910 194194
11074 194194 304767 335291 393649 100001 440169 343502 340860 669391 326699 196061
11064 196061 654907 432463 524276 546801 446501 284642 507767 562434 358620 665664
11054 665664 534834 365864 565033 755099 866437 915807 492382 567976 838855 595223
11044 595223 327817 662400 362018 617330 825659 727931 1074225 505182 643036 639988
11034 639988 582508 716750 126577 649892 753989 972633 804067 549506 573484 971506
11024 971506 607246 627538 386632 765222 1091173 593286 843924 389917 670875 647614
11014 647614 480215 386741 861326 609188 954571 624612 649370 456019 678977 603967
11004 603967 855798 877870 640696 663048 729169 733692 517306 680716 747656 763543 668300
10993 668300 960741 643927 769141 888758 1007100 600085 1093861 813196 704137 769365
10983 769365 960918 790471 1238399 1123556 1151356 1424045 1469146 1695077 2070665 2480243
10973 2480243 2499854 2455352 2819076 2168231 2271897 1881507 2182910 1548724 2142327 1621113
10963 1621113 1586391 1388547 1533448 1637080 1400874 1606536 1646905 1805805 1551489 1403824
10953 1403824 1436469 624124 1117011 985855 888473 531212 553727 597062 259394 145292
10943 145292 401576 229970 370088 -17023 -64577 -23663 30978 166621 315066 142503
10932 310709 216250 -298938 82804 -26350 86021 -82545 150620 242367 65169 300334 -75048
10920 24516 206303 201230 166706 -133539 436534 43757 -154253 237072 -71368 2131 -10457
10908 117298 52010 195185 -28533 -81298 128745 75780 -162120 63243 -177877 -30439 108032
10896 132015 22404 -317745 -151621 -16591 -83651 -277796 103742 32387 78520 -41055 188596
10884 72174 -161001 90748 -274839 -232675 -123582 181386 -320652 42463 85583 -152368
10873 -157585 147957 71172 -190095 152237 40198 311763 -130992 167676 290260 60788
10862 -120661 38931 60014 79513 -49755 -39297 69372 -40087 94296 -57715 32858 -99894
10850 -109972 -199685 -178740 -55519 -308246 42755 -445226 96953 -44819 27810 -147178 27273
10838 -226983 17133 256547 -71913 79574 119422 -31421 146498 83578 -53881 -92908 59592
10826 -132395 17772 -72309 145452 -249036 2505 -88570 -194382 -158129 -7928 308431 35036
10814 -7596 -84078 241130 -267427 -172360 -221378 -15559 65032 33541 -216558 -51419 273044
10802 -17356 -16805 -22314 -120269 190860 65125 -198982 -135027 484702 47806 45545 -166023 -89014
10790 -89014 -6315 44687 86992 157707 -166957 -34093 -132691 -367951 100577 -101524 206447
10778 -227474 150185 -112556 -239048 53451 -78006 137783 -4830 11041 59293 -163956 181443
10766 -33862 171823 -71534 59906 156639 227859 -296604 142568 240977 -436673 8335 91740
10755 91740 1471 -376049 189613 -50597 226126 -124164 -184111 147493 151877 -70100 278082
10743 131713 3483 -17067 257646 -57201 -322445 -25731 -89431 -38137 42144 50364 -157606
10731 305440 -236040 230946 -203340 224093 36438 268991 -314187 44039 51538 -265398
10720 102226 -207648 -212787 142553 217380 -98555 -377149 -143590 -132597 -99914 58586 30619
10709 30619 15548 -222796 170682 395002 11481 -118441 73168 -43707 -241363 -73419 -132238
10698 -132238 88982 -100036 -54735 99471 6892 158091 29323 -321343 137210 -22290 86386
10686 299425 -96510 -414904 102084 151941 17425 -111369 46148 25555 -15904 -1260 134152
10674 15941 -94416 -5268 -93262 169550 -278624 -394323 -352021 90485 -35327 88610 -171295
10662 190821 26714 -1944 -95640 -69776 384567 -67044 -103008 60125 -129609 -163266 -133212
10651 -133212 81107 -230301 -140314 309321 -180055 -346716 -256941 -82806 -103122 -209636
10641 -209636 -49719 -146936 -3432 238289 -58059 -369311 7451 47769 -20955 -200749 197408
10629 -135871 -353949 -369030 -261845 -282353 90636 -203403 -215137 -239704 17160 20551 263019
10618 263019 253168 -87818 48683 66997 -321724 194909 -18275 -189542 -13287 124851 -34860
10606 -178408 60637 75924 -135675 -280327 118316 -271447 10104 25297 19099 18824 98023
10595 98023 -85472 -224599 -380015 51356 -220125 64924 195097 -188135 -279127 -197671 -149660
10584 -149660 -302941 -116401 97557 -201147 -132450 -31103 -203642 200674 60916 227276
10574 227276 4638 -361897 -126091 64083 -71813 19022 -96026 191640 -133742 -227648 98238
10562 132393 157238 -153553 207857 71575 29233 -399734 55930 63738 -140698 -229933 170941
10550 -78986 -47601 -199430 -53633 78033 189454 161769 -286571 -13284 -268797 -57812 -11366
10538 157461 -363342 -64583 -207813 -175367 -304445 17469 249151 -168784 -243859 -150717
10528 -150717 -310208 -469074 120844 46817 247823 -125865 -320640 -15620 -169341 176667
10517 139430 214459 -143526 -239506 -168069 25462 382286 320907 51395 -24631 211083 24202
10505 210354 -26924 29944 289120 -170718 -102703 185201 -18331 -184073 -104206 -230075
10495 -230075 -32279 -46416 177523 273359 -87860 119373 -147237 154651 74005 214831
10485 214831 -200131 -17384 103698 250781 250352 307408 348410 92723 -37517 304577 -12936
10473 -3049 -27692 -202557 63722 264498 -202258 353245 -186461 220220 223333 -176885 51485
10461 -239274 158900 -158578 214731 -172339 79551 49822 -69971 -187548 97125 -29715
10450 -28298 -10878 -316606 -367864 -234341 282963 -18803 -187356 203906 25988 53865 -21991
10438 -76723 -211048 -145024 55563 -136818 -23159 183975 -116318 130686 250987 -185960
10427 64900 82803 -273594 45450 280859 -315556 213726 92274 122743 27691 -134127 16878
10415 79581 114266 248173 -158781 -176807 282 -123866 301177 -114826 -102042 404519 76654
10403 -201175 -210690 235106 -242890 218820 14622 -173231 -44610 83261 -154048 71523 -274351
10391 288704 50794 -44690 164078 -165269 221216 246390 125101 -103647 251737 240552
10381 240552 428514 286000 258499 165812 281050 110517 440401 91418 565346 324142
10371 324142 442944 493369 626168 495198 23927 -176448 606075 434386 187658 192890
10361 192890 432962 350223 -32450 449020 167052 330347 -6732 148421 221882 46948 511339
10350 511339 500647 361144 531436 235848 110501 153145 -36126 224222 395016 217595
10340 217595 269866 285 150547 -50008 201756 247412 112199 127589 169495 -44272 -7962
10328 -110038 -242858 -159359 -125584 138699 246872 -77829 -31888 36758 62821 244348 368891
10317 368891 380546 -844 376328 256809 188801 38886 -27863 -69860 -66008 26414 -62914 -67094
10305 -67094 86403 106333 39578 -46198 -110058 -158858 180852 -82345 54298 -180 -86405 -18400
10292 -106468 -72202 -41527 224287 236379 -371712 -282782 -203434 250978 38399 -204800 236237
10280 58545 -128474 12947 -183967 58088 6829 -286148 154232 245050 -33983 32032 -36757
10268 238993 -89939 143584 122263 -37435 -247280 -188435 321735 81330 380675 353147 -18702
10256 -116584 311220 257758 -55333 132737 -73080 325011 31450 -264005 -39434 209545
10245 241893 -146713 170397 241181 224926 251235 67394 -68258 -106956 174878 -31313 -62644
10234 -62644 120757 15418 72830 -131641 -217505 -49980 -421272 -45384 210420 330033 168695
10223 168695 96363 -143085 57996 -190367 -185053 -158094 -366258 -62660 -58779 69101 53117
10212 53117 -30266 -34281 112775 -21021 321458 -91667 141640 -46739 11750 355392 -220192
10200 407311 -49821 -186803 -142635 -353656 -163134 -10118 -140749 -314710 212524 -90913
10189 -80006 -37067 -38268 -483765 79913 22369 -488983 106910 156216 196239 -50767 64996
10177 26375 182031 227924 -44977 19762 123369 -206210 -203490 -154697 -224390 45239 -14483
10165 18162 194015 37226 -114432 -256345 -310433 -203310 -40065 -194634 -129329 -278265
10155 -278265 77173 -207247 -100589 -292941 170281 -298664 -227153 -284490 -110319 -202926
10145 -202926 30275 -106553 18036 -277537 -119712 -152431 -53578 103639 108427 -25734 -90824
10134 -90824 -49726 -206156 -174465 157738 -222568 7168 -230559 189299 19937 114743 382835
10123 382835 30070 -106464 -219702 -28529 -139373 105101 -224410 -456088 -306334 -2465
10112 66978 190667 48969 -234383 28474 101877 -85353 -196476 117187 -55611 -164087 -91689
10101 -91689 -157636 -312281 -28326 -259087 -233984 -33749 -186168 -144746 29032 37517 -197860
10089 96440 148307 -407053 109953 -194670 -81645 -608 195053 -275999 53884 -267766 -273236
10078 -273236 3017 -179380 78902 -239574 26207 123361 217179 -78918 32603 267555 53908
10066 6621 -113155 -29556 -116128 235896 81008 166771 -151574 -90126 265884 79191 -353702
10054 -53563 -244847 -85561 -28220 -147400 74481 -152044 143263 -152022 42937 195802
10044 195802 -310249 -193819 149513 -162269 209463 -39517 273857 183942 42668 88928
10034 88928 -97158 28983 -38879 181534 -152585 -61199 -41199 -179079 315154 -58190 -115324
10023 -115324 -77752 58137 -117082 -96552 108017 -7502 -130696 -102434 -4987 -133838 -300829
10012 -300829 -322415 -165558 58504 157053 -32103 -376120 -115716 39901 -620322 188292
10001 -347640 -236252 -157883 394400 -85380 -228416 -124606 -90811 -107253 -124589 140687
9990 -368275 -222388 106858 -228858 -114149 -102677 -97203 95987 146660 -142107 -11963 19179
9978 -73146 -26956 -195407 59981 -179503 17038 51994 -101780 -428931 -47007 -117457 -17826
9966 128392 -141337 -317356 -121253 18072 -17447 444073 -5197 -197084 -68330 230259 249521
9955 249521 -137959 60181 -28990 137836 -137230 42430 128235 -67303 -200543 -68133 -126331
9944 -126331 -90448 -30752 -59880 169859 -211563 -195389 -83672 -209237 -6504 -49457 -289621
9933 -289621 -67191 -182147 -213041 -83958 -145243 12523 -456446 -279265 -234415 -145003 151094
9921 119856 -44880 296203 120085 -169920 -281106 -24936 -86369 -225551 46992 -30054 -35984
9910 -35984 -336668 106487 -179035 236587 111443 122875 88158 -69555 -88150 -220455 -353206
9899 -353206 89032 -229626 106478 251635 -10957 12019 -283629 -334908 187305 -96301 108247
9887 -199897 167283 -222786 -131586 85790 -152462 -295019 -314191 -107665 -311109 165057
9876 -139323 -13349 173827 201707 -1376 149259 -196863 107824 105028 99920 -213603 -210443
9865 -210443 35965 50977 33428 -281605 133495 -47371 -37393 -14771 -80747 -109025 -98451
9854 -98451 -158653 -262274 30271 -112294 99468 -68155 224726 48393 44414 29061 -385205
9842 -38590 -66370 -57378 139853 -23992 52610 -296182 -81409 -70261 -309696 -225109 -41015
9830 -147802 38187 -214129 -224640 -289352 -331903 -55461 -2841 -13727 -96116 -278370 -244958
9819 -244958 -232763 -249638 1694 82918 -572549 -11867 -246097 -168232 289651 -96454 204824
9807 -282977 226574 80602 122627 30937 -315973 -92279 59365 20216 45781 -60990 -31605
9796 -31605 -269091 238874 97020 16492 -119586 96536 168462 -26869 -12311 -456098 10187
9784 -179432 -408568 -25795 -94668 -4622 -117439 182534 -39721 261240 189536 -134566 201304
9772 -113111 -25910 205512 -43727 -22422 91071 -359726 172090 153883 -374982 52306 79226
9761 79226 -135178 190219 -161618 -416196 149519 251176 -11266 149536 24811 -49990
9750 102946 -200612 -125124 -139625 71130 -359374 -440841 -21147 56386 -230788 5307 1469
9738 341084 149705 51162 -102579 -133081 -314538 98944 146853 -377772 -286518 46413 -8391
9726 -212761 -333541 -58008 -43982 -285985 206904 -72961 96961 18875 -49690 -411164 -288452
9715 -288452 167269 -9114 -73683 -33700 -62304 -119405 -186517 -160499 -213361 -95000 1382 -217869
9702 -348941 238904 -59510 31829 -71416 34546 84991 -171385 -5002 -53392 25951 -49740
9690 -14585 129589 -40917 103802 544509 -362685 -297099 108887 -171915 -88752 157281
9679 -261756 10809 159352 -19044 -120538 -156252 179892 -172211 -5039 23 -141037 -44775
9667 166913 -355456 -284206 134083 -101009 44208 -79934 -31172 239602 -58328 -251872 81191
9655 -9196 -261477 -241422 -283293 5291 -147453 -74188 226085 28112 -141026 -230774 114290
9643 348408 -108020 191702 -177668 235326 213051 164027 67991 -59006 -204007 -540730
9633 -540730 177017 -15470 -100180 43142 -195573 -10032 -59514 2507 -42985 20335 -261650
9621 -92984 -28318 -230424 -154970 -102134 34572 201911 -146746 -377777 -322655 212158 23925
9609 -56616 -130025 -254878 -94207 -163252 -167360 39872 -39647 -44106 392341 -170441 -73863 344632
9596 -36568 -6143 -25112 -195621 89931 -26228 -162153 115744 -95640 -129806 -208410 -150085
9585 -150085 -111002 27141 151097 49748 160775 155625 -324188 48249 114404 -37131 -213468
9574 -213468 -11437 108296 -282297 152984 -60396 -43150 -244119 308566 71664 62669 -364420
9562 -205336 -160768 153076 -330474 -354797 -352644 -80055 -411979 5623 48600 -88473 13893
9550 -83359 74288 160971 -220067 421053 -113238 -403191 305188 -158641 -86107 -62580 -181045
9539 -181045 79556 -371803 272692 104542 35608 -184118 -416843 -25337 143957 -424159
9528 121059 -142216 -230037 -315802 -310701 153341 119944 160701 58857 -26587 279351 -324472
9516 -81884 -209081 -103520 76995 73697 155952 -103726 -205636 -124533 117445 -50262 -34719
9505 -34719 55365 -52634 -250271 -174438 -181949 333113 -213650 -180161 386475 -188612 -188090
9494 -188090 49712 -209907 -61749 -228044 -10109 -117346 -260870 -123283 -110447 379372
9483 124225 -207509 341358 -250240 16750 50083 67447 -61775 -75952 -87365 -171116 13908
9471 -10262 108805 25783 -230690 79817 38317 -188441 63900 36756 -76524 122757 -148663
9459 177597 -385001 -47888 48706 -432088 180971 -124796 -55615 -222302 -48205 -159481
9449 -159481 -135867 -51470 -199963 -194909 -323384 -177988 -175786 -70526 500 -120494 123062
9437 40482 49382 347772 -38173 -129948 70436 -138479 -491 -502956 -248454 182339 75705
9425 247429 42731 116692 -38679 -207448 198474 5472 -19156 -190425 34276 -224296 88205
9413 -101450 213724 299499 -57008 -78859 116820 270742 246080 20719 206024 -172674 -244553
9402 -244553 -585137 61647 -75282 -3283 -152216 -44526 225895 149113 25346 -110103 10071
9390 -7523 -53160 -94362 -38182 -68434 -140819 -54929 81741 149168 170752 -102625 -331396 -93559
9377 -304039 -54324 -72862 -118056 -338138 -39341 -221909 85093 -92624 -39316 -149128 53114
9365 271859 -353412 -352960 -6419 -79990 79678 83334 -41516 -84289 -60571 -139243 -293804 97417
9352 -108828 -104074 -68147 -224839 1902 133268 -77631 -30080 -243141 -250573 -81592 -101197 271157
9339 -44807 258186 158719 -513484 -284829 -63644 360 -116439 -52014 -144520 -145186 -220981 -78810
9326 463870 107522 19161 -83450 207256 -319943 -374220 -143773 8521 86377 -9082 -152768
9315 -152768 314144 211474 -256620 -76169 -112977 -38405 8136 -361998 -150305 32313 -126268
9303 57255 40543 -203774 -104072 -82203 -187266 -340598 216443 -88252 -132139 141343 -236255
9291 239286 175476 -408380 -209745 163800 -89717 32929 -106109 -88314 119686 179540 -85053
9279 -46683 -176875 124250 -230084 90329 -118476 -7983 105974 -278575 -215333 275817 46417
9267 -139836 -191147 -284586 -66739 -34026 -190297 -173439 -6969 14036 -214981 27979 -262644
9255 -313436 316734 -291844 -262409 -127205 388015 -118165 -10258 -137391 -157168 -59931
9244 -32350 70893 -6303 -158348 -191259 61518 43133 -254936 -208184 87775 59762 -113530
9232 52412 254313 21472 -27580 -285504 -218386 -140446 -137730 -153602 26702 258560 -60737
9220 -229479 202450 25675 240208 -104203 171565 7896 37967 33169 118585 -270093 -292461
9209 -292461 -310824 224116 -144375 -111957 250667 290774 226390 -218875 137667 -278688
9198 61136 -101160 179368 -9718 60890 -320271 -586905 -251961 -218288 -359533 -73822 -260696
9187 -260696 -247450 37265 217152 -86259 -153559 125802 -5012 370867 244976 50599 -176007
9175 -224809 4307 13403 70619 -157377 186534 141241 -501375 74412 185609 -549236 -95818
9163 92761 12594 53996 -32826 -165771 -129871 -242675 287979 193271 -165419 92808 -552617
9151 20579 -6579 -35709 -103522 -110582 225728 78398 -97861 55301 -388517 101289 -22758 -28952
9139 -28952 61841 -99964 -133876 -522166 -224119 -124228 197250 271098 -105863 -33193 155252
9127 -80148 276802 321433 75661 -369797 174050 -290088 -138925 201963 -93998 -389261
9117 -389261 -259424 -144252 -341748 -175463 -341694 155498 -342645 -237087 40117 -158146
9106 -207080 -213428 -20552 49985 27726 -44164 -145368 145331 -57381 -228637 226271 -155926
9094 38655 -202354 76028 -323902 44462 -184222 -61193 -295105 -112613 -25622 2172 -97991
9082 -163857 16512 96914 142306 -135048 -154807 -145342 28297 -165763 -284367 -24733 86785
9070 36406 169511 -81480 84290 -89369 -413464 -467765 13351 -112503 -60667 -262550 201729
9058 50976 -198734 -252515 1155 -1857 -261729 6735 170034 -31695 -480522 -175203 -284156
9047 -284156 34707 116919 -285239 -187331 -170227 273451 -272441 -82747 -133758 67626 -35673
9035 266578 -67502 -139341 -151413 110007 -46407 69630 167457 -64042 -159314 35376 -306647
9023 -97037 -293807 147079 169699 -265109 271513 4574 -174472 55790 167879 -15792 109622
9011 19532 -185413 -412018 -117981 61985 78553 -145959 -140961 -456971 -32670 45992 232109
9000 232109 51543 3092 -120242 -356597 121128 148589 -112413 -189658 -315189 43405 27136
8989 27136 -45575 174 -133620 591169 11814 -80315 146975 -165238 -184236 -68748 -3354 -269826
8977 -269826 -174523 -42646 13896 -431566 -48373 -99628 -66532 183978 -225604 54927 -2532
8965 -12041 -73206 -98248 -10871 221092 -565283 -88338 -102250 -222643 -214383 465680 206938
8953 75981 -33674 45662 -3976 -355244 -186854 337477 140870 -20733 -63603 -89238 -49095
8942 -49095 147447 -402868 -173468 -245016 455857 100999 -92745 172655 214762 -19351 310829
8930 -246702 200554 221882 178104 421208 406500 870478 2476991 4313575 10542954 6038392
8920 6038392 2648506 1415933 592642 353828 641015 -236115 259532 232894 -72914 194758
8909 446228 257610 -131913 -120210 -110446 43096 75287 279518 250673 40814 -40713 -183534
8898 -183534 14693 61718 84401 250718 -374485 145067 20412 -190541 58070 -105485 172323
8886 55962 -185468 -51307 71302 -56160 -1164 -77609 77971 -233912 -233485 167322 -58781 296824
8873 -172123 -87339 232085 -62872 -24217 -214969 -92337 -15069 -129936 99209 -14972 -47709
8862 -47709 -303160 -138282 -62590 -262735 -24935 247903 109282 -145283 137434 -113975
8851 -2055 40049 70825 -39489 -264374 55480 -89468 -23226 -411583 51320 3681 -97685 18658
8838 109109 -35621 247486 -13920 -298136 -155716 147865 -300106 -282356 360421 3600 -262895
8826 -280595 -26631 4611 -209101 -117741 -401858 343312 261668 -19987 -322424 234950 54359
8814 66323 -176058 -87574 -125216 150201 285879 330343 -83706 101444 26429 -83462 -172653
8803 -172653 207831 -240948 195779 -544924 -136833 64497 -316396 106373 243003 -37048
8792 -330149 190876 -534867 -116616 -15674 -35282 -265514 65753 -48056 -60673 -166661 -138427
8781 -138427 -234338 -124145 57987 86798 -141750 -110751 -201158 -155507 -32451 -148168 -94360
8770 -94360 -126514 24649 60517 146228 -29634 -105036 -104641 -71756 -256975 50260 -185261 -95756
8758 -95756 -100462 -339648 -36692 -223157 -129083 -200311 192657 -21337 -7382 -20860 23111 113839
8746 113839 -5662 166388 186499 124854 -438406 32020 -380781 -71150 -152044 160702 -75777
8734 -101132 -323125 -281155 -263968 163838 -360009 -79728 -312196 -294369 -338692 -320351 -152097
8722 -200253 50605 111562 -140372 -423132 -290113 -348924 156076 -108458 -377730 -44591
8711 -130451 -94941 -323794 -61489 -177335 7794 236476 23580 25044 -263358 -345226 -61840
8699 158089 -132556 82244 -182105 311424 33389 193929 82897 -186091 94840 -57361 -43420
8688 -43420 -118345 33714 -17914 19613 -76002 -104526 1049 -87754 60472 -8220 -170822 -169912
8676 -169912 -304597 80482 180511 -286420 -17662 227708 -276167 73221 46784 -146151
8665 -143986 -40284 31519 130845 216442 -14152 8418 -96046 97884 9599 83723 -189338 -297981
8653 -297981 41113 44699 -204590 -73637 17386 102054 117204 -87003 102514 -250234 -88155
8641 122095 -147246 -508310 160391 -279334 -162647 206211 -316627 217588 8292 311362
8631 311362 -229955 -235751 209909 -76566 151541 -112772 43013 52141 -8115 111714 -149530
8619 157648 -211031 -33581 -198539 55553 -118520 -9827 393432 -66915 -237639 9064 52631
8608 52631 -333548 -281108 106121 9389 -74514 -30614 65791 -275810 172759 -111510 152350
8596 -136225 154346 240960 56790 27925 -143866 -8061 96654 -104835 342389 -96670 -272801
8585 -272801 -152478 -237286 -210788 12327 -119953 -8413 114025 80438 -4320 176800 73130
8573 79788 -274852 -129102 -123002 -123455 64830 -142862 -43612 -349647 -305206 139126 -78340
8561 -134504 -233746 -309676 -329337 -34421 -155216 57336 -111281 -189645 89806 72904 92273
8550 92273 -44805 -168669 63641 -62726 94243 57445 -44702 -22167 251555 -195282 91574
8538 -188700 -193968 -127306 -135720 -158788 168650 67946 -84937 -53661 -264858 -14537 225449
8526 112356 -16473 464985 72491 129729 -50955 48982 -32993 308583 -420764 -186390 -204537
8515 -204537 -203874 -126110 -199081 231001 -252446 316104 -179069 -122100 80077 -361180 -79663
8503 -184260 183721 159569 -254613 76703 -33355 -24387 -210880 -192199 108137 12302 -54200
8491 87888 98687 83816 4635 -173980 -106190 7219 -197042 -195668 31790 -151290 122751 -155569
8478 -64108 -480732 159855 -159543 -207770 272033 309077 105429 302110 -54253 -96314 -203777
8467 -203777 564 -208476 -306694 28240 -219383 -177236 -180320 -34895 56749 -231222 62388 -191427
8454 -54604 672 35948 197456 31081 -413344 -223477 -102442 -120859 -147067 -12587 58150
8442 94728 -107733 201969 229486 -87952 54510 273331 64622 -45663 -91827 -60902 86318
8430 199207 40237 -145344 158538 -89997 -115589 33656 -37403 333661 -346854 -113210 309479
8418 291220 223575 87671 -174713 -324599 -84608 -228271 -89474 25494 260426 -212139 -435057
8407 -435057 -38799 40525 71799 -110245 -50101 -306409 114120 -29493 51621 -484167 -329284
8396 -329284 -50971 -74861 -37981 -5520 -57836 -54185 -65851 -324298 -164320 117056 -106008
8384 -156474 165455 -105312 128321 -112824 65568 119287 77626 37511 -262139 -254978 -340192
8373 -340192 -121445 -173608 -119187 -203799 -66334 -213145 -285328 115406 109936 -17694 -342606
8362 -342606 87147 -207021 -74018 -27772 -302879 290612 -99813 -59353 -208346 -235899 -289753
8351 -289753 -56547 -328766 -237200 -110262 -95968 389251 -323408 -7525 201058 -128549 49745
8339 -269212 -85657 130669 196089 -129703 95291 46397 352623 -41747 250526 -22138 -232671
8328 -232671 393691 -101715 -76567 -224080 -24060 -103377 -220611 -31063 473988 227901
8317 107878 104684 168137 -17576 -85195 -145526 121274 201348 -101470 175790 -83050 -213385
8306 -213385 76538 -148523 -213305 -218549 78754 -279628 223103 -23816 128546 101924 250237
8295 250237 -128540 243121 -163896 7464 120434 102753 -114935 -35940 81092 -71180 13242
8283 -11897 -80941 121876 37722 41967 -214280 232559 39487 93868 -130400 -323104 -71046
8271 146728 191756 -157180 11882 -15924 -111654 -340468 -245652 232240 -215699 -79972 62554
8259 -41105 78759 -236375 291751 286623 -14113 73482 49914 8822 -99137 -249408 -62367 -29935
8246 148254 -99802 -12114 -9123 -88518 -139347 129904 -30361 -35879 3468 117857 -111495 174010
8233 -48128 -239 -105140 41358 -114338 -282037 12565 -220262 -243321 23312 -41623 -572189
8222 -572189 40292 -206393 -283835 25113 -17277 -98922 90940 -374207 155224 -345025 86740
8210 -120105 -42643 9045 79867 -156004 -300640 -126065 -302585 -295984 -41279 -117472 -186705
8199 -186705 -80310 24912 -90281 48398 109669 102869 -36408 -424069 -75592 -30253 -535030
8188 -535030 182167 37059 -91834 -125863 -247855 -132377 197558 122267 119941 -148397 -28147
8176 -117497 -56641 157389 -269974 -213466 -27755 260757 -123201 -203126 -104652 -234977 -26698
8164 -143118 -150351 114581 -156556 -296275 96379 -25503 115000 -78873 -139522 -201672 -50505
8152 -199397 -397107 319742 -76233 -51751 191341 -127554 -314658 -183110 233431 -74311
8141 55047 -72368 410 340171 -14574 94422 24700 -2904 14644 175252 -217052 -117286 -33661
8128 -203245 -99372 -181403 -379198 -152737 129487 339503 -226532 483429 99691 -129750
8117 -22908 12141 28656 -302597 -236892 -261096 29896 -128128 -299797 50192 -153258 -231473
8106 -231473 -140259 296523 76522 21803 -61969 144949 41065 -190054 62844 -120269 -349832
8095 -349832 22257 -18769 190519 -151586 110177 -51238 245346 -316687 -158276 -305565
8085 -305565 -35002 -114877 -158534 -450085 186057 -185904 250499 228134 -9848 -174094 570859
8073 -228696 -216023 -11954 8727 -148252 -74267 -125497 -50790 -138594 17852 -107029 -288323
8062 -288323 124824 -49376 -29784 166295 79803 37452 -60007 -105205 -177339 -110379 169527
8050 266631 335638 -177127 122074 -59263 -190993 -374930 108921 -310361 -185310 137370
8039 -275913 214065 -26280 98174 184615 -205682 155764 -572579 -262806 -4913 163054 51517
8027 171556 -73551 -162980 -61959 -37414 -168153 -245433 337133 -293256 -141349 -447117 -250801
8016 -250801 -270097 107384 138013 -146837 12551 -91149 -53282 -314040 74258 -105636 -121749
8005 -121749 79293 -14728 -235850 -111614 77369 -143888 301719 -187625 240001 18066
7994 148312 -153529 304840 298918 -41053 234473 112728 -8624 -114985 315654 -301749 -58246
7982 -174456 -37777 -48396 -203585 -226401 -8990 -165065 317765 109800 146334 47696 56954
7971 56954 -179472 -66237 -33287 219390 -97779 -303941 -140317 -28808 -217340 103027 -267544
7959 116824 -78055 110816 82521 -222039 44445 16980 -144342 29300 -280675 134093 -205004
7947 174898 -169799 -228060 -104105 -170294 185733 -87804 128089 -23165 -84426 67359 -116641
7935 -255147 75291 -139123 -91531 97627 190624 7979 -74209 148635 -141446 -149884 -392098
7924 -392098 153177 -308861 -79393 122704 -335599 75469 77171 145234 -113210 237327 61126
7912 40283 -218324 -216031 -251563 61225 -164604 98271 176177 -123631 -67300 -57954 144538
7900 229487 -342432 -165583 -303796 147585 41554 -66925 -14426 -165885 70544 233268
7890 233268 -107831 164298 68556 -288201 -130072 -39343 -179653 204612 -90168 -217163
7880 -217163 -170281 -215881 251808 -183779 18189 68288 25749 102918 11343 183324 222309
7869 222309 -44818 87893 14211 -94075 48857 -2688 -119302 -80406 -63160 34683 -158695
7857 39092 223201 37466 -119320 -26095 -316218 285429 -72310 246328 177759 204771 47703
7845 -367024 -431360 -81517 -237458 -72194 4050 70518 -134824 3214 113413 -228016 -289433
7834 -289433 142589 21402 170838 166291 -30288 -156347 -181507 40238 174568 95085 -157410
7822 -131990 -265584 -285247 -162419 -436826 122637 173877 -28699 -228560 -12076 115422
7811 -432151 -149461 -8678 -1696 166025 -22926 205585 -257106 -72321 -117639 -41714 42409
7799 7708 -15587 -132744 -90798 187331 12666 34698 -126500 -180487 93664 32453 280757
7788 280757 -8653 22789 188500 -130835 256019 200938 383990 174666 9663 103635 103135
7777 103135 -389844 -333092 -204809 30727 -364013 33479 -35773 -15926 -74484 142444 3898
7765 1400 33769 -116899 -129210 61285 -18253 -3626 -105275 127139 -76414 -214249 -35746
7753 -111976 -60126 53325 38296 -199228 -159872 -149572 -75137 71091 -162380 13755 79573
7742 79573 -226046 14242 124669 -117925 112431 -39123 -121147 98791 -44532 291639 -15330
7730 -81921 88514 44736 -262610 100847 149546 -19977 -31106 -79863 -57739 -247327 62949
7718 122158 208029 -5451 -163171 -242419 116885 25435 -34548 -281370 -198580 -129405 125950
7706 161369 -50637 -387165 -175534 -226737 -295476 135397 137813 55580 29083 -11105 -332433
7695 -332433 213663 57366 17596 -257329 -194919 453 -127608 -361421 303334 -50037 -111617
7684 -111617 155328 2695 -90505 -353660 -4100 -20231 164230 -9162 -52886 -212651 -240880
7673 -240880 -107784 200273 212546 -184205 -19321 -219079 383237 149246 -46452 152759
7662 -45281 -156697 -48242 -153841 -69629 99824 163922 154950 -159716 284864 40380 -338 195057
7649 -194924 -28494 -41472 -98220 -244861 -224029 6241 -107451 -74314 27997 -169576 -12769
7637 119871 -309100 172200 33669 -260086 -140774 229911 -338221 21186 -146761 -164013
7627 -164013 -200268 -376696 3172 -81773 -235057 -134249 88646 -195133 -279952 -234222 -248197
7616 -248197 -140745 154727 -30428 -163356 146986 -284594 -293670 43589 160793 97609 -215229
7604 97381 -313551 -61747 -236359 -272258 -252303 -52590 -37913 -11998 -243618 86856 170430
7593 170430 -42015 -10575 -203921 154550 -176616 -128892 -10887 104703 61382 -75462 -37463
7581 -74488 -320829 381785 -167668 -212106 195870 -116440 10431 87640 24588 -50431 -203202
7570 -203202 -58537 64233 -101024 50552 7252 93657 -240871 -253937 -66180 -210072 48432
7558 -299820 -156925 -147609 287243 134909 65625 -54703 -263043 145879 -33011 74633 -304100
7546 86729 66472 428350 -507161 30218 154955 41425 29401 -509106 -132807 180540 -39005
7534 44332 -179770 -270954 -30848 314185 377894 -465609 -8037 -284268 538044 -156093 170072
7522 -6287 -316919 -367069 -287 -123482 -196252 -93876 -211261 -37605 -300258 -43287 51201 50639
7510 50639 -264649 256485 -334709 -162627 -78673 -74325 -108350 -86381 -192320 -273402 80711
7498 -146460 -4401 183304 -16480 41346 112702 -239959 -289948 168998 -340711 -112930 -143191
7487 -143191 -108947 293390 111600 -99043 -128631 241969 189515 119554 -68180 9285 176533
7476 176533 38666 22381 117089 -213738 -16077 -115852 -151390 6830 237845 328712 124332
7464 -134679 -334712 -57487 273367 177866 148040 136990 199463 -64267 -274099 -471845 -226541
7452 -152465 87397 101844 -6297 -120342 -13657 -80883 -150493 -237037 -65815 -404627 -154129
7440 -241997 -14591 328732 13078 -78235 129167 207873 -76588 -197250 -64009 189998 57023
7428 -174654 -166290 220369 13990 43768 -73625 67263 -80040 -116990 -241053 -54348 -86405
7417 -86405 -125748 -169444 327542 150784 -70277 51 -196788 -96809 128528 -223969 -8106 -335124
7405 -335124 86079 -34577 -92782 -43712 25957 -51282 126768 291035 -105604 145412 -2284
7393 132981 -155207 -161860 -215552 -42809 11948 -52869 73113 -39216 184258 -361186 -251589
7382 -251589 12430 73486 25219 -14214 28416 72455 374039 149451 146673 151129 51519 31858
7370 31858 -93543 -35584 -48391 222208 -19480 -119289 -119195 -222938 80450 -39471 -265539 -93896
7357 36179 -282 -129348 -251924 -111772 87722 -213088 -268195 -100411 283971 81905 -253987
7345 -57651 -214376 93000 178445 211159 36343 206860 85960 147482 -68930 168416 -106656
7333 90038 73895 -193330 140851 -215946 40167 174397 -204095 231099 153737 36899 -32700
7321 154514 -101757 100394 -238457 -95315 -329035 349867 -135429 24456 160864 15744
7310 -346262 -145052 -239070 -164534 -221621 212322 110690 14821 148583 -65031 105626 93751
7299 93751 -24225 -74411 353021 -23413 158526 -99145 -366664 91969 167281 -158065 -171574
7288 -171574 -135379 -1625 -86469 -260551 -78840 35806 350295 -70422 91062 -51097 39009
7276 18933 225439 184133 -248923 202887 -8160 -234746 -215939 -10190 -153679 -127501 -377561
7265 -377561 -234357 -385669 -11391 -106216 -231568 -31511 -206142 -136115 211000 -49587 52106
7253 -197426 305273 -110303 34228 -72890 8849 -254402 -253115 54496 -31583 69919 206434
7242 206434 109829 -195384 -173274 -125208 -163740 -56667 84610 -37916 193147 39042 -152716
7230 181927 36802 -85944 170824 -149058 -89007 -288239 59577 -451670 54214 182176 154862
7219 154862 -347994 121634 -138861 216342 -222936 -115214 -153904 -191360 300728 -33095
7208 -216700 -118036 126797 -55399 -7522 62510 -81278 -469742 -233362 225473 3628 -145069
7196 248385 -83436 -5654 -290247 -220232 -183727 -180347 -152822 96534 14470 241253 -272211
7184 221674 -117218 6814 19016 291465 -282584 -162460 -194967 -83533 -144133 -10099 6065
7172 -240378 105483 121709 41990 -109868 311242 -276458 -367131 -157489 106343 -187262
7161 27384 -200223 -8884 121839 -1208 -200578 225660 -316363 -66094 -139539 -203891 213414
7149 -210225 33048 14550 -79969 -124617 -14386 -85713 272056 180286 -59405 208168 -470352
7137 -57980 195006 -193880 -85265 317593 171008 -113955 -239460 102412 95439 202719
7127 202719 -5338 -50350 142659 107442 138466 -185123 40800 195799 195883 -47796 -71388 -61275
7115 -61275 -163028 -284081 -177729 -8763 201274 283302 -71456 -260724 -336152 -167026 -207923
7104 -207923 -51313 162957 40554 -112122 -37665 -134896 -83836 -29997 11262 133164 -199266
7092 -166244 -98656 52514 203675 -160796 -126276 171876 21193 -12595 -309303 252500 -297439
7080 -81615 17400 42304 159239 74664 -317180 -329177 33098 -143840 20574 -327595 159658
7068 -151662 -124838 -137351 130413 -23875 1424 106430 -454640 200305 -131949 -289099 -2009
7056 89463 -49224 -7105 -29444 -96741 -105174 175078 -85335 -248614 -117998 199988 44831
7044 -267215 -49245 -3904 -16803 -115278 -447210 -7431 -187076 -48264 49569 -258793 -184352
7033 -184352 -150677 -142002 211203 56148 57213 -79797 -145911 -25596 -115041 8218 -288997 65962
7020 138745 -25804 108337 -300684 322730 95344 -102294 -20030 50608 62202 -367971 135338
7008 -155082 103664 -557300 161414 -379179 -83133 121153 -326119 26966 -283108 133592
6997 -16903 116209 -189820 215521 138452 25688 -264564 133926 -182544 -323101 14877
6986 84298 -20169 35409 -4541 -47359 117836 171252 -251349 -308712 -38773 -69237 -393604
6975 -393604 271085 -49749 264215 116920 171401 -255937 97763 -289981 -10713 -129782
6965 -129782 -43824 200493 457671 -58367 -19406 235451 -369679 -338725 -27308 90019 118571
6954 118571 60937 -104616 9492 -158357 -6351 240802 -329829 -337671 43680 -21992 -265463
6943 -265463 -134397 -204029 -86475 -150814 -54218 140461 27884 -28648 -2235 117006 -247651
6931 320749 124108 -163179 164204 410557 -5069 24555 -212510 137969 -538242 -2102 118544
6919 -151823 -66952 43511 15582 -94450 37788 -156513 205696 139476 -265419 -153028 146537
6907 -157526 -103468 -94862 27099 181676 984 220328 -162022 -262890 262395 -255886 -204752
6896 -204752 89753 -198588 -165234 -29642 -92548 -221343 -73844 -9716 285088 177937 206795
6885 206795 268059 183761 16074 85987 -226466 141795 -124588 130627 340306 -113043
6874 -368363 114626 -361424 -46894 38503 -256234 -491884 -71045 -206726 177597 -122282
6863 115169 -216326 -62996 38238 -92961 -261485 25990 174163 323847 -281205 44554 65925
6852 65925 143178 -27758 -18669 -27876 -256858 -75632 -156885 242636 211475 -73844 3186 -211166
6839 -119472 -528955 -104848 203373 169230 -229918 -123215 339637 -53605 -79059 -123757
6829 -123757 -721 29593 132702 92197 187420 -165787 52850 -112282 -334831 -101731 197691
6817 -262064 58215 201512 53833 50695 38179 -146830 -208161 -189764 151925 112473 -151834
6805 -110777 -224371 517 208857 60610 -41635 -76794 -320871 -82112 124775 -117158 31914
6793 -151112 63319 -20990 43239 -186477 164899 335171 9871 295731 -120897 -160735 -317289
6782 -317289 -60293 71950 34229 49939 -161255 215465 -61900 124699 -20228 -58676 -202174
6771 -202174 -13210 183966 -27156 -23681 -186222 -311821 10731 67917 -356864 -5167 -326978
6760 -326978 -118589 62999 253160 -150302 -251576 91706 192022 -83239 -99184 294833
6749 7049 161975 354566 402879 40364 -75527 392135 -10205 25110 -57190 33081 -89418
6737 256378 35994 77945 -13428 -259726 21749 149199 -412940 -106332 44646 -215271 -368816
6726 -368816 56069 -46274 27649 220951 47430 -25325 35215 27818 -12324 110332 -175271
6714 -66765 -105785 21753 -48710 314139 -152021 -106011 137120 -236034 -353886 -182936 -153693
6703 -153693 -276886 258354 259395 -100074 80485 72357 2365 348967 83622 -276816 51476
6691 -104920 111385 -126365 240959 -228194 -84421 -21106 133718 -159526 -165336 -156471 -120676
6680 -120676 -157097 -115069 -54732 -144279 64206 -6535 -96686 -31809 -215992 -346235 -115989
6668 224580 53159 57957 -201624 17024 -11092 352312 80971 118569 -241288 146883 -249609
6656 126738 46715 95553 -229700 -1353 207612 79474 7911 -241258 3255 39585 17626 -382611
6643 -55300 -253613 -152255 120335 55256 -168953 -87268 20246 -134834 310098 -200331
6632 -209140 28901 68653 -277300 51382 -145808 18437 -249435 106829 -96819 -53567 136073
6620 -128163 -41327 -38556 115972 -58310 388502 168783 -860 90066 375682 -221116 -172818
6609 -172818 -75409 -202081 167366 81845 -51662 317094 56263 1858 -211888 304664 -4416
6597 12255 120441 206073 -123484 -66399 -153692 -4850 -14379 -135255 -401305 -1853 172020
6585 235545 214732 63419 -373233 48381 -18319 199144 20818 105855 7339 25691 -15690
6573 52302 64071 306614 -270123 81610 57543 -63793 -276736 48749 -43247 -229457 60580
6561 225440 -320535 26258 107708 -81301 -43085 -119079 -48422 -43653 -110427 -161620 129363
6549 129331 -48977 -232234 358629 461021 -31508 46698 -50736 74842 189975 -8224 -149736
6538 -149736 184111 10737 26608 -49783 -230833 -41614 -8365 -358985 -372210 -148661 -401608
6527 -401608 127064 -294114 179848 83653 -202298 -7751 -324346 -24416 23711 24267 -81863
6515 -234056 -88021 2135 -160282 239605 -45251 31928 -137056 -60283 -44634 -348197 -83060
6503 -33809 90418 200116 -205529 -351350 349306 -121234 -14812 11731 -67929 215164 44994
6491 -182806 161463 457837 207628 -8736 10808 7994 -74634 122203 -176214 25148 -33368
6479 -35284 -309823 29918 -421916 75440 -88405 -34295 151734 38211 84615 144516 -176450
6467 70554 35527 153722 183576 20372 -9732 170152 11534 -204297 7160 103014 3332 -369325
6454 -13706 -297481 -36694 -9707 -167154 37713 -50750 181028 129262 19746 -378390 -181429
6442 -112754 88549 87229 -73617 -345664 -18550 -65833 -110217 73907 36123 -188031 47754
6430 158697 -62989 407814 196605 134843 -53201 203644 10919 98178 -159520 44654 -245629
6418 38432 23573 -42467 -230266 11624 -161417 -455712 -81495 12544 -107118 115837 -47857
6406 54337 -28039 -52287 87597 138647 247474 10297 -203951 -151563 108512 -174816 -321603
6395 -321603 10035 134751 26506 -284598 14407 228254 -368174 -1060 -242352 38356 -69103
6383 224951 300360 -322799 -162521 -54466 39958 101703 -30073 -106646 180273 -346577 -115140
6371 96759 -234295 184683 -377927 -344 143477 7650 206811 -110646 -39262 -207002 -13853
6359 98407 187745 34777 242298 137903 418554 348268 -69877 -84607 76756 -150291 -195291
6348 -195291 101170 -269967 95351 -86184 -133161 85216 -106973 -208029 -386556 -358258 -224664
6337 -224664 -40422 -40050 -246920 242859 -147456 -64028 145590 25822 301753 116243 -421471
6325 311433 -44755 -217972 -215317 72814 99693 -101393 -14747 -43085 -376394 101010 71103
6314 71103 908 -144161 103002 60670 135118 -23014 -107170 -188339 170860 267782 -129995
6302 17718 -108728 -66078 178936 -287342 -78849 38940 -288713 -139437 -81736 -265725 -14207
6290 110549 -32344 -479794 142611 528 73444 128496 19516 -204882 -291817 -157014 157569
6278 -279167 185820 -137794 -341837 -115567 20111 -257724 131177 67682 110325 -282730
6267 208322 -190857 -234931 -137297 -49435 -30919 -198888 -75803 -230948 -91318 159129 -262972
6255 -232357 17610 -65564 -84147 426696 152341 36825 190403 142242 -147769 -287840 35588
6243 51880 -46868 413905 -388 16978 166465 -58948 -140881 -7145 52385 -174811 457039 -75186
6230 123069 -246140 96902 -215953 36656 36370 446055 177722 6 191224 -70362 42506 24391
6218 24391 111330 -2616 236479 -521415 212398 -6496 11695 884 -148652 57856 28464 -44127
6205 -119430 -52418 114652 27586 213540 40173 -36248 -159200 3668 109230 21652 61100
6194 61100 -61514 -186748 -107416 157981 43096 -7050 -173489 -236104 58191 155633 -315810
6182 -79048 -231641 -296974 128094 212986 -16748 -601531 44561 -49261 -37527 244160 -124689
6170 -120130 97893 232233 -280806 14473 373327 -100999 188028 262574 25488 155042
6160 155042 62234 -113747 -224582 29906 -235272 -20696 -157915 -179654 -42481 446862 141791
6148 221771 112117 -33077 208244 351597 -292130 28909 -61583 -138771 -61358 -163454 -78923
6136 -91366 -46487 127313 -167578 239744 -395958 -20308 -125969 -274143 215326 -139767
6125 -146686 -155667 38883 -287937 -123633 208645 -145410 -65405 107632 -308912 -13021 58830
6113 -86008 -275812 71140 -137963 -24620 260575 38957 -19671 -225212 -101153 506458 68683
6101 -126404 -137100 67536 36791 220235 116929 158656 177921 -79180 -90206 31295 344963
6090 344963 342102 398545 104737 -35586 -11380 -170732 -243898 8028 -212687 163039 -220403
6078 -241863 148397 55085 -293354 4084 86916 -111984 -198777 62707 -101421 22968 36263
6067 36263 121506 -55472 5524 203527 47942 158485 154968 69073 190315 124007 -88743 -114782
6055 -114782 90118 -249160 -100067 297367 128620 391008 246186 449736 -9792 96212
6044 -101481 4061 -90817 17295 -143201 -123571 -96291 -259215 -55154 -22153 53216 221029
6033 221029 349890 319868 -32148 -259782 439394 -42655 -107850 -70487 -59660 -364082 108131
6021 -139599 317781 -181960 -177679 -276854 -146651 -14283 -161118 -227127 276216 53746 -59541
6009 169593 -63462 183074 -115523 -61699 50055 55757 147940 124922 154158 91107 -32776
5997 21873 -133628 -23457 -192252 69841 124910 154808 -225886 132634 -144759 -323149 -38561
5985 10449 122787 380499 -49830 28734 -98381 -421098 142181 -157170 -131948 -111080 -198812
5974 -198812 143368 -139286 -421926 185168 -106746 -273834 145584 213918 168955 -12111
5963 -47002 -25570 64948 19172 -9637 130748 -303321 94504 -75911 214493 16996 355484
5952 355484 104808 239998 10970 55219 -86300 -17283 -319657 275941 26962 16846 -80749
5940 152194 113538 -206263 -26471 -324732 150842 22131 -66447 -100423 -83799 79108 65067
5929 65067 226118 -77394 -339855 4656 -56402 -112259 -160364 -419371 77102 -281175 109520
5917 -17164 -92248 220231 295844 123539 -221361 -359592 30704 -126971 415687 -489027
5906 -157328 94582 -12196 78896 17278 75445 135199 -125684 197346 -218471 116437 292746
5895 292746 111274 125483 355236 202908 -464107 -53338 -185220 72414 82962 -222934
5884 -381147 -247316 32244 -359147 -39636 -345819 -102402 392574 -167332 45751 -18413
5873 -145736 158835 247620 -151798 172481 29912 -70890 -312266 -52578 197586 -218837
5862 160747 177041 -40170 112310 54464 -26187 46529 -232351 10619 219300 -31599 -75970
5851 -75970 -112315 47800 191042 41752 -359494 -26003 284105 212957 -25873 -223773 115693
5839 -209395 61639 -132879 -236972 270128 -211212 118450 -276196 31912 161160 175046
5829 175046 28455 -136236 38894 85732 -40744 -58220 275945 -228001 -174403 235568 -250567
5817 -71903 -213234 34436 -95283 85521 271942 -206409 103402 -89041 287806 257994 -20446
5805 -52497 149095 13811 250938 163 220539 -285319 37449 -94838 -177824 18339 180344
5794 180344 305951 -23553 103845 80762 47202 -176694 44869 58939 183041 -31710 -193426
5783 -193426 -62086 265624 -38149 49717 -171149 -146409 -330459 -35651 -43872 436828 -149315
5771 -118395 -131219 -115147 120730 144596 303244 -220216 -37393 76402 306777 148452 128000
5760 128000 3698 42700 -3069 -177879 -201741 118756 -43345 213443 288865 162899 -157843
5748 -78302 -87837 192035 -125217 249972 -97477 -75949 72521 35349 -64331 77109 40761
5737 40761 19619 201621 144111 -128622 59661 -296414 -184918 -62673 -23522 28517 -14258
5725 61099 -158367 128463 57530 -120196 -67382 -108663 -265208 116336 -42867 -7506 -217041
5714 -217041 -216440 -40690 96444 42392 -45312 252165 148385 334863 -228122 143117 188993
5703 188993 52566 378946 89016 -334814 -358658 31325 -200946 -49673 -61172 77103 9834
5691 344397 -264830 -86394 54560 -175040 249713 178919 -242679 218473 56261 81349 31402
5679 -185461 32905 -72491 125798 -209611 127889 -173106 47849 220558 260144 -163849
5668 -208819 92985 90233 202623 -259680 -33521 176559 1525 -131998 69774 -170391 -10152
5656 152485 -407216 251041 161008 106754 65155 64653 -179417 -176898 172646 -116430 -111417
5645 -111417 -176239 -80888 137435 543504 -91150 -172252 65137 75136 -87423 -79508 -91976 -179824
5633 -179824 103620 155597 -282115 73120 -93095 183525 29602 -70591 86370 85672 116945
5622 116945 43924 -175071 61986 105048 157448 -113862 238755 -183636 93072 -147090 182268
5610 -32343 -2222 -91153 -63183 48756 -328384 -157018 -164390 -43410 -139720 -23203 4198 2564
5598 2564 -111844 102300 347886 -408811 -139741 -345079 80312 -203236 -382320 -11492
5587 204400 53014 28552 -153317 187756 -23080 221409 199737 99056 -289169 -66291 -251181
5576 -251181 226697 -30134 88107 -7045 -164743 -183275 -172477 67241 -190621 -410173 57350
5564 172934 -253071 25190 143369 -268520 312311 -67888 -35174 -107564 -39310 -35845 50722
5552 212941 18983 376843 45256 279801 -150109 197248 89313 99383 135974 278295 -101274
5540 163976 310585 -89653 -139978 -84472 94316 -33725 -60236 -23137 86086 188885 158157
5529 158157 102736 147663 80175 -42907 80614 -8167 109969 -195616 -18626 -167442 -203380
5518 -203380 -79497 207471 -256478 -14737 71372 -157897 385707 -480196 2591 511036 -153605
5506 131438 128991 145230 -29775 122198 114492 -47315 -47074 76636 138652 -500703 -205161 -228184
5494 -228184 285268 -37619 -253042 -27362 -261120 63352 46586 -15483 223977 -130722 346625
5482 79029 5304 -35907 -3901 107243 -72053 437205 11635 -70381 -82293 130112 -210997
5470 -243814 -104384 -158083 -147094 19327 41705 -212070 29360 361124 69309 -74249 65824
5458 -191557 25235 20448 455573 57809 190155 29633 75762 162518 -22650 -231713 101347
5446 134137 48408 182881 102736 -50123 -177764 90181 89293 62315 6628 69843 110275 95295
5434 95295 -150527 -63058 25723 -99250 -125433 -231641 -341426 56543 1882 202664 -197615
5422 -58758 -80766 -41574 20961 148496 185088 5384 108689 -68046 -36421 -332338 -153367
5410 210135 48984 -308908 336056 117215 -388715 -404214 52412 -6756 89165 91540 14797
5398 -13064 2291 417540 -273970 195276 99294 -103175 -270757 -256213 60136 108670 15311
5386 3722 26783 -67375 34879 -99850 -141140 -23944 174994 102583 -33828 236327 -298058
5374 -85389 -200749 206718 66303 108267 294779 265848 -86275 -255745 145214 -172266 314544
5362 -57667 -197835 9236 70120 -285940 -163210 42784 218622 102689 -127295 -365936 -192913
5351 -192913 58593 -99531 -192713 -474145 -86181 262454 98404 143909 -75087 365192 17875
5339 105186 74457 -19769 157849 12302 -31216 128466 -364509 -280726 -13591 -167128 61219
5327 39604 81777 340868 195726 173288 -6376 66108 -301485 -156972 114454 -75142 -23723
5315 -111960 -131912 -171434 197986 -200915 -89370 36359 -125366 58461 -205886 -6673 -55141
5304 -55141 -324718 -32843 281902 -229154 -76920 13075 89811 216701 -177325 -169889 -72378
5292 48722 101 64701 199769 -8588 110664 -104554 -14970 -58677 73571 73332 -76910 42937
5279 145342 104567 -34776 224435 217810 -164033 27705 -39259 35 39834 -117135 104096 97121
5267 97121 87915 187379 53825 -209073 156321 -190993 136192 266525 375064 96472 -295176
5255 -37021 -198368 62377 -235265 347728 -93150 -107322 -104709 190239 -43374 -213690 -110641
5244 -110641 2976 368405 -37435 4212 7987 237454 -63842 -93269 -59601 -230025 -206500 -2084
5231 -95745 67090 2437 -235323 -103384 -244352 -214366 176519 188585 -89446 -257485 49851
5219 43712 47678 -150645 8429 -37431 -367674 212375 12417 30151 -6491 121433 -170498
5207 -70129 320532 -253018 303012 36952 -35756 -44865 -135493 141521 5471 209457 -74070
5195 -144019 2532 -142423 -10702 -120673 105352 247257 84144 36316 13787 -138564 -25512
5183 4397 165711 -136377 131949 -352899 36632 59121 52870 -12355 3542 -100509 436627
5171 -283380 130514 109894 -97744 46114 24882 42590 267145 69731 228970 202318 -237269
5159 90059 -70389 145606 80227 135950 96657 63981 115619 -64448 -332578 104554 236331
5148 236331 -3424 212877 395951 -289925 98097 273617 -148065 -11954 -156767 -9482 -11651
5137 -11651 101212 361842 -112444 83382 220634 229185 168193 -134811 20900 -38544 307656
5125 78510 -260031 63317 -13715 -277800 -37251 186009 -262123 -59407 162339 224309 -62632
5113 -146940 172523 -223059 -264091 -112305 -70273 -225073 107787 -290221 88002 -335272
5102 112046 -227714 -47107 118114 -52964 252617 -166615 30201 -152018 -185198 105436
5091 -8539 82250 148441 -43290 12224 -358108 362856 -348878 -93699 35724 18783 -24278
5079 -134704 -51138 164235 -46039 -115399 240961 -55037 -72840 -114294 59726 -264329 77663
5067 98021 -181356 151605 -12088 44995 158365 -33888 100870 225914 52199 -100799 52339
5055 -110760 -181441 88107 247597 45735 -58213 74034 28519 60626 -210167 9690 -494402
5043 183007 184166 107522 -152686 111615 503997 333597 7168 156409 187411 -177150 175654
5031 86569 -193611 -108362 -115329 -253432 16653 -6675 -128511 -86382 -202376 27796 193037
5020 193037 274329 -55123 190636 8237 -236129 -13255 -112032 74999 190599 -72364 -171710
5009 -171710 -68193 -47712 -194471 298038 72938 222917 -87360 181043 -62980 -35704 39975
4997 -111453 90115 211357 -238429 -27428 -9920 -50070 217002 493167 -95972 -195980 32461
4985 -57797 -41599 31259 179148 151449 -92965 -90676 -192745 -139888 -127400 247856 18460
4973 132445 -64412 -35821 -42595 -177464 232917 -293180 -59553 -183991 17562 -227141 98147
4961 39056 60846 14724 69014 39714 7244 90601 228270 -109800 303847 -134941 -199484
4950 -199484 48511 -201093 -56686 -97353 16039 58916 -152774 -33659 294310 -106870 -65371
4939 -65371 373205 -143168 321097 69753 173048 -117414 40420 68473 -117439 115353
4928 -72734 -346192 170827 152412 -1809 -72194 9543 -139892 312923 -66376 211095 -1810
4916 188809 365003 -93117 136830 37280 -389657 159001 -2789 -325505 -40423 -90600 -190246
4905 -190246 -71269 129154 46826 -29365 243533 -82715 -46258 -172957 -203919 170152 -13241
4893 241101 243476 -175407 -23236 124618 196876 -34382 277820 -45154 -42600 -165745 -266917
4882 -266917 -4108 28147 69125 -151724 241010 147472 -44940 2056 85141 347422 332611
4871 332611 161465 -120750 -118467 -76366 111497 -122156 2934 184616 31073 108683 27554
4859 143092 279709 -74477 -174066 -19122 -29798 135660 -314745 55345 -450477 -138508 -171088
4848 -171088 122173 222680 -163858 -95113 195425 -148382 236144 379688 4673 -48836
4837 -206638 177070 -30497 283863 -9135 -131879 -29562 247696 41067 163824 377139 21192
4825 -161574 85805 -110510 149858 -49669 60538 213050 42907 -62603 243034 326385 -88514
4813 81006 -19012 -126643 -1739 312473 -60459 327048 208215 93478 -91149 -194398 -126969
4802 -126969 4381 69966 58623 -144347 205063 104494 493931 20482 -142737 153328 -267891
4790 17855 -68808 191896 233911 29974 -48610 527683 -364303 -309854 193606 -100416 -66010
4779 -66010 -350624 72020 -482924 87164 -259900 85810 25026 34669 126749 14825 -179934
4767 -211819 -124461 80763 15735 -43774 23078 37455 -225704 5927 160248 -71115 -32321
4755 80768 -135552 -88489 -66689 -219881 -97018 135590 226942 -46795 -208850 178913 -54403
4743 201442 168039 162638 -17074 391555 60381 -180634 34884 82583 -77820 -27830 136727
4731 -88739 211948 454834 365361 97104 -47097 31391 -237744 -23636 64133 -210049 39965
4719 14623 33714 -199286 -237054 -139802 60577 319885 -275239 187842 301162 -17394 162626
4707 3420 215141 -44860 227209 -111834 -155173 -64301 55942 86277 -208053 -191315 128076
4695 -70901 256723 -621797 209874 -26501 -228033 -169327 81350 71441 235406 116753 -70330
4683 7521 -105421 27758 134383 -5716 -289848 -177973 36113 187614 52104 4566 340798
4672 340798 -119977 232032 3121 125045 -152476 -175209 -198557 -42254 -11799 82091 56567
4661 56567 74864 88682 -163892 154967 -56281 7947 -149512 -77844 135631 -100566 78099
4649 186718 -192508 58388 179894 320733 173013 -73005 -88499 130792 -78939 18321 -218518
4637 -65598 -326207 337342 -66200 348683 -253019 -254206 246463 235683 -80917 -106502 146574
4625 286110 -23350 12600 369420 -204217 75184 -396124 248515 99765 79411 55229 -111555
4613 339646 21441 -257097 22002 167705 -417 182914 370916 67349 -167469 -138572 -6250
4601 -60697 13908 -87801 184489 13057 36653 15842 94651 12179 -109444 -45680 -248279
4590 -248279 -15801 426590 -63921 124202 -158074 -18326 390424 4657 -40419 -179845 -145286
4579 -145286 191489 -39920 62610 -7376 -29232 168307 -268467 -103432 -73876 506859 -77530
4567 2570 192904 160068 55320 -52012 43219 -243857 76476 5733 -476712 213950 -2656 -95895
4555 -95895 137069 -266349 -32794 74737 -263963 -78370 50258 181111 22491 -266901 -270221
4544 -270221 217526 -286585 -349233 142257 -232327 85016 -54741 -26524 496111 -146137
4533 -214986 49243 -95278 -93943 64914 114743 423510 -50541 194722 47043 -202447 -223278
4522 -223278 -32575 104114 -214868 -91782 148159 85615 119242 43988 -92561 -50157 48747
$$ [...]
##END NTUPLES=NMR SPECTRUM
##END=
