
##TITLE=AC1303_PERAH12115_6615838_Fp94LsB6eQ
##JCAMPDX= 6.0         $$ Bruker NMR JCAMP-DX V2.0
##DATA TYPE= NMR SPECTRUM
##DATA CLASS= NTUPLES
##ORIGIN= BRUKER
##OWNER= Administrator
$$ 1.72 TOPSPIN		Version 2.1
$$ 2012-08-03 02:28:18.906 -0500  Administrator@TOPSPIN
$$ Compression mode = diff/dup
##.OBSERVE FREQUENCY= 400.02188249412
##.OBSERVE NUCLEUS= ^1H
##.ACQUISITION MODE= SIMULTANEOUS (DQD)
##.ACQUISITION SCHEME= undefined
##.AVERAGES= 8
##.DIGITISER RES= 22
##SPECTROMETER/DATA SYSTEM= spect
##.PULSE SEQUENCE= zg30
##.SOLVENT NAME= COFFEE_meoh
##.SHIFT REFERENCE= INTERNAL, COFFEE_meoh, 1, 14.98509
##AUDIT TRAIL= $$ (NUMBER, WHEN, WHO, WHERE, PROCESS, VERSION, WHAT)
$$ ##TITLE= Audit trail, TOPSPIN		Version 2.1
$$ ##JCAMPDX= 5.01
$$ ##ORIGIN= Bruker BioSpin GmbH
$$ ##OWNER= Administrator
$$ $$ C:\Bruker\TOPSPIN/data/COFFEE/nmr/AC1303_PERAH12115_6615838_Fp94LsB6eQ/10/pdata/1/auditp.txt
$$ ##AUDIT TRAIL=  $$ (NUMBER, WHEN, WHO, WHERE, PROCESS, VERSION, WHAT)
(   1,<2012-08-03 02:28:11.937 -0500>,<Administrator>,<TOPSPIN>,<go>,<TOPSPIN 2.1>,
      <created by zg
	started at 2012-08-03 02:27:05.468 -0500,
	POWCHK enabled, PULCHK disabled,
       configuration hash MD5:
       6B 1B 68 BB D9 2E 58 E2 7F 35 AD 54 07 DF 0E 41
       data hash MD5: 64K
       A8 7F 0D 82 09 25 EB 4A 71 4C D6 7A 2D 59 F0 9F>)
(   2,<2012-08-03 02:28:14.562 -0500>,<Administrator>,<TOPSPIN>,<proc1d>,<TOPSPIN 2.1>,
      <Start of raw data processing
       efp LB = 0 FT_mod = 6 PKNL = 1 PHC0 = 0 PHC1 = 0 SI = 32K 
       data hash MD5: 32K
       06 13 57 50 01 5D 98 F0 49 3E 7F 29 0E 85 91 08>)
(   3,<2012-08-03 02:28:14.984 -0500>,<Administrator>,<TOPSPIN>,<proc1d>,<TOPSPIN 2.1>,
      <pk PHC0 = 180.379 PHC1 = 0 
       data hash MD5: 32K
       20 09 9C FB 4D 25 32 6B B9 7D 22 EF 4C 21 D7 46>)
(   4,<2012-08-03 02:28:15.093 -0500>,<Administrator>,<TOPSPIN>,<proc1d>,<TOPSPIN 2.1>,
      <abs ABSG = 1 
       data hash MD5: 32K
       46 74 0B 6C A5 FD 47 00 C2 A4 23 FE A2 3E CD D8>)
(   5,<2012-08-03 02:28:15.156 -0500>,<Administrator>,<TOPSPIN>,<proc1d>,<TOPSPIN 2.1>,
      <abs ABSG = 2 
       data hash MD5: 32K
       F7 23 DA B7 82 48 D8 A3 83 B0 56 9C 7D 5D 84 13>)
(   6,<2012-08-03 02:28:15.203 -0500>,<Administrator>,<TOPSPIN>,<proc1d>,<TOPSPIN 2.1>,
      <abs ABSG = 3 
       data hash MD5: 32K
       ED 08 76 5F C5 3A BF 95 F1 92 01 CE 13 BE DA 31>)
(   7,<2012-08-03 02:28:15.234 -0500>,<Administrator>,<TOPSPIN>,<proc1d>,<TOPSPIN 2.1>,
      <abs ABSG = 4 
       data hash MD5: 32K
       54 10 62 B8 2E 9F 10 76 38 08 29 CF F7 2B 52 42>)
(   8,<2012-08-03 02:28:15.265 -0500>,<Administrator>,<TOPSPIN>,<proc1d>,<TOPSPIN 2.1>,
      <abs ABSG = 5 
       data hash MD5: 32K
       35 1C 22 EC 55 16 EE 5B FB 92 E8 39 2D 1B 54 F2>)
$$ ##END=
$$ 
$$ $$ hash MD5
$$ $$ E4 37 6C 36 EB C2 7A 02 A5 41 48 2A 54 BC C5 4D
##$RELAX= 
##$RELAX= 
##$RELAX= 
##$RELAX= 
##$RELAX= 
##$RELAX= 
##$RELAX= 
$$ Bruker specific parameters
$$ --------------------------
$$ [...]
##$TP= (0..7)
150 150 150 150 150 150 150 150
##$TP07= 0
##$TPNAME0= <>
##$TPNAME1= <>
##$TPNAME2= <>
##$TPNAME3= <>
##$TPNAME4= <>
##$TPNAME5= <>
##$TPNAME6= <>
##$TPNAME7= <>
##$TPOAL= (0..7)
0.5 0.5 0.5 0.5 0.5 0.5 0.5 0.5
##$TPOFFS= (0..7)
0 0 0 0 0 0 0 0
##$TUNHIN= 0
##$TUNHOUT= 0
##$TUNXOUT= 0
##$USERA1= <user>
##$USERA2= <user>
##$USERA3= <user>
##$USERA4= <user>
##$USERA5= <user>
##$V9= 5
##$VALIST= <valist>
##$VCLIST= <CCCCCCCCCCCCCCC>
##$VD= 0
##$VDLIST= <DDDDDDDDDDDDDDD>
##$VPLIST= <PPPPPPPPPPPPPPP>
##$VTLIST= <TTTTTTTTTTTTTTT>
##$WBST= 1024
##$WBSW= 4
##$XGAIN= (0..3)
0 0 0 0
##$XL= 0
##$YL= 0
##$YMAX_a= 490141
##$YMIN_a= -641404
##$ZGOPTNS= <>
##$ZL1= 120
##$ZL2= 120
##$ZL3= 120
##$ZL4= 120
##$ABSF1= 14.98509
##$ABSF2= -5.573092
##$ABSG= 5
##$ABSL= 3
##$ALPHA= 0
##$AQORDER= 0
##$ASSFAC= 0
##$ASSFACI= 0
##$ASSFACX= 0
##$ASSWID= 0
##$AUNMP= <proc_prof1d_extract_pilot.lims>
##$AXLEFT= 0
##$AXNAME= <>
##$AXNUC= <1H>
##$AXRIGHT= 0
##$AXTYPE= 0
##$AXUNIT= <>
##$AZFE= 0.1
##$AZFW= 0.1
##$BCFW= 0
##$BC_mod= 0
##$BYTORDP= 0
##$COROFFS= 0
##$CY= 15
##$DATMOD= 1
##$DC= 0
##$DFILT= <>
##$DTYPP= 0
##$F1P= 0
##$F2P= 0
##$FCOR= 0.5
##$FTSIZE= 32768
##$FT_mod= 6
##$GAMMA= 0
##$GB= 0
##$INTBC= 1
##$INTSCL= 1
##$ISEN= 128
##$LB= 0
##$LEV0= 0
##$LPBIN= 0
##$MAXI= 10000
##$MC2= 0
##$MEAN= 0
##$ME_mod= 0
##$MI= 0
##$NCOEF= 0
##$NC_proc= -8
##$NLEV= 6
##$NOISF1= 0
##$NOISF2= 0
##$NSP= 0
##$NTH_PI= 0
##$NZP= 0
##$OFFSET= 14.98509
##$PC= 1
##$PHC0= 180.379
##$PHC1= 0
##$PH_mod= 1
##$PKNL= yes
##$PPARMOD= 0
##$PPDIAG= 0
##$PPIPTYP= 0
##$PPMPNUM= 2147483647
##$PPRESOL= 1
##$PSCAL= 4
##$PSIGN= 0
##$PYNMP= <proc.py>
##$REVERSE= no
##$SF= 400.02
##$SI= 32768
##$SIGF1= 0
##$SIGF2= 0
##$SINO= 400
##$SIOLD= 32768
##$SPECTYP= <>
##$SREGLST= <1H.CDCl3>
##$SSB= 0
##$STSI= 32768
##$STSR= 0
##$SW_p= 8223.68421052631
##$SYMM= 0
##$S_DEV= 0
##$TDeff= 65536
##$TDoff= 0
##$TI= <>
##$TILT= no
##$TM1= 0
##$TM2= 0
##$TOPLEV= 0
##$USERP1= <user>
##$USERP2= <user>
##$USERP3= <user>
##$USERP4= <user>
##$USERP5= <user>
##$WDW= 1
##$XDIM= 32768
##$YMAX_p= 462817923
##$YMIN_p= -716592
##$CURPLOT= <Network HP LaserJet P1505>
##$CURPRIN= <$Network HP LaserJet P1505>
##$DFORMAT= <normdp>
##$LAYOUT= <+/1D_H.xwp>
##$LFORMAT= <normlp>
##$PFORMAT= <normpl>
##$SURQMSG= 1
$$ End of Bruker specific parameters
$$ ---------------------------------
##NTUPLES= NMR SPECTRUM
##VAR_NAME=  FREQUENCY,     SPECTRUM/REAL,   SPECTRUM/IMAG
##SYMBOL=    X,             R,               I
##VAR_TYPE=  INDEPENDENT,   DEPENDENT,       DEPENDENT
##VAR_FORM=  AFFN,          ASDF,            ASDF
##VAR_DIM=   32768,         32768,           32768
##UNITS=     HZ,            ARBITRARY UNITS, ARBITRARY UNITS
##FACTOR=    0.250966925370066, 1,           1
##FIRST=     8223.43324360094, -121131,      -71026
##LAST=      0,             72419,           -264197
##MIN=       0,             -716592,         0
##MAX=       8223.43324360094, 462817923,    0
$$ Real data points
##PAGE= N=1
##DATA TABLE= (X++(R..R)), XYDATA
$$ [...]
19483A48192a43008H8575b66644H854c5105a1188j57050N5997j43139J17601B34495
19471d11260F3940d13033e2640A41261e7125A04616c00709h3873A96746c95613
19460c41500a19275j15064a5317k60783Q4861A29517k0340d190k3727j28738B15146
19448i1774K7087o6326A33559a62614G7214r30P3590a9399A12298b45705i6663
19436B28904g9480B98653b86708F9309Q968g5711k45467A92416b9750A64281a40112
19424c6379J7253B72130b36406J17898e5986C07785b15085P3568B0380P2896b5072
19412C6902q21d6055A5083a27185e3284a4483k7787A9587d45324a3578A40749
19400A65860E7035a46919d3120k9293C41469c14402B4887K27081a87595r8710
$$ y = [148192, -143008, 88575, -266644, 8854, -35105, -11188, -168238, -112241, -255380, -137779, 234495, -411260, 63940, -413033, -52640, 141261, -57125, 104616, -300709, -83873, 196746, -395613, -341500, -119275, -234339, -15317, -276100, -191239, 129517, 109177, -4190, -27917, -156655, 215146, -91774, -64687, -131013, 133559, -162614, 77214, 76284, 149874, -19399, 112298, -245705, -96663, 228904, -79480, 298653, -286708, 69309, 78277, -75711, -321178, 192416, -29750, 164281, -140112, -36379, -19126, 272130, -236406, -118508, -55986, 307785, -215085, -141517, 20380, 93276, -25072, 36902, 36081, -46055, 15083, -127185, -53284, -14483, -42270, 19587, -445324, -13578, 140749, 165860, 57035, -146919, -43120, -72413, 341469, -314402, 24887, 251968, -187595, -286305]
19390b86305p9656C9989e8916j36489J9802g2848j57182a14908k4372K2606j80438
19379b97112J37760A65172p3119a5622I519c01419F5742B3772a54395p127J0882
19368a50640I099g1931B72041c17524c5111m560j72834G428N1529J54918b35135
19356A66743E3916M8900a64525P3738o0138i183j03419b0888H7410a31184J8945
19345a12239l7206k33185J26346A73332c02089A2987g7071j92537p5034n6219
19335d00861E1402a22452b6076A7394c8967p5721N756k04199A92380p4134C2179
19323a95264C65590b80631o0315a53652j10685l09778f5973n9260J9857G635L1017
19312C8652K6487d73942K04975a20041J4796B44125c1918k53182f9591n8182q2722
$$ y = [-286305, -365961, 39989, -58916, -195405, -175603, -72848, -230030, -114908, -139280, -116674, -297112, -159352, 165172, 92053, -15622, 9519, -301419, 65742, 23772, -154395, -161522, -150640, 9099, -71931, 272041, -317524, -35111, -39671, -212505, 7428, 58957, 213875, -235135, 166743, 53916, 102816, -164525, -90787, -150925, -9183, -112602, -20888, 87410, -131184, -112239, -149445, -382630, -256284, 173332, -302089, 12987, -77071, -269608, -344642, -400861, 51402, -122452, -26076, 17394, -38967, -114688, -108932, -313131, 192380, 118246, 32179, -195264, 365590, -280631, -340946, -153652, -264337, -574115, -65973, -125233, -105376, 7635, 38652, 65139, -473942, -268967, -120041, -105245, 244125, -31918, -285100, -69591, -127773, -210495]
19301b10495A29050L1901A907K31855b98738J07692A56927a60710l32262F8095
19290a75584F1451a77887B6037a33415n5506P8002A62408d011l21672A28309c42067
19278A02848h9504H7286b0509k07615c0071p1881D9928M0664d89158G4050K672
19267G6722g4197F110O1253R6355d12895J67743d4479K970k28025H9446a30358
19255B31008a00157k00282J22523B42936c42845c5990k74611L5197J28790j62541
19245c09155f4761m4069e0596E5896A7534N0744a13450L5717j75785h1932m3912
19234a25844H0543a65122j54470B31071g680r8256n2165f6877j03226P0434G1137
19222d2967A90683a49753A527b05886F6461R3626m3974a61402E5360j4208O4562
$$ y = [-210495, 129050, 160951, 1907, 233762, -298738, -191046, 156927, -160710, -492972, 68095, -175584, 61451, -177887, 26037, -133415, -188921, -110919, 162408, -4011, -325683, 128309, -342067, 102848, -89504, 87286, -20509, -228124, -30071, -101952, 49928, 90592, -489158, 74050, 76722, -74197, 6110, 67363, 163718, -412895, -245152, -44479, -41509, -269534, 89446, -130358, 231008, -100157, -300439, -177916, 242936, -342845, -35990, -310601, -275404, -146614, -309155, -64761, -108830, -50596, 55896, 17534, 68278, -113450, -77733, -253518, -81932, -125844, 80543, -165122, -319592, 231071, -7680, -105936, -158101, -66877, -170103, -99669, 71137, -42967, 190683, -149753, 1527, -205886, 66461, 160087, 116113, -161402, 55360, 41152, 105714]
19211A05714L0961a13868j54514h0762b3095C96327d2298n6066d2640J2785q2175
19200a12030q1969l3402G0802k321d86444h3676J8297A88030a26598o2764N943
19189a83419p2942D6982d54815a60337C38L5220N1858b60613J1556B0826j653
19178A9173J43426a12599B71496D0983J8811a83167A02026E839a74417Q0237n8297
19167a52477I8313b95283A59651c3922j12317D3280e2101p7584p3879F1417P1710
19156A33127a75809C01398a62697m7645B25500b15820b1622k32855a2351A3310
19145a72320j88359C36614A29431c01355D5226a57242A2737J11330A4074a59858
19134a93929A89395G5820b78246A28336e42091C46555c5260l18934B58093F6403
$$ y = [105714, 136675, -113868, -268382, -80762, -23095, 396327, -42298, -98364, -42640, -29855, -112030, -193999, -227401, 70802, 68481, -486444, -83676, -65379, 188030, -126598, -189362, -183419, -256361, 46982, -454815, -160337, 338, 35558, 87416, -260613, -249057, 20826, 19173, 162599, -112599, 271496, 40983, 59794, -183167, 102026, 5839, -174417, -94180, -152477, 98313, -295283, 159651, -33922, -146239, 43280, -52101, -129685, -203564, 61417, 133127, -175809, 301398, -162697, -210342, 225500, -215820, -21622, -254477, -12351, 13310, -172320, -360679, 336614, 129431, -301355, 45226, -157242, 12737, 124067, 14074, -159858, -193929, 189395, 75820, -278246, 128336, -542091, 346555, -35260, -354194, 258093, 66403]
19123c67818d7357E3219L0818a22475B4456N5421d0207A09964a72362O8635B36681
19111B67586K849b47068I1647O872a63505a3535j59951G6929b05663B72946m8035
19100B24911a84516g3685C6626O2419a43735o79d1855l04070D03771G8204M15887
19089D94091c65075C73938e0212A6069J53299b17599F5146a45251b6276A06734
19078b00595C4610L01433a30774D522f6602j927A94488H408K41433a18518a3726
19066a92092K4021o7482A36795d22892J54885g9820B53295F9048J91314b77546
19055c01098I0450a80553F4576e6538l8786A8779b86126P0970k00182e280D2909
19043a69198o648c8538k26356a13635K8023c4831l39744a58577c8205j35926B1634
$$ y = [-367818, -47357, 53219, 84037, -122475, 24456, 79877, -40207, 109964, -172362, -103727, 236681, 267586, 270435, -247068, 91647, 98519, -163505, -13535, -173486, 76929, -205663, 272946, 224911, -184516, -73685, 36626, 99045, -143735, -144414, -41855, -345925, 403771, 78204, 494091, -365075, 373938, -50212, 16069, 169368, -217599, 65146, -145251, -26276, 106734, -200595, 34610, 336043, -130774, 4522, -66602, -68529, 194488, 8408, 249841, -118518, -13726, -192092, -168071, -235553, 136795, -422892, -268007, -79820, 253295, 69048, 260362, -277546, -301098, 90450, -180553, 64576, -56538, -95324, 18779, -286126, -215156, -415338, -5280, 42909, -169198, -175846, -38538, -264894, -113635, -85612, -34831, -374575, -158577, -38205, -174131, 21634]
19031a81883M5744H2145L030R0946a78989a2112D68026b4227d353B45905M6381
19020B92286c5969A78048J64696j62064E9356K31959a04779k30830E1097a25355
19009A9542N5839e1278p3873b0319H1161a8218j46331b7461p9457D1262c7716
18997A24198b2203A97416D817h3026m5238E7656D368i5344C8137J20859A3613
18985b57167J5968j66250G1482h3378L6674A98334f11975A56589E0197J99049
18975B49246a54329B96882J77310K51552j43467j52976G4610M4079J02545p8677
18965A42557J6658c4093F7709a06296G1376b44444e2417j06808C39919c17868
18954e54703K47030A29065b63409K7730j02530f32j25251B1834a49488j03203
$$ y = [-181883, -136139, 82145, 85175, 176121, -178989, -12112, 468026, -24227, -4353, 245905, 292286, -35969, 178048, 342744, 180680, 59356, 291315, -104779, -335609, 51097, -125355, 19542, 75381, -51278, -125151, -20319, 81161, -18218, -164549, -27461, -106918, 41262, -37716, 124198, -22203, 197416, 4817, -83026, -128264, 57656, 4368, -95344, 38137, 158996, 13613, -257167, -241199, -407449, 71482, -83378, -46704, 198334, -611975, 156589, 50197, 249246, -154329, 296882, 474192, 725744, 582277, 429301, 74610, 118689, 221234, 142557, 159215, -34093, 67709, -106296, 71376, -244444, -52417, -159225, 339919, -317868, -554703, -307673, 129065, -263409, -235679, -338209, -632, -125883, 21834, -149488, -252691]
18944b52691a03672d0185j62301n8592a20765A16858J53225A26186a35443E7710
18933b1311m52267c4912j03552j63706B5634N8977O4181a39404C84154b41739
18922b24472c0079j16108E3378b64512A4058c34159A1308i0639q336l3685l5077
18911a67737j18400I790O19521O2645r8239A3568c9427j42020L6480A88890j4733
18900A74157H3893q811B4398J62686D9841k2509g643l79609J57244k3058B21722
18888B7468M7596b23123B6995O7415a9989l0753k46746B06948c23789a09167Q274
18877a00893r5948A5874h2436L222n6514B46150a5613A49014a60575A39028a9820
18865a32592F9960l3641L2941J8877L3392d63613a84574B9862A0145d50930A51329
$$ y = [-252691, -103672, -40185, -202486, -261078, -120765, 116858, 270083, 126186, -135443, 57710, -21311, -473578, -34912, -138464, -302170, 25634, 84611, 148792, -139404, 384154, -241739, -224472, -30079, -146187, 53378, -264512, 14058, -334159, 11308, -90639, -98975, -132660, -167737, -286137, 9790, 629311, 691956, 593717, 13568, -39427, -181447, -144967, 188890, 174157, 83893, 75082, 24398, 187084, 49841, 27332, -7643, -387252, -230008, -253066, 221722, 27468, 75064, -223123, 26995, 94410, -19989, -50742, -297488, 206948, -323789, -109167, -100893, -196841, 15874, -82436, -79214, -135728, 246150, -15613, 149014, -160575, 139028, -19820, -132592, 69960, 36319, 69260, 88137, 121529, -463613, -184574, 29862, 10145, -450930, 151329]
18853a39607M065K115J0369r4746B62098c15176e8337r0151f7571r6463I8652
18841d05685C31866a62697k15000A02126J3879a75876A29898I181d5719J1985
18831c3734A66140b4718B71460c38126B04813b91299a37367D2144L0899O5405
18821A38448c9775A32614b95983B16765F2816K52197C6512L86997A50553d1968
18810c0677C78559a37394C19443J75151j65332I3405a05147M8831j89630a11523
18799B4724b5342l506j79730c8703n1617I8207J6166B5567a65323B64706p0027
18788A94679a37909l2908D09311g3807A04569c01688J09762A15242b97982A39459
18777A36407a47351A1148b42273G1711d46306J72134j04003a53951N0495j59856
$$ y = [-139607, -135542, -133427, -123058, -217804, 262098, -315176, -58337, -148488, -67571, -164034, 98652, -405685, 331866, -162697, -377697, 102126, 116005, -175876, 129898, 9181, -45719, -33734, 166140, -24718, 271460, -338126, 204813, -291299, -137367, 42144, 73043, 138448, -39775, 132614, -295983, 216765, 62816, 315013, 36512, 423509, 150553, -41968, -30677, 378559, -137394, 319443, 494594, 329262, 93405, -105147, -56316, -245946, -111523, 24724, -25342, -28848, -208578, -38703, -90320, 98207, 114373, 25567, -165323, 264706, 194679, -137909, -170817, 409311, -73807, 104569, -301688, -191926, 115242, -297982, 139459, 136407, -147351, 11148, -242273, 71711, -446306, -274172, -378175, -153951, -103456, -263312]
18767b63312N457C12238a55613B06120F728K4961J36907O0487a7431k77202O9583
18756b25050l632H7044F928a10086n0665A27284h5835K4832j02899A37881b86924
18744B7207J47769b91999Q9466h2167H2143b05796b057A51940d52433f0347n8407
18733a18754p1571B4723a19314M3661a9000j00061J6738B15514a96937A77411
18722f4173B2784L8300c1406q6843e7378j11955E5426c9969a5244m2333o468C8218
18709a74693c6893A89040q9192c07424C9491c23300b2224r8120N5177L695q708
18698g0180j82404f1105j10615k5128A1346L55690C4666J4187b61228a09907L9189
18687g0718H3264c06214A11411b16119C0783J911a00866L4169o8920O0538A73343
$$ y = [-263312, -257855, 312238, -155613, 206120, 6728, 31689, 168596, 229083, -17431, -294633, -225050, -228682, 87044, 6928, -110086, -160751, 127284, -85835, -61003, -163902, 137881, -286924, 27207, 174976, -291999, -202533, -82167, 82143, -205796, -2057, 151940, -452433, -60347, -118754, -190325, 24723, -119314, -75653, -19000, -119061, -102323, 215514, -196937, 177411, -64173, 22784, 61084, -31406, -118249, -57378, -169333, 55426, -39969, -15244, -57577, -64045, 38218, -174693, -36893, 189040, 99848, -307424, 39491, -323300, -22224, -120344, -65167, -61472, -70180, -252584, -61105, -171720, -196848, 11346, 367036, 34666, 48853, -261228, -109907, -70718, 83264, -306214, 111411, -216119, 30783, 32694, -100866, -66697, -135617, -75079, 173343]
18675a48612b4703p6070B46555a76870B03324a30810A02883R9795a9790p4958
18665i4748D0620K15441a8509m16160g2763P488A43919b27439k5213Q7725e1529
18653E8209b64129a25937j80836f2671J5587j00696q929O2251l3330j17534K7695
18642b17627N956g790j59820I5637C118a43758C1978h4593j60481p2968B5915
18630b42979j21846P9154J31822k0732J00A82973a03435G7123j6264a86112b2908
18618a69847E6482a95334B8877a9986k0379B37686e1138E6086b25928J9963B59615
18606c01130H248d2943f556k60442D9262j3184b31750N7899A96274e019A59923
18594a50477N6223I839J75845a48498B7209c16393a27321K6402l233j59597a04854
$$ y = [-148612, -24703, -100773, 246555, -176870, 203324, -130810, 102883, 202678, -19790, -94748, 40620, 256061, -18509, -434669, -72763, -65275, 143919, -227439, -252652, -164927, -51529, 58209, -264129, -125937, -306773, -62671, -47084, -147780, -156709, -94458, -127788, -245322, -217627, -211671, -7790, -167610, 95637, 3118, -143758, 31978, -84593, -245074, -318042, 25915, -242979, -364825, -285671, -153849, -174581, -174481, 182973, -103435, 77123, 60859, -186112, -22908, -169847, 56482, -195334, 28877, -19986, -40365, 237686, -51138, 56086, -225928, -205965, 259615, -301130, 8248, -42943, -6556, -266998, 49262, 36078, -231750, -173851, 196274, -5019, 159923, -150477, -94254, 9839, 185684, -148498, 27209, -316393, -127321, -100919, -104152, -263749, -104854]
18582b80373i608j46189L0382r3686i3520j87329a22566j5242b8195j82196D4710
18570e2095l44435f4867k2338A79965F047g8954j9228A2634a14168G8556a29016
18558c3675r6006k20039a43804B50125a207j16247B70490a03192m289M5209k52184
18547c14456J28783A14713D6483R950d5951F8051O7735h2674n3239k03006D2722
18535I8356k872e2042l6827O962A91096f0568j57350h8947L6631j04358b6368
18523A65883c97640A70379b3445p7239p5384A15766Q9019M9833a98189A36929
18512a40283A01682i5221G893b04507R4841A82963c7505B31457a4164A39978K7018
18501A66996a10702B12403h6307j36928n7532P0475c7165H1069i6408k37919f6871
$$ y = [-280373, -9608, -155797, -125415, -219101, -93520, -280849, -122566, -137808, -28195, -210391, 44710, -52095, -396530, -64867, -87205, 179965, 6047, -78954, -98182, 12634, -114168, 78556, -129016, -33675, -129681, -349720, -143804, 250125, -1207, -117454, 270490, -103192, -107481, -62272, -314456, -185673, 114713, 46483, 56433, -45951, 68051, 135786, -82674, -135913, -338919, 42722, 98356, 95484, -52042, -88869, -81907, 191096, -60568, -217918, -88947, -52316, -156674, -26368, 165883, -397640, 170379, -23445, -100684, -176068, 115766, 204785, 254618, -198189, 136929, -140283, 101682, -95221, 7893, -204507, -109666, 182963, -37505, 231457, -14164, 139978, 166996, -110702, 212403, -86307, -223235, -280767, -210292, -37165, 81069, -96408, -334327, -66871]
18489a54931P135j98612a0750j72098Q3234k61297d1705q3045A95325a76469k09272
18478c85741B3707b0027l1017K2642B108c38025a05455k88620I7799A9235i6431
18466a93664j00608a44013p84B08642F6774a31206b3087A63593e7292A92476b17703
18454F5958a27623p4119L1625B6760K35644C3817b01484B45255d29154A92846
18443a54558A81378J86153C3860K2198j6263a21458q2076C96641D656a36362L0557
18432a05805A36833F7950B5045a17462q9830j00255j33622c9695C17628d9837
18421B8419d36813A046J77210h0232A8018M462K45315b91670I4486c47760K3571
18410c24189F5974a48707C517a9674l03217A77619B6569J14770a11885B57930
$$ y = [-154931, -147796, -346408, -10750, -182848, -99614, -360911, -41705, -124750, 195325, -176469, -385741, 23707, -20027, -51044, -28402, 2108, -338025, -105455, -394075, 97799, 19235, -96431, -193664, -294272, -144013, -144797, 208642, 66774, -131206, -23087, 163593, -57292, 192476, -217703, 65958, -127623, -201742, -170117, 26760, 262404, 33817, -201484, 245255, -429154, 192846, -154558, 181378, 367531, 33860, 56058, 39795, -121458, -203534, 396641, 4656, -136362, -105805, 136833, 67950, 25045, -117462, -207292, -307547, -441169, -39695, 317628, -49837, 28419, -436813, 1046, 178256, -80232, 18018, 22480, 267795, -291670, 94486, -347760, -324189, 65974, -148707, 3517, -19674, -322891, 177619, 26569, 141339, -111885, 257930]
18399g9283A57648o6893R350j3536J5840h2460A26310c6517F4686b49670A46103
18387a10410m6895e2248p9487A42042b94036H0997f7538k00340G1009a97453K4796
18376a72657A18402P4228b59096A61728j3551e80190F0199a9991k51457a08519
18365A7093b24452B67242a70274A07967O476f9658p0313j8903k37488A5000n223
18354I777l489K244a11101p5034k1381g8633D1937a42026j24367c0487o8960n0962
18342a50409A81128J4122K56753I8918N5861e840j09302D4181a29371L6479B48450
18330a24719A04145f4440G7061a00624j52908P8508p0206B4233J9620e7347K2501
18319c4846e802A64966b03518f2584B14963H7624Q1173a58924d0125k7495j61893
$$ y = [-79283, 157648, 90755, 100105, 86569, 102409, -82460, 126310, -36517, 64686, -249670, 146103, -110410, -157305, -52248, -131735, 142042, -294036, 80997, -67538, -267878, 71009, -197453, -172657, 118402, 192630, -259096, 161728, 148177, -580190, 60199, -19991, -271448, -108519, 17093, -224452, 267242, -170274, 107967, 114443, -69658, -139971, -158874, -396362, 15000, 9777, 6288, 8532, -111101, -186135, -207516, -78633, 41937, -142026, -266393, -30487, -99447, -150409, 181128, 195250, 452003, 98918, 154779, -5840, -115142, 44181, -129371, -92892, 248450, -124719, 104145, -64440, 77061, -100624, -253532, -175024, -245230, 24233, 43853, -57347, -34846, -5802, 164966, -203518, -62584, 214963, 87624, 168797, -158924, -40125, -67620, -229513]
18308b29513C26303j40609B0064b24086e2185A93306B4436h9912j89527C6473
18297h1515k0379a5971H2810h0152A66542o6737a07302p9405A17618d45731b12514
18285A65714a72432k12511a82354f197l97919a32473K7580e255k85134A32803
18274g2483l9828m8314F7165J9301L0492a01916o0445C8017b92230B1761K1835
18263D3596a23287N3485B83959C3605J39931c0821k48036A75935J66572b22942
18252B45997j07381a08068j10854A11988b82158c3469B11194j01826K8063J5311
18242A52742a78288b7544j20305A89149D2113a77150e3495j29410D4999J87189
18232B32188m9051E1098L0004a03250j25820b3255A03793a52409C3506d7422j24051
$$ y = [-229513, 326303, 185694, 20064, -224086, -52185, 193306, 24436, -89912, -279439, 36473, -81515, -101894, -15971, 82810, -80152, 166542, 99805, -107302, -186707, 117618, -445731, -212514, 165714, -172432, -384943, -182354, -6197, -404116, -132473, -104893, -5255, -290389, 132803, -72483, -112311, -160625, 67165, 86466, 116958, -101916, -162361, 38017, -292230, 21761, 43596, -123287, -69802, 283959, 33605, 173536, -30821, -278857, 175935, 342507, -222942, 245997, 138616, -108068, -218922, 111988, -282158, -33469, 211194, 109368, 137431, 152742, -178288, -27544, -147849, 189149, 42113, -177150, -53495, -182905, 44999, 232188, 183137, 51098, 81102, -103250, -229070, -23255, 103793, -152409, 33506, -47422, -171473]
18221a71473A06754c61765B02047H3082g0560j57453A37223b65066C7355b92952
18210c13423j8963i28G0296J89307a92438c2615k78662B46047A8497K13488p7865
18199A54120a2500A86030C32J97256a74827C00265L146J6470f3347C55772h417
18187I3785J07952a77166a4496k5273I3095R2807q8745i9523r8435A59552o2509
18176I7043b2908k22957a00484H045e170B5961b82113A24426a17855B2497M010
18165B6507L5873a4788l20324g5390B22800b52325g254b683G9114b83705C0010
18153A94273F4316h1429A1844K65191A09937a58555B15447b8119p4803j28240
18143b31162K2839A57324N373P9353a23471m9533D75773A63229a2583D7128h2138
$$ y = [-171473, 106754, -361765, 202047, 83082, -70560, -228013, 137223, -265066, 37355, -292952, -313423, -332386, -928, 70296, 259603, -192438, -32615, -311277, 246047, 18497, 231985, 154120, -12500, 186030, 332, 197588, -174827, 300265, 303411, 319881, -63347, 355772, -8417, 93785, 201737, -177166, -14496, -39769, 93095, 185902, 97157, -99523, -197958, 159552, 97043, -22908, -245865, -100484, 8045, -5170, 25961, -282113, 124426, -117855, 22497, 26507, 62380, -14788, -335112, -75390, 222800, -252325, -7254, -2683, 79114, -283705, 30010, 194273, 64316, -81429, 11844, 277035, 109937, -158555, 215447, -28119, -102922, -231162, -208323, 157324, 162697, 242050, -123471, -173004, 475773, 163229, -12583, 47128, -82138]
18131a6917C059b26123K7985c4666n4355E100K16028c54490K5417O9250A3077
18119b31366f7479A9855O5866R3134c5130N209j32420A49877E3431K21879C9102
18107A50843b09635M8819L9138M8667C19652C9514l869J18827J7129c39706J43207
18096a96499A93055a12146k5895A70365f3102r7499O9293L8461A87488L1871I1216
18084C56833a77746G0768O6967B1341a78339J5472l4531D18873j87850C2115c75168
18072b15311I3651i5966j89251B755a92803L6223B20369a95864a0467j07708A76267
18060e073l3687B08868g7440m7543C0874J12693b29487J14151B62211b4745G9500
18048g2929L4031m6933n9295j69730B70080F4437h3592k06267A44040h0157D7133
$$ y = [-16917, 3059, -226123, -198138, -34666, -89021, 5100, 221128, -354490, -329073, -259823, 13077, -231366, -67479, 19855, 85721, 178855, -35130, -29921, -162341, 149877, 53431, 275310, 39102, 150843, -209635, -160816, -121678, -73011, 319652, 39514, 35645, 154472, 171601, -339706, -196499, 193055, -112146, -138041, 170365, -63102, -160601, -91308, -52847, 187488, 219359, 91216, 356833, -177746, 70768, 137735, 21341, -178339, -162867, -197398, 418873, 231023, 32115, -375168, -215311, 93651, -95966, -285217, 2755, -192803, -156580, 220369, -195864, -10467, -118175, 176267, -5073, -38760, 208868, -77440, -124983, 30874, 143567, -229487, -115336, 262211, -24745, 79500, -72929, -38898, -85831, -145126, -314856, 270080, 64437, -83592, -289859, 144040, -80157, 47133]
18036D48751a89037A4234K6869b84754J18184L1648M4203D4561A6768d26420P6933
18025c49487F8804l0591a5329k84661A06521a26156j47052A2841M02683b04978
18014i350A740J9455L3652a57640A01954a46958j98858A59807g721m33317A79734
18002C07718l4463e1353k8223j29001p1854A98152J9099N3816e2312r6022A5139
17990B44577g6658k2441A7542c88430e978k21937A09505I68a54640a6957j2336
17979b9293j44869F1179b8402c134B46138o486K3858A09446H144a67009g58k3722
17967b4480A60709c24615K3085C52716A45708m2091m115d1819k5034j45198C87223
17955a74136C1489a80288I2252l184K2227J40439a61454h194E0514b58300j1847
$$ y = [448751, -189037, 14234, 41103, -284754, -166570, -134922, -90719, 44561, 16768, -426420, -349487, 68804, 38213, -15329, -299990, 106521, -126156, -273208, 12841, 415524, -204978, -9350, 1740, 21195, 54847, -157640, 101954, -146958, -345816, 159807, -7721, -441038, 179734, 307718, 273255, -51353, -79576, -208577, -280431, 198152, 217251, 271067, -52312, -148334, 15139, 244577, -76658, -99099, 17542, -388430, -5978, -227915, 109505, 968, -154640, -16957, -29293, -174162, 61179, -28402, -3134, 246138, 239652, 263510, 109446, 8144, -167009, -758, -24480, 160709, -324615, -301530, 352716, 145708, 103617, 99502, -41819, -66853, -212051, 387223, -174136, 31489, -180288, 92252, 89068, 111295, 251734, -161454, -8194, 50514, -258300, -270147]
17944b70147B92178I8048e1257O144k02865k2332C17785a5355E232a5613A35367
17932H9281c51765b1346A40902m763j002a5087o1179j93373A38753b1107G1473
17920A99528j0775L4205N2571I3807e2511B13254P8838d58114G1819J92968a02854
17908A10476e6999q4996d4610o3432A07044a48815f0995D2500K20886j10375a10813
17896A9520J43859j4036K7870B590J00075E1176b21473c7119C25425A40215a26645
17884c4665j19445H9444J48373H4173l3418b74667H6083K08881I5191D2221J31442
17873A73663d79949J72446C5141R5893b5777C09074A12442n4183h1783C3050b76643
17861A43314a95283d9501I8950L0090J32049L5126H3810a7282H1652J32148a46358
$$ y = [-270147, 292178, 98048, -51257, -45113, -247978, -270310, 317785, -15355, 5232, -15613, 135367, 89281, -351765, -21346, 140902, 136139, 135137, -15087, -76266, -269639, 138753, -21107, 71473, 199528, 188753, 222958, 275529, 93807, -52511, 213254, 292092, -458114, 71819, 264787, -102854, 110476, -56999, -141995, -44610, -108042, 107044, -148815, -60995, 42500, 263386, 153011, -110813, 19520, 163379, 149343, 177213, 2590, 102665, 51176, -221473, -37119, 325425, 140215, -126645, -34665, -154110, 89444, 237817, 84173, 50755, -274667, 86083, 294964, 95191, 42221, 173663, -479949, -307503, 35141, 131034, -25777, 309074, 112442, 58259, -81783, 33050, -276643, 143314, -195283, -49501, 98950, 129040, 261089, 296215, 83810, -17282, 81652, 213800, -146358]
17849i4831A09068L9697J68711a26004B34974d95752J61614a17731H8987J00667
17839A89654j7671b29028B3018b27368b0921C6468h1980A31176n9217j1592a89904
17827b7211B59396H3689K43282j33118m0754f251j57321E336a33199L1238B30053
17815G695c8268C53668E0118J46659k0109a759j12011r9270i6885j8000j43285
17804b58170A09822c494E796I56N1062K11376j08010o2824Q4908B1163i6277b4090
17791B119M1346a10913o1282B27262k0495e5948G5851M09786A27899N902B3679
17779a40460c3843B28429q5249f5427A21833a39672J7169q6303M5733A57815P6003
17768B33818f7684B31111H1857e77218B60051H5023J52411a81005Q4175C19087
$$ y = [-94831, 109068, 148765, 317476, -126004, 234974, -495752, -334138, -117731, 88987, 189654, 171983, -229028, 23018, -227368, -20921, 36468, -81980, 131176, 71959, 60367, -189904, -27211, 259396, 83689, 326971, 193853, 153099, -6251, -163572, 5336, -133199, -101961, 230053, 7695, -38268, 353668, 50118, 196777, 176668, -1759, -113770, -213040, -96885, -114885, -258170, 109822, -3494, 5796, 956, 52018, 263394, 155384, 92560, 177468, 21163, -96277, -24090, 2119, 43465, -110913, -172195, 227262, 206767, -55948, 75851, 485637, 127899, 133801, 23679, -140460, -33843, 228429, 143180, -65427, 121833, -139672, -122503, -208806, -163073, 157815, 233818, -67684, 231111, 81857, -577218, 260051, 85023, 237434, -181005, -96830, 319087]
17757d848A03419J8938L8816L6069B4331J36341a60636g4035L5972B07583D2272
17745a58496C1783K1294J16070g7088B37632A10524a96830B00245i4327B06723
17734B60269j24857J70973E2945R6440b34494a2897B1661K12887m3557E7021N5778
17723A12799d8870A66990k1961M8552L3705h1080a3409j76884c5863A41629d153
17711a80188e4567Q69B23991C7527c9142A51575n5810L9256h2869O639H786M7894
17699E6680a61081M9135A40540E4853K2345K92568p5829N6847A4847b7460G3101
17687C56959r9776G8178K0270L40488a80416d7518F7508k6679J15339J52076F963
17675B74228A22428B3148R3884J98649b45750A05575J10548c68252A06595C4943
$$ y = [-4848, 103419, 122357, 161173, 197242, 24331, 160672, -160636, -74035, -38063, 207583, 42272, -158496, 31783, 53077, 169147, -77088, 237632, 110524, -196830, 200245, -94327, 206723, 260269, 135412, 306385, 52945, 149385, -234494, -12897, 21661, 234548, 190991, 57021, 112799, -48870, 166990, 145029, 193581, 227286, -81080, -13409, -190293, -35863, 141629, -4153, -180188, -54567, -53698, 223991, 37527, -39142, 151575, 95765, 135021, -82869, -76230, 8786, 56680, -161081, -111946, 140540, 54853, 77198, 369766, 293937, 350784, 14847, -27460, 73101, 356959, 257183, 78178, 98448, 438936, -180416, -47518, 67508, 40829, 156168, 308244, 6963, 274228, 122428, 23148, 117032, 315681, -245750, 105575, 216123, -368252, 106595, 34943]
17664c5509F5123B4229K40958j28051k2860O2735j8000n0182J41567L5965n6224
17653B30137a95760A59473G7416e2963i473j0111D8407K05324i1790B52236b38931
17641A36430a49182C5933b5735E98b90171C02039a07883E2096i2213D2301K5883
17630F8184K27085A25089n6988O6963a7265A72852J4410d077E33253k47637b67488
17618b364j87389B10034E2725c0039A69118p8992J3942J12241H0688K78957a1255
17606A51914E6874M7006E0622J36487b3756A6889Q9727a83732M8560K3033A18752
17594F0441J10042F2752b4804E4761J33281J47355A18764R4876J5288l4863P7048
17583B71113I0345L04667j18078C6995I544J92816F8543K30261G808J95343D4783
$$ y = [-35509, 65123, 24229, 265187, 137136, 114276, 177011, 159011, 108829, 250396, 286361, 230137, -195760, 159473, 77416, -52963, -9473, -19584, 48407, 253731, -91790, 252236, -238931, 136430, -149182, 35933, -25735, 598, -290171, 302039, -107883, 52096, -92213, 42301, 68184, 295269, 125089, 68101, 135064, -17265, 172852, 187262, -4077, 533253, 285616, -267488, -2364, -189753, 210034, 52725, -30039, 169118, 90126, 104068, 216309, 80688, 359645, -11255, 151914, 56874, 103880, 50622, 187109, -23756, 16889, 106616, -183732, -135172, -112139, 118752, 60441, 170483, 62752, -24804, 54761, 188042, 335397, 118764, 213640, 228928, 194065, 271113, 90345, 395012, 276934, 36995, 9544, 202360, 68543, 298804, 7808, 203151, 44783]
17571H0813N7883J22625H3984J24533O3765n9010q8780a3170B72820H8054J17252
17560B05306M0599d9181A76991b8248F0213Q2485F8711N5880L68698F0732f2221
17548A76949o6515a10664B74052L11099D6985J66634L21458F050L19734A37992
17537a06370G8239L15603q6975k6048J80164k8316k14007K3341R1766J02031M4212
17526D80010M10913j55710J48225M24264l45982C54022J25428J10223j71076q8763
17516C29834L4702K89453l26363I5127M11010N4439O45369l53525J13920J0459
17506I76799m44743J10619o4518B56606G7280L35544J2782j47866a855C39999
17495C42206I2323k893J7549J98296K39200F8117L64050m6331A89056J67265A15367
$$ y = [80813, 138696, 261321, 83984, 208517, 272282, 213272, 124492, -13170, 272820, 88054, 205306, 245905, -49181, 176991, -28248, 60213, 142698, 68711, 124591, 493289, 60732, -62221, 176949, 110434, -110664, 274052, 585151, 46985, 213619, 535077, 6050, 325784, 137992, -106370, 78239, 393842, 306867, 280819, 460983, 432667, 218660, 242001, 333767, 435798, 480010, 890923, 735213, 883438, 1307702, 961720, 354022, 479450, 589673, 418597, 329834, 364536, 653989, 327626, 95127, 506137, 560576, 1205945, 852420, 966340, 976799, 532056, 642675, 578157, 256606, 77280, 412824, 425606, 277740, -1855, 339999, 342206, 92323, 89430, 106979, 305275, 544475, 68117, 432167, 385836, 189056, 356321, 115367]
17483C68404J52893A10835L72752f861A61266N51600A22263J22294M03710B18713
17472A10197j4957K71086j79349P8990j01978J98840j09370j8042c0967D83325
17461A94578E784L91815F2087J50664J25220J1233p2788o952J50065m5743J13961
17450D87747B14832N1232J58806j06785M6696I1470K34943K48654k17932N4022
17440D11157O3766P4009q3179k09748J08391J82468I0032J78318N5526L087K6812
17429C53775J39519B03519N3399p3711F0742J67913L21934J20661B84554J88492
17419D73046A41490N1268P0160b3267D36027K01048A86499K55441g3766D39008
17408C66582E2679K09033j07252l2646M1410r619K19376B1694h6814D53626j39574
$$ y = [368404, 521297, 110835, 483587, -6861, 161266, 712866, 122263, 244557, 648267, 218713, 110197, 95240, 366326, 186977, 265967, 163989, 362829, 253459, 235417, -30967, 483325, 194578, 5784, 397599, 62087, 212751, 337971, 349204, 276416, 269464, 419529, 373786, 487747, 214832, 266064, 424870, 318085, 364781, 91470, 326413, 575067, 357135, 411157, 474923, 548932, 465753, 256005, 364396, 546864, 90032, 268350, 323876, 326963, 353775, 493294, 203519, 256918, 183207, 60742, 228655, 550589, 671250, 284554, 473046, 141490, 192758, 262918, -23267, 436027, 637075, 186499, 441940, -73766, 439008, 366582, 52679, 261712, 154460, 121814, 163224, 153605, 372981, 21694, -86814, 453626, 314052]
17397C14052I9592J5050N3135J04353R6898H6796P4831J80232r8290Q5378B9050
17385C81699A64331J63032A26503J40537A19057J84513J26337G2480L62169k16616
17375B18033J22748Q2450l2951k9584P1690j78850J39521j76637K09942k03520
17365B22842K87327j40104K149A28964L42572n2039j57436J04251p0867J89362
17355D84807o5874j31936n2564C96O5250c9533D04222K30326B86397G7628J92509
17344B70137j5309L31064A41607N5263r1335L00182r3988A01036J31646L6Q900
17333B41618o2035K73272o9424n1856J43057B11035K65241n7412j62534K13250
17323D69580j57618J9885k733l1301J82584B23844K30154j68242j31207l2229
$$ y = [314052, 99592, 114642, 167777, 272130, 369028, 86796, 161627, 341859, 243569, 328947, 29050, 381699, 164331, 327363, 126503, 267040, 119057, 303570, 429907, 72480, 434649, 218033, 340781, 423231, 390280, 360696, 432386, 253536, 393057, 216420, 426362, 222842, 510169, 370065, 372214, 128964, 471536, 419497, 262061, 366312, 295445, 484807, 418933, 286997, 234433, 396, 65646, -39533, 404222, 634548, 286397, 77628, 270137, 254828, 585892, 141607, 196870, 105535, 405717, 311729, 101036, 232682, 232718, 241618, 179583, 452855, 383431, 331575, 474632, 211035, 476276, 418864, 256330, 469580, 311962, 331847, 329114, 297813, 480397, 223844, 453998, 285756, 154549, 122320]
17313A22320E9855Q4728M0620J17963I2621J74284j02032l4335K64598e0947C58970
17301C92135j20985q9096K51652l568A19538K64724j57375a15066B19380A8892
17290D6936R2819L00023j52721H3131L34970C427K75478F638M25776F0327K90733
17279C51060J06505M2311n514q0824r7397n4502n0272F7362L49109r3399l4339
17268B88733J17815j18973J96528k40458k7182Q9363j45747M55918a04659G1611
17257A47003K88908k02499o8638L65110l7637B44006D9786K04207K03707J10845
17247E68545j4325j14347A03824M25907j38547j24211J09671P4419B16369J94565
17237D10934K8018J62099k90397J16065A96497O35384l70113j88935R6135r1158
$$ y = [122320, 59855, 144583, 185203, 303166, 92621, 266905, 164873, 130538, 395136, -50947, 358970, 392135, 271150, 182054, 433706, 430138, 119538, 384262, 226887, -115066, 219380, 18892, 46936, 139755, 439778, 287057, 83131, 418101, 3427, 278905, 6638, 432414, 60327, 351060, 457565, 499876, 494362, 413538, 316141, 261639, 211367, 67362, 416471, 323072, 288733, 406548, 287575, 484103, 243645, 216463, 305826, 160079, 615997, -104659, 71611, 147003, 435911, 233412, 164774, 529884, 492247, 244006, 49786, 253993, 457700, 568545, 554220, 439873, 103824, 529731, 391184, 266973, 376644, 451063, 216369, 410934, 438952, 601051, 310654, 426719, 196497, 831881, 461768, 272833, 368968, 277810]
17227B77810J55589l4923L518A72301d2878C86887b5651A83981L34176j03484
17217D14673Q7340q7455A53481K19324J08097Q8788A83768J54291J59975K19969
17207G18003K7966A24554M45196j93954L9581k391j5746G8036c0137D28663j52067
17196B76596k9536K73142J14683k97173L74421j87565B40312o308K35247P0715
17186E39966k32629r486K82161O373j14454M9017j8039K45853B32742J26352N4706
17175D13800J34231j8454j88669K66093R1868l05959K01467N0980k95654k7232
17165C22471J17183P9151K92002l30432o0799N28851D50173M6351L3838o8744
17155D61618k2229P4636L7502m130K01560k60908K23100k97965K5816J83172B76599
$$ y = [277810, 433399, 398476, 401994, 172301, -42878, 386887, -25651, 183981, 518157, 414673, 502013, 414558, 153481, 372805, 480902, 569690, 183768, 338059, 498034, 718003, 745969, 124554, 569750, 375796, 415377, 412986, 397240, 78036, -30137, 428663, 276596, 247060, 520202, 634885, 337712, 712133, 524568, 240312, 234004, 469251, 539966, 307337, 297851, 580012, 586385, 471931, 520948, 502909, 748762, 232742, 359094, 413800, 548031, 529577, 340908, 607001, 698869, 392910, 594377, 645357, 349703, 322471, 439654, 518805, 810807, 480375, 419576, 948427, 450173, 496524, 530362, 461618, 439389, 514025, 551527, 547397, 748957, 488049, 711149, 413184, 439000, 622172, 276599]
17143E96487j31013K2889m0724k01315L50595j21527K80908j42511m0319j30639
17133D42831A62013L13427J530J20417J8899K5818j64593K02945j06437B81190
17122F42634J02509k23382q7049J57823K6508B01503O66312j94689j45937j14344
17112D12845M19837n2478m9425J09740l70040K25201J29972l31582L37038k61420
17102E69688J81402J3367K5079j47703n8629P0574J43894l6822k1291L06055j15057
17091I30557q5075k11828l8856M9900p8362Q2238o2489M29908D56097J76123j4469
17080F17751J6645j51663K75603j12408C02145L47579N0020J85501q8834o8980
17070G27431M7864m1422o8891N35574l59758k43707M94315n08784k04629L93208
$$ y = [596487, 465474, 488363, 447639, 246324, 596919, 475392, 756300, 613789, 573470, 442831, 162013, 475440, 476970, 597387, 616286, 642104, 477511, 680456, 574019, 281190, 642634, 745143, 521761, 434712, 592535, 619043, 201503, 867815, 673126, 527189, 412845, 832682, 780204, 730779, 840519, 470479, 695680, 825652, 494070, 831108, 569688, 751090, 764457, 789536, 641833, 583204, 653778, 797672, 760850, 739559, 1045614, 930557, 845482, 633654, 594798, 644698, 566336, 648574, 586085, 1015993, 456097, 632220, 617751, 634396, 482733, 758336, 645928, 302145, 649724, 699744, 885245, 796411, 727431, 775295, 733873, 664982, 1200556, 840798, 597091, 1091406, 582622, 377993, 771201]
17060G71201J56582l38990N86381l48477N9355J35532j31681J6430J17237M0508
17050A064078n11893P15343l4764k57201J71840j85690k83934L26510j55923N6112
17040I04478J59123J52780l16671j9341K30485o9169j19043j27404K85516l30384
17030G50370N5920J39769O1922R636J94888m29181P8754J19727J10428R149q2051
17019A019331k18002J89002j49934J60706M6373K00010j87159N7535j23801N842
17009I99903R9245m2185P5542K77508k32350l6128K79526K3488m58719R2944L4155
16998A112929K98896j78533j26692M6392l2278J92438k26261M14089k27918J37563
16988A410625N9122O8840p1542o9931O0711j0041R0733j27006L7170j88199M16941
$$ y = [771201, 927783, 588793, 1175174, 826697, 886052, 1021584, 889903, 906333, 1023570, 1064078, 552185, 1267528, 1232764, 975563, 1147403, 961713, 677779, 1004289, 848366, 904478, 1063601, 1216381, 899710, 880369, 1110854, 1041685, 922642, 795238, 1080754, 750370, 806290, 946059, 1007981, 1017617, 1212505, 783324, 862078, 981805, 1092233, 1101382, 1019331, 801329, 990331, 840397, 1001103, 1047476, 1247486, 1060327, 1117862, 994061, 999903, 1099148, 1056963, 1132505, 1410013, 1177663, 1141535, 1421061, 1444549, 985830, 1078774, 1112929, 1411825, 1233292, 1106600, 1152992, 1120714, 1313152, 1086891, 1500980, 1273062, 1410625, 1469747, 1538587, 1467045, 1397114, 1457825, 1447784, 1538517, 1411511, 1448681, 1260482, 1677423]
16977A677423K54610p20978M45196l35976K06972m5019K01871n85018N91686L85887
16967B076654m57127k05151P0247L5995j34241L49263j35550j22983J59298O1624
16957A698029j76234M01782m07934K36358j86418L59711J13269m80315J32785
16948A691033K46215j20114K45942m323m05252Q8888m2991Q4386J79854J83098
16938B146736O5127j17326n19062L23135L16218q4628M9024L1568j73317K24029
16928B261504r0892L27544M6603l16005o5846J73355m016L7468j73263K24404
16918B420856K3189l16398L71796J48929k85328J78415K9863p4515j44463J58849
16908B511193l0744N98937l25836P3996N4379R74n3884K0103K9840K36144k49759
$$ y = [1677423, 1932033, 1211055, 1656251, 1320275, 1527247, 1482228, 1684099, 1099081, 1690767, 2076654, 1619527, 1414376, 1484623, 1520618, 1386377, 1735640, 1600090, 1477107, 1636405, 1698029, 1521795, 1923577, 1515643, 1752001, 1565583, 1925294, 2038563, 1558248, 1691033, 1937248, 1817134, 2063076, 2058753, 1653501, 1742389, 1699398, 1783784, 1963638, 2146736, 2211863, 2094537, 1575475, 1898610, 2214828, 2130200, 2179224, 2210792, 2037475, 2261504, 2170612, 2498156, 2544759, 2228754, 2162908, 2336263, 2332247, 2369715, 2196452, 2420856, 2444045, 2127647, 2499443, 2648372, 2363044, 2541459, 2571322, 2496807, 2352344, 2511193, 2480449, 3079386, 2753550, 2827546, 2881925, 2882899, 2829015, 2849118, 2878958, 3115102, 2865343]
16897B865343m4427K59303J35182m344R1052j5542K34506O1865m81488J26312
16887C227762L35078Q1229P6608m0982p7858K4686K06829P8069j42992K92510
16877D060939m68573P00541k85928j17862J29585l8842L14832j61763j94886J60636
16867D098679L56620K49055l00478J23777k18597K24916O14786m75580J25483
16858D798661M59550m39378K57296J0143P2939Q40313o86141q0572N46228l65062
16848E413977K95490L62678O6903m47466L03116J7809K22871L01307Q6873m23476
16838F200082Q05826j44158L44371j54135J67361k38829M83494p1862K16349O1263
16828G669762M5122K20328N13030j60978K19631K92092J35180m7323M49998K8592
$$ y = [2865343, 2820916, 3080219, 3215401, 3211057, 3302109, 3286567, 3521073, 3582938, 3101450, 3227762, 3562840, 3644069, 3720677, 3679695, 3601837, 3626523, 3833352, 3911421, 3768429, 4060939, 3592366, 4292907, 4006979, 3889117, 4018702, 3979860, 4294692, 4132929, 3938043, 4098679, 4455299, 4704354, 4403876, 4527653, 4309056, 4533972, 5148758, 4673178, 4798661, 5258211, 4818833, 5076129, 5086272, 5159211, 5999524, 5313383, 5232811, 5779039, 5413977, 5709467, 6072145, 6139048, 5691582, 5994698, 6012507, 6235378, 6536685, 6623558, 6200082, 7005908, 6861750, 7206121, 7051986, 7219347, 6980518, 7464012, 7392150, 7608499, 7669762, 7714884, 7935212, 8448242, 8287264, 8506895, 8798987, 8934167, 8886844, 9336842, 9365434]
16818I365434J80117j951N75793o9921J99618M17380K91329Q2662L93338n3735
16808A1380064M70200L31933k3438L29886L11653L72163J67628n7900O19619L24461
16798A4226269J87595O66640j47378N09498N31392K42628M31147M75402N88137
16789A7711330K23218R58734M51684K77331N77819L03095O74777R0905Q61570
16780B2130463M54507R64667R27060O22700Q27770L55101P65908R60137J088702
16771B9097015Q00986N69893J406979R96719J110018P59632J202352J288562J390829
16762C8622985J332283R85311J577860J616071J371080J660756J402135J983525
16754E0552006J966719J600467K189231K040827K084889J953494K268260K257329
$$ y = [9365434, 9545551, 9543600, 10119393, 10049472, 10249090, 10666470, 10957799, 11040461, 11433799, 11380064, 11850264, 12182197, 12158759, 12488645, 12800298, 13172461, 13340089, 13282189, 13901808, 14226269, 14413864, 15080504, 14933126, 15442624, 15974016, 16216644, 16647791, 17123193, 17711330, 17934548, 18893282, 19344966, 19622297, 20200116, 20503211, 21177988, 21268893, 22130463, 22584970, 23549637, 24476697, 25099397, 25927167, 26282268, 27048176, 28008313, 29097015, 29898001, 30467894, 31874873, 32871592, 33981610, 34741242, 35943594, 37232156, 38622985, 39955268, 40940579, 42518439, 44134510, 45505590, 47166346, 48568481, 50552006, 52518725, 54119192, 56308423, 58349250, 60434139, 62387633, 64655893, 66913222]
16746F6913222K444322K697314K294875K819083K300758K650299K720064K882626
16738H7722563L106988K375042K659585L083427K275407K677531K244346J926850
16730A08071739K744639J445236J843658J486201J564815Q24098P54769M27177
16722A19162332Q8295j39815p90588o19336r71232j093539j368443k062944k199350
16713A10005380k137490k310921k054114k953144k273785l172198k563297k818392
16705H9722039k784503k829713k632986l053929k523257k642283k463250k380078
16697F8412040k434022k297996j910123k689020j820033k102311j976016j895749
16689E1286770j727938j774236j690430j346805j756555j646567j440483r64895
$$ y = [66913222, 69357544, 72054858, 74349733, 77168816, 79469574, 82119873, 84839937, 87722563, 90829551, 93204593, 95864178, 98947605, 101223012, 103900543, 106144889, 108071739, 110816378, 112261614, 114105272, 115591473, 117156288, 117980386, 118735155, 119162332, 119250627, 119110812, 118320224, 117700888, 116729656, 115636117, 114267674, 112204730, 110005380, 107867890, 105556969, 103502855, 100549711, 98275926, 95103728, 92540431, 89722039, 86937536, 84107823, 81474837, 78420908, 75897651, 73255368, 70792118, 68412040, 65978018, 63680022, 61769899, 59080879, 57260846, 55158535, 53182519, 51286770, 49558832, 47784596, 46094166, 44747361, 42990806, 41344239, 39903756, 38938861]
16681C8938861j379451j151144j354520j325131j058627r10105j007814j218342
16673B9533727m72710n23807j219984o50583j156058n56347r03542p15654m72789
16664B2862253m74862p89542n16615m98021p32091k81924p33883m43681r44034
16655A7447600K82966q42043m43780j40035o61592n71592j64056m93238j40012
16646A4274218n37491j62360k63126j2371p04140O9955m57110m75048k90569J45523
16636A1587481k61652k54510l30550l12674j15028m3424n33782n3482N5650n97892
16626I140137j15862j36568l57141P9535l01874j23972j25026O4153l41116o9876
16616G712390J19400j99809p6903o00976K39934m96608j11462J29455r9281J14790
$$ y = [38938861, 37559410, 36408266, 35053746, 33728615, 32669988, 31759883, 30752069, 29533727, 29061017, 28537210, 27317226, 26666643, 25510585, 24954238, 24050696, 23335042, 22862253, 22387391, 21597849, 21081234, 20583213, 19851122, 19569198, 18835315, 18391634, 17447600, 17730566, 16888523, 16444743, 16304708, 15643116, 15071524, 14907468, 14414230, 14274218, 13736727, 13574367, 13311241, 13298870, 12594730, 12664685, 12207575, 11732527, 11441958, 11587481, 11325829, 11071319, 10740769, 10428095, 10313067, 10269643, 9735861, 9682379, 9738029, 9140137, 9024275, 8887707, 8530566, 8610101, 8308227, 8184255, 8059229, 8123382, 7782266, 7712390, 7831790, 7631981, 7555078, 6954102, 7194036, 6697428, 6585966, 6715421, 6616140, 6730930]
16606F730930k22724j62241l93062L20283m90472j58390J86665j83742K77397
16597E904644k44198p2884k41739J35939l03135m7535K60707l53186j96880k15265
16587D626468J74342q4124m73959k3590L37121k78700J12023O056K6450l27100
16577D094987q4260j8832n3655N25565l58002m50775K03772J14606r3544l43281
16567C536581j40283M66858n02308L15047k94073R2550k99868L76650r8736k39155
16557C213263J44567k70655R2646q5375R8103k14763L2856l2817O9754L3757l12745
16546B768591K6750J17709r6630J93263j89409m64062Q0466Q7202J01464J7815
16536B643159k12745k30281N26268j40283k91281J60308J4591j6794L1L1967l15285
$$ y = [6730930, 6508206, 6345965, 5952903, 6273186, 5782714, 5624324, 5810989, 5627247, 5904644, 5660446, 5587562, 5345823, 5481762, 5178627, 5131092, 5391799, 5038613, 4841733, 4626468, 4800810, 4716686, 4242727, 4219137, 4556258, 4277558, 4389581, 4395637, 4422087, 4094987, 4010727, 3991895, 3938240, 4463805, 4105803, 3655028, 3858800, 3973406, 3879862, 3536581, 3396298, 3863156, 3360848, 3675895, 3381822, 3474372, 3174504, 3551154, 3452418, 3213263, 3357830, 3087175, 3179821, 3094446, 3192549, 2977786, 3010642, 2977825, 3047579, 3081336, 2768591, 2795341, 2913050, 2816420, 3009683, 2820274, 2356212, 2436678, 2523880, 2625344, 2643159, 2430414, 2200133, 2726401, 2586118, 2294837, 2455145, 2469736, 2452942, 2452973, 2484940, 2169655]
16525B169655K43571j68286k74240P25278o80240P672j8636J25866J89756l95757
16515A924639k23885L04204P7795m00041M41639k06461L29812m10868J74326O0462
16505B071622k25069o3746j24633K27757J31245N8625l189k19722j10170q217
16495A734503O3611n6182q1805J6287o0442j21855J82870J80390l82300j09909
16485A365168N4539r8600M44229l52424j32313J53612M0554l5947J77877j91543
16475A425152K1586j44246N1670l4345K94241j03369L9061J12427j25407n9977
16465A476793j85336K99626k34138l4420J14181j73400M8963p6385J01030j08261
16455A228653j47046L44933k75883K14153j08930j52441L2004K03658m22849K75739
$$ y = [2169655, 2413226, 2244940, 1970700, 2695978, 2015738, 2023410, 2004774, 2130640, 2320396, 1924639, 1700754, 2004958, 2082753, 1682712, 2124351, 1917890, 2247702, 1836834, 2011160, 2071622, 1846553, 1782807, 1658174, 1885931, 2017176, 2075801, 2072612, 1852890, 1742720, 1734503, 1798114, 1741932, 1660127, 1676414, 1615972, 1494117, 1676987, 1857377, 1475077, 1365168, 1419707, 1321107, 1765336, 1412912, 1280599, 1434211, 1474765, 1438818, 1616695, 1425152, 1446738, 1302492, 1354162, 1319817, 1614058, 1510689, 1549750, 1662177, 1536770, 1476793, 1291457, 1591083, 1356945, 1322525, 1436706, 1263306, 1312269, 1235884, 1336914, 1228653, 1081607, 1426540, 1150657, 1364810, 1255880, 1103439, 1135443, 1339101, 916252, 1191991]
16445A191991J08164J34945n16292J67757J09075J68637K6569j3212k02490j10897
16435A064247j89428j02963J62481K37012j35126O2775j4230l6538J44914L9936
16425A233080k75586R5842J91124m08191N3488l9901J02546D20190L43309N2753
16415H16252j35320N46585l91182k11414L69731J92087r9717m03597K44093n8490
16405H69028j80845M69943R9678n41249L02261Q2561l30866K62326j94168j36924
16395G01745r4216L32473l15913K5336J0490l7102L02908l00755o8086K82293
16385H39173k2669j10654K37256l72756J96536l2305j10166J92808R6412m19323
16375D94312L02140j96667J40235m2796K6128m4806j42658J78129C13031M40930
$$ y = [1191991, 1300155, 1435100, 918808, 1086565, 1195640, 1364277, 1390846, 1377634, 1175144, 1064247, 874819, 771856, 934337, 1171349, 1036223, 1098998, 1084768, 1048230, 1193144, 1233080, 957494, 1053336, 1244460, 836269, 889757, 849856, 952402, 420190, 763499, 816252, 680932, 1227517, 836335, 624921, 994652, 1186739, 1087022, 683425, 927518, 869028, 688183, 1158126, 1257804, 716555, 1018816, 1101377, 770511, 1032837, 838669, 701745, 607529, 940002, 624089, 649425, 659915, 622813, 925721, 624966, 556880, 839173, 816504, 705850, 943106, 570350, 766886, 734581, 624415, 817223, 913635, 494312, 796452, 599785, 740020, 697224, 723352, 678546, 535888, 714017, 313031, 753961]
16365G53961K4490m8188Q3547l43360j19921K89576Q772J10395Q4253l7889k20797
16354E84839p5905J46164m2403J35790k30693j65184L54116J84357m24579K00581
16344F67083j02985K03007k04036M31834D46640K53845r6941j46720M61249k84132
16334F33941Q0488k43009k7658j80464L31123N3120K56278D35613j9804J95413
16324F11222j10795J44038j64411K74473B30238J03900O184N8137K19667k20303
16314C97823L59139l06650j63118J93869P7082j75325M74338B23202M72847B91436
16303B59764L11357B76938m0166J02962L12572B87606P6393j53093K80206j833
16293D89279j71588M47303C20212q8243L82687r5905l9513J18576B69648D4697
$$ y = [753961, 778451, 730263, 813810, 470450, 350529, 640105, 648877, 759272, 843525, 805636, 584839, 508934, 655098, 612695, 748485, 517792, 352608, 706724, 891081, 466502, 667083, 564098, 767105, 563069, 994903, 446640, 700485, 603544, 456824, 918073, 633941, 714429, 471420, 443762, 263298, 594421, 647541, 903819, 435613, 415809, 611222, 500427, 644465, 480054, 754527, 230238, 334138, 340322, 398459, 618126, 397823, 756962, 450312, 287194, 481063, 558145, 382820, 857158, 223202, 696049, 291436, 259764, 571121, 276938, 236772, 339734, 652306, 287606, 363999, 210906, 491112, 489279, 317691, 764994, 320212, 231969, 614656, 518751, 479238, 597814, 269648, 44697]
16282C24082j40447L21770A15948J99660K58702j68210L54823k02647B25450p8873
16272A46577L45307B32299L46147K86259k89487j13653j15579q3340J16471J61889
16262E41006A99881O2636J00792K16087j23807K94931F0478K27640L91117j9732
16252F59503C8644L80183J84727j97941m2739p5335E661L88813K04003A12146
16241A44779K13517J72349B00047L89502j72227j44994o5727L40425j81300p3316
16231B92410q1661K69732A90281L43845K331j66489q885P68A62087M03316j06945
16220D58458j90746J80869r7348M1568j9982A50100J94570r3621P8906a4483A88412
16208D80958A80554l2997K33848K577R02A28371K59958K62611j68031o5203a9230
$$ y = [324082, 183635, 505405, 115948, 315608, 574310, 406100, 760923, 558276, 225450, 146577, 491884, 232299, 578446, 864705, 575218, 461565, 345986, 262646, 379117, 541006, 199881, 262517, 363309, 579396, 455589, 750520, 60478, 288118, 679235, 659503, 38644, 418827, 603554, 405613, 362874, 287539, 5661, 394474, 598477, 112146, 144779, 358296, 530645, 200047, 589549, 417322, 272328, 206601, 547026, 365726, 292410, 210749, 480481, 190281, 534126, 536457, 369968, 361083, 361851, 162087, 565403, 458458, 267712, 448581, 351233, 392801, 372819, 150100, 344670, 251049, 329955, -14483, 188412, 480958, 180554, 147557, 381405, 383982, 384884, 128371, 388329, 650940, 482909, 417706, -19230]
16196E3061P5160a56314C81808M4693l1028e2456A05048l7324K11405J23373D3160
16184A18382m0860J65610q2074a4515H3352K67044j02999a2344D06598A30617
16173I1864N26299c0766E08283N3224A08515e3020A11573c0071C01097G8918J67
16162G9085A6206J3603R2870K84049e3639B54322L3526j7043k9213p8524J44194
16151C07262L8613p9268f332A59966K72065b2317B01933I3368K69374A73496m1340
16140A32156B3410K9506J97098m9318q4455a06399A72048J21699d373I6646C6264
16128B54523A14621b96419C8298K62678K6967B8505J17832P0154N2692L3316b09344
16116A45698L17663E1513a95121A38756h7157B46620O0301A7081J43695K22950
$$ y = [53061, 128221, -156314, 381808, 426501, 395473, -52456, 105048, 67724, 279129, 402502, 43160, 118382, 77522, 243132, 161058, -14515, 83352, 350396, 247397, -12344, 406598, 130617, 91864, 618163, -30766, 508283, 561507, 108515, -53020, 111573, -30071, 301097, 78918, 79085, 16206, 29809, 122679, 406728, -53639, 254322, 287848, 270805, 241592, 163068, 307262, 345875, 266607, -6332, 159966, 432031, -22317, 201933, 93368, 362742, 173496, 132156, 23410, 52916, 250014, 200696, 116241, -106399, 172048, 293747, -4373, 96646, 36264, 254523, 114621, -296419, 38298, 300976, 327943, 28505, 146337, 216491, 269183, 302499, -209344, 145698, 463361, 51513, -195121, 138756, -87157, 246620, 306921, 17081, 160776, 383726]
16106C83726A1584J54885k9256E9452Q2640o5024K24611A36553j1827j773J25433
16095B48386b08550F3295J06120f3806B45671p5178M114c4295F7314K19858I9245
16083B13003J90448A70978a59458A24594C3852G277b22698b3622l570A96906P6473
16072B73379A23080K7169J97627a23440E1458J51393d7214G1928P779c9148C11873
16060a3277B78063G9718J48299N3355Q8874e1413o1907I8643e9566n7088I778
16048b72009B68730j00017p5510a02580B32693L5844l2523a60243A12013A6578
16037A50629A6896f3525A22587J34511b8309B03539b12719h8047D08570H6831
16026a01191C03122I1245l2763N518M6686K00165j07908i094k6518j44925a6104
$$ y = [383726, 11584, 166469, 137213, 59452, 142092, 77068, 301679, 136553, 124726, 122953, 248386, -208550, 63295, 169415, -63806, 245671, 170493, 174607, -34295, 67314, 287172, 99245, 213003, 403451, 170978, -159458, 124594, 33852, 7277, -222698, -23622, -27192, 196906, 273379, 123080, 150249, 347876, -123440, 51458, 202851, -47214, 71928, 79707, -39148, 311873, -13277, 278063, 79718, 228017, 281372, 370246, -51413, -113320, 98643, -59566, -116654, 9778, -272009, 268730, 168713, 93203, -102580, 232693, 268537, 236014, -160243, 112013, 16578, 150629, 16896, -63525, 122587, 257098, -28309, 203539, -212719, -88047, 408570, 86831, -101191, 303122, 91245, 58482, 64000, 110686, 310851, 202943, -9094, -35612, -180537, -16104]
16014H6140L97776h1089l32035a05407o8833A49396B1303b16442K2917E0041d2204
16002b09575B55573b19240P2278D5501c14272A19690a60908f1377B84332A17104
15991B23367b6538A82195a62377B21805N66227P9335K39251L81770k33548j42892
15981A111948j60395k28465b2574C7695J71704f1592B13718H1935K04213G1077
15970h6663A72877K43502j51674q0668c01325J21159a7755A88665k7226G9176
15959a01798F7638B34J26404B127a87103A34529c49758B63165a49685A77228a6597
15947F0859b11300C97812D7004c9658l1124C78631A56657D1896J0722L5976a74499
15935C5589c36937E1788a9537q6717B91245a48935B35128j16585b52170I9683
$$ y = [86140, 483916, -81089, -413124, -105407, -174240, 149396, 21303, -216442, -193525, 50041, -42204, -209575, 255573, -219240, -146962, 45501, -314272, 119690, -160908, -61377, 284332, 117104, 223367, -26538, 182195, -162377, 221805, 788032, 867367, 1106618, 1488388, 1254840, 1111948, 951553, 723088, -22574, 37695, 209399, -61592, 213718, 81935, 286148, 71077, -86663, 172877, 416379, 264705, 184037, -301325, -180166, -17755, 188665, 161439, 79176, -101798, 67638, 234, 126638, 2127, -187103, 134529, -349758, 263165, -149685, 177228, -16597, 60859, -211300, 397812, 47004, -39658, -70782, 378631, 156657, 41896, 52618, 88594, -174499, 35589, -336937, 51788, -19537, -106254, 291245, -148935, 235128, 118543, -252170, 99683]
15924h7109J29q2830j26507Q9607Q5092B43772r3942f6631B11725C334O752R6155
15912A06241b10402A22483L1978F8267b03657B56223a98314r5772C3058a13035
15901D21242a64562O3924p1486C7141J69811H6060g0757A6221e5225I1730f6842
15889a46194o902K7495p1023d6783q5480l826N5539K9929A33912b42310C35147
15877C3872N3035d14718J38241H7025h1981B856a44049I6687a90136A96782a47935
15865G2807e1819D540J49446a19308k80498A66165N1103M5414a19942F5065N0421
15854A15486l7307a92395h5052C1410a18204L8946G8347O9329d42667A07509F807
15842e7234I8297c99588i0114B76011d8508a5567j81351c0535j18968D3253b90712
$$ y = [-87109, -86980, -169810, -296317, -206710, -121618, 243772, 149830, -66631, 211725, 3334, 10086, 106241, -210402, 122483, 154461, 68267, -203657, 256223, -198314, -294086, 33058, -113035, 421242, -164562, -100638, -172124, 37141, 206952, 86060, -70757, 16221, -55225, 91730, -66842, -146194, -153096, -125601, -196624, -46783, -132263, -136089, -80550, -50621, 133912, -242310, 335147, 33872, 86907, -414718, -276477, 87025, -81981, 2856, -144049, 96687, -190136, 196782, -147935, 72807, -51819, 4540, 153986, -119308, -399806, 166165, 217268, 262682, -119942, 65065, 115486, 78179, -192395, -85052, 31410, -118204, -79258, 78347, 147676, -442667, 107509, 6807, -57234, 98297, -399588, -90114, 276011, -48508, -15567, -196918, -30535, -149503, 43253, -290712]
15830b7272A66795G4571b169k90694C09061e3814j17343J8664A11186M3470c3794
15818b31200A22026L0932J4654a41041A9650a59347A48450f0616O344C0328r660
15807B0668K2294b25162c2640C3083a21905j94731B52491I8522a18991p794j55056
15796b81841A60742g1642C6177b41582d1293G814J57161j1775a3765p4571M2789
15785d5547D7764g5994l6002r0572A02919c2006l1321j06134L1313A92567k0726
15774A71841a73264N4701q0886C9930J20306a98237N8073o6297q4464A28459J55779
15763B84238E0943g432k05369h4275B44834A6430J46857k1881l7365P6412p9672
15752A00781N9c3874C1504b57118P6184A10512C7454N388f1986o133C7363O2851
$$ y = [-27272, 166795, 74571, -2169, -292863, 309061, -53814, -171157, -152493, 111186, 154656, -33794, -231200, 122026, 152958, 167612, -141041, 19650, -159347, 148450, -60616, -54272, 30328, 20668, 42962, -225162, -32640, 33083, -121905, -316636, 252491, 98522, -118991, -126785, -281841, 160742, -71642, 36177, -241582, -41293, 7814, 164975, 153200, -13765, -88336, -45547, 47764, -75994, -111996, -202568, 102919, -32006, -63327, -169461, -138148, 192567, 171841, -173264, -118563, -199449, 39930, 160236, -198237, -140164, -206461, -290925, 128459, 284238, 50943, -7432, -212801, -84275, 244834, 16430, 163287, 141406, 104041, 180453, 100781, 100840, -33874, 31504, -257118, -180934, 110512, 37454, 42842, -61986, -68119, 37363, 100214]
15740A00214b76919e7539k9814b8230j36450G8034J09234B2793B24J38650B0650
15728a33941p2893m602B17358J70119a09945A2146J50236d2845j40854j82171
15718c65870C07472a79361L3998P0466m9199n6287c9107j5850A50313n8156a23756
15706F1333J50594a57257H8933a42932B35072o2166g881r4090l0953A02363b15840
15694a909H7829d0886j07424p9086A22275D6287L21524a60629A45935L6880o8834
15683A13981a99293A87696A2491a74989I9652f0998q2400P644b2833j40497B03692
15671a10066r356C986a48547B7070i57B7606J84541a9703r1193A55612d103j98868
15659b02971C48952h2422L4220k6199j22411c959o14251a03778A06593j9770a1560
$$ y = [100214, -276919, -57539, -87353, -28230, -164680, 78034, 187268, 22793, 224, 138874, 20650, -133941, -206834, -211436, 217358, 387477, -109945, 12146, 162382, -42845, -183699, -365870, 307472, -179361, -145363, -74897, -124096, -180383, -39107, -54957, 150313, 92157, -123756, 61333, 211927, -157257, 88933, -142932, 235072, 172906, -7881, -101971, -132924, 102363, -215840, -1909, 87829, -40886, -148310, -227396, 122275, 46287, 367811, -160629, 145935, 182815, 113981, -199293, 187696, 12491, -174989, 99652, -60998, -143398, -135754, -22833, -163330, 203692, -110066, -119422, 3986, -148547, 27070, -957, 27606, 212147, -19703, -110896, 155612, -4103, -202971, 348952, -82422, -48202, -74401, -196812, -3959, -618210, -103778, 106593, 86823, -11560]
15647B26457j10323a12778G8568f3710A828c04504P8798I0568A0628b1776A12775
15635C13495a52687A29448l5677c55410J62287M0406P2614n876M1675n7296j14702
15624b16302A65382b40836A29690h688j61782c906j80189e4654G514g0628j06917
15613a77545C39627a86274D30177E321O9122a43582B9644M18819G8957a79282
15602C2645K31982M1221A26987e04j42773f9554I3303C531N596a55679F1580B0771
15589a1446n1871k6143J4527I162L18606a79240O5731A16903b8486j26045B34006
15577a98480R5741D3730a85568O6012m59547a26506c0103j66876A88126b2589
15566A00125C3212J72931a6171n7866A41303d1688m3639C86190h4631A055J97171
$$ y = [226457, 116134, -112778, 78568, -63710, 1828, -304504, -225706, 90568, 10628, -21776, 112775, 313495, -152687, 129448, 93771, -355410, -193123, -152717, -80103, -85979, -44304, -101600, -216302, 165382, -240836, 129690, -8688, -170470, -3906, -184095, -54654, 7514, -70628, -177545, 339627, -186274, 430177, 5321, 74443, -143582, 29644, 448463, 78957, -179282, 32645, 264627, 305848, 126987, -504, -143277, -69554, 93303, 3531, 9127, -155679, 61580, 20771, -11446, -63317, -89460, -74933, 9162, 327768, -179240, -113509, 116903, -28486, -154531, 234006, -198480, -102739, 43730, -185568, -119556, -579103, -126506, -30103, -196979, 188126, -22589, 100125, 33212, 206143, -16171, -74037, 141303, -41688, -85327, 386190, -84631, 1055, 198226]
15555A98226d26162a33446n7738Q1257b1236m03381m1287a08772m6880N227J8516
15544a31909A91180b4653D1380a64412j43485A21698J1613n1433b59180c476B26740
15532b75939a04109k58843B12577l2232f4450B35511B7239K48349a88725b2947
15521a59888F6252K589a79162B25182D6659K0252e6225C90980A47423a75532I7078
15509A48754O6358c16868e8890G5419Q2553Q5167d4626C12218H669C323J12624
15498A15947D6302a35291A69539q3811K6545K7102F7180g6931F0938M9459g5931
15486B00408I8883m0058K67781D7687i0528l2408b3117B99099N0872A73538L20761
15475D94299J97594Q979j90873J39682k1996j80728b1522B94951j47181d0754
$$ y = [198226, -426162, -133446, -191184, -109927, -21236, -424617, -465904, -108772, -155652, -150425, -131909, 191180, -24653, 41380, -164412, -307897, 121698, 133311, 81878, -259180, -3476, 226740, -275939, -104109, -362952, 212577, 180345, -64450, 235511, 27239, 275588, -188725, -22947, -159888, 66252, 68841, -179162, 225182, 46659, 66911, -56225, 390980, 147423, -175532, 97078, 148754, 215112, -316868, -58890, 75419, 157972, 243139, -44626, 312218, 8669, 3323, 115947, 46302, -135291, 169539, 85728, 112273, 139375, 67180, -76931, 60938, 110397, -75931, 200408, 98883, 58825, 326606, 47687, -90528, -122936, -23117, 299099, 349971, 173538, 494299, 691893, 700872, 509999, 649681, 627685, 446957, -21522, 294951, 147770, -40754]
15464a07759j41585c450o1708B85314a09280A99214d9215E434L03996p3348b12148
15452a17422C18080A34431C252i5348a9803B52813B9223L12211A44366K45181
15442C89547K85250j5115N09432k22896C90685L55488B25277q6752K35440G3252
15431A71312b73078k4043e0454A83751a95751A84361n2899a48643A09156a30835
15420d82967A37226a37819e6164A77048o7184K8779J21341c64297B50821A08629
15409h7703A82072a29975B85431f6074J735j75540g2531B0982b19316Q7086E2588
15397A73822j3026G76e2173A75744a06948G3467K95369b46904D8795K08191c54075
15385B1624o452g200j0356B0594J41838a69242A33352J50851A3340a66575B54547
$$ y = [-107759, -249344, -3450, -65158, 285314, -109280, 199214, -49215, 5434, 309430, 236082, -212148, -117422, 318080, 134431, 3252, -95348, -19803, 252813, 29223, 341434, 144366, 389547, 674797, 659682, 1169114, 946218, 390685, 746173, 225277, 138525, 373965, 73252, 171312, -273078, -297121, -50454, 183751, -195751, 184361, 131462, -148643, 109156, -130835, -482967, 137226, -137819, -56164, 177048, 109864, 138643, 259984, -364297, 250821, 108629, -87703, 182072, -129975, 285431, -66074, -64339, -239879, -72531, 20982, -219316, -132230, 52588, 173822, 160796, 776, -52173, 175744, -106948, 73467, 368836, -246904, 48795, 256986, -354075, 21624, 15172, -7200, -17556, 20594, 162432, -169242, 133352, 284203, 13340, -166575, 254547]
15373F7918j2423j2126J04579K4204G8372c0202k5114B1669a16211E09943c4630
15361G1187h4961B65871P0805j54222a15212D02265G4066r325L7801J12994L86976
15350F02512e0327A87044K2880d8008B25382R2524j1041m1322i960F62983C16018
15338d302C71299I4526Q3715K08398b2853A29368m2363f7155I5501R9618f0739
15326A31684J01749I9222J15422D5557K8671J94365E5484K58138N5559b6743l4745
15315f1488D653L11795L0023r9119a18734C27958A08636k6523J49375F0294K7878
15304H8172L2391a47180A94738D7254d0232o281I8100P1033G7754e1603A68084
15292b21583A72886P3166a8822D86367a95105B5462g5930J7420l58850D4792h3350
$$ y = [67918, 55495, 43369, 147948, 172152, 78372, -30202, -55316, 21669, -116211, 509943, -34630, 71187, -84961, 265871, 336676, 182454, -115212, 402265, 74066, 64741, 102542, 215536, 602512, -50327, 187044, 209924, -48008, 225382, 317906, 306865, 265543, -9960, 662983, 316018, -4302, 371299, 94526, 178241, 386639, -22853, 129368, 87005, -67155, 95501, 195119, -60739, 131684, 233433, 99222, 214644, 45557, 74228, 268593, 55484, 313622, 369181, -26743, -61488, 4653, 316448, 346471, 247352, -118734, 327958, 108636, 82113, 231488, 60294, 88172, 120563, -147180, 194738, 47254, -40232, -46513, 98100, 169133, 77754, -51603, 168084, -221583, 172886, 246052, -18822, 486367, -195105, 25462, -75930, -58510, -417360, 44792, -83350]
15280B7419b76482Q2699f3850j1218o754A80797i3701A04098a49381B63216l7689
15269B25527b2947k619A36597J28910a35154e5658j96826C50867b835H7126b08628
15257F7947M7641c2339E1005P0942l5719J05899L0665h1218j9817G3053J77038
15246B50091b2561A39681J50031L96925N08041R87798p49541J82108m75099D17719
15235B16373g9563F7125a57093F8754L2297b2704G3366a92665G9711J65248G9797
15223A62040b6366B3352e4705m0625p0041e7119B98848l3672m5857d0743D70664
15211F8387J14788a42532K3991B76608c5093m1100J8141J472A15706k1009M63817
15200E58514F0964c21056A11291J39948l9945p508c03559A53098a4455A80942
$$ y = [27419, -276482, -193783, -63850, -75068, -81822, 180797, -93701, 104098, -149381, 263216, 225527, -22947, -25566, 136597, 265507, -135154, -55658, -252484, 350867, -2835, 87126, -208628, 67947, 115588, -32339, 51005, 121947, 86228, 192127, 222792, -81218, -101035, 73053, 250091, -22561, 139681, 289712, 686637, 1194678, 2182476, 1432935, 1615043, 1139944, 417719, 216373, -79563, 67125, -157093, 68754, 101051, -22704, 73366, -192665, 79711, 244959, 79797, 162040, -26366, 23352, -54705, -95330, -165371, -57119, 298848, 265176, 219319, -40743, 470664, 68387, 183175, -142532, -118541, 276608, -35093, -76193, -58052, -56580, 115706, 94697, 558514, 60964, -321056, 111291, 251239, 211294, 203786, -303559, 153098, -14455, 180942]
15189C36744p1820b80700h8301D9009B0589K01104J1062a7121n8781K6036E0642
15177A37327J3316k2793D3099O9117Q286J15729B3783h5065H7732M27935H8721
15165E639J79614J85161i0121b8884k0086A65424a91307g9673j77629D32807B06130
15153D6479I538O7563K99318f1547A04010J33209J17609k0137A62785b0385j8805
15142c9190B55512d6679A13104b38426A58416K95905d4792B68753c85235A94441
15131A61571G8198h7257D49356G0573Q6916F9296J30546K05079j70409b85021
15120F26746A93313O01762l12105j76896I9087N5838h2387E5812B6953h8997C01842
15108A38282a06917A45767a588F5293c1056F2599M9820b09110G7378P570L50027
$$ y = [336744, 264924, -280700, -88301, 49009, 20589, 221693, 232755, -17121, -75902, -49866, 50642, 137327, 150643, 127850, 43099, 112216, 120502, 236231, 23783, -85065, 87732, 515667, 88721, 5639, 185253, 370414, -90121, -28884, -48970, 165424, -191307, -79673, -257302, 432807, 206130, 46479, 9538, 77101, 376419, -61547, 104010, 237219, 354828, 334691, 162785, -20385, -39190, 255512, -46679, 113104, -238426, 158416, 454321, -44792, 268753, -385235, 194441, 161571, 78198, -87257, 449356, 70573, 157489, 69296, 199842, 404921, 234512, -285021, 626746, 193313, 795075, 482970, 306074, 99087, 154925, -82387, 55812, 26953, -88997, 301842, 138282, -106917, 145767, -1588, 65293, -31056, 62599, 112419, -209110, 77378, 84948, 434975]
15097D34975A97669i0520D3311A3195R6842J96715a20841c4522B1510a6527B64993
15085A91597b7578A18847J29911p4606N7351a9132q8824B51110O2218A7018K64604
15074B81622O3035p3032a3367C54324A31112L69337A00525a07305A50630f6501
15063C30307l3991C3705K59341N8020j7353n7827L64266B55111J79068j77216
15053B56963j28108J60570o4871g352C83044j44944n9796M18866j29684J23889
15043E91375k59331A07750L78908j93616i7737D15396A44223N33137A91818L61080
15033E52898B00250J43928Q9147L20381j21472K29314m11487p1868K52116H2011
15022B58538K71534P9903P0996k81318J36292J14257k15304K58901j31172D6K74976
$$ y = [434975, 197669, -90520, 43311, 13195, 110037, 306752, -120841, -34522, 21510, -16527, 264993, 191597, -27578, 118847, 248758, 174152, 231503, -19132, -107956, 251110, 313328, 17018, 281622, 344657, 271625, -13367, 354324, 131112, 500449, 100525, -107305, 150630, -66501, 330307, 296316, 33705, 293046, 351066, 333713, 275886, 640152, 255111, 434179, 256963, 128855, 289425, 224554, -7352, 383044, 238100, 178304, 597170, 467486, 591375, 332044, 107750, 486658, 293042, -97737, 415396, 144223, 677360, 191818, 552898, 200250, 344178, 433325, 753706, 632234, 861548, 450061, 378193, 630309, 82011, 258538, 530072, 609975, 680971, 399653, 535945, 650202, 434898, 693799, 562627, 46, 275022]
15011B75022j03866N7402J24573J18333J18951J39729B62652j6829K02129n2615
15001C95337K38803B91556J15972J47819B18752K97376o7430k2577p8560K07657
14991E55218J55407B77365K65687k05760J01510J7459P4938l7428M91292k21989
14981G63074K31944r3600k67236Q6958k19297k42492M86561j25065J1990J29383
14971G62220j34046B96838K55242P2406B42872j3612L70270B49605k2863J11900
14961C38642q9867J96083g1761B84776H2179l066N9856N6526A7064K94246n4910
14950B56400P9084j40829K48935j02963E7614L50583o7394M7700L29166Q0738
14940G98407k78797J64389j38494k7277l1623L73893j99497j02272R5574J56068
$$ y = [275022, 171156, 228558, 353131, 471464, 590415, 730144, 262652, 245823, 447952, 395337, 634140, 291556, 407528, 555347, 218752, 516128, 448698, 426121, 347561, 555218, 710625, 277365, 543052, 337292, 438802, 456261, 531199, 493771, 985063, 763074, 995018, 901418, 634182, 721140, 501843, 259351, 745912, 620847, 632837, 762220, 628174, 296838, 552080, 624486, 242872, 229260, 599530, 249605, 226742, 338642, 248775, 444858, -71761, 284776, 82179, 79113, 138969, 195495, 17064, 311310, 256400, 335484, 194655, 443590, 340627, 57614, 408197, 340803, 388503, 717669, 798407, 519610, 683999, 545505, 518228, 486605, 860498, 661001, 558729, 654303, 810371]
14930H10371L78363R4565L59616p93387N88969J78038j57244J49578m2096K10345
14920A777118m13542L67677n4727O28120k35602l67464J15126o60356K71600k11740
14910A216210l38432l14360j38431K51816k53799K16340A69746Q1933o2860J09218
14900B98037K9205K68027B48906K17083M5604B32995K52673A56506J41510p0536
14890B27480M52026A98800N11205k74772O8058K99463R1721k55060J76554k2643
14880G93326O484M05604j62416r2795k32847C26183P6341K88064k47849J3725
14870D56464M1263j27582K63685k2748K08911m8983r7423q8516J23660j40483
14860E68248j45601J25262J20734B56764p483Q0962E3311K80362K72119n7436
$$ y = [810371, 1188734, 1283299, 1642915, 849528, 1438497, 1616535, 1459291, 1608869, 1566773, 1777118, 1363576, 1731253, 1676526, 2304646, 2069044, 1701580, 1816706, 1156350, 1427950, 1216210, 877778, 563418, 424987, 676803, 423004, 639344, 169746, 251679, 188819, 298037, 327242, 595269, 248906, 465989, 511593, 232995, 485668, 156506, 298016, 227480, 679506, 198800, 710005, 435233, 503291, 802754, 894475, 639415, 815969, 793326, 799810, 1205414, 1042998, 950203, 717356, 326183, 402524, 690588, 442739, 456464, 497727, 370145, 633830, 611082, 819993, 771010, 673587, 585071, 708731, 568248, 422647, 547909, 668643, 256764, 249281, 330243, 53311, 333673, 605792, 548356]
14850E48356j41188j97517J18778K55923R2015N2504K6749K91026j26209j28779
14840G91658K70824K12991l32055k95700K68726j92928p2712j3424M68551k97962
14830H07969J13111D2267N75569J3492C00296L98439r3431J01988k62820N05394
14820I49866l67511j69779N07692l77402K58173j85934k418B88992J31626K84361
14810G04979l35559J86707J09066K67647j87421N0537J40663J77687j65643k03835
14800G44828k27928k7668P005M140j3002K76537l43408K64706O8621j29277l1947
14789E92607J61190o7455K42297k64258j0637r4120L46803n0552q9610K94983
14779A061248D03329M22092j26106k36805M45637k7449R4048J55404j66728J52981
$$ y = [548356, 407168, 209651, 328429, 584352, 676367, 728871, 755620, 1046646, 920437, 791658, 1062482, 1275473, 943418, 647718, 916444, 723516, 650804, 637380, 1105931, 807969, 921080, 42267, 617836, 631328, 300296, 698735, 605304, 707292, 444472, 949866, 582355, 412576, 920268, 542866, 801039, 615105, 612687, 288992, 420618, 704979, 369420, 556127, 665193, 932840, 745419, 795956, 936619, 1114306, 948663, 744828, 516900, 489232, 496237, 500377, 487375, 763912, 420504, 685210, 753831, 624554, 592607, 753797, 686342, 928639, 664381, 653744, 559624, 906427, 855875, 766265, 1061248, 403329, 825421, 699315, 462510, 908147, 880698, 974746, 1130150, 963422, 1116403]
14769A116403j48642D77460M64311l75988j2312m1402P553L33735K626j0785k28307
14758F16891J95673J96772k77815k7940j99452K48555j78120j14943M09850o3003
14748H06468l71959j8445K56730j19614L81139j39614P3820m05804L06299K35222
14738A004242k66594j96388j37561L92203J80343k10793K39224J76446n2275L62294
14728A491141j97922L87637l28004L63322J70375p39666J95420k32918j35237
14719I74148P6882j60571p0331K65298k20073k05012L82819k67435P9226K21478
14709A076429l91815J92504L85694l90665M31122l07295M56928J8028M49702K87857
14699B208489k16888m82715k73673L76702m96783K5793L7183l47227k09792O6415
$$ y = [1116403, 967761, 477460, 941771, 565783, 553471, 512069, 519622, 853357, 855983, 845198, 616891, 812564, 1009336, 731521, 703581, 504129, 752684, 574564, 459621, 869471, 806468, 434509, 416064, 672794, 553180, 934319, 794705, 868525, 462721, 769020, 1004242, 737648, 541260, 403699, 795902, 976245, 765452, 1004676, 1181122, 1128847, 1491141, 1293219, 1680856, 1352852, 1716174, 1886549, 1146883, 1342303, 1109385, 974148, 1051030, 890459, 820128, 1085426, 865353, 660341, 1043160, 775725, 854951, 1076429, 684614, 877118, 1262812, 872147, 1303269, 995974, 1452902, 1470930, 1920632, 2208489, 1991601, 1508886, 1235213, 1611915, 1115132, 1140925, 1178108, 830881, 621089, 687504]
14689F87504K75474n7591n2476M46937n39948J59252j41200K84920j106O892m24932
14678F43726K93146l1825L73356m40506J44680j73573M9754L31056j1835o5014
14668A112965m4910K26460m43327R5534L8580p4553j13874N04397k51081n9252
14658I90939J48635j93149K95478J00715l05875Q5040M04653k31047K5712j96371
14648A124730P605n2650K14020m71352P83828o0024k47437l01590K17649j07297
14638A107482o968j04512J40101J88467J68602k57377j41010M43697l40875k9579
14628A168028K29357l27345Q4675J01382M05117j85005j09634J67652k01372j81615
14618A151240k17789N98679m5790k97280L08861m9273K49601j10099j48867J17736
$$ y = [687504, 962978, 905387, 852911, 1299848, 759900, 919152, 777952, 1062872, 1061766, 1068658, 643726, 936872, 905047, 1278403, 837897, 982577, 809004, 858758, 1189814, 1177979, 1112965, 1068055, 1294515, 851188, 946722, 985302, 910749, 796875, 1301272, 1050191, 990939, 1139574, 946425, 1241903, 1342618, 1036743, 1121783, 1526436, 1295389, 1321101, 1124730, 1132335, 1079685, 1293705, 822353, 1606181, 1546157, 1298720, 997130, 1214779, 1107482, 1100514, 996002, 1136103, 1324570, 1493172, 1235795, 1094785, 1538482, 1197607, 1168028, 1397385, 1070040, 1154715, 1256097, 1661214, 1476209, 1366575, 1534227, 1332855, 1151240, 933451, 1532130, 1486340, 1189060, 1497921, 1448648, 1698249, 1588150, 1439283, 1557019]
14608A557019k17422j40766J50680J64969j10499K65639n12866M12101J08043
14599A676898J44672m57306K79026J22533J02700k79145P4250j71530K29757J63871
14589A885726k41959K92090l15381j71471K68699j29446L23655l23022J75969
14580A764860J38121l8037R4687j38995R2046L30048k58971n3576j00168O42145
14570B472160n82589N88514R8109l66387j94124J16549L54240j15218p9138K03525
14560B495641J2534O6211M0460M30560l9997N1822L34038J79726L68139L80314
14550D319448J119672J770380L328135Q130611J9672990J0626505B0950390H209723
14541D228926j511850j64704M13130Q88531J730217j825533j412880n69428L77985
$$ y = [1557019, 1339597, 1198831, 1349511, 1514480, 1403981, 1669620, 1156754, 1568855, 1676898, 1821570, 1364264, 1643290, 1765823, 1868523, 1589378, 1663628, 1492098, 1721855, 1885726, 1643767, 1935857, 1620476, 1449005, 1717704, 1588258, 1911913, 1588891, 1764860, 1902981, 1864944, 1959631, 1820636, 1912682, 2242730, 1983759, 1930183, 1830015, 2472160, 1889571, 2478085, 2576194, 2209807, 2015683, 2132232, 2486472, 2371254, 2292116, 2495641, 2508175, 2574386, 2614846, 3045406, 3005409, 3057231, 3391269, 3570995, 3939134, 4319448, 5439120, 7209500, 10537635, 18668246, 38341236, 48967741, 20950390, 8209723, 4228926, 2717076, 2552372, 2965502, 3854033, 5584250, 3758717, 2345837, 1776409, 2154394]
14532B154394j37315k5074J03471K99855j57714J3263J25067j11847j93820K44299
14522B314579R4435M5032p9896L13110l58933K8303J80863J8855J52375j34359
14512B574364L11870k40674j5343l5081J80905K31646J0127j64634j28778r2045
14502B632357N97983J27096m12479J01614K10112J714m68960M46179J28205J69764
14492C533585n5886k15190p7595L11968J07651J51678j83264k41276P6448K45154
14482C653273J05033Q2227j01374L8010K87642J2428n1815k73363L43666j93437
14472C902290J72766O9915J19124r0941J4891J52878L50991j62406J84049o2798
14462D650759P695K05354o4433k93147J42992L63500J49058p5880n0393J60302
$$ y = [2154394, 2017079, 1992005, 2095476, 2395331, 2237617, 2250880, 2375947, 2264100, 2070280, 2314579, 2409014, 2454046, 2374150, 2687260, 2328327, 2356630, 2537493, 2556348, 2708723, 2574364, 2886234, 2645560, 2630217, 2595136, 2776041, 3007687, 3017814, 2853180, 2724402, 2632357, 3230340, 3357436, 2944957, 3046571, 3256683, 3258397, 2789437, 3235616, 3363821, 3533585, 3477699, 3262509, 3184914, 3496882, 3604533, 3756211, 3572947, 3331671, 3408119, 3653273, 3758306, 3840533, 3739159, 3777169, 4064811, 4077239, 4025424, 3752061, 4095727, 3902290, 4075056, 4144971, 4264095, 4173154, 4188045, 4340923, 4691914, 4529508, 4713557, 4650759, 4658454, 4863808, 4799375, 4506228, 4649220, 5012720, 5161778, 5085898, 5035505, 5195807]
14452E195807p2241J75032J61611j33774J67876J83682J6837j26263J67455K42535
14442E978557k6337k47070M31662k03523K87374Q4547N17958m5401m80444K27071
14432F524394Q9612o6862M63653J17690j9017M6338K33859K27990j37754l2687
14422G447216M38959j01053M44453M11950j30743K47097l74232P1476q7202N08096
14412H876017l13793L74458J23490K66585k01409J74996M00717N01833K30293
14403A0433187P8159j86098J90132P6529K27867m1077K68777j5836L19019L5689
14393A1386348M51845q3754L24834L19976J03314K58655M07886r9763M06411J1487
14383A3487239N34286K21634L66737L97284K62656J96762P1576K15057K55835
$$ y = [5195807, 5123566, 5298598, 5460209, 5326435, 5494311, 5677993, 5694830, 5568567, 5736022, 5978557, 5952220, 5705150, 6136812, 5933289, 6220663, 6305210, 6823168, 6777767, 6297323, 6524394, 6614006, 6547144, 7010797, 7128487, 7109470, 7155808, 7389667, 7617657, 7479903, 7447216, 7886175, 7785122, 8229575, 8641525, 8510782, 8757879, 8383647, 8455123, 8367921, 8876017, 8562224, 8936682, 9060172, 9326757, 9125348, 9300344, 9701061, 10202894, 10433187, 10511346, 10325248, 10515380, 10591909, 10819776, 10778699, 11047476, 11031640, 11350659, 11386348, 11838193, 11754439, 12079273, 12399249, 12502563, 12761218, 13169104, 13069341, 13475752, 13487239, 14021525, 14243159, 14609896, 15007180, 15269836, 15466598, 15538174, 15753231, 16009066]
14374A6009066J41976N89460O7790P09800L38186K20642L38712O14863M38766
14365A9469261Q26607m60305R59911O8699M93676R6922Q92859M38210O32451K91609
14355B3709900R33868K39741M62998R88575L61031O05637O39362P37075M48681
14346B9126868R75451P23381J213221L70586J243978O68097J116659N54357J379755
14337C7372353J344549P58712J118364R48034J573786J045239J378569J655044
14329D7194650J466471J067992K246369J431632J529754K075986J765152J951175
14321F0729181K184306K522651K330302K372497K331927K734968K878688L106596
14313H1191116L347059L312724L244515L597461M417774L865227M554988M546599
$$ y = [16009066, 16151042, 16740502, 16808292, 17518092, 17856278, 18076920, 18415632, 19030495, 19469261, 20295868, 19835563, 20795474, 20864173, 21357849, 21454771, 22347630, 22785840, 23418291, 23709900, 24643768, 24883509, 25346507, 26335082, 26696113, 27301750, 27941112, 28678187, 29126868, 30102319, 30825700, 32038921, 32409507, 33653485, 34321582, 35438241, 35992598, 37372353, 38716902, 39475614, 40593978, 41542012, 43115798, 44161037, 45539606, 47194650, 48661121, 49729113, 51975482, 53407114, 54936868, 57012854, 58778006, 60729181, 62913487, 65436138, 67766440, 70138937, 72470864, 75205832, 78084520, 81191116, 84538175, 87850899, 91095414, 94692875, 99110649, 102975876, 107530864, 112077463]
14305A12077463M823659N479698N208898O320552N864546O701772O867314P185811
14297A60529713Q064294Q509839Q699900R206443J0041512R912476J0995456J1347651
14289B37307284J1984203J2701776J2981891J4011458J3752691J4279088J4828921
14282C31847312J4915864J5145659J4930637J4547153J4117013J3443387J2619188
14275D31566213J1077994Q841662N535008L102666J646710J047670l33333n054518
14267D57430072k102036n239834q584568j0627532j1827861j3462787j4573272
14260C91012182j4776809j5697574j5516598j5336234j5816994j4976398j4460048
14253B84431527j3721642j3526460j3087492j2282872j1639917j0238811r331425
$$ y = [112077463, 116901122, 122380820, 127589718, 133910270, 139774816, 146476588, 153343902, 160529713, 168594007, 177103846, 185803746, 195010189, 205051701, 214964177, 225959633, 237307284, 249291487, 261993263, 274975154, 288986612, 302739303, 317018391, 331847312, 346763176, 361908835, 376839472, 391386625, 405503638, 418947025, 431566213, 442644207, 451485869, 457020877, 460123543, 461770253, 462817923, 462484590, 457430072, 455328036, 450088202, 441503634, 430876102, 419048241, 405585454, 391012182, 376235373, 360537799, 345021201, 329684967, 313867973, 298891575, 284431527, 270709885, 257183425, 244095933, 231813061, 220173144, 209934333, 200602908]
14246B00602908r791933r143698q712072q099655q253626p064186o886844o767539
14238A35883355n754834n159382n794235m989232n287467m402449m074672l385429
14230I7035655m371686l427536l787354l058309l232044l135486k763858k765487
14222G0493895k275691k348312k217975k165382j978956j894535j954735j638659
14214E4019650j579808j418133j635851j832540j261088j771272j286972j53807
14206D3080179j449711j285156j498162j076560p16488q28120o58814j251119
14198C4316049j053624r89012q46366o80047m04739j035811p13083p59769m16933
14189B7416665r81380o66884o27394o67711k2062p73701m65253m09286o39236
$$ y = [200602908, 190810975, 181667277, 172955205, 164855550, 156601924, 149537738, 142650894, 135883355, 130128521, 124969139, 119174904, 114185672, 108898205, 104495756, 100421084, 97035655, 92663969, 89236433, 85449079, 82390770, 79158726, 76023240, 73259382, 70493895, 68218204, 65869892, 63651917, 61486535, 59507579, 57613044, 55658309, 54019650, 52439842, 51021709, 49385858, 47553318, 46292230, 44520958, 43233986, 43080179, 41630468, 40345312, 38847150, 37770590, 37054102, 36225982, 35567168, 34316049, 33262425, 32273413, 31427047, 30747000, 30342261, 29306450, 28593367, 27833598, 27416665, 26435285, 25768401, 25141007, 24473296, 24451234, 23677533, 23212280, 22802994, 22163758]
14180B2163758l37573o87660l52879k56725r96466J29353m40613m21581k80409
14171A8519205m86156m82996l6999n58842m11726L7908l08197o27080j28364k51410
14161A5265343p1106l84530l92740n99509K4229j84260m27929k52541l3990j59485
14151A2783482l6983k84214o09161Q0697j94314J0978N098k96309l44991j47591
14141A0966692k79703q6840k70124J1624k92143M42419j067686K7474J77613j62270
14131I467056j84220n4984l73493l10408J66137j32014Q6460m67735K93814l30804
14121H159809J47079m12826j08556Q0126p3390k60994k24034P6880j08616j53976
14111G121502J06436k41288j38281l51786O4338K13186j17713p1207j92269J2381
$$ y = [22163758, 21826185, 21138525, 20785646, 20528921, 19532455, 19661808, 19221195, 18799614, 18519205, 18033049, 17550053, 17513054, 16954212, 16542486, 16580394, 16272197, 15645117, 15516753, 15265343, 15194237, 14809707, 14416967, 13817458, 13841687, 13657427, 13229498, 12976957, 12942967, 12783482, 12746499, 12462285, 11853124, 11933821, 11739507, 11750485, 11755583, 11459274, 11114283, 10966692, 10686989, 10600149, 10330025, 10341649, 10049506, 10491925, 9424239, 9451713, 9629326, 9467056, 9282836, 9227852, 8854359, 8543951, 8710088, 8578074, 8664534, 8196799, 8490613, 8159809, 8306888, 7894062, 7785506, 7865632, 7792242, 7531248, 7307214, 7384094, 7275478, 7121502, 7227938, 6986650, 6848369, 6496583, 6560921, 6774107, 6656394, 6585187, 6392918, 6405299]
14101F405299j1259j86777J42218l44285j50491J03121j10795J21163K9319q23212
14091E174301L64186P6646J15653m17762J52985k1518J02983o06962L35812l91505
14081D884819K42527J980l11273l6784J5826J00815k17001N0592O8629l46239
14071D453891j771K53943j29390K62554n21070p4720j08974K89180l2844k00600
14061D190199l8673L2617J25637l5985l38317L8787K1629J32806j9494k37969
14051C871237k26682J34462k32778K47407j9310k84254j01570J95587k87612J22733
14041C419220K73097n93959K03686J846O3081K7061k54424r1873J02817j12558
14031C037994L55181j72471j06761r9591m7668l28J80667l62207J6813K56896
$$ y = [6405299, 6394040, 6207263, 6349481, 6005196, 5854705, 5957826, 5847031, 5968194, 5997513, 5174301, 5538487, 5615133, 5730786, 5313024, 5466009, 5444491, 5547474, 4940512, 5276324, 4884819, 5127346, 5129326, 4818053, 4781269, 4797095, 4897910, 4680909, 4731501, 4800130, 4453891, 4452120, 4706063, 4576673, 4839227, 4318157, 4243437, 4134463, 4423643, 4390799, 4190199, 4151526, 4184143, 4309780, 4273795, 3935478, 3974265, 3995894, 4128700, 4109206, 3871237, 3644555, 3779017, 3546239, 3793646, 3774336, 3490082, 3388512, 3584099, 3296487, 3419220, 3692317, 3098358, 3302044, 3303890, 3366971, 3394032, 3139608, 3047735, 3150552, 3037994, 3393175, 3220704, 3113943, 3014352, 2966684, 2966356, 3147023, 2784816, 2801629, 3058525]
14021C058525r1495l16033J98351l7547o9563p4811k43387J30897J23023k74305
14011B403655N97799n38227K99324m46947K92441k26801l29111M03154n07560
14002A947727J49589J45568j14061K48415j90857r0452J79209l57626N67737m61163
13992B024086J50180p9254Q20845N11830K034271N678688J7376257K3683713k3086688
13983B9113928A4432911o278195k299178r60381o27676p47067K6249n27621j39452
13974B879590m7621J46442k35281j17271J44182l35487M32802p41764L96446L9717
13964B561755j41104l67622L06033k41912O2884q099L4863j87807j2653P2095
13954B078433k22377M39181r3416l23339N88508o65278k19651O16629k97497j14584
$$ y = [3058525, 2967030, 2650997, 2849348, 2811801, 2742238, 2667427, 2424040, 2554937, 2677960, 2403655, 3001454, 2463227, 2762551, 2315604, 2608045, 2381244, 2052133, 2455287, 1947727, 2097316, 2242884, 2128823, 2377238, 2186381, 2095929, 2275138, 1917512, 2485249, 2024086, 2174266, 2095012, 2915857, 3427687, 5461958, 11140646, 28516903, 52200616, 29113928, 14432911, 8154716, 5855538, 4895157, 4267481, 3520414, 3546663, 3019042, 2879590, 2831969, 2978411, 2743130, 2625859, 2770041, 2434554, 2867356, 2125592, 2522038, 2561755, 2420651, 2053029, 2359062, 2117150, 2180034, 2171935, 2206798, 2018991, 2006338, 2078433, 1856056, 2295237, 2201821, 1878482, 2466990, 1801712, 1582061, 2198690, 1901193, 1786609]
13944A786609J15984J30209J4164L115l32036J51715k0059q2416j09870K66982
13934A924397l24811l2122P9113k87923L31647k86151L39134j6193j62408r7823
13924A466860J76242j07379k15252N3441K81486o8737K25199J3023k28059J4710
13914A611534j82217n525L8294L7786l9541N7909L72012n32793J60503j4179m8593
13903A455190K2823m8240j60876J69899J56979l83517P1682J37127m84663N4154
13893I90558q0469K29385K63798j26813j44878J26319O867m1228K6622Q3236m02783
13882I30614K15912N047R5772o4908k26324L16652r8674m7710N9070r3662J3022
13871A104811K15842m34982O5563K69171J94430j10729n94492J10980J76546Q573
$$ y = [1786609, 1902593, 2032802, 2046966, 2050081, 1718045, 1869760, 1849701, 1767285, 1657415, 1924397, 1599586, 1567464, 1646577, 1358654, 1690301, 1404150, 1743284, 1727091, 1564683, 1466860, 1643102, 1535723, 1320471, 1373912, 1655398, 1586661, 1811860, 1824883, 1596824, 1611534, 1429317, 1423792, 1462086, 1499872, 1460331, 1518240, 1890252, 1357459, 1517962, 1503783, 1455190, 1478013, 1429773, 1268897, 1438796, 1595775, 1212258, 1283940, 1421067, 936404, 990558, 910089, 1139474, 1403272, 1276459, 1131581, 1257900, 1264767, 1223539, 1250161, 1333397, 930614, 1146526, 1151573, 1247345, 1182437, 956113, 1272765, 1174091, 1126381, 1185451, 1091789, 1104811, 1320653, 885671, 951234, 1220405, 1414835, 1304106, 709614, 820594, 997140, 1005713]
13861A005713L20631k89760m0967K34060k24693j11369R1126J08995j69821L35534
13851A259449l64722J65223J85381l30416k84309N89606l00647J85270k81106
13842H23729J44891Q7146N4221j08697j54010j45800L06617m24126M62712n2824
13832I93859k21627M03336j10955J12689k38711K02823k8811p2058k60420r2410
13822F87715M465M81319k18445M8785l2983k34660J86905D43926O83809k03518
13812I24217m12560M11194p3394o2227R5002k57601K6814K11996J26768k33263
13802G56946K07850N1360j9357m59942J98648K0311R990J16221k6939k71837L52276
13791I35527j94316j79195L03441C90151O40878j25676k97053M29256m97359L70342
$$ y = [1005713, 1326344, 1036584, 995617, 1229677, 1004984, 893615, 984741, 1093736, 923915, 1259449, 894727, 1059950, 1245331, 914915, 630606, 1220212, 919565, 1104835, 823729, 968620, 1055766, 1109987, 1001290, 847280, 701480, 1008097, 583971, 1046683, 993859, 772232, 1175568, 1064613, 1177302, 938591, 1141414, 1112603, 1040545, 780125, 687715, 692180, 1173499, 955054, 1003839, 970856, 736196, 923101, 443926, 1127735, 924217, 511657, 922851, 849457, 787230, 882232, 624631, 651445, 863441, 990209, 756946, 964796, 1016156, 996799, 536857, 735505, 755816, 765806, 882027, 855088, 583251, 935527, 741211, 562016, 865457, 390151, 1031029, 905353, 608300, 1037556, 540197, 910539]
13781I10539k1450l07864J65740O7105j15774M91316n04820J06120j151K50961
13771A040722l80931K4724K0020j38917J26951P8893n4038J51274k59647J88288
13761G97339N3592K2671m32957K01142M8253p5439k67738J58333q5787L86731
13751H06140l15764K63851m0942M8614l29250K87010K0266J69858k37964j07737
13741E64082J18842J83297l11428K14260C84115Q42179D74092J06690A77491M38342
13731F15833k55900J46246M10217D41230K79084P6701j45883j13068j94939K55139
13721E98264j21949K84274j22042A15829P87377k67295l1554n0930j840L6700
13711E88287j95128L4662M9882m3969L09427l57024L04568B37426K15343J56727
$$ y = [910539, 889089, 581225, 746965, 814070, 698296, 1189612, 684792, 790912, 789761, 1040722, 659791, 684515, 704535, 565618, 692569, 771462, 717424, 868698, 609051, 797339, 850931, 873602, 440645, 641787, 690040, 614601, 346863, 505196, 419409, 806140, 490376, 754227, 713285, 761899, 432649, 719659, 739925, 909783, 671819, 564082, 682924, 866221, 554793, 769053, 384115, 1226294, 474092, 580782, 177491, 615833, 359933, 506179, 916396, 441230, 720314, 797015, 651132, 538064, 343125, 598264, 476315, 760589, 638547, 115829, 903206, 635911, 604357, 553427, 551587, 588287, 393159, 427821, 477703, 433734, 743161, 386137, 690705, 237426, 452769, 609496]
13701F09496A88568J67935J19336L3450R080k13163N13768k44335L21139k36041
13691F59737J67254l99823J66221N6113n111k35222K60538r6931j60797A96422
13680D95331M8403j47317K59869J23739j58623B28989M08863k97548J41700J74054
13670F56058k93457j48263l85N09979l01132q3706L49213j96532n7850l2222M14369
13659H16072l41562n4213Q0096B42800K48473J19278r3618J2631j3197J59922
13649F76289p4658j34816H8164K49768J15616n6697n8563K1029j58088K8278P7530
13638C07037K49052q199B22838K56331K1429K9275k41225p3389F3191L84274A39763
13626D36722A87818M52332M0884j81319n5687j61153p0573K94535l4594j52804
$$ y = [609496, 188568, 356503, 475839, 509289, 518369, 305206, 818974, 574639, 895778, 659737, 826991, 427168, 593389, 649502, 644391, 409169, 669707, 572776, 411979, 196422, 495331, 543734, 396417, 656286, 780025, 621402, 228989, 637852, 340304, 482004, 656058, 362601, 214338, 213953, 723932, 422800, 339094, 688307, 491775, 433925, 401703, 816072, 474510, 420297, 500393, 242800, 491273, 610551, 516933, 529564, 516367, 676289, 601631, 466815, 88164, 337932, 453548, 396851, 338288, 359317, 201229, 229507, 307037, 556089, 547890, 222838, 479169, 500598, 529873, 288648, 215259, 63191, 447465, 139763, 436722, 187818, 640150, 681034, 499715, 444028, 282875, 212302, 506837, 472243, 319439]
13616C19439K67618B65240K39875R05j40564J70517j33426A69855J23727K03288
13606D96870j67027r4662P1678q6189K60953j06950L02541j76306j72092k9476
13596B99340N3669J04722j0113A66156K99225B02797o126H2121O64222A53649
13585G28938l02445m0747k7644N5189m3989J13367r360J45j28565k3019q8939
13574B32931N90060B68295A31803e2749C08050K18033B57850A03850M00515r614
13564D94751A32823O5066j2591E7630L83972k06822L6009f6768C52587j8787J06093
13553D39893k08439a8136C20152K82416k57651K1123M5339A98048L221p7439K63951
13542C87781A10050J01567K9020H5813M26917j67396P487O1005a4334B73106j6212
$$ y = [319439, 587057, 265240, 505115, 506020, 365456, 535973, 402547, 169855, 293582, 496870, 329843, 235181, 306859, 220670, 481623, 374673, 677214, 500908, 328816, 299340, 353009, 457731, 447618, 166156, 465381, 202797, 196671, 82121, 746343, 153649, 728938, 426493, 385746, 358102, 413291, 369302, 482669, 473309, 473454, 344889, 321870, 232931, 822991, 268295, 131803, -52749, 308050, 526083, 257850, 103850, 504365, 494751, 132823, 197889, 185298, 57630, 441602, 234780, 270789, -66768, 352587, 333800, 439893, 231454, -18136, 320152, 602568, 344917, 366040, 411379, 198048, 201269, 123830, 387781, 110050, 211617, 240637, 85813, 512730, 345334, 352821, 413826, -14334, 273106, 256894]
13531B56894L58977A66572K07354q6035J5126c3476B10860A8050M07155j63985
13521B61220J4161o2767B4377Q4002J17489L5692J0948a77571B21748O6328p084
13510B80992A03014J31886J34528l3085j56712K51276l5746A59448C410J55783
13500A59193L05968A23194g0493c2224B85019J67728A91812J33969j34909Q1094
13490B71966m0452P5733J85255M7506A88292N2243m3109q8161K42909C3348L18772
13479C52120I208N2543i8589D30591A23262D7138L31795J4889j67337L5825j30053
13468A32257J37000A02320J84944F0037L49640A22422M5565R2359K42587c0175
13457C87180J07465A41554P9274A8975L98689l985A62848O4189h772B81083J96835
$$ y = [256894, 615871, 166572, 373926, 287891, 303017, -33476, 210860, 18050, 425205, 261220, 275381, 212614, 24377, 108379, 225868, 261560, 272508, -177571, 221748, 288076, 280992, 103014, 234900, 369428, 336343, 179631, 430907, 395161, 159448, 3410, 159193, 465161, 123194, -70493, -32224, 285019, 452747, 191812, 325781, 190872, 271966, 231514, 307247, 492502, 540008, 188292, 240535, 197426, 109265, 352174, 33348, 352120, 9208, 61751, -98589, 430591, 123262, 47138, 378933, 393822, 226485, 262310, 132257, 269257, 102320, 287264, 60037, 409677, 122422, 167987, 260346, 502933, -30175, 387180, 494645, 141554, 220828, 18975, 417664, 413679, 162848, 227037, -8772, 281083, 477918]
13446D77918m2366j24470j8775n129I1818M7701Q8835a40975B08868J8203A12142
13434C24548h3445C76215o4665k808j11705P1325C8524L48561j23206J00694j79027
13423A85546L3470G7416L42193B05761M5127I4158b0558B02575L1978a9802B34416
13411B3788b00945C21017I8421J06531p237j953N3287K08817L0826j59823j31344
13400A97525J11279K7345j09561Q4618j31149m4174k6911J80939A2487J79341
13390A91828M2096J812a30274B04097N1232C6999j7642K3069J66993r4863Q008
13379A22564Q6961n3004L3509j3292M4872I9111B059J15531K6680f2885C42353
13367b02752E63132A0731K41279J8159r4161M9357J14327p8571a00361A91326
$$ y = [477918, 435552, 311082, 292307, 287178, 91818, 139519, 228354, -140975, 208868, 227071, 112142, 324548, -83445, 376215, 311550, 308742, 197037, 268362, 38524, 387085, 263879, 364573, 185546, 219016, 77416, 419609, 205761, 250888, 94158, -20558, 202575, 234553, -19802, 234416, 23788, -200945, 321017, 98421, 204952, 197715, 195762, 249049, 457866, 488692, 328869, 197525, 308804, 336149, 226588, 311206, 180057, 135883, 108972, 289911, 12487, 191828, 233924, 235736, -130274, 204097, 255329, 36999, 19357, 42426, 209419, 114556, 122564, 209525, 156521, 190030, 176738, 221610, 99111, 2059, 117590, 144270, -62885, 342353, -202752, 563132, 10731, 252010, 270169, 176008, 225365, 339692, 261121, -100361, 191326]
13356D02916a14454A40008j8446K48670d6290j3008A69989K01541J26589N1862
13346E49981A08611L9183M5878J38795K2376o9855j36025J80164p1632L3501A07524
13334B65810b7461A45112j4399o486l024Q8315N1811f268C9120L78399g6126I3558
13321A1246M3318L45081A49035M3031K73529k00517q1651J50677j07889O7905
13311B94120O2187A10742k9209b1483j16669C93304j5493J2008b4735B33325G3157
13299A46814J54166A37377J66196j25032J26171q8552E0871P0709B8557J72432
13289B00989j0938a97750q9285B16899K72851G2883e9514H7726b95767h3685A90142
13277C24234f27C30929F1938a01126C72917K2672E3097J40065C3365C846L23834
$$ y = [402916, -114454, 140008, 121562, 370232, -46290, -59298, 169989, 371530, 498119, 549981, 108611, 147794, 193672, 332467, 354843, 284988, 148963, 329127, 257495, 290996, 107524, 265810, -27461, 145112, 130713, 124227, 121203, 209518, 261329, -6268, 39120, 417519, -76126, 93558, 11246, 54564, 399645, 149035, 192066, 465595, 265078, 183427, 334104, 226215, 294120, 356307, 110742, 81533, -21483, -138152, 393304, 377811, 389819, -24735, 233325, 73157, 146814, 300980, 137377, 303573, 178541, 304712, 216160, 50871, 121580, 28557, 200989, 190051, -197750, -287035, 216899, 489750, 72883, -59514, 87726, -295767, -83685, 190142, 324234, -627, 330929, 61938, -101126, 372917, 395589, 53097, 193162, 33365, 3846, 327680]
13266C27680d7455A11474Q9331p5872j9712b02004h807A51587E7104a28944K7982
13255a00962A68941k3771R2206Q3758h1933D3350F641L89091D8051J2053M2817
13244A02921k8387l6010J05567L49996b19421B88609a81367A15974Q5396b2118
13233A92325F7429j2460A9331J32584a75276K773b7154D62550a49554A54661K73862
13222D28523j21482a4912A01788P1061a14970A82346l2926F6008a10837G583J79842
13211A87425o2148a56474B9650J0226J03039J20213j14450A2393d4797H9931b6898
13199C49549F9688M5457J31471k3289l3328a53524n5292I151L18484b20956D06019
13187E2763K21270c0684B67449A08787a77804g814D7460J44416b80778A29891
$$ y = [327680, -47455, 111474, 200805, 124933, 105221, -202004, -8807, 151587, 57104, -128944, -100962, 168941, 145170, 237376, 321134, -81933, 43350, 6641, 395732, 48051, 60104, 102921, 74534, 38524, 144091, 494087, -219421, 288609, -181367, 115974, 201370, -22118, 192325, 67429, 54969, 19331, 151915, -175276, -172503, -27154, 462550, -149554, 154661, 428523, 307041, -14912, 101788, 172849, -114970, 182346, 149420, 66008, -110837, 7583, 187425, 125277, -156474, 29650, 39876, 142915, 263128, 148678, 12393, -44797, 89931, -26898, 349549, 69688, 115145, 246616, 223327, 189999, -153524, -208816, 9151, 327635, -220956, 406019, 52763, 274033, -30684, 267449, 108787, -177804, -7814, 47460, 191876, -280778, 129891]
13176a81071D6382J96035f1347j17862B1267N0428O2166a83283B08357A9272J22636
13165A41908b9947j9290r0218C02987a13637C9616a12157A22324Q9286a25087
13154A58385Q5720b5333B76407n2527b4448l8177q371A82228J23084c4890m3890
13143g8780j24764j88490A84750C2546K90435a04318A82620b6055E7278d899C26183
13131D21214F0047j9382K14935a30849N54c1936A68148q0541d9371C26248a31442
13119B19362b24092A70599K59056j59112A09155M5515E1715J14293K32920H2201
13108A67739J1728n7680J01612n3709a70390J4638E5782J48187J18869N7802a09679
13096F5901M7039k8411b22680g3455A53953i3442A23682A4572K34701B7424a78785
$$ y = [-181071, 46382, 242417, -61347, -179209, 21267, 71695, 133861, -183283, 208357, 19272, 141908, -29947, -49237, -139455, 302987, -113637, 39616, -112157, 122324, 211610, -125087, 158385, 244105, -25333, 276407, 223880, -24448, -62625, -70996, 182228, 305312, -34890, -78780, -203544, -392034, 184750, 32546, 322981, -104318, 182620, -26055, 57278, -4899, 326183, 421214, 60047, 40665, 255600, -130849, -130295, -31936, 168148, 87607, -49371, 326248, -131442, 219362, -224092, 170599, 429655, 270543, 109155, 154670, 51715, 166008, 398928, 82201, 167739, 179467, 121787, 223399, 169690, -170390, -155752, 55782, 203969, 322838, 380640, -109679, 65901, 112940, 84529, -222680, -73455, 153953, -93442, 123682, 14572, 249273, 27424, -178785]
13084C95883j23213j10919a63512l14381B73234p2152E5252j8306f2512A62385
13073C02728A45247b50170O0323A50119a14055A72284K58588E395c1800B26531
13062C1886F597i2696A86639c31797A79168L0432O0969b03679A57188K03004a68101
13050f3876r8834C14471c8050B90601g8994H3971l1679J02484K2099p8616J0495
13039A08754J02792a48618C63886j37928I0098g7999J0975n5241B43504E0748
13028C03267a17320B81531r9974p4871a47469j37143A03432J64682a49483P741
13018a41742O8856C18330H0202J0856d9766A70315K89379j80224D8208i390B97525
13006A91239i3007I2535L1390K05800I8158b0834A15815a08788k03660F0985i8149
$$ y = [395883, 272670, 161751, -163512, -477893, 273234, 201082, 55252, 36946, -62512, 162385, 302728, 145247, -250170, -189847, 150119, -114055, 172284, 430872, 5395, -31800, 226531, 31886, 6597, -92696, 186639, -331797, 179168, 209600, 270569, -203679, 157188, 360192, -168101, -63876, -162710, 314471, -38050, 290601, -78994, 83971, 52292, 154776, 176875, 98259, 108754, 211546, -148618, 363886, 225958, 90098, -77999, -67024, -122265, 243504, 50748, 303267, -117320, 281531, 181557, 106686, -147469, -284612, 103432, 268114, -149483, -141742, -72886, 318330, 80202, 91058, -49766, 170315, 459694, 279470, 48208, -9390, 297525, 191239, -93007, 92535, 123925, 329725, 98158, -20834, 115815, -108788, -312448, 60985, -98149]
12994B77655F6974P371o002N6132d24763A39908F031J80950f4350C56059b33543
12982a60822j48216j0795a59316e5734j5224j29593C1942K9066d733m74E0729
12970A2890g0079l72575E655c28410a19953j18820h08n647k97740c6554F0040
12958a23680A16564e4037E92828a12469k45545B93828a08423b1160A9442f145
12947C5936R2607J10590j05675K16328d5636A95281a0614j2681l1241k8671A71859
12935i1575j37231D13659g316k82348G3166P6698C4058J18314C2744e3576n7966
12924a11542D85439a04977G9003a28914L9947B51934h6196j19435L6318L4500
12914a34813C3794J18932a59157j91998A55356D5839J50798J02472e8939D93081
$$ y = [277655, 66974, 74345, 68343, 124475, -424763, 139908, 6031, 186981, -64350, 356059, -233543, -160822, -309038, -319833, -159316, -55734, -70958, -200551, 31942, 61008, -4733, -5207, 50729, 12890, -70079, -442654, 5655, -328410, -119953, -238773, -808, -6455, -304195, -36554, 60040, -123680, 116564, -54037, 592828, -112469, -358014, 293828, -108423, -21160, 19442, -6145, 35936, 128543, 239133, 133458, 349786, -45636, 195281, -10614, -23295, -54536, -83207, 171859, -91575, -228806, 413659, -7316, -289664, 73166, 149864, 34058, 152372, 32744, -53576, -111542, 485439, -104977, 79003, -128914, -88967, 251934, -86196, -205631, -169313, -134813, 33794, 152726, -159157, -351155, 155356, 45839, 196637, 299109, -58939, 493081]
12903A75921a95374C30448b9788k51085A78229k5538i8301l5501M7893a7767B35289
12891f7970b1545B60228d05560I8388J7082a60334j74809H1522j8541K49115F1659
12879c56370C53262a83472O2704A54775B0273a72906A18993O6350a385p3747I8119
12867a1089r3654B85664A7082P3862J61762D1110R483h8021J9031B6813O1487
12856H8300J88048m2011E6107k5933a65324G4045a53606B25421c13695A00656
12845G0976a70169D93580k35089m0830a72684E051a27144j09017f3248B21708
12834C56228a25668B08421a02500J6102B25543a13678l30760G550a73226I5420
12823A85859D7765a70652A78688A2228J44486h9271g142B19152q1820K9933N562
$$ y = [175921, -195374, 330448, -29788, -280873, 178229, 152691, -98301, -133802, -85909, -17767, 235289, -67970, -21545, 260228, -405560, 98388, 115470, -160334, -335143, 81522, 62981, 312096, 61659, -356370, 353262, -183472, -120768, 154775, 20273, -172906, 118993, 185343, -1385, -75132, 98119, -11089, -104743, 285664, 17082, 90944, 252706, 41110, 50593, -88021, -68990, 26813, 88300, 276348, 234337, 56107, 30174, -165324, 74045, -153606, 225421, -313695, 100656, 70976, -170169, 493580, 258491, 217661, -172684, 5051, -127144, -236161, -63248, 221708, 356228, -125668, 208421, -102500, -86398, 225543, -113678, -444438, 7550, -173226, 95420, 185859, 47765, -170652, 178688, 12228, 156714, -89271, -7142, 219152, 137332, 167265, 172827]
12812A72827a15599H5495a16797J4477B2293c8351m06231B55494a83161A03409
12801c05266C0155J28866O4001a91403b4937D47157B0021b93122B01002J1826
12791B12828o990C8514J98698f7987F7373a10021A63068e0480m5608l01036B31564
12779C82495A76549P245n8063b76394p9624J05282a06642J3054j02128d4659B97101
12767f2896a1757A44449b48389e2340B81971b5222k84886a40561j54230c3331
12756a19681H6206b7776k9175m0940k21074c309E9023a4954E3920b36913H3291
12744A30102c07059J08154b7494D35126d8451k75308G3151e184c15F0774J15693
12733A76467e4018p7107B85568a12547b9787A4954K24080c1730k6054j83764E75085
$$ y = [172827, -115599, 85495, -116797, -102320, 22293, -38351, -444582, 255494, -183161, 103409, -305266, 30155, 159021, 223022, -191403, -24937, 447157, 20021, -293122, 201002, 212828, 205838, 38514, 237212, -67987, 67373, -110021, 163068, -50480, -96088, -397124, 231564, 382495, 176549, 183794, 125731, -276394, -356018, -250736, -106642, -93588, -195716, -44659, 297101, -62896, -11757, 144449, -248389, -52340, 281971, -25222, -310108, -140561, -294791, -33331, -119681, 86206, -27776, -56951, -97891, -318965, -3309, 59023, -14954, 53920, -236913, 83291, 130102, -307059, -198905, -27494, 435126, -48451, -323759, 73151, -5184, -315, 60774, 176467, -54018, -131125, 285568, -112547, -29787, 14954, 239034, -31730, -57784, -241548, 575085]
12721D3206L6854g6222A7786H629N4779c7013B26483B1983c8471A31673a10265
12709g9069B65564H5808l2530K92949A07065K38957a9772Q857l22524Q0459b747
12697E4731b20740a06551k10521G8997Q7617N0160D0622a11650j69592d2623k05597
12686b48220p064B73322j13363J33472c07490A07451c38660F4274J11614N7505
12676B33393J6607B354K08873k0757a27188D2934a5694B67073A02843K59336i2367
12664C53954a0308m873r4523B57900A08687M437K40513D5721g6059A02190A6439
12652G1342a50016B92030q7808J1374a00727l0926d326j64939j09158A00500O1916
12641A62416G7452Q2283b10303A07153g7917K4273A15061M18752a13689n077N3638
$$ y = [43206, 80060, -76222, 17786, 8629, 63408, -37013, 226483, 21983, -38471, 131673, -110265, -79069, 265564, 85808, 53278, 346227, 107065, 346022, -19772, -10915, -333439, -252980, -2747, 54731, -220740, -106551, -317072, 78997, 166614, 216774, 40622, -111650, -281242, -42623, -248220, -255284, 273322, 159959, 293431, -307490, 107451, -338660, 64274, 175888, 233393, 250000, 2354, 211227, 190470, -127188, 42934, -15694, 267073, 102843, 362179, -92367, 353954, -10308, -15181, -109704, 257900, 108687, 113124, 353637, 45721, -76059, 102190, 16439, 71342, -150016, 292030, 204222, 215596, -100727, -131653, -4326, -169265, -278423, 100500, 162416, 77452, 159735, -210303, 107153, -77917, -53644, 115061, 533813, -113689, -118766, -65128]
12630f5128A00430k8015c9086j45581A24320K37937A69323p6850j8799K5507R4057
12619A93238Q4411H3571O5J62740b50767A13106n923f9477m3039A09670E3242
12607G4098a6479C7197e7538l8163A56440a23095B8511g2775C04840b14528G5939
12595f68n9586A25566j4498J92638j37765A1553b71760D9314b76310B21785B5674
12583G5220j3137b3174j31385A75844C8392J50295L0732B0480J4566K0137a25982
12571d736A06070J16849J10695b8485j06213A42556A5558a53698E8734a57503
12560B22393G1870f6079m0007n3936L1902C270a24188n48A72664o5619D5683J99063
12548B44746e0271G5610J19015a19236A08721N5045a77480B39612l8740b3041
$$ y = [-65128, 100430, 72415, -39086, -184667, 124320, 362257, 169323, 92473, 73674, 99181, 193238, 277649, 83571, 83636, 246376, -250767, 113106, 107183, -69477, -112516, 109670, 53242, 74098, -16479, 37197, -57538, -95701, 156440, -123095, 28511, -72775, 304840, -214528, 75939, -668, -60254, 125566, 111068, 303706, 165941, 11553, -271760, 49314, -276310, 221785, 25674, 75220, 62083, -23174, -154559, 175844, 38392, 188687, 219419, 20480, 35046, 55183, -125982, -4736, 106070, 222919, 333614, -28485, -134698, 142556, 15558, -153698, 58734, -157503, 222393, 71870, -66079, -106086, -160022, -128120, 3270, -124188, -124736, 172664, 107045, 45683, 244746, -50271, 75610, 194625, -119236, 108721, 163766, -177480, 239612, 200872, -23041]
12537G1350J57887M441c3014E908K4614a71737C6404a40678K8162C1809P9738
12526A11547a93034j03452l6142a26331G5574a51494D8110d7671A18804f9690
12515b04206Q9115C79914C3166a56097R782A7980I16L2140f4824A54885g9200
12503F7527b11950E3143g2993A93987c06513J04165A04218a24214l3683A29913
12492F1367R5353a40234B4808a47296I4901a23361E8221J48709h3371B07959A6357
12480C3357a97544C11763C3750b37469A32941b22109B9548b7199k0185A82013
12469b72863G0282c49813C06920d3336k1579j95239i8681L2381A28376c6835C299
12457a16088j13454F8909K9672a80653A24612J04841I0675a62863H6390a1125
$$ y = [71350, 229237, 233678, -33014, 5908, 30522, -171737, 36404, -140678, -112516, 31809, 111547, -193034, -296486, -332628, -126331, 75574, -151494, 48110, -47671, 118804, -69690, -204206, -115091, 379914, 33166, -156097, -146315, 17980, 916, 33056, -64824, 154885, -79200, 67527, -211950, 53143, -72993, 193987, -306513, -202348, 104218, -124214, -157897, 129913, 61367, 156720, -140234, 24808, -147296, 94901, -123361, 58221, 206930, -83371, 207959, 16357, 33357, -197544, 311763, 33750, -237469, 132941, -222109, 29548, -27199, -47384, 182013, -272863, 70282, -349813, 306920, -43336, -64915, -260154, -98681, -66300, 128376, -36835, 3299, -116088, -229542, 68909, 98581, -180653, 124612, 229453, 90675, -162863, 86390, -11125]
12446b50392L5195B4653b92779D66533e1889l09062A26049a30416j6988M0256
12436a07148k20750a22697F6863k815i6970j38416A10537b26825L8835A58041
12425A25096L9520b50794A65002a8084M673j10080D2178R75J86075c9177j42454
12414a81631c9613A65610A124J03241a31941A35931h3315j89092C75481d300k01627
12403b05927D4434b39048c9777A81011E4517a30731N2965a126j8302E5439a77313
12391C42116j22466f5514I484Q1578J26967J17777j39995D2141a06585A49264
12380E2683b41087B31062O230a66742D19920N194a241q4312K3110K3809A5992
12368F2702b3253F0344d0895l00784c2375q1659d4200l74346i4840k31563J40669
$$ y = [-250392, -215197, 24653, -292779, 466533, -51889, -360951, 126049, -130416, -147404, -107148, -327898, -122697, 66863, 64048, -96970, -235386, 110537, -226825, -187990, 158041, 125096, 164616, -250794, 165002, -18084, -13411, -123491, 42178, 43153, 229228, -39177, -181631, -39613, 165610, 1124, 104365, -131941, 135931, -83315, -272407, 375481, -4300, -205927, 44434, -239048, -39777, 181011, 54517, -130731, -77766, -1126, -19428, 55439, -177313, 342116, 219650, -65514, 9484, 91062, 218029, 335806, 195811, 42141, -106585, 149264, 52683, -241087, 231062, 237292, -166742, 419920, 425114, -1241, -85553, -62443, -38634, 15992, 62702, -23253, 60344, -40895, -341679, -32375, -114034, -44200, -418546, -94840, -326403, -185734]
12357a85734c0360F0404b39446R2481C19862a09612j20156C27166E8174c20670
12346C74965A28115e5689b623A92976L1786a01629K5376F1195n332L81546l1661
12335D05748j82653h0994k0349B10733p9596a20178C92085A95920P1062J92M2069
12324C09243A907a5169I5046b98711C36362a6968j7487n128A9191K48317J1172
12313B78680q2937Q7968Q0265C2731N353J76829c38778E2191a54674C16675n2261
12302B64414H1365K02666A19532R9890E7330J60694f9375n9552F335N5760a56363
12290A6966J10952M4744i9202A66668p8480R0531c9281A21071f8658H0283l023
12279G7260R1204O669D1564J76890P3581N7604J96598B01888a08963A28428A3391
$$ y = [-185734, -30360, 60404, -239446, -146965, 319862, -109612, -229768, 327166, 58174, -320670, 374965, 128115, -55689, -2623, 192976, 224762, -101629, -76253, 61195, 55863, 437409, 405748, 223095, -80994, -101343, 210733, 131137, -120178, 392085, 195920, 266982, 267174, 309243, 1907, -15169, 95046, -298711, 336362, -16968, -34455, -39583, 19191, 267508, 278680, 195743, 283711, 363976, 32731, 38084, 214913, -338778, 52191, -154674, 316675, 264414, 81365, 284031, 119532, 219422, 57330, 218024, -69375, -128927, 6335, 62095, -156363, 16966, 127918, 172662, -99202, 166668, 88188, 178719, -39281, 121071, -68658, 80283, 77260, 168464, 175133, 41564, 218454, 292035, 349639, 546237, 201888, -108963, 128428, 13391]
12267A50756k1395p736K7734F6084d2662A43429J60348K0385b5857A98019C0474
12255B2476a07899A37237b05165j39756A21431r668K16734Q7679A13904D8414
12244A60735a99809D16349a1480B05080F446a38595J2466D61410A21473M0200
12234A61673p2592b47198H1014l2144J69164o5019h2446A73227L6418o1200a93184
12222E75813a70795D69317j47832I5779R7101o4578K08256A23962J9280K95257
12212D38499E2411a25525A63987Q443J81798J0912l2249a43833B3159L15150j54531
12201A83778q7444k5256g9852j263F25257p9659k34999K4545L6332a19948e5513
12189B72152A5428N2024Q2071K33018a22825E0191K88706A22860O2612b9097C83839
$$ y = [150756, 129361, 121625, 149359, 66084, -42662, 143429, 303777, 324162, -25857, 198019, 30474, 22476, -107899, 137237, -205165, -344921, 121431, 111763, 328497, 416176, 113904, 48414, 160735, -199809, 416349, -11480, 205080, 6446, -138595, -126129, 461410, 121473, 161673, 89081, -247198, 81014, 48870, 218034, 153015, -82446, 173227, 209645, 148445, -193184, 575813, -170795, 469317, 321485, 95779, 192880, 128302, 336558, 123962, 143242, 438499, 52411, -125525, 163987, 172430, 354228, 365140, 332891, -143833, 23159, 338309, 183778, 96334, 71078, -79852, -81115, 625257, 545598, 310599, 335144, 371476, -119948, -55513, 272152, 15428, 67452, 149523, 382541, -122825, 50191, 338897, 122860, 185472, -29097, 383839]
12177A05619a26593A08793n2538N2745Q4150Q9654r0893K11597j89128Q1096n9445
12166B36031l1416q0455J6975b7719B71777N7104j16943J97183a75875C9785R5425
12155A35210K40280a21840A79672J20842J5712A36628O567E4348a74009j99911
12145c73920A81043J3699f9237k8039G4141Q894a7309I5752d316C0398a00470
12133B62518d80981C38771h8350B33994i1588r819M3882C59661A31039C0097Q1985
12122A12082Q8728O6179l3013M0261B2921b89233F7503L03865o8871G7882J56563
12111B34445e3526C19967l2569d6680B00428p6851a57545j23517g656j52817A73668
12099f8588q3122B99311A31655f402I8658N6154a54006F3315g9966B25167i4565
$$ y = [105619, -126593, 108793, 56255, 109000, 193150, 282804, 191911, 403508, 214380, 295476, 236031, 204615, 124160, 141135, -27719, 271777, 328881, 211938, 409121, -175875, 39785, 135210, 375490, -121840, 179672, 300514, 316226, 136628, 143195, 54348, -174009, -373920, 181043, 194742, -69237, -97276, 74141, 83035, -17309, 95752, -4316, 30398, -100470, 262518, -480981, 338771, -88350, 233994, -91588, -101407, -57525, 359661, 131039, 30097, 112082, 200810, 266989, 233976, 274237, 22921, -289233, 67503, 371368, 302497, 77882, 234445, -53526, 319967, 287398, -46680, 200428, 123577, -157545, -281062, -7656, -160473, 173668, -68588, -151710, 299311, 131655, -6402, 98658, 154812, -154006, 63315, -79966, 225167, -94565]
12087A5346J921M92179A93118I2682N1113b2852L556D14970A84199f6108B40807
12075g5024m8265L3136q529A85786K6927E8899J9471J40037e489A31321a6491
12063a5944C84394A87733B405K30200j15275K9684k2469N3024J51018a08143C18234
12051a32613A35336B6893N1300f5886C07960J06418I0164g728l4750j50002K7610
12040a64870H2513c7232h036k95296A69562a06378j13587G0869J62157b16771
12029A45195d1020A15290h9098j26235K5853a0313A63032b3449J1160B16674i9682
12017A74689G1460a428A29273d2084C0305J05028A6839P0405l6138A3871K53066
12006B66937q8729O1908i6817B59349G6211j0762Q1097g5396j2642D9356b86917
$$ y = [15346, 17267, 509446, 193118, 92682, 143795, -22852, -19296, 414970, 184199, -66108, 240807, -75024, -123289, -90153, -98682, 185786, 212713, 58899, 78370, 218407, -5489, 131321, -16491, -15944, 384394, 187733, 2405, 232605, 117330, 147014, 124545, 177569, 328587, -108143, 318234, -132613, 135336, 26893, 78193, -65886, 307960, 414378, 90164, -7728, -42478, -192480, -164870, 82513, -37232, -8036, -303332, 169562, -106378, -219965, 70869, 233026, -216771, 145195, -41020, 115290, -89098, -215333, -189480, -10313, 163032, -23449, -12289, 216674, -99682, 174689, 71460, -1428, 129273, -42084, 30305, 135333, 16839, 87244, 51106, 13871, 266937, 178208, 240116, -96817, 259349, 76211, 65449, 146546, -75396, -88038, 49356, -286917]
11994e649j40870L2109B54855b43975R6274I4269g9390D3694P2197a23610A60101
11982b69615J33303j93799d1112R472G0483J23501c11697A87015i3388H1005a32196
11970E3141J14926h945o5664a5541l20040a42018O6433k5505p297l1555B08051
11958B16503a57141H7997a19560A58705b25130a2474j79862C3736b97826a2549
11947D2981K10384e5249G1513h079m0813C8578n33J17107m5689m2683a96640h8605
11934A27834c6429j78815c8992q3862C2301M16a62261A54983k3926j4711N6218
11923A72564a35150p2588O628j0695l9667a17866m3618A67992Q0066b12525E8404
11911a30043A47184n3109O1277f971l51280G2113K11009A9368d55G3854M3968
$$ y = [-5649, -146519, -114410, 254855, -243975, -147701, 94269, -79390, 43694, 115891, -123610, 160101, -269615, -136312, -330111, -41112, -31640, 70483, 193984, -311697, 187015, -93388, 81005, -132196, 53141, 168067, -8945, -74609, -15541, -335581, -142018, -75585, -101090, -108387, -139942, 208051, 216503, -157141, 87997, -119560, 158705, -225130, -12474, -192336, 33736, -297826, -12549, 42981, 253365, -55249, 71513, -8079, -48892, 38578, 38045, 155152, 109463, 66780, -196640, -88605, 127834, -36429, -215244, -38992, -122854, 32301, 32717, -162261, 154983, 131057, 116346, 172564, -135150, -207738, -201110, -211805, -251472, -117866, -161484, 167992, 248058, -212525, 58404, -130043, 147184, 94075, 155352, -6971, -358251, 72113, 283122, 19368, -455, 73854, 117822]
11900A17822l8899a13182A39569J4854b69451H0141h4789A39692b36480a05979
11889B5597b3969r6058A95873b73782a07445d3254j44425j41994G2066A8620c65312
11877C08432B3249d11589a58099j7588b564l95166a32218n0431M4749q7030C10067
11865D75071F4685i3203p4267j9586l2668h3687j97209i3512b1621n663E7323
11853b1026B30594I0670b54904A10065b23002H324J32090C3221a03551l5582j39047
11842b78180C7280b41905J16746A42637g000A9603K8935a54445n5742b193A6932
11830B02655r2765i427A83280a9602n2310k5002L2929n4780C6074a62294c4675
11818g3733n7562k7823I2850f9910l6103l6728B34479b9980F4344a01567J3901
$$ y = [117822, 78923, -113182, 139569, 154423, -269451, 80141, -84789, 139692, -236480, -105979, 25597, -23969, -120027, 195873, -273782, -107445, -43254, -187679, -329673, 72066, 18620, -365312, 308432, 23249, -411589, -158099, -175687, -2564, -397730, -132218, -182649, -137900, -224930, 310067, 475071, 64685, -93203, -167470, -187056, -219724, -83687, -280896, -93512, -21621, -27284, 57323, -21026, 230594, 90670, -254904, 110065, -223002, 8324, 140414, 33221, -103551, -139133, -278180, 37280, -241905, -125159, 142637, -7000, 19603, 48538, -154445, -210187, -2193, 16932, 202655, 109890, -9427, 183280, -19602, -71912, -96914, -63985, -118765, 36074, -162294, -34675, -73733, -131295, -159118, 92850, -69910, -106013, -142741, 234479, -29980, 64344, -101567, -87666]
11807h7666j3370A28544J3748J90700l7078a9606m9896a1813j2354j15062L0506
11796a08723M7361o0782B71672g1262C4850b21773A37703a21135K0217A8369a42848
11784c28190f2548j27317A8053J07846L8108c6334j85905Q1972K753A2125J79619
11773A91744g9336A107P1507a77874G8677H938a62439a9893D4742h2623J6623
11762f6000j91419A24939a51035J3443P200I0885J52210a42274G5909e1350k0531
11751g1881p4922j3113G9773b854A80690J01243b68436c1959k12928J16160a0894
11739C36253b72397B19899p1908a11845D8955a82459B10542R8620a56079A377
11728A91672a22752C0996J29850a29685j33607E0959L2496k79K6483Q7418n1614
$$ y = [-87666, -101036, 128544, 142292, 332992, 295914, -19606, -69502, -11813, -24167, -139229, -108723, -61362, -122144, 271672, -71262, 34850, -221773, 137703, -121135, -100918, 18369, -142848, -328190, -62548, -189865, 18053, 125899, 164007, -36334, -222239, -140267, -137514, 12125, 191744, -79336, 1107, 72614, -177874, 78677, 8938, -162439, -19893, 44742, -82623, -66000, -257419, 124939, -151035, -137592, -130392, 90885, 243095, -142274, 75909, -51350, -71881, -146803, -159916, 79773, -2854, 180690, 281933, -268436, -31959, -244887, -128727, -10894, 336253, -272397, 219899, 147991, -111845, 48955, -182459, 210542, 309162, -156079, 1377, 191672, -122752, 30996, 160846, -129685, -263292, 50959, 83455, 83176, 109659, 197077, 145463]
11717A45463M1477D8738A3003J90895I8606Q426g1450D40821j81282b52840d1417
11705a60364A0282L5231R2512c22487J55698A02585a68613L6313J1497A43957
11694a98636B66343q7969a57369C71163a65693A1996J6991N9782K5387K07174
11684C21330a90663A37095Q5614d2487p6306A94365F7818J97003R5165j27474
11674B32512L6498e8337m4843D6419J02956o9354f5542n1365c1688j60902A35804
11662d8515D6790B1308j212b15742A23771j8106f9949B36239g0157l4783A21544
11650E8140J17922M7476J8977q9811a37955A06751g5160C52945G2098b7385F5960
11638B63073f7345C5790i2742l1615d1878q250j94222E9664a8567D82550A48258
$$ y = [145463, 186940, 48738, 13003, 203898, 98606, 107032, -71450, 440821, 259539, -252840, -41417, -160364, 10282, 45513, 138025, -322487, -166789, 102585, -168613, -132300, -120803, 143957, -198636, 266343, 178374, -157369, 371163, -165693, 11996, 28987, 88769, 114156, 321330, -190663, 137095, 222709, -42487, -118793, 194365, 67818, 264821, 359986, 232512, 269010, -58337, -103180, 46419, 149375, 80021, -65542, -116907, -31688, -192590, 135804, -48515, 46790, 21308, 20096, -215742, 123771, 105665, -69949, 236239, -70157, -104940, 121544, 58140, 176062, 223538, 242515, 152704, -137955, 106751, -75160, 352945, 72098, -27385, 65960, 263073, -67345, 35790, -92742, -124357, -41878, -50128, -244350, 59664, -18567, 482550, 148258]
11626a87697M3295B10649D9812K84723b97022J13326B5002d1176A87693E4015
11615b79740d5050C62124a91025D8974a96096j47827B12944a8081l2584C23150
11604G5031d8507M978A97968c13505f2726A44176c38452A76673D6481A2793c94810
11592B18291a08152A90338I3358e6446F815J45045a38176C1128c1322o5085B10163
11580C87765a03189G5281d12466A64458g8601k34445C6620g6806j30545F5485
11569A28087B2457J46227l2819F6379K38380A26442b9970A4780J39370F8748B3549
11557H0655K02119a93382C87341h9995j02099B12281a59572f2968b1568j82813
11547b04381H6812J86800B5785a67073A67558a6850e942B8096I825d6935B13437
$$ y = [-187697, -144402, 210649, 49812, 334535, -297022, -183696, 25002, -41176, 187693, 54015, -279740, -45050, 362124, -191025, 48974, -196096, -343923, 212944, -18081, -50665, 323150, 75031, -48507, -43529, 197968, -313505, -62726, 144176, -338452, 176673, 46481, 12793, -394810, 218291, -108152, 190338, 93358, -56446, 6815, 151860, -138176, 31128, -31322, -96407, 210163, 387765, -103189, 75281, -412466, 164458, -78601, -313046, 36620, -76806, -207351, 65485, 128087, 22457, 168684, 135865, 66379, 304759, 126442, -29970, 14780, 154150, 68748, 23549, 80655, 282774, -193382, 387341, -89995, -192094, 212281, -159572, -62968, -21568, -204381, 86812, 273612, 25785, -167073, 167558, -16850, -5942, 28096, 9825, -46935, 213437]
11535A92810i7544k67567G1864i3056C44975b58660A03917a37658B76227l468
11525B72759R6939F6231B8735a60140B3858b2367A13689D8118L02700b21124G9461
11513b3313A17004b16357f7520k34204A47823K44037A05033c6343a61E97555A46550
11501a92156M7107B005Q8887Q8526K3858d0263k10882A0155J92129c8069F7694
11489a38022B11767a16904A3149K27139a4146D1651K24747d14726B87666E0914
11478C11759f9408b3974G1825q559g0816D7275J34964J42470j53610c4773B01969
11466e5328B06332G2545B3076L3563K31071o3059G3351R7701o1000M26385k68192
11455B68245n7970H9789J34584B2767f3247B78675e6895G7802a12382A78732j7355
$$ y = [192810, -97544, -365111, 71864, -93056, 344975, -258660, 103917, -137658, 276227, 272759, 369698, 66231, 28735, -160140, 23858, -22367, 113689, 48118, 350818, -221124, 79461, -23313, 117004, -216357, -67520, -301724, 147823, 391860, 105033, -36343, -161, 597555, 146550, -192156, -145049, 2005, 90892, 179418, 203276, -40263, -251145, 10155, 202284, -38069, 67694, -138022, 211767, -116904, 13149, 240288, -14146, 41651, 266398, -414726, 287666, 50914, 311759, -69408, -23974, 71825, 63266, -70816, 47275, 182239, 324709, 171099, -34773, 201969, -55328, 206332, 72545, 23076, 56639, 287710, 224651, 73351, 171052, 110052, 536437, 268245, 210275, 89789, 224373, 22767, -63247, 278675, -56895, 77802, -112382, 178732, 161377]
11444A61377J4946K6955b97675C2405h6509I8753R8542k7406A5137c0421A53391
11432A77682A4275b2964o0521j58555B8297Q4568a17487i568B28301b215l3034
11421c5249l024k7218G080N1067J65153c41937A6958J34075a75051A07625L31994
11410D39619b32943G0398J27586M4524c15416A59c7008A48140d3062j13557B23371
11398b27360k3159H4659k784B9197f1363j53261C45401a15797F254L84901h9563
11386A20408a37064j12905A18345b22473B31663f5205B2548d118A06172b21490
11375D8971g5478j64748A96181a46489j01555B02320a78339A6290c01538A19734
11364H9330e5836C3809R2650h1048F1506J9254f1997l58482a82462M9537j36599
$$ y = [161377, 176323, 203278, -297675, 32405, -86509, 98753, 197295, 169889, 15137, -30421, 153391, 177682, 14275, -22964, -83485, -242040, 28297, 112865, -117487, -9568, 228301, -2215, -35249, -38273, -65491, 7080, 58147, 223300, -341937, 16958, 151033, -175051, 107625, 439619, -232943, 70398, 197984, 242508, -315416, 159, -37008, 148140, -43062, -156619, 223371, -227360, -250519, 84659, 81875, 29197, -61363, -214624, 345401, -115797, 6254, 391155, -89563, 120408, -137064, -249969, 118345, -222473, 231663, -65205, 22548, -4118, 106172, -221490, 48971, -75478, -240226, 196181, -146489, -248044, 202320, -178339, 16290, -301538, 119734, 89330, -55836, 33809, 126459, -81048, 61506, 80760, -61997, -420479, -182462, -132925, -269524]
11353b69524R0705m9808e5423j20672Q331Q2069L2011A6007a66154I6065l8330
11342E7735b5226n2418c8161j76292P1541I6310J2411A2705a58964A17018g0442
11330A57630a37922l281B11564b0286l46821d4950D5487A4533a34804e256l08417
11319c13673a7145o4614A98611B997K55566L2452B8603h6902m1821C8139K62062
11308C00201A1423c90656J95175I4424A0540O4305J9872K77729a61081D792f7110
11296a94361D5574c04919J00834l20074a12693m2832l12867J99596E6178F785
11285B01395p2102b38146c7135C7839e1160A48049c23513j19582A62891C0819
11274b05263B04889F8850J95594a15841j04642Q247C2954e0059A05376i5312A86119
$$ y = [-269524, -178819, -228627, -55423, -176095, -167764, -85695, -53684, 16007, -166154, 96065, 57735, -25226, -77644, -38161, -214453, -142912, 96310, 108721, 12705, -158964, 117018, -70442, 157630, -137922, -141203, 211564, -20286, -367107, -44950, 45487, 14533, -134804, -5256, -313673, -17145, -81759, 198611, 2997, 258563, 291015, 28603, -86902, -128723, 38139, 300201, 11423, -390656, -195481, 94424, 10540, 74845, 94717, 372446, -161081, 4792, -67110, -194361, 45574, -304919, -204085, -524159, -112693, -155525, -468392, -268796, 56178, 6785, 201395, 129293, -238146, -37135, 37839, -51160, 148049, -323513, -443095, 162891, 30819, -205263, 204889, 68850, 264444, -115841, -220483, -212236, 32954, -50059, 105376, -95312, 186119]
11262B4521a61187G0655b4566A18713l7225b22277K93h993j62067a3396I5826
11250B48697c69706a08646N3601B41927f2525j148A64252K4056c9152j57387A45480
11238b30563P2992j4146e0180K2481B27314G9149a18919d7616a0126A12826c21197
11226H0099B5625f8888o460r1651e9928j25646O8742A0660K59566a85931B58246
11214F9227d39203G9280a66474B65304c3869A81969o7248g5451j37511g8086j55679
11203b33765A03450g6353k3114m8748e1482m2147M6568P283o604A55253b9664
11191b65110J04479c7414q0225q6680K6507b741k39500A29839a42283j10691Q0982
11180a71992b8769k1995q0000D6052d5317A53184a17858d7517r8683D5027N4660
$$ y = [24521, -161187, 70655, -24566, 118713, 81488, -222277, -221984, -8993, -171060, -13396, 95826, 248697, -369706, -108646, -55045, 241927, -62525, -63673, 164252, 188308, -39152, -196539, 145480, -230563, -157571, -171717, -50180, -27699, 227314, 79149, -118919, -47616, -10126, 112826, -321197, 80099, 25625, -68888, -75348, -166999, -59928, -185574, -116832, 10660, 270226, -185931, 258246, 69227, -439203, 79280, -166474, 265304, -33869, 181969, 114721, -75451, -212962, -78086, -233765, 103450, -76353, -99467, -148215, -51482, -93629, -47061, -39778, -46382, 155253, -29664, -265110, -160631, -37414, -117639, -204319, -177812, -2741, -242241, 129839, -142283, -252974, -171992, -28769, -50764, -130764, 46052, -45317, 153184, -117858, -47517, -146200, 45027, 99687]
11169I9687a00680G2276j1907K03634a57176G461a95100B4437i2978k49876A47685
11157C0112a90362c1449G9355a53892j44997J5806L0328A21999A137a49130f6585
11145A30548b49198n334J02118A51571a5136m6664n3061F621J64319B5554b9865
11133B208J57677a57388B18648p2095m3396L84037d26902A7492K71184A27465
11122g1978I7345K2124a50826c5218k7130j92386D9053L24902A65529e0087B74772
11110A16652B9243P1020b53601B93491A02810b26286B29531b17990B79715E8475
11099D5264K49109A13629a57139A16291K1875J79926L853q9202J2589a38788e8720
11087B15376K3338o8781E6184J97299N0230E1277O9217a07405a5056E6563J92365
$$ y = [99687, -100680, 72276, 60369, 264003, -157176, 7461, -195100, 24437, -92978, -342854, 147685, 30112, -190362, -31449, 79355, -153892, -298889, -283083, -252755, 121999, 1137, -149130, -66585, 130548, -249198, -254532, -152414, 151571, -15136, -61800, -114861, 6621, 170940, 25554, -29865, 2208, 159885, -157388, 218648, 146553, 103157, 487194, -426902, 17492, 288676, 127465, -71978, 97345, 119469, -150826, -35218, -62348, -254734, 49053, 373955, 165529, -50087, 274772, 116652, 29243, 100263, -253601, 293491, 102810, -226286, 229531, -217990, 279715, 58475, 45264, 294373, 113629, -157139, 116291, 138166, 318092, 321945, 232743, 245332, -138788, -58720, 215376, 238714, 169933, 56184, 253483, 303713, 51277, 120494, -107405, -15056, 56563, 248928]
11076B48928K42094A11865c4753A78422L0644I0192K08484L0424j08509M0012
11066B60603Q4279a6279B65343b0038B09718N2531J86148o4659J82563q6559q8978
11055C90764P5465O8934J19836J42486p1190l03599m7491J82085J89912k00570
11045E46632R2422k89188M40651r3478j20738O9365p7232j36173M05202C58523
11034D16361p7044M28615k6447J28410B60308K78942q6752J25963B85012J52912
11024D37924r344P2086l2165J00523A43753P03894j00453j60884K5547j80406
11014D31451J40240j25817p5055K03714k22511M27666j85838k40010R5249k15564
11004B33525L30129j36150M25552B34724J65061O9941j38411Q6007J53289j08557
$$ y = [248928, 491022, 111865, -34753, 178422, 209066, 90192, 298676, 329100, 220591, 260603, 344882, -16279, 265343, -20038, 209718, 262249, 448397, 383738, 566301, 479742, 390764, 466229, 535163, 654999, 797485, 726295, 422696, 375205, 557290, 747202, 546632, 639054, 349866, 790517, 697039, 576301, 645666, 568434, 432261, 837463, 358523, 416361, 339317, 767932, 741485, 869895, 260308, 539250, 452498, 578461, 285012, 437924, 428580, 500666, 468501, 569024, 143753, 847647, 747194, 586310, 611857, 431451, 571691, 445874, 370819, 574533, 352022, 779688, 593850, 353840, 449089, 233525, 563654, 427504, 853056, 234724, 399785, 469726, 331315, 417322, 570611, 462054]
10994D62054K41912k72326k0480M06471k50160K83127J32426j98295k39592Q418
10984E53555J85728n7558Q0608O1707J06564q9174n0475L07639j96779M30201
10974A332016L6259j13872M13794K08319J70833M49856j70275P1055l45235K68930
10964B321680j99504p1929j38994q7553r0966J88k1843j76964P8172J20579o5027
10953A667839N11129n75623L47060l84697o09618J61273k04190R0486k55688M2139
10943G90110k42451r9016A42401J85021A28474B7828K47596F6428J98569A7634
10932A48721B8423J62330J07444A37621E7489a50587A08352J67280c5464A58462
10921a69285k8407D61194A52067J01918a9751B8382O3140h7255A34364i2305K4112
$$ y = [462054, 703966, 431640, 411160, 817631, 567471, 850598, 983024, 784729, 545137, 553555, 739283, 681725, 762333, 824040, 930604, 841430, 790955, 1098594, 901815, 1332016, 1368275, 1254403, 1668197, 1876516, 2047349, 2497205, 2326930, 2397985, 2052750, 2321680, 2122176, 2050247, 1911253, 1823700, 1732734, 1732922, 1711079, 1534115, 1612287, 1732866, 1667839, 2178968, 1603345, 1950405, 1565708, 956090, 1117363, 913173, 1003659, 747971, 790110, 547659, 448643, 142401, 327422, 128474, 27828, 275424, 66428, 264997, 17634, 148721, 28423, 190753, 298197, 137621, 57489, -150587, 108352, 275632, -35464, 158462, -169285, -197692, 461194, 152067, 253985, -19751, 28382, 91522, -87255, 134364, -92305, -68193]
10910f8193G9810b43051Q4081B71397d8993m4343A88691q3083f8814j97217a09843
10898B61045I1898c95209B00651k1984a2947C09101F8300b21671C3283J33181
10888A66464a87708D1347L6740d6962A21329r804i3448P544H3363C8827J20266
10877A59093c13808C01716a0737G7720i4619B24194a46611f7623A90002b12335
10866A32895d7071m1854j87322a2223D4127N7876K06575P3522b18936p199A35789
10854h5028G5086b69949B25572m4485f1128B61179A7253K28249A1028J04357L0733
10843A46118d2790B30172E0685F030a90995D30824G7313O2109h9602A25810e7188
10831a00375k11966i7594A49206d0161c997m3022A90946B9187h5913G6394d711
$$ y = [-68193, 79810, -243051, -158970, 271397, -48993, -93336, 188691, 105608, -68814, -266031, -109843, 261045, 91898, -395209, 200651, 178667, -12947, 309101, 68300, -221671, 33283, 166464, -187708, 41347, 78087, -46962, 121329, 111525, -93448, -85904, 83363, 38827, 159093, -313808, 301716, -10737, 77720, -94619, 224194, -146611, -67623, 190002, -212335, 132895, -47071, -88925, -276247, -12223, 44127, 102003, 308578, 382100, -218936, -226135, 135789, -85028, 75086, -269949, 225572, 181087, -61128, 261179, 17253, 245502, 11028, 115385, 146118, -42790, 230172, 50685, 6030, -190995, 430824, 77313, 139422, -89602, 125810, -57188, -100375, -312341, -97594, 149206, -40161, -3997, -47019, 190946, 29187, -85913, 76394, -4711]
10819c8945B98776A0715f8746a3704k56697G9284b07199F9648j0399J09912l4991
10808A34170P8421n4998g5261c1075p7866D4295a34717L9187I2495g2548j15214
10797a87762A95039k2262k4711g6083C9727J78552a16859A98434b36320i9963
10786A46232b33138a04202j92745B96635c43200J21249A24454I062b3113M908
10776a8205p7700B27594a8654l98775B24837a09188A2963K5344L6822M0500c48156
10764a34716A51758e9673D9547c04423N8032A05217L7551a44767b1566C5031R1617
10753A26648D9410e3866A74623b28039Q402m45j09097Q8709G5962C3684h7246
10741e55459C29217a70398q0504J10929A0211B653a53104A43602E2906a95547
$$ y = [-38945, 298776, 10715, -68746, -13704, -270401, 79284, -207199, 69648, 59249, 169161, 134170, 212591, 157593, -75261, -31075, -108941, 44295, -134717, -95530, 92495, -72548, -187762, 195039, 172777, 148066, -76083, 39727, 218279, -116859, 198434, -236320, -99963, 146232, -233138, -104202, -296947, 296635, -343200, -221951, 124454, 9062, -23113, -18205, -95905, 227594, -18654, -417429, 224837, -109188, 12963, 38307, 75129, 115629, -348156, -134716, 151758, -59673, 49547, -304423, -246391, 105217, 142768, -144767, -21566, 35031, 126648, 49410, -53866, 174623, -228039, -219637, -220082, -329179, -240470, 75962, 33684, -87246, -555459, 329217, -170398, -250902, -139973, 10211, 2653, -153104, 143602, 52906, -195547]
10730c17036A21572a07249k71291a34245G7261e2300B63482I0691b76933q736
10720b85669e0078p3486G845O0614a63083d9502m8002C5873J8800a27206h972
10708a41419a1708k33600A03383b4325B61926b32721d5627j78509c2937E6685
10697b00500B02784M8843a47399C9407j9411L93607I2788A219b00733N7617i80
10685a9527D2838M3775f1925k55462a16393A09134b27910B2231J07367m4136d36336
10673I5038D2615a98536j30056P1974i9492k09319C5952R6737l6017b13271N8948
10662a54323j30314B0888a58795K5513A33411b56414H4245a35871j25408j29400
10652c90679a79318C402b60820B0990l761K61896a63581m624I77f5262A68819
$$ y = [-317036, 121572, -107249, -378540, -134245, 77261, -52300, 263482, 90691, -276933, -285669, -50078, -123564, 7845, 68459, -163083, -49502, -97504, 35873, 54673, -127206, -8972, -141419, -11708, -245308, 103383, -24325, 261926, -232721, -45627, -224136, -32937, 56685, -200500, 202784, 251627, -147399, 39407, 19996, 413603, 92788, 1219, -200733, -143116, -980, -19527, 42838, 86613, -61925, -317387, -116393, 109134, -227910, 22231, 129598, 85462, -436336, 95038, 42615, -198536, -328592, -256618, -99492, -308811, 35952, 132689, 96672, -213271, -154323, -284637, 20888, -158795, -133282, 133411, -256414, 84245, -135871, -261279, -390679, -179318, 3402, -260820, 20990, 17229, 279125, -163581, -168205, 977, -65262, 168819]
10640a8092A0931a39360c4814A6702i8504o8342e2391B34544I9407e2659j74354
10629b27013R6815J5659c296k784l69347a66707m2211B37840b39272A9421d4864
10617A926d04005B09674a39586j33825c8533B41838B4974J02147a43513C6451
10606b38448J9745D8645c50924J72924j673B95169b3514r8407j3815j1611e5573
10594I846b19553l6607B64753I3013b0334B66070a31831j75430J22579j54079
10584c38761g024k48419h7662K005k34901D27485a77632L3932j10820B9294J0391
10573C9685l031i293A14714b2308C8418K14676H6070J545B07a62310d3506l333
10561d6839B5747J15182C5027a93199H2122i8950j89193h2134p9259j1829q5881
$$ y = [-18092, 10931, -139360, -34814, 16702, -98504, -166846, -52391, 234544, 99407, -52659, -227013, -130198, -114539, -3296, -6080, -375427, -166707, -208918, 237840, -239272, 19421, -44864, 1926, -404005, 209674, -139586, -273411, -38533, 241838, 24974, 127121, -143513, 36451, -238448, -218703, 48645, -350924, -178000, -179673, 295169, -23514, -121921, -135736, -147347, -55573, 9846, -219553, -256160, 264753, 93013, -20334, 266070, -131831, -307261, -184682, -338761, -7024, -255443, -87662, -85657, -320558, 427485, -177632, -143700, -254520, 29294, 39685, 36654, -9293, 114714, -22308, 38418, 253094, 86070, 87615, 207, -162310, -43506, -46839, 25747, 140929, 35027, -193199, 82122, -98950, -288143, -82134, -161393, -173222, -259103]
10550b59103m8867d303m30440D0448i8827n2739A39482a50307D3735B1295c8002
10538h579j04809M8517r8856O4122o2813O3823r3417j13451e859n1387o3073A81916
10525I2072A1792a26978H0000a94670G7881J59566b90526A6722a67889M9654j7239
10514a35474A11768J66894b25784b3673j44467g7503d708m38367B60313c61622
10503B06498b90760E4975d02363A82546a62303j87430A08264b60814G7869L2014
10493A09883C4126K56207b84693e129I4736f6786j08603j51444A40648c1290B01695
10481a35812O817a4622n2516B7235J81989a54802H8421J40119c810I7003K28038
10470C25041a4054l6854A74007b53066a17591B36709A1751K48917D6552g099k14722
$$ y = [-259103, -307970, -4303, -434743, 40448, -98827, -151566, 139482, -150307, 43735, 21295, -38002, -8579, -113388, -64871, -163727, -99605, -162418, -98595, -192012, -305463, -5859, -57246, -120319, 181916, 92072, 11792, -126978, 80000, -194670, 77881, 237447, -290526, 16722, -167889, -118235, -135474, 111768, 278662, -225784, -23673, -168140, -77503, -4708, -443075, 260313, -361622, 206498, -290760, 54975, -402363, 182546, -162303, -349733, 108264, -260814, 77869, 109883, 34126, 290333, -284693, -5129, 94736, -66786, -175389, -326833, 140648, -31290, 201695, -135812, -128995, -14622, -67138, 27235, 209224, -154802, 88421, 228540, -3810, 97003, 325041, -14054, -50908, 174007, -253066, -117591, 236709, 11751, 260668, 46552, -7099, -221821]
10459b21821A92567J76149f0248J9213B40344a9492m7086r8619A57139C5951N4287
10448I0238a20862j27722E7324K33182F8265B8143a99855e0619j88949B9897b22431
10436B72556a33411l6011j91410B0616R564J88289H3923Q4087b9575B04730c41869
10424a45671J8102p1223j55191A68609a8260n23861c2927J0097o3635k39974J14007
10413b12432G0726K13992a79102G0363J35853r4996a76919g1222A27718C8639
10402a6725l9343A5327a16165k62733a19806j5016n6778e1548A00906a6095A03143
10390C0170J18100c8780A50866N5502a27641A43152h5594A77293m4326i2B28480
10378A03787a96559B71105a64129O9535A18319L79016C3039L1232d9009D45343
$$ y = [-221821, 192567, 368716, -60248, -41035, 240344, -19492, -66578, -165197, 157139, 35951, 90238, -120862, -248584, 57324, 290506, 68265, 28143, -199855, -50619, -239568, 29897, -222431, 272556, -133411, -169422, -360832, 20616, 30180, 218469, 83923, 168010, -29575, 204730, -341869, -145671, -127569, -198792, -353983, 168609, -18260, -542121, -32927, -22830, -86465, -326439, -212432, 70726, 284718, -179102, 70363, 206216, 111220, -176919, -71222, 127718, 38639, -16725, -56068, 15327, -116165, -378898, -119806, -134822, -191600, -51548, 100906, -16095, 103143, 30170, 148270, -38780, 150866, 206368, -127641, 143152, -85594, 177293, 132967, -92, 228480, 103787, -196559, 271105, -164129, -94594, 118319, 497335, 33039, 64271, -49009, 445343]
10367G3842B5303i5910A45248P9930K06501p892J19850k14219j09077A05817J11708
10356B17525H037L60701a91258B95633F8689K02538J16051L4272l4191j54634
10346B32725Q1863j26408c6037j54930H8201N29308j06210F0041K65259l551A8014
10334C65691j29415A7281L50704D3231K0769a08522B43862J11D6234h210A2399
10322A90141c4546B03019l8297G3447O9172k059A3931f5836D3052L8934M7752
10311A29738a25595B01111n8953n0331b54931F7358K29194a74661D9435J39937
10301A89372J74185C7124J0308g1915I0895e9412P153k9087C57913a35574m6793
10290a82367C99164j63526b32334A36580C4193g7335b9268k7322B32514b97027
$$ y = [73842, 25303, -95910, 145248, 225178, 431679, 423787, 543637, 329418, 220341, 105817, 217525, 8037, 368738, -191258, 295633, 68689, 271227, 387278, 421550, 387359, 232725, 314588, 188180, -36037, -190967, 88201, 617509, 511299, 60041, 325300, 321749, 18014, 365691, 236276, 17281, 367985, 43231, 64000, -108522, 243862, 243973, 46234, -8210, 12399, 190141, -34546, 203019, 164722, 73447, 142619, 140560, 13931, -65836, 43052, 81986, 129738, -125595, 201111, 142158, 91827, -254931, 67358, 296552, -174661, 49435, 189372, 363557, 37124, 47432, -71915, 90895, -59412, -52259, -81346, 357913, -135574, -182367, 399164, 235638, -232334, 136580, 34193, -77335, -29268, -56590, 232514, -297027]
10279a40909N8602j12755e1267q2006d6965C5336L1688b13085F8300J83488I9075
10267A77820g9258B85454a4687C8225d0903j26055P8885C28670i6780K9746j65798
10256b32832f262D273J31413L56148b5023I6476L30911j69766I6107H535b69759
10244A53835K32169b16280Q0880L7272e447n6710K4557A12472f6095a3991l3561
10233d7552j20933B79170a10938B38309J01741d4846A78901E6086B6884h2104
10222i5672E1038e2466j0226j48372B67143r2893c33666J64368A41727b33750
10211c85415F2612c4245C2856J57803c1707j98263H1882J08997J21549A01386
10200c68980B05795C1862b34947O9815B21352a06581j19976j40626c1724j4633
$$ y = [-140909, -82307, -195062, -51267, -133273, -46965, 35336, 67024, -213085, 68300, 251788, 99075, 177820, -79258, 285454, -14687, 38225, -40903, -166958, -88073, 328670, -96780, -67034, -232832, -6262, 4273, 135686, 491834, -25023, 96476, 427387, 257621, 96107, 8535, -269759, 153835, 386004, -216280, -135400, -98128, -5447, -62157, -37600, 112472, -66095, -13991, -47552, -168485, 279170, -110938, 238309, 340050, -44846, 178901, 56086, 26884, -82104, -95672, 51038, -52466, -62692, -211064, 267143, 174250, -333666, -169298, 141727, -233750, -385415, 62612, -34245, 32856, 190659, -31707, -229970, 81882, 190879, 312428, 101386, -368980, 205795, 31862, -234947, -165132, 221352, -106581, -226557, -367183, -31724, -46357]
10190d6357j19611b2248k15441P8841r7688a13222B00322A62b8817j28061o3857
10179b20735N5043C43774b97811B25813B7606c19389B97093B90M24654a34898
10168b27329d7169p6728j16834A09042b15910Q5812J0391j31307N5507l3671J12387
10157a16791M8968c133l86778b4010n3780B9164A1245a03071L6011k38654A28188
10145h8958m933M5065j75902C9637d9341k31229A31687g3940a8948j13170q6817
10134b18935a00417l18089A22490a58958A77993a33403b2350B6640a55909D0908
10123b65575J08953k0554b2601A27261a6464k66846B19609a2076k68096l3965
10113c14137A33196f5794m3007p3953A68039a6443j30245e932l4774A31172a35816
$$ y = [-46357, -165968, -22248, -237689, -158848, -256536, -113222, 200322, 162, -28817, -156878, -220735, -165692, 343774, -297811, 225813, 27606, -319389, 297093, 290, 424944, -134898, -227329, -47169, -123897, -240731, 109042, -215910, -130098, -119707, -251014, -195507, -229178, -116791, -67823, -3133, -389911, -24010, -77790, 29164, 11245, -103071, -67060, -305714, 128188, -88958, -93891, -48826, -224728, 39637, -49341, -280570, 131687, -73940, -18948, -132118, -218935, -100417, -418506, 122490, -158958, 177993, -133403, -22350, 26640, -155909, 40908, -265575, -156622, -177176, -22601, 127261, -16464, -283310, 219609, -12076, -280172, -314137, 133196, -65794, -108801, -182754, 168039, -16443, -146688, -5932, -40706, 131172, -135816]
10101A20399b53214A51653a12774j07329B03492h0466j7261B36017G5393d4474
10090F3252a83587j65874b5035j50475D59509C243J51052a63038d9225A72792
10079I2427c21089F2770b68888O7730j63608L0366J02951B17650r4215a86265
10068c72384d4318n4623n4610L1115j9761A07169B3045C637b4993p2612q9019
10057a86624A46982b42180f1706A34776a8768j17331b672j00508L6705l0686A6248
10045B9273h2588d422A71290I293J7245O6835j400a01745b1142r3158C0836K09083
10033B39919a82673A20050J15165C1194b07172O7164K7543A33811a13766k43063
10023c56829d2881n41043b47536G7413b0756F0821b16496R6303j32742H4292a40594
$$ y = [120399, -253214, 151653, -112774, -220103, 203492, -80466, -97727, 236017, 75393, -44474, 63252, -183587, -349461, -25035, -175510, 459509, 3243, 154295, -163038, -49225, 172792, 92427, -321089, 62770, -268888, -201158, -364766, -334400, -231449, 217650, 123435, -186265, -372384, -44318, -98941, -153551, -122436, -142197, 107169, 23045, 3637, -24993, -97605, -186624, 146982, -242180, -61706, 134776, -18768, -136099, -2672, -103180, -66475, -97161, 16248, 29273, -82588, -4422, 171290, 9293, 26538, 93373, 91973, -101745, -21142, -114300, 30836, 239919, -182673, 120050, 235215, 31194, -207172, -140008, -112465, 133811, -113766, -356829, -42881, -583924, -247536, 77413, -20756, 60821, -216496, -120193, -252935, 84292, -140594]
10011B49914E9623a756l48105Q5859J7754Q8763n833B2711i3293c2981A1528a22949
9998c5667j18271j63685a2221j40576k44369D3231A7034K91646C7806r103L02026
9987C30729h6587q9801E5507B5391c499k67657B78823d2604B39325b09891j13514
9976c23405a20445K7149k51382A04199k0712a62648j46848A58114c0520I5203
9965H7453Q0573f1729g105I6007L2255J07285b49186O565n4780n205B58562G897
9952a89053A09906A7733b05767M2145G363i065A88626a12106e4290A51326C6095
9940f6737k9125k51218D242K6073b03121Q1131k684A0701d18271B96737b20399
9928a01389j33388f6721A04054a32616g017k80794A02952j6348A8770K10633n8727
$$ y = [249914, 59623, -1756, -349861, -264002, -246248, -157485, -163318, 22711, -93293, -32981, 11528, -122949, -35667, -153938, -317623, -12221, -152797, -397166, 43231, 17034, 308680, 37806, 28703, 330729, -86587, -176388, 55507, 25391, -3499, -271156, 278823, -42604, 239325, -209891, -323405, -120445, -93296, -344678, 104199, 83487, -162648, -309496, 158114, -30520, 95203, 87453, 168026, -61729, -7105, 96007, 128262, 235547, -249186, -242621, -297401, -302606, 258562, 7897, -189053, 109906, 17733, -205767, -163622, 7363, -9065, 188626, -112106, -54290, 151326, 36095, -66737, -95862, -347080, 4242, 30315, -203121, -121990, -124674, 10701, -418271, 296737, -220399, -101389, -234777, -66721, 104054, -132616, -7017, -287811, 102952, 86604, 18770, 229403, 170676]
9917A70676n95e3827j7507k15178A63137M9184b69667A22180a82125Q5444K2617
9906g4064L203A41985b52495B99451e10489a78866K9767j6725E39518a08888l12815
9895d21703A99665b54787d0452A24769i9079o8374O5485J7659G2354L7109b20973
9883e5731B99539a16707A07486b27510F8884c48254J10126a439q4433b8128l87874
9872d16002J93622b7480j71100l4782f373k28902J01915j8083l284d7085B29631
9860B438h8760l28325g4015j30448H9996a92711B04642C2072a57974k14542A33956
9848a67126L2052k54957N3918A17630e3317J3947A12931c24973a29432k7669j4491
9837a71592A37425i6869J1892p1472O9262L872I8501c59274a76202B0648a77846
$$ y = [170676, 170081, -53827, -71334, -286512, 163137, 212321, -269667, 122180, -182125, -96681, -74064, -70861, 141985, -252495, 299451, -510489, -178866, -149099, -165824, 539518, -108888, -421703, 199665, -254787, -40452, 124769, -99079, -167453, -101968, -84309, 72354, 109463, -220973, -55731, 299539, -116707, 107486, -227510, 68884, -348254, -238128, -1439, -85872, -28128, -416002, -222380, -27480, -198580, -233362, -6373, -235275, -133360, -151443, -154727, -47085, 229631, 2438, -88760, -417085, -74015, -204463, 89996, -192711, 204642, 32072, -157974, -372516, 133956, -167126, -135074, -390031, -336113, 117630, -53317, -39370, 112931, -324973, -129432, -157101, -171592, 137425, -96869, -84977, -156449, -87187, -83315, 98501, -359274, -176202, 20648, -177846]
9825B76944c88620b7357l55547a32660k79855H6510J35400p0162D2444a93973
9814b48104B9827a30472n6304b0168H4382J9135L06084b81516p5974J60279i0696
9802F0489a47381I1134c65110C01861j0105A17503B8502O5573a60412j55962c2659
9790c03501A38347c78832a60449e3259k88724J55654L9225m2263j40654G4317
9779I4547b48524A32046e3196i032j44030A50412f57A2366c00419I3819b47361
9767H6822a35855A05131c03747A20435b73852n1489a04299A2416i0972c8051j67612
9756b05663M2173A53035g0980A00080h3223A9067a22394A75611b11815J6885b4487
9744H5533a33275A40106g0574r2499J7330k6477A03781j1101b5373B8239a66632
$$ y = [276944, -388620, -27357, -382904, -132660, -412515, 86510, 221910, 151748, 42444, -193973, -248104, 29827, -130472, -186776, -20168, 84382, 103517, 409601, -281516, -357490, -197211, -90696, 60489, -147381, 91134, -365110, 301861, 291756, 117503, 28502, 94075, -160412, -316374, -32659, -303501, 138347, -378832, -160449, -53259, -341983, -186329, -147104, -189367, -330021, 74317, 94547, -248524, 132046, -53196, -9032, -153062, 150412, -657, 12366, -300419, 93819, -247361, 86822, -135855, 105131, -303747, 120435, -273852, -325341, -104299, 12416, -90972, -38051, -205663, -163490, 153035, -70980, 100080, -83223, 19067, -122394, 175611, -211815, -194930, -24487, 85533, -133275, 140106, -70574, -163073, -145743, -172220, 103781, 92680, -25373, 28239, -166632]
9732a51438f6291L0951p1867A37002h3906R846H6480K80613a43152B0143a05780
9720B12727a17957j94107B72331d8084a5691j51801A06661d09634C19444b63423
9709e7000k87478a9305j56776A751K4815b3658k94926A32624b3650j65837e9079
9697A28428b5177n17l8238K0814m4406B15434c9171k79619Q1681A38039b43956
9685e2795B17027a33194A42088e6327l03945e8441A44422F1670N1743J18942P6058
9674C08413c52942C2798J24044a91581j12767a29205l74074A8634b72124P7508
9664a94616N4927e4087n9877B8872b79210g3298B13599a31092F8803b19340f0084
9652A44802a11798A29172a6565j73032A0119b731l30356i153q5957b7503G2407
$$ y = [-151438, -66291, -35340, -107207, 137002, -83906, -74060, 86480, 367093, -143152, 20143, -105780, 212727, -117957, -312064, 272331, -48084, -15691, -167492, 106661, -409634, 319444, -263423, -57000, -344478, -19305, -176081, 1751, 26566, -23658, -318584, 132624, -23650, -189487, -59079, 128428, -25177, -25694, -63932, -43118, -87524, 215434, -39171, -318790, -237109, 138039, -243956, -52795, 217027, -133194, 142088, -56327, -360272, -58441, 144422, 61670, 113413, 232355, 308413, -352942, 32798, 156842, -191581, -304348, -129205, -503279, 18634, -272124, -194616, -139689, -54087, -113964, 28872, -279210, -73298, 213599, -131092, 68803, -219340, -60084, 144802, -111798, 129172, -16565, -189597, 10119, -2731, -333087, -9153, -95110, -27503, 72407]
9640A52805o9020b33673l4771R4384B01703e3227A65691h9047j28360B6617b91705
9628A38378b8918A19500l9736N0185c14074C36655g9768A20364a22698L9946G0903
9616C1910b82264L0200H2058c10722h8480C4901a04325B06965c32252e6701a5218
9604I268b61551k46753g7090A3363K08769a30341k63101A01437a22403F2380c20769
9592f6503r3906f2688E3267K69180a35687B80207c72697A40248a5677B8714a64644
9580b51561B22257B0847b55204O1670N4208j27835l1787A34468D2371b20893f5129
9568e1199k7761L9077A885L03481A316b664A52208b56048A41535B4915c04166
9556A183a342E0756J61588F8347a18099J1495l7681A5801K37649b24390A89927
$$ y = [152805, 83785, -233673, -268444, -174060, 201703, -53227, 165691, -89047, -217407, 26617, -291705, 138378, -28918, 119500, 79764, 129949, -314074, 336655, -79768, 120364, -122698, -82752, 70903, 31910, -282264, -252064, 82058, -310722, -88480, 34901, -104325, 206965, -332252, -56701, -15218, 9268, -261551, -508304, -77090, 13363, 222132, -130341, -393442, 101437, -122403, 62380, -320769, -66503, -160409, -62688, 53267, 322447, -135687, 280207, -372697, 140248, -15677, 28714, -164644, -251561, 222257, 20847, -255204, -193534, -139326, -267161, -298948, 134468, 42371, -220893, -65129, -51199, -78960, -39883, 1885, 305366, 1316, -2664, 152208, -256048, 141535, 24915, -304166, 1183, -1342, 50756, 212344, 68347, -118099, -106604, -144285, 15801, 253450, -224390, 189927]
9544a55273B63348E7586j0738c51535a5168B87345c93195B36188i0657n4939k42623
9533c88219B27036a25415K3657l22142a20471j64370d3155B5550g2499A90673
9522G2513B6640c08939J26000i366E225b60477h0006k2641k9098j22171l4459
9511b88375q499m1563d5288q5083c1911A52821c10211F2859a64717N3829L0428
9500h0460E1549b54419F2713c623l46252i7065B63789a80127Q1003c5265j52070
9489a87335r8463I9229f0271r6601A59040i0004j56418l78918f7964k13696a22680
9477b51380G6170b27574R4590d5553j8731k08569a34857N6076J4007n2947B56318
9465G196g109I256h6136A56300c80636B83982c07448K1088F6902a47178E2436
$$ y = [-155273, 263348, 57586, 46848, -351535, -15168, 287345, -393195, 236188, -90657, -145596, -388219, 227036, -125415, -101758, -423900, -120471, -284841, -43155, 25550, -72499, 190673, 72513, 26640, -308939, -182939, -9366, 5225, -260477, -80006, -102647, -131745, -253916, -288375, -296874, -338437, -45288, -130371, -31911, 152821, -310211, 62859, -164717, -110888, -80460, 51549, -254419, 62713, -3623, -349875, -97065, 263789, -180127, -99124, -35265, -187335, -285798, 99229, -60271, -156872, 159040, -90004, -246422, -625340, -67964, -281660, -122680, -251380, 76170, -227574, -132984, -45553, -64284, -272853, -134857, -78781, -64774, -117721, 256318, 7196, -7109, 9256, -86136, 156300, -380636, 283982, -307448, -286360, 66902, -147178, 52436]
9453g7407j24319N8326C1290g6192r0032f4920l38378I2622a25413j95999d331
9441A1975R889i63A09268c9575M974B5084a68775M1427I0032a24500B07135a89216
9428c38119a9779A64743b51629R9848C61466q9355i0042H5599b4736A00247c169
9416A87840C0219c7999j77360M705B20663c6666j74858e8527A34682a97845B0396
9404c84397g2118C90489a4278j42534B57257a62352E9971R3412d77601A23892
9393h5878j55733j47087D6911b94339a36978j71620G2156a39528C9817l368b42369
9381f0350j5723A41447d49441J60804C5204c3265j60423j32255A42979b01097
9370c60606a43860k6860j78519r222B57954h2060A5786a41345C9993J0495K93854
$$ y = [-77407, -201726, -143400, 31290, -76192, -166224, -64920, -403298, 92622, -125413, -321412, -4331, 11975, 21864, -963, 109268, -39575, -34601, 25084, -168775, -127348, 90032, -124500, 207135, -189216, -338119, -19779, 164743, -251629, -151781, 361466, 272111, -90042, 85599, -24736, 100247, -3169, 187840, 30219, -37999, -215359, -210654, 220663, -36666, -211524, -58527, 134682, -197845, 20396, -384397, -72118, 390489, -14278, -156812, 257257, -162352, 59971, 153383, -477601, 123892, -85878, -241611, -388698, 46911, -294339, -136978, -308598, 72156, -139528, 39817, 36449, -242369, -60350, -76073, 141447, -449441, -288637, 35204, -33265, -193688, -325943, 142979, -201097, -360606, -143860, -170720, -349239, -358461, 257954, -82060, 15786, -141345, 39993, 50488, 344342]
9359C44342H6438b3672j80139B03605c02321A6262a42793j78573K3973g3223l43761
9348d16984c104k2250m8044l20268A33346a82919A19246E7336b91371a2270G3626
9336C1490L3250i1938j12840B2376c9553G1993c10096J33546E5059K06226a86342
9324b12057g6630C1562a193q9551k7236e4874j66554J05459j59763a19610b7109
9312b92617a24318a5863A81253c4684H3000a53862b6409G1819b05517L8976a111
9300A45485J27136c9290j07451J7775B61150b1178o9492J4965r4718B46935a51865
9288a23826N778p7769c5180j38534I8440b3940j49212B01271E2457J16978e6876
9276h0250k79179R5176h6287A89332G4764a50218F5312a56009P308J1997D1591
$$ y = [344342, 86438, -23672, -203811, 203605, -302321, 16262, -142793, -321366, -297393, -73223, -416984, -3104, -25354, -73398, -393666, 133346, -182919, 119246, 57336, -291371, -12270, 73626, 31490, 64740, -91938, -204778, 22376, -39553, 71993, -310096, -176550, 55059, 261285, -186342, -212057, -76630, 31562, -1193, -90744, -117980, -54874, -221428, -115969, -275732, -119610, -27109, -292617, -124318, -15863, 181253, -34684, 83000, -153862, -26409, 71819, -205517, -166541, -1111, 145485, 272621, -39290, -146741, -128966, 261150, -21178, -90670, -75705, -170423, 246935, -151865, -123826, -118048, -195817, -35180, -173714, 98440, -23940, -173152, 201271, 52457, 169435, -56876, -80250, -359429, -264253, -86287, 189332, 74764, -150218, 65312, -156009, -148701, -136704, 41591]
9264G2089b27692b9535k3573Q444m3544J8033K554I4003J15114o6050a86123A36090
9251b03558E4648P9848J22261a21784B64252A4880h1620K4488L787k20378R8302
9240a75421K4552K4943r2060L8328j31850Q2871C7722b6390A5613b01683I5954
9228A25710a34158C18601b88101B16146m8296J44822a02858a0444k15498a10847
9217a55935r9795b2440A99251i6582j97375B22056b8050A6504M3818o339K9269
9206H3252B2439K30238b17026f3835j08176k17543G3031a94443B44293E623a14901
9194c58639a37346k83446A98321K1797b63289f0560l12500J16283C0859J70521
9184B01380a54272h933B89822k9595L755I4105a2126m1229j44156H9344K9273
$$ y = [72089, -227692, -29535, -53108, -44664, -88208, -70175, -67621, 94003, 209117, 143067, -186123, 136090, -203558, 54648, 134496, 256757, -121784, 264252, 14880, -81620, -57132, -53345, -273723, -175421, -150869, -125926, -217986, -179658, -311508, -228637, 37722, -26390, 15613, -201683, 95954, 125710, -134158, 318601, -288101, 216146, 167850, 312672, -102858, -10444, -225942, -110847, -155935, -255730, -22440, 199251, -96582, -293957, 222056, -28050, 16504, 60322, 53983, 83252, 22439, 252677, -217026, -63835, -172011, -389554, 73031, -194443, 244293, 5623, -114901, -358639, -137346, -420792, 198321, 220118, -263289, -60560, -373060, -256777, 30859, 201380, -154272, -8933, 289822, 260227, 263982, 94105, -12126, -53355, -197511, 89344, 118617]
9173A18617a524q3359A67077J36790A5071J63471c19526J04236L8031g4899B28016
9161b90176J24498A061c7155J8373l5771o3567A05198M4569a75838B39655A01126
9149g6582A1590b44361A37447K23740F9240a20016l2558C28904d78768a20097
9138h2487k16583J34366j5573f945A72341a00820G5947C5610a96993C3877N2995
9127H6872b12415j6984A83010b89453J25984J0455A73556D9282a27258D124h6142
9115a17375C42781A29243m0785d1166l86969a14119j65849G4018B9708e1387N939
9104d5448j4956k9590k58180c1038A40845b78357B5974J07406f9948j01171e6360
9092A33632A7059a90787O588D12351e2230B8617a00207L2829m24569b14899k5001
$$ y = [118617, -1524, -84883, 167077, 303867, 15071, 178542, -319526, -215290, -177259, -74899, 228016, -290176, -165678, 1061, -37155, -18782, -54553, -118120, 105198, 149767, -175838, 239655, 101126, -76582, 11590, -244361, 137447, 361187, 69240, -120016, -152574, 328904, -478768, -120097, -82487, -299070, -164704, -180277, -6945, 172341, -100820, 75947, 35610, -196993, 33877, 86872, -212415, -229399, 183010, -289453, -163469, -153014, 173556, 49282, -127258, 4124, -86142, -117375, 342781, 129243, 88458, -41166, -428135, -114119, -279968, 74018, 29708, -51387, -45448, -60404, -89994, -348174, -31038, 140845, -278357, 25974, 133380, -69948, -171119, -56360, 133632, 17059, -190787, -184199, 412351, -52230, 28617, -100207, -67378, -491947, -214899, -239900]
9081b39900A43150h5264k1203k6976K1749n9031f0113p1043b6053n7186k00130
9070b83369b0145l16667e5082E5208a16361m7534l2861B7279J50650b22127B62951
9058H1597a77485J5688f3217j82182i5681M3690F3982c45541k4944a0108k14615
9047b24723e5171r4374f6981j38840A98098a77441j01129a4392j7056G7949M500
9036H2449k0933c5062j18740N7115l3572K5817A5768b47839i4281j06103Q3629
9025a16755B4766i1805A55097d3299H3919b29137a02236A2531J09103h3864k50098
9014c33962a8057j04301A43373a82226m3944b9811j32387E540b75016P2969N990
9003a96057A57293A730b90285I1509a34419N7533n1690p5994R8359r302A38474
$$ y = [-239900, 143150, -85264, -106467, -133443, -111694, -170725, -60113, -131156, -26053, -83239, -283369, -20145, -336812, -55082, 55208, -116361, -163895, -196756, 27279, 177929, -222127, 262951, 81597, -177485, -161797, -63217, -245399, -95681, -51991, 63982, -345541, -370485, -10108, -224723, -55171, -149545, -66981, -205821, 198098, -177441, -278570, -14392, -31448, 77949, 82449, 61516, -35062, -153802, -96687, -130259, -104442, 15768, -247839, -94281, -200384, -116755, 24766, -91805, 155097, -43299, 83919, -229137, -102236, 12531, 121634, -83864, -333962, -18057, -122358, 143373, -182226, -226170, -29811, -162198, 5540, -275016, -202047, -196057, 157293, 1730, -290285, 91509, -134419, -76886, -128576, -204570, -106211, -115513, 138474]
8991A28807a88513K9250O6663I842k718N7624c8976k0172k62876g510j74108L2010
8979a49608j1183r1005o9480B53818l5058a80730b6278a423l1575r5270a3300
8967c2649I0376b4170l54580a18561a7327J62l09046A73854B3324c09409C43740
8955a06374G8981b35481h049l12219f3046A74222o7674e3862K1160j68047A36859
8943A70791h3591k17563e3972j2809j16248c3341F1480h8049B09994a20369J1011
8932a09358A9108L17656A42387C1190j4604J4487R5332E3725L29552c168A95659
8920I27691J668764P597729C216161A168683D76879a81686A58157a34801A26861
8910a68860B5005b23394C2073K1531J23967m5647P3773B9399a14311p7549B54667
$$ y = [128807, -188513, -159263, -92600, 9842, 7124, 64748, -38976, -59148, -322024, -7510, -181618, -149608, -160791, -251796, -321276, 253818, 218760, -180730, -26278, -1423, -32998, -128268, -13300, -32649, 90376, -24170, -378750, -118561, -17327, -17165, -326211, 173854, 23324, -309409, 343740, -106374, 78981, -235481, -8049, -320268, -63046, 174222, 106548, -53862, -32702, -200749, 136859, 170791, -83591, -301154, -53972, -66781, -183029, -33341, 61480, -88049, 209994, -120369, -109358, 19108, 336764, 142387, 31190, 16586, 31073, 126405, 53725, 383277, -3168, 195659, 927691, 2596455, 10194184, 3216161, 1168683, 476879, -181686, 158157, -134801, 126861, -168860, 25005, -223394, 32073, 53604, 177571, 131924, 205697, 29399, -114311, -191860, 254667]
8898a74931A0700a30759f0654j09129b8534k2910A05122b20225J08246D16192
8887a68189B9207N4272a74187A23166b12677L7067f2332b5088n3906k08383h6026
8875a46645A80217a15633E3699j9232c0010o2621l06410A39994d4653o261j97015
8864b47929B7405K31070g2668j05595H9142C9683a97430k56448g586H0072K3331
$$ y = [-174931, 10700, -130759, -60654, -169783, -28534, -51444, 105122, -220225, -111979, 416192, -168189, 29207, 83479, -174187, 123166, -212677, -175610, -62332, -25088, -78994, -287377, -86026, -146645, 180217, -115633, 53699, 34467, -30010, -92631, -399041, 139994, -44653, -50914, -247929, 27405, 258475, -72668, -178263, 89142, 39683, -197430, -453878, -7586, 80072, 103403]
$$ [...]
##END NTUPLES=NMR SPECTRUM
##END=
