
##TITLE=AC1303_PERAH12115_6615838_Fp94LsB6eQ
##JCAMPDX= 6.0         $$ Bruker NMR JCAMP-DX V2.0
##DATA TYPE= NMR SPECTRUM
##DATA CLASS= NTUPLES
##ORIGIN= BRUKER
##OWNER= Administrator
$$ 1.72 TOPSPIN		Version 2.1
$$ 2012-08-03 02:41:23.687 -0500  Administrator@TOPSPIN
$$ Compression mode = diff/dup
##.OBSERVE FREQUENCY= 400.02188249412
##.OBSERVE NUCLEUS= ^1H
##.ACQUISITION MODE= SIMULTANEOUS (DQD)
##.ACQUISITION SCHEME= undefined
##.AVERAGES= 64
##.DIGITISER RES= 22
##SPECTROMETER/DATA SYSTEM= spect
##.PULSE SEQUENCE= noesygpps1d.comp
##.SOLVENT NAME= COFFEE_meoh
##.SHIFT REFERENCE= INTERNAL, COFFEE_meoh, 1, 14.9625
##AUDIT TRAIL= $$ (NUMBER, WHEN, WHO, WHERE, PROCESS, VERSION, WHAT)
$$ ##TITLE= Audit trail, TOPSPIN		Version 2.1
$$ ##JCAMPDX= 5.01
$$ ##ORIGIN= Bruker BioSpin GmbH
$$ ##OWNER= Administrator
$$ $$ C:\Bruker\TOPSPIN/data/COFFEE/nmr/AC1303_PERAH12115_6615838_Fp94LsB6eQ/12/pdata/1/auditp.txt
$$ ##AUDIT TRAIL=  $$ (NUMBER, WHEN, WHO, WHERE, PROCESS, VERSION, WHAT)
(   1,<2012-08-03 02:41:19.000 -0500>,<Administrator>,<TOPSPIN>,<go>,<TOPSPIN 2.1>,
      <created by zg
	started at 2012-08-03 02:29:48.734 -0500,
	POWCHK enabled, PULCHK disabled,
       configuration hash MD5:
       6B 1B 68 BB D9 2E 58 E2 7F 35 AD 54 07 DF 0E 41
       data hash MD5: 64K
       DC 36 00 5C 62 BF B4 93 0B CB E2 79 5F 53 AC 8E>)
(   2,<2012-08-03 02:41:21.781 -0500>,<Administrator>,<TOPSPIN>,<proc1d>,<TOPSPIN 2.1>,
      <Start of raw data processing
       efp LB = 0.3 FT_mod = 6 PKNL = 1 PHC0 = 0 PHC1 = 0 SI = 128K 
       data hash MD5: 128K
       D6 A3 D5 A4 A6 59 7F 32 C4 4A 2D DD B6 42 C7 1F>)
(   3,<2012-08-03 02:41:22.906 -0500>,<Administrator>,<TOPSPIN>,<proc1d>,<TOPSPIN 2.1>,
      <pk PHC0 = 2.988281 PHC1 = 0 
       data hash MD5: 128K
       07 9F E1 D7 01 2C 3E 96 72 D8 5D 0B B0 F4 DE 76>)
(   4,<2012-08-03 02:41:23.140 -0500>,<Administrator>,<TOPSPIN>,<proc1d>,<TOPSPIN 2.1>,
      <abs ABSG = 1 
       data hash MD5: 128K
       6B 8F AE F3 CD 5A 8D 95 BF 2E E7 6F B0 E9 D1 42>)
(   5,<2012-08-03 02:41:23.218 -0500>,<Administrator>,<TOPSPIN>,<proc1d>,<TOPSPIN 2.1>,
      <abs ABSG = 2 
       data hash MD5: 128K
       64 36 F9 6B 98 5C E8 06 81 F6 52 95 7F 3A 97 D0>)
(   6,<2012-08-03 02:41:23.265 -0500>,<Administrator>,<TOPSPIN>,<proc1d>,<TOPSPIN 2.1>,
      <abs ABSG = 3 
       data hash MD5: 128K
       8B D7 90 B6 A7 0B A1 D5 AC C9 2B A0 EB BF 35 B4>)
(   7,<2012-08-03 02:41:23.468 -0500>,<Administrator>,<TOPSPIN>,<proc1d>,<TOPSPIN 2.1>,
      <abs ABSG = 4 
       data hash MD5: 128K
       87 08 A3 F7 5D ED C2 C5 D5 71 6A 4F 3E E4 8F CC>)
(   8,<2012-08-03 02:41:23.609 -0500>,<Administrator>,<TOPSPIN>,<proc1d>,<TOPSPIN 2.1>,
      <abs ABSG = 5 
       data hash MD5: 128K
       0F BA D1 9C 8A C8 9C 12 A6 D3 FF 77 53 01 3A 23>)
$$ ##END=
$$ 
$$ $$ hash MD5
$$ $$ 63 97 78 99 E7 5F 7F CA 16 04 44 D0 BC 65 5E F6
##$RELAX= 
##$RELAX= 
##$RELAX= 
##$RELAX= 
##$RELAX= 
##$RELAX= 
##$RELAX= 
##$RELAX= 
$$ Bruker specific parameters
$$ [...]
150 150 150 150 150 150 150 150
##$TP07= 0
##$TPNAME0= <>
##$TPNAME1= <>
##$TPNAME2= <>
##$TPNAME3= <>
##$TPNAME4= <>
##$TPNAME5= <>
##$TPNAME6= <>
##$TPNAME7= <>
##$TPOAL= (0..7)
0.5 0.5 0.5 0.5 0.5 0.5 0.5 0.5
##$TPOFFS= (0..7)
0 0 0 0 0 0 0 0
##$TUNHIN= 0
##$TUNHOUT= 0
##$TUNXOUT= 0
##$USERA1= <user>
##$USERA2= <user>
##$USERA3= <user>
##$USERA4= <user>
##$USERA5= <user>
##$V9= 5
##$VALIST= <valist>
##$VCLIST= <CCCCCCCCCCCCCCC>
##$VD= 0
##$VDLIST= <DDDDDDDDDDDDDDD>
##$VPLIST= <PPPPPPPPPPPPPPP>
##$VTLIST= <TTTTTTTTTTTTTTT>
##$WBST= 1024
##$WBSW= 4
##$XGAIN= (0..3)
0 0 0 0
##$XL= 0
##$YL= 0
##$YMAX_a= 16282315
##$YMIN_a= -9317152
##$ZGOPTNS= <>
##$ZL1= 120
##$ZL2= 120
##$ZL3= 120
##$ZL4= 120
##$ABSF1= 14.9625
##$ABSF2= -5.595682
##$ABSG= 5
##$ABSL= 3
##$ALPHA= 0
##$AQORDER= 0
##$ASSFAC= 0
##$ASSFACI= 0
##$ASSFACX= 0
##$ASSWID= 0
##$AUNMP= <proc_prof1d_extract.lims>
##$AXLEFT= 0
##$AXNAME= <>
##$AXNUC= <1H>
##$AXRIGHT= 0
##$AXTYPE= 0
##$AXUNIT= <>
##$AZFE= 0.1
##$AZFW= 0.1
##$BCFW= 0
##$BC_mod= 0
##$BYTORDP= 0
##$COROFFS= 0
##$CY= 15
##$DATMOD= 1
##$DC= 0
##$DFILT= <>
##$DTYPP= 0
##$F1P= 0
##$F2P= 0
##$FCOR= 0.5
##$FTSIZE= 131072
##$FT_mod= 6
##$GAMMA= 0
##$GB= 0
##$INTBC= 1
##$INTSCL= 1
##$ISEN= 128
##$LB= 0.3
##$LEV0= 0
##$LPBIN= 0
##$MAXI= 10000
##$MC2= 0
##$MEAN= 0
##$ME_mod= 0
##$MI= 0
##$NCOEF= 0
##$NC_proc= -2
##$NLEV= 6
##$NOISF1= 0
##$NOISF2= 0
##$NSP= 0
##$NTH_PI= 0
##$NZP= 0
##$OFFSET= 14.9625
##$PC= 1
##$PHC0= 2.988281
##$PHC1= 0
##$PH_mod= 1
##$PKNL= yes
##$PPARMOD= 0
##$PPDIAG= 0
##$PPIPTYP= 0
##$PPMPNUM= 2147483647
##$PPRESOL= 1
##$PSCAL= 4
##$PSIGN= 0
##$PYNMP= <proc.py>
##$REVERSE= no
##$SF= 400.020009037746
##$SI= 131072
##$SIGF1= 0
##$SIGF2= 0
##$SINO= 400
##$SIOLD= 131072
##$SPECTYP= <>
##$SREGLST= <1H.CDCl3>
##$SSB= 0
##$STSI= 131072
##$STSR= 0
##$SW_p= 8223.68421052631
##$SYMM= 0
##$S_DEV= 0
##$TDeff= 65536
##$TDoff= 0
##$TI= <>
##$TILT= no
##$TM1= 0
##$TM2= 0
##$TOPLEV= 0
##$USERP1= <user>
##$USERP2= <user>
##$USERP3= <user>
##$USERP4= <user>
##$USERP5= <user>
##$WDW= 1
##$XDIM= 131072
##$YMAX_p= 441581702
##$YMIN_p= -13266
##$CURPLOT= <Network HP LaserJet P1505>
##$CURPRIN= <$Network HP LaserJet P1505>
##$DFORMAT= <normdp>
##$LAYOUT= <+/1D_H.xwp>
##$LFORMAT= <normlp>
##$PFORMAT= <normpl>
##$SURQMSG= 1
$$ End of Bruker specific parameters
$$ ---------------------------------
##NTUPLES= NMR SPECTRUM
##VAR_NAME=  FREQUENCY,     SPECTRUM/REAL,   SPECTRUM/IMAG
##SYMBOL=    X,             R,               I
##VAR_TYPE=  INDEPENDENT,   DEPENDENT,       DEPENDENT
##VAR_FORM=  AFFN,          ASDF,            ASDF
##VAR_DIM=   131072,        131072,          131072
##UNITS=     HZ,            ARBITRARY UNITS, ARBITRARY UNITS
##FACTOR=    0.0627417313425164, 1,          1
##FIRST=     8223.62146879497, 343,          -55829
##LAST=      0,             2129,            -56506
##MIN=       0,             -13266,          0
##MAX=       8223.62146879497, 441581702,    0
$$ Real data points
##PAGE= N=1
##DATA TABLE= (X++(R..R)), XYDATA
$$ [...]
64462 69164 69693 70961 72848 74832 75989 75637 73871 71373 69000 67667 67982 69597 71350 72447 73063
64447 73063 73511 73539 73003 72555 72825 73345 73143 72170 71282 70972 70976 71080 71484 72210 72855 73151 73252 73336 73426 73749 74699
64426 74699 76191 77523 78217 78686 79770 81799 84322 86586 88118 88989 89735 90958 92840 95034 97011
64411 97011 98543 99869 101396 103173 104692 105342 105098 104545 104211 104093 103800 102807 100610 97217 93686 91464
64395 91464 90792 90346 88994 87356 86839 87587 88282 87818 86238 84062 81692 79744 79072 79925 81520 82856
64379 82856 83588 83905 83988 83994 84164 84541 84728 84324 83503 82933 83143 84090 85229 85906 85807 85137 84335 83628 83003 82517
64359 82517 82351 82519 82777 82926 83083 83562 84588 86074 87510 88185 87857 87193 87210 88187 89441 90253 90661 91110
64341 91110 91599 91541 90488 88760 87270 86721 87038 87614 88039 88379 88772 89085 89187 89282 89650 90284 91103 92355
64323 92355 94417 97321 100782 104497 108033 110711 112161 112879 113612 114339 114525 114296 114475 115220 115511 114363
64307 114363 111889 108802 105639 102998 101796 102421 103986 105154 105504 105497 105437 105215 104880 104649 104354 103656 102901
64290 102901 103115 104852 107556 110306 112812 115440 118625 122508 126833 130968 134264 136625 138620 140969
64276 140969 144035 147773 151807 155510 158382 160520 162442 164285 165546 165741 164970 163587 161687 159257 156517
64261 156517 153714 150810 147758 144881 142542 140625 138771 137002 135578 134315 132624 130356 128107 126505
64247 126505 125612 125239 125373 125974 126686 127195 127684 128584 129958 131472 132915 134420 136128 137886 139426 140809
64231 140809 142584 145393 149297 153614 157647 161524 165942 171043 175944 179582 181655 182501 182443 181636 180236
64216 180236 178261 175531 172125 168645 165522 162347 158511 154376 151100 149224 148064 146732 145232 144265
64202 144265 144321 145227 146353 147128 147608 148577 150756 153872 156914 159319 161420 163589 165524 166718 167178 167268
64186 167268 167145 166727 166021 165173 164342 163734 163514 163550 163490 163261 163193 163511 164099 164956 166425 168626 171104 173459
64168 173459 175965 179095 182668 185975 188633 190964 193593 196990 201244 206087 211363 217615 225746 235776
64154 235776 246497 256991 268034 281182 296646 312952 328736 343995 359280 374282 387747
64143 387747 398412 405610 409160 409095 405682 399576 391729 382829 372785 361050 347681 333776 320620
64130 320620 308735 298111 288947 281500 275391 269748 264085 258569 253466 248872 244973 241934 239418 236804
64116 236804 234051 231789 230348 229275 228097 226983 226231 225597 224700 223763 223388 223705 224305 225013 226273 228633
64100 228633 232137 236423 241171 246283 251734 257535 263911 271363 280295 290530 301343 312069 322623
64087 322623 333361 344566 356163 367709 378507 387794 395075 400285 403576 405038 404651 402299 397759
64074 397759 391010 382739 374150 365902 357567 348578 339449 331437 325126 319940 315091 310454 306381 303190
64060 303190 301074 300126 300245 301220 302995 305628 308946 312558 316207 319814 323253 326625 330812 337116 345978
64045 345978 356429 367171 377923 389407 402250 416363 431351 447128 463945 481907 500631
64034 500631 519494 538132 556498 574364 591117 606260 619832 632061 642893 652325 660933 669472
64022 669472 677961 685655 691824 696041 697839 696872 693538 688757 682868 675350 665876 655103 644073 633363
64008 633363 623211 613954 605925 599291 594370 591759 591723 593732 596998 601240 606676 613537 621927 631904
63994 631904 643365 656073 669971 685171 701467 718364 735987 755528 778241 804247 832812
63983 832812 863534 896729 932789 971740 1013442 1057830 1104944 1155023 1208575 1266067 1327580
63972 1327580 1393007 1462613 1537291 1618421 1707591 1806246 1915412 2036036 2169866 2319872
63962 2319872 2489699 2683207 2904880 3160301 3455660 3797087 4190974 4644648 5165747
63953 5165747 5760450 6432156 7181260 8005101 8897820 9851037 10855356 11901193 12977626
63944 12977626 14069975 15157947 16215593 17213325 18121396 18913609 19569838 20076643 20426123
63935 20426123 20613821 20636728 20492465 20180123 19702322 19067602 18292125 17399498 16418026
63926 16418026 15376543 14301185 13214390 12135127 11079162 10059625 9088227 8175951
63918 8175951 7332082 6562654 5870122 5254060 4711520 4237054 3823682 3464557 3153580
63909 3153580 2884670 2651412 2448018 2270250 2115017 1979380 1860263 1754843 1660818 1576373
63899 1576373 1500124 1431007 1368022 1310166 1256610 1206698 1159666 1114623 1070975 1028631 987610
63888 987610 947615 908195 869145 830599 792888 756487 721842 689030 657755 627941 600164
63877 600164 575080 552479 531276 510619 490754 472611 456650 442332 428728 415516 403254
63866 403254 392657 383687 375483 367230 359033 351797 346233 342090 338469 334836 331595 329566 329041 329553
63852 329553 330548 332023 334342 337674 341833 346551 351569 356434 360556 363672 366066 368122 369714 370209 368991
63837 368991 365850 360902 354331 346303 337020 326777 315999 305159 294555 284153 273763 263496
63825 263496 253868 245303 237620 230251 222983 216238 210516 205747 201341 196748 191803 186734 182044 178308
63811 178308 175741 173906 172019 169636 166938 164387 162253 160494 158911 157376 155993 154977 154263 153310 151585
63796 151585 149234 146973 145289 144020 142817 141684 140780 139947 138770 137110 135313 133819 132775 132092 131758
63781 131758 131881 132349 132644 132232 131141 129931 129011 128197 127107 125661 123956 121910 119422 116731 114202 111928
63765 111928 109985 108907 109238 110582 111765 112200 112504 113460 114873 115878 115998 115457 114731 114221 114225 114898 116183
63748 116183 117884 119621 120753 120783 120085 119772 120566 122103 123701 125406 127857 131401 135775 140446 144894
63733 144894 148786 152300 156162 160946 166506 172399 178572 185194 192042 198686 205145 211783 218467 224378
63719 224378 228782 231646 233367 234219 234198 233145 230970 227887 224399 220899 217328 213482 209485 205666 202054
63704 202054 198329 194222 189653 184557 178911 172977 167263 162279 158443 155970 154521 153177 151239 148978
63690 148978 147182 146122 145481 145122 145287 145963 146738 147455 148463 150029 152081 154807 158891 164717 171702 178905
63674 178905 185985 193159 200539 208042 215696 223417 230507 235948 239322 241012 241338 239951 236376 230839
63660 230839 224089 216629 208543 200084 191884 184374 177427 170878 165081 160518 157091 154285 151911 150162
63646 150162 149001 148085 147420 147468 148338 149427 150210 150948 152214 154148 156558 159332 162246 164865 167267 170560
63630 170560 175931 183252 191205 198724 205821 213100 221131 230253 240408 251064 261808 273087 285870
63617 285870 300565 316710 333756 351616 370363 389902 409996 430062 448830 464769 477114
63606 477114 486035 491709 493834 492374 488220 482724 477002 472056 469027 468545 469871 471180 470834 468218 463527
63591 463527 457127 449233 439970 429504 418072 405975 393715 382082 371805 362846 354260 345163 335723
63578 335723 326891 319199 312289 305600 299068 293048 287960 284165 281835 280718 280313 280434 281441 283935 288374
63563 288374 294877 302985 311719 320364 329273 339477 351502 365092 380142 397202 416737 438371
63551 438371 461197 484347 506898 527662 545568 560154 571418 579469 584606 587557 589419 591417
63539 591417 594656 599593 605602 611522 616842 621852 626410 629195 628700 624381 616220 603680 586121 564250
63525 564250 540283 516289 492804 469242 445246 421330 398474 377461 358570 341680 326536
63514 326536 312982 300996 290562 281516 273522 266273 259740 254158 249645 245933 242564 239261 236032
63501 236032 233147 231140 230496 231038 231902 232513 233329 235130 237955 241310 245099 249539 254429 259537 265571
63486 265571 273557 283093 292463 300933 309666 319697 330141 339331 346727 352610 356751 358676 358687 357314
63472 357314 354147 348497 340987 333188 325707 317950 309814 302295 296038 290489 285070 280244 276688 274180
63458 274180 271979 269791 267768 265965 264349 263004 261885 260664 259227 258005 257462 257569 258147 259369 261462
63443 261462 264278 267682 272143 278350 286297 295276 304789 315035 326392 338858 352251 366685 382554
63430 382554 400048 418756 437861 456821 475969 496355 518880 543603 569983 597543 625939
63419 625939 654320 681003 704049 722080 734406 740632 740712 735542 727136 717756 708815 700729 693624
63406 693624 687645 682462 676884 669395 659047 645667 629419 610550 589537 567070 543727 519879
63394 519879 496053 473192 452301 433869 417717 403323 390161 377896 366586 356804 349329 344470
63382 344470 341769 340425 339904 340100 341145 343411 347479 353648 361419 369931 379003 389295 401257 414534
63368 414534 428811 444636 462683 482544 503096 524004 546093 570112 595694 621615 646367
63357 646367 668358 686261 699598 708603 713403 713910 710705 705289 699034 692452 685913 680376 676644 674198
63343 674198 671451 666953 659916 649886 636648 620463 602010 582056 561379 540794 520853 501678
63331 501678 483243 465580 448521 431791 415761 401619 390198 380954 372695 364932 357930 351848
63319 351848 346688 342888 341002 340738 341055 341339 341762 342463 343121 343555 344095 344993 345993 346767 347382 348076 348949
63302 348949 349980 350988 351453 350863 349474 348282 347981 348238 348218 347516 346404 345450 345099 345312 345546 345299 344788
63285 344788 344734 345459 346530 347397 347951 348380 348904 349805 351269 352954 354160 354707 355259 356574 358820 361833 365532
63268 365532 369606 373247 375824 377709 379922 382938 386218 388921 390751 392034 393244 394644 396316 398389
63254 398389 401073 404375 407907 411241 414460 418122 422617 427787 433233 438707 444084 449282 454432 460012
63240 460012 466623 474679 484259 495037 506440 518219 530976 545769 563066 582390 603029 624675
63228 624675 647205 670388 694125 718566 743549 768230 791715 813848 835038 855578 875570
63217 875570 895299 915136 935154 955236 975487 996011 1016317 1035367 1052339 1066881 1078493
63206 1078493 1086077 1088370 1084678 1075073 1060116 1040538 1017049 990271 960924 930093 899127 869213
63194 869213 841186 815737 793456 774501 758560 745488 735895 730714 730156 733415 739557 748444 760585
63181 760585 776241 795018 816322 839891 865722 893632 923080 953278 983369 1012647 1040943
63170 1040943 1068741 1096674 1124854 1152888 1180498 1207696 1234160 1258839 1280505 1298427 1311978
63159 1311978 1319841 1320410 1313272 1299667 1280935 1256953 1226836 1190989 1151599 1110914 1069882 1028886
63147 1028886 988984 951499 916798 884449 854479 827571 803900 782697 763349 746088 731132
63136 731132 717887 705704 694796 685605 677648 669933 662356 655823 650930 647229 643923 640699 637728
63123 637728 635376 634041 633800 634168 634664 635645 637897 641342 644880 647838 650836 654714 659259 663709 668078
63108 668078 673161 679344 686110 692804 699279 705559 711389 716521 721316 726607 732824 739349 744955 748916
63094 748916 751544 753604 755473 757107 758499 759672 760334 760126 759289 758541 758173 757808 757253 756972 757371 758246 759403
63077 759403 761275 764252 767927 771823 776510 782972 790924 798840 805907 813025 821358 830784 840551 850899
63063 850899 863018 877487 893619 910571 928452 948013 969725 993624 1019841 1048727 1080410
63052 1080410 1114552 1150734 1188939 1229575 1273053 1319366 1367909 1417589 1467274 1516384 1565104
63041 1565104 1613883 1662665 1710709 1757246 1802178 1846044 1889414 1932528 1975563 2018899 2062854
63030 2062854 2107197 2151135 2193811 2234483 2272035 2304539 2329638 2345368 2350416 2343776 2324696 2293242
63018 2293242 2250704 2199203 2140998 2078190 2012789 1946735 1881904 1820187 1763348 1712553 1668170
63007 1668170 1630286 1599330 1575950 1560424 1552494 1551674 1557452 1569336 1587134 1611203 1642010 1679329
62995 1679329 1722130 1769227 1819679 1872457 1926281 1980217 2034172 2088458 2142940 2196898 2249622
62984 2249622 2300749 2349976 2396643 2439649 2477546 2508601 2530955 2542894 2543061 2530465 2504543 2465423
62972 2465423 2414010 2351588 2279289 2198163 2109782 2016543 1921173 1826073 1733187 1644136 1560048
62961 1560048 1481344 1408034 1340234 1278135 1221617 1170283 1123827 1082013 1044397 1010629 980983
62950 980983 955909 934921 916585 899874 884842 871637 859576 847851 836603 826520 817697 809494
62938 809494 801266 792627 783287 773270 763167 753570 744408 735309 726340 717765 709434 701088 693034 685758
62924 685758 679081 672485 666089 660352 654882 648605 641360 634367 628723 624194 619874 615375 610881 606544
62910 606544 602279 597902 593243 588394 583839 579939 576317 572318 568094 564557 562231 560887 560388 561008 562570
62895 562570 564006 564242 563013 560588 557318 553704 550197 546588 542254 537301 532727 529046 525576 521607
62881 521607 517536 514230 511913 510337 509416 509011 508545 507535 506146 504750 503431 502411 502250 502916 503270 502321
62865 502321 500537 499088 498208 497219 495795 494228 492604 490666 488468 486397 484557 482758 480979 479197 476978
62850 476978 474065 471214 469491 468677 467306 464536 461139 458334 456408 454949 453812 453157 452818 452309 451483
62835 451483 450822 450867 451485 451965 451858 451511 451474 451581 451157 450208 449678 450187 451086 451285 450532 449303 447860 446133
62817 446133 444289 442687 441331 439916 438311 436610 434929 433685 433755 435676 438832 442114 445193 448508 452146
62802 452146 455604 458677 461836 465599 470164 475720 482459 490128 498289 507189 517743 530369 544411
62789 544411 558980 573934 589734 606802 625299 645228 666588 689750 715781 745933 780602
62778 780602 819158 860978 906279 955817 1010224 1069926 1135264 1206218 1282148 1362016 1444751
62767 1444751 1529181 1613741 1696389 1774753 1846339 1908781 1960105 1998818 2023905 2034815 2031305
62756 2031305 2013227 1980720 1934818 1877507 1810909 1736748 1657006 1574554 1492313 1411798 1333093
62745 1333093 1256200 1181787 1110733 1043736 981565 925010 874292 828926 788248 751672 718456
62734 718456 687883 659925 635143 613703 594983 578313 563537 550563 538935 528305 518903 511102
62722 511102 504819 499679 495514 492366 490251 489198 489327 490673 493126 496678 501473 507467 514354 522086
62708 522086 531221 542570 556696 573847 594019 616886 641970 669218 699238 732819 770410 812261
62696 812261 858822 910749 968615 1032764 1103259 1179823 1261899 1348859 1440015 1534438 1630842
62685 1630842 1727560 1822365 1912339 1994306 2065473 2123518 2166272 2191889 2199502 2189282 2161766
62674 2161766 2117561 2057986 1985577 1903480 1814430 1720496 1623682 1526449 1431481 1340830 1255205
62663 1255205 1174252 1097703 1026091 960124 899709 844180 793355 747695 707265 671158 638260
62652 638260 608176 581049 556789 534789 514265 494697 476079 458851 443511 430243 418979
62641 418979 409550 401453 393752 385723 377526 369734 362366 355041 348008 342195 337996 334720 331545 328279
62627 328279 324820 320598 315273 309631 305096 302428 301239 300623 299951 299198 298767 298915 299261 299161 298683 298786
62611 298786 300270 302847 305622 308186 310874 314146 318085 322517 327370 332874 339428 347209 356001 365584
62597 365584 376223 388512 402809 419181 437831 459083 482958 509238 538041 569868 604984
62586 604984 643210 684314 727989 773211 818217 861397 901799 938602 970649 996771 1016103
62575 1016103 1027879 1031433 1026688 1014208 994649 968789 938220 905159 871058 836000 799911 763653
62563 763653 728410 694720 662849 633508 607302 583810 561994 541400 522396 505459 490778
62552 490778 478263 467353 457007 446436 435639 424852 413948 403001 392923 384583 377509 370384
62540 370384 362831 355843 350336 346078 342372 339118 336796 335750 335871 336796 338234 340242 343205 347411 352685
62525 352685 358605 365008 372020 379742 388223 397730 408720 421502 436079 452325 470197 489920 512083
62512 512083 537348 565993 597976 633543 673292 717356 764992 815425 868598 924386 981320
62501 981320 1036851 1088850 1136277 1178378 1213833 1240908 1258072 1264449 1260068 1245821 1222889 1192103
62489 1192103 1154043 1109677 1060674 1009149 957275 906883 858930 813380 769941 728891 690921
62478 690921 656416 625347 597764 573789 553122 535063 519221 505715 494536 485142 477047 470499
62466 470499 466185 464313 464253 465061 466163 467492 469166 471328 474283 478455 483902 490083 496450 503187 510881
62451 510881 519571 528742 538338 548939 560575 572044 582120 590860 598926 605932 610379 611219 608748
62438 608748 603859 596970 587908 576350 562185 545790 528115 510273 492948 476353 460645 446091
62426 446091 432808 420689 409676 399873 391355 384080 378077 373535 370653 369408 369479 370391 371866 374019
62412 374019 377060 380896 385340 390681 397499 405815 414972 424539 434746 445590 456141 465333 473027
62399 473027 479704 485478 490041 493232 494998 495068 493380 490635 487715 484640 480790 476032 470873 465554 459836
62384 459836 453824 448262 443697 440021 437177 435848 436949 440662 446223 452583 459264 466860 476740 490011
62370 490011 506692 526095 547858 572302 599849 630587 664435 701369 741282 783967 829343
62359 829343 877477 928179 980627 1033340 1084463 1132204 1175210 1212474 1242849 1264964 1277886
62348 1277886 1281674 1277123 1265272 1247382 1224982 1199344 1171035 1140188 1106931 1071296 1033315 993803
62336 993803 954677 917751 883403 850968 820202 791644 765769 742539 721699 702777 684765
62325 684765 666603 648200 630437 614028 598896 584778 571948 561100 552742 546774 542486 539098
62313 539098 536485 535073 534808 534725 534039 533018 532042 530315 526617 521043 514872 508739 502063 494427 486449
62298 486449 478939 472042 465632 459853 454887 450802 447898 446672 447175 448929 451631 455393 460176 465569
62284 465569 471276 477287 483483 489702 496239 503670 512111 521321 531493 543093 555890 569048 582344
62271 582344 596318 610995 625516 639499 653829 669534 686764 705457 726221 749834 776496
62260 776496 806216 839351 876068 915732 957480 1001004 1046141 1091906 1136332 1176974 1211427
62249 1211427 1237946 1256046 1266127 1268344 1262384 1248580 1228422 1203488 1174516 1141959 1106605 1069029
62237 1069029 1029160 987228 944617 903074 863609 826888 794016 765906 742153 721512 703393
62226 703393 688076 675595 665224 656195 648293 641651 636368 632373 629322 626701 624283 622293 620877
62213 620877 619684 618344 617080 616413 616463 616949 617674 618673 620091 622211 625358 629570 634626 640568 647666 655659
62197 655659 663703 671535 680103 690499 702829 716754 732450 750186 769404 789239 809703 831469
62185 831469 854441 877284 898349 916516 931288 942760 951591 958537 964053 968685 973532 979710 987678
62172 987678 997707 1010700 1027681 1048591 1072489 1098972 1128563 1161523 1197000 1233534 1269723
62161 1269723 1304048 1334726 1360301 1380292 1395065 1405320 1411803 1415152 1415769 1413801 1409186 1401555 1390353
62148 1390353 1375447 1357625 1338323 1318934 1300473 1283510 1267977 1253355 1239537 1227278 1217241
62137 1217241 1208846 1200702 1192068 1183238 1174519 1165645 1156452 1147562 1140021 1134530 1131174 1129654 1129639 1131048
62123 1131048 1133957 1138160 1143130 1148750 1155780 1165043 1176326 1188616 1201280 1214450 1228366 1243082
62111 1243082 1258829 1275957 1294303 1313233 1332518 1352628 1373970 1396424 1419917 1444884 1471762
62100 1471762 1500365 1530154 1560846 1592495 1625325 1659852 1696878 1736895 1779589 1824224 1870468
62089 1870468 1918447 1967911 2017571 2065549 2110611 2152972 2193968 2235143 2277759 2322804 2370726
62078 2370726 2420715 2470513 2517350 2559085 2594632 2624066 2648958 2672143 2696254 2722272 2749885
62067 2749885 2779133 2811119 2847075 2887238 2930695 2975883 3021109 3065004 3106715 3145570 3180811
62056 3180811 3212143 3240416 3267144 3293147 3318025 3340979 3361682 3380191 3396491 3410427 3421936
62045 3421936 3431314 3439411 3447448 3456246 3465708 3475480 3485987 3498136 3511904 3525853 3538345 3548786
62033 3548786 3557505 3564976 3571526 3577322 3582143 3585330 3586305 3585028 3581830 3577060 3571066 3564186 3556437 3547400
62019 3547400 3536650 3524248 3510668 3496480 3482264 3468630 3456093 3444892 3434982 3426163 3418323 3411755
62007 3411755 3407086 3404664 3404215 3405508 3409052 3415440 3424159 3433943 3444457 3456673 3471063 3486276 3500349
61994 3500349 3512547 3523155 3531870 3537495 3539168 3537046 3531633 3523243 3512327 3499644 3485711 3470520
61982 3470520 3454062 3436728 3418822 3400081 3380116 3359079 3337390 3314917 3290870 3264653 3236570
61971 3236570 3207547 3178315 3148889 3118806 3087814 3056292 3024897 2993789 2962548 2931074 2900270
61960 2900270 2871305 2844234 2817846 2791010 2763680 2736398 2709395 2682711 2656804 2632322 2609426
61949 2609426 2587899 2567884 2549913 2534105 2519943 2507020 2495465 2485405 2476500 2468413 2461391 2455926
61937 2455926 2452066 2449412 2447660 2446866 2447390 2449824 2454755 2462293 2471966 2483378 2496796 2512857 2531837
61924 2531837 2553534 2577778 2604850 2635607 2671452 2714006 2764346 2822591 2888587 2963144 3048451
61913 3048451 3147307 3262129 3394803 3547334 3722515 3923923 4155365 4420591 4723729 5069764
61903 5069764 5464147 5911877 6417000 6982328 7608196 8290153 9016792 9768215 10514653
61894 10514653 11216154 11825713 12296349 12589358 12680721 12564910 12255856 11783774 11188033
61885 11188033 10509445 9785484 9048296 8323436 7629157 6977256 6374907 5825761 5330293
61876 5330293 4886541 4491229 4140297 3829081 3552923 3307808 3090099 2896043 2722181
61867 2722181 2566094 2426193 2300951 2188839 2088686 1999362 1919327 1847158 1782289 1724564
61857 1724564 1673318 1627606 1586974 1551090 1518910 1489275 1462247 1438860 1419509 1403512 1390115
61846 1390115 1378787 1368450 1357764 1346665 1336580 1328610 1322350 1316950 1312432 1309339 1307845 1307767 1308864
61833 1308864 1310616 1312299 1313764 1315594 1318137 1321038 1324042 1327432 1331194 1334580 1337214 1339875 1343338 1347075
61819 1347075 1350100 1352802 1356945 1363864 1373346 1384299 1395900 1408040 1421201 1436202 1453831 1474524
61807 1474524 1498240 1524571 1553090 1583978 1618232 1656852 1699866 1746722 1797600 1853552 1915151
61796 1915151 1981962 2053784 2131566 2216385 2308268 2406964 2513407 2629547 2757048 2897025
61786 2897025 3050937 3220868 3408981 3617509 3849454 4108749 4399585 4726088 5092847
61777 5092847 5505424 5970272 6494536 7086008 7752989 8503994 9347471 10291042 11339510
61768 11339510 12491885 13738404 15057851 16414737 17756890 19015652 20110901 20961271
61760 20961271 21497498 21675138 21482818 20943533 20108812 19047756 17834559 16538465 15218305
61751 15218305 13920749 12680094 11518722 10448821 9475161 8597478 7811830 7111814 6490084
61742 6490084 5939276 5451898 5020261 4637197 4296692 3993600 3723145 3481108 3264229
61733 3264229 3070045 2896401 2741228 2602398 2477539 2364382 2261617 2169068 2086593 2013019
61723 2013019 1946496 1885668 1830150 1780026 1735221 1695169 1658860 1625310 1594130 1565430 1539141
61712 1539141 1514875 1492571 1472646 1455107 1439042 1423446 1408152 1393450 1379237 1365165 1351219
61701 1351219 1337436 1323268 1307991 1291671 1275063 1258557 1241898 1225014 1208393 1192366 1176536
61690 1176536 1160337 1143848 1127732 1112560 1098457 1085268 1072779 1060763 1049002 1037397 1026032
61679 1026032 1015130 1004946 995818 988286 982905 979669 977753 976135 974481 973175 972570 972532 972741 972953 972901
61664 972901 972296 971157 969810 968410 966720 964443 961512 957996 954036 949913 945842 941678 937184 932551
61650 932551 928195 924087 919878 915703 912101 908992 905531 901318 897024 893445 890570 887986 885513 882978
61636 882978 880122 877366 876090 877398 880991 885801 891242 897265 903706 910308 917082 923972 930535 936487
61622 936487 942150 947791 952946 957051 960284 963093 965376 966912 968144 969624 970972 971242 970042 967458
61608 967458 963225 957013 949359 941302 933163 924621 915851 907453 899221 890142 879928 869535 859801 850557
61594 850557 841564 833428 826900 821853 817628 813967 811036 808846 807203 806067 805593 805871 806950 809034 812515
61579 812515 817815 825258 834924 846612 859970 874626 890232 906747 924838 945504 968937 994186
61567 994186 1020472 1048304 1078486 1110418 1142380 1173441 1204095 1234881 1265339 1294582 1322074
61556 1322074 1347524 1370753 1392067 1412110 1431025 1448322 1463850 1478145 1491356 1502599 1510943
61545 1510943 1516425 1519413 1519436 1515468 1507196 1495375 1481070 1465097 1448028 1430149 1411393 1391841 1372296
61532 1372296 1353960 1337466 1322612 1309083 1297046 1286936 1278998 1273286 1269894 1268939 1270490 1274726 1282115
61519 1282115 1293222 1308334 1327502 1350997 1379501 1413669 1453713 1499731 1552405 1613037 1682842
61508 1682842 1762507 1852570 1953988 2068124 2196382 2339995 2500062 2677619 2873657 3088840
61498 3088840 3322659 3572499 3833476 4098909 4360343 4607154 4827117 5008482 5142134
61489 5142134 5222594 5248317 5221777 5148663 5036133 4891688 4723491 4540441 4350639 4159856
61479 4159856 3972073 3791037 3620404 3462685 3319005 3189931 3075787 2976352 2891184 2820305
61469 2820305 2763853 2721063 2690434 2670990 2662610 2664925 2676698 2696514 2723427 2756623 2795166 2838358
61457 2838358 2885769 2936508 2988921 3041357 3092881 3143047 3191446 3237704 3281555 3322759 3361349
61446 3361349 3398171 3434706 3472141 3510879 3551043 3592931 3636748 3682247 3728850 3775788 3822040
61435 3822040 3866442 3908060 3946117 3979608 4007371 4028557 4042602 4048759 4046239 4034938 4015604 3989251
61423 3989251 3956844 3919515 3878492 3834749 3789284 3743735 3699996 3659139 3621398 3587341 3558232
61412 3558232 3534931 3517173 3504317 3496100 3492278 3492202 3495228 3500890 3508081 3514592 3518049 3517051 3511105 3500050
61398 3500050 3484126 3464223 3441633 3417816 3394721 3374736 3359815 3351043 3349511 3357117 3375957 3407352
61386 3407352 3452115 3511571 3587739 3682672 3798027 3934918 4093698 4274020 4475496 4698053
61376 4698053 4941148 5202733 5479025 5764510 6051390 6329329 6586652 6812163 6996092
61367 6996092 7130488 7210347 7234968 7207775 7134460 7021140 6873573 6697011 6496224 6275766
61357 6275766 6040230 5794009 5540956 5284759 5029596 4779881 4539127 4309306 4091402
61348 4091402 3886260 3694776 3517653 3355330 3208053 3075835 2958413 2855441 2766671 2691762
61338 2691762 2629892 2579769 2540300 2511135 2492325 2483430 2483360 2491285 2507242 2531415 2563078 2600749
61326 2600749 2643163 2689511 2738858 2790087 2842495 2895744 2949021 3000913 3050370 3097129 3140875
61315 3140875 3180696 3215980 3247283 3275680 3301695 3325476 3347522 3368250 3386905 3401728 3411451
61304 3411451 3416057 3415915 3410682 3399513 3382095 3359044 3331236 3299017 3262283 3221177 3176319 3128186
61292 3128186 3076695 3021890 2964831 2907268 2850482 2795055 2741763 2691906 2646455 2605591 2569536
61281 2569536 2539233 2515551 2498153 2485686 2476773 2470329 2465221 2460345 2455074 2449201 2442462 2434402 2424626
61268 2424626 2412959 2399492 2384717 2369415 2354104 2338784 2323485 2308815 2295729 2285080 2277781
61257 2277781 2275122 2278473 2288840 2307083 2334394 2372096 2421116 2482013 2555353 2641638 2740868 2852399
61245 2852399 2974911 3106050 3242212 3378985 3511518 3633949 3738858 3818265 3865659 3877134
61235 3877134 3851169 3788430 3692176 3568254 3424004 3266980 3104245 2941953 2784793 2635710
61225 2635710 2496354 2367822 2250973 2146168 2052871 1969634 1894781 1827391 1767540 1715412
61215 1715412 1670286 1630590 1594892 1562558 1533653 1508579 1487852 1471810 1460383 1453314 1450611 1452550
61203 1452550 1459227 1470379 1485656 1504703 1526820 1550771 1575113 1598581 1620061 1638514 1653184
61192 1653184 1663867 1670839 1674545 1675441 1673941 1670284 1664432 1656232 1645725 1633181 1618800 1602513 1584194
61179 1584194 1564074 1542885 1521594 1500969 1481264 1462162 1443000 1423234 1402795 1381970 1360938
61168 1360938 1339507 1317319 1294123 1269782 1244165 1217220 1189153 1160507 1132046 1104480 1078116
61157 1078116 1052851 1028727 1006346 986313 968295 951141 933964 916487 898186 878031 855651
61146 855651 832116 808829 786242 764428 744281 727024 712736 700493 689832 681073 674254 668909
61134 668909 665066 663318 663581 664798 666352 668818 672839 678160 684359 691666 700373 710094 720375 731415
61120 731415 743471 756123 768864 781985 796058 810909 825857 840707 855789 871230 886880
61109 886880 902763 918864 934515 948638 960620 970437 978020 983096 985745 986535 985872 983561 979224
61096 979224 972991 965617 957984 950383 942218 932576 921261 909138 897247 885824 874373 862477 850185
61083 850185 837675 824950 811969 798915 786226 774351 763448 753290 743501 733807 724024 714076
61071 714076 704376 695979 689805 685613 682144 678370 674237 670087 665979 661897 658269 655805 654863 655171 656123
61056 656123 657223 658236 659003 659271 658981 658677 659060 659898 659997 658778 657299 656986 657860 658993 660318 662809 666939
61039 666939 672182 678241 685661 694873 705450 716735 728468 740525 752700 765030 777709 790538
61027 790538 803050 815206 827275 839112 850415 861560 873206 885066 896243 906828 917952
61016 917952 930114 942711 955564 969572 985419 1002833 1021596 1042111 1064489 1088235 1113474
61005 1113474 1141496 1173539 1209886 1250416 1294983 1342979 1393629 1446859 1502850 1561017 1621170
60994 1621170 1685603 1758071 1840601 1933434 2038040 2157374 2292430 2441391 2603336 2780575
60984 2780575 2976973 3197463 3450606 3748285 4101372 4519276 5015444 5609642 6324519
60975 6324519 7187620 8241360 9544142 11155258 13122548 15479384 18213788 21185571
60967 21185571 24061159 26385404 27801227 28255507 28011565 27472478 26992234 26809087 27052972
60958 27052972 27707846 28535210 29095232 28936943 27837036 25892757 23412871 20731868 18096045
60949 18096045 15651574 13472313 11580777 9965314 8600949 7462001 6520783 5745716
60941 5745716 5107267 4582516 4151428 3793099 3488949 3226345 2996308 2790527 2603108
60932 2603108 2432268 2277271 2135521 2004669 1885087 1777760 1681584 1594894 1517638 1449556
60922 1449556 1387798 1328693 1270729 1214091 1158791 1105191 1054865 1008846 966173 925896 889099
60911 889099 857058 828801 802576 778545 757882 740220 724133 709302 696209 684399 673058
60900 673058 662701 654335 647464 640734 634118 628730 624882 622007 620099 619539 619796 619946 620386 622525 626826
60885 626826 632332 638027 643548 648894 654485 661182 669125 676976 683363 688550 693544 698190 701482 703212
60871 703212 703938 703684 702044 699291 696014 691955 686437 679716 672675 665519 658043 650845 644858 639846 634736
60856 634736 629365 624632 621040 618386 616843 617008 618724 621139 624090 628317 634130 641003 648861 658715
60842 658715 671477 686745 703175 719671 735997 752454 768896 783946 795736 803922 810407 817467
60830 817467 825708 834567 844029 854588 865838 876327 884870 891197 895522 898339 900503 902637 904552
60817 904552 905899 907091 908822 910987 912875 914094 914454 913353 910259 905512 899724 892691 883817 873290
60803 873290 861737 849031 834590 818764 802796 787378 772284 757497 743728 731671 721444
60792 721444 712788 705202 698077 691405 686148 683128 681910 681612 682372 684959 689225 694164 699452 705787 713681
60777 713681 722868 732962 743756 754904 766157 777841 790243 802733 814451 825642 837139 848646
60765 848646 858777 866912 873872 880533 886894 892709 898065 903014 907483 911823 916603 921737 926635 931375
60751 931375 936815 943312 950181 956678 962765 968653 974309 979651 984590 988725 991572 993135 993633 992759 990000
60736 990000 985715 981004 976419 971572 966055 959825 952552 943503 932509 920423 908378 897086 886847
60723 886847 877613 868941 860469 852486 845530 839649 834694 831045 829113 828257 827150 825241 822914 820279
60709 820279 816723 811781 805559 798294 790353 782655 776112 770602 765416 760696 757417 755946 755767 756729 759328
60694 759328 763551 768575 774019 780349 787569 794580 800293 804457 806951 807221 804966 800518 794022 785049
60680 785049 773560 760474 746755 732639 718266 704329 691543 680008 669519 659994 651310 643359
60668 643359 636545 631524 628180 625605 623397 622158 622334 623439 624896 626750 628826 629985 629096 626427 623460
60653 623460 621573 621280 622323 624029 625850 627902 630690 634184 637598 640294 642344 643979 645066 645464 645441
60638 645441 645408 645626 646436 648337 651557 655867 660963 666777 673401 681082 690161 700593 711697 722986
60624 722986 734996 748521 763281 778291 793406 809391 826421 843683 860686 877775 894879
60613 894879 910826 924469 935670 944688 951493 956165 959180 960724 960433 958274 954998 951200 946527 940236
60599 940236 931974 921708 909593 896268 882561 868625 854091 839344 825751 814244 804541 796191
60587 796191 789464 784665 781387 779091 777679 777005 776558 776176 776216 776488 775817 773365 769610 765421 760984 756411
60571 756411 752578 750374 749601 749492 749942 751487 754390 758422 763255 768495 773586 778138 782153 785684 788641
60556 788641 791121 793406 795447 796981 798281 800041 802315 804577 807127 811357 818040 826446 835878 847157
60542 847157 861767 880398 903220 930792 963767 1002334 1046807 1097993 1155831 1217898 1279946
60531 1279946 1337383 1385640 1420120 1437335 1436280 1418292 1386035 1343196 1294326 1243712 1194374
60520 1194374 1148520 1108301 1075272 1049705 1031355 1020459 1017070 1019893 1026772 1036162 1047353 1059666
60508 1059666 1072397 1085347 1098629 1112179 1126197 1141773 1160301 1182606 1209415 1242352 1283563
60497 1283563 1334575 1396334 1470134 1557719 1660662 1780386 1918396 2075455 2250708 2442729
60487 2442729 2651782 2880600 3133128 3413260 3724510 4069147 4445623 4845048 5248645
60478 5248645 5628199 5950613 6184975 6308269 6307629 6180921 5937767 5599560 5195863 4758104
60468 4758104 4314030 3884785 3484113 3119276 2793299 2506826 2258309 2043924 1858954
60459 1858954 1699569 1562867 1445774 1344988 1257918 1182782 1117810 1061060 1010967 966482
60449 966482 926799 891507 860646 833868 809910 787665 767314 749451 733433 717767 701951
60438 701951 686796 672910 659929 647360 635164 623382 612164 602307 594723 589079 583878 578270
60426 578270 572949 568904 566148 564123 562567 561366 560132 558620 557296 556996 558144 560616 564117 568417
60412 568417 573305 578453 583338 587455 590852 594295 598492 603191 607459 610827 613680 616544 619492 622402
60398 622402 625448 629088 633688 639177 644980 650448 655584 661081 667364 673876 679726 684792 689618 694318
60384 694318 698162 700389 700971 700479 699413 697721 694906 690689 685603 680604 676027 671420 666691 662763 660516
60369 660516 659574 658915 658307 658336 659185 660296 661323 662664 664815 667656 670616 673218 675376 677371 679605 682227
60353 682227 685114 688282 692066 696622 701594 706632 712016 718396 726043 734549 743113 751006 758061 764716
60339 764716 771176 776583 779725 780663 780724 780639 779746 777531 774901 773141 772599 773251 775571 779782 785071 790741
60323 790741 797376 805569 814161 821159 825870 828657 829122 826282 820512 813674 807058 800532 793921 787807
60309 787807 782620 778113 774256 771633 770492 770206 769993 769502 768475 766670 764332 762063 760108 758481 757690
60294 757690 758431 760505 763020 765725 769109 772976 776074 777592 778183 779046 780651 782687 784565 785716 786027
60279 786027 786195 787045 788465 789781 791130 793530 797455 802383 807997 814748 822784 831261 839309 847030 855171
60264 855171 864507 875787 889476 905103 921602 938742 957582 979205 1003800 1031297 1062046 1096289
60252 1096289 1133701 1174115 1218208 1266933 1320802 1380169 1445701 1518024 1597305 1683584 1777135
60241 1777135 1878101 1986039 2100022 2218774 2340570 2463418 2585432 2704494 2817666
60232 2817666 2921861 3015389 3097973 3168910 3226102 3267565 3293147 3304103 3301533 3285966 3258148
60221 3258148 3219570 3172430 3119534 3064028 3008797 2956132 2907991 2866252 2832505 2807942 2793621
60210 2793621 2790529 2799403 2820950 2856268 2906432 2971523 3050538 3142345 3246060 3360308 3482794
60199 3482794 3610906 3742092 3873255 4000347 4119020 4225499 4316799 4390711 4445858 4481380
60189 4481380 4496430 4490447 4463873 4417957 4353850 4272783 4177473 4072474 3962731 3852293 3744620
60178 3744620 3643136 3550825 3469833 3401952 3348984 3312189 3291884 3288080 3301057 3330937 3377072
60167 3377072 3438106 3512068 3596066 3686411 3779475 3872091 3960949 4042270 4112458 4168732 4209087
60156 4209087 4232483 4239447 4231728 4210859 4177707 4133892 4082898 4029084 3976075 3926631 3883512 3849642
60144 3849642 3827662 3819843 3828182 3854199 3898836 3962911 4047342 4152803 4279726 4429098 4602779
60133 4602779 4802596 5029431 5283470 5564736 5872811 6206278 6562738 6938890 7330176
60124 7330176 7730624 8133387 8531194 8916256 9280538 9616695 9918544 10180532 10397450
60115 10397450 10565091 10680649 10742034 10747412 10695906 10588276 10426451 10213041 9952279 9651289
60105 9651289 9319845 8968757 8608535 8248918 7898676 7565360 7255150 6972899 6722351
60096 6722351 6506552 6327964 6187867 6085953 6021211 5993157 6001465 6044323 6117827 6217042 6336737
60085 6336737 6470914 6612647 6754977 6891373 7015172 7119763 7200172 7253947 7280099 7278003
60075 7278003 7247988 7192141 7113445 7014283 6896232 6760829 6609878 6445415 6269975 6086694
60065 6086694 5898701 5708713 5519504 5334320 5156480 4988927 4834343 4695082 4572656
60056 4572656 4467824 4381468 4314791 4268477 4242487 4237007 4252718 4289608 4346409 4421760 4515060
60045 4515060 4625390 4750316 4886405 5030024 5176746 5320697 5455668 5576653 5679740
60036 5679740 5761226 5817875 5847775 5850134 5824578 5771389 5692160 5589443 5466077 5325524 5172526
60025 5172526 5012610 4850882 4691647 4538709 4395397 4264331 4147469 4046035 3960227 3889684
60015 3889684 3834710 3796464 3775662 3771894 3784780 3814945 3863158 3929477 4014185 4118745 4244574
60004 4244574 4391187 4556310 4737088 4930006 5129975 5330602 5525252 5707339 5870380
59995 5870380 6009154 6120770 6203826 6256903 6278695 6269015 6228439 6157353 6056768 5930081 5782872
59984 5782872 5620883 5449228 5273474 5100042 4934824 4781994 4644397 4524386 4423908
59975 4423908 4344254 4285978 4248900 4232294 4235538 4258428 4300430 4359907 4434670 4522999 4623425
59964 4623425 4733751 4851038 4972303 5094419 5213483 5325376 5427219 5517576 5595195 5658390
59954 5658390 5706044 5738612 5757664 5764837 5761598 5749892 5732769 5714271 5698662 5689825 5691600 5708590
59942 5708590 5745963 5808187 5898392 6019219 6173631 6364456 6593664 6862587 7172180 7522266
59932 7522266 7910680 8333385 8784545 9255482 9733786 10203989 10648827 11049580 11386523
59923 11386523 11641174 11799379 11853021 11800241 11645378 11398522 11073990 10688572 10260542 9808544
59913 9808544 9349485 8896852 8460965 8049968 7669884 7324490 7016316 6747505 6519110
59904 6519110 6330362 6179830 6066929 5991385 5951920 5946851 5975688 6038750 6135229 6262672 6418096
59893 6418096 6598230 6798405 7012105 7231522 7447626 7649837 7826902 7968481 8065460 8109524
59883 8109524 8094304 8017659 7882163 7693346 7458400 7186377 6887866 6573274 6251591 5930696
59873 5930696 5617773 5318792 5037992 4778199 4541196 4327725 4137626 3970233 3824510
59864 3824510 3699058 3592528 3503768 3431068 3371575 3322072 3279928 3242632 3207002 3170029 3130431
59853 3130431 3088540 3044993 3000598 2957223 2917536 2883605 2856464 2836819 2825055 2820469 2821316 2825520
59841 2825520 2830489 2832599 2828217 2815497 2794314 2764667 2726468 2680907 2630682 2578423 2525853 2474579
59829 2474579 2426511 2383106 2345179 2313722 2289967 2274293 2266106 2265205 2272415 2288480 2313057 2345002
59817 2345002 2382825 2424699 2469061 2515740 2565946 2620978 2681509 2747851 2819559 2894248 2967686
59806 2967686 3035504 3094331 3141551 3175381 3195808 3204543 3203604 3194614 3179677 3161750 3143486 3126482
59794 3126482 3112214 3103017 3101578 3109944 3129323 3160385 3203626 3260105 3332053 3422097 3531905 3662538
59782 3662538 3816298 3997300 4209949 4457790 4744034 5071747 5442079 5851860 6291933
59773 6291933 6745636 7187488 7584346 7900538 8105332 8179865 8121626 7944883 7676096 7346307
59763 7346307 6984759 6615877 6258290 5924523 5621872 5354289 5123467 4928690 4767245
59754 4767245 4636013 4532484 4454294 4398898 4364273 4349266 4352748 4373080 4408901 4459859 4526079
59743 4526079 4607348 4703252 4813784 4939596 5081962 5242516 5422614 5623014 5844674 6089711
59733 6089711 6360921 6660655 6990951 7354488 7754263 8192324 8669812 9188013 9747887
59724 9747887 10348020 10983679 11647537 12329819 13017555 13695399 14348466 14964562 15534872
59715 15534872 16055114 16527354 16959854 17364534 17755168 18147327 18557282 18998811 19480928
59706 19480928 20008215 20581105 21194297 21835753 22488237 23131236 23741345 24293037 24761769
59697 24761769 25127587 25376905 25503243 25508163 25401165 25197749 24917520 24583575 24221301 23855513
59687 23855513 23508073 23197791 22940844 22750201 22635634 22605390 22667379 22828354 23093294 23466741
59677 23466741 23953867 24558933 25282956 26123051 27072205 28117262 29236194 30396869 31557072
59668 31557072 32664909 33660883 34482948 35073107 35383782 35384166 35066059 34445963 33561593 32465348
59658 32465348 31217927 29882130 28516525 27171167 25886614 24693730 23612019 22648141
59650 22648141 21796578 21040700 20352764 19695683 19029592 18320919 17549229 16710240 15815637
59641 15815637 14888887 13957421 13045521 12171886 11350196 10588912 9890807 9254877 8679313
59632 8679313 8162055 7699358 7285804 6916194 6586396 6292447 6030187 5796197 5588215
59623 5588215 5404412 5242920 5102120 4980650 4876901 4788919 4714771 4652656 4600815 4557551
59613 4557551 4520870 4487702 4454125 4416926 4374435 4325452 4268222 4201333 4124898 4040032 3947913
59602 3947913 3850305 3750221 3650665 3552999 3457566 3365531 3278980 3199431 3127289 3062601 3005439
59591 3005439 2955669 2913197 2878354 2851417 2832032 2819705 2814376 2815804 2822960 2834790 2850997 2871194
59579 2871194 2894016 2918097 2943316 2969881 2996753 3022345 3046364 3069723 3093038 3116689 3142165
59568 3142165 3171745 3206682 3246963 3292984 3346217 3407912 3478311 3557542 3646405 3745950 3857028
59557 3857028 3980569 4117673 4269210 4435875 4618724 4819095 5037940 5275609 5531958
59548 5531958 5805874 6094836 6395586 6705086 7020055 7335829 7646661 7947318 8233889
59539 8233889 8503442 8753944 8984684 9195811 9386853 9555795 9699584 9815642 9903789 9967760
59529 9967760 10014695 10052427 10087297 10124749 10170987 10232577 10314293 10417950 10542671 10684734 10836734
59518 10836734 10987745 11124814 11234451 11303724 11321669 11280412 11174951 11002509 10763191 10461257
59508 10461257 10104815 9703990 9269681 8813456 8347216 7882162 7428018 6992729 6582043
59499 6582043 6199418 5846960 5526473 5239148 4984500 4760314 4563662 4391760 4242389
59490 4242389 4114250 4006723 3918702 3848050 3792801 3752486 3727586 3718153 3723800 3744601 3780966
59479 3780966 3832878 3900187 3983585 4084414 4203577 4341335 4498026 4674280 4870506 5086619
59469 5086619 5321940 5574714 5841837 6119254 6401957 6683116 6953878 7204785 7426733
59460 7426733 7610199 7745024 7822821 7839549 7795066 7691187 7531629 7323205 7075190 6797139
59450 6797139 6498028 6186847 5872285 5561410 5259342 4970013 4696340 4439925 4201639
59441 4201639 3982302 3782104 3599903 3434248 3284672 3150948 3031631 2924647 2828993 2744605
59431 2744605 2670907 2606802 2551786 2505687 2467512 2435867 2410343 2391243 2378146 2370088 2367002 2369519
59419 2369519 2377294 2388748 2402545 2418337 2436248 2456833 2481482 2511794 2548410 2590713 2636553
59408 2636553 2681290 2718688 2745269 2763807 2781051 2802516 2830864 2868085 2916482 2977567 3052225
59397 3052225 3141649 3245430 3358660 3474058 3588465 3705762 3833130 3976699 4141241 4331250
59387 4331250 4550338 4800858 5085314 5406924 5768181 6170361 6615050 7104138 7636759
59378 7636759 8207223 8806469 9423870 10046627 10659463 11247150 11797470 12301661 12753765
59369 12753765 13151016 13494136 13786188 14031485 14235524 14404022 14540470 14644936 14715483
59360 14715483 14749535 14743355 14691842 14590261 14435848 14227871 13968055 13662241 13320538 12954698
59350 12954698 12575733 12193803 11817830 11453094 11099674 10754175 10412303 10069371 9720306
59341 9720306 9361268 8991232 8611403 8224116 7833194 7444217 7062905 6693575 6339767
59332 6339767 6005271 5693202 5404667 5139461 4897613 4679280 4483724 4309472 4155267
59323 4155267 4020164 3903068 3802809 3718275 3647980 3590059 3543172 3506881 3480777 3464072 3456385
59312 3456385 3457962 3468573 3487122 3513010 3546876 3589285 3639647 3697266 3762448 3835539 3915608
59301 3915608 4001086 4091060 4184959 4281490 4378762 4475132 4569152 4658993 4742475 4817480 4882245
59290 4882245 4935965 4979451 5014558 5042786 5065270 5084225 5103095 5124856 5151297 5184410 5227096
59279 5227096 5281706 5348972 5429027 5522158 5627615 5742832 5864750 5990787 6117556 6239785
59269 6239785 6351539 6447324 6520889 6564472 6571411 6539619 6471919 6373949 6252888 6117093 5974840
59258 5974840 5832849 5696300 5569476 5455411 5355616 5271195 5203740 5154236 5121790 5104470
59248 5104470 5100917 5110169 5130534 5159656 5195275 5235087 5276479 5317482 5357620 5397167 5436266 5475720
59236 5475720 5517977 5566293 5623409 5691977 5775704 5879095 6006441 6161825 6349383 6572353
59226 6572353 6832049 7128312 7460028 7823792 8212053 8613121 9012485 9393547 9738259
59217 9738259 10028984 10250474 10390300 10438735 10389814 10242749 10001941 9676208 9278492 8825239
59207 8825239 8334400 7823378 7308396 6804097 6322006 5869318 5449682 5064732 4714521
59198 4714521 4397707 4112677 3858257 3632728 3432900 3255162 3097012 2956805 2832694
59189 2832694 2722652 2624964 2537862 2459237 2387543 2322401 2263637 2210391 2161926 2118455 2080247
59178 2080247 2046567 2016350 1989266 1965393 1944665 1927404 1914486 1906087 1901161 1899019 1900412 1906098
59166 1906098 1915504 1927982 1944296 1965452 1990980 2019776 2051802 2087493 2126331 2167588 2211866
59155 2211866 2260356 2313096 2369393 2429415 2493881 2562672 2635235 2711926 2793521 2879754 2969760
59144 2969760 3063474 3161105 3261442 3362106 3461202 3557418 3648861 3733270 3809231 3875888 3931706
59133 3931706 3974943 4005282 4023853 4031877 4030524 4021837 4008541 3993071 3977818 3965932 3960601 3963774
59121 3963774 3976723 4001405 4039952 4093277 4161598 4246019 4348170 4468525 4606590 4762551
59111 4762551 4937228 5130341 5340151 5564569 5801015 6044861 6289079 6525419 6744932
59102 6744932 6937768 7094274 7206949 7270999 7283845 7245921 7162086 7040783 6891316 6722373
59092 6722373 6542283 6358558 6176461 5998783 5826954 5661404 5501261 5345127 5192273
59083 5192273 5042015 4892273 4740369 4585409 4428548 4270785 4111800 3951300 3790277
59074 3790277 3630508 3473615 3320846 3173053 3030756 2894681 2765839 2644428 2529410
59065 2529410 2420231 2318237 2225017 2139993 2061205 1987960 1920889 1859714 1803025 1750376 1702616
59054 1702616 1659690 1619830 1581548 1545021 1510847 1478658 1447603 1417221 1387361 1358117 1330209
59043 1330209 1304566 1281283 1259703 1239649 1221700 1206313 1193534 1183540 1176490 1171901 1169135 1168439
59031 1168439 1170559 1175481 1182569 1191691 1203090 1216339 1230589 1245530 1260831 1274899 1285758 1293113
59019 1293113 1298130 1301180 1301387 1298613 1294366 1290382 1287500 1286214 1287015 1289768 1293808 1299042 1306086 1315143
59005 1315143 1325618 1336903 1348670 1360404 1371527 1381836 1391017 1398116 1402518 1404964 1406434 1406581 1404771
58992 1404771 1402100 1400667 1401072 1402356 1404256 1407683 1412938 1419244 1426245 1434387 1443652 1453500 1464163 1476306
58978 1476306 1489316 1501674 1513339 1526016 1540651 1556280 1571800 1587383 1603730 1621433 1641421
58967 1641421 1664517 1690118 1716696 1743916 1772867 1803987 1836352 1869337 1903285 1938056 1972547
58956 1972547 2006280 2040054 2074542 2109696 2145983 2184764 2226910 2272323 2321211 2374395 2432106
58945 2432106 2494042 2561003 2634807 2716101 2803855 2897565 2998397 3107604 3225476 3352521
58935 3352521 3490079 3639006 3799242 3971509 4158057 4361084 4581851 4822027 5084440
58926 5084440 5371736 5685664 6028431 6403430 6813855 7261896 7749946 8281143 8857838
58917 8857838 9480618 10149338 10863505 11620477 12413948 13234218 14068077 14897335 15698701
58908 15698701 16446185 17113205 17672948 18099679 18372566 18479199 18416492 18190185 17814169
58899 17814169 17308483 16696167 16001463 15249491 14464688 13667903 12875502 12101006 11355742
58890 11355742 10647547 9980846 9358883 8784478 8258218 7777803 7340105 6942507 6581849
58881 6581849 6254063 5955795 5684793 5437986 5210957 5000192 4804198 4621673 4450457
58872 4450457 4289334 4139059 4000364 3872448 3754320 3645955 3547042 3456193 3372582 3296795
58862 3296795 3229034 3168006 3112572 3062921 3019062 2979896 2944904 2915069 2890942 2871424 2855717
58851 2855717 2844799 2839700 2839985 2845354 2857004 2875841 2900868 2930985 2966989 3010243 3060703 3117811
58839 3117811 3182074 3254168 3333654 3420107 3514463 3617840 3730139 3851195 3982204 4124681
58829 4124681 4279128 4446054 4627203 4824458 5038731 5271257 5524849 5802518 6106109
58820 6106109 6437699 6801172 7200824 7639302 8118270 8640112 9207518 9821975 10483355
58811 10483355 11189578 11935164 12710642 13503779 14299715 15078743 15815596 16482543 17052764
58802 17052764 17501027 17804673 17947469 17922861 17733306 17388458 16905278 16307404 15621140
58793 15621140 14871527 14082063 13275319 12470941 11683581 10924088 10201382 9521571 8886797
58784 8886797 8297076 7752524 7252494 6794135 6373907 5989579 5639131 5318984 5025321
58775 5025321 4756218 4510640 4286097 4078919 3885994 3704845 3533261 3370559 3218142
58766 3218142 3077198 2946732 2825164 2712405 2608700 2512897 2423790 2341906 2268003 2201001
58756 2201001 2139380 2083395 2033888 1990015 1950289 1914829 1884401 1858149 1834426 1813092 1794902
58745 1794902 1779318 1764937 1751434 1739220 1727864 1716676 1706073 1696509 1686795 1675343 1662378 1649160
58733 1649160 1635789 1621562 1606719 1592085 1577609 1562811 1547836 1532539 1515610 1496177 1475154
58722 1475154 1453357 1429616 1402597 1373195 1343118 1312437 1280646 1248854 1218634 1189875 1162027
58711 1162027 1136230 1113787 1093640 1073943 1055134 1038901 1025055 1012025 999643 988702 978423
58700 978423 967132 955065 943945 934152 924689 915491 907322 899724 891444 882679 874816 868361 863144
58687 863144 859845 859063 859538 859658 860010 861961 864345 864227 860681 855313 849408 842987 836469 830854 826350
58672 826350 822833 821211 822123 823859 823853 821842 819433 817250 814964 813394 813863 815821 817484 818471 819429 819722
58656 819722 818081 815042 812234 809756 806851 804461 804436 806766 810386 815980 824948 836165 847050 857566
58642 857566 869976 884817 900430 916538 935053 957006 981639 1008788 1039252 1072655 1107886
58631 1107886 1145885 1189081 1237869 1290626 1347469 1410948 1482664 1562264 1650369 1749462 1861187
58620 1861187 1985568 2123666 2278263 2451024 2641372 2848742 3073379 3314029 3566783
58611 3566783 3826358 4085973 4335439 4561747 4752419 4897044 4986643 5015056 4981874 4892017
58601 4892017 4752575 4572225 4362824 4137566 3906449 3675610 3450687 3237527 3039349
58592 3039349 2856435 2689185 2538621 2403676 2281341 2170242 2071237 1984027 1906293 1836809
58582 1836809 1776321 1724605 1679558 1639912 1605995 1577188 1551470 1528070 1507682 1489536 1471293
58571 1471293 1452395 1434423 1417529 1399619 1379687 1358768 1336986 1313027 1287380 1262665 1239624
58560 1239624 1216023 1190610 1164975 1140366 1115894 1091233 1068031 1047281 1028092 1010197 994776
58549 994776 981745 969193 956629 945816 937331 929348 920940 913468 907547 901771 895684 890867 887731
58536 887731 884331 879763 875700 873173 870833 867786 865146 863336 860726 856394 851412 846200 839440 830754
58522 830754 821432 811471 799063 784234 769670 756727 743933 730665 718790 709202 700292 691434
58510 691434 684446 679912 675594 670305 665897 663593 661784 659340 657668 657540 657293 656122 655778 657024 657933
58495 657933 657706 658587 661685 664458 664814 664414 665414 667110 668206 669275 670547 670399 668450 667232 668447
58480 668447 670501 671741 672977 674784 675769 675765 677230 681108 684806 686660 688809 693012 697278 699479 700724
58465 700724 702251 702471 700299 698070 697923 698310 697177 695505 694657 693191 689469 684618 680051 674850 668316
58450 668316 662062 656930 651026 643486 636756 632334 627877 621577 615745 612728 610906 608265 606309 606698
58436 606698 607414 606176 604533 604743 605638 605387 605297 607060 609132 609606 609806 611392 612900 612867 613310 616244 619820
58419 619820 621845 624103 629136 635673 641297 646871 654242 662340 669539 677150 686624 696087 703543 710702
58405 710702 719715 729048 736503 743211 750574 756452 758632 758988 759962 760126 757583 754439 753254 752257 748979
58390 748979 745480 744977 746182 746080 745569 747266 750329 752506 754803 759100 763577 765484 766085 768122 770802
58375 770802 772078 773299 776812 781490 785325 789767 796774 804456 810466 816678 825521 834803 841334 846580
58361 846580 853397 860378 864940 868805 874686 880605 883355 884620 887786 891659 893358 894449 897999 902397
58347 902397 904301 905013 907722 911236 912680 913626 917248 922140 925310 928359 934298 941207 945657 949455 956349
58332 956349 965174 973043 981959 994989 1009142 1019640 1028290 1039966 1053726 1065282 1075409 1087801
58320 1087801 1101141 1111426 1119861 1130512 1142534 1152594 1162403 1175781 1190899 1203576 1215410 1230266
58308 1230266 1245685 1256689 1265335 1277387 1292158 1304871 1316436 1331362 1348426 1363027 1376462
58297 1376462 1393204 1411467 1426409 1440257 1458988 1481256 1501033 1519016 1540704 1565246 1587146
58286 1587146 1607148 1630371 1655448 1676778 1695957 1719715 1748032 1775482 1802613 1834462 1869539
58275 1869539 1902077 1933562 1970152 2010427 2047819 2083248 2122807 2164923 2202854 2238090 2277923
58264 2277923 2321577 2362425 2402111 2448328 2500209 2550351 2599630 2655316 2716305 2775534 2835226
58253 2835226 2903915 2980083 3055092 3130501 3215363 3308014 3398336 3486797 3582991 3686629 3788927
58242 3788927 3891683 4005275 4128575 4251107 4374469 4510814 4660782 4814503 4973733
58233 4973733 5150344 5343292 5540631 5744119 5967487 6210645 6461246 6721670 7007537
58224 7007537 7319352 7643935 7984503 8359760 8772412 9209526 9674986 10189081 10755081
58215 10755081 11360763 12014011 12740314 13544353 14413855 15362689 16427927 17623658 18944863
58206 18944863 20419223 22105359 24039079 26238645 28767508 31732245 35217312 39292205
58198 39292205 44088022 49791436 56564899 64574387 74118443 85646188 99667762 116798068
58190 116798068 137897596 163965498 195784949 233712305 277490328 325358639 372634931
58183 372634931 411597689 434130880 435740537 417636358 385298526 345275348 302909499
58176 302909499 261802220 224083495 190719331 161875258 137352568 116822740 99822342
58169 99822342 85789453 74218062 64717353 56930842 50515255 45221343 40900774 37414012
58161 37414012 34611886 32412567 30807804 29782907 29314624 29451976 30305031 31939761
58153 31939761 34364383 37582932 41463203 45443014 48506725 49663859 48534843 45486721
58145 45486721 41278370 36635087 32059525 27837766 24095891 20859299 18107960 15803025
58137 15803025 13888446 12300088 10982535 9889626 8976236 8204255 7551522 7002512 6535752
58128 6535752 6129979 5774035 5460015 5174879 4908330 4659828 4428643 4206490 3988825
58119 3988825 3783111 3596656 3426043 3267098 3124583 3002558 2895060 2795595 2706420 2629462
58109 2629462 2557245 2481754 2403895 2326399 2246324 2162435 2081082 2006808 1935487 1863912 1797267
58098 1797267 1739682 1686329 1632524 1582042 1538666 1497906 1454982 1413204 1376793 1342904 1308137
58087 1308137 1275617 1248439 1223119 1196398 1171455 1150748 1129820 1104943 1079830 1058244 1036958
58076 1036958 1012726 989219 970188 952423 932294 912876 897873 884683 870099 856797 847627
58065 847627 839333 828403 817460 809651 802414 793026 784616 780387 777217 771092 763640 757445 750305 740116
58051 740116 730110 723272 716751 707660 699108 694584 691621 687065 683382 683529 684684 683435 682305 684674
58037 684674 687892 688084 687458 690289 695599 700150 704771 711325 717060 718440 717354 717463 717592 714703 710252
58022 710252 707584 705863 702346 697929 694855 691614 685581 678169 672222 666895 660177 653664 649682 646333
58008 646333 640527 633300 627180 621071 612884 604609 599465 596277 591753 586118 581594 577556 572142 566573
57994 566573 563014 560089 555231 549626 546315 545276 544690 545035 547678 551392 554497 558349 564621 571374 576040
57979 576040 579934 585549 591730 595966 599170 603642 608443 611288 612850 614691 615170 612077 607305 604144
57965 604144 601828 597429 591291 585790 580461 573297 565442 559776 556012 551753 547141 543944 541261 536684
57951 536684 530707 525680 521467 516406 511450 509055 508924 508966 509383 511687 514850 516653 517779 520339 523379
57936 523379 524099 522530 520725 518347 513443 506822 501154 496262 489549 480677 471665 462849 452879 442447
57922 442447 433961 427693 422058 417384 415615 416515 417890 419370 422398 426853 431327 436421 444133 454149
57908 454149 464246 474086 485117 497022 507814 517243 526667 535764 542727 547465 551278 553686 553038
57895 553038 549946 546739 543699 539120 532806 526209 519423 511410 502837 495319 488258 479873 470951 464023
57881 464023 459109 453920 448105 443685 441359 439932 439306 440416 442246 442618 442110 443548 447449 451564 455180
57866 455180 460153 467141 474431 481212 488606 496671 503616 508848 513824 519139 523512 526209 527769 527926
57852 527926 525647 521588 517733 514291 509709 503903 498491 493598 487580 480329 473810 468806 464075 459160
57838 459160 455060 451680 447583 442837 439193 436929 434382 430996 427861 424803 420082 413626 407439 402031
57824 402031 395472 386846 377708 369219 360719 352078 344700 339117 334109 329097 324888 321414 317354 312730
57810 312730 309223 307192 305058 302301 300338 299652 298937 297962 298460 301138 304519 307739 311758 316830 321599
57795 321599 325922 331856 340512 350412 360138 370009 379791 387413 391597 393651 395243 396447 397133 398017 398997
57780 398997 398529 396004 392820 389924 386308 381003 374612 367783 360186 352097 345066 339934 335974 332717
57766 332717 330621 329249 327109 324211 322556 323166 324851 326779 329746 333810 337194 338894 340151 342079
57752 342079 344042 345620 347860 351203 354359 356595 358985 362078 364620 366051 368009 371729 376004 379312
57738 379312 381993 384790 387286 389465 392889 398530 405117 411193 417089 423421 429485 434808 440626 448194
57724 448194 457065 466408 476381 486923 496939 506146 516014 527500 539629 551693 564939 580413
57712 580413 596973 613171 629496 647073 665765 685288 706689 730952 757489 785565 815865
57701 815865 849243 885410 924407 967917 1017611 1073618 1135996 1206113 1285093 1372627 1469028
57690 1469028 1576934 1699289 1837085 1990735 2162066 2353022 2563570 2792252 3037100
57681 3037100 3293957 3554932 3810045 4049170 4261285 4434310 4558782 4631735 4656265 4639139
57671 4639139 4590455 4523529 4452022 4386663 4334108 4294858 4258517 4203034 4103949 3947757 3737846
57660 3737846 3490293 3225922 2963806 2717194 2492758 2293214 2119827 1972058 1846984
57651 1846984 1741351 1653508 1582041 1523963 1476258 1438211 1410231 1391225 1378945 1372147 1370652
57640 1370652 1374173 1382843 1398096 1421180 1451532 1488330 1532778 1587102 1652109 1727560 1814157 1913281
57628 1913281 2025411 2150694 2290428 2446094 2617308 2802245 2999242 3205975 3417344
57619 3417344 3625636 3822162 3997219 4139570 4238550 4287257 4283054 4226278 4120480 3973304
57609 3973304 3794904 3595103 3382713 3166271 2953200 2748364 2554754 2374893 2210085
57600 2210085 2059210 1920357 1793362 1679176 1577366 1485989 1403539 1329304 1262312 1201584
57590 1201584 1146964 1098117 1053304 1010876 971362 936287 905482 877446 851747 828995 808790
57579 808790 789823 771892 755865 741691 728310 715497 704059 694178 685257 677392 671347 667056
57567 667056 663637 660901 659358 658874 658825 659459 661635 665388 670168 676182 683951 692900 702055 711891 723714
57552 723714 737363 751380 765431 780808 798429 818100 839900 864662 892794 924075 958826
57541 958826 997949 1041826 1090617 1145667 1209095 1281773 1363123 1453015 1552521 1662687 1783948
57530 1783948 1916828 2061765 2217832 2382626 2553218 2725811 2894258 3050124 3184484
57521 3184484 3289051 3356450 3381540 3363248 3304438 3210139 3086718 2941966 2784007 2619620
57511 2619620 2454257 2292979 2139890 1996906 1864558 1743788 1635640 1539643 1454164 1378268
57501 1378268 1311773 1253831 1203078 1159039 1121821 1090630 1064197 1042401 1025809 1013814 1004976
57490 1004976 999036 996767 997972 1001506 1007357 1016907 1031026 1049566 1072652 1100683 1133093 1169076
57478 1169076 1209655 1257117 1312355 1374672 1444362 1523359 1613063 1713606 1825634 1950588 2088489
57467 2088489 2237204 2394369 2557864 2723411 2883360 3028713 3150953 3241775 3293554 3301824
57457 3301824 3266521 3190454 3078151 2936625 2775104 2602379 2425063 2248553 2077822 1916342
57447 1916342 1765668 1626995 1501761 1390055 1289975 1199637 1118620 1046702 982582 924853
57437 924853 873111 827177 786238 749532 716866 687801 661351 637069 615297 595878 577840
57426 577840 560890 545910 533298 522080 511298 501052 491514 482217 473116 465144 458867 453570 448358
57413 448358 443134 437923 432376 426593 421415 417270 413649 410148 406998 404273 401749 399810 399231 399758 400323
57398 400323 400821 402123 404043 405213 405469 406379 408583 410556 411028 410837 411222 412050 413017 414882 418005 421039
57382 421039 422695 423585 424870 426228 426679 426404 426225 426092 425565 425178 425955 427986 430512 432942 434997 436459
57366 436459 437622 439355 442024 445024 447863 450764 453663 455775 456882 457929 459547 461192 462554 464488
57352 464488 467538 470770 473276 475660 478879 482676 486379 490215 494523 498591 501645 504241 507421 511173
57338 511173 514906 518766 523323 528482 533761 539138 544682 550011 554989 560308 566489 572942 578836 584200
57324 584200 589468 594715 600058 605953 612320 618302 623633 629264 635931 643227 650841 659404 669142 679053
57310 679053 688552 698594 709898 721401 731978 742491 754445 767616 780760 793790 807507 821789
57298 821789 835891 850213 866169 884390 904311 925268 946921 968940 991408 1015177 1040907
57287 1040907 1068227 1096636 1126457 1157912 1190177 1222577 1255835 1290737 1326270 1360522 1392764
57276 1392764 1423156 1450924 1474372 1492449 1504943 1511489 1511683 1505992 1495395 1480457 1461866 1441465
57264 1441465 1421453 1402670 1384724 1367505 1351676 1338082 1327651 1321359 1319272 1320117 1322812 1327881
57252 1327881 1336307 1347728 1360991 1375853 1392749 1411342 1430732 1450791 1472029 1494275 1516618
57241 1516618 1538496 1559923 1581059 1602438 1625127 1649669 1675384 1701571 1728728 1757526 1787476
57230 1787476 1817804 1848852 1881226 1914287 1947014 1979689 2013152 2046863 2079353 2110193 2139914
57219 2139914 2168288 2194421 2218490 2241905 2265704 2290064 2315331 2342132 2370374 2399283 2428496
57208 2428496 2458227 2488574 2519684 2552308 2587047 2623217 2659432 2695062 2730269 2765094 2799539
57197 2799539 2834035 2868760 2903098 2936904 2971560 3008411 3046779 3085030 3123015 3161830 3201543
57186 3201543 3240854 3278873 3315725 3351505 3386069 3419831 3453509 3487144 3520466 3553923 3588174
57175 3588174 3622929 3657491 3691976 3726758 3761323 3795203 3829501 3865865 3904274 3943459 3983057
57164 3983057 4023549 4064403 4104222 4142778 4181133 4219579 4257029 4292646 4326675 4359536 4391422
57153 4391422 4422784 4453866 4483790 4511462 4537333 4562994 4589142 4615232 4640867 4666097 4690556
57142 4690556 4713909 4737095 4761721 4788249 4816142 4845591 4877526 4911966 4947785 4984078 5020498
57131 5020498 5056398 5091086 5124688 5157366 5187907 5214564 5237070 5256485 5273573 5289018 5304906
57120 5304906 5324229 5349032 5380476 5420182 5469578 5528184 5594417 5667957 5749625 5839326 5936252
57109 5936252 6041171 6156823 6286263 6432798 6601495 6798985 7031850 7307178 7634891
57100 7634891 8028272 8502654 9075531 9767774 10603199 11607204 12807023 14231986 15910987
57091 15910987 17869263 20127398 22699554 25587773 28776796 32234568 35914942 39758249
57083 39758249 43694592 47652884 51564225 55350107 58909366 62124260 64877647 67054243
57075 67054243 68525929 69155188 68834573 67533168 65310019 62291184 58636804 54516897
57067 54516897 50096492 45528209 40951764 36494026 32262800 28338216 24770309 21582684
57059 21582684 18776339 16333391 14223928 12413466 10866054 9544844 8414909 7446723
57051 7446723 6615804 5900162 5280283 4740689 4269068 3854132 3485920 3157428 2863901
57042 2863901 2600844 2364013 2150498 1958270 1785219 1629751 1491213 1368442 1258977
57033 1258977 1160886 1073929 997584 929516 867592 811828 762614 718561 678040 641379 609533
57022 609533 581815 556906 534812 515864 499106 483699 470711 461404 454839 449224 444538 441913
57010 441913 441606 443679 449634 461393 479663 504981 539186 584347 642080 715817 811735 935673
56998 935673 1091704 1284935 1518504 1778588 2022948 2193974 2250558 2189381 2038523 1836205
56988 1836205 1615417 1399508 1202422 1030248 884514 765228 671137 598462 540766 490428
56978 490428 440898 388909 334996 281487 230259 182891 141604 108069 81712 60866 45244
56967 45244 35609 31521 31437 34937 42871 55367 71604 91608 116350 145974 179745 217560 258980
56954 258980 300025 333060 351300 352762 339901 317135 289266 260428 233025 207940 185979 168303
56942 168303 155421 146851 142041 140769 142668 147404 155431 167750 185032 207859 237494 275164 320405
56929 320405 370403 420166 462334 488271 492029 474016 440086 397400 351886 308153 269049 234862
56917 234862 204505 177747 155203 136659 121100 108225 98257 90429 83318 76648 71207 67051 63388
56904 63388 60133 57940 56708 55633 54728 54707 55499 56415 57673 60082 63408 66874 71225 78431 89292
56889 89292 103144 120110 141812 169529 203044 241006 280395 315600 340428 351968 351398 341279
56877 341279 324044 303123 282826 265904 252612 242663 236434 233896 234360 238207 247239 262552 283536
56864 283536 309834 342907 384935 437401 501360 577354 663352 752633 833828 893322 919731
56853 919731 909331 868402 809161 742769 676267 614292 560455 516427 481980 456962 441880
56842 441880 436446 439544 451227 473156 506846 553332 614899 695063 796127 917858 1057332
56831 1057332 1205988 1345550 1450862 1501261 1490638 1427515 1328095 1209863 1087755 971584
56821 971584 865826 772391 693003 628588 578233 540498 515007 501744 499918 508885 529508 563503
56809 563503 612087 676162 756736 853127 959605 1063413 1146423 1190951 1187658 1140120 1061675
56798 1061675 967380 868607 773043 686002 610126 545491 491444 447650 413247 386754 367692
56787 367692 356956 354959 360803 373973 395431 426314 466799 516344 572753 629653 676635 703807
56775 703807 706268 684587 643212 589354 531113 474257 420858 371457 327224 289272 257399 230860
56763 230860 209373 192402 178533 166625 156741 149139 143320 138712 135277 132768 130471 128265 126779
56750 126779 126019 125104 123807 122896 122502 121754 120589 120150 120697 120990 120500 120305 120701 120040 117312 113976 111666
56733 111666 109784 107071 103945 101402 98906 95369 91305 88184 86320 84965 83827 83072 82353 81200 79944
56718 79944 79223 78984 78804 78676 78812 79273 80261 81926 83562 84048 83475 83011 82854 81883 79870 78270 78100 78733
56700 78733 79564 80986 82704 83090 81564 79849 79498 79793 79487 78970 79213 80111 81330 83358 86227 88602
56684 88602 89591 90064 90862 91311 90958 91121 93018 95824 98161 99977 101447 101772 100948 101029 103523 106933 108836
56667 108836 109043 108706 107832 105981 104180 103729 104003 103570 102551 101834 100963 99061 96988 96282 96582 96220 94798
56650 94798 93197 91592 89472 87137 85355 83922 82189 80456 79301 78325 77086 76363 76825 77462 77111 76468
56634 76468 76676 77026 76223 74896 74593 75113 75232 75341 76851 79434 81331 82183 83274 85062 86691 87927
56618 87927 89499 91410 92757 93352 93907 94630 95110 95502 96301 97184 97444 97223 96983 96323 94824 93488 93716
56601 93716 95354 97215 98912 100657 102052 102808 103916 106292 108985 110548 111400 112881 114741 115708 115968
56586 115968 116877 118618 120269 121822 124076 126758 128766 130046 131405 132791 133628 134495 136640 140121 144165
56571 144165 148835 154561 160674 166370 172550 180700 190522 200818 212084 225875 242041 258922 276023
56558 276023 294169 313171 331608 348886 365446 381113 395267 408365 421174 432751 441349 447036
56546 447036 451228 453939 453856 450927 446459 440701 432690 422482 411192 398782 384106 367315 349949
56533 349949 332525 314231 295226 277132 261079 247242 236170 228373 222556 216574 210277 205276
56521 205276 201861 198427 194070 189441 184809 179553 173901 169118 165625 162779 160518 159218 158050 155688
56507 155688 152593 150369 149018 147248 145354 145042 146192 146533 145076 143305 142411 141741 140664 139711 139181 138570
56491 138570 137873 137557 137119 135724 134361 134987 137365 139191 139591 139998 141220 142304 142894 144179 146685 149414
56475 149414 151871 154815 158398 161667 164423 167445 170544 172701 174458 177746 182872 188076 192559 197475
56461 197475 203339 209016 214020 219399 225533 231348 236454 241791 247451 252074 255091 257427 259450 260454
56447 260454 260567 260814 260894 259393 256657 254839 254600 254432 253719 253566 253900 252819 249880 247181 245929 244608
56431 244608 241798 238232 234797 230927 226265 221671 217445 212678 207287 202488 198444 193842 188514 183949
56417 183949 180480 176654 172302 169441 169039 169598 170012 171043 172801 173599 172710 171666 171557 171558 171256 171674 172758
56400 172758 172680 170988 169657 169687 169543 168458 168297 170332 172945 174475 175791 178183 181120 183864 186970 190527
56384 190527 193219 194700 196545 199383 201583 202210 202673 203939 204824 204687 205069 206874 208634 209286 210036 211660
56368 211660 212748 212579 212984 215260 217825 219014 219786 221603 224002 226211 228734 231500 232952 232772 232950
56353 232950 234344 235017 233954 233458 235566 238821 240967 242174 243266 243421 242243 241682 243344 246065 248354
56338 248354 250915 254609 258423 261691 265803 271507 277093 281547 286757 294199 302150 308732 315025 322548
56324 322548 330322 337149 344245 352889 361896 370073 378638 388537 397996 405444 412206 419550 425801 429344
56310 429344 431803 435124 438086 438873 438576 438917 438883 436877 433919 431585 429071 425448 422443 421795 422231 422230 423342
56293 423342 427470 433253 438553 444104 451324 458948 465465 472567 482495 494196 505715 518145 533479
56280 533479 550786 568331 587367 609911 634815 659946 686383 716571 750188 785755 824504
56269 824504 868711 917912 970686 1028514 1094089 1167525 1248113 1338014 1440286 1554923 1680769
56258 1680769 1819542 1973851 2142809 2323696 2516411 2722031 2938227 3160142 3384479
56249 3384479 3608768 3827826 4034891 4225082 4394192 4535778 4643720 4716681 4756534 4764010
56239 4764010 4739717 4687833 4614567 4524061 4419419 4306022 4189626 4072325 3954054 3836535
56229 3836535 3721954 3609448 3496894 3384563 3273154 3160120 3042282 2920522 2797754
56220 2797754 2674028 2547804 2420309 2294206 2169631 2045857 1925202 1810836 1702450
56211 1702450 1598446 1500494 1411303 1329767 1253108 1182005 1118750 1062153 1009357 960936 919094
56200 919094 882492 848075 816441 790090 767946 746909 727315 711421 698050 684303 671175
56189 671175 661771 655260 648293 641133 636562 633968 630474 626904 626630 629357 631926 634398 639407 646333
56175 646333 652187 657638 666138 677664 689162 700521 714086 728915 741641 752505 764508 777104
56163 777104 786813 793539 800148 806306 808923 808238 807320 806107 802250 797247 795251 796260 796975 797871 802702
56148 802702 811515 821067 831933 848238 870461 895541 924179 961022 1007513 1061541 1124377 1200900
56136 1200900 1292560 1396796 1513260 1643223 1782307 1920798 2051740 2172344 2278245 2364580
56126 2364580 2433568 2493636 2550030 2602479 2651127 2696434 2733034 2752319 2752644 2740086 2719040 2689818
56114 2689818 2655124 2619533 2580957 2530799 2464023 2381778 2284273 2170316 2045259 1920420 1802590
56103 1802590 1691745 1589709 1502042 1429788 1368125 1314881 1272057 1237778 1205785 1174576 1148198
56092 1148198 1126625 1104536 1081103 1061467 1046667 1031706 1015579 1003420 996380 989076 979678 972994
56080 972994 971033 969961 968778 971311 977233 980994 982107 986486 995274 1002744 1007732 1016271 1030007 1042967
56066 1042967 1052909 1064868 1080140 1093077 1102365 1114274 1130849 1146143 1157931 1171728 1189294 1204818
56054 1204818 1216643 1231043 1250146 1268021 1282963 1301357 1324874 1346426 1363578 1383239 1408086
56043 1408086 1431392 1450561 1472547 1500253 1527006 1550277 1577163 1610141 1641351 1667492 1696346
56032 1696346 1731854 1766994 1798484 1833861 1876496 1918359 1955552 1996284 2045284 2095168 2141555
56021 2141555 2191661 2249279 2306462 2358847 2413937 2475514 2535714 2591451 2652306 2722984 2794854
56010 2794854 2864153 2940784 3029074 3118201 3202326 3291498 3391539 3492670 3589935 3694814 3813927
55999 3813927 3936587 4056712 4186126 4332262 4484303 4636228 4801410 4988693 5186412
55990 5186412 5386323 5600304 5836582 6083440 6334118 6603139 6899686 7210687 7529373
55981 7529373 7873532 8255525 8662985 9090409 9559306 10084174 10650689 11252259 11914432
55972 11914432 12657129 13469231 14349340 15333328 16450722 17695370 19073742 20639089 22442306
55963 22442306 24498558 26844814 29579905 32804820 36583323 41013557 46275163 52552115
55955 52552115 59991773 68821085 79436753 92325847 108026067 127277001 151068343
55948 151068343 180350159 215728181 257354709 304390444 353590132 398285072 429845918
55941 429845918 441581702 432113288 405418895 367993231 325898693 283524235 243645434
55934 243645434 207742841 176315063 149307211 126465572 107412814 91628060 78558345
55927 78558345 67748282 58818416 51399061 45170230 39919311 35492504 31727132 28480065
55919 28480065 25674510 23260949 21163690 19309109 17669867 16235282 14967010 13822968
55911 13822968 12795384 11886520 11072292 10324554 9644277 9039371 8492542 7982022 7511846
55902 7511846 7091893 6708861 6345296 6007285 5705893 5430016 5163900 4913530 4690266
55893 4690266 4485360 4285267 4095960 3928198 3773919 3620225 3472302 3340299 3217317
55884 3217317 3092078 2970312 2862753 2764363 2665504 2571509 2491443 2419097 2344256 2271746 2210687
55873 2210687 2155649 2096729 2037975 1988026 1942501 1893113 1844538 1804846 1768412 1725344 1679274
55862 1679274 1639314 1602854 1562690 1523205 1493264 1470346 1447232 1427389 1418532 1417445 1415437 1412045
55850 1412045 1409409 1400431 1377237 1345069 1314020 1283449 1248189 1213126 1186977 1167403 1146468 1125461
55838 1125461 1110566 1099030 1083408 1064814 1048760 1032518 1009741 983304 960607 940217 915776
55827 915776 889180 867276 849151 829019 808271 792470 779585 763197 744475 729395 716947
55816 716947 701634 684959 673032 665037 655179 643978 636938 633967 630557 627484 629197 634405 638157
55803 638157 641288 648134 656888 661955 663945 667686 672087 671528 665755 659210 652074 640997 627149 614716
55789 614716 602917 588050 571714 558474 547292 533947 519999 510494 504514 496928 488073 482883
55777 482883 481645 480110 477411 475372 471378 460703 445014 430287 417344 402699 387432 376466
55765 376466 369789 362984 356017 353125 354163 354064 350833 346588 341161 332338 322087 314934 310308 303673
55751 303673 294685 287009 280851 273321 265522 261460 260212 256880 251126 247133 245208 241257 234775 229767
55737 229767 227265 224281 220634 219556 221009 221502 221085 223463 228515 231676 231440 230673 229780 225580 217987
55722 217987 211072 206264 200825 194120 189156 186741 184147 180679 178734 178504 177427 175685 176416 179746 182433
55707 182433 184137 188165 195277 202631 209563 218393 228672 236615 241230 245226 249008 249843 248009 247654
55693 247654 250125 252248 252601 253716 256492 258079 257080 255635 254708 252417 248615 246127 245866 245479 244156
55678 244156 244084 245988 247990 249903 253736 258907 261959 262211 262759 264838 266195 266152 267106 269715 271600 272167
55662 272167 273769 276829 278815 279336 281140 284699 286898 286660 286778 288560 289689 289136 289159 290515 290478 287607
55646 287607 283789 279701 272996 263015 252735 243953 234915 224618 215001 206806 197800 187219 177724
55633 177724 170802 164333 156803 149770 144129 138104 131090 125402 122036 118601 113619 108961 105962 103031
55619 103031 99276 96640 96162 95799 94157 92889 93251 93768 93338 93210 93942 93833 92251 91062 90959 89830
55603 89830 86610 83262 81259 79561 77733 77367 78641 79140 77903 77068 77813 78456 78192 78772 80529 80824
55587 80824 78538 76160 75250 73819 70594 67900 67644 68086 67305 66405 66686 66939 66185 65858 66832 67482 67036
55570 67036 67508 69858 71664 71275 70940 73056 76393 78787 80593 82735 84232 84369 84559 85521 85329 82767
55554 82767 79859 78650 78237 77292 76632 76943 76894 75961 76125 78277 79987 79507 78979 80873 84118 86593 88636
55537 88636 91189 93186 93831 94930 97985 101382 103325 105171 108915 113625 117305 120184 123344 126123 127526
55522 127526 128220 128657 127375 123632 119478 116743 114239 110432 106424 103562 100550 95835 90589 86395 82085
55507 82085 75881 68743 62704 57707 52849 48857 46559 44636 41616 38429 36448 34847 32461 30343
55493 30343 29797 29726 28619 27407 27661 28697 29060 29163 29886 30274 29229 27850 27596 27754 27090 26191 25834 24984
55475 24984 22939 21471 22258 24092 25145 25908 27231 27697 25969 23744 23262 23701 23133 22193 22586 23642
55459 23642 23702 23440 24537 26372 27180 27236 27792 28166 27025 25346 24935 25143 24169 22560 22232 22980 23068 22462
55441 22462 22399 22479 21223 18975 17488 17179 17303 18069 20027 22154 23115 23585 24900 26417 26756 26519 27116
55424 27116 27986 27766 27108 27361 27539 25730 22733 21152 21447 21919 22105 23095 24741 25497 25055 24568 24371 23811
55406 23811 23157 23349 24119 24509 24820 25988 27565 28408 28637 28809 28120 25747 23002 21651 21054 19553 17744
55389 17744 17480 18406 18442 17250 16316 15967 15158 14014 13848 14665 15160 15054 15117 15109 14035 12199 10797 9839 8687
55370 8687 8067 9115 10888 11318 10252 9190 8524 7567 6823 7549 9330 10607 11341 12653 14145 14218 12892
55353 12892 11821 11679 11856 12468 14145 16049 16528 15644 14779 14135 12951 11708 11490 11608 10538 8881 8604
55336 8604 9631 10057 9542 9594 10512 11050 11204 12314 14118 14679 13705 13109 13657 13793 12552 11104 10566 10552
55318 10552 10676 11397 12650 13537 13872 14256 14401 13326 11381 10015 9394 8339 6755 5959 6380 7097 7834
55301 7834 9266 11163 12384 12909 13769 14855 15006 14351 14296 15096 15715 16111 17209 18476 18102 16024 14358
55284 14358 14402 15435 16696 18101 18777 17480 14913 13192 12665 11794 10444 10400 12017 13283 13106 12828 13446
55267 13446 13936 13487 12909 12619 11564 9434 7741 7407 7301 6414 5503 5403 5645 5946 7186 9676 12157
55250 12157 13644 14652 15654 16059 15707 15652 16406 17019 16854 16668 17066 17477 17521 17725 18090 17688 16514 15989
55232 15989 16732 17546 17522 17364 17631 17466 16221 14762 14084 14083 14632 16278 18844 20841 21325 21029 20843 20624
55214 20624 20308 20600 21601 22241 22037 21961 22721 23624 24098 24780 26092 27145 27152 26682 26506 26393 26001 25798 26178
55195 26178 26660 26707 26417 25902 25053 24290 24332 24901 24950 24471 24595 25603 26443 26575 26642 26897 26726 26202 26331 27158
55175 27158 27391 26564 25840 26045 26609 27022 27531 27794 26745 24518 22605 21424 19696 17022 14991 14715 15238
55158 15238 15426 15547 15899 15771 14971 14648 15426 16357 16742 17225 18101 18411 17832 17587 18269 18658 17959 17379 18069
55139 18069 19243 19771 19994 20552 21018 21088 21523 22517 22806 21840 21244 22570 25100 27384 29468 32056 34876
55122 34876 37507 40536 44340 47902 50244 51856 53382 54197 53601 52180 50682 48847 46543 44680 43735
55107 43735 42879 41735 41363 42123 42431 41279 40293 41308 43403 44348 43803 43124 43129 43855 45491 47686 48917
55090 48917 48250 46889 46457 46786 46895 46965 47662 48651 49455 50724 52948 54985 55573 55260 55131 54832 53727 52798
55072 52798 53347 54725 55428 55581 56279 57259 57370 56768 56546 56591 55813 54235 53007 52633 52812 53652 55381 57199
55054 57199 58109 58508 59404 60477 60532 59499 58274 56964 55004 52839 51789 52179 53039 53652 54155 54736 55442
55037 55442 56635 58520 60450 61680 62425 63189 63669 63455 63144 63440 63722 62993 61809 61737 63117 64733 65593
55020 65593 65844 66022 66427 67150 67929 68281 68327 68876 70044 70717 70205 69389 69188 68984 67824 66139 64826 63649
55002 63649 62040 60574 60028 59818 59001 58101 58157 58682 58331 57215 56700 57159 57556 57141 56208 55277 54702 54740 54958
54983 54958 54187 52186 50597 50959 52563 53722 54251 55042 55964 56105 55631 55635 56439 57626 59296 61708 64117
54966 64117 65608 66680 68422 70635 72432 74211 77249 81740 87011 93274 101298 110615 119914 129061
54952 129061 139024 150012 161496 173838 188017 203748 219488 234133 246966 256278 260094 258349
54940 258349 252586 243529 230866 215394 199257 183733 168610 154083 141423 131242 122682 114798
54928 114798 107371 100217 93233 87363 83931 82720 82102 81244 80622 80314 79625 78740 79022 81112 84214 87734
54912 87734 92095 97508 103442 109914 117859 127699 138877 151263 165500 181283 196609 209481 219254
54899 219254 225738 228204 226083 219736 209951 197450 183280 168717 154395 140383 127316 116397
54887 116397 107939 100955 94587 88951 84291 80286 76601 73310 70461 67957 65945 64532 63190 61438
54873 61438 59950 59777 60534 60721 59931 59349 59795 60631 60958 60595 59455 57244 54372 52092 51143 51117 51530 52488
54855 52488 53874 54837 54633 53284 51149 48613 46355 45027 44453 43917 43348 43298 43729 43849 43343 42743 42397
54838 42397 41965 41181 40229 39294 38576 38706 40209 42514 44468 45729 46720 47425 47504 47499 48497 50449 52092 52695
54820 52695 52725 52703 52655 52861 53877 55564 57159 58426 59650 60565 60634 60414 61200 63177 65345 67510 70830
54803 70830 75970 82085 88163 94213 100728 108117 117036 128136 141118 155042 169655 185277 201326
54790 201326 216231 228920 239071 245878 248136 245789 239989 231434 220221 207425 194979 183535
54778 183535 172214 161016 151631 145073 140206 135576 131265 127994 125725 124078 123015 122309 121494 120991
54764 120991 122038 124871 128253 131431 135189 140237 146000 151921 158656 167021 176978 188563 202609 219557
54750 219557 238569 258732 280046 302364 324391 344610 362211 376336 385468 388538 385785 377865
54738 377865 365092 348241 328998 308846 288400 268320 249598 232295 215386 198682 183618
54727 183618 171223 160652 150738 141719 134329 128374 123344 119317 116159 112956 109325 106116 103686 100776
54713 100776 96504 92283 90095 89821 89859 89645 89809 90352 90474 90092 90069 90809 91747 92272 92287 91908 91429 91465 92426
54694 92426 93873 94874 94878 94009 92922 92595 93578 95089 95603 94753 93831 93967 94785 95461 96081 97090 98267 99140
54676 99140 99780 100423 100990 101623 102956 105171 107606 109908 112712 116443 120404 123906 127380 131516 136099
54661 136099 140626 145270 150312 155345 159905 164132 168026 170864 172314 173406 175513 179052 183880 190039
54647 190039 197199 204271 210622 217024 224630 233844 244951 258781 275695 294795 315244 337463 361957
54634 361957 387804 413284 436968 457005 470506 475281 471629 461179 444763 422802 396921 369482
54622 369482 341919 314890 289536 267037 247292 229473 213646 200529 189965 181009 173315 167174
54610 167174 162392 158388 155235 153351 152325 151231 149969 149166 148893 148627 148328 148357 148393 147571 145693 143262
54594 143262 140375 136631 132138 127606 123321 118914 114238 109669 105529 101896 98899 96485 94018 90888
54580 90888 87494 84937 83772 83563 83434 82595 80673 78153 76139 75120 74472 73643 73116 73394 73826 73511 72790
54563 72790 72582 72666 71863 69796 67397 65693 64973 65078 65665 66206 66444 66739 67495 68525 69518 70651 72112
54546 72112 73534 74653 75970 78077 80862 84084 87973 92449 96543 99662 102680 106720 111622 116826
54532 116826 122922 130899 140471 150640 161424 173441 186118 197978 208520 218252 226902 233149 236243
54519 236243 236452 233749 227467 217589 205275 191876 178385 165860 155124 145886 137207 128963 121812
54506 121812 115740 109918 104245 99682 96652 94212 91361 88258 85574 83446 81659 80286 79602 79643 80150
54491 80150 80740 81158 81610 82683 84543 86519 87960 88997 89875 90064 89059 87718 87659 89356 91795 93997
54475 93997 95924 97819 99559 100968 102131 103176 104124 104923 105321 104930 103814 102640 101800 100856 99418 97957
54459 97957 97058 96442 95514 94322 93108 91559 89459 87535 86582 86244 85656 84784 84080 83454 82712 82384 82765
54442 82765 82740 81011 78123 75797 74638 73947 73425 73358 73305 72362 70856 70155 70561 70864 70281 69451 69175 69386
54424 69386 69704 69968 69998 69799 70054 71401 73301 74649 75328 75940 76330 75909 75352 76262 78904 81737 83504
54407 83504 84366 84701 84362 83645 83676 85198 87990 91833 96903 102899 108866 114296 119371 123997 127677 130553
54391 130553 133426 136545 139512 142395 145535 148186 148884 147540 145718 144427 143088 141058 138669 136149
54377 136149 132998 129164 125529 122529 119449 115735 111817 108100 104471 101360 99868 99948 99795 98042 95405
54362 95405 93222 91526 89679 87904 86952 86799 86762 86473 86004 85394 84700 84124 83734 83519 83891 85400 87734
54345 87734 89880 91585 93718 96904 100764 104820 109074 113340 117119 120646 124853 129730 133843 136139
54331 136139 137162 137835 138109 137591 136451 134843 132323 128661 124516 120568 116712 112668 108596 104626 100571
54316 100571 96610 93323 90581 87490 83907 80859 78815 76804 74017 71067 68794 66931 64935 63083
54302 63083 61742 60510 59091 58129 58083 58220 57765 57211 57384 57959 58028 57464 56710 55828 54806 54167 54284 54650
54284 54650 54726 54876 55554 56303 56576 56803 57509 58029 57404 56114 55668 56666 58350 59859 60971 61755 62390 63237
54266 63237 64349 65083 64845 64001 63472 63706 64548 65673 66565 66574 65678 64734 64400 64258 63649 62792 62395 62625 63181
54247 63181 63852 64364 64224 63432 62899 63469 64974 66733 68371 69566 69797 69144 68624 68897 69291 68947 68154 67605
54229 67605 67022 65689 63866 62535 62124 62388 63185 64393 65498 66163 66780 67577 67772 66728 65387 65247 66167
54212 66167 66506 65343 63396 61736 60752 60515 61111 62264 63387 64260 65059 65653 65531 64530 63071 61579
54196 61579 60172 58985 58310 58300 58792 59471 60029 60291 60293 60083 59503 58581 58005 58374 58963 58227 55870 53402 52131
54177 52131 51728 51463 51600 52472 53263 53081 52528 52808 53786 54270 53908 53465 53373 53223 52692 51970 51224 50459 49857
54158 49857 49588 49531 49800 51127 53776 56575 58054 58224 58239 58582 58752 58556 58483 58712 58806 58588 58446 58610 58842
54139 58842 58953 58982 58844 58418 57924 57681 57590 57430 57374 57598 57709 57331 56882 56895 56849 55699 53494 51496 50621 50599
54119 50599 50751 50817 50914 51290 52176 53373 54077 53677 52545 51512 50804 50174 49716 49755 50108 50296 50418 51042 52320
54100 52320 53874 55437 56889 57807 57729 56860 55899 55274 55083 55525 56697 58132 59192 59767 60068 60068 59741 59451
54082 59451 59339 58773 57243 55428 54482 54517 54671 54398 53801 52995 52077 51549 51856 52668 53403 54193 55403 56585
54064 56585 56905 56420 55911 55657 55420 55445 56384 58247 60401 62451 64251 65345 65533 65754 67185 69521 71360
54047 71360 72197 72803 73718 74738 76049 78420 81835 85085 87228 88599 90145 92566 96235 100879 105235
54032 105235 108191 110539 114428 120739 128134 135139 141998 149718 158241 166419 173273 178651 183046 187165
54018 187165 191368 195334 198646 201590 204723 207798 210004 211231 212169 213023 213136 212074 210140 207545 204081
54003 204081 199939 195938 192480 189118 185496 181893 178462 174733 170373 165729 161216 156868 152823 149520
53989 149520 146976 144563 141867 139127 136503 133656 130413 127186 124312 121686 119370 117849 117198 116653 115515
53974 115515 114015 112846 112289 112210 112438 112790 113037 113103 113038 112794 112448 112522 113465 114829 115715 116035 116507 117373 118049
53955 118049 118260 118603 119586 120932 122292 123931 126315 129522 133341 137403 141068 143873 146279 149224 152843
53940 152843 156430 159837 163924 169309 175583 182208 189282 196856 204248 210669 215921 220014 222684 223728
53926 223728 223309 221609 218784 215546 213057 211836 211423 211422 212120 213726 215851 218319 221707 226408 231730 236653
53910 236653 241079 245855 251891 259659 269095 279523 289909 299442 307631 313927 317930 320019 321042 321152
53896 321152 319732 316681 312942 309396 306006 302436 298747 295038 291109 286896 282530 277645 271409 263697
53882 263697 255410 247222 238842 230080 221704 214464 207944 201243 194264 187644 181757 176470 171545 166778
53868 166778 162035 157527 153718 150643 147749 144635 141455 138365 135205 131999 129107 126612 124178 121741
53854 121741 119620 117732 115525 112975 110750 109050 107279 105255 103701 102972 102344 101244 100072 99038 97291
53839 97291 94260 90982 88950 88264 87913 87345 86763 86387 86383 87129 88687 90333 91313 91648 91649 91337 91018 91594 93343
53820 93343 95070 95485 94849 94214 93753 93105 92836 93996 96329 98281 98947 98917 99072 99613 100553 102196 104699
53803 104699 107734 110960 114462 118523 123259 128533 133982 139221 144297 149697 155575 161323 166328 170828
53789 170828 175512 180551 185551 190168 194277 197777 200749 203498 205960 207412 207341 206280 205192 204326 203270
53774 203270 201794 199938 197499 194144 189996 185547 181099 176721 172552 168635 164681 160496 156458 153115
53760 153115 150549 148526 146970 145819 144781 143702 142790 141980 140565 138116 135367 133438 132460 131712 130853
53745 130853 130207 129937 129672 128979 127736 126089 124440 123291 122665 121969 120807 119579 118798 118340 117947 117974 118846
53728 118846 120151 121128 121799 122773 124091 125119 125522 125595 125613 125616 125808 126504 127528 128210 128069 127161 125817 124473
53710 124473 123613 123402 123477 123468 123560 124124 125016 125709 125962 125947 125970 126447 127757 129631 131082 131568 131848 133066 135354
53691 135354 138006 140629 143296 145812 147795 149408 151239 153415 155490 157170 158562 159785 160984 162619
53677 162619 165111 168246 171440 174454 177257 179462 180616 180980 181293 181805 182217 182472 182853 183309 183419 183146
53661 183146 182963 183102 183183 182726 181593 179914 177987 176238 174901 173834 173019 172983 174143 175907 177016 176780
53645 176780 175475 173685 171819 170211 169102 168438 168035 167892 168027 168286 168686 169616 171213 172874 173897 174295
53629 174295 174424 174292 173907 173856 174669 175875 176594 176845 177373 178315 179033 179297 179717 180811 182393 184068 185761
53612 185761 187680 190163 193478 197239 200321 202033 203196 205289 208712 212652 216444 220075 223451 226272
53598 226272 228831 231985 236070 240557 244948 249220 253211 256434 258861 261185 263982 267148 270428 273898
53584 273898 277629 281421 285112 288715 292034 294646 296457 297875 299258 300553 301656 302757 304136 305813
53570 305813 307494 308746 309374 309750 310452 311378 311762 311476 311598 313042 315232 317052 318500 320279 322179 323200
53554 323200 323212 323172 323580 323897 323739 323575 323921 324798 326299 328796 332223 335904 339370 342619 345468 347589 349374
53537 349374 351823 355187 358607 361462 364236 367598 371445 375287 378886 382085 384723 387165 390288 394481
53523 394481 399290 404384 410140 416844 424093 431569 439773 449304 459863 470592 481060 491411 501882
53510 501882 512682 524076 536188 548839 561872 575425 589750 605021 621423 639031 657503
53499 657503 676295 695356 715226 736356 758728 782103 806089 829911 852836 875061 897607
53488 897607 920980 944435 966873 988028 1008516 1029090 1050080 1071237 1091976 1112009 1131685
53477 1131685 1151365 1170731 1189318 1207551 1226363 1245767 1264700 1282467 1299490 1316401 1333248
53466 1333248 1349941 1366649 1383194 1398678 1412213 1423585 1432873 1440011 1445100 1448651 1451016 1451954 1451021
53453 1451021 1447964 1442543 1434549 1424316 1412752 1400566 1387867 1374657 1361126 1347209 1332447 1316627
53441 1316627 1300102 1283197 1265809 1247838 1229474 1210752 1191330 1171021 1150113 1128911 1107431
53430 1107431 1085782 1064450 1044021 1025006 1007920 992955 979512 966754 954860 945038 938049 933265
53418 933265 929314 925063 919931 914115 908859 905753 905328 906813 909386 912964 917561 922789 928445 934987
53404 934987 943005 952754 964401 978061 993322 1009469 1026446 1044929 1065220 1086867 1109666 1134149
53392 1134149 1160693 1189026 1219057 1251231 1285556 1321107 1357138 1393964 1432214 1472012 1513418
53381 1513418 1556821 1602186 1648571 1695089 1741751 1788853 1836243 1883765 1931619 1979613 2026836
53370 2026836 2072731 2117709 2161934 2204336 2243721 2280141 2314166 2345434 2372989 2396587 2416615
53359 2416615 2433049 2445521 2454233 2459823 2462267 2460627 2453878 2441589 2424087 2402433 2377944 2351194
53347 2351194 2321799 2289568 2255341 2220096 2183799 2145879 2106397 2066001 2025105 1983949 1943235
53336 1943235 1903897 1866315 1830260 1795393 1761296 1727289 1692896 1658280 1623785 1589298 1554535
53325 1554535 1519693 1485380 1452240 1420970 1392210 1365919 1341318 1318018 1296743 1278361 1262625
53314 1262625 1248426 1234794 1221049 1206543 1191041 1175034 1159057 1143093 1127258 1112502 1099791
53303 1099791 1088920 1078887 1069204 1060212 1052463 1046416 1042376 1040097 1038888 1038723 1040683 1045507 1052224 1059170
53289 1059170 1065988 1073689 1083072 1094074 1106433 1120006 1134492 1149729 1166278 1184945 1205753 1227929
53277 1227929 1250710 1273609 1296249 1318688 1341629 1365435 1389123 1411134 1430894 1448879 1465449
53266 1465449 1480509 1494110 1506376 1516850 1524819 1530282 1533902 1536071 1536857 1536641 1535775 1533545 1528493 1520020
53252 1520020 1508985 1496637 1483703 1470531 1457197 1443226 1427970 1411547 1394768 1377912 1360280
53241 1360280 1341252 1321157 1300741 1280351 1260058 1240217 1221443 1204162 1188304 1173251 1158042
53230 1158042 1141908 1124763 1107099 1089426 1071904 1054349 1036486 1018363 1000628 984080 968805
53219 968805 954150 939757 926102 913686 902350 891850 882424 874143 866241 857869 849073 840210 830888
53206 830888 820295 808275 795213 781189 766120 750489 735058 720019 705247 691087 677998
53195 677998 665669 653483 641714 631207 621874 612531 602297 591247 579657 567592 555409 543628
53183 543628 531981 519415 505471 490976 476991 463692 450694 437947 425884 414943 405243 396496
53171 396496 388182 379981 372041 364679 358007 352028 346719 341605 335756 328801 321609 315324 309991 304755
53157 304755 299079 293097 287110 281522 276932 273461 270236 266303 261821 257579 253736 249978 246555 244032
53143 244032 242181 240198 237931 235811 233698 230968 227795 225186 223569 222409 221366 220767 220699 220661 220387 220106
53127 220106 219804 219176 218489 218600 219850 221872 224486 227743 230950 232989 234013 235636 238819 242552 245256
53112 245256 246600 247323 248017 248712 249034 248289 245969 242471 238684 234680 229719 223843 218388 214301 210867
53097 210867 206829 202026 197246 193101 189692 186863 184175 181101 177746 174846 172667 170548 168014 165621
53083 165621 164045 162869 161002 157909 153900 149564 145555 142607 141129 140783 140766 140420 139505 138233 137170
53068 137170 136740 136728 136590 136238 135992 135799 135211 134238 133505 133379 133629 134078 134763 135291 134925 133695 132532 131900
53050 131900 131142 129707 128156 127324 127233 127491 128076 128963 129561 129329 128545 127849 127322 126669 125981 125690 125912 126360
53032 126360 126769 127031 127033 126703 126118 125480 125082 125185 125623 125710 125099 124516 124892 125906 126320 125792 125291 125495 125902
53013 125902 125918 125747 125656 125334 124667 124215 124240 124047 123082 121947 121568 122027 122928 124216 125821 127071 127329 126819
52995 126819 126137 125456 124893 125066 126461 128639 130797 132705 134442 135696 136164 136255 136651 137404 138146 138817 139546
52978 139546 140189 140728 141854 144383 148207 152400 156264 159827 163553 167968 173273 178955 184136 188615 193048
52963 193048 197690 201658 204008 204985 205431 205536 204967 203800 202431 200825 198623 195843 192892 190132 187909
52948 187909 186650 186309 186060 185171 183846 182656 181618 180490 179505 178980 178589 177799 176767 175999 175450 174765 174119
52931 174119 173943 174031 173815 173447 173628 174405 175033 175169 175404 176261 177335 177779 177312 176435 175880 175956 176387 176754 177053
52912 177053 177560 178156 178315 177913 177474 177268 176797 175653 174322 173554 173497 174020 175311 177406 179604 181204 182467
52895 182467 183998 185502 186023 185324 184262 183822 184358 185662 187176 188256 188689 188841 188985 188913 188636 188904 190319
52878 190319 192389 194161 195393 196405 197253 197817 198327 198964 199336 199215 199359 200669 202828 204722 205898 206678
52862 206678 207171 207299 207581 208707 210338 211401 211650 211952 212978 214538 216276 218120 219997 222001 224802
52847 224802 228942 233684 237546 240109 242340 245084 248258 251658 255392 259112 261801 262818 262409 260852
52833 260852 257924 253612 248614 243694 239107 234909 231164 227631 223937 220283 217308 215034 212736 210066
52819 210066 207469 205235 203025 200743 198958 197889 196800 195017 192879 191016 189318 187327 185074 182840
52805 182840 180446 177577 174535 172076 170599 169948 169799 169797 169507 168716 167683 166756 165865 164737 163465 162481 161972
52788 161972 161530 160470 158433 155748 153179 151214 149614 147792 145523 143050 140718 138856 137856 137816 138152
52773 138152 138048 137343 136513 135805 134948 133755 132437 131192 129987 128865 127917 126825 125080 122846 121017 120116
52757 120116 119669 119012 118182 117566 117117 116396 115150 113427 111335 109010 106684 104453 102159 99766 97720 96658
52741 96658 96759 97473 97873 97264 95597 93355 91075 89040 87446 86452 85863 85172 84381 84384 85902 88247 89884
52724 89884 90156 89741 89398 89093 88565 88008 87729 87678 87701 87885 88305 88731 88908 88931 89114 89584 90101 90199 89643 88943
52704 88943 89152 90801 93251 95562 97711 100356 103619 106920 109918 112814 115652 118134 120200 121985 123049
52689 123049 122554 120519 118148 116515 115514 114412 112704 110169 106804 103174 100177 98018 96013 93764
52675 93764 91799 90541 89349 87348 84698 82339 80778 79734 78790 77811 76814 75800 74651 73094 71067
52660 71067 69171 68284 68525 69172 69802 70781 72269 73548 73985 73993 74279 74654 74493 74005 74081 74902 75502 74870 72995
52641 72995 70744 69139 68711 69251 70113 70992 72228 74128 76344 78310 80045 81983 84153 86051 87239
52626 87239 87626 87203 86036 84507 83078 81719 79988 77824 75906 74919 74745 74646 74132 73334 72555 71810 71083
52609 71083 70806 71628 73532 75587 76923 77675 78595 79933 81180 81807 81758 81222 80406 79576 78922 78341 77778 77653
52591 77653 78401 79649 80544 80950 81578 82764 83950 84749 85694 87379 89462 91195 92462 93673 94975 96158
52575 96158 97098 97828 98391 98999 100021 101373 102301 102295 101920 102216 103514 105364 107380 109524 111691 113616 115269
52558 115269 116885 118574 120200 121624 122812 123776 124671 125826 127364 128880 129829 130121 130125 130175 130353 130644 131030
52541 131030 131507 132262 133665 135835 138291 140327 141651 142484 143140 143805 144614 145675 146989 148443 149881 151149
52525 151149 152195 153096 153839 154131 153797 153315 153443 154215 154784 154539 153835 153356 153224 153200 153269 153537 153857 154091 154452
52506 154452 155076 155510 155161 154105 152912 151770 150379 148623 146866 145460 144410 143623 143158 143079 143286 143598
52490 143598 143873 144049 144204 144565 145302 146316 147301 147962 148162 148024 147961 148367 149156 149857 150274 150796 151876 153469
52472 153469 155145 156502 157260 157320 157028 157102 157890 158896 159371 159274 159342 160255 161943 163632 164425 163933 162563 161166
52454 161166 160414 160533 161379 162382 162639 161758 160647 160758 162268 163734 163959 163483 163655 164857 166453 168046
52438 168046 169838 171793 173269 173716 173269 172542 172122 172247 172662 172774 172217 171210 170244 169616 169518 170233 171755
52421 171755 173394 174250 174107 173492 172863 172111 170902 169236 167561 166417 165949 165701 165053 163922 162803 162013
52405 162013 161286 160265 159065 158005 157122 156360 156009 156434 157426 158198 158089 157158 156100 155678 156074 156673 156732 156318
52387 156318 156291 157203 158589 159576 159843 159694 159515 159498 159708 160119 160732 161703 163077 164383 164975 164951 165228 166410
52369 166410 168123 169709 171009 172110 172958 173676 174714 176189 177643 178938 180752 183552 186689 189289 191545
52354 191545 194244 197488 200774 204014 207500 211015 213979 216455 219179 222501 226024 229354 232539 235679
52340 235679 238737 241766 244806 247527 249548 251118 252898 255106 257413 259642 261972 264408 266638 268517
52326 268517 270215 271827 273320 274881 276880 279450 282473 285916 289764 293763 297703 301822 306425 311333
52312 311333 316336 321978 329129 337750 346775 355307 363308 371106 378980 387374 396833 407369 418355 429257
52298 429257 440122 451301 463130 475976 490089 505229 520790 536342 551718 566747 581500
52287 581500 596731 613349 631287 649476 667117 684423 701923 719605 737025 753824 769858
52276 769858 785194 800144 814972 829456 843073 855722 867825 879600 890603 900079 907467 912547
52264 912547 915667 917857 920259 923210 926238 928929 931297 933241 934290 934154 933127 931727 930300 929116
52250 929116 928359 927871 927337 926936 927385 929124 931894 935380 939829 945648 952701 960418 968524 977388 987610
52235 987610 999316 1011805 1023986 1035340 1046372 1057934 1070303 1083168 1096219 1109280 1121974
52224 1121974 1133830 1144738 1154889 1164285 1172716 1180068 1186224 1190776 1193444 1194678 1195231 1195162 1193943 1191561
52210 1191561 1188771 1186045 1182955 1178830 1173491 1167119 1159901 1152070 1143813 1134958 1125246 1115058 1105332 1096561
52196 1096561 1088421 1080581 1073318 1067068 1061882 1057696 1054587 1052461 1050918 1049755 1049207 1049363 1049743 1049740 1049158 1048080
52180 1048080 1046661 1045287 1044465 1044181 1043744 1042639 1041200 1040019 1039007 1037439 1034813 1031295 1027456 1023778 1020374
52165 1020374 1016954 1013163 1008971 1004664 1000488 996480 992592 988676 984467 979898 975341 971207 967426 963745
52151 963745 960361 957716 955769 954094 952537 951074 949081 945711 941116 936483 932592 929141 925721 922502
52137 922502 919493 915988 911404 906079 900664 895322 890053 885239 881152 877388 873388 869102 864606 859546
52123 859546 853634 847321 841313 835767 830588 826169 823026 820863 818756 816307 814006 812414 811541 811132 811092
52108 811092 811508 812548 814506 817667 822044 827404 833590 840740 849261 859611 871998 886130 901452
52095 901452 917741 935303 954483 975148 996779 1018870 1041088 1063267 1085389 1107451 1129292
52084 1129292 1150741 1171918 1193114 1214333 1235237 1255501 1274900 1293013 1309275 1323393 1335384
52073 1335384 1345229 1352926 1358841 1363427 1366534 1367657 1366979 1365499 1363864 1361689 1358339 1353770 1348238 1341775
52059 1341775 1334435 1326634 1318832 1311187 1303736 1296428 1288865 1280702 1272615 1266147 1262047 1259442 1257164 1255224
52045 1255224 1254298 1254391 1254888 1255526 1256504 1257874 1259529 1261588 1264104 1266604 1268541 1270091 1271925 1274424 1277615
52030 1277615 1281652 1286605 1291867 1296376 1299458 1301043 1301258 1300373 1299002 1297724 1296480 1294801 1292567 1289990
52016 1289990 1286962 1283000 1277960 1272326 1266611 1260807 1254511 1247279 1238833 1229214 1218714 1207447 1195011
52003 1195011 1180850 1164876 1147479 1128982 1109403 1088766 1067333 1045462 1023358 1000923 977787
51992 977787 953575 928295 902380 876291 850263 824459 799022 773819 748422 722605 696596
51981 696596 670764 645351 620699 597333 575502 554887 535035 515875 497626 480440 464247
51970 464247 448682 433198 417737 403270 390953 380532 370365 359401 348438 338920 331211 324643
51958 324643 318570 312658 306758 301243 296979 294111 291313 287193 282077 277542 274375 271962 269499 266869
51944 266869 264254 261750 259549 257822 256256 254296 251939 249748 247983 246279 244305 242289 240692 239733
51930 239733 239285 238956 238224 236820 234991 233227 231854 231066 231023 231559 232081 232173 232030 231921 231590 230666 229329 227934
51912 227934 226273 223931 221160 218685 216709 214768 212526 210131 207839 205830 204351 203432 202553 201112 199159
51897 199159 197175 195300 193352 191425 189793 188382 186996 185900 185431 185129 184133 182474 181142 180697 180587
51882 180587 180084 179245 178639 178588 178869 178832 177772 175670 173486 172243 171950 172006 172400 173620 175470 177031 178006
51865 178006 179109 180830 182659 183950 184716 185137 185097 184792 185029 186233 187732 188714 189425 190650 192369 193684
51849 193684 194021 193826 194013 195135 196976 198612 199053 198208 197217 197479 199347 201953 204187 205516 205950 205644
51833 205644 204821 203932 203544 203910 204717 205470 206064 206741 207434 207614 207085 206544 206801 207676 208279 208282 208273 208761 209434 209724
51813 209724 209655 209740 210248 210892 211224 211210 211424 212568 214656 216758 217773 217435 216444 215809 216178 217546 219228 220337
51795 220337 220643 220804 221492 222564 223469 224068 224553 224887 224941 224897 224904 224667 224129 224141 225478 227348 228022 226990 225471
51776 225471 224622 224413 224564 225431 227238 229352 231090 232599 234240 235691 236430 236659 237012 237648 238270 238847 239703
51759 239703 241005 242663 244672 247203 250380 254125 258021 261223 262981 263533 264147 265860 268495 271248 273899
51744 273899 276958 280929 285960 292110 299400 307532 315933 324226 332511 341137 350272 359558 368095 374891
51730 374891 379454 381893 382501 381546 379513 377135 374918 372892 371049 369704 369032 368480 367083 364472 361345
51715 361345 358914 357965 358362 359251 359693 359185 357674 355267 352099 348446 344706 341127 337595 333763 329398
51700 329398 324655 319997 315755 311779 307735 303773 300464 298005 295939 293981 292560 292075 292113 292064 292112 292830
51684 292830 294082 295349 297085 300792 307425 316279 325535 333164 337307 336794 331906 324244 315559 307012
51670 307012 299453 293532 289230 286011 283788 283133 284177 286093 288229 291131 295793 302263 309563 316676
51656 316676 323135 328857 333834 337763 339696 338382 333363 325541 316449 307246 298627 291133 284918 279416
51642 279416 273778 267708 261642 256195 251591 247532 243460 239086 234752 231081 228266 225912 223568 221121
51628 221121 218712 216668 215457 215183 215108 214205 212238 209744 206965 203632 199984 197091 195676 195245 194882 194300
51612 194300 193640 192882 192150 192065 193027 194373 194931 194337 193296 192659 192661 193033 193467 193895 194431 195044 195390 195210 194815
51593 194815 194735 194911 194766 194132 193486 193142 192974 193196 194582 197344 200476 202881 204747 207210 211043 216162
51577 216162 222051 228109 233822 239051 244022 248771 252927 256217 258711 260383 261010 260815 260484 260094 258799
51562 258799 256149 253035 250575 248647 246354 243425 240329 237390 234712 232708 231843 231957 232532 233442 234808
51547 234808 236431 238179 240669 244622 249587 254196 257750 260816 264143 267726 271167 274348 277464 280741
51533 280741 284245 287671 290334 291723 292077 292085 292135 292230 292418 292776 293021 292719 291954 291348 291354 291923 292917 294492 296921
51514 296921 300213 303912 307166 309184 309890 310019 310356 311005 311515 311409 310308 307956 304533 300718 297050 293451
51498 293451 289656 285823 282353 279417 277029 275223 273789 272185 270165 268136 266502 265086 263610 262223
51484 262223 260979 259406 257328 255581 255075 255530 256087 256798 258489 261293 264392 267172 269654 271788 273340
51469 273340 274653 276583 279412 282613 285867 289501 293635 297779 301699 305914 310882 316282 321557 326582
51455 326582 331270 335085 337652 339562 341927 345115 348308 350397 351066 350937 350774 350654 350097 348939 347714
51440 347714 346896 346132 344701 342552 340320 338427 336800 335512 335063 335785 337364 339140 340534 341129 340775 339824
51424 339824 338819 337760 335930 332676 328148 323121 318303 313900 309698 305423 301103 297074 293573 290450
51410 290450 287395 284227 280810 277020 273139 270003 268279 267768 267855 268449 269864 271844 273370 273623 272749 271568
51394 271568 270866 270994 271724 272359 272305 271680 271136 271124 271481 271693 271300 270129 268426 266645 264798 262227 258365
51377 258365 253608 248984 245042 241415 237448 232938 228310 224319 221422 219155 216360 212370 207650 202934
51363 202934 198140 192774 187082 181980 177928 174576 171556 168980 167032 165572 164223 162514 159991 156668
51349 156668 153339 150962 149761 149267 149049 148888 148434 147373 145938 144723 144017 143781 144121 145177 146587 147624
51333 147624 147866 147286 145863 143773 141842 141060 141580 142775 144262 146227 148715 151247 153299 154683 155508
51318 155508 156231 157557 159673 161713 162654 162667 162856 163843 165414 167519 170627 174933 179960 185082 189730 193131
51302 193131 194707 194883 194674 194352 193347 191570 189877 188837 187894 186165 183464 180232 177060 174491 172657
51287 172657 170962 168740 166268 164291 162635 160255 156906 153641 151339 149765 148523 147816 147661 147313 146248
51272 146248 144958 144078 143461 142799 142392 142475 142391 141311 139360 137319 135547 133900 132406 131359 130843 130622 130334
51255 130334 129626 128386 127034 126139 125594 124794 123779 123433 124222 125567 126921 128608 130886 132995 134003 134099
51239 134099 134200 134645 135036 135121 135162 135591 136753 138708 140872 142215 142247 141466 140518 139487 138433 137925 138339 139144
51221 139144 139596 139765 140157 140743 141065 141036 140877 140506 139684 138657 138034 138071 138474 138795 138715 138250 138002 138848 140872
51202 140872 142957 143919 143755 143322 143144 143051 142743 142188 141636 141520 142083 142863 143024 142424 141810 141645 141550 141351 141791
51183 141791 143335 145037 145615 145108 144459 143832 142523 140411 138369 137118 136574 136435 136671 137169 137499 137297 136588
51166 136588 135680 135004 134881 135156 135265 135021 134972 135577 136425 136791 136539 135881 134681 132755 130579 128865 127627
51149 127627 126388 125142 124341 124006 123627 122943 122205 121648 121271 121087 121021 120660 119655 118293 117153 116392 115929
51132 115929 116038 117040 118531 119679 120224 120569 120944 121210 121419 121899 122786 124063 125929 128445 130966 132702
51116 132702 133816 135204 137192 139207 140653 141329 141024 139638 137858 136805 136779 137068 137115 136945 136323 134605
51100 134605 132017 130129 130255 131927 133619 134526 134996 135549 136222 136815 137349 138174 139778 142337 145359 148000
51084 148000 149831 151034 151737 151632 150479 148635 146773 145341 144527 144517 145480 147398 150033 152949 155578 157537
51068 157537 158965 160340 161889 163440 164816 165972 166693 166539 165383 163697 162092 160718 159304 157655 155938
51053 155938 154602 154081 154497 155636 157225 159147 161220 163000 164108 164700 165342 166483 168298 170899 174282
51038 174282 178045 181487 184108 185873 187070 188067 189121 190139 190759 190863 190844 191052 191236 190935 190261 189788 189767
51021 189767 189877 189694 189000 187742 186142 184818 184300 184439 184655 184745 185022 185750 186857 188180 189560 190785 191916
51004 191916 193508 195946 198688 200882 202695 205257 209145 213680 218013 222191 226755 231841 237243 242930
50990 242930 249003 255378 261992 269157 277320 286508 296332 306457 316899 327868 339572 352233 366217
50977 366217 381983 399801 419578 441186 464969 491619 521417 554029 589326 628006 670918
50966 670918 718056 768734 822543 879581 939889 1003168 1068938 1136469 1204610 1272174 1338355
50955 1338355 1402232 1462134 1516214 1563659 1604702 1639613 1668487 1692006 1711439 1727485 1739893
50944 1739893 1748588 1754539 1759121 1763232 1767525 1772991 1780678 1790939 1803159 1815904 1827104 1834563 1836773
50931 1836773 1833128 1823238 1806417 1782039 1749973 1710293 1662910 1607990 1546599 1480520 1411409 1340276
50919 1340276 1267729 1194514 1121819 1051175 984093 921741 864871 813787 768207 727321 690313
50908 690313 656847 626921 600453 577216 556971 539380 524027 510797 499997 491674 485123 479482
50896 479482 474557 470556 467324 464531 462384 461395 461494 462077 462909 464268 466163 468145 469985 471891 474019
50881 474019 476442 479641 484248 490142 496549 503160 510410 518459 526818 535368 544924 556217 568997 582662
50867 582662 597290 613441 631358 650869 671839 694421 719130 746881 778560 814388 854141
50856 854141 898185 947745 1003932 1067099 1137477 1215866 1303232 1400018 1506151 1621268 1744604
50845 1744604 1875125 2012160 2155509 2304578 2457644 2612062 2764554 2911098 3047351
50836 3047351 3169899 3276882 3367170 3439639 3493776 3530562 3552183 3561236 3560589 3553579 3543724 3534488
50824 3534488 3529541 3532520 3545729 3569145 3601106 3639533 3681865 3724127 3760908 3786505 3796036 3785900
50812 3785900 3753944 3699402 3622443 3523818 3404989 3268252 3116419 2952503 2779904 2602599
50802 2602599 2424843 2250712 2083853 1927149 1782302 1649916 1530111 1422777 1327310 1242714
50792 1242714 1168210 1103329 1047309 999019 957648 922757 893440 868244 846390 828241 813965
50781 813965 802450 792283 783120 775309 768683 762597 756772 751150 745214 738373 730940 723913 717773 712143
50767 712143 706545 700755 694489 687486 680158 673599 668687 665487 663543 662401 661863 662128 663799 667508 673423
50752 673423 681258 690655 701446 713756 728114 745234 765463 788589 814384 843046 874883 909949
50740 909949 948347 990556 1037097 1088145 1143759 1204194 1269565 1339620 1414212 1493544 1577454
50729 1577454 1664818 1754217 1844863 1936275 2027315 2116193 2201203 2280792 2353149 2416399 2469127
50718 2469127 2510052 2537344 2549171 2545275 2527642 2499558 2464357 2425036 2384461 2345555 2311299
50707 2311299 2284345 2266293 2257321 2256699 2263487 2276405 2293332 2311410 2327583 2338711 2341357 2332123
50695 2332123 2308346 2268424 2211831 2139406 2053535 1957566 1854910 1748842 1642703 1539576
50685 1539576 1441670 1350338 1266571 1190971 1123324 1062785 1008731 961152 920147 885323 855815
50674 855815 830822 810090 793947 782719 776014 772789 772207 774148 778781 786016 795509 806731 818732
50661 818732 830402 841386 852364 864048 876388 889116 902435 916597 931405 946817 963444
50650 963444 981720 1001094 1020967 1042036 1065708 1092580 1122542 1155968 1193602 1235322 1280280
50639 1280280 1328312 1380013 1435214 1492665 1551607 1612428 1675048 1737602 1797568 1853382 1904166
50628 1904166 1948607 1985294 2014015 2035774 2051402 2060747 2063402 2059864 2051846 2041677 2031474 2022648
50616 2022648 2016031 2012328 2012314 2016548 2024991 2036893 2050953 2065638 2079585 2091807 2101593 2108333 2111531
50603 2111531 2110795 2105623 2095342 2079386 2057390 2028848 1993026 1949529 1898755 1841540 1778728 1711532
50591 1711532 1641928 1572057 1503295 1436284 1371610 1309868 1251192 1195349 1142342 1092528 1046269
50580 1046269 1003874 965695 931750 901457 874314 850671 831193 815681 803178 793145 785801
50569 785801 781255 779077 778972 781207 786112 793598 803317 814829 827529 840969 855438 871742 890272
50556 890272 910684 932576 955991 981157 1008165 1036978 1067322 1098560 1130158 1162191 1194852
50545 1194852 1227590 1259439 1290252 1320803 1351589 1382321 1412795 1443403 1474467 1505931 1538240
50534 1538240 1572811 1610999 1653082 1698799 1748379 1802505 1861673 1926183 1996453 2072764 2154898
50523 2154898 2242406 2334852 2431219 2529320 2626467 2720717 2810966 2895845 2973038 3039959 3094800
50512 3094800 3136763 3165494 3180595 3181745 3169050 3142976 3103935 3052244 2988738 2915257 2834337
50501 2834337 2748606 2660690 2573415 2489695 2412281 2343790 2286601 2242235 2210969 2192482 2186566
50490 2186566 2192719 2209392 2234332 2265448 2300517 2336239 2368633 2394499 2411637 2417415 2408204 2380879
50478 2380879 2334532 2270583 2192039 2102938 2007564 1909227 1809892 1711162 1615027 1523287 1436891
50467 1436891 1356384 1282560 1216042 1156576 1103305 1055671 1013666 977385 946675 921089 900011
50456 900011 882941 869731 860233 853770 849468 847236 847849 851834 858805 868141 879760 893824 910217
50443 910217 928722 949291 971727 995558 1020612 1047266 1075734 1105480 1135767 1166327 1197079
50432 1197079 1227741 1258290 1289420 1321792 1354963 1387505 1418055 1445905 1470931 1493487 1514200
50421 1514200 1533402 1550850 1566247 1579729 1591567 1601897 1611298 1621225 1633193 1647691 1664443 1683495
50409 1683495 1705369 1730225 1757449 1786077 1815201 1844080 1872424 1900464 1928115 1954024 1976033
50398 1976033 1992669 2003738 2009362 2008988 2001636 1986629 1963650 1932375 1892529 1844376 1788945 1727769
50386 1727769 1662405 1594151 1524103 1453541 1384359 1319078 1260208 1209319 1166598 1131437 1103521
50375 1103521 1083274 1071225 1067188 1070256 1079338 1093317 1110850 1130462 1150784 1170239 1186596 1197393
50363 1197393 1201011 1196939 1185074 1165478 1139075 1107871 1073982 1038705 1002759 966871 931644 897344
50351 897344 864380 833725 806293 782079 760394 740756 723048 707001 692178 678584 666836
50340 666836 657519 650600 645556 641824 639027 636957 635588 635188 636354 639743 645570 653397 662583 672876
50326 672876 684361 696967 710400 724563 739632 755653 772434 789900 808094 826740 845297
50315 845297 863678 882448 902052 922248 942619 963208 984242 1005497 1026286 1045894 1063712
50304 1063712 1079305 1092650 1104127 1113957 1121870 1127589 1131316 1133403 1133764 1131969 1127806 1121530 1113732
50291 1113732 1105219 1096841 1089065 1081684 1073957 1064937 1053778 1040139 1024434 1007431 989505 970698
50279 970698 951471 932793 915198 898211 881063 863542 845871 828228 810810 794030 778216
50268 778216 763308 749159 735896 723833 713321 704880 699013 695618 693966 693504 694201 695904 697988
50255 697988 700126 702842 706777 711872 717789 724592 732291 740155 747274 753658 760095 766998 773994 780536
50241 780536 786349 791273 795127 797799 799142 798868 796837 793348 788849 783543 777540 771176 764798 758376
50227 758376 751656 744583 737314 729990 722781 715952 709687 704084 699490 696500 695345 695645 696990 699385
50213 699385 702891 707240 712145 717561 723360 729204 735000 740949 746776 751595 755019 757809 760795 763711
50199 763711 765688 766338 765691 763617 760116 755745 750911 745085 737571 728759 719758 711001 702033 692561 682883
50184 682883 673286 663668 653745 643127 631433 618918 606814 596324 587400 579090 570877 563063 556056
50171 556056 550014 545074 541287 538446 536507 535913 536834 538330 539019 538415 536982 535079 532540 529050 524223
50156 524223 517606 509351 500686 492910 486128 479595 472924 466143 459104 451973 445885 441819 438993 435678
50142 435678 431499 427579 424393 421040 416972 412949 409610 406368 402568 398765 395995 394497 393926 394260 395804
50127 395804 398595 402217 405912 408810 410647 412416 415632 420681 426569 432434 438492 445138 452050 458709
50113 458709 465107 471370 477284 482738 488103 493684 499238 504428 509260 513763 517770 521346 524832 528132
50099 528132 530557 531804 532505 533410 534644 536207 538533 541956 546139 550639 555626 561540 568477 576374 585311
50084 585311 595072 604812 613769 622083 630475 639407 648917 658921 669222 679527 689889 700821 712603
50071 712603 724770 736636 748019 759156 770249 781456 792972 804728 816240 827101 837341
50060 837341 847164 856751 866545 877173 888751 900785 913045 925961 939710 953518 966436 978308
50048 978308 989419 999724 1009053 1017607 1025527 1032322 1037470 1041271 1044271 1046077 1045574 1042354 1037188 1030950
50034 1030950 1023737 1015234 1005441 994727 983477 971890 960031 947934 935739 923691 911995 900840
50022 900840 890661 882069 875341 870188 866171 863051 860579 858419 856692 856277 858103 862358 868760 877270
50008 877270 887945 900258 913229 926399 940183 955164 971421 988751 1007150 1026633 1046573
49997 1046573 1065476 1081640 1094049 1102637 1107772 1109748 1108793 1105230 1099330 1091329 1081958 1072670 1064678
49984 1064678 1057774 1050653 1042412 1033086 1022628 1010108 994333 974795 951622 925065 895521 863846
49972 863846 831331 799355 769045 740869 714601 690085 668037 649466 634248 620967 608369
49961 608369 596297 584993 574318 564139 554691 545930 537177 528019 519022 510862 503256 495435 487204
49948 487204 478814 470256 461533 453324 446485 441022 436226 431626 427055 422040 416145 409954 404797 401172
49934 401172 398112 394468 390311 386698 384413 383261 382417 381196 379597 378237 377760 378355 379844 382030 384744
49919 384744 387678 390442 392784 394742 396714 399361 403068 407344 411087 413660 415363 416714 417821 418744
49905 418744 419953 421816 424047 426226 428597 431756 435781 440255 444980 450118 455777 462029 469211 477691
49891 477691 487372 497997 509900 523927 540627 560017 582107 607008 634332 662973 691805 720348
49879 720348 748532 776054 802104 825694 846318 864447 881323 898055 914955 931862 948822
49868 948822 966081 983572 1000766 1016872 1030746 1040690 1044926 1042508 1033644 1019133 999802 976524
49856 976524 950326 922196 892856 862858 832785 803194 774367 746203 718461 691149 664634
49845 664634 639358 615550 593308 572693 553498 535169 517429 500898 486594 474780 464740
49834 464740 455692 447388 439790 432867 426856 422070 418155 414144 409497 404510 399482 394290 389123 384753
49820 384753 381445 378380 374879 371525 369259 367955 366827 365744 365212 365363 365921 366914 368568 370683 372843
49805 372843 375079 377508 379591 380721 381408 382927 385639 388524 390490 391389 391627 391533 391377 391377 391448 391374 391336 391822
49787 391822 392907 394085 394834 394983 394595 393982 393781 394519 396090 398010 400001 401938 403590 405089 407312 410980
49771 410980 415550 419877 423935 429005 436193 445597 456957 470192 485102 501449 519547 539969 562412
49758 562412 585631 608706 631484 653449 673113 689188 701767 711861 720413 728283 736553 746139
49746 746139 757318 770004 784028 798743 812780 824678 833410 837953 836847 828882 814123 793921
49734 793921 770081 744295 717999 692329 668169 646285 627102 610228 594744 580237 567196
49723 567196 556093 546629 538292 531131 525311 520320 515415 510726 507136 504951 503348 501438 499353 497848
49709 497848 497152 496708 496039 495387 495266 495661 495959 495654 494801 493809 493088 492970 493585 494551 495131 495093 495187 496409 498923
49690 498923 502055 505127 507857 510046 511472 512199 512647 513217 514060 515112 516062 516417 516024 515556 516035 517785
49674 517785 520167 522348 524024 525320 526318 526820 526527 525539 524736 525243 527171 529278 530447 531122 532612 535129
49658 535129 537399 538308 538151 537972 538299 538921 539484 539923 540441 541225 542125 542733 542908 542950 542933 542238 540329 537713
49640 537713 535495 534078 533001 531950 531206 531076 531577 532690 534309 535974 537243 538302 539605 541048 542217
49625 542217 543239 544491 545658 546117 546146 546646 547678 548559 549495 551660 555242 558889 561699 564338 567418 570244
49609 570244 572356 575040 579835 586324 592863 598868 605033 611784 619035 627260 637285 648864 660652
49596 660652 671832 682833 694253 706080 718289 731348 745668 761102 777411 794728 813263
49585 813263 832884 853318 874535 896784 920461 945980 973487 1002557 1032475 1062991 1094660
49574 1094660 1128324 1164251 1201796 1239906 1278017 1316478 1356038 1397035 1439337 1482889 1527814
49563 1527814 1573895 1620560 1667587 1715234 1763257 1810353 1855113 1897262 1937467 1976192 2013132
49552 2013132 2047516 2078410 2104889 2126383 2142864 2154517 2161389 2163535 2161223 2154764 2144444 2130895
49540 2130895 2115145 2097947 2079395 2059542 2039003 2018606 1998874 1980269 1963506 1949105 1937037
49529 1937037 1927389 1920970 1918530 1919649 1923111 1928318 1935787 1946359 1960546 1978494 1999966 2024354 2051158
49516 2051158 2080389 2112043 2145402 2179439 2213756 2248441 2283060 2316510 2347921 2376967 2403092
49505 2403092 2425015 2441398 2451674 2456014 2454788 2448215 2436203 2418344 2394259 2364037 2328172 2287143
49493 2287143 2241421 2191893 2139827 2086178 2031090 1974255 1915687 1856177 1797095 1739673 1684289
49482 1684289 1630497 1577891 1526723 1477489 1430223 1384633 1340785 1299149 1259948 1222863 1187474
49471 1187474 1153660 1121508 1091111 1062559 1035940 1011182 987996 966003 944941 924886 906284
49460 906284 889532 874454 860486 847477 835897 825961 817048 808416 800079 792408 785151 777584 769600
49447 769600 761988 755463 749914 744786 739866 735455 731892 729040 726250 722999 719720 717746 718107 720492
49433 720492 723627 726493 728974 731669 735505 741384 749719 760339 773066 788301 807041 830657 860373
49420 860373 895556 931526 960109 974412 973735 963308 949458 935885 924076 915143 909983 908587
49408 908587 910351 914822 921558 929767 938849 949021 960793 974021 988044 1002498 1017317 1032066
49396 1032066 1045960 1058740 1070936 1083066 1094924 1105855 1115432 1123637 1130707 1137115 1143466 1150004
49384 1150004 1156244 1161488 1165824 1170321 1176015 1182919 1190195 1197114 1203574 1209922 1216728 1224695 1234278 1245242
49370 1245242 1256891 1268803 1281056 1293803 1307146 1321527 1337629 1355588 1374805 1394857 1416107
49359 1416107 1438985 1463191 1488202 1514201 1541900 1571696 1603611 1637833 1674616 1713679 1754355
49348 1754355 1796383 1840102 1885852 1933618 1983316 2035005 2088776 2144773 2203331 2264739 2328879
49337 2328879 2395354 2463817 2533923 2605202 2677496 2751317 2827189 2904669 2982546 3059937 3136744
49326 3136744 3213024 3288526 3362821 3435311 3505008 3570883 3632548 3690067 3742972 3790048 3830375
49315 3830375 3864049 3891543 3912785 3927290 3934898 3935938 3930829 3919928 3903852 3883675 3860706 3836092
49303 3836092 3810679 3785241 3760633 3737495 3715863 3695451 3676475 3659822 3646263 3635909 3628747
49292 3628747 3625157 3625404 3629101 3635849 3646032 3660175 3677779 3697669 3719498 3744045 3771917 3802700
49280 3802700 3835526 3869750 3904834 3940204 3975476 4010225 4043246 4072651 4097007 4115948 4129418
49269 4129418 4136875 4137579 4131233 4117922 4097761 4070851 4037304 3997094 3950242 3897421 3840101 3779830
49257 3779830 3717553 3653612 3588074 3521045 3453075 3385324 3318897 3253965 3190063 3127245 3066327
49246 3066327 3007840 2951554 2897367 2845968 2798109 2753762 2712511 2674225 2638777 2605454 2573362
49235 2573362 2542224 2512367 2484122 2457649 2433082 2410368 2389116 2368994 2350090 2332504 2315920
49224 2315920 2300065 2285326 2272261 2260602 2249440 2238540 2228877 2221490 2216131 2211424 2206237 2200530
49212 2200530 2194856 2189372 2183622 2177214 2170300 2163249 2156130 2148801 2141355 2134105 2127259 2120868 2115002 2109639
49198 2109639 2104528 2099600 2095417 2092628 2091022 2089690 2088222 2087083 2086626 2086424 2086059 2085995 2087134 2089757 2093340
49183 2093340 2097198 2100884 2104223 2107360 2110786 2115093 2120750 2128069 2137064 2147295 2158263 2170168 2183765
49170 2183765 2199157 2215182 2230436 2244558 2258076 2271424 2284704 2298316 2313203 2330340 2350155
49159 2350155 2372433 2396642 2422541 2450604 2481537 2515196 2550394 2586100 2622450 2660208 2699672
49148 2699672 2740756 2783732 2829073 2876626 2925629 2975504 3025843 3075448 3122221 3164539 3202370
49137 3202370 3236754 3268687 3298982 3328660 3358634 3388953 3418922 3448106 3476698 3504743 3531504
49126 3531504 3556181 3579025 3601219 3623571 3645736 3666822 3686354 3704384 3721016 3736250 3750171
49115 3750171 3762917 3774455 3784704 3793868 3802477 3811089 3820081 3829614 3839613 3849891 3860523 3871818
49103 3871818 3883728 3895571 3906877 3918267 3930905 3945044 3959634 3973398 3985849 3997267 4008347
49092 4008347 4020049 4033221 4047971 4063653 4079623 4095691 4111833 4128062 4144749 4162473 4181159
49081 4181159 4199825 4217670 4235070 4253055 4271983 4291198 4309841 4327586 4344575 4361006 4376882
49070 4376882 4391980 4405932 4418300 4428689 4436986 4443550 4448875 4452821 4454488 4453207 4449370 4443695 4435965
49057 4435965 4425269 4411430 4395368 4377898 4358943 4338197 4315739 4291588 4265326 4236774 4206622
49046 4206622 4175890 4145070 4114114 4082874 4051281 4019465 3987963 3957393 3927746 3898507 3869738
49035 3869738 3842418 3817364 3794507 3773651 3755190 3739354 3725377 3712264 3700126 3689948 3682258
49024 3682258 3676683 3672739 3670426 3669986 3671522 3674901 3679855 3686321 3694729 3705559 3718403 3731893 3744870
49011 3744870 3757207 3769271 3781234 3793241 3805434 3817231 3827301 3835041 3841405 3847409 3852344 3854488
48999 3854488 3853147 3848984 3842709 3834527 3824688 3813407 3800182 3784182 3765431 3744778 3722655 3698757
48987 3698757 3672971 3645753 3617424 3587999 3557815 3527468 3496880 3465241 3432080 3397570 3361621
48976 3361621 3323743 3284259 3244654 3206001 3167784 3129035 3090038 3052052 3015781 2980932 2947127
48965 2947127 2914484 2883289 2853623 2825430 2798693 2773561 2750467 2729950 2712179 2696855 2683709
48954 2683709 2672825 2664301 2657983 2653908 2652557 2654150 2657979 2663062 2669399 2677906 2689094 2702392 2716986
48941 2716986 2732717 2749734 2767693 2785933 2804368 2823617 2844189 2865962 2888610 2912063 2936256
48930 2936256 2960838 2985684 3011477 3039136 3068592 3098597 3127862 3156022 3183445 3210635 3238071
48919 3238071 3266102 3294606 3323098 3351572 3380923 3412179 3445531 3480534 3517039 3555513 3596554
48908 3596554 3640369 3686636 3734573 3783390 3833014 3884226 3937729 3993241 4049753 4106480 4163230
48897 4163230 4220103 4277268 4334919 4392987 4450950 4508179 4564331 4619084 4671793 4721827 4769076
48886 4769076 4813634 4855188 4893237 4927749 4958991 4986725 5010096 5028435 5041709 5050166 5054005 5053517
48874 5053517 5049148 5041191 5029624 5014285 4995067 4971994 4945328 4915452 4882410 4845816 4805569 4762411
48862 4762411 4717409 4671095 4623597 4575274 4526635 4477739 4428365 4378688 4329168 4279826 4230307
48851 4230307 4180735 4131805 4083920 4036876 3990587 3945505 3902053 3860131 3819457 3779960 3741637
48840 3741637 3704486 3668774 3634968 3603179 3573067 3544469 3517703 3493006 3470100 3448552 3428268
48829 3428268 3409382 3391945 3375908 3361175 3347610 3335285 3324771 3316814 3311537 3308327 3306640 3306579 3308548
48816 3308548 3312699 3318933 3327125 3337114 3348684 3361689 3376046 3391685 3408756 3427776 3449087 3472181
48804 3472181 3496059 3520371 3545684 3572490 3600457 3628917 3657593 3686559 3715812 3745233 3774641
48793 3774641 3803624 3831572 3858208 3883877 3909184 3934497 3959816 3984795 4008803 4031351 4052698
48782 4052698 4073724 4095028 4116401 4137288 4157453 4177043 4196312 4215433 4234328 4252622 4270060
48771 4270060 4286947 4303748 4320189 4335285 4348395 4359699 4369388 4376906 4381337 4382109 4378958 4371570 4359730
48758 4359730 4343604 4323525 4299635 4271915 4240347 4204932 4165933 4124254 4081168 4037311 3992270
48747 3992270 3945470 3897180 3848369 3799939 3752492 3706548 3662499 3620475 3580639 3543596 3510230
48736 3510230 3481110 3456186 3435010 3417196 3402790 3392319 3386321 3384807 3387453 3394202 3405277 3420512
48724 3420512 3439138 3460393 3483863 3508997 3534880 3560959 3587521 3614932 3642711 3669957 3696427
48713 3696427 3722566 3748541 3773966 3798654 3823108 3847897 3872846 3897198 3920387 3942367 3963158
48702 3963158 3982395 3999559 4014550 4027835 4040002 4051377 4062136 4072548 4082894 4093433 4104689
48691 4104689 4117551 4132711 4150154 4169552 4191088 4215534 4243540 4275213 4310258 4348284 4389161
48680 4389161 4433451 4482208 4535824 4593327 4653457 4716144 4782105 4851168 4922059 4993973 5067258
48669 5067258 5142066 5217169 5290599 5360779 5426590 5487111 5541895 5590898 5633451 5667771 5692040
48658 5692040 5705515 5708112 5699527 5679524 5648724 5608334 5559308 5502300 5438174 5367955 5292466 5212606
48646 5212606 5129755 5045329 4960022 4874040 4787894 4702403 4617961 4534373 4451512 4369734 4289593
48635 4289593 4211476 4135584 4061995 3990665 3921506 3854511 3789797 3727708 3668752 3613067 3559887
48624 3559887 3508064 3457373 3408825 3363329 3320509 3279317 3239416 3201352 3165647 3132249 3100766
48613 3100766 3070686 3041419 3012530 2984053 2956378 2929917 2904968 2881615 2859463 2837682 2815554
48602 2815554 2792892 2769927 2747181 2725559 2705871 2687841 2670039 2651313 2631907 2612750 2594118
48591 2594118 2575705 2557650 2540685 2525208 2510782 2496644 2482444 2468548 2455818 2444895 2435509
48580 2435509 2426744 2418236 2410665 2404731 2400212 2396544 2393864 2392769 2393364 2395299 2398565 2403491 2409982 2417368
48566 2417368 2425040 2432780 2440515 2448192 2455765 2462886 2468848 2473350 2477133 2481306 2486197 2491433 2496932 2503111
48552 2503111 2510193 2517992 2526434 2535637 2545425 2555284 2564951 2574610 2584488 2594711 2605507 2617006 2628766
48539 2628766 2640096 2650984 2662283 2674762 2688303 2702146 2715639 2728679 2741669 2755095 2768956
48528 2768956 2782691 2795752 2808109 2820014 2831670 2843430 2855864 2869133 2882563 2895376 2907563
48517 2907563 2919512 2931176 2942358 2953489 2965283 2977723 2990245 3002920 3016649 3032063 3048960
48506 3048960 3066917 3085775 3105451 3126013 3148165 3172972 3200862 3231371 3263990 3298713 3335670
48495 3335670 3374923 3416780 3461616 3509125 3558318 3608537 3659908 3712571 3766129 3820121 3874298
48484 3874298 3927916 3979351 4026924 4069838 4107894 4140734 4167868 4189129 4204624 4214337 4218219 4216609
48472 4216609 4210286 4200086 4186595 4170066 4150586 4128441 4104346 4079101 4053052 4026121 3998281
48461 3998281 3969616 3939889 3908425 3874552 3837935 3798533 3756559 3712394 3666094 3617078 3564832
48450 3564832 3509880 3453443 3396070 3337340 3277074 3216137 3155647 3096056 3037490 2980505 2925883
48439 2925883 2873926 2824509 2777691 2733850 2693207 2655538 2620433 2587730 2557653 2530513 2506246
48428 2506246 2484440 2464912 2448063 2434295 2423290 2414270 2406856 2401183 2397297 2394980 2394124 2394710 2396392
48415 2396392 2398663 2401546 2405569 2411017 2417728 2425669 2434993 2445424 2456216 2467039 2478329 2490559 2503681
48402 2503681 2517447 2531615 2545709 2559223 2572370 2585966 2600280 2614666 2628648 2642661 2657349
48391 2657349 2672794 2688864 2705464 2721859 2736495 2748300 2757750 2765954 2773196 2779042 2783406 2786702
48379 2786702 2789208 2791016 2792366 2793465 2794281 2795118 2796978 2800553 2805150 2809473 2813402 2818165 2824793 2833141
48365 2833141 2842497 2852366 2862475 2872632 2882972 2893959 2905923 2918791 2932258 2945901 2959218 2971974
48353 2971974 2984565 2997693 3011726 3026701 3042777 3060093 3078173 3096124 3113654 3131393 3149922
48342 3149922 3168817 3186926 3203339 3217888 3230993 3243314 3255440 3267583 3279539 3290994 3301879
48331 3301879 3312386 3322699 3332794 3342519 3351854 3361022 3370189 3379137 3387477 3395260 3403028 3411142 3419370
48318 3419370 3427366 3435204 3443029 3450503 3457156 3463165 3469228 3475578 3481632 3486752 3491030 3495092 3499418 3504055
48304 3504055 3508820 3513569 3518246 3522717 3526604 3529470 3531391 3533216 3536024 3540329 3546078 3553289 3562209 3572747
48290 3572747 3584231 3596132 3608846 3623358 3640167 3658762 3678210 3697971 3718008 3738213 3757951
48279 3757951 3776300 3792672 3807003 3819245 3828759 3834486 3835802 3833000 3826585 3816186 3800556 3778887
48267 3778887 3751840 3720880 3686765 3649148 3607731 3563240 3516971 3469707 3421503 3372306 3322462
48256 3322462 3272698 3223914 3176811 3131347 3086672 3041955 2997213 2953091 2910008 2867936 2826803
48245 2826803 2786575 2747008 2707871 2669480 2632463 2596885 2562102 2527557 2493330 2459786 2427216
48234 2427216 2395924 2366097 2337320 2308816 2280448 2253080 2227530 2203538 2180122 2156634 2133043
48223 2133043 2109475 2085864 2062005 2037666 2012801 1987752 1963034 1938802 1914818 1891038 1867860
48212 1867860 1845566 1823863 1802192 1780233 1757926 1735314 1712545 1689685 1666422 1642350 1617712
48201 1617712 1593333 1569649 1546336 1523123 1500332 1478242 1456530 1434877 1413609 1393172 1373450
48190 1373450 1354176 1335557 1317886 1300946 1284468 1268765 1254180 1240289 1226503 1213161 1201053
48179 1201053 1189986 1178850 1167278 1156290 1146944 1139170 1132393 1126627 1122309 1119351 1117001 1114647 1112447
48166 1112447 1111123 1111327 1113141 1116061 1119394 1122709 1125989 1129523 1133656 1138427 1143354 1147887 1152253 1157567
48152 1157567 1164730 1173381 1182310 1190823 1199405 1209104 1220491 1233126 1245801 1257416 1267815 1277679 1287578
48139 1287578 1297446 1307118 1316810 1326654 1336229 1345305 1354657 1365376 1377360 1389255 1400001 1409810 1419479
48126 1419479 1429356 1439272 1449022 1458505 1467661 1476577 1485593 1495095 1505280 1516117 1527396 1538734 1549692
48113 1549692 1560038 1569926 1579847 1590322 1601436 1612576 1622870 1631977 1640192 1647761 1654618 1661055 1668093
48100 1668093 1676635 1686582 1697338 1708899 1721726 1735650 1749703 1763249 1776793 1791411 1807683 1825384
48088 1825384 1844015 1863409 1883815 1905457 1928069 1951100 1974367 1998188 2022808 2048073 2073814
48077 2073814 2100073 2126696 2153197 2179339 2205315 2230994 2255691 2279227 2302535 2326527 2350964
48066 2350964 2375284 2399935 2425835 2452929 2480442 2508295 2537181 2567448 2599088 2632792 2669936
48055 2669936 2711688 2759364 2815587 2883731 2966240 3064505 3179055 3305648 3429050 3523690 3565530
48044 3565530 3545955 3474861 3371708 3254680 3136214 3023931 2922155 2832416 2754058 2685452
48034 2685452 2625029 2571620 2524264 2481936 2443575 2408400 2375966 2345843 2317416 2290108 2263547
48023 2263547 2237365 2211135 2184662 2157971 2130731 2102083 2071423 2039124 2006054 1972572 1938441
48012 1938441 1903641 1868851 1835017 1802575 1771177 1740096 1709013 1678423 1649141 1621425 1594897
48001 1594897 1569336 1545096 1522601 1501790 1482413 1464473 1448015 1432736 1418195 1404283 1391123
47990 1391123 1378625 1366434 1354331 1342517 1331502 1321728 1313143 1305152 1297243 1289677 1283205 1278097 1273886
47977 1273886 1270177 1267135 1264883 1262941 1260760 1258454 1256556 1255333 1254711 1254610 1254881 1255083 1254795 1254059 1253238 1252547
47961 1252547 1251934 1251150 1249718 1247137 1243411 1239035 1234147 1228127 1220529 1211915 1203060 1193657 1182649 1169743
47947 1169743 1155775 1141499 1126801 1111349 1095362 1079286 1063169 1046731 1029861 1012789 995964
47936 995964 979880 964783 950441 936452 922967 910841 900899 893120 886673 880637 874725 869475 865749
47923 865749 863861 863242 863181 863731 865465 868414 871895 875564 880045 886068 893402 901155 908852 916634 924424
47908 924424 931554 937412 942106 946223 950179 953968 957336 959977 961693 962651 963384 964273 964982 964683 962922
47893 962922 960174 957393 955063 952709 949308 944209 937813 931418 926241 922516 919591 916879 914496 912909
47879 912909 912218 912059 912062 912165 912528 913368 914873 917096 919917 923206 926941 931095 935597 940577 946417 953210
47863 953210 960313 966901 972938 979176 986117 993407 1000459 1007261 1014187 1021186 1027547 1032513 1035904 1037993
47849 1037993 1038899 1038273 1035736 1031529 1026430 1020963 1015050 1008630 1002129 995824 989082 980955 971478 961726
47835 961726 952494 943575 934471 925139 915694 906045 896282 886992 878734 871530 865285 860256 856563 853519
47821 853519 850159 846354 842859 840244 838258 836339 834341 832494 830877 829095 826470 822580 817670 812457
47807 812457 807440 802560 797666 793095 789439 786784 784492 781845 778702 775416 772221 768885 765076 760994
47793 760994 757399 754851 753098 751540 750250 750109 751833 755166 759289 763742 768724 774636 781601 789418
47779 789418 797923 807390 818475 831524 846099 861515 877827 895804 915840 937401 959729 982599
47767 982599 1006059 1029918 1053935 1078179 1102742 1127296 1151356 1174728 1197345 1218832 1238668
47756 1238668 1256579 1272391 1285691 1296082 1303730 1309210 1312855 1314574 1314268 1311979 1307617 1300877 1291663
47743 1291663 1280398 1267842 1254605 1240872 1226534 1211671 1196821 1182545 1168720 1154645 1140010
47732 1140010 1125374 1111531 1098741 1086891 1075992 1066172 1057433 1049710 1042843 1036274 1029353 1022432 1017169
47719 1017169 1015009 1015651 1017642 1020228 1023899 1029276 1036324 1044693 1054151 1064557 1075977 1088874 1103534
47706 1103534 1119269 1134751 1149254 1162921 1175726 1186964 1196029 1202943 1207606 1209164 1206807 1200877
47694 1200877 1192620 1182974 1172059 1159711 1146054 1131457 1116208 1100396 1084082 1067587 1051544 1036514
47682 1036514 1022655 1009982 998773 989321 981290 973879 966845 960958 957129 955399 955052 955422 956332 958024
47668 958024 961013 965823 972514 980537 989306 998789 1009313 1020989 1033616 1047008 1061072 1075583 1090190
47655 1090190 1104718 1119270 1133963 1148668 1162969 1176259 1187973 1197929 1206436 1213910 1220396 1225598
47643 1225598 1229358 1231850 1233242 1233368 1231928 1229007 1225224 1221329 1217649 1213978 1210019 1205887 1202134 1199274
47629 1199274 1197383 1196204 1195613 1195841 1197196 1199563 1202292 1204608 1206136 1207057 1207842 1208923 1210411 1211877 1212420
47614 1212420 1211320 1208779 1205711 1202604 1198850 1193525 1186537 1178516 1169675 1159416 1147255 1133627 1119408
47601 1119408 1104925 1089870 1074079 1057970 1042123 1026700 1011357 995559 978907 961283 942818
47590 942818 923671 903758 882787 860679 837910 815283 793330 772070 751403 731532 712866
47579 712866 695617 679689 664969 651485 639247 628060 617605 607677 598368 590087 583276 577966
47567 577966 573700 570103 567389 566046 566126 567227 569110 571827 575178 578578 581767 585219 589514 594685 600535
47552 600535 607216 614929 623238 631211 638315 644835 651429 658473 665783 672723 678635 683327 687065 690010
47538 690010 691971 692851 692889 692066 689687 685143 678855 671842 664452 656159 646625 636346 626131 616442 607301
47523 607301 598352 588859 578179 566544 554997 544368 534657 525598 517351 510297 504464 499519 495119
47510 495119 491016 487003 483056 479432 476386 473867 471628 469535 467617 465984 464871 464604 465332 466893 469127
47495 469127 472230 476606 482319 488830 495301 501159 506383 511224 515644 519116 521076 521458 520603 518787 516054
47480 516054 512507 508403 503838 498637 492717 486423 480265 474460 468937 463744 459230 455726 453111 450884
47466 450884 448704 446790 445659 445522 446056 446772 447437 448132 449192 451125 454333 458739 463885 469451 475326
47451 475326 481084 485935 489636 493019 497065 501677 505930 509334 512161 514610 516391 517379 518092 519164 520724
47436 520724 522579 524681 527065 529493 531538 533095 534707 537270 541307 546564 552487 559116 567071 576480
47422 576480 586493 596378 606648 618354 631548 645336 659434 674698 691870 710694 730670 751882
47410 751882 774379 797340 819681 841349 863261 885931 908639 930068 949406 966640 982024
47399 982024 995501 1006725 1015497 1021954 1026181 1027846 1026514 1022254 1015624 1007028 996446 983819 969400
47386 969400 953608 936809 919330 901452 883338 865214 847635 831223 816050 801610 787541
47375 787541 774137 762034 751635 742962 735805 729917 725234 721921 720020 719149 718830 719071 720291 722720
47361 722720 726297 731092 737411 745370 754749 765184 776145 786812 796568 805574 814254 822220 828457
47348 828457 832706 835825 838429 839865 838959 835212 828822 820110 809473 797525 784775 771439 757739
47335 757739 743958 729922 714996 698952 682381 665936 649812 634330 620246 607794 596073
47324 596073 584170 572410 561685 552068 543019 534628 527566 521851 516641 511393 506404 502041 498160
47311 498160 494632 491856 490361 490155 490707 491379 491829 492276 493382 495683 499094 503144 507482 511845 515712
47296 515712 518498 520045 520620 520493 519843 518907 517774 516111 513560 510418 507469 505145 503176 501062 498528
47281 498528 495581 492583 490229 489020 488659 488313 487544 486643 486093 486125 486872 488501 490988 494069 497558 501493
47265 501493 505859 510441 515081 519933 525354 531663 538940 546872 554846 562461 570022 578288 587672 597867
47251 597867 608310 618795 629477 640375 651011 660675 668952 675867 681421 685341 687680 689371 691438
47238 691438 693618 694573 693732 692080 690639 688988 686080 681837 676993 671876 666434 661236 657192 654170 650963
47223 650963 646910 642769 639659 637819 636697 635650 634324 632922 632331 633467 636291 639970 644036 648766
47209 648766 654296 660232 666444 673511 681936 691619 702527 715105 729424 744576 759689 774942 790725
47196 790725 806270 820172 832165 843318 854271 864146 871613 876401 879247 880773 880960 879562 876454
47183 876454 871380 863803 853505 841350 829064 817934 807849 797849 787515 777427 768401 760760
47171 760760 754493 749644 746212 744014 742957 743262 745111 748315 752645 758344 766006 776007 788237 802271
47157 802271 817552 833577 850163 867533 885959 905395 925580 946265 967125 987556 1006876
47146 1006876 1024645 1040639 1054663 1066687 1076971 1085672 1092297 1095940 1096240 1093839 1089791 1084627 1078151
47133 1078151 1069990 1060187 1049335 1038224 1027326 1016551 1005495 994004 982485 971646 961893 953048
47121 953048 944707 936767 929414 922557 915661 908450 901597 896258 892891 890994 890130 890616 892759 895872 898737
47106 898737 901103 904076 908838 915351 922526 929328 935441 941132 946803 952592 958062 962319 964695 965311
47092 965311 964654 962625 958413 951477 942313 931859 920420 907729 893976 880207 867341 855157 842621
47079 842621 829122 815045 801199 788036 775520 763548 752226 741786 732357 723918 716358 709473
47067 709473 702941 696579 690775 686396 683892 682564 681174 679368 678063 678289 680059 682692 685770 689327
47053 689327 693352 697712 702512 708048 714334 721029 727804 734428 740457 745406 749443 753544 758595 764464
47039 764464 770173 774859 778367 781026 783170 784976 786627 788465 790884 794089 798072 802807 808295 814357
47025 814357 820548 826568 832629 839176 846244 853355 860098 866573 873218 880386 888209 896624 905258 913387
47011 913387 920393 926488 932818 940509 949583 959080 968272 977371 986798 996287 1005349 1014347 1024236 1035182
46997 1035182 1046202 1056394 1065802 1074690 1082768 1089621 1095275 1099681 1102302 1102994 1102790 1102899 1103192 1102619 1100882
46982 1100882 1098705 1096554 1094151 1091382 1088747 1086615 1084813 1083157 1081663 1080027 1077825 1075616 1074942 1076640
46968 1076640 1079810 1083074 1086238 1090026 1094675 1099677 1104727 1110171 1116497 1123900 1132353 1141671 1151431 1161122
46954 1161122 1170475 1179595 1188849 1198658 1209096 1219506 1228841 1236628 1243380 1249829 1256066 1261707 1266549
46941 1266549 1270591 1273616 1275260 1275469 1274560 1272800 1270165 1266542 1261977 1256729 1251211 1245865 1240942 1236432
46927 1236432 1232198 1228073 1223945 1220015 1216929 1215288 1214927 1215077 1215353 1216102 1217583 1219401 1221263 1223781 1227882
46912 1227882 1233566 1239896 1246132 1252318 1258664 1264920 1270672 1275987 1281570 1288280 1296504 1305830 1315408 1324802
46898 1324802 1334457 1345102 1356738 1368435 1379127 1388325 1395935 1401662 1404932 1405424 1403394 1399234 1392883
46885 1392883 1384095 1373430 1362524 1352945 1344991 1338083 1332123 1327815 1325659 1325421 1326868 1330387 1336374 1344461
46871 1344461 1353897 1364369 1375988 1388741 1402393 1416731 1431433 1445879 1459486 1472150 1484003
46860 1484003 1494979 1504973 1514192 1522877 1530822 1537685 1543632 1549116 1554095 1558097 1561208 1564441 1568848 1574636
46846 1574636 1581402 1588897 1597268 1606737 1617271 1628461 1639626 1650253 1660517 1671215 1682994 1695659
46834 1695659 1708375 1720418 1731590 1741951 1751350 1759371 1765744 1770709 1774872 1778624 1781765 1783692 1783929
46821 1783929 1782551 1780189 1777720 1775812 1774676 1774176 1774080 1774078 1773798 1773121 1772549 1772967 1774973 1778628 1783857 1790713
46805 1790713 1799111 1808727 1819519 1832185 1847703 1866357 1887287 1909029 1930530 1951899 1974191 1998228
46793 1998228 2023522 2048503 2071798 2092961 2111999 2128714 2142833 2154412 2163807 2171411 2177487 2181888
46781 2181888 2183841 2182547 2178317 2172628 2166642 2160146 2152360 2143285 2133608 2123689 2113416 2102926 2092737
46768 2092737 2083148 2074004 2065030 2055987 2046576 2036701 2026737 2017130 2007855 1998707 1989869 1981632 1973749 1965839
46754 1965839 1958284 1951965 1947086 1943039 1939573 1937277 1936627 1937290 1938803 1941312 1945191 1950400 1956731 1964345
46740 1964345 1973638 1984847 1998079 2013415 2030638 2049120 2068338 2088254 2108918 2129924 2150515
46729 2150515 2170070 2188337 2205502 2222180 2238929 2255451 2270629 2283694 2294985 2305242 2314563
46718 2314563 2322520 2328931 2333878 2337219 2338902 2339733 2341177 2344130 2348288 2352917 2357867 2363682 2370992 2379962
46704 2379962 2390122 2400702 2411393 2422761 2435529 2449408 2463044 2475272 2485913 2495111 2502342 2506534
46692 2506534 2506920 2503319 2495836 2484701 2470314 2452916 2432205 2407689 2379491 2348442 2315308 2280279
46680 2280279 2243401 2205122 2166165 2127077 2088163 2049705 2012053 1975620 1940862 1908092 1877127
46669 1877127 1847333 1818161 1789533 1761656 1734739 1709011 1684740 1661975 1640448 1619875 1600022
46658 1600022 1580420 1560553 1540651 1521753 1504445 1488075 1471987 1457102 1445246 1437033 1431430 1427519
46646 1427519 1425628 1426356 1429478 1434468 1441459 1450974 1463080 1477322 1493156 1509930 1526752 1542848 1557891
46633 1557891 1571656 1583643 1593330 1600482 1604964 1606693 1606174 1604567 1602627 1599860 1595317 1589069 1582411 1576757
46619 1576757 1572797 1570612 1570131 1571484 1575166 1581742 1591229 1603051 1616834 1632831 1651242 1671579 1693225
46606 1693225 1716145 1740378 1765112 1789021 1811432 1832512 1852301 1870108 1884855 1895568 1901684
46595 1901684 1903367 1901421 1896364 1887800 1875187 1859036 1840717 1821247 1800952 1780118 1759133 1737956
46583 1737956 1716313 1694621 1674048 1655367 1638259 1621860 1605441 1588515 1570998 1553554 1537183
46572 1537183 1522189 1507906 1493554 1478819 1463561 1447685 1431663 1416538 1402932 1390394 1378033
46561 1378033 1365428 1352738 1340432 1329172 1319492 1311262 1303869 1297094 1291355 1286862 1283196 1280109 1278065
46548 1278065 1277419 1277545 1277529 1277448 1278278 1280570 1283804 1287162 1290558 1294714 1300376 1307587 1315740 1324343 1333562 1343786
46532 1343786 1354865 1366270 1377988 1390674 1404747 1419864 1435535 1451691 1468323 1485143 1502159
46521 1502159 1520162 1539937 1561173 1582685 1603699 1624501 1645883 1668374 1692139 1717258 1743905
46510 1743905 1772243 1802193 1833379 1865446 1898411 1932482 1967548 2003067 2038505 2073549 2107857
46499 2107857 2141019 2172867 2203395 2232203 2258428 2281457 2301317 2318158 2331805 2342112 2349334
46488 2349334 2353837 2355835 2355733 2354237 2351678 2347601 2341584 2334191 2326559 2319302 2312298 2305325 2298339 2291169
46474 2291169 2283500 2275154 2266004 2255639 2243527 2229532 2213920 2196803 2177889 2156778 2133329 2107732
46462 2107732 2080367 2051497 2020970 1988354 1953529 1916931 1879089 1840266 1800765 1761245 1722396
46451 1722396 1684603 1648228 1613904 1582134 1552990 1526669 1503965 1485581 1471227 1460041 1451715
46440 1451715 1446517 1444407 1445013 1448476 1455419 1465769 1478286 1491638 1505500 1520331 1536518 1553980
46428 1553980 1572138 1589894 1606028 1619997 1632182 1643181 1653093 1661548 1668027 1671915 1672795 1671079 1667963
46415 1667963 1664280 1659667 1653393 1645761 1638157 1631746 1626648 1622491 1619305 1617640 1618137 1621150 1626643 1634284
46401 1634284 1643769 1655189 1668969 1685417 1704523 1726245 1750722 1777975 1807589 1839065 1872420
46390 1872420 1908160 1946550 1987168 2029264 2072306 2115888 2159277 2201399 2241411 2279093 2314468
46379 2314468 2347065 2375748 2399384 2417616 2430864 2439552 2443573 2442670 2437092 2427476 2414131 2396921
46367 2396921 2376044 2352474 2327291 2300892 2273241 2244720 2216254 2188691 2162460 2137798 2114952
46356 2114952 2094129 2075612 2059921 2047591 2038779 2033441 2031797 2034269 2041021 2051995 2067406 2087730
46344 2087730 2113187 2143683 2179293 2220253 2266344 2316864 2371443 2430375 2493841 2561200 2631322
46333 2631322 2703172 2775766 2847937 2918458 2986087 3049302 3106444 3156465 3199078 3233879 3259776
46322 3259776 3275740 3281664 3277949 3264616 3241454 3208805 3167699 3119358 3065048 3006229 2944351 2880484
46310 2880484 2815422 2749936 2684666 2620163 2557479 2498360 2444266 2395421 2351394 2312341 2279015
46299 2279015 2251713 2229976 2213355 2201829 2195470 2194276 2198443 2208193 2223130 2242274 2264900 2290964
46287 2290964 2320600 2353646 2389802 2428783 2470130 2513185 2557456 2602780 2649014 2695823 2742755
46276 2742755 2789191 2834273 2877324 2918331 2957462 2994024 3026520 3054014 3076866 3095709 3110054
46265 3110054 3118410 3119568 3113482 3101125 3083885 3062999 3039162 3012573 2983489 2952616 2920828 2888606
46253 2888606 2856045 2823423 2791573 2761559 2734021 2708864 2685584 2663931 2644215 2627005 2612533
46242 2612533 2600459 2590151 2581140 2573434 2567469 2563665 2561857 2561195 2560688 2559760 2558253 2556143 2553443 2550179
46228 2550179 2546137 2540721 2533404 2524248 2513720 2502079 2489189 2474868 2459044 2441575 2422312 2401523
46216 2401523 2379994 2358556 2337556 2316793 2295783 2274159 2252057 2230199 2209390 2189909 2171598
46205 2171598 2154476 2138963 2125363 2113368 2102298 2091757 2082032 2073876 2067931 2064264 2062481 2062270 2063753
46192 2063753 2067203 2072566 2079423 2087380 2096410 2106871 2119171 2133256 2148404 2163819 2179471 2196040
46180 2196040 2213917 2232751 2252124 2272101 2292711 2313400 2333567 2353233 2372524 2390903 2407667
46169 2407667 2423062 2438168 2453751 2469789 2485943 2501776 2516652 2530328 2543674 2557988 2573348
$$ [...]
##END NTUPLES=NMR SPECTRUM
##END=
