
##TITLE=AC1303_PERAH12115_6528332_5mPQnOYvMW
##JCAMPDX= 6.0         $$ Bruker NMR JCAMP-DX V2.0
##DATA TYPE= NMR SPECTRUM
##DATA CLASS= NTUPLES
##ORIGIN= BRUKER
##OWNER= Administrator
$$ 1.72 TOPSPIN		Version 2.1
$$ 2012-07-15 12:59:57.375 -0500  Administrator@TOPSPIN
$$ Compression mode = diff/dup
##.OBSERVE FREQUENCY= 400.02188249412
##.OBSERVE NUCLEUS= ^1H
##.ACQUISITION MODE= SIMULTANEOUS (DQD)
##.ACQUISITION SCHEME= undefined
##.AVERAGES= 8
##.DIGITISER RES= 22
##SPECTROMETER/DATA SYSTEM= spect
##.PULSE SEQUENCE= zg30
##.SOLVENT NAME= COFFEE_meoh
##.SHIFT REFERENCE= INTERNAL, COFFEE_meoh, 1, 14.98509
##AUDIT TRAIL= $$ (NUMBER, WHEN, WHO, WHERE, PROCESS, VERSION, WHAT)
$$ ##TITLE= Audit trail, TOPSPIN		Version 2.1
$$ ##JCAMPDX= 5.01
$$ ##ORIGIN= Bruker BioSpin GmbH
$$ ##OWNER= Administrator
$$ $$ C:\Bruker\TOPSPIN/data/COFFEE/nmr/AC1303_PERAH12115_6528332_5mPQnOYvMW/10/pdata/1/auditp.txt
$$ ##AUDIT TRAIL=  $$ (NUMBER, WHEN, WHO, WHERE, PROCESS, VERSION, WHAT)
(   1,<2012-07-15 12:59:50.265 -0500>,<Administrator>,<TOPSPIN>,<go>,<TOPSPIN 2.1>,
      <created by zg
	started at 2012-07-15 12:58:43.656 -0500,
	POWCHK enabled, PULCHK disabled,
       configuration hash MD5:
       6B 1B 68 BB D9 2E 58 E2 7F 35 AD 54 07 DF 0E 41
       data hash MD5: 64K
       E8 D4 A0 4D A8 D4 EC DD C2 C9 6D 3C 67 74 3B A2>)
(   2,<2012-07-15 12:59:53.125 -0500>,<Administrator>,<TOPSPIN>,<proc1d>,<TOPSPIN 2.1>,
      <Start of raw data processing
       efp LB = 0 FT_mod = 6 PKNL = 1 PHC0 = 0 PHC1 = 0 SI = 32K 
       data hash MD5: 32K
       21 79 7B 94 F9 88 14 77 CB BE 2D 5C DB AF 96 2D>)
(   3,<2012-07-15 12:59:53.453 -0500>,<Administrator>,<TOPSPIN>,<proc1d>,<TOPSPIN 2.1>,
      <pk PHC0 = 178.7585 PHC1 = 0 
       data hash MD5: 32K
       B1 FA CA 94 2C 11 0E 52 03 21 78 7A 6A 1F 76 63>)
(   4,<2012-07-15 12:59:53.562 -0500>,<Administrator>,<TOPSPIN>,<proc1d>,<TOPSPIN 2.1>,
      <abs ABSG = 1 
       data hash MD5: 32K
       73 42 EF 3C 8D 1E 04 04 60 2D 34 F9 87 82 0C EE>)
(   5,<2012-07-15 12:59:53.593 -0500>,<Administrator>,<TOPSPIN>,<proc1d>,<TOPSPIN 2.1>,
      <abs ABSG = 2 
       data hash MD5: 32K
       8F 6D F9 DC 75 C6 75 1D 92 A1 22 67 08 2F 12 31>)
(   6,<2012-07-15 12:59:53.625 -0500>,<Administrator>,<TOPSPIN>,<proc1d>,<TOPSPIN 2.1>,
      <abs ABSG = 3 
       data hash MD5: 32K
       53 BD 64 15 8A 10 64 AC 83 4D ED 94 C4 2B A1 C2>)
(   7,<2012-07-15 12:59:53.828 -0500>,<Administrator>,<TOPSPIN>,<proc1d>,<TOPSPIN 2.1>,
      <abs ABSG = 4 
       data hash MD5: 32K
       5B EE 83 D6 2B 75 6C 41 0D 45 66 5E AD 83 D4 D3>)
(   8,<2012-07-15 12:59:53.859 -0500>,<Administrator>,<TOPSPIN>,<proc1d>,<TOPSPIN 2.1>,
      <abs ABSG = 5 
       data hash MD5: 32K
       4C D9 FF F0 F8 49 80 35 01 47 74 48 1F 55 24 A2>)
$$ ##END=
$$ 
$$ $$ hash MD5
$$ $$ F7 45 60 06 3E FA 01 F2 3E 58 A2 45 98 56 C2 C3
##$RELAX= 
##$RELAX= 
##$RELAX= 
##$RELAX= 
##$RELAX= 
##$RELAX= 
##$RELAX= 
$$ Bruker specific parameters
$$ --------------------------
$$ [...]
150 150 150 150 150 150 150 150
##$TP07= 0
##$TPNAME0= <>
##$TPNAME1= <>
##$TPNAME2= <>
##$TPNAME3= <>
##$TPNAME4= <>
##$TPNAME5= <>
##$TPNAME6= <>
##$TPNAME7= <>
##$TPOAL= (0..7)
0.5 0.5 0.5 0.5 0.5 0.5 0.5 0.5
##$TPOFFS= (0..7)
0 0 0 0 0 0 0 0
##$TUNHIN= 0
##$TUNHOUT= 0
##$TUNXOUT= 0
##$USERA1= <user>
##$USERA2= <user>
##$USERA3= <user>
##$USERA4= <user>
##$USERA5= <user>
##$V9= 5
##$VALIST= <valist>
##$VCLIST= <CCCCCCCCCCCCCCC>
##$VD= 0
##$VDLIST= <DDDDDDDDDDDDDDD>
##$VPLIST= <PPPPPPPPPPPPPPP>
##$VTLIST= <TTTTTTTTTTTTTTT>
##$WBST= 2048
##$WBSW= 25
##$XGAIN= (0..3)
0 0 0 0
##$XL= 0
##$YL= 0
##$YMAX_a= 517044
##$YMIN_a= -662573
##$ZGOPTNS= <>
##$ZL1= 120
##$ZL2= 120
##$ZL3= 120
##$ZL4= 120
##$ABSF1= 14.98509
##$ABSF2= -5.573092
##$ABSG= 5
##$ABSL= 3
##$ALPHA= 0
##$AQORDER= 0
##$ASSFAC= 0
##$ASSFACI= 0
##$ASSFACX= 0
##$ASSWID= 0
##$AUNMP= <proc_prof1d_extract_pilot.lims>
##$AXLEFT= 0
##$AXNAME= <>
##$AXNUC= <1H>
##$AXRIGHT= 0
##$AXTYPE= 0
##$AXUNIT= <>
##$AZFE= 0.1
##$AZFW= 0.1
##$BCFW= 0
##$BC_mod= 0
##$BYTORDP= 0
##$COROFFS= 0
##$CY= 15
##$DATMOD= 1
##$DC= 0
##$DFILT= <>
##$DTYPP= 0
##$F1P= 0
##$F2P= 0
##$FCOR= 0.5
##$FTSIZE= 32768
##$FT_mod= 6
##$GAMMA= 0
##$GB= 0
##$INTBC= 1
##$INTSCL= 1
##$ISEN= 128
##$LB= 0
##$LEV0= 0
##$LPBIN= 0
##$MAXI= 10000
##$MC2= 0
##$MEAN= 0
##$ME_mod= 0
##$MI= 0
##$NCOEF= 0
##$NC_proc= -8
##$NLEV= 6
##$NOISF1= 0
##$NOISF2= 0
##$NSP= 0
##$NTH_PI= 0
##$NZP= 0
##$OFFSET= 14.98509
##$PC= 1
##$PHC0= 178.7585
##$PHC1= 0
##$PH_mod= 1
##$PKNL= yes
##$PPARMOD= 0
##$PPDIAG= 0
##$PPIPTYP= 0
##$PPMPNUM= 2147483647
##$PPRESOL= 1
##$PSCAL= 4
##$PSIGN= 0
##$PYNMP= <proc.py>
##$REVERSE= no
##$SF= 400.02
##$SI= 32768
##$SIGF1= 0
##$SIGF2= 0
##$SINO= 400
##$SIOLD= 32768
##$SPECTYP= <>
##$SREGLST= <1H.CDCl3>
##$SSB= 0
##$STSI= 32768
##$STSR= 0
##$SW_p= 8223.68421052631
##$SYMM= 0
##$S_DEV= 0
##$TDeff= 65536
##$TDoff= 0
##$TI= <>
##$TILT= no
##$TM1= 0
##$TM2= 0
##$TOPLEV= 0
##$USERP1= <user>
##$USERP2= <user>
##$USERP3= <user>
##$USERP4= <user>
##$USERP5= <user>
##$WDW= 1
##$XDIM= 32768
##$YMAX_p= 470221547
##$YMIN_p= -823712
##$CURPLOT= <Network HP LaserJet P1505>
##$CURPRIN= <$Network HP LaserJet P1505>
##$DFORMAT= <normdp>
##$LAYOUT= <+/1D_H.xwp>
##$LFORMAT= <normlp>
##$PFORMAT= <normpl>
##$SURQMSG= 1
$$ End of Bruker specific parameters
$$ ---------------------------------
##NTUPLES= NMR SPECTRUM
##VAR_NAME=  FREQUENCY,     SPECTRUM/REAL,   SPECTRUM/IMAG
##SYMBOL=    X,             R,               I
##VAR_TYPE=  INDEPENDENT,   DEPENDENT,       DEPENDENT
##VAR_FORM=  AFFN,          ASDF,            ASDF
##VAR_DIM=   32768,         32768,           32768
##UNITS=     HZ,            ARBITRARY UNITS, ARBITRARY UNITS
##FACTOR=    0.250966925370066, 1,           1
##FIRST=     8223.43324360094, -25273,       -47249
##LAST=      0,             27485,           -131675
##MIN=       0,             -823712,         0
##MAX=       8223.43324360094, 470221547,    0
$$ Real data points
##PAGE= N=1
##DATA TABLE= (X++(R..R)), XYDATA
$$ [...]
19543d1000A11968i7119m2217j27739f7847j29322M2634l6238j9551q2068a41164
19531c18640C04504a37072D5352c8405A3139h5544A46138b8747B7562I880A09
19519a58804N7045I3789a61595E840N1487b71517a07849q083B07813c88700p2304
19508d61004a9496H1245b64726C4644b73037J31122D13464A58860i0472q5655
19498a76127j08362F2K44881C8978a94383P4595H1554L8034a01305k0512l8160
19487a59977A7192m271K02087A148b70068P9437e7475A10833a20253F5567c55837
19475f4187p8543A55315o6117b38042F2473j9817l93a9797p5662B88017H5803
19463a45414j26162B64086K3240A38886F3805a18445j16767q0236M0804C418R8597
$$ plain form
19543 -41000 111968 -97119 -139336 -267075 -67847 -197169 -154535 -190773 -210324 -292392 -141164
19531 -318640 304504 -137072 45352 -38405 13139 -85544 146138 -28747 27562 9880 109
19519 -158804 -101759 93789 -161595 5840 57327 -271517 -107849 -115932 207813 -388700 -461004
19508 -461004 -19496 81245 -264726 34644 -273037 -141915 413464 158860 -90472 -176127
19498 -176127 -284489 62 244943 38978 -194383 -119788 81554 119588 -101305 -121817 -159977
19487 -159977 17192 12921 215008 1148 -270068 -190631 -57475 110833 -120253 65567 -355837
19475 -64187 -142730 155315 89198 -238042 62473 42656 42263 -19797 -95459 288017 85803
19463 -145414 -271576 264086 287326 138886 63805 -118445 -235212 -315448 -274644 3418 102015
19452A02015d2943B18522b85740J24591D4142J4793J08734E0457J68569b31234
19441c23493A58968d27371F8539r83F129d15348g0631A60671b86546G9815K0335
19430A00150b06830C3488a14666j66015m3632c9843B28779D3708e2844k56871
19420c09715f5365C45049C6218h8191j34072H1425h231j98017e0176j48442G4569
19408f1932A23465K3352a20409K512M3734l55457a74269j91658C0124a69551D3696
19396a57865D3609J18197a34474A72433c18464h8924B20171a06227k82132e4028
19385c66086B8545b5275H4682C4113f1801c09B661M4881J25238E8393h2435a2798
19372A74732B7342K25925a48048j05741a05821A06872b88160h6238m4958k1777
$$ plain form
19452 102015 -42943 218522 -285740 -161149 44142 58935 167669 50457 219026 -231234
19441 -323493 158968 -427371 68539 67556 6129 -415348 -70631 160671 -286546 79815 100150
19430 100150 -206830 33488 -114666 -280681 -324313 -39843 228779 43708 -52844 -309715
19420 -309715 -65365 345049 36218 -88191 -222263 81425 -8231 -206248 -50176 -198618 74569
19408 -61932 123465 146817 -120409 -117897 -74163 -429620 -174269 -365927 30124 -169551 43696
19396 -157865 43609 161806 -134474 172433 -318464 -88924 220171 -106227 -388359 -54028
19385 -366086 28545 -25275 84682 34113 -61801 -309 2661 47542 172780 58393 -82435 -12798
19372 174732 27342 253267 -148048 -253789 -105821 106872 -288160 -86238 -131196 -152973
19362a52973q8318E8938a32804k44357e4289q0941I2106h2519r7375Q7958n0915
19351a42851k59024a56599j65783C4835K2160e2556j29324H4222J35213f2608
19340a22067M6222C48625b68003g2640B28258a38934e8544m06987b12835C1603
19329A87576a40164j62731a29058l14339d4351A95652M5282c34096a27489A29405
19318a82481A1415a76016f6177A51506a26256K1722M8672A47219a69583f678n69582
19307e76260b00182A52798c82930A08696C4083a53984K1804p6023M7043M6940
19297a14220k20659c5309j51766D275a00864k18068a8971R096j3811A39398F1971
19285a56648G9442n331j9221c2598D1702g8343H3373D0329d44488I3069C7606
$$ plain form
19362 -152973 -241291 58938 -132804 -377161 -54289 -135230 92106 -82519 -179894 -91936 -142851
19351 -142851 -401875 -156599 -322382 34835 56995 -52556 -181880 84222 219435 -62608
19340 -122067 -75845 348625 -268003 -72640 228258 -138934 -58544 -465531 -212835 31603
19329 187576 -140164 -302895 -129058 -443397 -44351 195652 240934 -334096 -127489 129405
19318 -182481 11415 -176016 -66177 151506 -126256 -104534 -55862 147219 -169583 -6678 -576260
19307 -576260 -200182 152798 -382930 108696 34083 -153984 -132180 -208203 -161160 -114220
19297 -114220 -334879 -35309 -187075 4275 -100864 -318932 -18971 -9875 -23686 139398 61971
19285 -156648 79442 74111 54890 -32598 41702 -78343 83373 40329 -444488 93069 37606
19273A78264M7229b17478O5660D503a28769j3989N4549b2320A08595m2869l625
19262F2101g1396r4437B8546K32470a0764E3542b34950E4903a6063A33337g5086
19250E1689c88536J03222A08613a81371I2448K7775e9348D2555b45066a02941
19239a6880E3658l456b35675J02906b3065m9930A18333b29061H5807c35498C08794
19227a63498j31714C00559a19102b4E0559K48681b44496H6719b32968G2305c40070
19215b83841a37488A01884a40630k06329k9347O3970C13268d1816J4806l63269
19205c90279h1887q6065k8124h621E7385d8843A68226i368j08814L3220a6757
19193a80326H4670P5305h2684E6105J1086b85763J39838G5822e6068C831i0863
$$ plain form
19273 178264 225493 -217478 -151818 4503 -128769 -142758 -88209 -22320 108595 65726 62101
19262 62101 -71396 -165833 28546 261016 -10764 53542 -234950 54903 -16063 133337 -75086
19250 51689 -388536 -285314 108613 -181371 92448 120223 -59348 42555 -245066 -102941
19239 -16880 53658 50202 -235675 -132769 -23065 -72995 118333 -229061 85807 -335498 308794
19227 -163498 -295212 300559 -119102 -24 50559 299240 -244496 86719 -232968 72305 -340070
19215 -283841 -137488 101884 -140630 -346959 -376306 -312336 313268 -41816 -27010 -390279
19205 -390279 -81887 -167952 -196076 -8621 57385 -48843 168226 -9368 -118182 -84962 -16757
19193 -180326 84670 159975 -82684 56105 67191 -285763 -145925 75822 -56068 3831 -90863
19181B12208a95273N9156d8186r8336A90945B3992a09513K9791m7845E0509L06668
19170C57177j44510b13066O2650j41358A27900C3326P0225a94068r9219F9564
19159a39833F522a1979j3625p1687j34596A29189J8665o8822a71761F3093e8663
19147a02709p5081c0916F4070a16463N3452B27337a49732B1754R9531M7079b17914
19135B0787g9027l06106D27703B3743a38648k29363a60336A08457b28930M0937
19125a87993M5403n5561A96791o8593c45459B5236c02940Q9054l5463a6180k22551
19114b38731j79525H7496a1380k36843J427C88985a69691l8458P8593A07418a3265
19102f7195o4167j84697A329d55253a57632j57875J41353B60687N823A15786a00218
$$ plain form
19181 212208 -195273 -136117 -48186 -146522 190945 23992 -109513 -79722 -127567 50509 357177
19170 357177 212667 -213066 -150416 -291774 127900 33326 103551 -194068 -293287 69564
19159 -139833 6522 -11979 -25604 -97291 -231887 129189 147854 79032 -171761 63093 -58663
19147 -102709 -177790 -30916 64070 -116463 -63011 227337 -149732 21754 121285 168364 -217914
19135 20787 -79027 -385133 427703 23743 -138648 -368011 -160336 108457 -228930 -187993
19125 -187993 -142590 -198151 196791 128198 -345459 25236 -302940 -213886 -249349 -16180 -238731
19114 -238731 -418256 87496 -11380 -248223 -246796 388985 -169691 -208149 -129556 107418 -13265
19102 -67195 -131362 -316059 1329 -455253 -157632 -315507 -174154 260687 266510 115786 -100218
19090c97614C3204J2973r785a6583A55912K1713L9251a06014E946i166C4823N7503
19078I2326h5143Q549j99577A53794n3344K99481H8422k5479b3342B0139J29140
19067A49279g5410a5816n6964j64055G2586k9109e4749e598B77300f7673j14888
19056a82561E3698b54474A1216J63239a23300c0212m45574B76533d7783a2442
19045a48235j17425h2863B1726b02966j872C61123H0732O0089i2875A30407l0653
19034I9754d84033d1262k48365J08032A96038d6259k13245J25657d3173G7255
19023I9506o477c6852j87357f9016E4688D23b09482B2478d13024A84626d35681
19011C26662E6129b29657o4625i7457A03250a86496Q4716p9995A49979N2798c7879
$$ plain form
19090 -397614 33204 46177 36392 -16583 155912 177625 216876 -106014 5946 -9166 34823 92326
19078 92326 -85143 -76594 -276171 153794 100450 399931 88422 62943 -23342 20139 149279
19067 149279 -75410 -15816 -72780 -236835 72586 43477 -54749 -5598 277300 -67673 -182561
19056 -182561 53698 -254474 11216 174455 -123300 -30212 -475786 276533 -47783 -12442
19045 -148235 -265660 -82863 21726 -202966 -204838 361123 80732 140821 -92875 130407 99754
19034 99754 -484033 -41262 -289627 -181595 196038 -46259 -259504 -133847 -43173 77255
19023 99506 93029 -36852 -224209 -69016 54688 423 -209482 22478 -413024 184626 -435681
19011 326662 56129 -229657 -294282 -97457 103250 -186496 -101780 -181775 149979 202777 -37879
18999F1619j9200J11936c3364k23340B7941L1641b3470l11583B82457A9d4054
18987I7428a73689C29920b46044l7053J21449M0510J8254n4410K752j0539D15394
18975B86754f5916J6934o2443l1225H4692b90416M4868g8013p6561j4406N7267
18964a11713k07699B30703a4985m39550C8131i0931B93070b38586F4007b21101
18953G0903a63188q7330A5734b12646A50510B6068c45931C66408j67097o9494
18943A29817o3139K12871c4789B18943n6844b21492B34810a54020g0434B76041
18932i0884j38023c4709p167C9179L9279N6043a67100A73479B3558a60629B05302
18920e5612a9763r0743j91581i8563C8630Q9801a23009e650l3272j90068P5082
$$ plain form
18999 61619 42419 154355 -33364 -256704 27941 59582 -23470 -335053 282457 19 -44054
18987 97428 -173689 329920 -246044 -283097 -161648 -121138 -102884 -157294 -154542 -165081 415394
18975 286754 -65916 -48982 -111425 -142650 84692 -290416 -245548 -78013 -154574 -168980 -111713
18964 -111713 -319412 230703 -14985 -454535 38131 -90931 293070 -238586 64007 -221101
18953 70903 -163188 -250518 15734 -212646 150510 26068 -345931 366408 199311 129817
18943 129817 66678 279549 -34789 218943 162099 -221492 234810 -154020 -70434 276041
18932 -90884 -228907 -34709 -41876 39179 78458 134501 -167100 173479 23558 -160629 205302
18920 -55612 -19763 -110506 -302087 -98563 38630 128431 -123009 -5650 -38922 -228990 -153908
18909a53908j35458N5363a0064o2344j85830C12902b6108A7332K0300d60526a50784
18897A00374a26690m6317D09670A41072N8674a38309k38410a18488j00677B28156
18886A49596A7267a02929A11723e00847a84889G1653a9457A65367g2198A51508
18875g3811j35089i5676j25380N5902C5110c25027H542b75018C7377J77210f4979
18863A77630c86480B49706b74838E1410J82949a72412f2651l5791A46651a53936
18852b30279D0092J86006c9570B57549N9263a9118H5817i9A99307d8745j99964
18841b48709A06610m6374b01822N2103j40809C6098P7460i4057q2202j83951J77039
18830a83171i1092M326l3202q773I3744a4040k41394K9158M2592B06540F1642
$$ plain form
18909 -153908 -289366 -234003 -10064 -72408 -258238 312902 -26108 17332 37632 -460526 -150784
18897 100374 -126690 -173007 409670 141072 199746 -138309 -376719 -118488 -219165 228156
18886 149596 17267 -102929 111723 -500847 -184889 71653 -19457 165367 -72198 151508
18875 -73811 -208900 -95676 -221056 -165154 35110 -325027 8542 -275018 37377 214587 -64979
18863 177630 -386480 249706 -274838 51410 234359 -172412 -62651 -98442 146651 -153936
18852 -230279 40092 226098 -39570 257549 316812 -19118 85817 -99 199307 -48745 -248709
18841 -248709 106610 60236 -201822 -149719 -290528 36098 113558 -94057 -176259 -360210 -183171
18830 -183171 -91092 -86766 -119968 -128741 93744 -14040 -255434 -226276 -183684 206540 61642
18818c44511A18702L26014A90168M8716a01874P887l6133A44671a04135B90150
18807C0982b41345B98149H925L49768D1601b52411L5526k5540n3234d6783A47909
18795d3661C74979A71114o1198N83a65233l39798a64681J9704B66785g2563j38962
18784b11525q2429B1079L77020a34429A03790a09759D8982N259c27683j96739
18774e24422b30674B2676d983A07065b46617A73621g3865A47879m5277q736G144
18762E4571J3282a15394B3637K0428Q7834b02025f144G9680b24205g5452p7729
18751a53181b1338j8509B58809c3110k87932b6462C40761A52255J6988C0391O9753
18740A00144a21575a9391D06688b7428j58049P8022p8578J4818E4503J74044i447
$$ plain form
18818 -344511 118702 444716 190168 238884 -101874 -93987 -130120 144671 -104135 290150
18807 30982 -241345 298149 8925 358693 41601 -252411 -216885 -242425 -295659 -46783 147909
18795 -43661 374979 171114 109916 110499 -165233 -505031 -164681 -144977 266785 -72563 -211525
18784 -211525 -293954 21079 398099 -134429 103790 -109759 48982 54241 -327683 -524422
18774 -524422 -230674 22676 -4983 107065 -246617 173621 -73865 147879 102602 93866 7144
18762 54571 67853 -115394 23637 44065 131899 -202025 -6144 79680 -224205 -75452 -153181
18751 -153181 -21338 -39847 258809 -33110 -321042 -26462 340761 152255 169243 30391 100144
18740 100144 -121575 -19391 406688 -27428 -185477 -107455 -186033 -171215 54503 228547 -9447
18728i5029H4591a79068d4255r1184M1251e386H0277A17a00759G5363c07658a42338
18715g7189l1967d4697A17907b73447l8734A91540e64528A98987b04356l3213
18705b37569B33752a09722d496n8318A44256k3726C17J45677C72a95850Q2110
18694a13740b5591m4717B86976e9536D6214c22831A48426a46863B1645I639a19693
18682e08769C11429b63929A47230b87032C76234j57490f9437A32957b03612D7726
18671a30906J2672o6717q0220a31095r1799a07740k03437A59547b03218a00055
18660a77859p354a6222E0729f1816b0822j72975A22901A7525a31011n559j83227
18649c19797C656K24015I963c2061F3205a48026l7169A01606k2320b10780k99203
$$ plain form
18728 -95029 84591 -179068 -44255 -135439 -94188 -5386 80277 117 -100759 75363 -307658 -142338
18715 -77189 -109156 -44697 117907 -273447 -312181 191540 -564528 198987 -204356 -237569
18705 -237569 233752 -109722 -4496 -62814 144256 120530 317 145994 372 -195850 -113740
18694 -113740 -25591 -70308 286976 -59536 46214 -322831 148426 -146863 21645 9639 -119693
18682 -508769 311429 -263929 147230 -287032 376234 218744 -69437 132957 -203612 47726
18671 -130906 -118234 -184951 -265171 -131095 -222894 -107740 -311177 159547 -203218 -100055
18660 -177859 -185213 -16222 50729 -61816 -20822 -193797 122901 17525 -131011 -136570 -319797
18649 -319797 3656 227671 9963 -32061 63205 -148026 -185195 101606 79286 -210780 -509983
18638e09983E5094R1868d2408B2922e0252j78660A76789E1020O5154d03961a23353
18626g5756p5546C05798b68013a9391k2760A38809a25678A21415f8800H4999a55968
18614B6577a91524e2169A13146E1146c6032j44268g2614A19453d81j35472E5987
18602A93287b10454k21812A36289b25023e1687n7243L8766A38479k1356f6622
18591a66271f7873B49981D243a20245A7968N3543J25554b41087k76649a39284
18580E6155d54616J43576A77307b52375J05580G9221J3507a07624L4389A27273
18569B18870J53299A5678b13901b5951C6750j6606a5750l28772B7011d34473A22172
18557b38727A46339b32292A26341d0818j12211K4048o0475L7444H8181a61935
$$ plain form
18638 -509983 55094 146962 -42408 22922 -50252 -228912 176789 51020 116174 -403961 -123353
18626 -75756 -151302 305798 -268013 -19391 -42151 138809 -125678 121415 -68800 84999 -155968
18614 26577 -191524 -52169 113146 51146 -36032 -180300 -72614 119453 -481 -135953 55987
18602 193287 -210454 -432266 136289 -225023 -51687 -108930 -70164 138479 117123 -66622
18591 -166271 -67873 249981 4243 -120245 17968 71511 197065 -241087 -517736 -139284
18580 56155 -454616 -311040 177307 -252375 -146795 79221 92728 -107624 -73235 127273
18569 218870 372169 15678 -213901 -25951 36750 20144 -15750 -344522 27011 -434473 122172
18557 -238727 146339 -232292 126341 -40818 -153029 -128981 -189456 -152012 88181 -161935
18546A27307a09792A98881a12606r2353N9185q5222B22386E8045c02682a31601
18535A18123d15373J91022L4133j54623a29566j11497P5915J3963B3044a50148
18524b58090i6613I0793A0923b29153b6501B9519b56807A21985c20658M7278n385
18513b78765J38829b6798j393B521K37493I2450a34459H2951a58189J3533J654
18502a43002o7260I3043i5914o6737g3297j96171j96822a55987L2223L9113p7933
18491a62584d9767K4882j30863l26498b11201F8267R1073h2285a9043B7116J26188
18480A53304a98916l3770K1314F2439J48371i5974k0812A2227a35728j1655B10213
18468c7783E1380c3909j23414o7415A22555b0626B83358a56794p8108o1265C04320
$$ plain form
18546 127307 -109792 198881 -112606 -204959 -145774 -230996 222386 58045 -302682 -131601
18535 118123 -415373 -224351 -190218 -344841 -129566 -241063 -165148 -151185 23044 -150148
18524 -258090 -96613 90793 10923 -229153 -26501 29519 -256807 121985 -320658 -273380 -278765
18513 -278765 -139936 -26798 -28191 2521 240014 92450 -134459 82951 -158189 -144656 -143002
18502 -143002 -210262 93043 -95914 -162651 -73297 -269468 -466290 -155987 -123764 -84651 -162584
18491 -162584 -49767 -24885 -155748 -482246 -211201 68267 159340 -82285 -19043 27116 153304
18480 153304 -198916 -232686 -211372 62439 210810 -95974 -116786 12227 -135728 -147383 210213
18468 -37783 51380 -33909 -157323 -224738 122555 -20626 283358 -156794 -234902 -296167 304320
18456a80192A8154a69634P0209A28104J24855B443a13584c1867l1396C24208b06793
18444b2282l09513J06800O391C5417a81049C955J19458R265N4421D0394b50319
18432f7108c1828A49985j4565C6918d3974k741q5719k06812R4922K7864B17916
18420H5177h4570k1108A75275a05757l03096J56135D702L8941A3970b02624C1596
18408A41991o0249a54319A78388K16558c3215A42366g1315j25853A11287n1056
18398F0231P0496a43530A35274D6690K31448a23341A30998h5288c1339j90536
18388b21875k9953A09001K2959D5838K46412c3721A65484J57490a58392A6825
18377a0390j54123C0776a53991p0654c6749j38599K4083N5596F7127N8503b21353
$$ plain form
18456 -180192 18154 -169634 -99425 128104 252959 2443 -113584 -31867 -63263 324208 -206793
18444 -22282 -331795 -224995 -218604 35417 -181049 3955 123413 132678 187099 40394 -250319
18432 -67108 -31828 149985 135420 36918 -43974 -46715 -132434 -339246 -244324 -216460 217916
18420 85177 -84570 -105678 175275 -105757 -408853 -252718 4702 43643 13970 -202624 31596
18408 141991 81742 -154319 178388 394946 -33215 142366 -71315 -197168 111287 60231
18398 60231 130727 -143530 135274 46690 278138 -123341 130998 -85288 -31339 -221875
18388 -221875 -251828 109001 131960 45838 292250 -33721 165484 322974 -158392 16825
18377 -10390 -164513 30776 -153991 -224645 -36749 -175348 -151265 -95669 67127 125630 -221353
18365D19290D7238e9207j733K0663B06980a33692c0010k03118C41458A2028a48341
18353e0029A44462c63705B01296l2213a83195K1682B65573A32039b9184k16169
18343b45353k43656J93706J09979R0988A78605b47954J10911j72736B34758I1627
18332a91066N5130B24822c04296H3410l4695a50023A22098h1776j89587B91792
18321A91150a03055A41073a2449j06593H5364O5517f604C85981B6293i3010F2928
18309a16736C35079A3722b8933F5068g9711B40446b31632g444j37357A04690c4989
18297a29027D6630i3608A65803a36229c0451k04945k15240e1063j52230B63297
18286A29510b6100H315h7306E5701A8854h1161A48543a04371H0830J5636a43953
$$ plain form
18365 419290 47238 -59207 -60940 -40277 206980 -133692 -30010 -233128 341458 12028 -148341
18353 -50029 144462 -363705 201296 169083 -183195 -161513 265573 132039 -29184 -245353
18343 -245353 -489009 -295303 -185324 -94336 178605 -247954 -137043 -309779 234758 91627
18332 -191066 -135936 224822 -304296 83410 48715 -150023 122098 -81776 -271363 291792
18321 191150 -103055 141073 -12449 -119042 85364 150881 -6604 385981 26293 -93010 62928
18309 -116736 335079 13722 -28933 65068 -79711 240446 -231632 -7444 -144801 104690 -34989
18297 -129027 46630 -93608 165803 -136229 -30451 -235396 -450636 -51063 -203293 263297
18286 129510 -26100 8315 -87306 55701 18854 -81161 148543 -104371 80830 96466 -143953
18274A95773a78591l178f5632j7414b6437j55305h5304j11024I2683N5251h9206
18262d03745a7052A16023b43648d7228k4369j02289D88293h7764D4380b68205
18251b477j73821B66439i9212A5849J85525E6150e5222k8162a1893j29095r7152
18240b38140M412J11926B35084b15699i0344d2085j45322F777K60452k2040g8055
18228a63493E658R6301a43047k78100K06260k7538J04325e8886R457O212r7051
18217a40268O4798b7604j58454D9331J01792b52485N9705F5648b25737R3966d8135
18205A3320e5587l4825a3180G1272a04356A12769l0073B405a60135Q290B19666
18193a72895B40102h4611j53361R5810n6276O5438A77798D9445J02313b12755
$$ plain form
18274 195773 -178591 -181769 -65632 -83046 -26437 -181742 -85304 -196328 92683 147934 -89206
18262 -403745 -17052 116023 -243648 -47228 -71597 -173886 488293 -87764 44380 -268205
18251 -2477 -176298 266439 -99212 15849 201374 56150 -55222 -83384 -11893 -140988 -238140
18240 -238140 -233728 -121802 235084 -215699 -90344 -42085 -187407 6777 267229 245189 -78055
18228 -163493 5658 101959 -143047 -421147 -214887 -242425 -138100 -58886 -49429 -43217 -140268
18217 -140268 -75470 -27604 -186058 49331 151123 -252485 -192780 65648 -225737 -131771 -48135
18205 13320 -55587 -90412 -13180 71272 -104356 112769 82696 2405 -160135 -151845 219666
18193 -172895 240102 -84611 -237972 -142162 -198438 -133000 177798 49445 151758 -212755
18182a96164b1097B09411d9406j47299b287k42324F1691b0880j44238A27909b21349
18170A37958a74719G1792k2227K42911b96450f1936k4576G3567N7998a19081q2335
18159b01416Q8085D279a75844c5251k56409a05361C5754b26977c1918I6607L46109
18148D42716b76408i128B50502a80231A36476j8802a3617B81529C1462a04082
18137c7839F2611c34096a62594K0409I5553a43564j85894a9138A08741b13669
18126A28629a12142C9295J30777c3611k6245j56732g7939n2735J6283b2281l2485
18115e4766k74624E4077b75627N6160N9573A87248a18117A91469E8141J37190
18105A95331F5808L4105D1550a04369M7831E4981a35532J9245N4884a0322d276
$$ plain form
18182 -196164 -21097 209411 -49406 -196705 -2287 -244611 61691 -20880 -165118 127909 -221349
18170 137958 -174719 71792 49565 292476 -296450 -61936 -86512 73567 131565 -119081 -201416
18159 -201416 -113331 4279 -175844 -35251 -291660 -105361 35754 -226977 -31918 96607 442716
18148 442716 -276408 -9128 250502 -180231 136476 117674 -13617 281529 31462 -104082
18137 -37839 62611 -334096 -162594 -142185 95553 -143564 -329458 -19138 108741 -213669
18126 128629 -112142 39295 170072 -33611 -59856 -216588 -77939 -130674 -114391 -22281 -54766
18115 -54766 -329390 54077 -275627 -219467 -159894 187248 -118117 191469 58141 195331
18105 195331 65808 99913 41550 -104369 -56538 54981 -135532 -116287 -61403 -10322 -4276
18093a66567M0367j7147A88987M2020a38615e0623E5024d39173A24527a97680
18082g4410F7574c3854A40589j0562e4721A51130M4748D3733J52694l0796b38499
18070a90189A99112g61j03053B1847A42N240b39139c2086B14900f3117B53354
18058c57228B69409b67919h8215c6778E2833c6522O709A05913A2526J03768b2613
18046C12249b66337c0908A41841d6246B07675k0701J15614a17377d2333k30039
18036b72372G6509J42530F1280J70863a61935P0095F9366j2318b66392j21357
18026c87749A83577a56827C57664G3137b35308C1895b43790B2522a75432R757
18016a65675F7592f3767A61789k3635b17865R9331K3245G6414M1867J5399c8034
$$ plain form
18093 -166567 -126200 -143347 188987 231007 -138615 -50623 55024 -439173 124527 -197680
18082 -74410 67574 -33854 140589 130027 -54721 151130 195878 43733 196427 165631 -238499
18070 -190189 199112 -761 -103814 21847 142 5382 -239139 -32086 214900 -63117 253354
18058 -357228 269409 -267919 -88215 -36778 52833 -36522 -29813 105913 12526 116294 -22613
18046 312249 -266337 -30908 141841 -46246 207675 186974 302588 -117377 -42333 -272372
18036 -272372 76509 219039 61280 232143 -161935 -91840 69366 57048 -266392 -387749
18026 -387749 183577 -156827 357664 73137 -235308 31895 -243790 22522 -175432 -165675
18016 -165675 67592 -63767 161789 138154 -217865 -118534 -95289 76414 118281 133680 -38034
18004c3929D2002c09761i2461r6838h8649r6165B2452d2078C0710L3658o135d49494
17991e3855B71183H7980f4248b2226F5534M3899a40994n3694A19497d897n0059
17980e4956J0779k739l03019J17578E9106c54044J68907i0137B76678O2092d047
17968A00178b22953C64600b0627p1468k995K4436j73300j13624d2226j20308I0162
17956b3538p7170l4351j01033F3481I01Q709f2372p849c4274B71539a69069e7010
17943E7121b10205F3564J42699D1492d7982j46792G1417h1144N272c2777n2205
17932h4982j28720E8879a0745A25532e6838A15630K24733a32009N7048G5998a03157
17920G2728Q8681b89826H541c51400A02363a0161j02036d7075k66409H651K62543
$$ plain form
18004 -33929 42002 -309761 -92461 -189299 -88649 -184814 22452 -42078 30710 64368 58233 -449494
17991 -53855 271183 87980 -64248 -22226 65534 109433 -140994 -194688 119497 -4897 -54956
17980 -54956 -44177 -46916 -349935 -232357 59106 -354044 -185137 -90137 276678 338770 -4047
17968 100178 -222953 364600 -20627 -92095 -95090 -70654 -243954 -357578 -42226 -162534 90162
17956 -23538 -100708 -135059 -236092 63481 901 9610 -62372 -70221 -34274 271539 -169069 -57010
17943 57121 -210205 63564 206263 41492 -47982 -194774 71417 -81144 -75872 -32777 -84982
17932 -84982 -213702 58879 -10745 125532 -56838 115630 340363 -132009 -74961 75998 -103157
17920 72728 161409 -289826 8541 -351400 102363 -10161 -112197 -47075 -313484 8651 271194
17909B71194b11964N1604A4983g3833k14897F5095d40255a91888Q6792M6398r6657
17898a55355I9542M738L15582I0321J80386f4093F8679J88180l6724a94311A04106
17886d2735K0326m3231m4679A84353d8226j41140g0999k01106M5684B68553j26927
17875A41626F9701J20819b57630b7095o0597A5618g5801K4035i581A28682A8232
17863a66490a8189b733A49222B8114a58965p6324b4245j61279D0920M7443a93742
17851a53773H6463b10110O4391F3822J35135a2498A63254K3964P786m2176h961
17839A51481f9050j71307a0768l28029e2011G3632B7339e9198A28520J24204a34653
17827C99273A79046a79084f0189B08073b83713e8666k30953e2761A56519b01246
$$ plain form
17909 271194 -211964 -160360 14983 -73833 -288730 65095 -440255 -191888 -105096 -58698 -155355
17898 -155355 99542 104280 419862 90321 270707 -64093 68679 256859 220135 -194311 104106
17886 -42735 -22409 -65640 -110319 184353 -48226 -189366 -70999 -272105 -226421 268553 141626
17875 141626 69701 190520 -257630 -27095 -87692 15618 -75801 -51766 -9581 128682 18232
17863 -166490 -18189 -2733 149222 28114 -158965 -235289 -24245 -185524 40920 88363 -193742
17851 -153773 86463 -210110 -145719 63822 198957 -12498 163254 187218 195004 152828 -8961
17839 151481 -69050 -240357 -10768 -338797 -52011 73632 27339 -59198 128520 252724 -134653
17827 399273 179046 -179084 -60189 208073 -283713 -58666 -289619 -52761 156519 -201246
17816A9441b20094D8579K21357A28872L35839G6723J95928b53153O0992B89108
17805B43804J45410a80156j99634G1392g9686F542J02588a32277A22293h744j09893
17794a18637N0994B08083A8523B843a17323a3775A30122I479b38593F2974a89707
17782F6000Q7338b42517A87152b3679C7450j3535Q3007l7341K4134a82249A10270
17770B6410a3528k36440i4781J0604G5456K031a05926B22286i1755D188g0083
17758d5712C5223K41199o6148M7617F9059O0974o2996a08965C6162b49858A6016
17746A71101c04909H2281J15035c20516J36502N0065J5978M7787j34570P9889
17736a24865J2298G7981K7267m6261a50784j33577f4795B76349d9929k22300C53298
$$ plain form
17816 19441 -220094 48579 269936 128872 464711 76723 272651 -253153 -192161 289108
17805 243804 389214 -180156 -379790 71392 -79686 6542 109130 -132277 122293 -8744 -118637
17794 -118637 -67643 208083 18523 2843 -117323 -13775 130122 9479 -238593 62974 -189707
17782 66000 153338 -242517 187152 -23679 37450 23915 106922 69581 93715 -182249 110270
17770 26410 -13528 -249968 -94781 -84177 75456 77487 -105926 222286 -91755 4188 -70083
17758 -45712 35223 276422 210274 257891 69059 130033 67037 -108965 36162 -249858 16016
17746 171101 -304909 82281 197316 -320516 -184014 -133949 -117971 -70184 -204754 -124865
17736 -124865 -112567 77981 105248 58987 -150784 -284361 -64795 276349 -49929 -272229 353298
17724C35094b65948q3306J55624D9360c08264B84246A2482e5344B71162j18046
17714A53116b61517c1473C04911G1994J04512o5668J44714m1954G7657L927e9237
17702B39834e0168C9437J67480a54711r8697C67553E1532J28430f9788B44813
17691a35885E8982b03331i5887k29977a25807N1883j08802B77735b14908E789
17680D8037K02278c16388G2390f1141B30838c0686A01641J55130H1007j2558a04119
17668E6855b19967D5601b01240E2336a0762A88277b5001l70788g0705l23654B38181
17656E5687Q2581J10080c313C2231a66520c3128E2599J663a15107B931P7020Q2234
17644A62185c7208A74628H1192l4694a29877k42804I1442m89r234R880c9609B42309
$$ plain form
17724 335094 -265948 -349254 -193630 49360 -308264 284246 12482 -55344 271162 153116
17714 153116 -261517 -31473 304911 71994 176506 110838 255552 213598 77657 81584 -59237
17702 239834 -50168 39437 206917 -154711 -253408 367553 51532 179962 -69788 244813
17691 -135885 58982 -203331 -95887 -325864 -125807 -73924 -182726 277735 -214908 5789
17680 48037 250315 -316388 72390 -61141 230838 -30686 101641 256771 81007 68449 -104119
17668 56855 -219967 45601 -201240 52336 -10762 188277 -25001 -395789 -70705 -394359 238181
17656 55687 138268 248348 -3313 32231 -166520 -33128 52599 54262 -115107 2931 79951 162185
17644 162185 -37208 174628 81192 46498 -129877 -372681 91442 90953 81719 91599 -39609 242309
17631D522b8133j31631I9932P9516B4726a8961C00967f0133C9456L74348c7512
17619c20417A23135L19733a42480H4304D714M1018b04146Q0770C24911A1962J33782
17608A45744a60374d7336A75356a51470J9298B7356N3955j1976a34084A37427
17597c57791A39549J01782g1937c3454B0895a93800D56588k25549J83041A23846
17586a13166f757E295c84763J49356c1827H9208l0577K01681C2159J70383b0942
17574H4477l2656k2119g947B25003K5714F2665R1330M3683m471c38693A30798
17562c5227A20531l8819K4938M5298a11821B08969A6083J00716K24921A32152
17551G7253A9571Q5796O7132O8671j02031J75701F9285c5736j65861A78579b78702
$$ plain form
17631 4522 -28133 -159764 99932 179448 24726 -18961 300967 -60133 39456 413804 -37512
17619 -320417 123135 442868 -142480 84304 4714 45732 -204146 -123376 324911 11962 145744
17608 145744 -160374 -47336 175356 -151470 -132172 27356 81311 69335 -134084 137427
17597 -357791 139549 241331 -71937 -33454 20895 -193800 456588 231039 414080 123846
17586 -113166 -6757 5295 -384763 -235407 -31827 89208 58631 260312 32159 202542 -20942
17574 84477 51821 29702 -7947 225003 250717 62665 153995 197678 193207 -338693 130798
17562 -35227 120531 81712 106650 151948 -111821 208969 16083 116799 341720 132152
17551 77253 19571 105367 172499 241170 139139 314840 69285 -35736 -201597 178579 -278702
17539D1000A1122N9484M0053Q9258b9338j59953O8806O069j61408D34474A56591
17527B27499G4096J87808p0503g582k10459G5873M5593a37455A53166b14711C24374
17515a06536A01027c6793d524l3589j03087N8125C4592a1831B8735K17422k3889
17504B22268a8026C81143B8338Q3421B8934L3223Q1223L50203A77077n9342c9790
17492B58117o9534k1347p4605J70519K7988b37558B02571A4301L38917a09397
17481A12898A8751b73556D8692a13887H8214M18894C3896i9795B5186K49553A07809
17469B31372L14186h3900B36844J15328B4944e7875C82098A7736K5459a00211
17458A61733h2297A64358C7403b60083C46810j52249C5914K44292D7890M87377
$$ plain form
17539 41000 11122 70606 110659 199917 -29338 -189291 -120485 -114416 -275824 434474 156591
17527 227499 74096 261904 191401 -7582 -218041 75873 121466 -137455 153166 -214711 324374
17515 -106536 101027 -36793 -4524 -38113 -141200 -83075 34592 -11831 28735 246157 222268
17504 222268 -18026 381143 28338 111759 28934 62157 143380 493583 177077 117735 -39790
17492 258117 188583 167236 92631 263150 291138 -237558 202571 14301 353218 -109397
17481 112898 18751 -273556 48692 -113887 88214 507108 33896 -99795 25186 274739 107809
17469 231372 545558 -83900 236844 352172 24944 -57875 382098 17736 43195 -100211
17458 161733 -82297 164358 37403 -260083 346810 194561 35914 280206 47890 535267
17448E35267A04047L60342r0844j76072M9331j14039J86451l9280P7074j7184
17438C39826K25012k56293o2794a64843H8201a9662I7068K38590G8943J20727
17428A99670H3150f8407B02620m0449J51842J16461A61540J16546a07297A93361
17417C65388n6512G2806K64311B0135J57065J36707a04048J8076B80279Q4422
17407C64701A79945Q6876Q7224d4721B61192E6506d4029F6172K44950J83677A18292
17395C20599D5727L7268K45636b39491B13695p2328J07202a61338F9955f0961
17384B96561R5467j15429D8558a46097B51177r3267J68579I0078j0404a66015
17373C8422J45267G0997A1215P105a87140B91970J01281A67390p0505L8860i0582
$$ plain form
17448 535267 104047 464389 373545 197473 246804 132765 319216 279936 357010 339826
17438 339826 564838 308545 245751 -164843 88201 -19662 97068 335658 78943 199670
17428 199670 83150 -68407 202620 162171 314013 430474 161540 278086 -107297 193361
17417 365388 308876 72806 337117 20135 177200 313907 -104048 -85972 280279 364701
17407 364701 179945 266821 354045 -44721 261192 56506 -44029 66172 311122 494799 118292
17395 320599 45727 82995 328631 -239491 213695 141367 248569 -161338 69955 -60961
17384 296561 392028 276599 48558 -146097 251177 157910 326489 90078 79674 -166015
17373 38422 183689 70997 11215 18320 -187140 291970 393251 167390 96885 135745 -90582
17361D08864A92490F1077J54004K9789I7277J06445m1743A0816R4055Q7494F4223
17349C40380p6994A02576c4176A34403k2141M1715D6348i502C82956L3861q3239
17338C33578b6157D64801A9838N1366b91861B89180J75054B18817C7067O1007
17328I8074D0329A3816K77616I8081K81727d8839j42925c2623A35022J59095J65147
17317D59264F0869O9188j2133a35255I5676J99527p7819K252J58964A56972J21277
17306B78249K14161A88641O1730K03166B25673k8189j073n6300g7755J0606G7490
17294F1695k479P9144K36906a9013A38613E2806J44535a79347G7012J15531H7664
17282B49434A12440h5038A28705a0196A99326j7064f3209I0597N2488K98563j87100
$$ plain form
17361 408864 192490 61077 215081 244870 97277 203722 161979 10816 104871 192365 64223
17349 340380 263386 102576 -34176 134403 112262 153977 46348 -9502 382956 416817 333578
17338 333578 -26157 464801 19838 71204 -291861 289180 464234 218817 37067 98074
17328 98074 40329 13816 291432 98081 379808 -48839 -191764 -32623 135022 294117 459264
17317 459264 60869 130057 117924 -135255 95676 295203 217384 219636 378600 156972 278249
17306 278249 492410 188641 250371 453537 225673 197484 196411 140111 -77755 -67149 77490
17294 61695 59216 138360 375266 -19013 138613 52806 197341 -179347 77012 192543 87664
17282 249434 112440 -85038 128705 -10196 199326 182262 -63209 90597 143085 441648 254548
17271B54548N0021m1332J8101A04457E030R2628j1310a85587B60880C3058f9757
17259A14897J89732J76923A17135M0243K36231A10482j6188k2471K36837j01329
17249B07331K6051m2350K70300a44020A7788M12709A13493a23517e7384A38076
17238B73534m86b7771l43648A25464K9855o4105N6936J79129o4099J08400j64021
17227B07559q6524i9207F10575D6839K33557O4435J19866A21029e3832G152J86511
17216A93663k9697P4827K65695e376k5095C61549n2082L8403q2000j4418M4717
17205B96169r7633n8263b4583A72626N2029r0858d9624B37759K7861j00033G4557
17193A46788K41960G2564B5783O01784A88542G2441O167J30761P6602k0683o0327
$$ plain form
17271 254548 304569 263237 281338 104457 5030 97658 86348 -185587 260880 33058 -69757
17259 114897 304629 481552 117135 157378 393609 110482 94294 71823 308660 207331
17249 207331 233382 191032 461332 -144020 17788 430497 113493 -123517 -57384 138076
17238 273534 273048 -27771 -371419 125464 155319 91214 148150 327279 263180 371580 207559
17227 207559 121035 -99207 610575 46839 280396 344831 464697 121029 -53832 7152 193663
17216 193663 163966 238793 504488 -5376 -30471 361549 309467 347870 265870 251452 296169
17205 296169 198536 140273 -24583 172626 224655 133797 -49624 237759 265620 165587 74557
17193 146788 388748 72564 25783 627567 188542 72441 78608 209369 285971 265288 204961
17182B04961J24141K16499q5409j00417p2077p8002R0267G3039L39407A03944
17171D77309B04260Q2729Q0156j55358K108L739J89912p1832P3906A03195J58720
17160B61915J21422j28408J54629p8981n9545M8113j6028A15777K26110J91589
17150E33476I0206K89138O2488Q8586d1652C88932F5248J25006L9699M36136C22076
17138C56693o9394K27600i7525D62681B17991K56345j34044J79982k05455l5629
17128B79190L63093k88440L6051M37885A36465J70801J24216J09426F5787K15407
17118B81194j9670O0111K6083L9500j50363Q9165J65096q0362q6453K7405J57301
17107E09007B20982J61446M0511j64089M38029k87265J97904o7243p4030r5169
$$ plain form
17182 204961 329102 545601 460192 359775 287698 209696 299963 73039 412446 103944
17171 477309 204260 286989 367145 211787 213895 217634 407546 335714 409620 103195 261915
17160 261915 383337 254929 409558 330577 271032 319145 303117 115777 341887 533476
17150 533476 90206 379344 441832 530418 -41652 388932 65248 190254 229953 666089 322076
17138 356693 287299 514899 -97525 462681 217991 474336 340292 520274 314819 279190
17128 279190 642283 353843 389894 827779 136465 307266 431482 540908 65787 281194
17118 281194 261524 321635 347718 387218 236855 326020 491116 410754 324301 351706 509007
17107 509007 220982 382428 422939 258850 696879 409614 607518 540275 466245 371076
17097C71076m4682J76100A46852J94559m3517O0987Q4735K81056B31281K83708
17087E14989j62710L06186k95115K27900j37006l6759H1106L7091K26058R2666
17077D36921q8526C2436M84104J33981j62959m2400j2897J29558r2590K18220
17067F87453j2893k39401M4946O7914j5461j76429K14951p1192Q3084l4436o0582
17056D87954K7102R4911K97998D07579J35202J98238l01448o8424O3588K30881
17046F65616B76379M50427C26994M57683J20257k59475k57322j26821J01254J38981
17036E01551j4349q580J31395J52255P9761k83464j34933A63508M42851k24788
17026C81571M37056l61762J66580J35460j70193K46389m0875l32367J42561A64667
$$ plain form
17097 371076 326394 502494 146852 341411 297894 358881 443616 724672 231281 514989
17087 514989 352279 658465 363350 591250 454244 417485 81106 118197 344255 436921
17077 436921 348395 32436 516540 650521 487562 445162 432265 561823 469233 687453
17067 687453 674560 435159 480105 548019 532558 356129 571080 499888 582972 548536 487954
17056 487954 515056 609967 907965 407579 542781 741019 439571 371147 434735 665616
17046 665616 276379 726806 326994 784677 904934 645459 388137 261316 362570 501551
17036 501551 487202 478622 610017 762272 842033 558569 423636 163508 606359 381571
17026 381571 818627 456865 623445 758905 588712 835101 794226 461859 604420 164667
17015F07750K9253N675M7411j81658J1183r2125J58858r3163K69176k57449R1757
17004E96668R0372M6838J61354o5501k85228J84362J05588j45938N8j99427K25459
16993G14605l1788K18507l01301M36648k57448k06354O4966N60140n60992J47721
16983G84704r4511K36640J04849l60592j31217K85165K01310m79740K20415Q4911
16973H51934M7940n7479k463J00974k31826L45984k71394r6436M14498K39765
16963A341497j80268k68406j4843J66430K03161E17788M76979J5234l33394J94382
16953H70989j25927M89571j29797o8796j90819K71298j63333K50447k47469K07468
16943A163632J02194k67866L20579l10307L05048L5526l35801J70203J6365O8943
$$ plain form
17015 607750 637003 642678 690089 508431 519614 427489 586347 493184 762360 504911 596668
17004 596668 687040 733878 895232 829731 544503 728865 834453 688515 688573 489146 714605
16993 714605 682817 901324 600023 1036671 779223 572869 637835 1197975 636983 784704
16983 784704 690193 926833 1031682 671090 539873 825038 1026348 546608 767023 851934
16973 851934 899874 842395 839932 940906 709080 1055064 783670 687234 1101732 1341497
16963 1341497 1161229 892823 877980 1044410 1247571 517788 994767 1010001 676607 870989
16953 870989 745062 1234633 1104836 1036040 845221 1116519 953186 1203633 956164 1163632
16943 1163632 1265826 997960 1318539 1008232 1313280 1348806 1013005 1183208 1199573 1268516
16933A268516k81599K67446J32418J5258l01906L99009j4692j62045l28755M07847
16923A401497m4828J6466j59550K37662J65443l89003L58356o8988r639j9139
16913A488277K34821l51206L62370m20096K11751J90015k0597M677k7266j11457
16903A561289J05620k8345l6257J24342J61099k24446M14170N2631k6671l97798
16893A705634K01506J04638P3094m27345K44741O9913J3849M5272J65365J26146
16883B322813j71632N1640K176K07350R9412m78363K4926L17581m36261M28574
16873B368216k37687L01872J10073P9906k37822K58575R3175n432P1475M7252
16863B849603j31497N0072o8665Q0649p7720l1061L53554K23051j7338m11227
$$ plain form
16933 1268516 986917 1254363 1386781 1402039 1100133 1499142 1484450 1322405 993650 1401497
16923 1401497 1356669 1373135 1213585 1451247 1616690 1227687 1586043 1517055 1507416 1488277
16913 1488277 1723098 1371892 1734262 1314166 1525917 1715932 1695335 1700012 1672746 1561289
16903 1561289 1666909 1638564 1602307 1726649 1887748 1663302 2077472 2130103 2103432 1705634
16893 1705634 1907140 2011778 2084872 1657527 1902268 1972181 1986030 2031302 2196667 2322813
16883 2322813 2151181 2202821 2204997 2412347 2511759 2033396 2058322 2375903 1939642 2368216
16873 2368216 2130529 2432401 2542474 2622380 2384558 2643133 2736308 2730876 2802351 2849603
16863 2849603 2718106 2768178 2699513 2780162 2702442 2671381 3024935 3247986 3230648 2819421
16853B819421J23556R4479J83896L05309M2809j59903j5867R1403J47065j98490
16843C433678o6100K48118K68224j22149J85825N733M47816l58677K01514K04774
16833D448756J74265l38287O52472k87238r5403J25431k22101K38217N84325j92031
16823E088406M41154j05690j31441K12035K13907M5595K4517R511Q4700L69194
16813F251888K74837m82879Q23979j26021K20113l0595N60839l03116L54410K51940
16803G795395P3779J76484L56019j57152K46770M46330K56347l5349L07620L45106
16793I811349K85214K11117M3518J72499N45089M14496j14033O01503K49315R959
16783A2230026Q40573n6721N31205N07336K66331O33970N13163M06639M21360
$$ plain form
16853 2819421 2942977 3037456 3221352 3526661 3569470 3409567 3393700 3485103 3632168 3433678
16843 3433678 3367578 3615696 3883920 3761771 3947596 3953329 4401145 4042468 4243982 4448756
16833 4448756 4623021 4284734 4937206 4649968 4554565 4679996 4457895 4696112 5280437 5088406
16823 5088406 5529560 5423870 5292429 5504464 5718371 5763966 5788483 5797994 5882694 6251888
16813 6251888 6526725 6043846 6867825 6741804 6961917 6931322 7492161 7189045 7543455 7795395
16803 7795395 7869174 8045658 8401677 8244525 8491295 8937625 9193972 9158623 9466243 9811349
16793 9811349 10096563 10307680 10351198 10523697 11068786 11483282 11369249 11970752 12220067 12230026
16783 12230026 13070599 13013878 13545083 14052419 14318750 14952720 15465883 15872522 16293882
16774A6293882N30666O19034N18997P90405M46423P08181O33358R01984O52383
16765B2095313P60241J105281Q78430P87971J167018J272290P10853J614097J058437
16756C1449931J365503J555124J504501J625089J671993J806004J975425K008814
16748D4962384K167509K146824L132646K554745L227137L036185L150224L490483
16740F7868137M001635L700520M778621M745529M970148N307485N700339O186781
16732A07259195O170815O876920O996536P165821P615033P713027P810160P423002
16724A65030509P716389O957300O327145N686709M403166L878971K605832J375442
16716B03981463k57322j218324k545513m468038m740206o006693o955314p040221
$$ plain form
16774 16293882 16824548 17443582 17962579 18752984 19199407 19907588 20540946 21442930 22095313
16765 22095313 22855554 23960835 24839265 25627236 26794254 28066544 28777397 30391494 31449931
16756 31449931 32815434 34370558 35875059 37500148 39172141 40978145 42953570 44962384
16748 44962384 47129893 49276717 52409363 54964108 58191245 61227430 64377654 67868137
16740 67868137 71869772 75570292 80348913 85094442 90064590 95372075 101072414 107259195
16732 107259195 113430010 120306930 127303466 134469287 142084320 149797347 157607507 165030509
16724 165030509 172746898 179704198 186031343 191718052 196121218 200000189 202606021 203981463
16716 203981463 203724141 202505817 199960304 195492266 190752060 184745367 177790053 170749832
16708A70749832p998148p905703p647941q193128p735559p753738o959795o628882
16700A09926938o490173o237159n364636n821045m994313m333558n041233m224149
16692F7420672l695067l315782k846424k984645k961457l029645k308765k289511
16684D3989376j776837k471062j536029j991666j528978j889653j002848j573041
16676C0219262j411677j131175j202261j115977q52090j177407r86621m67558
16668B1874496j105683o25919p47723m63430q53587o49900m57874q75027n96159
16659A5499194M7463j113678j15598n15512m22583k87098n91534k7749m55172
16650A2017733k34764p22632l50596k13631j37154p26514p4566l8043m00501k92596
$$ plain form
16708 170749832 162751684 154845981 147198040 139004912 131269353 123515615 116555820 109926938
16700 109926938 103436765 97199606 91834970 86013925 81019612 76686054 71644821 67420672
16692 67420672 63725605 60409823 57563399 54578754 51617297 48587652 46278887 43989376
16684 43989376 42212539 39741477 38205448 36213782 34684804 32795151 31792303 30219262
16676 30219262 28807585 27676410 26474149 25358172 24506082 23328675 22342054 21874496
16668 21874496 20768813 20142894 19395171 18931741 18078154 17428254 16970380 16095353 15499194
16659 15499194 15546657 14432979 14317381 13801869 13379286 13092188 12500654 12472905 12017733
16650 12017733 11782969 11060337 10709741 10496110 10358956 9632442 9557876 9519833 9119332 8826736
16640H826736k13946k62743J12264o10607K03963l84327M4555o00749p0659k43573
16630F800914M7180j30610l3941n57581L70050m66601n21236K30849K37554k74224
16620E702354m07494p421l5330k06109J58599m10027O1543m08124K64021k25174
16610D486838J84828k57826k33724j7903o6937L6671j28760J1669l96259O3931
16600C682528K1194o0434k86822J93556l91284O32533m75067K2703J87099l88047
16590C137959o3119k19984R6454L97163m89512j72979J80963l89349N30408j08701
16580B899303l34499K87191k59474m9561K66882m38951M09925k21206j59963j58761
16570B240886k42555M95150o4138k10617N3290K9570j0071J70460m78065L65586
$$ plain form
16640 8826736 8612790 8350047 8462311 7851704 8055667 7671340 7715895 7115146 7044487 6800914
16630 6800914 6848094 6717484 6683543 6125962 6496012 6029411 5508175 5739024 5976578 5702354
16620 5702354 5294860 5287439 5252109 5046000 5204599 4794572 4856115 4447991 4712012 4486838
16610 4486838 4671666 4413840 4180116 4162213 4095276 4131947 4003187 4014856 3618597 3682528
16600 3682528 3703722 3643288 3356466 3550022 3158738 3791271 3316204 3338907 3526006 3137959
16590 3137959 3074840 2854856 2951310 3348473 2858961 2685982 2866945 2477596 3008004 2899303
16580 2899303 2564804 2851995 2592521 2542960 2809842 2370891 2780816 2559610 2399647 2240886
16570 2240886 1998331 2493481 2429343 2218726 2272016 2301586 2291515 2461975 1983910 2349496
16560B349496n27212K3749r3147M30783k32347J32444k70194L53550n06192K18223
16550A879153P9011j82143L74766j61055j82481k32362K22243m57359J90188J36213
16540A666174m24326N21119j82178n099J30185l20334J90506Q8506k44160M0171
16530A460564o2653M3626J6682l12510L03773l5755j42693q9185K36622l25779
16520A092692N1716l8268l8382J22795J43266k56940k814n6604J77226j71483
16510A023204j11858L25720k10848N1055k72937M44736j53957j75608J87919P0063
16500A177489l55549K87679j95205L24518n70569N86670m58012L27123l0292j51210
16490I42642j04562j3333j37286l9074K03533k5207N1735K47884l12666o7278
$$ plain form
16560 2349496 1822284 1846033 1752886 2183669 1951322 2083766 1813572 2167122 1660930 1879153
16550 1879153 1958164 1776021 2150787 1989732 1807251 1574889 1797132 1339773 1529961 1666174
16540 1666174 1241848 1762967 1580789 1575690 1705875 1385541 1576047 1664553 1420393 1460564
16530 1460564 1397911 1441537 1458219 1145709 1449482 1413727 1271034 1181849 1418471 1092692
16520 1092692 1144408 1106140 1067758 1190553 1333819 1076879 1074065 1017461 1194687 1023204
16510 1023204 911346 1237066 1026218 1077273 804336 1249072 1095115 919507 1107426 1177489
16500 1177489 821940 1109619 914414 1238932 668363 1255033 797021 1124144 1093852 942642
16490 942642 838080 824747 687461 648387 851920 826713 878448 1126332 813666 746388
16480G46388j33990K80464j46400Q8188Q2830l5701k8189j7818m5489l69380K47778
16469F68681J41095k57111J52260J66305K36157n07618J65445K1399j42056J28128
16459G72685j39867K53105l10979K21891J4271K2085J38667m09744m0127k41172
16449B80815L01688K22665R798J659n5696J43443q1728O5265k86206N61145m21066
16438G41782j91941j53098K10383J59834j07595j06088K0727r4240K73303l55765
16428C97302J90889l8534q4074l1070j22843L38021k39800M19382l93380J06303
16418E42196J08898n5063k60815K98546C07103J09701J03080k32089J09050J17633
16408E14478B07994L67541k16244r4110L91292k81027q8501L25917B61566J19705
$$ plain form
16480 746388 612398 892862 746462 834650 917480 881779 853590 835772 790283 420903 668681
16469 668681 809776 552665 704925 871230 1107387 599769 765214 786613 644557 772685
16459 772685 632818 885923 574944 796835 811106 833191 971858 562114 521987 280815
16449 280815 582503 805168 814966 816625 760929 904372 822644 887909 601703 1162848 741782
16438 741782 549841 396743 607126 766960 659365 553277 574004 479764 753067 397302
16428 397302 588191 549657 465583 434513 311670 649691 409891 829273 435893 542196
16418 542196 651094 596031 335216 633762 307103 416804 519884 287795 396845 514478
16408 514478 207994 575535 359291 265181 656473 375446 286945 612862 261566 381271
16398C81271K69584k68280J85831O9464j83576o974j96072K34681r0520k542O2862
16387D55729K19345k71422J45416N1941B12698L96017j97645n764a7330B81743
16376B46201L49710j85230R5569A13808K55672j37019M3061J67013O3400K53509
16366G59444B02939K63542B12417h607C30768R568p7764K69366k06341O6896j94736
16355A97757p0175L88909m7833H1190N45280j63979k07791J01455J60360k01224
16345C15291J07574j11180M99976i8472A64528k02O1997L9061J93213k05948P9201
16334C31850Q9335A87758M18827B76331A8979K20727l1087j7139J62703J31672
16324D85855j18725l9161J90263k26525j21389J94906A43261K34291A21891J27206
$$ plain form
16398 381271 650855 382575 568406 637870 454294 447320 251248 485929 395409 392867 455729
16387 455729 675074 403652 549068 601009 212698 608715 411070 405306 -17330 281743
16376 246201 595911 410681 506250 113808 369480 232461 275522 442535 505935 759444
16366 759444 202939 466481 212417 -8607 330768 340336 262572 531938 325597 392493 197757
16355 197757 127582 516491 468658 81190 626470 462491 254700 356155 516515 315291
16345 315291 422865 311685 811661 -98472 164528 164326 226323 265384 458597 252649 331850
16334 331850 421185 187758 606585 276331 18979 239706 208619 191480 354183 485855
16324 485855 367130 327969 518232 291707 170318 365224 143261 377552 121891 249097
16314B49097G1103N35401B70661J84925c08265d6805C73345j77414P5774L1228
16304C02933j16528R8226A22877Q9024O1427A14088n2022K77310j15971c1155
16293A07774b3536C0725J38555h9351a3379A90859K7166M4050F2327K04854d2796
16281G2045L56999j91172J52032a13079a0448C45785L2071F5150N3321L3610e2521
16269C06354N3282K61053A92289c0138A97684a1061B76682d35F37400B84436O268
16258B90704a92128A4260l921h212A97150F2369A3285R0183l9523l318K6836K5498
16246A12961B3660K20700I9329l1062J22924p4998a11706E9577L76186B5925O8434
16235I4359O38a41956C79669E7839K52254a03599H6391K8454J90751e136j22157
$$ plain form
16314 249097 71103 606504 270661 455586 -308265 -46805 373345 195931 271705 302933
16304 302933 186405 284631 122877 211901 273328 114088 62066 339376 223405 -31155
16293 107774 -23536 30725 169280 -89351 -13379 190859 218025 262075 62327 267181 -42796
16281 72045 429044 237872 389904 -113079 -10448 345785 377856 65150 118471 152081 -52521
16269 306354 359636 620689 192289 -30138 197684 -11061 276682 -435 637400 284436 290704
16258 290704 -192128 14260 10339 -8212 197150 62369 13285 103468 63945 60627 87463 112961
16246 112961 23660 244360 99329 68267 191191 116193 -111706 59577 435763 25925 94359
16235 94359 94997 -141956 379669 57839 310093 -103599 86391 114845 305596 -5136 -127293
16224a27293B07864d3474J9366B03233I6529K3001a2167B8483K36007D4711L90019
16213D34730r2798a79730A72849C7483Q1463P7150q2691K24781b5579I998R5405
16202A05403d412B71150I0826K01077E4554K40974F6182o583J8800J47049b18122
16190g242l35254E8464b57251c8925a1832A59528B6894R5114R1525C0644A3801
16178f4114C0711K12480H3102i0822A46052a77358A42882Q4657i7814A09819J95750
16167C05569B71L29654f6827n6887c0157j55361A6231N2662J38196l2838J6619
16156A90870o4699f3711k19406A29050c890k1495J0359D3405K40395C5861c26109
16144d8190j40959A68196A5274J07211e0991D5908J46270a8983l9813E1211d63556
$$ plain form
16224 -127293 207864 -43474 -24108 203233 96529 119530 -12167 28483 264490 44711 434730
16213 434730 341932 -179730 172849 37483 118946 196096 113405 338186 -25579 9998 105403
16202 105403 -4412 271150 90826 291903 54554 295528 66182 59599 78399 225448 -218122
16190 -7242 -342496 58464 -257251 -38925 -11832 159528 26894 122008 213533 30644 13801
16178 -64114 30711 243191 83102 -90822 146052 -177358 142882 227539 -97814 109819 305569
16167 305569 271 329925 -66827 -123714 -30157 -185518 16231 68893 207089 174251 190870
16156 190870 126171 -63711 -283117 129050 -3890 -25385 -15026 43405 283800 35861 -326109
16144 -48190 -189149 168196 15274 122485 -50991 45908 192178 -18983 -58796 51211 -463556
16132A82003B6490e2955J5535B58588h2381b1643B99552A43346M9797K13620H1328
16120F1606k5784K19276E6224a54567B97426g5129A93240a17423m3712C6474K14321
16109B50795l3973J82071e210C99136c14937g3129C28342A35159e609A8856K02767
16098B21623N7933a06917I8375G073L6342K59680A24654g3466k18961A67386d5024
16086f9761a886j67198B2726c24259B39138a68056P4822A53102o3451Q8157b08544
16074i0015j81752I1779j8894J78683d1848m4393B305K1316K71756F6145a64168
16062E8783b10050A90515l5881b2251h681A97161B1931K05823a26142o7962g4371
16050b17183B35417b2720E7241J2672b45643J21888e7234j21292j72254A02366
$$ plain form
16132 182003 26490 -52955 -37420 258588 -82381 -21643 299552 143346 193143 406763 81328
16120 61606 35822 255098 56224 -154567 297426 -75129 193240 -117423 -161135 36474 250795
16109 250795 216822 398893 -5210 399136 -314937 -73129 328342 135159 -5609 18856 221623
16098 221623 279556 -106917 98375 7073 43415 303095 124654 -73466 -292427 167386 -45024
16086 -69761 -1886 -169084 22726 -324259 239138 -168056 -93234 153102 89651 177808 -208544
16074 -90015 -271767 91779 72885 251568 -41848 -86241 2305 23621 295377 66145 -164168
16062 58783 -210050 190515 154634 -22251 -8681 197161 21931 227754 -126142 -194104 -74371
16050 -217183 235417 -22720 57241 69913 -245643 -123755 -57234 -178526 -350780 102366
16039a09042M0761J8080D08305P4035a50081m1233N8323B3283J32599E4775b17869
16027a09541k46315C31882e9870C23189j38932a55821O2898B52151b7616A16964
16016F4358c0901A66253a95118q9723J01518k4542A03296K07153A37074a02352
16005B7627B82P6729a31854L7012m3244C6868K20878j0951c5792B46549h9855
15993b07866A67394e743j56297q1256J5089j7151A59049A0884a83547C53096A11252
15981D6962K26141Q4950b6604B48740A7238K35380a46313E8160g4708b2770m3862
15970f6632j72115a5555j55562d7784A62423F3937a1456r1289h249k2892j00850
15959a31991N4992A03490p955J73212A07290h8641A0767J74878q8666a71047A18600
$$ plain form
16039 -109042 -68281 -50201 408305 482340 -150081 -191314 -132991 23283 155882 54775 -217869
16027 -109541 -355856 331882 -59870 323189 184257 -155821 -92923 252151 -27616 116964
16016 64358 -30901 166253 -195118 -284841 -183323 -207865 103296 310449 137074 -102352
16005 27627 282 77011 -131854 -94842 -138086 36868 257746 246795 -35792 246549 -89855
15993 -207866 167394 -5743 -162040 -243296 -228207 -245358 159049 10884 -183547 353096 111252
15981 46962 273103 358053 -26604 248740 17238 252618 -146313 58160 -74708 -22770 -66632
15970 -66632 -238747 -15555 -171117 -47784 162423 63937 -11456 -102745 -8249 -31141 -131991
15959 -131991 -76999 103490 95535 268747 107290 -88641 10767 185645 96979 -171047 118600
15947d00701F5996d8509j00026L9884B7877b76356a07846J6336j11650C98813
15936A48798J33397a08162j8760j12500A38190D423d24802a17601B3914d4496
15925A40160C6694a71293k1597A23039a27099c4533q2035A05132B9726a11851
15914c3520J2668o4259J0401j45886f7203b1097k58475K3017R0238C229d1493
15902i6224L4978C69996b01360p1221B52829A24789a65184C0019L1698b95560
15891f6986j40297E3463a16262j6111B74422I5788i2353E5280f0503a7187n6611
15880g3798K9504o4688j17156i5897r0309j26837B7709i6461J1603j6025A93666
15868E4405c8485j36612A5268i7329j0904B49481a12473J7308B4116b77522c6528
$$ plain form
15947 -400701 65996 -48509 -148535 -108651 27877 -276356 -107846 -91510 -203160 398813
15936 148798 282195 -108162 -126922 -239422 138190 4423 -424802 -117601 23914 -44496
15925 140160 36694 -171293 -192890 123039 -127099 -34533 -116568 105132 29726 -111851
15914 -33520 -20852 -85111 -74710 -220596 -67203 -21097 -279572 -256555 -166317 3229 -41493
15902 -96224 -61246 369996 -201360 -272581 252829 124789 -165184 30019 61717 -295560
15891 -66986 -207283 53463 -116262 -132373 274422 95788 -92353 55280 -60503 -17187 -73798
15880 -73798 -44294 -108982 -226138 -95897 -186206 -313043 27709 -96461 -84858 -100883 193666
15868 54405 -38485 -175097 15268 -97329 -108233 249481 -112473 -95165 24116 -277522 -36528
15856D34467k07837b14031c8296i609A92752A9768K2442h9507A87635k956a08595
15844c70354e4768E0341c21448a01512A87660b47271d5579C73273b47820H0244
15833b3230D56950a27981b1630m216A17603L2792c2222j16700k37204h2278E1576
15821B22030a73657j14227C59247b64744A00373h2480j44256C04565F1798b61475
15810B35451a09550j95706D3617g0197B60812a27655j71915J12589E5420a2911
15799A53802a66139F5610a58435A37764j9475a61128m0413j42745d7370q4193
15789a31563e5380A73073b07129R3434B28647F6478a2967B3577a80235K0583N1426
15778a08226j22812f5546k51982Q7340o9374J00843j78056A19332c0532j02450
$$ plain form
15856 434467 226630 -214031 -38296 -9609 192752 19768 42210 -89507 187635 184679 -108595
15844 -370354 -54768 50341 -321448 -101512 187660 -247271 -45579 373273 -247820 80244
15833 -23230 456950 -127981 -21630 -25846 117603 150395 -32222 -148922 -386126 -82278 51576
15821 222030 -173657 -287884 359247 -264744 100373 -82480 -226736 304565 61798 -261475
15810 235451 -109550 -305256 43617 -70197 260812 -127655 -299570 -186981 55420 -12911
15799 153802 -166139 65610 -158435 137764 118289 -161128 -201541 -344286 -47370 -131563
15789 -131563 -55380 173073 -207129 -113695 228647 66478 -12967 23577 -180235 -159652 -108226
15778 -108226 -231038 -65546 -317528 -230188 -299562 -198719 -376775 119332 -30532 -132982
15768a32982G0682A508J11123a14251A1857b33656h3061B25435a31190B09681
15757B56629a63941A85113J3523o5675A8761J51489J0881F2742K1513g903C6692
15745H0536a52450F4610O1607e8408I7481g1138q6007I3913i7815F1631j3595
15734D8036h4019A8338a25210I5068Q0393c6418j2743G5227J98758r4306c11869
15722b71428i1249c5994j6390k75655a33232k56300b5917j60859A18638b57347
15711h1102r1584b4538j70090a4894B06094a36198j9598e9167k4977K7317n0356
15700a07183k7243A10945b308l04496A30654a65202d6798E9249e3460C81348c6403
15688D1973e4553B44477A03670b34281O5755o853C20422c0839k76450o0734G1260
$$ plain form
15768 -132982 70682 1508 112631 -114251 11857 -233656 -83061 225435 -131190 209681
15757 256629 -163941 185113 198636 132961 18761 170250 181131 62742 84255 -7903 36692
15745 80536 -152450 64610 126217 -58408 97481 -71138 -157145 93913 -97815 61631 48036
15734 48036 -84019 18338 -125210 95068 175461 -36418 -49161 75227 273985 179679 -311869
15722 -271428 -91249 -35994 -52384 -328039 -133232 -389532 -25917 -186776 118638 -257347
15711 -81102 -172686 -24538 -194628 -14894 206094 -136198 -155796 -59167 -84144 -56827 -107183
15700 -107183 -134426 110945 -2308 -306804 130654 -165202 -46798 59249 -53460 381348 -36403
15688 41973 -54553 244477 103670 -234281 -168526 -175379 320422 -30839 -307289 -368023 71260
15676d3631B34465a85408P6616A02200J2542O907J24522q4062C8758f3696A05932
15664b8921r1146A68858C5684f3320H7791j1622Q5668K72788H823d26127A61777
15652a214B1456a92131l4141M0648m2706B52482c8660A29735J66214h677k08816
15641b17493n21807b5269l90693j76745a81136L4164A53359E6442K099K70704
15631C29245c9413j54337A4052b18823r2940h1375H0176a65646e2142l65268A61184
15619c43360C46727j62699e4070D07492a26967a9214j73511j56746O1577E1853
15608B58512f937A15550b20527M426P9790j12161C53912a40565A68849c10423
15597a23652L9734j83600A20914b16991J7604j795A28091m3375J53573b33892
$$ plain form
15676 -43631 234465 -185408 -108792 102200 114742 121649 246171 162109 38758 -63696 105932
15664 -28921 -120067 168858 35684 -63320 87791 76169 161837 434625 8823 -426127 161777
15652 -1214 21456 -192131 -226272 -185624 -228330 252482 -38660 129735 295949 -8677 -217493
15641 -217493 -739300 -25269 -415962 -592707 -181136 -146972 153359 56442 58541 329245
15631 329245 -39413 -193750 14052 -218823 -311763 -81375 80176 -165646 -52142 -417410 161184
15619 -343360 346727 184028 -54070 407492 -126967 -19214 -192725 -349471 -287894 51853
15608 258512 -6937 115550 -220527 -216101 -136311 -248472 353912 -140565 168849 -310423
15597 -123652 -83918 -267518 120914 -216991 -199387 -201182 128091 84716 238289 -233892
15586G9114b543B36027a26018B9678c17237I7713f2173a6696j64147A71548P9935
15575B51483C0130J48765n3559K02332e3825j43251n4724F4080f8758n8294B74972
15563I3225O1594b41100B53466I9928a33369c3612p0505l9275a7965j91969B3779
15551F9755h7053k15625f9466m259D381a2657K603B8674C350a55242a4003p2321
15539h6324c1604m39319A11300d105B78191a44630l2094p3552B9519J60287i643
15527A60912Q9909e2661n4625B07431I5262e23514H9636J2154p653R6800i1614
15515G3748L2417C9315e8597A73087a04839b2368B1195e6683k20033f4138j638
15504f5776m1714A41375a47475f9215B09242c11222A89274e9097o3504j81856
$$ plain form
15586 79114 -2543 236027 -126018 29678 -317237 97713 -62173 -16696 -180843 171548 251483
15575 251483 30130 178895 125336 327668 -53825 -197076 -251800 64080 -68758 -127052 274972
15563 93225 154819 -241100 253466 99928 -133369 -33612 -104117 -143392 -17965 -209934 23779
15551 69755 -87053 -302678 -69466 -73725 4381 -12657 -10054 28674 3350 -155242 -14003 -86324
15539 -86324 -31604 -470923 111300 -4105 278191 -144630 -176724 -250276 29519 189806 -9643
15527 160912 250821 -52661 -107286 207431 95262 -523514 89636 101790 94137 190937 -91614
15515 73748 106165 39315 -58597 173087 -104839 -22368 21195 -56683 -276716 -64138 -65776
15504 -65776 -107490 141375 -147475 -69215 209242 -311222 189274 -59097 -122601 -304457
15494c04457i2067q8696A9190a4632C89254c70692d6231k29213a6685H7676k975
15483H4701J82599c961j11227k8056C43981r5217I3700L9212j4443b94380A70236
15471A78658i5865d4148k54403J41793a5297q8338A4051K30069j09141H011K98096
15460C06107I5046J05600q2643a73560j16872I0867K0455P8314D6671A3974b90576
15448c2396k29937f7259D9478e6230m4377n1882B8572a34439d3469j12768c8052
15436b95665a34337b1589p1632k43479A31698J09687n2673O3145J62742e9345
15425d7413B00420r8034K99720H6200j6034a98458g4439i455I2559A381f2403
15413b01006B27048d4148C6054d093j23368j80861C34092b92573A91951g4430
$$ plain form
15494 -304457 -92067 -180763 19190 -14632 389254 -370692 -46231 -275444 -16685 87676 84701
15483 84701 267300 -3961 -115188 -143244 343981 248764 93700 132912 118469 -294380 170236
15471 178658 -95865 -44148 -298551 -156758 -15297 -103635 14051 244120 134979 8011 306107
15460 306107 95046 200646 118003 -173560 -290432 90867 111322 189636 46671 13974 -290576
15448 -32396 -262333 -67259 49478 -56230 -100607 -152489 28572 -134439 -43469 -156237 -38052
15436 -295665 -134337 -21589 -93221 -336700 131698 241385 188712 251857 414599 -59345
15425 -47413 200420 102386 402106 86200 70166 -198458 -74439 -9455 92559 1381 -62403
15413 -201006 227048 -44148 36054 -4093 -127461 -308322 334092 -292573 191951 -74430
15402a40211F4094r484F062a4405p9035b2170j6699p7953L6298j22625D1271J55331
15390A96602n3632i0996j0494l2855j35174A37422m5843J55539J9079G9006e04539
15378D9232o690a50279j13048R7371C70886c35858a2283G247b73471a06911A1078
15366E0249R7353C3493R9273m1412a83688A09870B679J43860k6748J12881a3071
15354a94518B98724A01101A1669c1004l2635B08383b92765h6511I7108O5985B4345
15342c453m0145j58413E1776O9298g8125J9259q0603D52955I0866g8446k04083
15331b82529d1627A67658e560H4261O382b07460G8539J3299J17286a62430A62937
15319e8463A23471F1203b15670P5235H9258j3059a8756k6343A891L72862g6360
$$ plain form
15402 -140211 64094 54610 6062 -14405 -93440 -22170 -38869 -116822 -80524 -203149 41271 196602
15390 196602 142970 -90996 -101490 -134345 -269519 137422 91579 247118 266197 79006 -504539
15378 49232 42542 -150279 -263327 -165956 370886 -335858 -12283 7247 -273471 -106911 11078
15366 50249 147602 33493 132766 91354 -183688 109870 2679 146539 119791 232672 -13071
15354 -194518 298724 101101 11669 -31004 -63639 208383 -292765 -86511 97108 163093 24345
15342 -3453 -43598 -202011 51776 121074 -78125 -58866 -139469 452955 90866 -78446 -282529
15331 -282529 -41627 167658 -5560 84261 90643 -207460 78539 91838 209124 -162430 162937
15319 -58463 123471 61203 -215670 -140435 89258 76199 -18756 -45099 1891 374753 -76360
15307B9492Q5995C6479j6784a9458l0141G7207J98348c12241g9211K8634K2124
15296b8453j71702d405G1960b3820l9286A13780P53C6159a85564B2711M5801k890
15284F5622g2706q3501H5768L62805j12769j13239a17529q8917B05272D1K67781
15273B67822b33510A01202b18939L3743B36356n6088A6640O3106a27210A73031
15262F2625K8457b65799F4816J18102d9126E58346B56640H8416A0760M1309L2650
15251H4719L04414M0191L57584O91880L8212m38083K44204o10568A83265g7509
15240d2840j56475A59409i6669g136C92079D7725d02559J83673F8045J48548a73640
15228D89942B2617e8421b3835j20819p2653A36457L12313A81791N6639a81460
$$ plain form
15307 29492 115487 36479 19695 -19458 -49599 77207 275555 -312241 -79211 -50577 -28453
15296 -28453 -200155 -4405 71960 -23820 -63106 113780 114533 36159 -185564 22711 68512 65622
15284 65622 -72706 -156207 85768 448573 335804 222565 -117529 -206446 205272 41 267822
15273 267822 -233510 101202 -218939 -185196 236356 180268 16640 79746 -127210 173031
15262 62625 91082 -265799 64816 182918 -49126 558346 256640 88416 10760 52069 84719
15251 84719 389133 429324 786908 1478788 1517000 1078917 1323121 712553 183265 -77509
15240 -42840 -199315 159409 -96669 -7136 392079 47725 -402559 -218886 68045 216593 -173640
15228 489942 22617 -58421 -23835 -144654 -217307 136457 448770 181791 238430 -181460
15217C40131c8941A55860F0462K90412k9224j06008E5856B3466g835A25191i2046
15205h6097A44204k5858m9601J09835a90710O0184d8974B48964G0443k7168a96729
15193g6903B33633l3852g0164B07010A5336J65773q7998b29196I1436j5507e2760
15181f5341A6140a02427A20927D0965a91839B02763b3383A6254B23L7839j8197
15170A9865a1611m6525p7905a0088B36814a2575A31847B5759a1532A22786k300
15159A20486Q6166F4938K81682m9135F0163K11746m1401N3988L1131q8469g4987
15147b63538g8676A55411a09072A37619i1111j68857H500L64199F999J27469L0610
15136A65078a73875c5415E1069K09372b2742A68614j3886O6176M32038a70347
$$ plain form
15217 340131 -38941 155860 60462 350874 321650 215642 55856 23466 -7835 125191 -92046
15205 -86097 144204 118346 68745 178580 -190710 -130526 -48974 248964 70443 43275 -196729
15193 -76903 233633 199781 -70164 207010 15336 181109 93111 -229196 91436 75929 -52760
15181 -65341 16140 -102427 120927 40965 -191839 202763 -23383 16254 223 38062 19865
15170 19865 -11611 -58136 -136041 -10088 236814 -12575 131847 25759 -11532 122786 120486
15159 120486 206652 64938 346620 297485 60163 271909 230508 284496 315627 227158 -74987
15147 -263538 -78676 155411 -109072 137619 -91111 -259968 8500 372699 6999 134468 165078
15136 165078 -173875 -35415 51069 260441 -22742 168614 154728 220904 652942 -170347
15125a42186A45334k0438J60948j7316J12470F8485k496J03890f9418j92390G4063
15113A34955C0981J35798J09700d6094n9758C1579J40550N14693a59235B70144
15102h5228I855J59968b4008A77074J11248j15786a62964B63615A2269L1140K93054
15091C36463a60449B23483J63644A21959J86220d44138B06003J367n5718F1445
15080B51960P6072f2332K3773A71762J40856L1486C6001M2248J01222K3161o1425
15069A41207K12474R1880e9695a8271A69126F0568K88303a831D84549E1441J13958
15058A65399J90391b7499B70322J85706b30726A97916o114a2077D31154n878J08187
15047E33463k29238a91096A58688n6053k6441a66139A89187R8590h7798A4826
$$ plain form
15125 -142186 145334 124896 285844 268528 380998 68485 65989 169879 -69418 -261808 74063
15113 134955 30981 166779 276479 -46094 -105852 31579 172129 686822 -159235 270144
15102 -85228 9855 169823 -24008 177074 288322 172536 -162964 263615 12269 43409 336463
15091 336463 -160449 223483 387127 121959 308179 -444138 206003 207370 151652 61445
15080 251960 328032 -62332 -38559 171762 312618 344104 36001 78249 179471 202632 141207
15069 141207 353681 445561 -59695 -18271 169126 60568 348871 -1831 484549 51441 165399
15058 165399 355790 -27499 270322 456028 -230726 197916 191802 -12077 431154 425276 533463
15047 533463 304225 -191096 158688 102635 76194 -166139 189187 287777 -87798 14826
15036A0335L52679A21195R5635J78865J04276m9725j70869B9271J28339l133K67196
15025D21673I3031J95865A01250B1879J64940J97481J24449a25846c3340D34385
15014C05379K9278J51032A92603C0028K10132A9574J26407L4604l6046M38746
15004E83285r0920G5532K10601o0248R6935A27052J72412a01121F09995D5771
14993D88830B27108A5926L11644G6363J78512p2359f6632I1803J31948R4600j15716
14982B02635F0096K80441n1643j10900J28237K24199j30224A98201K8117j07152
14972A19166J84207j29997J09085L33809l04911j05400Q0430l5072h9649A98559
14961E72732B48036K66117K6074j61063A0019e576B21904J87509j0471d8369A44628
$$ plain form
15036 10335 363014 121195 216830 395695 499971 450246 279377 29271 157610 154477 421673
15025 421673 93031 288896 101250 21879 186819 384300 508749 -125846 -33340 434385
15014 305379 334657 485689 192603 30028 240160 19574 145981 180585 144539 583285
15004 583285 492365 75532 286133 225885 322820 127052 299464 -101121 609995 45771
14993 488830 227108 15926 327570 76363 254875 182516 -66632 91803 223751 318351 202635
14982 202635 60096 340537 288894 177994 306231 530430 400206 198201 226318 119166
14972 119166 303373 173376 282461 616270 311359 205959 286389 251317 -89649 198559
14961 572732 248036 514153 540227 379164 10019 -5576 221904 409413 398942 -48369 144628
14949d6307k06072A39338O8406m7791m3174K00483P6469j00765J37040A90395
14938c319A42686J72194K03175k14081H7280J26034F5928A9870J73760J8694K87098
14927D99422j32880j6294m7355j17958L7109j4973K2284J01880f022C35195N6339
14916C91534K32108j67513K097j02254J78609B18981L43081E6253J52591I2275
14905C30386j49139L08M10385B03260N0330J26937O5610M2098j55441D2504P1337
14894A13841K20678K39936K204B34324K57374j41027J60251q8228j32426N2065
14884C42333A54313L68593j48268j10124J37750j07616l7977J55692A41369J40633
14874B82002P2212q0070j30121N23770j42489J66200B62883K66043B61858D7518
$$ plain form
14949 -46307 -252379 139338 207744 159953 116779 317262 393731 292966 430006 190395
14938 -3319 142686 314880 518055 303974 87280 213314 65928 19870 193630 212324 499422
14927 499422 366542 350248 302893 184935 222044 207071 229355 331235 -6022 335195 391534
14916 391534 623642 456129 458226 355972 534581 218981 562062 56253 208844 92275
14905 330386 181247 181555 591940 203260 253590 380527 446137 488235 332794 42504 113841
14894 113841 334519 574455 576659 234324 491698 350671 510922 422694 290268 342333
14884 342333 154313 522906 374638 264514 402264 294648 256671 412363 141369 282002
14874 282002 354214 274144 144023 667793 525304 691504 262883 528926 261858 47518
14863D48717J32381k8970I5668L52572j95873M66304C52186k2840n8648O3833
14853C34531J25232J32242j80524j7632J66952j59331j62939K3952R3418R6345
14843D52246O3052R3905k97293Q7692j13746J21999J11583j13877Q4154n536Q3346
14832E67525j52563J20254K98358l61937j30088J78115l7281J38102k39001M5244
14822D26728K00581J41257l58695r8446K44949B70064K13349L14112l75738Q4814
14812E06601p1742J64822L13851D55127l9802M06470C53317J66589q0963J18190
14802E57133N2335l8340J8663B52018P3184J31168M2929M72563m72748O3516R2300
14791F54930l21258J41140O6795J1845k8779J48914K8303o9362M4777M6588j19766
$$ plain form
14863 448717 581098 552128 95668 448240 252367 718671 352186 329346 270698 334531
14853 334531 459763 592005 411481 393849 560801 401470 238531 262483 355901 452246
14843 452246 515298 609203 311910 399602 285856 407855 519438 405561 489715 484179 567525
14832 567525 414962 535216 833574 471637 341549 519664 482383 620485 381484 426728
14822 426728 627309 768566 409871 311425 556374 270064 483413 797525 421787 506601
14812 506601 434859 599681 913532 455127 415325 821795 353317 519906 438943 557133
14802 557133 609468 571128 589791 252018 325202 456370 499299 971862 499114 562630 654930
14791 654930 333672 474812 541607 553452 524673 673587 701890 632528 677305 723893 604127
14780F04127J1748j8487K43431k86894K9270j10398J21697O7169n2543J16343
14770G25463Q9640l89429r0126K52555j14775j87598L76524J35953q9278L71325
14760A080254E32888j02155M8585M7055o8797J17545O5988R8198n9430M9716j81251
14749E48342L82183m14055L88440j52647M0879K74270l86526L1492J80311J6740
14739I09429k1763j58059j08908J57874O9275J0666k79135P8889J00426O5376
14729H24070j10844J97371j11327J04335k5755j58643N1148M56199k17262k13749
14719G95543j67041k0372K57762j29062r540J34796r8859N23211n05998n8102
14709G22338M98969n04045K20144J7489j89017J18460k87150M49828j54276j38665
$$ plain form
14780 604127 615875 597388 840819 553925 583195 472797 594494 661663 609120 725463
14770 725463 815103 425674 335548 588103 473328 285730 662254 798207 708929 1080254
14760 1080254 532888 430733 479318 526373 457576 575121 641109 739307 679877 729593 548342
14749 548342 930525 516470 904910 752263 793142 1067412 680886 712378 892689 909429
14739 909429 887666 729607 620699 778573 847848 858514 579379 658268 758694 824070
14729 824070 713226 910597 799270 903605 877850 719207 770355 1226554 1009292 795543
14719 795543 628502 608130 865892 736830 727290 862086 763227 1286438 780440 722338
14709 722338 1221307 717262 937406 954895 765878 884338 597188 1047016 892740 754075
14699G54075M5183K77847m03762J88771q0018j00497j41088L82284K00966j44331
14689I79430j59983k37394K4745J44142K22994J813J20605r6436Q9035j25971
14679I62980K66473k62344K59150j70357J521N1350n20539M30818L3766R4910
14669A147728j89756L69838n7055p5376k53653M8769M2126j32515K71966l31767
14659H40305M01617L8296L0217j79959K11623J8675l49326J11699J30301M7230
14649A300678q5889Q3441j45635J15596N7485J76548M6746k96880K57581p5109
14639A434562j43926K01521k97492J76555l02163N26058O9811l47161R4283O6915
14629A478963K50677N6427j51866j15511o4433q1306J78173O0314M4081j3766
$$ plain form
14699 754075 799258 1077105 673343 862114 782096 681599 540511 922795 1123761 979430
14689 979430 819447 582053 606798 750940 973934 975747 1096352 999916 1088951 962980
14679 962980 1229453 967109 1226259 1055902 1057423 1108773 588234 1019052 1052818 1147728
14669 1147728 957972 1327810 1270755 1195379 941726 990495 1032621 900106 1172072 840305
14659 840305 1241922 1280218 1310435 1130476 1342099 1360774 1011448 1123147 1253448 1300678
14649 1300678 1214789 1298230 1152595 1268191 1325676 1502224 1548970 1252090 1509671 1434562
14639 1434562 1290636 1492157 1194665 1371220 1069057 1595115 1664926 1317765 1412048 1478963
14629 1478963 1729640 1786067 1634201 1518690 1454257 1372951 1551124 1611438 1655519 1641753
14619A641753k41946J43177J64810o30877L88153J18932R2910j87721O4197j5639
14609A537749l7682J65555J25353n12666N89022j47543N8051J88939M0055l26260
14599A680573r9049M26251J23197N9174k62692O3951m4923j61935J38624j33264
14589A789907O9031M44903j63206j04375k94309J58714K38510r5957J30539Q7633
14579B261390R6688l04981R5232K29438M0517R0081r1432K6940l49865L48554
14569B442562K87838j19400j69591k69871M67973L12337O4605l20858K27501K19167
14559C142263P910K99669P7783n6926J73111K55116P12073J28210R20166J124300
14549F783675K233853M768969R240012J2047034R668676j8289214A0116780D551455
$$ plain form
14619 1641753 1399807 1542984 1707794 1076917 1465070 1584002 1676912 1489191 1553388 1537749
14609 1537749 1500067 1665622 1790975 1278309 1867331 1719788 1777839 1966778 2006833 1680573
14599 1680573 1581524 2007775 2130972 2190146 1927454 1991405 1946482 1784547 1923171 1789907
14589 1789907 1858938 2303841 2140635 2036260 1741951 1900665 2139175 2043218 2173757 2261390
14579 2261390 2358078 2053097 2148329 2377767 2418284 2508365 2416933 2443873 2094008 2442562
14569 2442562 2730400 2611000 2441409 2171538 2639511 2951848 3016453 2695595 2923096 3142263
14559 3142263 3150173 3449842 3527625 3470699 3643810 3898926 4610999 4739209 5659375 6783675
14549 6783675 9017528 13786497 23026509 35073543 44742219 26453005 10116780 4551455
14540C154014p17543J35706j19598j93389j07714j13386J11706M54333m36472
14531B167657L82671j25006j09408K59236j15146l81101M43922K02015J69534
14522B894374m02144J92782j48362K24018Q4605J21056Q6577l44941J51964j44758
14512B715171M19653j12378k58647N81976j89976L54925o17433J56010j81575
14503B867726M68293P6601k93945L05138N5467O7461J25687l76738L53362n6652
14493C592400j7621J10170j78982M61321m23354L86143k30162N94381l23775Q3646
14483D054167j09738J70718l2453J58146m4462j61131N26919l09908J72058p9347
14473D344969P1755J47410j2049k9613O6877K89294p8780J03998J74424k41365
$$ plain form
14540 3154014 2436471 2572177 2452579 2259190 2151476 2038090 2149796 2604129 2167657
14531 2167657 2550328 2425322 2315914 2575150 2460004 2078903 2522825 2724840 2894374
14522 2894374 2492230 2685012 2536650 2760668 2845273 2966329 3052906 2707965 2859929 2715171
14512 2715171 3134824 3022446 2763799 3345775 3155799 3510724 2893291 3049301 2867726
14503 2867726 3336019 3412620 3118675 3423813 3479280 3546741 3672428 3295690 3649052 3592400
14493 3592400 3574779 3684949 3505967 3967288 3543934 3930077 3699915 4294296 3970521 4054167
14483 4054167 3944429 4115147 4082694 4240840 4196378 4035247 4562166 4252258 4424316 4344969
14473 4344969 4416724 4564134 4552085 4522472 4589349 4878643 4799863 4903861 5078285 4836920
14463D836920K51031p2432P3522L10810j37441J53118j76091K93026j92581L9711
14453E379593K15816M95655o31246K99316L59514k28896J97422J24150j46810
14444F064514L59541p9493J60867N8457j50234j3083J32844K94432P9488N9242
14434F966575J5974M40384k17487M06829J50293j66051K09335J58425o5843J72323
14424H070757J6847J58313K72515j08244J02800q4635O99499l24893J81747K22743
14414I207449J97503L35429q7632k18182L89849K48128J94232o9311L02714k01311
14404A0298868M94115N79318j7617K88358J65414l1575J40253K99979K12893J2559
14394A2442565J13978K03216N05593L63334K64628q3062L94527J29685P18578
$$ plain form
14463 4836920 5087951 5015519 5089041 5399851 5262410 5415528 5239437 5532463 5339882 5379593
14453 5379593 5595409 6091064 5459818 5759134 6118648 5889752 6087174 6211324 6064514
14444 6064514 6424055 6344562 6505429 6563886 6413652 6400569 6533413 6827845 6907333 6966575
14434 6966575 6982549 7422933 7205446 7612275 7762568 7596517 7805852 7964277 7898434 8070757
14424 8070757 8087604 8245917 8518432 8410188 8512988 8428353 9127852 8802959 8984706 9207449
14414 9207449 9404952 9740381 9652749 9434567 9824416 10072544 10266776 10197465 10500179 10298868
14404 10298868 10792983 11372301 11354684 11643042 11808456 11776881 11917134 12217113 12430006 12442565
14394 12442565 12556543 12759759 13265352 13628686 13893314 13810252 14204779 14334464 15053042
14385A5053042J37191k40210P29986K85106l5942K48122O60972L07051M31814
14376A7577132J05098L93921K25086K98433O00480L17041M81736N34488J0038
14367B0543453M34579P36449K68710N92435R9047J026896j79481O77052N00994
14358B4700134N51704P34373P61915L94334O66380Q12732Q03981L83775P42550
14349C0551878R29500N93901J009863P75073Q47060Q45425Q85383Q27508J130000
14340C8395591O97224J211673R62454J416982J519215J182858J142216K052995
14332D8581208Q71160J409152J564052J749644J895944J629496J727054J818181
14324F1245891K286479J850986K333197K486782K249659K594273K943653L176280
$$ plain form
14385 15053042 15190233 14950023 15680009 15965115 15929173 16177295 16838267 17145318 17577132
14376 17577132 17682230 18076151 18301237 18599670 19200150 19517191 19998927 20533415 20543453
14367 20543453 20978032 21714481 21983191 22575626 22674673 23701569 23522088 24199140 24700134
14358 24700134 25251838 25986211 26748126 27142460 27808840 28621572 29425553 29809328 30551878
14349 30551878 31481378 32075279 33085142 33860215 34707275 35552700 36438083 37265591 38395591
14340 38395591 39092815 40304488 41266942 42683924 44203139 45385997 46528213 48581208
14332 48581208 49452368 50861520 52425572 54175216 56071160 57700656 59427710 61245891
14324 61245891 63532370 65383356 67716553 70203335 72452994 75047267 77990920 81167200
14316H1167200K997169L302876K909285L784773L652065L643040M356355M657991
14308A10470754M353399M791883N117834N174601N707173N843175O475108O600863
14300A54534790P044296P431164P773904Q561886Q836342Q882474J0071181R962888
14292B23098925J0938754J1670666J1486014J2664564J2867423J3218494J3853360
14285C09798200J3896711J4312410J4565803J4796641J4725270J4336918J4076323
14278D10508276J3384367J2730488J1320436R827298P833467M021222N95993j626048
14270D68595499p47346J627365K08430m163361o742452r560202j0789513j2688093
14262D25740327j3910599j4409992j5443220j5592198j5771968j5291310j5211206
$$ plain form
14316 81167200 84164369 87467245 90376530 94161303 97813368 101456408 105812763 110470754
14308 110470754 114824153 119616036 124733870 129908471 135615644 141458819 147933927 154534790
14300 154534790 161579086 169010250 176784154 185346040 194182382 203064856 213136037 223098925
14292 223098925 234037679 245708345 257194359 269858923 282726346 295944840 309798200
14285 309798200 323694911 338007321 352573124 367369765 382095035 396431953 410508276
14278 410508276 423892643 436623131 447943567 457770865 465604332 469625554 470221547 468595499
14270 468595499 467848153 469475518 469683948 465520587 458778135 449217933 438428420 425740327
14262 425740327 411829728 397419736 381976516 366384318 350612350 335321040 320109834
14255C20109834j4612118j4122805j3889857j3118879j2860696j2198734j1801397
14248B27505348j0786166j0519526r538399r336753q615186p836410p929509p482297
14240A55461102p338970o341847o306886n304173n747262n440453m607406n026969
14232A09347136m097220l569508m045917l939157l840892k942882l936974k563928
14224H0410658k840108k912537k617176k532954k105507k043652k385212j879254
14216F1094258k197374k060911j274791j498017j541461k091740j396634j381183
14208D7652147j588280m85558r20020j950362r15556j445608r91743p70923j014720
14199C7569377j052087j407239q07353n15812j110221p86425n98839q61270p27778
$$ plain form
14255 320109834 305497716 291374911 277485054 264366175 251505479 239306745 227505348
14248 227505348 216719182 206199656 196661257 187324504 178709318 170872908 162943399 155461102
14240 155461102 148122132 141780285 135473399 130169226 124421964 118981511 114374105 109347136
14232 109347136 105249916 101680408 97634491 93695334 89854442 86911560 82974586 80410658
14224 80410658 77570550 74658013 72040837 69507883 67402376 65358724 62973512 61094258
14216 61094258 58896884 56835973 55561182 54063165 52521704 50429964 49033330 47652147
14208 47652147 46063867 45578309 44658289 42707927 41792371 40346763 39355020 38584097 37569377
14199 37569377 36517290 35110051 34302698 33786886 32676665 31890240 31291401 30430131 29702353
14190B9702353p56114o03983o18490n74308m83290p82563q26541j29762r31164
14181B3996138n15700l96545j051657L46762n79816o66106j63767n57251j81013
14172B0231045l89671q44765K18147p61558k52133n86026j23052l80696n26202
14163A6585089k02242l47313m8172l55513k12047j41485m18476m77407j37398
14154A4245036o2183m32899N9057m65888n1841j66636j84161j86870K46664n40328
14144A2459951k07295l04301j77337J415m57606q9069J9394l92852n6939l68199
14134A0427162m0385J05089l08737J0954n31210J92440k67878k59034j04635j21324
14124I102442k92861j13451J59900k73038J38687k40820J08644m22768l02379
$$ plain form
14190 29702353 28946239 28342256 27723766 27149458 26666168 25883605 25057064 24927302 23996138
14181 23996138 23480438 23083893 22032236 22378998 21799182 21133076 20969309 20412058 20231045
14172 20231045 19841374 18996609 19214756 18453198 18201065 17615039 17491987 17111291 16585089
14163 16585089 16382847 16035534 15987362 15631849 15419802 15278317 14859841 14382434 14245036
14154 14245036 14182853 13749954 13809011 13343123 13291282 13124646 12940485 12753615 13000279 12459951
14144 12459951 12252656 11948355 11771018 11772433 11314827 11225758 11245152 10852300 10795361 10427162
14134 10427162 10386777 10491866 10183129 10194083 9662873 9855313 9587435 9328401 9223766 9102442
14124 9102442 8809581 8696130 8856030 8582992 8721679 8480859 8589503 8166735 7864356
14115G864356J04449L14882l99562k11414j64677L76315k7522j61905m79511L34917
14105G550328k58888j34415l5118l05410Q3288r3068j07801l40896N42518l53685
14095F546853J15343l38014r8562K28734l82992p755l01137O4252k3862K71771
14085F074631o00089M17120k04060J93869l01654k91501K29350l90582J01551
14076E228635J9134M302l55008R2993K61930l61159j09001J54441K5181n12757
14066D448691M52562k19657j16906j0182L36633n16946J04258J49265k17739l3924
14056D376055K58322k25753j97322o3739P3380k70402K39933l20964K42105m65806
14046C645809K65308J29998m63208L67303k95680p3954L17133n52444J11532j0487
$$ plain form
14115 7864356 7968805 8283687 7884125 7672711 7508034 7884349 7856827 7694922 7215411 7550328
14105 7550328 7291440 7157025 7121907 6816497 6899785 6806717 6698916 6358020 6900538 6546853
14095 6546853 6662196 6324182 6225620 6454354 6071362 6063607 5762470 5826722 5802860 6074631
14085 6074631 5474542 5891662 5687602 5881471 5579817 5288316 5517666 5127084 5228635
14076 5228635 5247769 5252071 4897063 4990056 5251986 4890827 4781826 4936267 4961448 4448691
14066 4448691 4901253 4681596 4564690 4554508 4891141 4374195 4478453 4627718 4409979 4376055
14056 4376055 4634377 4408624 4211302 4147563 4220943 3950541 4190474 3869510 4111615 3645809
14046 3645809 3911117 4041115 3577907 3945210 3649530 3575576 3892709 3340265 3451797 3441310
14036C441310k55714K90822j38979L19966k12957r3761J08500j56122J52293j23916
14026C331442K7447j67700j02334j51929J10036o8376j03035K89910k39599r6605
14016B829257q1314R0329l13187L22073K19933j58844k83347K49094j99158m0884
14006B633952O2625k16030n1191J10165q393j95164r7490K39378J63365j92622
13996B448595p6770k29245O94010j40761J20142M12614M31511J239886L467035
13987H367017P972968J3037560J3940408j2716876A4863573n771617k330260j831989
13979D929707n46590l92231l80176o414m37194J5478j69254K20682o13566j08558
13969B511884K65731q3674j88040K63122n03399O6053L46587O86j59965k0677
$$ plain form
14036 3441310 3185596 3476418 3337439 3657405 3444448 3350687 3459187 3303065 3455358 3331442
14026 3331442 3358889 3191189 3088855 2936926 3046962 2978586 2875551 3165461 2925862 2829257
14016 2829257 2747943 2838272 2525085 2847158 3067091 2908247 2624900 2873994 2674836 2633952
14006 2633952 2696577 2480547 2429356 2539521 2531128 2335964 2238474 2477852 2641217 2448595
13996 2448595 2371825 2142580 2836590 2695829 2815971 3228585 3660096 4899982 8367017
13987 8367017 16339985 29377545 43317953 30601077 14863573 9091956 6761696 4929707
13979 4929707 4383117 3990886 3610710 3604296 3167102 3182580 3013326 3234008 2620442 2511884
13969 2511884 2777615 2693941 2505901 2769023 2265624 2331677 2678264 2678950 2518985 2498308
13959B498308o2091N111m39717M80850J63316l94812m0554q0215l4422j7626O0969
13948B139117J08500j58086k72907K27869j75745L64124l31546m5171L97258j20523
13938B132890j57895j69607M6161j34243K85442q1337K55413l80958j48990L7884
13928A684760K11484j30489l65862L86329j94163J23272j28663j35835J4805L34933
13918A800571L0807l46981M01150k10620l04864M3765n0247K24391K26724j85295
13908A629401J1693J58062J1297l81974J41081M7071q5148q9500L15869m90184
13898A267668O76870n22084L2252L6651J01830j43938J42532R8075r7364l55645
13888A236847j68693L04816N3062k18834N18524j47200l45987J46970J19361l29477
$$ plain form
13959 2498308 2436217 2441328 2001611 2482461 2645777 2250965 2210411 2130196 2095774 2078148 2139117
13948 2139117 2247617 2089531 1816624 2044493 1868748 2232872 1901326 1856155 2253413 2132890
13938 2132890 1974995 1805388 1851549 1717306 2002748 1921411 2176824 1795866 1646876 1684760
13928 1684760 1896244 1765755 1399893 1786222 1592059 1715331 1586668 1450833 1465638 1800571
13918 1800571 1831378 1484397 1885547 1674927 1370063 1413828 1363581 1587972 1814696 1629401
13908 1629401 1641094 1799156 1810453 1428479 1569560 1616631 1531483 1441983 1757852 1267668
13898 1267668 1944538 1422454 1454706 1491357 1593187 1449249 1591781 1689856 1592492 1236847
13888 1236847 1068154 1372970 1426032 1207198 1725722 1578522 1232535 1379505 1498866 1169389
13878A169389K61462J40789l22183j24102J16817J23354P168p8091l85343J0710
13868I19970K99544L94552m98617l88513N24638m5001l78024O32962l21924Q5560
13858A225147l37506L22139k2197k30372J71819P1243k87302K76066K27541k5415
13848A391163m68866K27144r4797K63012J602j86146j38738k5940q0331R9048
13838I87151J32001K51477k4321m65755J12614l4693L06246j35487J34246Q9550
13828A353029l30598j52186J00841J70426k29579k9587K55947j91246R8797j48095
13818H97749J60515k70361L31446J32112m96012j46971J36298M00002k19066M0096
13808I65808k56720N65373l91890j67282K88720J7358k41239M5665O3553j79487
$$ plain form
13878 1169389 1430851 1571640 1249457 1125355 1242172 1365526 1372694 1294603 909260 919970
13868 919970 1219514 1614066 1115449 726936 1251574 1206573 828549 1461511 1139587 1225147
13858 1225147 887641 1209780 1187583 957211 1129030 1200273 912971 1189037 1416578 1391163
13848 1391163 922297 1149441 1054644 1317656 1319258 1133112 994374 968434 888103 987151
13838 987151 1119152 1370629 1346308 880553 993167 958474 1264720 1129233 1263479 1353029
13828 1353029 1022431 870245 971086 1141512 911933 882346 1138293 947047 1045844 897749
13818 897749 1058264 787903 1119349 1251461 755449 608478 744776 1144778 925712 965808
13808 965808 709088 1274461 882571 715289 1004009 1021367 780128 825793 889346 709859
13798G09859N81488j72230l01905q8463j39206J26237N2051N0496j43013J16520
13788G91834K33781k11593J17936j29222k03545J91127l11445M79872N40r8689
13778H60596k07035J71121j06979j07224O62671k29475l71192P4890M24165l66117
13768H05421j73006L3230J13652m6827R6428m8476r1452m9667J32417k20724L99414
13757I50410j78601N83152m33694j30833j67065J50022J64825k28649Q8095j88896
13747F08766L07264k81989M71092k46717j07783j49217R5829o5965P0897J84130
13737H86307o5843C65782O29152m48380K92300j45031j27463N2019P2127k32480
13727D58026K90347o1603j0738m1734m5089J18272J61744p9483k71607J49247
$$ plain form
13798 709859 1291347 1119117 817212 728749 589543 715780 767831 818327 675314 791834
13788 791834 1025615 814022 931958 802736 599191 790318 478873 958745 959285 860596
13778 860596 653561 824682 717703 610479 1273150 1043675 672483 747373 1171538 805421
13768 805421 632415 665645 779297 732470 828898 780422 688970 639303 771720 550996 950410
13757 950410 771809 1354961 921267 790434 623369 773391 938216 709567 797662 608766
13747 608766 916030 634041 1105133 858416 750633 601416 697245 631280 702177 886307
13737 886307 820464 365782 994934 546554 838854 693823 566360 618379 690506 458026
13727 458026 748373 686770 676032 634298 589209 707481 869225 789742 518135 667382
13717F67382p5876K62824j21876j36849o8418j90553P3802J09233J10496K06948
13707H37113j18584J37786l24052k5434M07155k91857J48046j26830J13656j84662
13697E72337K93649j59429k31357J98316K72358k03148k97274K41214k19907J85978
13687F52737k41959J63349R5473k27210N02496l86823J66872l54957M80868C51273
13676B94182K00444J67554B63391M4242O2306O5285J78614p6087j48794O9313
13666D58270L13892k29672B63990J11827q0857M13735k13759J17311B69438O47595
13656I17033B28402L22244Q2853p1415O9527k27687Q7524B01181J26510L75296
13646G02987B40946J43793R0895R0797j48526P960L7272K93085k50342j9248l6468
$$ plain form
13717 667382 591506 854330 732454 595605 527187 336634 410436 519669 630165 837113
13707 837113 718529 856315 532263 506829 913984 622127 770173 643343 756999 572337
13697 572337 865986 706557 475200 673516 945874 742726 445452 686666 466759 652737
13687 652737 410778 574127 669600 442390 944886 558063 724935 369978 850846 351273
13676 294182 494626 662180 263391 307633 369939 435224 613838 537751 388957 458270
13666 458270 772162 542490 263990 375817 294960 708695 494936 612247 269438 917033
13656 917033 228402 550646 633499 562084 631611 403924 491448 201181 327691 702987
13646 702987 240946 384739 475634 566431 417905 425865 463137 756222 505880 486632 450164
13635D50164K7041K51367B94192L57208R4760a56926D40697K21494B79162J14545
13625C93707j49088L93817J20262C05394A32121J97423J78140K3926j22947r3321
13615C15342p9467P7201K3026p3156J00304J21599r8122A88926J30740J21507
13605D41173J00995k04737N897A38421J98937R3406L1963A79272K27971K40193
13595F47436j69342j67477M8477j46107J90257K48535l1003J03214l22751p2941
13585C28298O74299m48425B65020J22271O5002K228J4570O0716j50788K38583
13575F17602k65988l8156K56329k00451J34434A47690J79823M38702A71003R0133
13565B61136G8567L19009O1986K5278N7918j15894k00191J47730j46893Q2908
$$ plain form
13635 450164 477205 728572 294192 651400 746160 -156926 440697 662191 279162 393707
13625 393707 244619 638436 758698 305394 132121 329544 507684 531610 408663 315342
13615 315342 235875 313076 336102 262946 363250 484849 386727 188926 319666 441173
13605 441173 542168 337431 343328 138421 337358 430764 462727 179272 407243 647436
13595 647436 478094 310617 359094 212987 403244 651779 620776 723990 401239 328298
13585 328298 1002597 554172 265020 387291 452293 454521 469091 529807 379019 617602
13575 617602 351614 313458 569787 369336 503770 147690 327513 766215 171003 261136
13565 261136 78567 397576 459562 484840 542758 426864 226673 374403 227510 310418
13555C10418Q3349J4762j15391a35456A70908J27806K26134r2062R5964j96212
13545C32538N459j42919J17178Q7063J60202j7847j53904J08835j40500l4596
13535C21509A37385Q3077K83653A56699J48213J83874A20770P7324M136R395L75247
13524E86872A83536K94103J7901l0226Q7070k7072l9466j13399P3865N9095j42062
13513C63345j22404C3134J76306K17561n1532p3468J10109m6414J32637A98702
13502a56957C48380J13578B09668C9337L44585J3521j69201k6545J51894j24180
13492B29411Q4356N8131n6999Q1520A92409d7040C97156K37788A64780m8134J72594
13481B89240d7502C12075J31473B14969M11804k77743m3598J72481A34499K32219
$$ plain form
13555 310418 393767 408529 293138 -135456 170908 298714 524848 432786 528750 332538
13545 332538 337997 195078 312256 399319 559521 541674 387770 496605 356105 321509
13535 321509 137385 220462 504115 156699 304912 488786 120770 198094 202230 211625 586872
13524 586872 183536 477639 495540 465314 552384 525312 485846 372447 446312 505407 363345
13513 363345 240941 33134 209440 427001 375469 302001 412110 365696 498333 198702
13502 -156957 348380 461958 209668 39337 383922 397443 228242 201697 353591 229411
13492 229411 313767 371898 314899 396419 192409 -47040 397156 634944 164780 116646 289240
13481 289240 -47502 312075 443548 214969 626773 349030 305432 477913 134499 366718
13471C66718J9627c8825C79569r3464G8889K31713j34201l3608J50045i554C88714
13459B3932L51517l5009l0993J74279A34092o050k4776J44512A14659L61541A80302
13447h1519A98449M6005J948a41173B98852J21296A41761K93550n5666C4129K48937
13436B83066n5920G1128J63664K61880k03667a38686D7525c8375E4531K77148
13426C31679o9285b8852A99733r1468j743O1194K11485j70005J509K05572o9786
13415C46491J16667B12907p5677L87174j10492j16910q054J63787m1986j80550
13405B30199b701B15954d7978j05570F10753B22108M7011o482P7348r8092M592
13394B46485i3547I8278J70652r5647E0015J72413J9937j05708m6971e1400C01762
$$ plain form
13471 366718 386345 -38825 379569 286105 78889 310602 176401 142793 292838 -9554 388714
13459 23932 375449 340440 309447 483726 134092 128042 103266 247778 114659 476200 180302
13447 -81519 198449 244454 246402 -141173 298852 420148 141761 435311 379645 34129 283066
13436 283066 227146 71128 234792 496672 293005 -138686 47525 -38375 54531 331679
13426 331679 262394 -28852 199733 108265 106522 167716 379201 209196 210705 416277 346491
13415 346491 463158 212907 137230 524404 413912 297002 288948 452735 410749 230199
13405 230199 -2701 215954 -47978 -153548 610753 222108 269119 262637 339985 241893 246485
13394 246485 -93547 98278 268930 173283 50015 222428 242365 136657 89686 -51400 301762
13382B17331K7289L05420A79274G5983M7831J62299m891n9315J78693k4860j85881
13371A89859J51573A14442J63390o7908E9317K09717P8775J68795k39996M0422
13361C17030A32850J94615D843N7409L15089M6027K06738B89122J28741A71230
13350C0630K54990K80290j80617j17593A06893l9158M91829k03526A37352J16881
13340B54233l8913G9300C1937L64684J12567j17437A54134L03797o0717l9530
13330C57684A73296o3673J22412m4834n6305d8497C17524r27J14105C9652a37600
13318D23886J50398k03728L1250H7601M13375R013B24715p8814F6871J19569J04759
13307B91199A0598K92144r8904e266B13596r8000a33775A54703p6947r536N4666
$$ plain form
13382 217331 244620 550040 179274 75983 123814 286113 281222 221907 400600 375740 189859
13371 189859 341432 114442 277832 209924 59317 269034 347809 516604 276608 317030
13361 317030 132850 327465 4843 62252 377341 423368 630106 289122 417863 171230
13350 30630 285620 565910 385293 267700 106893 67735 559564 356038 137352 254233
13340 254233 215320 79300 31937 396621 509188 391751 154134 457931 397214 357684
13330 357684 173296 109623 232035 187201 130896 -48497 317524 316597 430702 39652 -137600
13318 423886 574284 370556 401806 87601 500976 509989 224715 145901 66871 186440 291199
13307 291199 10598 302742 203838 -5266 213596 115596 -133775 154703 77756 68220 122886
13296A22886K55619A24919A0654J55261j5369k0876R0447H1016a09821C17925
13285C74105F0793j9992J21112c1687C28978J86597a67885B23673Q7250b8135
13274b39933A10783L5179e6254I3295J72790a34806C07179R2030m9077j45334
13264B04798A3490d9886B01432c9978A35453J25026M4088a86854C56181k4751
13254C31430A9736O2487a31437A70145m9489L56073n9605q2908O5977k7597a1370
13242B5790P1454M7914m2765J48817F034d3277A71704f9824D16049g2930B84715
13230c7148D31229A07506b5354B75017j36845K84999J39228a35591B60991J55001
13220D15992j00906I5948l2626J46346c0203j9086j05282a9981B3148K79815j09582
$$ plain form
13296 122886 378505 124919 10654 165915 150546 129670 220117 81016 -109821 317925
13285 374105 60793 40801 161913 -31687 328978 515575 -167885 223673 310923 -28135
13274 -239933 110783 145962 -56254 93295 266085 -134806 307179 399209 350132 204798
13264 204798 13490 -49886 201432 -39978 135453 260479 304567 -186854 356181 331430
13254 331430 19736 82223 -131437 170145 120656 476729 417124 334216 400193 372596 -11370
13242 25790 97244 145158 102393 251210 6034 -43277 171704 -69824 416049 -72930 284715
13230 -37148 431229 107506 -25354 275017 138172 423171 562399 -135591 260991 415992
13220 415992 315086 95948 63322 209668 -30203 -49289 -154571 -19981 23148 302963 193381
13209A93381F9553a89149C0879P9744K9502m7669a72859B05077L02682e1204j21498
13198a72702A15791K3972d8459A8090J40596m4656B0411b8362B72926O9066j51375
13187A90617a51751a1520j02173B2138J23519h9276D74330j64644k7064D8852
13176a1218m1023A58894J0981J03115g4583A79432C0286L61733A01765m3474J45120
13165B03411j7214j5506p9129A6776J65032a53565D48031A34123K76752C8329
13154i9446A70195d04327B00050F7448M69860A08050K71663j5070I7683g7194
13143A32170b94150C32627b12090A05622C8192L58787C0406J93344A06414g1148
13132G2352R5164a00493A83506b89253A51170a3522D79750j76299m3700d3945
$$ plain form
13209 193381 69553 -189149 30879 110623 140125 92456 -172859 205077 507759 -51204 -172702
13198 -172702 115791 139763 -48459 18090 158686 114030 20411 -28362 272926 341992 190617
13187 190617 -151751 -11520 -113693 22138 145657 -89276 474330 309686 282622 48852
13176 -11218 -52241 158894 169875 272990 -74583 179432 30286 392019 101765 58291 203411
13165 203411 186197 170691 91562 16776 181808 -153565 448031 134123 410875 38329
13154 -99446 170195 -404327 200050 67448 537308 108050 379713 364643 97683 -77194
13143 132170 -294150 332627 -212090 105622 38192 396979 30406 223750 106414 -71148
13132 72352 167516 -100493 183506 -289253 151170 -13522 479750 303451 259751 -43945
13121B42827P6417l3751b48962B22624K8401E1971a09286F893K66145G345a9731
13109a62077b7098C093a98253F0643N7795J35069G3710J67374r778a41256D8184
13097F468J46300a42367M9047a7721A16258P8383L84715E1263e5999A13590K3499
13086A37089o1952J40678E9245Q2524G0775L53144a32572B77757j23646K8759
13076A82870M0028J2382a5804k21549e618o2792N935A5727K45498k1039a85413
13064C13831d1625A46892K86812A56261j1996c316o3778F9394K10913M303a86379
13052A46455b8514l0765B37894j09225b5103C29527A61206g2019D7844a23713
13041a58290B02293J77935A85566d2683F2874a95296A14825n2675L22709K7248
$$ plain form
13121 242827 319244 285493 -248962 222624 251025 51971 -109286 6893 273038 7345 -19731
13109 -162077 -27098 3093 -198253 60643 118438 253507 73710 241084 231306 -141256 48184
13097 6468 152768 -142367 -93320 -17721 116258 194641 579356 51263 -55999 113590 137089
13086 137089 75137 215815 59245 141769 70775 423919 -132572 277757 154111 182870
13076 182870 222898 235280 -15804 -237353 -5618 -68410 -62475 15727 261225 240186 -185413
13064 313831 -41625 146892 433704 156261 144265 -3316 -67094 69394 280307 284610 -186379
13052 146455 -28514 -59279 237894 128669 -25103 329527 161206 -72019 47844 -123713
13041 -158290 202293 380228 185566 -42683 62874 -195296 114825 62150 384859 412107
13031D12107F1972L17880N6081b1052A04521J63154R3502a85648A07512L92025
13021D99537E1763P2598A6372a90863A80541N7287a90297E6506J53492C3142R3007
13010A26149J36631A10379a02803H1761L41174A43454a01159a7929p145B50169
12999c5451J2519D6045O7963d0823A52546O5117b32347h6736r1779j32590I4867
12987b06887B62277j10566g557p4982b2666A13775b81749D292K69943q8036C9929
12975C45251a05551K8408C14397j26505N5506N4977i727l06039c128o0302g252
12963I2676M09324E275P1070O4480N2913c9685j12345E2058J56492e9055A04774
12951A50698a60410C8606b53131N5897L7788E3858a35444F4690J01001E5706q681
$$ plain form
13031 412107 61972 379852 435933 -21052 104521 267675 361177 -185648 107512 499537
13021 499537 51763 124361 16372 -190863 180541 237828 -190297 56506 209998 33142 126149
13010 126149 262780 110379 -102803 81761 422935 143454 -101159 -17929 -25074 250169
12999 -35451 -22932 46045 114008 -40823 152546 217663 -232347 -86736 -178515 -311105 94867
12987 -206887 262277 151711 -7557 -82539 -22666 113775 -281749 4292 274235 186199 39929
12975 345251 -105551 -77143 314397 187892 243398 298375 -9727 -315766 -3128 -63430 -7252
12963 92676 502000 5275 76345 140825 193738 -39685 -152030 52058 208550 -59055 104774
12951 150698 -160410 38606 -253131 -197234 -159446 53858 -135444 64690 165691 55706 47025
12940D7025b465o2030n8781I9813Q383L70484a35509b1959k32332A79930G8137
12928B22346p0107l416i0344b8891C34590r2051i4382A65778d9429C93063A11692
12916b92390B66982b79832A24190Q509c821j47031A0849Q1415L7001L7769P2098
12905B39132d4967B14350I5662J70242D8480P6155K95955E9840h4617j02046A12576
12893a73146C00211F9097b53296B21615J14256h2949B28795o5098N134m5131O4018
12882A87718C3092J322e7191o9976l1277j40604E7734J6390b0430H6684a7578
12870A90293G1846a31284j52075f0510A28417e9718A20732M0914L3270R8530a36548
12858C7011b77475E61614b1656J763p7662F9872J49627q7294b7983C23699B7857
$$ plain form
12940 47025 -2465 -64495 -123276 99813 108196 478680 -135509 -21959 -254291 179930 78137
12928 222346 152239 148823 -90344 -28891 334590 242539 -94382 165778 -49429 393063 111692
12916 -292390 266982 -279832 124190 132699 -3821 -150852 10849 92264 129265 167034 239132
12905 239132 -44967 214350 95662 265904 48480 124635 420590 59840 -84617 -186663 112576
12893 -173146 300211 69097 -253296 221615 335871 -82949 228795 163697 168831 123700 187718
12882 187718 33092 34414 -57191 -127167 -158444 -299048 57734 74124 -20430 86684 -17578
12870 190293 71846 -131284 -283359 -60510 128417 -59718 120732 161646 194916 293446 -136548
12858 37011 -277475 561614 -21656 -19893 -97555 69872 219499 132205 -27983 323699 27857
12846A77496l4289b23538a2728I2329e8925A12977J52950l3155k1706E6173f6319
12834I6965K69818j61295q2069C9263K35745b37965i5692k18151J37945a6443
12823b8374B14532i3022K7250A04606b69437A31445K06223E2676J06646b35945
12812f8013d576A70970p7081R1560G0138f5644l26460a79604B64490d6165E6538
12800b52386C66857A07069M2055D0175N6661a36683K6426A30767F2422K1382k8866
12789E4938J31488a26800O995N9887E9178c61871g6037G5907K35a55764A78851
12777F3536i8159k819H8617J47682I1906C9285J85839c14277a49236o1845A26639
12765i4296d1273F0332F752h7416I5326d35024d3139f66C35201j5429H614f0176
$$ plain form
12846 177496 143207 -223538 -12728 92329 -58925 112977 265927 232772 211066 56173 -66319
12834 96965 366783 205488 123419 39263 275008 -237965 -95692 -313843 -175898 -16443
12823 -28374 214532 -93022 -65772 104606 -269437 131445 337668 52676 159322 -235945
12812 -68013 -4576 170970 93889 185449 70138 -65644 -392104 -179604 264490 -46165 56538
12800 -252386 366857 107069 149124 40175 96836 -136683 -110257 130767 62422 83804 54938
12789 54938 186426 -126800 -119805 -59918 59178 -361871 -76037 75907 76142 -155764 178851
12777 63536 -98159 -100978 88617 236299 91906 39285 225124 -314277 -149236 -211081 126639
12765 -94296 -41273 60332 6752 -87416 95326 -435024 -43139 -666 335201 319772 8614 -60176
12752A75628O4768A01310a48385B21197a98930B35894e5930j85867J16311E8416
12741c38434A64609a48698I7585m6378M6584b64965B49225p98A23192Q8215g4271
12729A66849b28156n7991B45211j01786B3999b14598I4444P1487E7398J64108
12719B21506G1362f3615j11126d538A22983L0017J53042a67j43024F9292k6308
12708D2984K74507k6206B6604K52747J24540J19779i0507B9342J19078J12110
12698B60530L9644d7791B23282j8148F870M6562K41039d7836j33136b4806B0259
12686A35341L08133f2222K3406A75137E3765q480Q7031J76295P0392A34669f1981
12674C96998A66818q0780K43245q6976J36086g2851A32672K2217K20621q8932
$$ plain form
12752 175628 240396 101310 -148385 221197 -198930 235894 -55930 -241797 -125486 58416
12741 -338434 164609 -148698 97585 51207 97791 -264965 249225 248427 123192 211407 -74271
12729 166849 -228156 -286147 245211 143425 23999 -214598 94444 165931 57398 221506
12719 221506 71362 -63615 -174741 -4538 122983 153000 306042 -167 -143191 69292 42984
12708 42984 317491 291285 26604 279351 403891 523670 -90507 29342 148420 260530
12698 260530 300174 -47791 223282 205134 6870 53432 294471 -47836 -180972 -24806 20259
12686 135341 443474 -62222 -38816 175137 53765 45285 132316 308611 379003 134669 -61981
12674 396998 166818 86038 329283 242307 378393 -72851 132672 154889 375510 286578
12664B86578K7849i8820A6002K13045i4196k3994D86879A27518n5987a11194I0759
12652a80210B16805A07793Q5404Q3797A20589J14463k8250a23993J3263b885A56176
12640A26432o11O6001b16238d7024n7959j07818C7447N0265K7782a34201F8704
12628A50334K89595p259j57451C1269c2943B03809L4610c4131C86177A77378p0959
12617A06419C6257A4791J61031b76809B6985a94121b7182j44842G7570N3659J51835
12606B83064a1998A50717K3764L43747F3809j2442A9799b56253A18225K30285
12596C48510A21333c3408j92306B30253N0304h9898A45727a15584B18441a26477
12585C75945I0298a59691G6345J90670o215G8673A5823K12308E7453g1183a6058
$$ plain form
12664 286578 314427 -98820 16002 229047 -94196 -118190 486879 127518 71531 -111194 90759
12652 -180210 216805 107793 193197 276994 120589 235052 206802 -123993 -110730 -2885 156176
12640 126432 125821 191822 -216238 -47024 -104983 -212801 37447 87712 115494 -134201 68704
12628 150334 439929 432670 275219 31269 -32943 203809 238419 -34131 386177 177378 106419
12617 106419 36257 14791 175822 -276809 26985 -194121 -27182 -172024 77570 131229 283064
12606 283064 -11998 150717 174481 518228 63809 51367 19799 -256253 118225 348510
12596 348510 121333 -33408 -225714 230253 280557 -89898 145727 -115584 218441 -126477
12585 375945 90298 -159691 76345 267015 260800 78673 15823 228131 57453 -71183 -16058
12573I9779m7704J53537l811I170O9628J39476d300A06118J31014G019a40261
12561C3579L28644c57584C9090b61740a0197j94887C16867e1229m6728j65570
12551b63527B39307G3117Q6482c28904B35631a26924B34642J1213n5781q5309
12541A04765J19312l026I0748b09511A93265k1522J05659A23328L32448D7990
12530a12068A61678k2011b1563A03999P1341g5858D2988b57735D7020a31679B43753
12518D0426M3035k0035K8908H231g6960A54159C2960J10623e57m858F2598J49911
12506B12509n3026G0282A5443a95045A20782D4635J50095J4839N1548J9927F8275
12494b60261D5052L1796k786a19998c2520j44177E7543b2719A20205b17387C93425
$$ plain form
12573 99779 52075 205612 201801 9170 78798 218274 -4300 106118 237132 7019 -140261
12561 33579 362223 -357584 39090 -261740 -10197 -205084 316867 -51229 -97957 -263527
12551 -263527 239307 73117 159599 -328904 235631 -126924 234642 245855 190074 104765
12541 104765 224077 221051 90748 -209511 193265 171743 277402 123328 455776 47990
12530 -112068 161678 139667 -21563 103999 175340 -75858 42988 -257735 47020 -131679 243753
12518 40426 83461 63426 92334 8231 -76960 154159 32960 143583 -557 -5415 62598 212509
12506 212509 159483 70282 15443 -195045 120782 44635 194730 209569 261117 281044 68275
12494 -260261 45052 76848 74062 -119998 -32520 -176697 57543 -22719 120205 -217387 393425
12482i296A84912a21251n6826N9780E3421P9509b33886B21770A03079a1577a464
12470i7599A41381o8363a80175h5756A98214a6093C680a68149b5185O773j18144
12459a36556A72586b7990B10584I0509D2035a27136k9650E8327a41126j03118
12449b44244b1425m7682a1648l03214B02611a409q0693C981a56359A88195j5742
12438A72453a6931D3789b76099e2985C72299c3415L974k05233g3971k4539p4032
12427a72542G1022a06005J9278k4391p6334I6275g525k08719a870j43872H3465
12415D80121a41979g0456J4696A44585b27803a06704k2614l0512l475B99868g0048
12403A04460C5961h0435o9631n2193J6414I6737J87236G9632b42125A83958a23392
$$ plain form
12482 -9296 184912 -121251 -178077 -118297 53421 132930 -233886 221770 103079 -11577 -1464
12470 -97599 141381 73018 -180175 -85756 198214 -16093 3680 -168149 -25185 -18412 -136556
12459 -136556 172586 -27990 210584 90509 42035 -127136 -156786 58327 -141126 -244244
12449 -244244 -21425 -69107 -11648 -314862 202611 -1409 -82102 3981 -156359 188195 172453
12438 172453 -16931 43789 -276099 -52985 372299 -33415 -29441 -234674 -73971 -98510 -172542
12427 -172542 71022 -106005 -86727 -111118 -187452 96275 -7525 -216244 -1870 -145742 83465
12415 480121 -141979 -70456 -55760 144585 -227803 -106704 -129318 -159830 -163305 299868 -70048
12403 104460 35961 -80435 -150066 -202259 -185845 96737 283973 79632 -242125 183958 -123392
12391G166a25510A6474d4764j9284K6738k48235A60267o3374a2798A98707E1732
12379a69992B45294b4221A19574C5077a53533B06200D3899P818L86019A12805
12368C67228a62831O4739b0344F3569G977a64382A0726b47140C26405p0188c4105
12356b41533a4932k80659e6095m5982A16031C6507a17694B04884d3794j12330
12346a56124E71667b81060H9420c2k43149P7161A1870J1878c913A68945a43512
12334B00285J2488H3243l1910i9458d5014A81581G5412a7671j17116I5448M357
12323I9805F434a51558c1414A34981P7510p5687A0852c7142d615E623J78131K9118
12311B12872a8149q9643K845o9336O4562k8347G1906M5132H118a03129A46317
$$ plain form
12391 7166 -125510 16474 -44764 -64048 -37310 -285545 160267 96893 -12798 198707 51732
12379 -169992 245294 -24221 119574 35077 -153533 206200 43899 51717 437736 112805
12368 367228 -162831 -98092 -20344 63569 7977 -164382 10726 -247140 326405 256217 -34105
12356 -241533 -14932 -295591 -56095 -102077 116031 36507 -117694 204884 -43794 -156124
12346 -156124 571667 -281060 89420 -32 -243181 -166020 11870 23748 -3913 168945 -143512
12334 200285 212773 83243 51333 -99458 -45014 181581 75412 -17671 -134787 95448 99805
12323 99805 6434 -151558 -31414 134981 212491 136804 10852 -37142 -4615 5623 183754 212872
12311 212872 -18149 -107792 -104947 -174283 -109721 -138068 71906 117038 8118 -103129 146317
12299b92195B35035O4312r6897R9098a5800A16289a47929B40035C7229N6654k2604
12288G1279R3465p1689a00375f024b978n0283A1570b0486j5373q8930A58950J68471
12276C27421D0894J02290a02553E8925L4812K82956j87279k7568J6396o0099D6154
12264D7006N18459E4586a80146H7275m1739J1661i046q7473A80514H7149a94260
12252B41263K06797j71099B9510J28692J60029f0112A08807K99299A14974M3337
12242A58311K4430K9768d0352A16092A1624J28966F4194g7055A24747J95130a33982
12230B59614j13890J40941L74073E798K7630N57107a0863B73332q3396r3369C4470
12218C09219A21109m8159L71845d3938D4533P203a62557A44093J42248j7452l5084
$$ plain form
12299 -292195 235035 299347 202450 301548 -15800 116289 -147929 240035 37229 93883 71279
12288 71279 164744 93055 -100375 -6024 -2978 -53261 11570 -20486 -35859 -124789 158950 327421
12276 327421 40894 143184 -102553 58925 93737 376693 189414 161846 178242 118143 46154
12264 47006 565465 54586 -180146 87275 45536 57197 -9046 -96519 180514 87149 -194260
12252 241263 448060 276961 29510 158202 318231 -60112 108807 408106 114974 158311
12242 158311 182741 212509 -40352 116092 11624 140590 64194 -77055 124747 319877 -133982
12230 259614 145724 286665 660738 5798 33428 590535 -10863 273332 189936 96567 34470
12218 309219 121109 72950 444795 -43938 44533 51736 -162557 144093 286341 268889 233805
12207B33805j04350L59024e1196B35471A08272J2110a1033C61957j14801M3334
12197B90490H7091O4599B9556K16788j22291b431j3838A11804B9630a22048A39850
12185B18290m319J61562p7407k8173c9179D65252A39253M3983O6543E0891J93060
12174B43951a7037j78460M7685A11542K61508l6244A51270b8938j02403M3586
12164h7755F8114J92830O7727j15440K49017k03968E3377e9806m1416m7711i255
12152A9979k632b60252A80551q4738B4284k208M32068J95547A6140J02859a53014
12140b21983A50688I412J09346K9415h5913n0719E07200a4914l48140C15572j01318
12129B14254a78029A71338c140j09185n3382B92192C2847g8796F685c55129A87361
$$ plain form
12207 233805 129455 488479 -51196 235471 108272 120382 -11033 361957 247156 290490
12197 290490 87091 151690 29556 246344 124053 -2431 -16269 111804 29630 -122048 139850
12185 218290 213971 375533 298126 269953 -39179 465252 139253 183236 249779 50891 243951
12174 243951 -17037 -195497 -147812 111542 373050 336806 151270 -28938 -131341 -87755
12164 -87755 68114 260944 328671 213231 462248 258280 53377 -59806 -101222 -148933 -9255
12152 19979 17347 -260252 180551 95813 24284 22076 454144 649691 16140 118999 -153014
12140 -221983 150688 9412 118758 148173 -85913 -136632 507200 -14914 -363054 315572 214254
12129 214254 -178029 171338 -3140 -112325 -165707 292192 32847 -78796 6685 -355129 187361
12117A85731B4493J44724P608h2443L1642o5609B98977a54277M3116d362m5636
12106d9998C73424i6230a9588I5844b58652e3819J8687j50048q6387d3594j96936
12095b40530a00297G7374a06044K8276j46023c8469m62108A5398b13760A58528
12084b10555e0825p16k9754o6597M7070B3740g6047H7311J85603d5583G4738c5015
12071f5329a3354A78430p7806O89909L93277M345B1581J17244K65018b7185k75183
12060c02368C2951K0504k1344L5951c20135B47111A9212a37660B5493K06417c30010
12048c75377D8706A1375J23265i8342M0739o7166M0798A01436b70976A1556d9951
12036c93322h2911B16783a84492B41321b08321l0508J06869I2254b63285A4857
$$ plain form
12117 185731 24493 169217 176825 -82443 -50801 -116410 298977 -154277 -111161 -4362 -49998
12106 -49998 373424 -96230 -19588 95844 -258652 -53819 -35132 -185180 -271567 -43594 -240530
12095 -240530 -100297 77374 -106044 -77768 -223791 -38469 -500577 15398 -213760 158528
12084 -210555 -50825 -51541 -81295 -147892 -100822 23740 -76047 87311 272914 -45583 74738 -35015
12071 -65329 -13354 178430 100624 790533 1183810 1188155 21581 138825 403843 -27185 -302368
12060 -302368 32951 53455 32111 68062 -320135 247111 19212 -137660 25493 231910 -330010
12048 -375377 48706 11375 134640 -98342 -57603 -124769 -83971 101436 -270976 11556 -49951
12036 -393322 -82911 216783 -184492 241321 -208321 -238829 -131960 92254 -263285 14857
12025H7205O5339J44018G7881a33876o1204A7399d80697A62249J94152e158A51522
12013h5429J5417j84390C2803q851b27543p5880G9556l5090N8742b12236e1688
12001d325l0923m75542a57035C25594f7502C0126j3041b09323f6439p8775B35863
11989E0878J89289b15221H5143a29263m8123A71127D7981a53280f2219G9745i9672
11977C24790E2119N6855J78420j01994q225b16949A6052J69074b37958O0383f7081
11965B53208a67555E730a15119I7145a00235m6804A70756a15048f782G5160J30840
11954B06000J6188d75091B56762i3536C3364K86763H4072Q3555o3725H369c22963
11942a74834C27183F7309B1251c08593B72800b00171F4856f201A31917b05243
$$ plain form
12025 87205 152544 296562 77881 -133876 -195080 17399 -480697 162249 356401 -5158 151522
12013 -85429 -70012 -254402 32803 23952 -227543 -303423 79556 44466 103208 -212236 -51688
12001 -4325 -35248 -510790 -157035 325594 -67502 30126 17085 -209323 -66439 -145214 235863
11989 50878 240167 -215221 85143 -129263 -177386 171127 47981 -153280 -62219 79745 -99672
11977 324790 52119 108974 287394 185400 177175 -216949 16052 185126 -237958 -177575 -67081
11965 253208 -167555 5730 -115119 97145 -100235 -147039 170756 -115048 -6782 75160 206000
11954 206000 222188 -475091 256762 -93536 33364 320127 84072 167627 103902 8369 -322963
11942 -174834 327183 67309 21251 -308593 272800 -200171 64856 -6201 131917 -205243
11931b05857P1673A0086M9531K48513E896e6034l29629h4201k46873f1708A79730
11919c96258J67701e3835q904j71655H4241J34397P8707A30766h7340c3126k9549
11908f2675j33092k4023N0628C06391n3381b92607G8174J61770r4917b11486J5993
11897a95493A12658d1715k80914j26028A67744e4183q4996a5478B09902i6786
11886b12886a04594j32608C84N7402j4516c62162a58254C6191J09154k6369a88240
11874b59648Q4060A8353a23623p2629m9447E9398b51554H6021J6845j2500a43326
11862A02843a48749A85323c98014J48088E2553a45576j08175C07024A01604J12178
11852B13782d5662D7392h2317A85353c33240A75493n6436g2769A45869a30007
$$ plain form
11931 -205857 -134184 10086 59617 308130 5896 -56034 -385663 -84201 -331074 -61708 179730
11919 -396258 -228557 -53835 -62739 -234394 84241 218638 297345 130766 -87340 -33126 -62675
11908 -62675 -195767 -219790 -169162 306391 253010 -292607 78174 239944 145027 -211486 -195493
11897 -195493 112658 -41715 -322629 -448657 167744 -54183 -139179 -15478 209902 -96786
11886 -212886 -104594 -237202 384 57786 43270 -362162 -158254 36191 145345 118976 -188240
11874 -259648 -175588 18353 -123623 -196252 -245699 59398 -251554 86021 102866 90366 -143326
11862 102843 -148749 185323 -398014 -249926 52553 -145576 -253751 307024 101604 213782
11852 213782 -45662 47392 -82317 185353 -333240 175493 119057 -72769 145869 -130007
11841f1415j60677f0890E2711L80325k02654r0050f8415A18521b77157B2879J675
11830B4554b57735O4173N3541A46965f2354A03694L49369a23070E6145K11726
11820B67871I5405b87003a42022j51780J18786C8625h8233p3125A11050i6903
11809b63345a29471F2475B0099b4791j23253a3666A01289b87369a42248A95119
11798e8570F7489B0823M6652A0335K46040a3980A36299b36899M0608G7485K06351
11787B83836G8212a38118B7824M0414g3546k16754Q8264b5550j30651j44344C12617
11775A03751c7082j92095d2073i344B60918a73389D77310c13041A40911N7127
11765A98038b34100Q3023G2882C2795b30587B12443f1218B06916C6525b25681
$$ plain form
11841 -61415 -222092 -60890 52711 433036 230382 140332 -68415 118521 -277157 22879 24554
11830 24554 -257735 -193562 -140021 146965 -62354 103694 453063 -123070 56145 267871
11820 267871 95405 -287003 -142022 -293802 -175016 38625 -88233 -161358 111050 -96903
11809 -263345 -129471 62475 20099 -24791 -148044 -13666 101289 -287369 -142248 195119
11798 -58570 67489 20823 67475 10335 256375 -13980 136299 -236899 -196291 77485 283836
11787 283836 78212 -138118 27824 68238 -73546 -290300 -202036 -25550 -156201 -300545 312617
11775 103751 -37082 -229177 -42073 -9344 260918 -173389 477310 -313041 140911 198038
11765 198038 -234100 -151077 72882 32795 -230587 212443 -61218 206916 36525 -225681
11754C71324g43A37382d6288C33982g1910B63424e6112j75556B42325d4037E1445
11742A59520o3902c37860C28351i8159O603h347j02834A1077K13495q6458a57932
11730b25924i3304A778a18420a9870r4261d571l81764h5555J5642B57523j09797
11719A47726b4294l4741H1460L0206l2502b07584g6235C26426b551o066E3219
11707f2864j04248C431J33434g5830A23964n2763L5836M442a11805j56920G8094
11695B9990J50706J1026a65210A16139a04348G3120a76320b0750B47544F7678
11684E04541k38315A25427K8168G031L19999k7979F1338L17656c13506a39182
11673A21241J26822M5244A01980B2657b4984k56377h8077A61034c46563B33235
$$ plain form
11754 371324 -743 137382 -46288 333982 -71910 263424 -56112 -231668 242325 -44037 51445
11742 159520 95618 -337860 328351 -98159 -91556 -8347 -111181 11077 224572 138114 -157932
11730 -225924 -93304 1778 -118420 -19870 -114131 -4571 -386335 -85555 -69913 257523 147726
11719 147726 -24294 -59035 81460 111666 79164 -207584 -76235 326426 -2551 -8617 53219
11707 -62864 -167112 3431 136865 -75830 123964 71201 107037 111479 -111805 -268725 78094
11695 29990 180696 191722 -165210 116139 -104348 73120 -176320 -20750 247544 67678
11684 504541 266226 125427 153595 7031 327030 299051 61338 378994 -313506 -139182
11673 121241 248063 293307 101980 22657 -24984 -281361 -88077 161034 -346563 233235
11662a74925f2397G0335k3630b5190H5309a01346m6551F425L11099m375d19280
11650b2445G11J40661f5537A92306a10498C6089J21294J15962a1848j38301I4527
11638A08346a85535H6729C7000K5434K89701b2091B1943b39835E0619R2365N1320
11627A94304M4328a21473E0083a61138A55079b46269A87132a30095B20470K53840
11617D74310c5012D00372a37566A11761Q8948b15176A98706c69563E5246O3836
11607A19082B8919b92332I7973m4808Q2585b13570A38285c2159A92295g9100a9619
11595A6068a11283B57847a96423C4078c41668G1643a50269D47817J72822A13484
11584C20690L4944n9104b70725A51716Q4279K29551H3746b88899a5557I1300e1871
$$ plain form
11662 -174925 -62397 70335 46705 -25190 85309 -101346 -147897 6425 317524 313149 -419280
11650 -22445 711 141372 -65537 192306 -110498 36089 157383 273345 -11848 -150149 94527
11638 108346 -185535 86729 37000 62434 352135 -22091 21943 -239835 50619 142984 194304
11627 194304 238632 -121473 50083 -161138 155079 -246269 187132 -130095 220470 474310
11617 474310 -35012 400372 -137566 111761 200709 -215176 198706 -369563 55246 119082
11607 119082 28919 -292332 97973 53165 135750 -213570 138285 -32159 192295 -79100 -19619
11595 16068 -111283 257847 -196423 34078 -341668 71643 -150269 447817 620639 113484
11584 320690 355634 296530 -270725 151716 235995 465546 83746 -288899 -15557 91300 -51871
11572a18665I3987J29626i1377j380A73965a47406D92430b95663F2127j5416r328
11561C7383A4926L6431c3764A94553a21007B63865a4460C5525K1193J405a9724
11549C22378J21423A93941K8474C9106a06954d9388A16452l8731J20904A3467
11538B17862q8881a47237B00978f4531B13824I5214J64606p9864J94920L4933
11528D09809D5773h598C38889A47757B941M9105A5074b9722C5018K07775L6819
11517B79612K67938C3870J20746k6285J3568P1586m1013J99668A58286n1094J61137
11506B68329K40154B18126G9205L8859d3159F6876C102b51983A4318O2611N9359
11495A36288C0975J05074H547J84188B3223N3472p043d0875r7681B15937a0890
$$ plain form
11572 -118665 93987 223613 -91377 -92757 173965 -147406 492430 -295663 62127 46711 37383
11561 37383 14926 51357 -33764 194553 -121007 263865 -14460 35525 56718 58123 -19724
11549 322378 443801 193941 222415 39106 -106954 -49388 116452 77721 198625 13467
11538 217862 128981 -147237 200978 -64531 213824 95214 259820 179956 374876 409809
11528 409809 45773 -8598 338889 147757 2941 52046 15074 -29722 35018 242793 279612
11517 279612 547550 33870 154616 128331 141899 213485 172472 372140 158286 107192 268329
11506 268329 508483 218126 79205 118064 -43159 66876 3102 -251983 14318 76929 136288
11495 136288 30975 136049 8547 192735 23223 76695 69652 -40875 -138556 215937 -10890
11483C48616e9365C72329a96135e4549B55396j18921L05311A54181i6319B0081
11472B25912Q7081A28116o3001h7146C64869b08093c944B58876a2165F8820J30700
11461A99520P7228j22791A137g7990c1818B06786b3053B08665K6260O2455i2796
11449G3768g5158B76369I5287M1194D8176O7721L3233D0500J67285m6106A1467
11437D28875j54812J4413O7266c6190e739B78333C3489L66192I454J91138a35684
11425h8920B69149j22118a39645A07677h132k13754D5940i7772D8426n308a62812
11413D22216b83567A35353a43864B35489a20509k1183c6452A620J77298d7302
11402d683B53176G5839h951A38529L6221G4885b12674O9813I9099j2708L7781
$$ plain form
11483 348616 -59365 372329 -196135 -54549 255396 136475 441786 154181 -96319 20081
11472 225912 312993 128116 65115 -87146 364869 -208093 -3944 258876 -12165 68820 199520
11461 199520 276748 153957 1137 -77990 -31818 206786 -23053 208665 234925 297380 -92796
11449 73768 -75158 276369 95287 136481 48176 115897 149130 40500 207785 161679 11467
11437 428875 274063 288476 355742 -36190 -5739 278333 33489 399681 9454 200592 -135684
11425 -88920 269149 147031 -139645 107677 -8132 -221886 45940 -97772 48426 43118 -162812
11413 422216 -283567 135353 -143864 235489 -120509 -141692 -36452 1620 178918 -47302
11402 -4683 253176 75839 -8951 138529 174750 74885 -212674 -142861 99099 86391 124172
11391A24172J00090b23920b9650j0924j09872A24950b9100E4701f8582C61684
11380A16534b71752A05366b74722A3605K43567j07707b56435B0982J37245o812
11370A51415m8975a8984A16918L10254b42861O4540Q6368F8878f8481A80448a56894
11358B07823d7435k5624B24711G0778M4937a02847j9574A29555D4178a00057L9766
11347f0291B47117e06650B54523I6160f9855J065I258h9234A29021n2541J70202
11336B46682b16388B49728m9979F2741h2017a2959o46077A05085m1624a20984
11325d3303m7099l45592A0404b7174A7531a82637D4523N3364h3045h160m6026
11314e4186E1530J06384K8190a46759j07407B9028a59080B20726a07608k20786
$$ plain form
11391 124172 224262 -223920 -29650 -40574 -150446 124950 -29100 54701 -68582 361684
11380 116534 -271752 105366 -274722 13605 257172 149465 -256435 20982 158227 151415
11370 151415 102440 -18984 116918 427172 -242861 -178321 -91953 68878 -68481 180448 -156894
11358 207823 -47435 -73059 224711 70778 115715 -102847 -122421 129555 44178 -100057 -60291
11347 -60291 247117 -506650 254523 96160 -69855 -68790 9258 -89234 129021 76480 246682
11336 246682 -216388 249728 199749 62741 -82017 -12959 -659036 105085 63461 -120984
11325 -43303 -90402 -435994 10404 -27174 17531 -182637 44523 97887 -83045 -8160 -54186
11314 -54186 51530 157914 186104 -146759 -254166 29028 -159080 220726 -107608 -328394
11304c28394a23681L248B1102L2049Q1684f9721l3504K1051b1024l75742B01433
11292a2935C7831a27350C9167a42395A54463b02969f5189j7600p4990l991A9547
11280a34888C47654j19010b11281b7475A53256a12014a3556j21085a8862k55021
11270b73883J36324B52489e3465B1508b28096L3159C7562O1094N3591B376O1237
11259F3613b03768E0766J38532n7538d0324J4543A13271b48514j5538H6488O7078
11248A53566a81700p1246k6134B3360b47414C286J16651B3630g3769c1257C8706
11236f7310j02974c3251G4273a10050A77597j9931P6306f4779A42237b06453A67239
11224a04088I0927b07914A06217a39435k24489B24613b12740K7012Q3297B5810
$$ plain form
11304 -328394 -123681 -120433 21102 53151 134835 -69721 -103225 -82174 -21024 -396766 201433
11292 -12935 37831 -127350 39167 -142395 154463 -202969 -65189 -82789 -157779 -161770 19547
11280 -134888 347654 228644 -211281 -27475 153256 -112014 -13556 -134641 -18862 -273883
11270 -273883 -137559 252489 -53465 21508 -228096 -194937 37562 98656 152247 2376 63613
11259 63613 -203768 50766 189298 131760 -40324 -25781 113271 -248514 -264052 86488 153566
11248 153566 -181700 -252946 -279080 23360 -247414 3286 119937 23630 -73769 -31257 38706
11236 -67310 -170284 -33251 74273 -110050 177597 157666 233972 -64779 142237 -206453 167239
11224 -104088 90927 -207914 106217 -139435 -363924 224613 -212740 -185728 -102431 25810
11213f3547r8167D4438K5831j9067a49383e408A49a49108m1271b6646B98915B957
11200a44053N6533j94542B03591j01279a1001A00479a13684a6995j18933j88731
11190c24659a61800K2331d4880A00073O12B1249a05738j68409j20180D0645h923
11178A20977C8622I719a79146b4658A61375a10120A35010c40109J30644A73214
11167I2257b9405k80032a16118C27524H5158C1781M56438F5182J8317a69894c2430
11155B6526n927J9047b40250G6970b11575A24796R6785G0174a30618G5244a7865
11143B96857b51014A5107J15890C4957J46213B3182O63K03120A09504L5069o3814
11132H0759K33414e5742B2338i6347m1553O7834k65626A63344g4490n4053B92662
$$ plain form
11213 -63547 -161714 44438 70269 51202 -149383 -5408 149 -149108 -190379 -26646 298915 2957
11200 -144053 -87520 -282062 203591 102312 -11001 100479 -113684 -16995 -135928 -324659
11190 -324659 -161800 -139469 -44880 100073 100685 21249 -105738 -274147 -394327 40645 -8923
11178 120977 38622 9719 -179146 -24658 161375 -110120 135010 -340109 -209465 173214
11167 92257 -29405 -309437 -116118 327524 85158 31781 488219 65182 83499 -169894 -32430
11155 26526 20599 39646 -240250 76970 -211575 124796 221581 70174 -130618 75244 -17865
11143 296857 -251014 15107 130997 34957 181170 23182 23845 226965 109504 144573 80759
11132 80759 314173 -55742 22338 -96347 -137900 -70066 -335692 163344 -74490 -128543 292662
11120B34501O7102i3109j7821A7030a3114H9171J68707J5433a66158G2880J8925
11109I1805l8599R1879K70022j69228F4394K80221J1399J74321I3475K5516a14917
11097D771R4110O9967A7754K23705d9811C60418F0777M15434j52618M3807K5865
11086C93265C6466b677p4804q9590D52169o0300j73196J88540j36348J04793D7382
11074A47704J24030q5917L82738m1166o3708j4691A90832L84834q0052B25500
11063D93602J21573A02625K34843K60429J29027C13793L4066J39806P4823M0943
11053F03431J68037J82462k47689r2388K82772k18440R1548J87138J6865j66865
11043H06871r2496J70993n2135k30122J11358j52136L32326k24865j42733L86108
$$ plain form
11120 234501 301603 -93109 -110930 17030 -13114 89171 257878 273311 -166158 72880 91805
11109 91805 53206 145085 415107 245879 64394 344615 356014 530335 93475 118991 -114917
11097 4771 98881 168848 17754 241459 -49811 360418 60777 476211 323593 367400 393265
11086 393265 36466 -2677 -77481 -167071 452169 391869 218673 407213 270865 375658 47382
11074 147704 271734 185817 568555 527389 463681 448990 190832 575666 495614 225500
11063 493602 615175 102625 337468 597897 726924 313793 347859 487665 562488 603431
11053 603431 771468 953930 706241 613853 896625 678185 769733 956871 973736 806871
11043 806871 714375 885368 833233 603111 714469 562333 894659 669794 527061 913169
11033I13169j76973j39397j2957k22587K04737J12465P5735k63036J06328J51997
11023G49481p1917K12826j31636l47160L86781k72267J04841J0572k43240K86825
11013F85106L5656k83608O17036E00030J25629O3478l32633K27624j20313k24394
11003B39421K92289L453N3960K88518C72305K80670o7342J75735q6876P4729J2887
10992G62108l34202Q3209L55103j17591L66651k39473r1611K07568J77423q7173
10982A082012L09428k26401K82107l6572J66189M7628L75125N04336j24987K76983
10972B655848M93542k99482l3225P8752j74754k22450m29110p16k35591K38427
10962B071241k17377J5898J24547J83359p4141k71042R4079J30492q17112K25272
$$ plain form
11033 913169 736196 596799 583842 361255 565992 678457 754192 491156 597484 749481
11023 749481 677564 890390 758754 411594 798375 526108 630949 641521 398281 685106
11013 685106 720762 437154 1054190 500030 625659 689137 356504 584128 463815 239421
11003 239421 531710 535163 589123 877641 372305 652975 585633 761368 674492 749221 762108
10992 762108 427906 511115 866218 748627 1115278 875805 784194 991762 1169185 1082012
10982 1082012 1391440 1165039 1447146 1410574 1576763 1624391 1999516 2503852 2378865 2655848
10972 2655848 3149390 2849908 2816683 2895435 2720681 2498231 2069121 2068405 1832814 2071241
10962 2071241 1853864 1869762 1994309 2177668 2103527 1832485 1926564 2057056 1239944 1465216
10952A465216K11421p79604L0627Q7298m17416C2716P71518C95873Q5916C6338
10941A46594L24961o1614A24716D0451a719H7432Q8738h3656b3873C96637N5572
10930D52209b80673B35268E3731K44583j23649c7665I8015i769C1169J48504h2052
10918A30968n5515a64765K0575N1529A64927a82009Q7413j17755A12289f2593
10907A38968J19257A27100b4297C62532m4415a90887G6317J75934K5579a80544
10896b6650p1658A84716h1310F3083f5132j47522b2129j36991e5627k13979i9715
10884c7312o2664K1944k09425J37440C6466e0196I6868m0197b06181P3191k93377
10873d26367e2991A18858b23338A75725G8985j5665A5885h9376G6275K2061e3147
$$ plain form
10952 1465216 1676637 897033 927660 1014958 597542 32716 804234 395873 481789 36338
10941 146594 471555 409941 124716 40451 -1719 87432 176170 -83656 -23873 396637 452209
10930 452209 -280673 235268 53731 298314 174665 -37665 98015 -9769 31169 179673 -82052
10918 130968 75453 -164765 -144190 -92661 164927 -182009 -94596 -212351 112289 -62593
10907 138968 258225 127100 -24297 362532 318117 -190887 76317 252251 277830 -180544
10896 -26650 -98308 184716 -81310 63083 -65132 -212654 -22129 -159120 -55627 -269606 -99715
10884 -37312 -99976 -78032 -287457 -150017 36466 -50196 96868 56671 -206181 -132990 -426367
10873 -426367 -52991 118858 -223338 175725 78985 63320 15885 -89376 76275 98336 -53147
10861d5782E2418J97292B6306F074b923B3483N2029a38775A88429h2220j65471
10850b47691G450f2407m5232A06814b62493a21659D3643L5934h9228C56538a33283
10838F3046M6069j2676h4601k7890F5705f7930A63100a6842k64175a0318A4655
10826a55817E3311L40653f6005o4662D0631J7431a33296e2130C26377a82621r8285
10815b80906B53213a38333C30188A2288L4912O477h8340K7192j30447E6480c5067
10803a99924c600k909C58857e9774A01498b12039A19958f8215k09653a8964l44534
10792c63498A5353a08894b3629P2j91219c5050j21221A5237a1244k3178j03950
10781a38372c7210j43637j03870F3531A5761c17794a214l1333J2414A80488b44821
$$ plain form
10861 -45782 52418 249710 26306 6074 -2923 23483 75512 -138775 188429 -82220 -247691
10850 -247691 7450 -62407 -107639 106814 -262493 -121659 43643 79577 -89228 356538 -133283
10838 63046 109115 96439 -84601 -112491 65705 -67930 163100 -16842 -281017 -10318 14655
10826 -155817 53311 393964 -66005 -130667 40631 58062 -133296 -52130 326377 -182621 -280906
10815 -280906 253213 -138333 330188 12288 47200 53677 -88340 -61148 -191595 56480 -35067
10803 -199924 -3600 -6509 358857 -59774 101498 -212039 119958 -68215 -277868 -18964 -363498
10792 -363498 15353 -108894 -23629 -23557 -214776 -35050 -156271 15237 -11244 -34422 -138372
10781 -138372 -37210 -180847 -284717 63531 15761 -317794 -1214 -32547 -20133 180488 -244821
10769b32734c6105A16076e7633j4888l1116i424k77179B95207j21661D2752g4436
10757a36561A99849c5118n8719K0760q035J9063K2625l63310A8073a53831A19544
10745d69745A16599m494J29285b26516B49740E242b89632A30633b71495B18313
10734D0904K81595b09693A87176h0119B14296a06160b8904H9992C6327c1511A58085
10722a09870d3456k70985a25475L7636o8141b9428l30661N5834a00107B39149
10711D0228J8027b66413e1337j63716a1210p019I5035a49147n2195B61038d07997
10699b26233C371e02955A6018b4439A27043a71891E4087c12816J32959j05248
10689b85105i2488I1186a57154j08052A38885O9817a10257L2963j40182a9288
$$ plain form
10769 -232734 -36105 116076 -57633 -72521 -103637 -9424 -286603 295207 173546 42752 -74436
10757 -136561 199849 -35118 -93837 -73077 -81112 -62049 -39424 -402734 18073 -153831 119544
10745 -469745 116599 112105 241390 -226516 249740 5242 -289632 130633 -271495 218313
10734 40904 322499 -209693 187176 -80119 214296 -106160 -28904 89992 36327 -31511 158085
10722 -109870 -43456 -314441 -125475 -87839 -155980 -29428 -360089 -304255 -100107 239149
10711 40228 58255 -266413 -51337 -215053 -11210 -18229 95035 -149147 -201342 261038 -407997
10699 -226233 3371 -502955 16018 -24439 127043 -171891 54087 -312816 -179857 -285105
10689 -285105 -92488 91186 -157154 -265206 138885 208702 -110257 -77294 -217476 -19288
10678A21500K04411c34178a20493m392f1690m6732F607a25A39209F1341a24927
10666B68728j01083L57228A49471B6443h7285C20772B1266c66738i1605L6579
10656e5026A67644b583I2269l9828O5573h3786l0280m31155a32405G5259k7607
10645D7652a8565j4887a1493F3076P3184e4642A24543a11064o6003E0729J39385
10634A90114G2454a88533J6943k81509E9017J96255c04289C11441a4201F5822
10623a48582e0394B51536d0462l20200J80006c3341m33238d8426N334j97383N8156
10612a82319j57242A3766P2891O8329a46186p604q0499h0852j3994Q075k02489
10601b89260J30752D2554J01692b16537C2793a9941j4515B00405d2310j78074
$$ plain form
10678 121500 325911 -334178 -120493 -124885 -61690 -108422 6607 -125 139209 61341 -124927
10666 268728 167645 524873 149471 26443 -87285 320772 21266 -366738 -91605 -55026
10656 -55026 167644 -2583 92269 52441 118014 -83786 -114066 -545221 -132405 75259 47652
10645 47652 -18565 -33452 -11493 63076 136260 -54642 124543 -111064 -177067 50729 190114
10634 190114 72454 -188533 -171590 -453099 59017 255272 -304289 311441 -14201 65822
10623 -148582 -50394 251536 -40462 -360662 -180656 -33341 -466579 -48426 -43092 -240475 -182319
10612 -182319 -339561 13766 86657 154986 -146186 -153790 -234289 -80852 -94846 -86771 -289260
10601 -289260 -158508 42554 144246 -216537 32793 -19941 -34456 200405 -42310 -220384
10591b20384b4966A4875b82846n6054A90160K5808a20106e2808j26011B10649
10580E0849a28121L7207l4665p5463B8012J25968G6926J66597c23166I0315J26783
10569B17098d4549A08543g9954B53753I1041Q5280L3517E6464j8257d55235C1389
10557b19095a04813K8860l1041A81814a88514M0256D4525e7125q5031N1082j39542
10546b30616A47712b89937A05957J19912a09547p5056N2157B75425C553b86107
10535b33112P4494B4846J35635a50135N5166B81569a31871m21775a63660B00914
10524H7716N2913c63680J68659G2314a60607O8872d1572j91575A41971c27173
10513B2296L809J62622a89355i0037o091C59638A09170P3396f7929j06503D6872
$$ plain form
10591 -220384 -24966 14875 -282846 -338900 190160 215968 -120106 -52808 -178819 210649
10580 50849 -128121 -90914 -125579 -201042 28012 153980 76926 243523 -323166 90315 217098
10569 217098 -44549 108543 -79954 253753 91041 176321 209838 56464 38207 -455235 31389
10557 -219095 -104813 -75953 -106994 181814 -188514 -148258 44525 -57125 -142156 -91074 -230616
10546 -230616 147712 -289937 105957 225869 -109547 -184603 -132446 275425 3553 -286107
10535 -233112 -158618 24846 160481 -150135 -94969 281569 -131871 -553646 -163660 200914
10524 87716 140629 -363680 -195021 72314 -160607 -91735 -41572 -233147 141971 -327173
10513 22296 26105 188727 -189355 -90037 -96128 359638 109170 182566 -67929 -174432 46872
10501A45327R174e3404B53087b05206A6681b62319m4466F1419a78592A88772a55752
10489A47431J36780D767N7757K42550l1622B4682c6956A56455L02305L53005B30394
10477A4894e722D6642g7668E6331J42860l9107b5044P172e719D2190c72566F1326
10464a27381b4955B36865b08014B43943D0217M26542A37840b54673j52220c9094
10453A76256F7846b88166A84010p5356a03071B31600n847i0574q3482b6479j38455
10442a64934P903D7338M13623b04691C059a50762j33174A67971b63679C0663a63489
10430b7388m9386A1011R1177c7859H8855c31140e0005o114o3908A49083J6394
10419A65477B7190a95347B6788J47418n2803j3082Q5132c7174I6489f0805B53381
$$ plain form
10501 145327 154501 -53404 253087 -205206 16681 -262319 -306785 61419 -178592 188772 -155752
10489 147431 284211 4767 62524 305074 273452 24682 -36956 156455 458760 811765 230394
10477 14894 -5722 46642 -77668 56331 199191 160084 -25044 -17872 -5719 42190 -372566 61326
10464 -127381 -24955 236865 -208014 243943 40217 466759 137840 -254673 -406893 -39094
10453 176256 67846 -288166 184010 108654 -103071 231600 225753 -90574 -174056 -26479 -164934
10442 -164934 -157031 47338 460961 -204691 3059 -150762 -283936 167971 -263679 30663 -163489
10430 -27388 -76774 11011 102188 -37859 88855 -331140 -50005 -56119 -120027 149083 165477
10419 165477 27190 -195347 26788 174206 121403 108321 193453 -37174 96489 -60805 253381
10407A13260b46509A39403K0674E1867r020l177J86616a86800F9778a22505j90646
10396c13151A28616n6480k1954D498L305K18276J02741B7707K87198b00632B03546
10384A51641e5136F05383c9042B2608J75108D1523r810J22574K91544H5455K08182
10373B93637J43322K5196A29793K96056k09139K83026k2349r7657L16898m8474
10363F48154B89331j33321L30577A26853N8988J32539J27757C6881K34605m748
10353B66738L93178j8208q4392J08116B99964J70129j23329q7782J49649p1409
10343C37222n4497l798r6985m7188i1212A49700j6001P2378j5105J1165F8886
10331H7594a97567A32439d1410C9754P8312J71149B4012R6089K25124p2914h7101
$$ plain form
10407 113260 -246509 139403 160077 51867 42847 39670 226286 -186800 69778 -122505 -313151
10396 -313151 128616 72136 50182 4498 7803 226079 328820 27707 314905 -200632 203546
10384 151641 -55136 605383 -39042 22608 197716 41523 31713 154287 445831 85455 293637
10373 293637 436959 462155 129793 425849 216710 499736 477387 379730 696628 648154
10363 648154 289331 156010 486587 126853 185841 318380 446137 36881 271486 266738
10353 266738 659916 641708 557316 665432 299964 470093 346764 258982 408631 337222
10343 337222 282725 278927 181942 134754 -91212 149700 133699 206077 190972 202137 68886
10331 87594 -197567 132439 -41410 39754 118066 289215 24012 120101 345225 272311 -87101
10319D85145j42252C8805J27821k4528k8168l7186h1968A629Q389O3890a79937
10307I4922d97208A49263i5632j93999B81514c54696a08680K8182A06072b43217
10296A36161M033J0330d7340k84883D14618b7126G6439h9321A11066b10953F7235
10284a49663N1887A47378c27542A3229d7156j98779b0375j01728A84493L3862
10274B18355b9696B1140K68173c1546k18465A83848q7690h4363F3051A1268J9233
10263C0501g247D4630M50258k24611L18264B55791K56058A32708b65693B06001
10252a13579D5390b06841A88682a44185a8290j77934G2603c46440a35537j74082
10242c09619i8872G1492J44489F4856J80318a96520Q0041M4001B27876n1706d9982
$$ plain form
10319 485145 342893 38805 166626 142098 113930 76744 -81968 1629 10018 73908 -179937
10307 94922 -497208 149263 -95632 -289631 281514 -354696 -108680 -80498 106072 -243217
10296 136161 140194 150524 -47340 -332223 414618 -27126 76439 -89321 111066 -210953 67235
10284 -149663 -97776 147378 -327542 13229 -47156 -245935 -20375 -122103 184493 218355
10274 218355 -29696 21140 289313 -31546 -250011 183848 96158 -84363 63051 11268 30501
10263 30501 -7247 44630 494888 270277 588541 255791 511849 132708 -265693 206001
10252 -113579 45390 -206841 188682 -144185 -18290 -196224 72603 -346440 -135537 -309619
10242 -309619 -98872 71492 215981 64856 245174 -196520 -116479 -72478 227876 176170 -49982
10230B8508N1469d96090K03351D5547a11286D4205j0651e3466B31596a20377o4324
10219a84701p251B65518A7968J79774c60787i6454C44744C9516h8286j78796R5183
10208a71899M0686l0325q4661i4470F683L5128b98329d4505j34583Q5897E2192
10196D5505N9914b63692C56469A24623J7182c54045a69280A24106h6910E7467
10185c15828B00562h9418A56850a54034r6281A90961J6042a6210E705a0339j00361
10174a10700e710A11866A6780a84915E3348c8135l86053a61302D8425c1336j6384
10163d7720I0044c39731A87890g3167F1871h4726k71529i8868I0054b02542j503
10152b04045f2167a9395E696a46782d3137B86063a80376a7947p630j07304L7122
$$ plain form
10230 28508 79977 -496090 -292739 45547 -111286 44205 33554 -53466 231596 -120377 -184701
10219 -184701 -191952 265518 17968 197742 -360787 -96454 344744 39516 -88286 -267082 -171899
10208 -171899 -131213 -161538 -246199 -94470 6683 41811 -298329 -44505 -179088 -93191 52192
10196 45505 105419 -263692 356469 124623 141805 -354045 -169280 124106 -86910 57467
10185 -315828 200562 -89418 156850 -154034 -250315 190961 207003 -16210 5705 -10339 -110700
10174 -110700 -5710 111866 16780 -184915 53348 -38135 -424188 -161302 48425 -31336 -47720
10163 -47720 90044 -339731 187890 -73167 61871 -84726 -356255 -98868 90054 -202542 -204045
10152 -204045 -62167 -19395 5696 -146782 -43137 286063 -180376 -17947 -25577 -132881 -95759
10141i5759k87070a15839o3323b2914j73125j53173A57882k9686d20781B12794
10130d2029o2135j1225A48501f3935A62275e3560G7141f7325a9735A61078a56268
10118A23336a18246j06566a08207d7388K2429A58750E6910i1669k2655A64947
10107b27073e6743j0527A3857J01787J41145b4035H238J19818B8930e0691j59449
10096b10140e6013j15398J8541g4997D722J43168n5365a84097k36644J01796d0729
10084a25943b9505A18080e4418r782A38718k9603J217O9247h7194p9243l6364
10073b02801d1257F6655J80521A11588R358b29803R8326A67641b79317A24909
10062A20090b6971A33152c1392H0364B4799a84789j49949L5817G465a47052A29033
$$ plain form
10141 -95759 -382829 -115839 -179162 -22914 -196039 -349212 157882 128196 -420781 212794
10130 -42029 -104164 -115389 148501 -63935 162275 -53560 77141 -67325 -19735 161078 -156268
10118 123336 -118246 -224812 -108207 -47388 -24959 158750 56910 -91669 -114324 164947
10107 -227073 -56743 -67270 13857 115644 256789 -24035 8238 128056 28930 -50691 -210140
10096 -210140 -56013 -171411 -152870 -74997 4722 147890 92525 -184097 -420741 -318945 -40729
10084 -125943 -29505 118080 -54418 -64200 138718 109115 110332 179579 -87194 -166437 -202801
10073 -202801 -41257 66655 247176 111588 120946 -229803 -131477 167641 -279317 124909
10062 120090 -26971 133152 -31392 80364 24799 -184789 -334738 -298921 7465 -147052 129033
10050A11912a87907h1349B9684a72556c7764j56861E95a65513j85064A60448b91
10038a08654m2618n1009j72800E8738b04406j00338a19382r7397a998k67800J33259
10027a36539E5814D811K03227N704r8233b37134A69547f1638G4910b50963d2909
10015a02359B0260K6244E044a36988j024k62020a63163A47097b41268n7691a18991
10003A35106a18423A46337a1445A45418c13564A9176a40629A1493a55895G3267
9992a23186j34600C7094F947b7310C47821A53124a0188k35485M9308A6207P1574
9981H7781b03766A66952M8101c38480h994j45046M2803j3067A57794H910J18429
9970A27339a10293B23414i7598G2457c49895d6864A83483a77640O6016K8435A0953
$$ plain form
10050 111912 -187907 -81349 29684 -172556 -37764 -194625 595 -165513 -350577 160448 -291
10038 -108654 -151272 -202281 -375081 58738 -204406 -304744 -119382 -216779 -1998 -269798 -136539
10027 -136539 55814 4811 208038 213742 115509 -237134 169547 -61638 74910 -250963 -42909
10015 -102359 20260 46504 5044 -136988 -138012 -400032 -163163 147097 -241268 -298959 -118991
10003 135106 -118423 146337 -11445 145418 -313564 19176 -140629 11493 -155895 73267
9992 -123186 -257786 37094 6947 -27310 347821 153124 -10188 -245673 -196365 16207 87781
9981 87781 -203766 166952 215053 -338480 -8994 -154040 -111237 -124304 157794 8910 127339
9970 127339 -110293 223414 -97598 72457 -349895 -46864 183483 -177640 -111624 -83189 10953
9958g1468F5225J0498b04101i9458L6353C68893F8536a2733n7123c0153o4374
9947i4527b9943B50419n0566A6335b42352A39970f8657m06492f0615F7990b3722
9935b32238j2729A77679b87864R7139R4911F7993a25285n0422k33386i2905o2703
9924a55608A34291a05730k24362b0099k0175C13350a51222H4064i7616j39779
9914b37395g9089G8788R3473c46226B93201i0203A51062R4696h7353n9530D6473
9902B40673a80512a697j44137o3642N3090H1599b22898N0910n529K1124M4291
9891a12102B3372b73614N5055B80342b26142h7343j57024E7066J31166a02490
9880c64705h5920D7294a64650o9751N156O7545j36824g9108A69814F5490g4132
$$ plain form
9958 -71468 65225 75723 -204101 -99458 -63105 368893 68536 -12733 -69856 -30153 -94527
9947 -94527 -29943 250419 199853 16335 -242352 139970 -68657 -475149 -60615 67990 -23722
9935 -232238 -244967 177679 -287864 -190725 -95814 67993 -125285 -175707 -409093 -92905 -155608
9924 -155608 134291 -105730 -330092 -20099 -40274 313350 -151222 84064 -97616 -237395
9914 -237395 -79089 78788 172261 -346226 293201 -90203 151062 245758 -87353 -146883 46473
9902 240673 -180512 -1697 -145834 -209476 -156386 81599 -222898 -171988 -177517 -156393 -112102
9891 -112102 23372 -273614 -218559 280342 -226142 -87343 -244367 57066 188232 -102490
9880 -364705 -85920 47294 -164650 -234401 -229245 -161700 -298524 -79108 169814 65490 -74132
9868I2013b22740H0926b65268n8857o6232J55245b6085I4721g7180j18595d014
9856a50952g3268k57254f1272C6020a1417B53789i9634G3609J60566j00271j5225
9845A18679l8005b11616o3154O7647f8391k94403B3690J99548a33944j10623J10982
9834a33585d4377J4498j90700G799a54126k15760d0687B3504L8243b81921f657
9822i9551p0003K1123N4114a4845q0546H7577R5116b53985I810N3585J32665e1046
9809b08757r3012b9849p2351k78018f0288j67791C9819M8233d6748k55433a13459
9797F5408b37833r5711I8401c84048c7524r744A50654b35410l5391c9494G2038
9785a32340M2751f398A73247a46680A8082J1478P8529J60099h4727I4938a20801
$$ plain form
9868 92013 -222740 80926 -265268 -324125 -390357 -235112 -26085 94721 -77180 -195775 -4014
9856 -150952 -73268 -330522 -61272 36020 -11417 253789 -99634 73609 234175 133904 118679
9845 118679 80674 -211616 -274770 -207123 -68391 -362794 23690 223238 -133944 -244567 -133585
9834 -133585 -44377 -29879 -220579 7799 -154126 -369886 -40687 23504 61747 -281921 -6657
9822 -99551 -169554 -148431 -94317 -14845 -95391 87577 182693 -253985 9810 63395 196060 -51046
9809 -208757 -301769 -29849 -102200 -380218 -60288 -228079 39819 88052 -46748 -302181 -113459
9797 65408 -237833 -333544 98401 -384048 -37524 -47268 150654 -235410 -270801 -39494 72038
9785 -132340 -89589 -6398 173247 -146680 18082 29560 108089 268188 -84727 94938 -120801
9773e4469n7352k4190D1619b48132d1488k50213B51641a09829B08760b58401a05674
9761c18650A19003i9940I6350B0749a02434j62384e3850B43826G3982o480c21799
9749H2804K94794n3044b45539I9402b0054A83330i1447j75458b5463A50448a01712
9737a7909j04611A62460k6599a79836n0540A10846R7617a02127k2019B4839b62008
9725I4638k9675d48870c121D9647h5256H0058d7116C6662J61190k9941A0352a75004
9712H4176c82795a2901m86166g6101A8785M4479B0163J75719a64128P4730r8324
9701a87722A79280b54707C32276a79257B3610P1793R3763i411B19330d3358j7570
9690f0928o4619H5560J45768b38459f9052o9449j93374R7951g614A98006E3083
$$ plain form
9773 -54469 -111821 -136011 41619 -248132 -41488 -291701 251641 -109829 208760 -258401 -105674
9761 -318650 119003 -99940 96350 20749 -102434 -264818 -53850 243826 73982 67502 -321799
9749 82804 377598 324554 -245539 99402 -20054 183330 -91447 -266905 -25463 150448 -101712
9737 -17909 -122520 162460 135861 -179836 -230376 110846 208463 -102127 -124146 24839 -262008
9725 94638 64963 -448870 -3121 49647 -85256 80058 -47116 36662 197852 167911 10352 -175004
9712 84176 -382795 -12901 -499067 -76101 18785 63264 20163 195882 -164128 -89398 -187722
9701 -187722 179280 -254707 332276 -179257 23610 95403 189166 -9411 219330 -43358 -60928
9690 -60928 -125547 85560 231328 -238459 -69052 -138501 -331875 -233924 -7614 198006 53083
9678c09295G3161A9469a44254F1327n640G42a63372m1945c9308B41055d32300
9666b28520A69406a56108k87464a78565O9645n3685e1571j92014C7800K203K76249
9655C16252a52237A565O6957a89253m1349N6493h4764E0231b45207J08271m4083
9644a81019j0664D4400M2289k9301a21098f246C0843a18916j3834j14103A68517
9632c31929a39503E665b9571A83567b17971e8381D1173J22944F759a04220r5751
9621a99971A00106a69984k11453F5751K41694j52853a36556n6916j3134r1218
9611b97824A7506J40095i7741c0439A749a69245r1053A77563a4607r7725c5902
9599a84648A99267L4487D3615O6650b43571h1643j64448r4267b5838k49963N8378
$$ plain form
9678 -309295 73161 19469 -144254 61327 55687 742 -163372 -205317 -39308 241055 -432300
9666 -228520 169406 -156108 -443572 -178565 -108920 -162605 -51571 -243585 37800 40003 316252
9655 316252 -152237 1565 68522 -189253 -230602 -174109 -84764 50231 -245207 -136936 -181019
9644 -181019 -191683 44400 86689 57388 -121098 -6246 30843 -118916 -132750 -246853 168517
9632 -331929 -139503 5665 -29571 183567 -217971 -58381 41173 164117 6759 -104220 -199971
9621 -199971 100106 -169984 -381437 65751 307445 154592 -136556 -193472 -206606 -297824
9611 -297824 17506 157601 -97741 -30439 1749 -169245 -260298 177563 -14607 -112332 -35902
9599 -184648 199267 233754 43615 110265 -243571 -81643 -246091 -340358 -25838 -275801 -217423
9588b17423K0751j30721B9743a69901A20083G96c898H3507P7138i8811j03649
9577b02460d9715D20920b98133g2053m6898A20215b5299k31051J4129L9850l239
9566b05610a4804l48166B6818b3024l12479a53135q3365f9816G2618H788L2773
9555D1561J62615a06616r8048h0091q0656M3542j6531A17661f3k80982F8679P4179
9543A42858N9094H8545K9552F205a1731j65521P1607j2957B46127b18619I7683
9531a63309J7520j18655g6550n2904C6468c2359D5039g4035k77120a30986O3879
9520f7107k38013A24840c05175J0667d9730p3640j14105C9158K33801b10086E0771
9508B078a48508j85445j4455g7676o5678n3724n2343f0716b5115j58141h1559
$$ plain form
9588 -217423 -196672 -327393 29743 -169901 120083 796 -3898 83507 160645 -98811 -202460
9577 -202460 -49715 420920 -298133 -72053 -118951 120215 -25299 -256350 -242221 -202371 -205610
9566 -205610 -14804 -362970 26818 -23024 -335503 -153135 -236500 -69816 72618 8788 41561
9555 41561 204176 -106616 -204664 -80091 -160747 -117205 -133736 117661 -63 -281045 68679 142858
9543 142858 201952 88545 118097 6205 -11731 -177252 -105645 -118602 246127 -218619 97683
9531 -163309 -145789 -264444 -76550 -129454 36468 -32359 45039 -74035 -351155 -130986 -67107
9520 -67107 -305120 124840 -305175 -294508 -49730 -123370 -237475 39158 272959 -210086 50771
9508 2078 -148508 -333953 -348408 -77676 -143354 -197078 -249421 -60716 -25115 -183256 -81559
9496A09541J76275b03122M1567M9489j03663B3365b616j84529G9877m377i9384
9484a40826M0998d52I6680B5958a45870A15302b41099c8250j91032j25888f0232
9472B47187E5333i4354M5761j17898M6292j42608H5821L6757o0393m147L9208
9461I7246b82989b2689o3405D5581a19646j03456B91842a30557A22712a27189
9450a2540j63514j15027R4552H821J7317b9726j47451M2099N8637I6473f931j25099
9438a32030A02826a31142N5499K7527B20963F5328M7427B2892a2584p3111A288
9426C1029a81693m3960G9604d1832A12059B5468i9502j35977A45627b24454a8772
9414A69376b90113I2245a26362A26522J15211G6412a71530j72737d7504B01456
$$ plain form
9496 109541 285816 -203122 -161555 -112066 -215729 23365 -2616 -187145 79877 75500 -99384
9484 -140826 -99828 -452 96680 25958 -145870 115302 -241099 -38250 -229282 -355170 -60232
9472 247187 55333 -94354 -48593 -166491 -120199 -262807 85821 122578 62185 58038 97246
9461 97246 -282989 -22689 -86094 45581 -119646 -223102 291842 -130557 122712 -127189
9450 -12540 -176054 -291081 -196529 8821 26138 -29726 -177177 -135078 -76441 96473 -6931 -132030
9438 -132030 102826 -131142 -75643 -48116 220963 65328 112755 22892 -12584 -85695 1288
9426 31029 -181693 -225653 79604 -41832 112059 25468 -99502 -235479 145627 -224454 -18772
9414 169376 -290113 92245 -126362 126522 241733 76412 -171530 -344267 -47504 201456
9403A3791a16728D110a5592A09366E3986M1376R0896a02988H148c87518B5648
9391a50058k251p946C8210c95203B74605j25038J54761c7485j81993o8927B4944
9379b17439A144L9922a77352K637g3534D5529d47678e3243A08477h1132A28207
9367B4693b29050D5942c1067B34257f5507A68951a47717j0833C9656N572b98670
9355b94074a19809B49479A6557a37899M6325J7080c0849n8949k35095E789a68585
9343h7869k69977J2086R1663a12456k13115A12892g1655k68966B75896J10828
9333C86724a80673m4788J06122A92105q1194J89785a8985j84956Q4520b3464j08328
9322a31792A39492J91851i7571A07165J26435c51971C5896d9925q3508N9727j19132
$$ plain form
9403 13791 -116728 4110 -15592 109366 53986 95362 186258 -102988 8148 -387518 25648
9391 -150058 -152309 -160255 38210 -395203 274605 149567 304328 -37485 -219478 -288405 24944
9379 -217439 1144 41066 -177352 -174715 -73534 45529 -447678 -53243 108477 -81132 128207
9367 24693 -229050 45942 -31067 234257 -65507 168951 -147717 -158550 39656 45228 -298670
9355 -294074 -119809 249479 16557 -137899 -91574 -74494 -30849 -89798 -324893 5789 -168585
9343 -87869 -357846 -345760 -254097 -112456 -325571 112892 -71655 -340621 275896 386724
9333 386724 -180673 -225461 -119339 192105 110911 300696 -18985 -203941 -119421 -23464 -131792
9322 -131792 139492 331343 -97571 107165 233600 -351971 35896 -49925 -133433 -73706 -192838
9311a92838q730A11260h9746A3183i1445l91938A51017F7017O7209A3310K51429
9300B64739K6400a70580A8793b15499A69008B1796K4505c92502J76192b8909A2116
9288B09691C8132d83502a45694A9397a97C12372A42968e3691k39205J02226b1411
9276a68791A29863i0996l71740K25301A46485a50057g0358k99676d2856j35737
9266a78593N7521I9533A2376R5582J1494d861k92116C9122L6833J5880a86607
9254B3032f6278A28521c14122l81837B68569c97514F2730d1658j27379c7672B1690
9242A43393a20538K2868B0706J79986i4973A86178A1392l24d5107b0017F9631
9230a63357C33823e8200B3914M4591e8449j22310L4454K1515o3547b5749k03978
$$ plain form
9311 -192838 -201568 111260 -89746 13183 -91445 -483383 151017 67017 134226 13310 264739
9300 264739 291139 -170580 18793 -215499 169008 21796 46301 -392502 -216310 -28909 12116
9288 209691 38132 -483502 -145694 19397 -197 312372 142968 -53691 -292896 -190670 -21411
9276 -168791 129863 -90996 -462736 -237435 146485 -150057 -70358 -370034 -42856 -178593
9266 -178593 -121072 99533 12376 107958 119452 -4861 -296977 39122 75955 91835 -186607
9254 23032 -66278 128521 -314122 -695959 268569 -397514 62730 -41658 -169037 -37672 21690
9242 143393 -120538 -97670 20706 200692 -94973 186178 11392 11068 -45107 -20017 69631
9230 -163357 333823 -58200 23914 68505 -58449 -180759 -146305 -124790 -188337 -25749 -229727
9219b29727P1973j29964k5833E9159a17863K8671b7082k48205G0876k0811b80464
9207C9839a65073d5796A54127b26599k426g3812A28483b6587j54053H1402a63989
9195a81884A6293M5923a08767p8335A27501D4676g7036j54921R1848C19467f1952
9183e8944m3665d5858d188l28712A21256n7595a52572F8528a06107M128l09537
9172d11516J76222R0493f9185b4875C99784j17169o1834b78597D04869G4519J06747
9161A81266a90473H2141b05661A38865O8682l3047g0754F0707N111a07669H7966
9149A00075d441A2670J69501f9166F2416J7810a34442B6726P7391a60307K9013
9138a31294C65539a33696A58202a2359j20430A09055a80263j02040e8203R803
$$ plain form
9219 -229727 -157754 -287718 -313551 59159 -117863 -89192 -27082 -275287 70876 50065 -280464
9207 39839 -165073 -45796 154127 -226599 -229025 -73812 128483 -26587 -180640 81402 -163989
9195 -181884 16293 62216 -108767 -187102 127501 44676 -77036 -231957 -140109 319467 -61952
9183 -58944 -102609 -45858 -4188 -332900 121256 63661 -152572 68528 -106107 -101979 -411516
9172 -411516 -235294 -144801 -69185 -24875 399784 282615 220781 -278597 404869 74519 181266
9161 181266 -190473 82141 -205661 138865 207547 174500 -70754 60707 65818 -107669 87966
9149 100075 -4441 12670 182171 -69166 62416 80226 -134442 26726 104117 -160307 -131294
9138 -131294 365539 -133696 158202 -12359 -132789 109055 -180263 -282303 -58203 -48400
9128d8400p6476j3974B89390a98395a1518A9355J6441P4537M6207b16714A80502
9116d9040k08892R6937f7662m00656i6871A05936a64970k10203h7234G0429J04457
9105A74886G5264o217a03926j70884c2357n551o2514j3841e6357b4957p9339A50576
9092A36366F7696O4373J3966a49949f0675C16199H3956B4376a56204r1012D0642
9080a13288j93661A87495a17566J5370k16073a00086j22075b5371l28814J61905
9070a92280j3339b6426A07972M4597F1831K11004c1951j6812k73218d0678j24989
9059a65667A24860h1382j74663A39934m7039d2935j77335D2194j4972b11563j02972
9048c14535n074j84464B52841b85161A06875L82481b52771m7870F6402a54209
$$ plain form
9128 -48400 -124876 -138850 289390 -198395 -11518 19355 35796 110333 156540 -216714 180502
9116 -49040 -257932 -160995 -67662 -468318 -96871 105936 -164970 -375173 -87234 70429 174886
9105 174886 75264 69047 -103926 -274810 -32357 -37908 -100422 -114263 -56357 -24957 -104296 150576
9092 136366 67696 132069 146035 -149949 -60675 316199 83956 24376 -156204 -247216 40642
9080 -113288 -306949 187495 -117566 -102196 -318269 -100086 -222161 -25371 -354185 -192280
9070 -192280 -205619 -26426 107972 152569 61831 272835 -31951 -48763 -321981 -40678 -165667
9059 -165667 124860 -81382 -256045 139934 92895 -42935 -220270 42194 27222 -211563 -314535
9048 -314535 -319609 -504073 252841 -285161 106875 489356 -252771 -300641 66402 -154209
9037i2201L2971a2964H1180c54763P2043J00846a3805A68129A2147K20766D6150
9025D1392J64694a43262B19542Q121a08508I2007J50940H4539d0397k63672n089
9014c09158g6775C9173b98893a076D8483e3036D8993b83975J2905A25296a28888
9002A98992b98521P6388N0866A12808b74010a11496B58945b22253j26564a72774
8991d8429p7241A5842a25921A55311b21237C2124K3612c32428b5875g005m6004
8980e3009b3077A77041c65209M2970J34979B66204b1007B24127b7666A6045b64052
8968I1122P176g7115p8552j10924O7329n3149A48782J716h9961j16260P8010p9080
8956b07291B07742a08420j42217g7169G0862j5710b91013a0105j97511a4183A50572
$$ plain form
9037 -92201 -59230 -12964 81180 -354763 -282720 -181874 -13805 168129 12147 232913 46150
9025 41392 206086 -143262 219542 227663 -108508 92007 242947 84539 -40397 -304069 -309158
9014 -309158 -76775 39173 -298893 -1076 48483 -53036 48993 -283975 -271070 125296 -128888
9002 198992 -298521 -222133 -171267 112808 -274010 -111496 258945 -222253 -348817 -172774
8991 -48429 -125670 15842 -125921 155311 -221237 32124 55736 -332428 -25875 -7005 -53009
8980 -53009 -23077 177041 -365209 -322239 -187260 266204 -21007 224127 -27666 16045 -264052
8968 91122 98298 -77115 -155667 -266591 -199262 -252411 148782 150498 -89961 -206221 -128211 -207291
8956 -207291 207742 -108420 -250637 -77169 70862 55152 -291013 -10105 -207616 -14183 150572
8944a69529c4275j10506j08965N5130A09557a3282A87408o3709d2335A20713a11818
8932F0265Q8230b2342o3477n7034J1314B733a1852E71288M92866K075689L134892
8921F274735K200850B341443G86151C82027D5855j4144K33919a39307i970A83476
8910B35828E3155n729K10918r2306a08300a0675j31235B37343c2514B27881B4336
8898C0924b43733I372g9218j90284B19787d05814A5907a44291A31238a25111j36252
8887b61363J09434f7762D2268J00980J04543C1307d9547A87434a19452B7343a58811
$$ plain form
8944 -169529 -34275 -144781 -253746 -198616 109557 -13282 187408 123699 -42335 120713 -111818
8932 60265 148495 -22342 -85819 -142853 -131539 2733 -11852 571288 1064154 3139843 6274735
8921 6274735 8475585 2341443 786151 382027 45855 31711 265630 -139307 -9970 183476
8910 235828 53155 47426 258344 166038 -108300 -10675 -141910 237343 -32514 227881 24336
8898 30924 -243733 9372 -79218 -269502 219787 -405814 15907 -144291 131238 -125111 -261363
8887 -261363 -151929 -67762 42268 143248 247791 31307 -49547 187434 -119452 27343 -158811
$$ [...]
##END NTUPLES=NMR SPECTRUM
##END=
