
##TITLE=AC1303_PERAH12115_6641754_p1tBAZZZUx
##JCAMPDX= 6.0         $$ Bruker NMR JCAMP-DX V2.0
##DATA TYPE= NMR SPECTRUM
##DATA CLASS= NTUPLES
##ORIGIN= BRUKER
##OWNER= Administrator
$$ 1.72 TOPSPIN		Version 2.1
$$ 2012-08-08 13:49:52.843 -0500  Administrator@TOPSPIN
$$ Compression mode = diff/dup
##.OBSERVE FREQUENCY= 400.02188249412
##.OBSERVE NUCLEUS= ^1H
##.ACQUISITION MODE= SIMULTANEOUS (DQD)
##.ACQUISITION SCHEME= undefined
##.AVERAGES= 8
##.DIGITISER RES= 22
##SPECTROMETER/DATA SYSTEM= spect
##.PULSE SEQUENCE= zg30
##.SOLVENT NAME= COFFEE_meoh
##.SHIFT REFERENCE= INTERNAL, COFFEE_meoh, 1, 14.98509
##AUDIT TRAIL= $$ (NUMBER, WHEN, WHO, WHERE, PROCESS, VERSION, WHAT)
$$ ##TITLE= Audit trail, TOPSPIN		Version 2.1
$$ ##JCAMPDX= 5.01
$$ ##ORIGIN= Bruker BioSpin GmbH
$$ ##OWNER= Administrator
$$ $$ C:\Bruker\TOPSPIN/data/COFFEE/nmr/AC1303_PERAH12115_6641754_p1tBAZZZUx/10/pdata/1/auditp.txt
$$ ##AUDIT TRAIL=  $$ (NUMBER, WHEN, WHO, WHERE, PROCESS, VERSION, WHAT)
(   1,<2012-08-08 13:49:45.125 -0500>,<Administrator>,<TOPSPIN>,<go>,<TOPSPIN 2.1>,
      <created by zg
	started at 2012-08-08 13:48:38.625 -0500,
	POWCHK enabled, PULCHK disabled,
       configuration hash MD5:
       6B 1B 68 BB D9 2E 58 E2 7F 35 AD 54 07 DF 0E 41
       data hash MD5: 64K
       45 DB 01 1E 68 F4 5C 42 98 58 98 10 4F 12 54 4F>)
(   2,<2012-08-08 13:49:48.109 -0500>,<Administrator>,<TOPSPIN>,<proc1d>,<TOPSPIN 2.1>,
      <Start of raw data processing
       efp LB = 0 FT_mod = 6 PKNL = 1 PHC0 = 0 PHC1 = 0 SI = 32K 
       data hash MD5: 32K
       22 6E C7 F2 07 6B B5 54 E7 C2 DB B4 02 B4 2D 6D>)
(   3,<2012-08-08 13:49:48.468 -0500>,<Administrator>,<TOPSPIN>,<proc1d>,<TOPSPIN 2.1>,
      <pk PHC0 = 177.4951 PHC1 = 0 
       data hash MD5: 32K
       1F 52 0B 7C 97 0B D5 E2 40 76 97 EC E4 E6 D8 1C>)
(   4,<2012-08-08 13:49:48.531 -0500>,<Administrator>,<TOPSPIN>,<proc1d>,<TOPSPIN 2.1>,
      <abs ABSG = 1 
       data hash MD5: 32K
       A2 06 85 E5 08 31 6F 5F 96 9B 85 1D FD EA 67 EB>)
(   5,<2012-08-08 13:49:48.562 -0500>,<Administrator>,<TOPSPIN>,<proc1d>,<TOPSPIN 2.1>,
      <abs ABSG = 2 
       data hash MD5: 32K
       4C 3C 0A 88 F9 0B 65 66 BB 81 CE A7 71 A3 0A F7>)
(   6,<2012-08-08 13:49:48.593 -0500>,<Administrator>,<TOPSPIN>,<proc1d>,<TOPSPIN 2.1>,
      <abs ABSG = 3 
       data hash MD5: 32K
       87 BA 9B 3B 94 1B 42 E4 CB 41 9A A9 B0 46 00 FC>)
(   7,<2012-08-08 13:49:48.625 -0500>,<Administrator>,<TOPSPIN>,<proc1d>,<TOPSPIN 2.1>,
      <abs ABSG = 4 
       data hash MD5: 32K
       23 67 C7 D1 8E F4 DB A8 55 A2 43 71 F9 48 31 D2>)
(   8,<2012-08-08 13:49:48.656 -0500>,<Administrator>,<TOPSPIN>,<proc1d>,<TOPSPIN 2.1>,
      <abs ABSG = 5 
       data hash MD5: 32K
       E3 80 69 7A 80 77 17 67 FE A6 27 CE 5A 76 79 86>)
$$ ##END=
$$ 
$$ $$ hash MD5
$$ $$ E1 A9 66 F6 24 0A 66 64 63 20 FF 0C F1 CA F3 7D
##$RELAX= 
##$RELAX= 
##$RELAX= 
##$RELAX= 
##$RELAX= 
##$RELAX= 
##$RELAX= 
$$ Bruker specific parameters
$$ --------------------------
$$ [...]
150 150 150 150 150 150 150 150
##$TP07= 0
##$TPNAME0= <>
##$TPNAME1= <>
##$TPNAME2= <>
##$TPNAME3= <>
##$TPNAME4= <>
##$TPNAME5= <>
##$TPNAME6= <>
##$TPNAME7= <>
##$TPOAL= (0..7)
0.5 0.5 0.5 0.5 0.5 0.5 0.5 0.5
##$TPOFFS= (0..7)
0 0 0 0 0 0 0 0
##$TUNHIN= 0
##$TUNHOUT= 0
##$TUNXOUT= 0
##$USERA1= <user>
##$USERA2= <user>
##$USERA3= <user>
##$USERA4= <user>
##$USERA5= <user>
##$V9= 5
##$VALIST= <valist>
##$VCLIST= <CCCCCCCCCCCCCCC>
##$VD= 0
##$VDLIST= <DDDDDDDDDDDDDDD>
##$VPLIST= <PPPPPPPPPPPPPPP>
##$VTLIST= <TTTTTTTTTTTTTTT>
##$WBST= 1024
##$WBSW= 4
##$XGAIN= (0..3)
0 0 0 0
##$XL= 0
##$YL= 0
##$YMAX_a= 484516
##$YMIN_a= -620400
##$ZGOPTNS= <>
##$ZL1= 120
##$ZL2= 120
##$ZL3= 120
##$ZL4= 120
##$ABSF1= 14.98509
##$ABSF2= -5.573092
##$ABSG= 5
##$ABSL= 3
##$ALPHA= 0
##$AQORDER= 0
##$ASSFAC= 0
##$ASSFACI= 0
##$ASSFACX= 0
##$ASSWID= 0
##$AUNMP= <proc_prof1d_extract_pilot.lims>
##$AXLEFT= 0
##$AXNAME= <>
##$AXNUC= <1H>
##$AXRIGHT= 0
##$AXTYPE= 0
##$AXUNIT= <>
##$AZFE= 0.1
##$AZFW= 0.1
##$BCFW= 0
##$BC_mod= 0
##$BYTORDP= 0
##$COROFFS= 0
##$CY= 15
##$DATMOD= 1
##$DC= 0
##$DFILT= <>
##$DTYPP= 0
##$F1P= 0
##$F2P= 0
##$FCOR= 0.5
##$FTSIZE= 32768
##$FT_mod= 6
##$GAMMA= 0
##$GB= 0
##$INTBC= 1
##$INTSCL= 1
##$ISEN= 128
##$LB= 0
##$LEV0= 0
##$LPBIN= 0
##$MAXI= 10000
##$MC2= 0
##$MEAN= 0
##$ME_mod= 0
##$MI= 0
##$NCOEF= 0
##$NC_proc= -8
##$NLEV= 6
##$NOISF1= 0
##$NOISF2= 0
##$NSP= 0
##$NTH_PI= 0
##$NZP= 0
##$OFFSET= 14.98509
##$PC= 1
##$PHC0= 177.4951
##$PHC1= 0
##$PH_mod= 1
##$PKNL= yes
##$PPARMOD= 0
##$PPDIAG= 0
##$PPIPTYP= 0
##$PPMPNUM= 2147483647
##$PPRESOL= 1
##$PSCAL= 4
##$PSIGN= 0
##$PYNMP= <proc.py>
##$REVERSE= no
##$SF= 400.02
##$SI= 32768
##$SIGF1= 0
##$SIGF2= 0
##$SINO= 400
##$SIOLD= 32768
##$SPECTYP= <>
##$SREGLST= <1H.CDCl3>
##$SSB= 0
##$STSI= 32768
##$STSR= 0
##$SW_p= 8223.68421052631
##$SYMM= 0
##$S_DEV= 0
##$TDeff= 65536
##$TDoff= 0
##$TI= <>
##$TILT= no
##$TM1= 0
##$TM2= 0
##$TOPLEV= 0
##$USERP1= <user>
##$USERP2= <user>
##$USERP3= <user>
##$USERP4= <user>
##$USERP5= <user>
##$WDW= 1
##$XDIM= 32768
##$YMAX_p= 452808016
##$YMIN_p= -691916
##$CURPLOT= <Network HP LaserJet P1505>
##$CURPRIN= <$Network HP LaserJet P1505>
##$DFORMAT= <normdp>
##$LAYOUT= <+/1D_H.xwp>
##$LFORMAT= <normlp>
##$PFORMAT= <normpl>
##$SURQMSG= 1
$$ End of Bruker specific parameters
$$ ---------------------------------
##NTUPLES= NMR SPECTRUM
##VAR_NAME=  FREQUENCY,     SPECTRUM/REAL,   SPECTRUM/IMAG
##SYMBOL=    X,             R,               I
##VAR_TYPE=  INDEPENDENT,   DEPENDENT,       DEPENDENT
##VAR_FORM=  AFFN,          ASDF,            ASDF
##VAR_DIM=   32768,         32768,           32768
##UNITS=     HZ,            ARBITRARY UNITS, ARBITRARY UNITS
##FACTOR=    0.250966925370066, 1,           1
##FIRST=     8223.43324360094, -184657,      -82389
##LAST=      0,             98705,           -222045
##MIN=       0,             -691916,         0
##MAX=       8223.43324360094, 452808016,    0
$$ Real data points
##PAGE= N=1
##DATA TABLE= (X++(R..R)), XYDATA
$$ [...]
19531f1610G7110a08996p2354B49744d55207g6087H6245a12477c831j02964M1435
19520f5360k6409H2899c4284n8025A02413a1646I5841c8340n2541J2281D5853
19508H028J9498n208J62277d51411K09514C1474a8459G55J5133L7040g2823m7465
19496a20288G0662b68353B89502a14601j22222A89378n5439a0300A11572i1265
19485a31395J0645I4271B7576L06227a11153D8355c74853H8427h1429K6083k92466
19474c47812P8234B41331L1959b02524g2963k15459a07754n6328Q044A6875c3614
19462a02319a060l04360g1521C1480b3417j10610q6000B10121d3898B02596j360
19451B01236b91989B17914M984c50156a04771k2128c3427j21938f7430J165j57483
$$ plain form
19531 -61610 77110 -108996 -181350 249744 -455207 -76087 86245 -112477 -3831 -106795 -65360
19520 -65360 -91769 82899 -34284 -92309 102413 -11646 95841 -38340 -90881 -78600 45853
19508 8028 27526 22318 184595 -451411 -241897 31474 -18459 755 15888 52928 -72823 -120288
19496 -120288 70662 -268353 289502 -114601 -236823 189378 133939 -10300 111572 -91265
19485 -131395 -120750 94271 27576 333803 -111153 48355 -374853 88427 -81429 -55346 -347812
19474 -347812 -269578 241331 273290 -202524 -72963 -288422 -107754 -164082 -156038 16875 -33614
19462 -102319 -1060 -305420 -71521 31480 -23417 -134027 -220027 210121 -43898 202596 201236
19451 201236 -291989 217914 222898 -350156 -104771 -126899 -33427 -155365 -67430 -66265 -223748
19440b23748a03426C4888a51080P2414j45201B14103c8786A58442a08625a5451
19429E8289k2096a42828I2475H538d8049j43124H5986N1275A4215J41746a37194
19417b42676j27852a57737A71475a81809D8222b47448D0392a75695L2671B08148
19406c35559g2187e771q8529A71963F812d07342P7622B61321f5460k07662M0588
19395b32534R0286l7451B1908e0072H7441a01773A46569a1939I176P2132d39350
19383A3796a54777K3963Q463B0454J03889f4193k56897i7291C5878D09A2b93034
19370a43875B68152b08251L8a779l15119d8755B56003G5824a24895j232j12734
19359b38861B45672P7474c50980A48942P017K8425a3011c550j79875C1285L2026
$$ plain form
19440 -223748 -103426 34888 -151080 -78666 -223867 214103 -38786 158442 -108625 -15451
19429 58289 36193 -142828 92475 8538 -48049 -191173 85986 137261 14215 155961 -137194
19417 -242676 -370528 -157737 171475 -181809 48222 -247448 40392 -175695 -143024 208148
19406 -335559 -72187 -5771 -94300 171963 6812 -407342 -329720 261321 -65460 -273122 -232534
19395 -232534 -142248 -179699 21908 -50072 87441 -101773 146569 -11939 9176 81308 -439350
19383 13796 -154777 -130814 -122351 20454 124343 -64193 -321090 -97291 35878 409 12 -293034
19370 -143875 268152 -208251 -208213 -1779 -316898 -48755 256003 75824 -124895 -126127 -238861
19359 -238861 245672 323146 -350980 148942 155959 184384 -13011 -3550 -183425 31285 63311
19348F3311Q4424a88098r6902a36730n5127r1343A58755J98334b31213B3053d8480
19336b83032a8465j90497D7813h8676n4476d2452m56285a85827I8771a43920A97100
19324c52265C0467M256J97572A13002Q8773a03638e1753m4095K5893b5933j67390
19313a93323d4285q0390j9509k17781B09411j9095a40558q046F8310g8861n623
19302h4484H4064b3068l555m55072c413q0487r4657A08057b8647C01767C9721
19290a86931m9066J12413j02354P8503l5133B48399K76399H4000d24364I35c9541
19278a32887o7467B00603d75k71984a05550A30577N5294f9283A77351c18542E7603
19266a17720A60533g6811C2716A6080c39998J17969i3485k12492A1172O551c29540
$$ plain form
19348 63311 147735 -188098 -285000 -136730 -191857 -283200 158755 357089 -231213 23053 -48480
19336 -283032 -18465 -208962 47813 -88676 -143152 -42452 -498737 -185827 98771 -143920 197100
19324 -352265 30467 34723 232295 113002 201775 -103638 -51753 -95848 -69955 -25933 -193323
19313 -193323 -44285 -124675 -144184 -361965 209411 190316 -140558 -148604 68310 -78861 -84484
19302 -84484 84064 -23068 -26623 -481695 -3413 -83900 -178557 108057 -28647 301767 39721
19290 -186931 -235997 -123584 -225938 -147435 -182568 248399 524798 84000 -424364 935 -39541
19278 -132887 -200354 200603 -475 -272459 -105550 130577 185871 -69283 177351 -318542 57603
19266 -117720 160533 -76811 32716 16080 -339998 -222029 -93485 -305977 11172 17723 -329540
19254A41742e1997n1578C9606J41583a87712H6098a16873C9543a51032G017K12013
19243B19030a05942m74340b68173N0478D3907a2483A21385a11973j71430a10962
19232a55368B76545C088a43644A41108L719a07607C0820c69004A21593c43418
19221b06293B2378c23374A35387o6778A6808i9163l55c7469B78348a12125l41766
19210d53891h2909j66972A78024B6938h0882f610B02906a48672B61268a71953
19199a26317j16801M9682j5271A84189h7550A88990c08537j01491B3424b5410
19188A24947D4449J92781h0682L9247B71406g7093F7256b08976o3776C6128J47876
19177A84004b83708d3852J3047j69097A24078b73858d6142j42502A53695b58448
$$ plain form
19254 141742 -51997 -103575 39606 181189 -187712 86098 -116873 39543 -151032 7017 219030
19243 219030 -105942 -580282 -268173 -217695 43907 -12483 121385 -111973 -283403 -110962
19232 -155368 276545 3088 -143644 141108 144827 -107607 30820 -369004 121593 -343418
19221 -206293 22378 -323374 135387 68609 16808 -99163 -99518 -37469 278348 -112125 -453891
19210 -453891 -82909 -249881 178024 26938 -80882 -6610 202906 -148672 261268 -171953
19199 -126317 -243118 -193436 -208707 184189 -87550 188990 -308537 -410028 23424 -25410
19188 124947 44449 237230 -80682 -41435 271406 -77093 67256 -208976 -272752 36128 184004
19177 184004 -283708 -43852 -30805 -199902 124078 -273858 -46142 -188644 153695 -258448
19166F2523b02903Q8433h985n8781C3537J82622a09337k9706M8184A5517e1963
19154c50570a16217j18904A24219g0613b5458n2227a6912D7428J43051b11377
19143c42846C2913a3033m9073j1984l9251k4627D8361m759b25367a0956E4588
19131e9698j07665j56557d7178j57368A89154a67274B39445b31855H5101f2999
19120b62390D8000d6533l46075a5913J194A8813P2898b61028H430a33588G5292
19108B4759L4217h0338L1441A2657K61941F4361i527j34873j21733a31132A15449
19096d55322D5886a88211I2513A9552N571f4838I2951m2390a30378q1534G625
19084a52529N3290A79754a87041l1851A12729A8490e4697B17798c14576d2320
$$ plain form
19166 62523 -202903 -114470 -8985 -67766 33537 216159 -109337 -139043 -90859 15517 -51963
19154 -350570 -116217 -235121 124219 -70613 -25458 -77685 -16912 47428 190479 -211377
19143 -342846 32913 -13033 -62106 -74090 -113341 -137968 48361 43602 -225367 -10956 54588
19131 -59698 -167363 -323920 -47178 -204546 189154 -167274 239445 -231855 85101 -62999
19120 -262390 48000 -46533 -392608 -15913 -14719 18813 91711 -261028 8430 -133588 75292
19108 24759 58976 -80338 -48897 12657 274598 64361 -9527 -144400 -266133 -131132 115449
19096 -455322 45886 -188211 92513 19552 25123 -64838 92951 50561 -130378 -211912 7625
19084 -152529 -99239 179754 -187041 -218892 112729 18490 -54697 217798 -314576 -42320
19073a54967F1154R5464n4496B0456N2284a06380J8480a3242l76712a14972B02574
19061F7672h7772a209C66316c66034a47183E7126b81580A14988e7087j21486d1744
19049c8782j60252B10121L73687b54568A17254a07000b4559A2105O3197J45739
19039B21041e1816k60039R7019J05185a5933n0218L1835A07092a42225K8330b7456
19027A0760a34036j04497F3241K76732A36145A8615R3740a32094k22424H5943
19016d987k31266k35380J47292k1799q9839D21a06791j38887G2534j4723M9790
19005A07601a14515d0346D6204n215b34557H433J57525L2075e6926A16971J26395
18994B43366A12653a66562l9862B01293b79952L8887A76318c09037a23041B2238
$$ plain form
19073 -154967 61154 156618 102122 20456 72740 -106380 -87900 -13242 -389954 -114972 202574
19061 67672 -87772 -1209 366316 -366034 -147183 57126 -281580 114988 -57087 -178573 -41744
19049 -38782 -199034 210121 583808 -254568 117254 -107000 -24559 12105 75302 221041
19039 221041 -51816 -311855 -214836 -109651 -15933 -66151 -34316 107092 -142225 -113895 -27456
19027 10760 -134036 -238533 63241 339973 136145 18615 112355 -132094 -354518 85943
19016 -4987 -236253 -471633 -324341 -346140 -435979 421 -106791 -245678 72534 57811 107601
19005 107601 -114515 -40346 46204 40989 -234557 8433 165958 198033 -56926 116971 243366
18994 243366 112653 -166562 -206424 201293 -279952 -241065 176318 -309037 -123041 22238
18983a492B40594q0323e8858B854d9215j13355f802j52067P3164A50191b21700
18971E3342c68085e0751k1511B12716b44333B10793r8261B9363C882a30400p5804
18960b06204f3539A0022c6859J7714r6478n8306A20444b63976Q4229A26091E3397
18948F7953P0792b47734D1055a50819j97902N4695H860h1725k9937B90566h017
18936A31772M6408d11348B9294a85507A20562e0332o9372C33927a7192r0096A27140
18924D2115N7229a50226e2224H2375J00428q0201a4370q0400L3683G981a69213
18912a63778J9629d9802D257a50381A37771a59540A4396K3697a32633j35793k9384
18901b97810J30147A12474c69779A77799N6149c54691a68767O7408C76443f1249
$$ plain form
18983 -1492 240594 160271 -58858 2854 -49215 -162570 -6802 -158869 -85705 150191 -221700
18971 53342 -368085 -50751 -72262 212716 -244333 210793 112532 29363 3882 -130400 -206204
18960 -206204 -63539 10022 -36859 -19145 -115623 -173929 120444 -263976 -179747 126091 53397
18948 67953 138745 -247734 41055 -150819 -348721 -294026 8860 -81725 -111662 290566 -8017
18936 131772 178180 -411348 29294 -185507 120562 -50332 -119704 333927 -17192 -107288 127140
18924 42115 99344 -150226 -52224 82375 182803 102602 -14370 -94770 -61087 7981 -169213
18912 -163778 -144149 -49802 4257 -150381 137771 -159540 14396 38093 -132633 -268426 -297810
18901 -297810 -167663 112474 -369779 177799 233948 -354691 -168767 -101359 376443 -61249
18890b0843E6901b78605a08957A62021B4151c59855H3943a81745j04824A15291
18879H7358R7660R723G2571a59323k51928c8203B7418N5257g8451E358b1312C6437
18866A36822M4172a00563k07267J42823E480a76251h5465A53846a40054B6818
18855H5776J19454b44420R1048C11750a03322j16046c4223H8892C4148J56374
18845A90522a12786p7179a2267A63528d18099a82861g704k412G6388l1051d1456
18833A06435h6341m9006n8775o7747g2468k1783j13789A39483b45311B03820a07645
18821B10246O4675A03307a43083E3526f3486A46929F6977g6948C86168n020o2861
18810C18287A16040M66078k78127a07530J7237j6435J5271k01289a43427J080
$$ plain form
18890 -20843 56901 -278605 -108957 162021 24151 -359855 83943 -181745 -286569 115291
18879 87358 185018 194741 72571 -159323 -411251 -38203 27418 82675 -78451 5358 -21312 36437
18866 136822 180994 -100563 -307830 -165007 5480 -176251 -85465 153846 -140054 26818
18855 85776 205230 -244420 -153372 311750 -103322 -219368 -34223 88892 34148 190522
18845 190522 -112786 -189965 -12267 163528 -418099 -182861 -7704 -10116 76388 45337 -41456
18833 106435 -86341 -135347 -194122 -261869 -72468 -94251 -208040 139483 -245311 203820 -107645
18821 210246 274921 103307 -143083 53526 -63486 146929 66977 -76948 386168 381148 318287
18810 318287 116040 582118 303991 -107530 -90293 -106728 -91457 -292746 -143427 -142347
18800a42347A81531a59591A40629C2216K01195b9578j48931b4442B48289a4118
18789A57793A4878a49105N6917l9947F4979B053K0271a65895C4298a02744a9981
18777a82207A9540a69585n6962a05697G6526c13372a05051j37378e6201A99507
18766a52150k0125A6048a33936A3272c2005G8487a89247d7636j93961f7668B62884
18754a02738H3497c23147B1576J67487E3940a22868A06632h8147l7483k24331
18744c49961C0339k750c3488k07884A72319d47906B1427J94699F7158O7193k2563
18733A11788m0345O0534a91703M894o980p2303k32669g9625l3452C68274a07634
18721b34326J5152b0714l330j12272A25428J16943b54486D062J97027f7019j46899
$$ plain form
18800 -142347 181531 -159591 140629 32216 233411 -29578 -178509 -24442 248289 -14118
18789 157793 14878 -149105 -92188 -132135 64979 2053 22324 -165895 34298 -102744 -19981
18777 -182207 19540 -169585 -226547 -105697 76526 -313372 -105051 -242429 -56201 199507
18766 -152150 -172275 16048 -133936 13272 -32005 78487 -189247 -47636 -241597 -67668 262884
18754 -102738 83497 -323147 21576 189063 53940 -122868 106632 -88147 -125630 -349961
18744 -349961 30339 27589 -33488 -241372 172319 -447906 21427 216126 67158 134351 111788
18733 111788 71443 131977 -191703 -186809 -193789 -266092 -498761 -79625 -113077 368274 -107634
18721 -234326 -219174 -20714 -24044 -136316 125428 242371 -254486 4062 201089 -67019 -213918
18710b13918j1922a4721G0491b31962g4707m3330B19369A09231c06088a102k01928
18699b03030i5751j89523B46211l5417E3501b6521k45217A26888a70122f610A74734
18687e6749r1203g0694a6301m6507F3615a14300C9623g129D4798r492j999a62298
18674A76191f8470j14612F3182J35106a58454P3456A02080J09349c34045J54952
18664a79093h63L23A17630a89016b4744C6381e1332n2072m4038j15062A27866
18652F7534c38660f6759G294L5811Q7004C5836a28282r8144n2051C5133M11146
18641D46279A26987N2658c78262L2141a1246l23802A62180a12345A30157a35567
18630B8582b75474D856f3409l9443r5488p7777a9859B15805a85099d9305l09851
$$ plain form
18710 -213918 -225840 -14721 70491 -231962 -74707 -118037 219369 109231 -306088 -1102 -203030
18699 -203030 -95751 -285274 246211 210794 53501 -26521 -271738 126888 -170122 -6610 174734
18687 -56749 -147952 -70694 -16301 -62808 63615 -114300 39623 -7129 44798 35306 33307 -162298
18674 176191 -68470 -183082 63182 198288 -158454 -84998 102080 211429 -334045 -179093
18664 -179093 -863 -540 117630 -189016 -24744 36381 -51332 -103404 -147442 -262504 127866
18652 67534 -338660 -66759 7294 43105 130109 35836 -128282 -226426 -278477 35133 446279
18641 446279 126987 179645 -378262 -346121 -11246 -335048 162180 -112345 130157 -135567
18630 28582 -275474 4856 -63409 -102852 -198340 -276117 -19859 215805 -185099 -49305 -359156
18619c59156e3416l98382F1504m803b46150A36874a43829H965M4241a00555j5217
18608a15772G8293A2735a17748A17133g8046b0211j2089j85037i3628B37960c8666
18596A48072b9526k12039A72644A0959J4616J47515c75196B22447j08702g3871
18585B35486h4054j00246K3212e0234K1318A0350l222K87577B7659a02234d6303
18573a90319R4010F2906h7559A56770D9176d0820B83815b3499G1047r501h4425
18561C5351O3367b38381B05739i8261p3780A84454b7629n8078n5456O7458j97585
18550b71290i4851E994N8217a1279n932M711m5091j35834g6978A51891C0820L3082
18538F3902k3295c1011l6957A57078i9641d1868j83783A5160a53513j46570a1114
$$ plain form
18619 -359156 -53416 -451798 61504 56701 -246150 136874 -143829 8965 53206 -100555 -115772
18608 -115772 78293 12735 -117748 117133 -78046 -20211 -32300 -217337 -93628 237960 -38666
18596 148072 -29526 -241565 172644 10959 25575 173090 -375196 222447 113745 -73871
18585 235486 -84054 -184300 -161088 -50234 -28916 10350 7128 294705 27659 -102234 -46303
18573 -190319 -96309 62906 -87559 156770 49176 -40820 283815 -23499 71047 61546 -84425
18561 35351 98718 -238381 205739 -98261 -172041 184454 -27629 -85707 -141163 -73705 -271290
18550 -271290 -94851 5994 64211 -11279 -17211 -12500 -57591 -193425 -76978 151891 30820 63902
18538 63902 40607 -31011 -67968 157078 -99641 -41868 -225651 15160 -153513 -300083 -11114
18526g745A09385g5019b8160A18417c15413a13037j18289J13253o7699A47124
18515a21486j16271D61220a18370H7314h5342j91265b2240k16169E75198e7819
18504A05198L3262b0998j60301O5948M0394F0259a41699A63056i335k44171C3099
18492d8453C3893a13090h168A99941a65005D4138i3079p9133B2959c49318J06526
18481b42792i7964b3488n465j1303k8813A7876N6403a58503f6054k22211e0220
18469b00182q4990a24850p1495P4467j49543A26635b57314q1376a34243N3462
18459h0781B75641j35527c28674a4498l12914b6736E1166K43986a46750N0121
18449i6629q7864d7244m0610E0300a1727k04605n9616O6058Q3655N5856a2865
$$ plain form
18526 -7745 109385 -75019 -28160 118417 -315413 -113037 -231326 -118073 -185772 147124
18515 -121486 -237757 461220 -118370 87314 -85342 -276607 -22240 -238409 575198 -57819
18504 105198 138460 -20998 -181299 -115351 -74957 60259 -141699 163056 -9335 -253506 33099
18492 -48453 33893 -113090 -8168 199941 -165005 44138 -93079 -172212 22959 -349318 -242792
18481 -242792 -97964 -23488 -28953 -40256 -69069 17876 74279 -158503 -66054 -288265 -50220
18469 -200182 -285172 -124850 -196345 -121878 -271421 126635 -257314 -338690 -134243 -80781
18459 -80781 275641 140114 -328674 -14498 -327412 -26736 51166 295152 -146750 -96629
18449 -96629 -184493 -47244 -87854 50300 -11727 -216332 -275948 -209890 -126235 -70379 -12865
18437B60644G6419J02789a28251j8265A74422a38442A50426E7689a63046a9340
18426b13431f0921p3154j46816e6780j38617i3911m0914d6891J8486k90359B20985
18414d4710K1972I4837B6363R056p937L19589c242H2981J28611a21027j04417
18403b25444B40917b52339b912A30932A6406a56139j17846A19173K25582a98580
18392a20779l42155a75860a7975m6594B15646a14130m8200b1433L243r4849p272
18381a20311D7583R6146F519c86910B10168C888J48000c3165j99711n0593q3604
18370c67073B06111m7553C7336n042P7199L5147J59081F2599a61737g4766j48146
18359b22912A38803D7438J19518J09167A24501K8912c16815J44310E7193b12070
$$ plain form
18437 260644 76419 179208 -128251 -146516 174422 -138442 150426 57689 -163046 -19340
18426 -213431 -60921 -134075 -280891 -56780 -195397 -93911 -134825 -46891 -28405 -318764 220985
18414 -44710 -22738 94837 26363 35419 27482 347071 -3242 82981 211592 -121027 -225444
18403 -225444 240917 -252339 -2912 130932 16406 -156139 -273985 119173 344755 -198580
18392 -120779 -462934 -175860 -17975 -64569 215646 -114130 -162330 -21433 -18190 -113039 -120311
18381 -120311 47583 143729 6519 -386910 210168 3888 151888 -33165 -232876 -283469 -367073
18370 -367073 206111 158558 37336 32294 109493 144640 303721 62599 -161737 -74766 -222912
18359 -222912 138803 47438 166956 276123 124501 153413 -316815 -172505 57193 -212070
18348g2148j56283d6477G3234a14267A23728P4513a05002B48566h5066A48635
18337B88200b97059E9479L66746c26519h5727J5606E558h282j05685M0991j01691
18326a74667L3519O723a2659A60018h6509L0478B8172a61490M9393I3162a08533
18314B60815A22138c980A90594J8322G5295P0468c33068A16415b95131a40713
18303b50268B14583a25423c1009j58799j15209C0617K54324n1730g3592D0946
18292E3794J97502k8217C8077a24670j17028L4389q0486B3413g5828A71719g4703
18280g5003A33991J03578J11834a47389j62468A66672n8261d11883a62152C784
18269a0214A07476K052b12725b1079C4186h2367E0189a4949j97456e5028A43804
$$ plain form
18348 -72148 -228431 -46477 73234 -114267 123728 198241 -105002 248566 -85066 148635
18337 288200 -297059 59479 426225 -326519 -85727 -70121 5558 -8282 -113967 -72976 -174667
18326 -174667 -141148 -134425 -12659 160018 -86509 -56031 28172 -161490 -112097 93162 -108533
18314 260815 122138 -3980 190594 208916 75295 145763 -333068 116415 -295131 -140713
18303 -250268 214583 -125423 -31009 -189808 -305017 30617 284941 233211 -73592 40946
18292 53794 251296 223079 38077 -124670 -241698 -207309 -287795 23413 -75828 171719 -74703
18280 -75003 133991 237569 349403 -147389 -309857 166672 108411 -411883 -162152 3784
18269 -10214 107476 109528 -212725 -21079 34186 -82367 50189 -14949 -212405 -55028 143804
18257i4812B2474a61667I4119i2815I7160M1226a49652A67917a05369A04456g2092
18245I2657D269a15095P798k7039B63209r0168D0360K26700E0460b56186D6398
18233c4234m7439l38011c2647n8354H3306a12926A68206p8652b56478D56751f4959
18221A97326o0127E3114b1521p2671A59200a28153p3519A10955c6849m5627K0161
18210f2315c444A28761g364j27107A6202O2090a8376F4149k3606b15783f5248
18198h8818A0900b4542A12035a06279F4585P5294l9141b13240n461H3244f4381
18186A01343C7977a59922f2022B2910a07429p0511A51687a34013k8041e6597A12851
18174F36N0265J28807a30684A03716e9303A90796P1323d22002H2895a42592A024
$$ plain form
18257 -94812 22474 -161667 94119 -92815 97160 138386 -149652 167917 -105369 104456 -72092
18245 92657 4269 -115095 -107297 -134336 263209 173041 40360 267060 50460 -256186 46398
18233 -34234 -81673 -419684 -32647 -91001 83306 -112926 168206 89554 -256478 456751 -64959
18221 197326 137199 53114 -21521 -94192 159200 -128153 -201672 110955 -36849 -82476 -62315
18210 -62315 -3444 128761 -7364 -134471 16202 78292 -18376 64149 40543 -215783 -65248
18198 -88818 10900 -24542 112035 -106279 64585 139879 100738 -213240 -218701 83244 -64381
18186 101343 37977 -159922 -62022 22910 -107429 -177940 151687 -134013 -162054 -56597 112851
18174 636 50901 179708 -130684 103716 -59303 190796 262119 -422002 82895 -142592 1024
18162A54342P9582a05425k5579l58040I4606O3866R8825I3961a44650B7115C991
18150a13361j5322A32850a31139A66840i814A33261f8815C40756a4477A12032
18139c4791k40132f104r201p1139A81767A4837a52891c3984j07378b9855F4903
18127A80267e0918j3207k77728a11365A36156a19333N3543A08665k2185J94293
18117B80773A1081a1420p0746j58869e3028b4098C3819g5239A96485a60625E073
18105G9191C7091h1435B53220C9295g6610C9329a98007e0951j37404C10263I9174
18093d8709B7247a15596j87414h7483q7133P7039I3235i1695k76214A92411i8782
18081i509C7999b0376N412I3593a10344A80953b5400D01010b33136M7972A84913
$$ plain form
18162 154342 233924 -105425 -131004 -489044 94606 158472 257297 93961 -144650 27115 3991
18150 -113361 -128683 132850 -131139 166840 -9814 133261 -68815 340756 -14477 112032
18139 -34791 -274923 -6104 -15305 -86444 181767 14837 -152891 -33984 -141362 -29855 64903
18127 180267 -50918 -64125 -341853 -111365 136156 -119333 -65790 108665 86480 280773
18117 280773 11081 -11420 -82166 -241035 -53028 -24098 33819 -75239 196485 -160625 5073
18105 79191 37091 -81435 253220 39295 -76610 39329 -198007 -50951 -188355 310263 99174
18093 -48709 27247 -115596 -303010 -87483 -174616 -97577 93235 -91695 -367909 192411 -98782
18081 -9509 37999 -20376 -14964 93593 -110344 180953 -25400 401010 -233136 -185164 184913
18069E16152h0776j40789B8052d3459j90024p0133a28736B96628a63230b6940
18058E9910a11786B5349d16229C0698L55971b1469A67540a41213p012c6052a5663
18046c23508n0695I2271a797j67192B45321r3770J51078j49692a58821k6863F6594
18034E3513c13404H8220r280L1819g5866k80835G0681b8928l43281a30458e8452
18022B51946e4980A0319c556l9323E6584j8419b00699A17901b04502a7483A42858
18010A2280g5766B26374A10523N0541c04845B94039g4580A51515E8010H310Q3548
17999I1858a42149A39306f4719A50743D0954a11773A93743J70169c45627B15101
17988A30083J68830j37152l4592J5429E1480i4001L2221H9969b46722h885j1378
$$ plain form
18069 516152 -80776 -221565 28052 -43459 -233483 -303616 -128736 296628 -163230 -26940
18058 59910 -111786 25349 -416229 30698 386669 -21469 167540 -141213 -148225 -36052 -15663
18046 -323508 -374203 92271 -1797 -168989 245321 151551 302629 152937 -158821 -185684 66594
18034 53513 -313404 88220 78940 110759 -75866 -356701 70681 -28928 -372209 -130458 -58452
18022 251946 -54980 10319 -3556 -42879 56584 38165 -200699 117901 -204502 -17483 142858
18010 12280 -75766 226374 110523 161064 -304845 294039 -74580 151515 58010 8310 91858
17999 91858 -142149 139306 -64719 150743 40954 -111773 193743 363912 -345627 215101
17988 130083 298913 161761 127169 142598 51480 -94001 -61780 89969 -246722 -8885 -20263
17977b0263B41381a7592B02681N0982G4312K01610b01810A08581a54395n95k08381
17966c63371J01368B96a9252l67063d6342k3308q4963a5579C23521c54464k18441
17955e72905a61976G5567f6960j07377G7690b10343F8868a86349A28503N5942
17945A84445A4574a13594H5207a13961k4911C93773b70952A11089a7763k20304
17935b38067h2934c4653B6682e8283H7312b36340D9104A8655a69152A03529b63561
17923A40661a86412C56469a48175j3656F8476k5527j1353c53107c3600C85487
17912d2204B36639a30638b1294m28429A56421c59156A86067d35688B14206b36718
17901h1272B17880K6978b6091k83815L8050B52033a53267B6378L9827c0028G8792
$$ plain form
17977 -20263 241381 -17592 202681 253663 74312 275922 -201810 108581 -154395 -154990 -363371
17966 -363371 -262003 296 -19252 -386315 -46342 -69650 -154613 -15579 323521 -354464 -572905
17955 -572905 -161976 75567 -66960 -174337 77690 -210343 68868 -186349 128503 184445
17945 184445 14574 -113594 85207 -113961 -138872 393773 -270952 111089 -17763 -238067
17935 -238067 -82934 -34653 26682 -58283 87312 -236340 49104 18655 -169152 103529 -263561
17923 140661 -186412 356469 -148175 -161831 68476 42949 31596 -353107 -33600 385487
17912 -42204 236639 -130638 -21294 -449723 156421 -359156 186067 -435688 214206 -236718
17901 -81272 217880 244858 -26091 -309906 -271856 252033 -153267 26378 66205 -30028 78792
17889B26665a00146A42986F8087J34560K0186a50532g4668A58001D876a43733
17878B95429d3245l55060d8895A21233a39484A09477K0911K2036k4368A1217J24318
17867A35535n262d64656H9249G241M2096K0160b8423j25643C3682f1220C09452
17855h0041q1604g2378D4588K495H671a71515a0351E9616f1026K6444m36408A22663
17842b132C965h6020B35703o7998D1641O7833e0102J8905G8595J47951a33990
17830a78019b7897O78A39749K2811c702B14568a47701I2822K3844K90064a52130
17818e2611A30300B7092e220B6080a23953A68483e6625n6180A26864i9973G7463
17806b49230A62496J1617b79894a3133n3845I9179a60672A73048c56788g9776
$$ plain form
17889 226665 -100146 142986 68087 202647 222833 -150532 -74668 158001 4876 -143733
17878 295429 -43245 -398305 -48895 121233 -139484 109477 130388 152424 128056 11217 135535
17867 135535 130273 -464656 89249 7241 49337 69497 -28423 -154066 33682 -61220 309452
17855 -80041 -161645 -72378 44588 47083 8671 -171515 -10351 59616 -61026 -34582 -470990 122663
17842 -2132 3965 -86020 235703 167705 41641 109474 -50102 -31197 78595 226546 -133990
17830 -178019 -27897 -27219 139749 162560 -3702 214568 -147701 92822 116666 406730 -152130
17818 -52611 130300 27092 -5220 26080 -123953 168483 -56625 -112805 126864 -99973 77463
17806 -249230 162496 174113 -279894 -13133 -66978 99179 -160672 173048 -356788 -79776
17795I0782l0299a84788A5865J21924j8903a04716L5203G7542h681A89747n2917
17784A36830g8908I6601a43566M0937K8487A54923a70990B21136b7657C14113
17773b21764A2057b05148B49738a06383E97627h1780p3027M2405j16273e9747
17762C04659R4049D8156J83992a50683j1961b6349j040B48501b5343j04821A62267
17750D2415a01909A56986m5020Q2505b62377B2107a83337A2388J03864m5701Q5768
17739A56319b31061A25027g9658k14636B81104b31412b9717M836C6927C874K16672
17728B20546K04230a26953A6662b59215g8921A25246H067J73265a8645r8749A35428
17716c8948k20876B28711g0528B68257a04556c9399k1809B01117b72177A49378
$$ plain form
17795 90782 60483 -184788 15865 137789 118886 -104716 -69513 77542 -8681 189747 136830
17784 136830 -78908 96601 -143566 -102629 -74142 154923 -170990 221136 -27657 314113
17773 -221764 12057 -205148 249738 -106383 597627 -81780 -154807 -112402 -228675 -59747
17762 304659 398708 48156 232148 -150683 -162644 -26349 -27389 248501 -25343 -130164 162267
17750 42415 -101909 156986 111966 194471 -262377 22107 -183337 12388 116252 70551 156319
17739 156319 -231061 125027 -79658 -294294 281104 -231412 -29717 -24881 36927 3874 220546
17728 220546 424776 -126953 16662 -259215 -78921 125246 8067 181332 -18645 -117394 135428
17716 -38948 -259824 228711 -70528 268257 -104556 -39399 -61208 201117 -272177 149378
17705A20815c81191R8224a21099c9296o2014k42986B3163e5476a0123F5148O1597
17694A26745a12728K3776A68911G0042b84682J34483C7846O1222J03760A00855
17683C08176a15019C07637j30153b25869E60202i1746C2894a89989Q4838j9452
17673a24603j05185A66537J038F1085K95211E1035c50E1194a52315H9792j8036
17662G1756d74316a44191A85852j8901m4460K6802J92280A32233d9664B4697e0735
17650I9621K73263E8338B8992J83037I7583c624r2642A44135A4413M42931b01607
17638A67841a07411j2080H3159J05332g6673A19439d9027A90226k6347m8715k1648
17627I3516b49515A03411c09909b6895j35197m020d4281C03787F4120d6580L528
$$ plain form
17705 120815 -381191 -282967 -121099 -39296 -101310 -344296 23163 -55476 -10123 65148 126745
17694 126745 -112728 -88952 168911 70042 -284682 -150199 37846 99068 202828 100855
17683 308176 -115019 307637 177484 -225869 560202 -91746 32894 -189989 -105151 -124603
17673 -124603 -229788 166537 167575 61085 356296 51035 -350 51194 -152315 89792 71756
17662 71756 -474316 -144191 185852 166951 122491 149293 341573 132233 -49664 24697 -50735
17650 99621 372884 58338 28992 212029 97583 -3624 -96266 144135 14413 457344 -201607
17638 167841 -107411 -119491 83159 188491 -76673 119439 -49027 190226 163879 115164 93516
17627 93516 -249515 103411 -309909 -26895 -162092 -166112 -44281 303787 64120 -46580 -43052
17616d3052B3749P2094J0048K35744H3646R9742H3747L7419K03428a26846C7207
17604b5840A59646e9786o4716l1916D33392D9635K89609j41602o2322B6678L27485
17593C54163j19009I3138a41991O0912A15272k3214b87944B71193a52707H5744
17582A37001i978D70103A83539j2797i4785p4804K6382A36180K60665A45389D782
17570a09066A1439J14085P8853F586b0456f522A76642J31448A7290J22607B5325
17558A53519n3932D7779a29342C8955A2185J27922P8450a00650A70077a3455j32058
17547a45513M6929l9673I3425N3864J00748E5331a78812D5738a4221B41716F4977
17535B32855i9629A19064M2466m9991a19434n2879F2771K4456L03214q0548a92341
$$ plain form
17616 -43052 23749 95843 105891 341635 83646 183388 83747 121166 324594 -126846 37207
17604 -25840 159646 -59786 -124502 -156418 433392 49635 339244 197642 135320 26678 354163
17593 354163 235154 93138 -141991 -81079 115272 92058 -287944 271193 -152707 85744
17582 137001 -9978 470103 183539 170742 -94785 -169589 -143207 136180 396845 145389 4782
17570 -109066 11439 125524 204377 6586 -20456 -6522 176642 308090 17290 139897 25325
17558 153519 99587 47779 -129342 38955 12185 140107 218557 -100650 170077 -13455 -145513
17547 -145513 -98584 -138257 93425 147289 248037 55331 -178812 45738 -14221 241716 64977
17535 232855 -99629 119064 161530 111539 -119434 -172313 62771 87227 390441 309893 -192341
17523A08634J33160I6854N8589M6037B2639J10947f0132B49129a13916M7628f296
17511B34626G9436L31214A83017J39733a2614E15999A25875a12350j06135A09210
17500g2824l2979B61525I582L05699j32226k2025h6214c9748a0609n9748m5408
17489a15765A06283D4810a15707l5440A94511c7131B26080H1345L58276A26751
17478A92768p8437J2099n3834J44371E8177L21356j86176r6233a86553b3306C2218
17466B04079o0231A6245J72682l3933q993J20630K3778p693b144C69069G8922
17454A48149J50866O1162j1395j11827K85123k8307l375o6306r2900j38823a00704
17442A75704a9716D69317A01571M74347E6903O5698J84401G7942K83244R8621
$$ plain form
17523 108634 241794 96854 155443 201480 22639 133586 -60132 249129 -113916 -66288 -6296
17511 234626 79436 410650 183017 322750 -12614 515999 125875 -112350 -218485 109210
17500 -72824 -105803 261525 9582 315281 183055 161030 -86214 -39748 -10609 -70357 -115765
17489 -115765 106283 44810 -115707 -151147 194511 -37131 226080 81345 439621 126751
17478 192768 114331 126430 72596 216967 58177 379533 193357 97124 -186553 -23306 32218
17466 204079 143848 16245 188927 154994 146001 266631 290409 282716 -2144 369069 78922
17454 148149 299015 360177 348782 236955 522078 493771 490396 424090 331190 192367 -100704
17442 175704 -19716 469317 101571 575918 56903 122601 307002 77942 361186 459807
17432D59807E92J91352f642A64127P1257J41305H5855J10673r2808L03507F9374
17420C30009A39364m7148O0233M8009N5103K32933k16413J02679A42808l0126
17410A12682K39793A28850D4437a03707B98353A30669m5465Q036g3987F3633K65001
17399C28634b59398A87282q7485L25670f9042B55598I0432P6753O8864J16918
17389C52967R472j10760f0540k32377A89554j2896R9885O3374C1717J88362J54496
17378C74575q9669N5417a40557E02037B46790P7948g0106A68769E5801M9561D1254
17366D5828N0529a10660G3255Q8640D007d23898B28882J12525m4466J02638A63909
17354F11855f1638G3972e795A63928r87l8778P8322D6396k429C172K90713e1816
$$ plain form
17432 459807 592 191944 -6642 164127 235384 376689 85855 196528 103720 407227 69374
17420 330009 139364 92216 152449 200458 255561 488494 272081 374760 142808 112682
17410 112682 352475 128850 44437 -103707 298353 130669 85204 93240 -73987 63633 328634
17399 328634 -259398 187282 99797 425467 -69042 255598 90432 167185 236049 352967
17389 352967 362439 251679 -60540 -292917 189554 176658 276543 339917 31717 220079 374575
17378 374575 284906 340323 -140557 502037 246790 324738 -70106 168769 55801 105362 41254
17366 45828 96357 -110660 73255 161895 4007 -423898 228882 341407 296941 399579 163909
17354 611855 -61638 73972 -5795 163928 162941 124163 202485 46396 43967 3172 293885 -51816
17341C87443j02914j08003g906j71147E32217D181R7496j0435a00324C26825A0926
17329A6946K73276F8860J90894H4694Q6863M43742B55152R2049G9904J04804J040
17318A85748a94845M3210B82911j11826O64951C25775E0756L98720A55940O9459
17308B25399n9599a28785b1456H5212L62790A59565P511F0634O6091K02613m8274
17297B81064O6486b10989B33299n8971P8102J11578a8584C07629p9322E9876R2655
17286A52531a70930H038O0758C0833K29499J83947a7193A13350P1962J02360Q3252
17275C70924i556A19309C3519J44735K06371j70384p4330J48566N9144A31846
17264A46688j0072J31494j08076J75343k6421a5499j41716A95703r3306i2048
$$ plain form
17341 387443 284529 176526 -7906 -179053 532217 4181 101677 91242 -100324 326825 10926
17329 16946 290222 68860 259754 84694 171557 615299 255152 347201 79904 184708 185748
17318 185748 -194845 -151635 282911 171085 836036 325775 50756 449476 155940 225399
17308 225399 165800 -128785 -21456 85212 448002 159565 167076 60634 126725 329338 281064
17297 281064 347550 -210989 233299 174328 252430 364008 -18584 307629 228307 59876 152531
17286 152531 -170930 8038 68796 30833 260332 444279 -17193 113350 185312 287672 370924
17275 370924 -9556 119309 33519 178254 384625 214241 139911 288477 347621 131846
17264 146688 136616 268110 160034 335377 308956 -15499 -157215 195703 102397 -92048
17253E3949K22369D1333J94820j11883b4025C18686a54965C63569j30138e596
17242A26829B8052K06709h9186n5747C2551J52557m0934K65511P2837A54015a82124
17230A27579Q449l3467J94694A40288a7132A94962D3981Q6106L38015A60494m6933
17219A13561Q5257K08768A64849K44641b8509I5896N30796A4696J57840K25169
17209C97705A55473J54832A52293J85662l8837D4467L37153O9964G7310R0810
17199A68120J44931j21275J63790n4461n127E0389K31177O0890l4543b0239C53033
17187A22789R5063J70264b396H2714L8687O1585K14750A50917J23984J78884A94416
17175C68858G1962J07706J20700A14897L12932j30150E6645K79610N441K41855
$$ plain form
17253 53949 276318 41333 236153 124270 -24025 318686 -154965 363569 233431 -5596
17242 126829 28052 234761 -89186 -144933 32551 185108 144174 409685 482522 154015 -182124
17230 127579 136028 102561 297255 140288 -17132 194962 43981 130087 468102 160494 113561
17219 113561 198818 407586 164849 409490 -28509 95896 626692 14696 172536 397705
17209 397705 155473 310305 152293 337955 299118 44467 381620 451584 77310 168120
17199 168120 313051 191776 355566 301105 295978 50389 281566 342456 307913 -20239 353033
17187 122789 217852 388116 -2396 82714 121401 182986 397736 150917 274901 453785 194416
17175 368858 71962 179668 300368 114897 427829 297679 56645 336255 341696 583551
17165E83551k49278A33301L76549p8974p5723j73447K63345j06486D0403J44181
17155A84584l8978N737L04864D7331L55175j64682j05656J06095N8601j34824
17145A62040J1983K49506r6491A42645f0983B87809L1424K06523B54746j23799
17135A30947L81075k40723p5336J17044q0927L88690B03861K08587j0032J21964
17125E24380j41560J19650k37701J22231n0236k7477M73150C10774R0676J645
17115D03095l9314n1851J9396N8860K37758k67312k9354J46055O1902j93368J03679
17104D49546J4391R1672B32689L64200A16239J3770K42186A03778M83529A37399
17093F58660k32789N4672k37151O4817M19165k73785l1595J5875K35531B04124
$$ plain form
17165 583551 334273 133301 509850 430876 355153 181706 445051 338565 40403 184584
17155 184584 145606 151343 456207 47331 402506 237824 132168 238263 296864 162040
17145 162040 174023 423529 327038 142645 -60983 287809 319233 525756 254746 130947
17135 130947 512022 271299 195963 313007 232080 620770 203861 412448 402416 524380
17125 524380 382820 502470 264769 387000 336764 309287 782437 310774 401450 403095
17115 403095 363781 311930 331326 390186 627944 360632 331278 477333 539235 345867 449546
17104 449546 463937 555609 232689 596889 116239 130009 372195 103778 587307 137399
17093 658660 425871 480543 243392 308209 727374 453589 421994 437869 673400 204124
17082G16118k07791k17212j18606L61108j15823A99071Q4804j22386K76555j34882
17072C03162E5076L97416J56346K0176B60619L00957R3075C7245M24177r8580
17062C62842K54647J17787C00746J35732L41030B88467J88937m0973D1125L56417
17052C97542j1323K03518j15790L15313j95028j52177L61762l3309B26063M8734
17042B74797k034M98194C76606K32306B54161L65279j38079O2104K1399j15134
17032D49730M4616K08675j06801M30070n06928K11348k26813L31456C36737L8750
17022C75487L19363k21028J32831p1556N7139O4794J03116J10075l7782k13852
17012F18587N6736L4584j0143j32599L31360n1985n4633j25277M32639n03044
$$ plain form
17082 716118 508327 291115 172509 533617 417794 199071 283875 161489 438044 303162
17072 303162 55076 452492 608838 629014 260619 561576 654651 37245 461422 362842
17062 362842 617489 735276 300746 436478 777508 288467 477404 436431 41125 397542
17052 397542 386219 589737 473947 789260 594232 442055 803817 770508 226063 274797
17042 274797 272763 770957 376606 608912 254161 619440 481361 543465 564864 449730
17032 449730 494346 703021 596220 1026290 519362 730710 503897 835353 336737 375487
17022 375487 694850 473822 606653 535097 592236 657030 760146 870221 832439 618587
17012 618587 675323 709907 699764 567165 898525 846540 791907 666630 1099269 596225
17002E96225O232M06235m32327M61308j60719J14400k89079j14876L86447L7640
16992A011486k66581k6934L61499m62555K83964q7391K22318k41160J7241K1956
16982H33843K3081K29517m00237O6853K65290l16627n7805j1545K48009Q896k6974
16971H62301J71903q6566Q7273l57845J80241K17127k19718J10992l77j06329
16961H59002J47711k15120K56524j48306R6771J73239r6606K01888l44043P0649
16951A001709J10162k68240J01001Q3432p6141q1728N54723l37597L61423l41852
16941A106892o4279R1755J59594j08428k3891j06992O8883j62571J05233K46719
16931A312915j06997J9417J79838k3461l24537L18216P6363k76367L36400j93679
$$ plain form
17002 596225 602457 1008692 576365 1037673 876954 991354 702275 587399 973846 1011486
16992 1011486 744905 717971 1079470 616915 900879 813488 1035806 794646 811887 833843
16982 833843 856924 1086441 686204 753057 1018347 701720 643915 632370 880379 889275 862301
16971 862301 1034204 947638 1034911 677066 857307 1074434 854716 965708 965331 859002
16961 859002 1006713 791593 1048117 899811 996582 1169821 1073215 1275103 931060 1001709
16951 1001709 1111871 843631 944632 1028064 951923 870195 1424918 1087321 1448744 1106892
16941 1106892 1042613 1134368 1293962 1185534 1161643 1054651 1123534 960963 1066196 1312915
16931 1312915 1205918 1225335 1405173 1381712 1057175 1375391 1451754 1175387 1511787 1318108
16921A318108M92751m45686J52586l38548K76150M5349Q4261j29942K68930j03528
16911A620431k34612m8969R8988L41530n7133j63396J56030j45031L28489j20390
16901A775937K1107q6816K23861m43931O8668N27635J6442m59867O13621l40290
16891A916367J4326J8818q3518P6788L7150J24881k34074o2604l4670M38626L421
16880B215511j42892K01661q3197K23309k24268L75939n48913K34630J52436k31982
16870B172234L60011j60256J80648J09144o207q9963k91491L41776J89165j84603
16860B620458J04466L91834m64421K58935R4110K1267M8127r0240K8249J14356
16850C127141J6351l5311J90063K21293K6280q7000j20024J39883P4289L21921
$$ plain form
16921 1318108 1810859 1365173 1517759 1179211 1455361 1500710 1584971 1455029 1723959 1620431
16911 1620431 1385819 1336850 1435838 1777368 1720235 1556839 1712869 1567838 1896327 1775937
16901 1775937 1797044 1710228 1934089 1490158 1558826 2086461 2102903 1643036 2256657 1916367
16891 1916367 1930693 1949511 1865993 1942781 1979931 2104812 1870738 1808134 1773464 2212090 2215511
16880 2215511 2072619 2274280 2191083 2414392 2190124 2566063 2017150 2251780 2404216 2172234
16870 2172234 2532245 2371989 2552637 2661781 2655574 2565611 2274120 2615896 2805061 2620458
16860 2620458 2724924 3116758 2652337 2911272 3005382 3026649 3074776 2984536 3012785 3127141
16850 3127141 3143492 3108181 3298244 3519537 3545817 3458817 3338793 3478676 3552965 3874886
16840C874886k22232p9549K38360J09207K36777J30078k85628K48068m0427L54634
16830D564174J32918j98597J78576R4266J4999q575M09677o238J95126l30922
16820E045404K76087N9699m7268M15640M71916k52977J96063K50465m26054N23041
16810F512016L63240k65935L76596k5621j6761j15702J96677L27092M28881O9471
16800G849954K15431K77594R5490L26456J52936L60795K8180K90369L34826J18831
16790A0050862j96814N07336M78959L09130J12243L68359O31786K21114m7813
16781A2435162J97129J012406K31715L44441N63606M29826l9302Q69987M23788
16772A6468758N05442J061903j0675P89857O09878O87283Q73371O31393J071284
$$ plain form
16840 3874886 3652654 3573105 3811465 3920672 4157449 4287527 4001899 4249967 4209540 4564174
16830 4564174 4697092 4498495 4677071 4771337 4786336 4777761 5187438 5181200 5376326 5045404
16820 5045404 5321491 5381190 5333922 5749562 6221478 5968501 6164564 6415029 5988975 6512016
16810 6512016 6875256 6609321 6985917 6960296 6943535 6827833 7024510 7351602 7780483 7849954
16800 7849954 8065385 8342979 8438469 8764925 8917861 9278656 9306836 9597205 9932031 10050862
16790 10050862 9854048 10361384 10840343 11149473 11261716 11630075 12261861 12482975 12435162
16781 12435162 12632291 13644697 13876412 14220853 14784459 15214285 15174983 16044970 16468758
16772 16468758 16974200 18036103 18025428 18815285 19425163 20112446 20985817 21617210 22688494
16763B2688494O62574R70371R79842J181539P59325J260697J262056J249463J303356
16754C2317717J507493J310803J373737J994636J620307K012417K098163K066162
16746D6301435K284169K902190K353832K692465L412431L216188L381569L659212
16738G0203491M047101M400244M426897M693447N075117N592414N739946N824797
16730A10003454O373829O947070O626010P076812P076219P445402O722017O737815
16722A65008628O205785N791776M785120M085510K631840J698212N27954j022162
16714A89712663k278348k935091m653291n079495o034122o559185p167729p223037
16706A47782365p563301p187589p130503p278759o826820o371466n884967o231780
$$ plain form
16763 22688494 23351068 24321439 25301281 26482820 27242145 28502842 29764898 31014361 32317717
16754 32317717 33825210 35136013 36509750 38504386 40124693 42137110 44235273 46301435
16746 46301435 48585604 51487794 53841626 56534091 59946522 63162710 66544279 70203491
16738 70203491 74250592 78650836 83077733 87771180 92846297 98438711 104178657 110003454
16730 110003454 116377283 123324353 129950363 137027175 144103394 151548796 158270813 165008628
16722 165008628 171214413 177006189 181791309 185876819 188508659 190206871 190734825 189712663
16714 189712663 187434315 184499224 179845933 174766438 168732316 162173131 155005402 147782365
16706 147782365 140219064 133031475 125900972 118622213 111795393 105423927 99538960 93307180
16698I3307180n290290n362927m773198m468822m018264l909783l937406l306436
16690E8240054l004809l022390k643461k609913k599667k027631j925302k287722
16682C8119159j594704k135998j338018j406753j436887j357704j089082j167431
16674B6592582q36829j644746n32536j172894r60561n64564j103769m73353n74143
16665A8729187j039557l58205m56400n63011n64180p81089n37094k33388l78490
16656A3817773p60274k69109l35165o00072J36629o01839n08290j11400m61644
16647A0306609n04972N6786l26676l15115p4542j78206n93932K57525m79918l19639
16637G827920k03991j26768k71122j09980l18055j50240K65034k79200m39039
$$ plain form
16698 93307180 88016890 82653963 77880765 73411943 69393679 65483896 61546490 58240054
16690 58240054 55235245 52212855 49569394 46959481 44359814 42332183 40406881 38119159
16682 38119159 36524455 34388457 33050439 31643686 30206799 28849095 27760013 26592582
16674 26592582 25755753 24111007 23578471 22405577 21445016 20880452 19776683 19303330 18729187
16665 18729187 17689630 17331425 16875025 16312014 15747834 14966745 14429651 14196263 13817773
16656 13817773 13057499 12788390 12453225 11853153 11989782 11387943 10879653 10768253 10306609
16647 10306609 9801637 9858423 9531747 9216632 9142090 8963884 8369952 8627477 8147559 7827920
16637 7827920 7623929 7497161 7226039 7116059 6798004 6647764 6912798 6633598 6194559
16628F194559l24002o8526J79602n0227k74959o3081j35809l40182k91784L47642
16618E173233l12337K5266j59538N6008k22901l29149J7823J21441j91754j29999
16608D048093K11901j41754l06437j07046j83484K89489n3003k03630k90964L62677
16598C625842k40760j4571l66408J29058k26502J48624o6772j68205K27732l36655
16588B711383J54461j24644k58424J46332l0901n7525J11533p2145J5139j43171
16578B452038k23894m0384M4918j2256J29732k39968L4982L0896J15247k95826
16568A995485K90490j89220J24610k81759n7823Q1725j18166l4333J25088K12410
16558B148507j66036P3257R7068k34976k02765K37404k09176M5610l13668J40673
$$ plain form
16628 6194559 5870557 5802031 5981633 5931406 5656447 5593366 5457557 5117375 4825591 5173233
16618 5173233 4860896 4886162 4726624 4782632 4559731 4230582 4248405 4369846 4178092 4048093
16608 4048093 4259994 4118240 3811803 3704757 3521273 3810762 3757759 3554129 3263165 3625842
16598 3625842 3385082 3370511 3004103 3133161 2906659 3055283 2988511 2820306 3048038 2711383
16588 2711383 2865844 2741200 2482776 2629108 2598207 2540682 2652215 2580070 2595209 2452038
16578 2452038 2228144 2187760 2232678 2220422 2350154 2110186 2145168 2176064 2291311 1995485
16568 1995485 2285975 2096755 2221365 1939606 1881783 1963508 1845342 1811009 1936097 2148507
16558 2148507 1982471 2055728 2152796 1917820 1715055 1952459 1743283 1788893 1475225 1615898
16548A615898k1359L7296j79001K12268K29457n39339L64850j45379k47404p5576
16538A251711L21535N0663j61851j87818j8829r8802j4826J67754P7222R6509
16528A483268j4230k53532M01345j32616l88050M04489l10925q6536J15782J61806
16518A380801k07617j89569J73498p2595j7860j39953J75719M9989o4756n909
16508A081748J64850n76582K13485J29475j75488j22745J05898K8559j00480P6240
16498H24960j140O0786m4441j07113J42126k15779L09517n7520k00778K92784
16488A003402M7766j60626J14991o677j21725M672k23180L79585l59321J86370
16478H65257K02847j44145P192l51908K49221j67255j26659J13929K57868l19735
$$ plain form
16548 1615898 1594539 1631835 1452834 1665102 1894559 1355220 1720070 1574691 1327287 1251711
16538 1251711 1573246 1623909 1462058 1274240 1255411 1156609 1141783 1309537 1386759 1483268
16528 1483268 1469038 1215506 1616851 1484235 1096185 1500674 1189749 1103213 1218995 1380801
16518 1380801 1173184 983615 1157113 1084518 1066658 926705 1102424 1152413 1087657 1081748
16508 1081748 1246598 670016 883501 1012976 837488 714743 820641 849200 748720 824960
16498 824960 823820 884606 840165 733052 875178 659399 968916 911396 710618 1003402
16488 1003402 1051168 890542 1005533 998856 877131 881803 658623 1038208 678887 865257
16478 865257 1068104 923959 931151 579243 828464 661209 534550 648479 906347 586612
16468E86612J39044r9609r5370K30845P0480K68405n31531j2086L45344l15342
16458E86792j74257L17851j24885J4998M4036j36771K50931k33584j53633L09442
16448G00920C10619P2399K65624j72464K33879J23641p1559j44014J79726l47216
16438D50635l0595A34884L81224A62990N99953j05350k70160N1380L06696k56780
16428D88729O7883B35004M71150n8032j03694k71222L47046k39604K74591r2286
16418E62953j24171j15740L40800B88199L20376k21615j49819L25616A73935N08202
16408F82137A58901J87157O1126K37753A67382P6659K01377o1003K44628B61096
16397E45563A02020J05226K23055m2858j10963j09724N4798j2333K24548N7219
$$ plain form
16468 586612 725656 626047 530677 761522 832002 1100407 568876 556790 902134 586792
16458 586792 412535 730386 605501 620499 664535 527764 778695 545111 391478 700920
16448 700920 310619 383018 648642 476178 710057 833698 762139 618125 797851 450635
16438 450635 420040 134884 516108 162990 762943 657593 387433 438813 745509 488729
16428 488729 556612 235004 706154 648122 544428 273206 620252 380648 655239 562953
16418 562953 438782 323042 663842 288199 608575 386960 237141 562757 173935 682137
16408 682137 158901 346058 407184 644937 167382 244041 445418 384415 629043 261096
16397 545563 102020 207246 430301 387443 276480 166756 221554 209221 433769 490988
16387D90988l4427k20146R0526R8749m5030n155j36159L5278o2601R6643J41594
16376D50260k8407J1448I0862M55784k17562A15892M41205p8145j67907k1605
16366B89440a17555C62750A73566J62225H9022M61876B58374L0040k7210F2747
16355D33363q7004J27590a03096D82028r4281A61619M24114B80216M0297L6110
16345C56623o5228j32585P3151E2720M86350C4495J6649K01855l0405K68317k01351
16334B89560J34702j31497J26958m1808A82602E0719K60325j46699a7899B03361
16323A59916K32699A52127F7983K28862C6447L14793o4298E8597J95693Q1456
16313C35746j05559Q9180J31304A97650K83190f3997C97368a47701A34039C8581
$$ plain form
16387 490988 456561 236415 326941 425690 380660 375505 239346 274624 212023 308666 450260
16376 450260 421853 433301 90862 546646 329084 115892 557097 478952 311045 289440
16366 289440 -117555 362750 173566 335791 89022 550898 258374 288414 261204 62747
16355 433363 346359 473949 -103096 482028 387747 161619 585733 280216 320513 356623
16345 356623 291395 158810 231961 52720 539070 34495 51144 252999 222594 490911 289560
16334 289560 424262 292765 419723 377915 182602 50719 311044 164345 -17899 203361
16323 159916 392615 152127 67983 296845 36447 351240 286942 58597 254290 335746
16313 335746 230187 319367 450671 197650 480840 -63997 397368 -147701 134039 38581
16302h4258b0418k21949c0640C10431K15680E6790f392C33741j11048p3556a42688
16290A13831k7248c4514B67115K87975B9702R2132f8689c2640A54703K1476P1301
16279B47480l4929a05258C98541B1761L0522J96328j4526a01800L4298B41229
16268C06141Q8605J19357B32577a67566C22821k2138a06306b1830B51515A05012
16257D75383D0246d8821N652D75877b62519C18718g6668B19154C2174k51M4072
16246G5995a03398B31821J23354a21347D46141r82d044n076G8517J42683K30300
16235D51500G8182L82201j44468A13632b07845A56784f2395a2923e09A33265b67055
16223A05156J66909G9894L00102A30257C8267b47675A12774L5441J76921r8879
$$ plain form
16302 -84258 -20418 -242367 -30640 310431 526111 56790 -6392 333741 222693 149137 -142688
16290 113831 86583 -34514 267115 555090 29702 121834 -68689 -32640 154703 176179 247480
16279 247480 212551 -105258 398541 21761 52283 248611 234085 -101800 -67502 241229
16268 306141 394746 514103 232577 -167566 322821 300683 -106306 -21830 251515 105012
16257 475383 40246 -48821 -43169 475877 -262519 318718 -76668 219154 32174 31923 75995
16246 75995 -103398 231821 355175 -121347 446141 445159 -4044 -9120 78517 221200 451500
16235 451500 78182 460383 315915 113632 -207845 156784 -62395 -12923 -509 133265 -267055
16223 105156 272065 79894 379996 130257 38267 -247675 112774 148215 325136 226257
16213B26257J72844A44497M65057a2880A43657a8764H0763K83394j31368n8658
16203A74131F1203K11376A20933E4544L6408N9252e5624B02306b32969G8170B401
16191i0337G2184a8722j14105E189M57272i4365A94343r2927J49312h0683a9153
16179D9520a35244j6501C10549a06787B8313b40778A82226L3703I8227a30039
16168A42980A3113b78807g091A36264c7552k52582B02030p00E720b68213A83340
16156b87321G09965b36831A44962R1336J7190a5825o690A01350A7015a09842B47192
16144a60585a3875k16504B05768J10546r4866a11232D30298B9213i4047B99497
16133A87424D4349R1556f0399n4799A39033e4118J7044G0204a65925A43572C2007
$$ plain form
16213 226257 399101 144497 609554 -12880 143657 -18764 80763 364157 232789 174131
16203 174131 61203 272579 120933 54544 90952 150204 -55624 202306 -232969 78170 2401
16191 -90337 72184 -18722 -132827 5189 462461 -94365 194343 101416 250728 -80683 -19153
16179 49520 -135244 -151745 310549 -106787 28313 -240778 182226 215929 98227 -130039
16168 142980 13113 -278807 -7091 136264 -37552 -290134 202030 201330 5720 -268213 183340
16156 -287321 709965 -236831 144962 236298 253488 -15825 -22515 101350 17015 -109842 247192
16144 -160585 -13875 -230379 205768 316314 221448 -111232 430298 29213 -94047 299497
16133 187424 44349 135905 -60399 -115198 139033 -54118 -37074 70204 -165925 143572 32007
16121C546a42268m6a6941j15976a3033l2211A35325c9752j75581B12178a26792
16109h3788C1446K62143p1424H7117d26219a0222o53q8243E15610B04766a55888
16097B38564G4206j7518J45281d2899B7146a39131A56337J62586P9572j11940
16087B86555A25539o2392g3466k62823c159C04262a02515J5850e798E090a32403
16075a88081j39882B8142K57239f6866I0817b71185A37641A0321J4548h502B88733
16063C0481g1837M485A20158b8667k0038B31540n3099h2811A12078b01820d1243
16051b69606B3733L6355h588C23553A33712b1710I7859a16333b1211G70b46832
16039d4869A19188o75c9273n07A9578g6096q5248K9031j71880G6487a94453A11310
$$ plain form
16121 3546 -142268 -142314 -16941 -132917 -13033 -45244 135325 -39752 -215333 212178 -126792
16109 -83788 31446 293589 222165 87117 -426219 -10222 -10875 -99118 515610 204766 -155888
16097 238564 74206 56688 201969 -42899 27146 -139131 156337 318923 398495 286555
16087 286555 125539 63147 -73466 -336289 -3159 304262 -102515 -86665 -5798 5090 -132403
16075 -188081 -327963 28142 285381 -66866 90817 -271185 137641 10321 24869 -8502 288733
16063 30481 -71837 -67352 120158 -28667 -48705 231540 178441 -82811 112078 -201820 -41243
16051 -269606 23733 60088 -8588 323553 133712 -21710 97859 -116333 -21211 770 -246832
16039 -44869 119188 118513 -39273 -39780 19578 -76096 -161344 -132313 -304193 76487 -194453 111310
16026A54631f5269A48313R322a87721e1778A72359b32897D5351d9845A85999i3825
16014A70009B0055b75767h3022j27334B00253H2430J42410A01703a68585e5279
16003a74714p6497a08074N2809J94B76699m3986H0949a38298r0086q0635g9984
15991B5366b43931F4632C1195b41545a8540B14785o2103E5058J33886r2197K57646
15980C54393D9543A6703J06250J06109l9835a77018k1762A91925o2407i2973A46058
15968C11536j10158d6079j98645c4441F9715b41334p2079a47030c2354B3770i5428
15956i0578C37765A08956a16537j6205m07794A05870k378j4799P9347a28196e0464
15944A80499A4402J53290a2920m4569H2573h2193j74474Q6621b6067k32597f8633
$$ plain form
16026 154631 -65269 148313 157635 -187721 -51778 172359 -232897 45351 -49845 185999 -93825
16014 170009 20055 -275767 -83022 -210356 200253 82430 224840 101703 -168585 -55279
16003 -174714 -251211 -108074 -55265 -55071 276699 232713 80949 -138298 -228384 -309019 -79984
15991 25366 -243931 64632 31195 -241545 -18540 214785 152682 55058 188944 96747 354393
15980 354393 49543 16703 122953 229062 189227 -177018 -198780 191925 129518 -92973 146058
15968 311536 201378 -46079 -244724 -34441 69715 -241334 -313413 -147030 -32354 23770 -95428
15956 -90578 337765 108956 -116537 -132742 -540536 105870 103492 88693 168040 -128196 -50464
15944 180499 14402 167692 -12920 -57489 82573 -82193 -256667 -170046 -26067 -258664 -68633
15932e6050j85977i9100o5830C20965E8498J43522p3552J06750K05681I3224j0727
15921H2497g7809A34402d91424d5571J1034a1203n9584r4348M3819E4429a36140
15909D4090a0953k18377B0830h6842k43709B17879i3962B9600a19602o9498n297
15898a94397e8325j32265A18082c79317A23165a86401a1325H360a39410o0903
15888b00313b3050j21796e180B74077h4001c1240k12810A9409N0871R396a24688
15876a94922A99768k9705a41987d1021B36582h7897b9244G9519g1173E4699b28442
15864I69a26997N8478C21265A52213A3144a62106M2091A14858E5265b47398C19719
15852c61880J65593j8549d7795K341j7879A29063B7559J09329b77719J20173P0429
$$ plain form
15932 -56050 -242027 -99100 -164930 320965 58498 202020 128468 235218 440899 93224 82497
15921 82497 -77809 134402 -491424 -45571 -34537 -11203 -70787 -165135 -121316 54429 -136140
15909 44090 -10953 -229330 20830 -86842 -330551 217879 -93962 29600 -119602 -189100 -194397
15898 -194397 -58325 -190590 118082 -379317 123165 -186401 -11325 8360 -139410 -200313
15888 -200313 -23050 -144846 -5180 274077 -84001 -31240 -244050 19409 70280 79676 -124688
15876 -194922 199768 170063 -141987 -41021 236582 -87897 -29244 79519 -71173 54699 -228442
15864 969 -126997 -68519 321265 152213 13144 -162106 -120015 114858 55265 -247398 319719
15852 -361880 -196287 -214836 -47795 -45454 -63333 129063 27559 136888 -277719 -157546 -87117
15841h7117B59472A15341a52993D01035L5696e4891k0817n0428d2499f266H6075
15829I3316a73984A60818E6424e7396B45407b92330h3741A77930A7339c4749A78612
15817a24824D0894K399M0037a23567H2010b42482a4336o8180A14086B9350J70335
15806A99685b64932J4651h0964C07445E4218P7516L704b26278j10334I0291f7901
15794B6183i7627B68981A02108p93K88063A6293J4856J30963f13r4223N713p5434
15782a64557m815m9354f5708B36210G3262O2950p251B730a2550p0510L5688c177
15769f1421k90964B40737E967b0483k33796i8706C08042a06309C7107A7062b01250
15757A0134J04218d7698k81744a35984A45619D9591a52056B00952C0069J07996
$$ plain form
15841 -87117 259472 115341 -152993 401035 436731 -54891 -75708 -126136 -42499 -6266 86075
15829 93316 -173984 160818 56424 -57396 245407 -292330 -83741 177930 17339 -34749 178612
15817 -124824 40894 43293 83330 -123567 82010 -242482 -14336 -82516 114086 29350 199685
15806 199685 -264932 -250281 -80964 307445 54218 131734 135438 -226278 -336612 90291 -67901
15794 26183 -97627 268981 102108 101315 389378 16293 31149 162112 -613 -94836 -89123 -164557
15782 -164557 -169372 -218726 -65708 236210 73262 136212 128961 2730 -12550 -83060 -47372 -3177
15769 -61421 -352385 240737 5967 -20483 -254279 -98706 308042 -106309 37107 17062 -201250
15757 10134 114352 -47698 -329442 -135984 145619 49591 -152056 200952 30069 138065
15747A38065D535c5774A4142J56236A9839e4824F6590a46144e1082A54803c8546
15735b35958E8256c09393r916f1387I9736J03294D9185g0599e128A90584a30826
15723A25748K1983a6278A06828a55098B31152F347Q1740i4431J2497j00450n598
15712a87982C6853L8173a00379J2910A66101c62642F5669b0958j33880A5746N6103
15701G1849b14719a0213l22491I1571P9266b42922C6793a04161M9800B42003o2973
15690A79030A542R1293K94935A84883K8455f8578r6166g7006j25836f3057j96349
15679b59406N9178B5405c4302r8617H3924J11012R37a88019B21c59285A1253L829
15667A5082D188i6350k5736A19382d7211k15470K3698K8728L2020j3632I8327
$$ plain form
15747 138065 4535 -35774 14142 170378 19839 -54824 66590 -146144 -51082 154803 -38546
15735 -235958 58256 -309393 -319309 -61387 99736 203030 49185 -70599 -5128 190584 -130826
15723 125748 147731 -16278 106828 -155098 231152 6347 88087 -94431 -81934 -182384 -187982
15712 -187982 36853 75026 -100379 -87469 166101 -362642 65669 -20958 -154838 15746 71849
15701 71849 -214719 -10213 -332704 91571 170837 -242922 36793 -104161 -54361 242003 179030
15690 179030 1542 92835 387770 184883 213338 -68578 -164744 -77006 -202842 -63057 -259406
15679 -259406 -200228 25405 -34302 -132919 83924 194936 195873 -188019 221 -359285 11253 15082
15667 15082 4188 -96350 -122086 119382 -47211 -262681 -238983 -210255 -178235 -191867 98327
15655c15055n6412C4557J29073a43498O7385i424o6400q7309N2498B2183N6221
15644G8404l4163K82615A7308e1207k27318J29128j80228R1232E7020b69029e5228
15632A28725a6747p9205B6723d00383D1739Q0497J05857r5898E0023a42861N5934
15621h6927L277A64802P9042a03572D8082j1101J20749A8684a80179B0153K30148
15610B50301A06143d8302A36201a60801B35056e4264A9863R1489b47219d2945
15599A13911B5608b375A14498a07015A65376a94847F8150N4677b27230B1008J79577
15588B00585J0002b72100a17143d7505o9509A5757J76660e3832A5913e8621q158
15577f6779j74903A78244d3698A38563D4949O8293a22867C8631J87444C2643b39256
$$ plain form
15655 -315055 -371467 34557 163630 -143498 -76113 -9424 -75824 -163133 -110635 22183 78404
15644 78404 44241 326856 17308 -51207 -278525 -149397 -329625 -238393 57020 -269029 -55228
15632 128725 -16747 -95952 26723 -400383 41739 122236 228093 132195 50023 -142861 -86927
15621 -86927 -83650 164802 243844 -103572 48082 36981 157730 18684 -180179 20153 250301
15610 250301 106143 -48302 136201 -160801 235056 -54264 19863 111352 -247219 -42945
15599 113911 25608 -2375 114498 -107015 165376 -194847 68150 122827 -227230 21008 200585
15588 200585 210587 -272100 -117143 -47505 -117014 15757 192417 -53832 15913 -58621 -66779
15577 -66779 -241682 178244 -43698 138563 44949 113242 -122867 38631 226075 32643 -239256
15565E541a78364B940a27352D02987A1993N2161A8840a48k07842E5175J21971
15554A77146b99319J06722i1331B4407Q5234A8360b57641C3406a20514A90144
15543a78577A66508a74164A5858b76475A05124l3774J79404H6724L48587c5755
15532A13300k418J10667C2139J91453a37849A14825E3782d3539q0711f730A36596
15520C18384G8868P6335J75707H9357D53K1682K92212C0999J53795A1892J30521
15509A42413o3191J13038J22594E0434J34338a07402A3942e4019j11736B35543
15498A71284H0233b05046f1775p908J0835A86731p5253b32224D6424O3207C7800
15486C3975J39830J0733G625e9551r7289B00031B1341c36083O3726b7980B15064
$$ plain form
15565 5541 -178364 2940 -127352 402987 11993 64154 18840 -148 -207990 55175 177146
15554 177146 -299319 -192597 -91331 24407 109641 18360 -257641 33406 -120514 190144
15543 -178577 166508 -174164 15858 -276475 105124 71350 250754 86724 435311 -35755
15532 113300 110882 221549 32139 223592 -137849 114825 53782 -43539 -124250 -6730 136596
15520 318384 78868 155203 330910 89357 453 22135 314347 30999 184794 11892 142413
15509 142413 79222 192260 314854 50434 184772 -107402 13942 -54019 -165755 235543
15498 171284 80233 -205046 -61775 -69683 -58848 186731 111478 -232224 46424 109631 37800
15486 33975 173805 184538 7625 -59551 -156840 200031 21341 -336083 -272357 -27980 215064
15474C5288a93496A34674a42583a2982j00835m7253A7037a5184k46169B74115
15463A82047a01387B54042a9066B1914J60662e7172j50452B18048G7161J42386
15453B19547B9929L43288m3987j36320D6592J11429c7302q6028F8939r120R8488
15442A58307D3270e0903j32592d6583A52323a422F0005a99296F7214a55927E8443
15430e0208l29722A6514e2780h150E9400R1609a21625j05865C36062d4114j48108
15419a92222A57265f9177A35444e0142G2746N1156f5356A10441b43398L1505o156
15408b18049e0829B71693G394P1498N655Q2616g8966A38057r388E8838K9589A7350
15395a99863C7320g0473H6956g8332k7180b4937p4856c3398A17703a89075R1614
$$ plain form
15474 35288 -193496 134674 -142583 -12982 -113817 -161070 17037 -15184 -261353 274115
15463 182047 -101387 254042 -19066 21914 182576 -57172 -207624 218048 77161 219547
15453 219547 29929 373217 329230 192910 46592 158021 -37302 -123330 68939 59819 158307
15442 158307 43270 -50903 -183495 -46583 152323 -1422 60005 -199296 67214 -155927 58443
15430 -50208 -379930 16514 -52780 -8150 59400 151009 -121625 -227490 336062 -44114 -192222
15419 -192222 157265 -69177 135444 -50142 72746 123902 -65356 110441 -243398 -211893 -218049
15408 -218049 -50829 271693 7394 78892 84547 167163 -78966 138057 128669 58838 88427 17350
15395 -199863 37320 -70473 86956 -78332 -105512 -24937 -99793 -33398 117703 -189075 -97461
15384i7461j28960o3371a07179B68996A046a34865A67043K0107j2179d054j3777
15373a7831o0527q2588g8105j27544j96463J80642b2026B17888A06701f4150A51957
15361i9413I2684d6044J2656a4256B50553K4846C9829g2494H4262c1987l73166
15350d05153B8849N4752D825M3749h8063B337N8707L1803f4794A27533J11046
15339B38579B1365R1252N6752d8773j2447j08627D72037i8153M3122H6180k1582
15328F4598d9430B5633h0783a9635G7790C1360a45078D9987N7340a8117A77954
15316a39369b8755j10378A46727a39539O8145I218a7994B65429j04033p9711J89318
15305B71003b5558n1784L6509j10381E4395b13238G8981B9521c80283C01603B5705
$$ plain form
15384 -97461 -226421 -289792 -107179 268996 1046 -134865 167043 187150 174971 -4054 -17831
15373 -17831 -78358 -160946 -78105 -205649 -402112 -221470 -22026 217888 106701 -64150 151957
15361 -99413 92684 -46044 -33388 -14256 250553 275399 39829 -72494 84262 -31987 -405153
15350 -405153 28849 83601 4825 48574 -88063 2337 61044 92847 -64794 127533 238579
15339 238579 21365 112617 169369 -48773 -61220 -169847 472037 -98153 -55031 86180 64598
15328 64598 -49430 25633 -80783 -19635 77790 31360 -145078 49987 107327 -18117 177954
15316 -139369 -28755 -139133 146727 -139539 -71394 9218 -17994 265429 161396 81685 271003
15305 271003 -25558 -77342 -40833 -151214 54395 -213238 78981 29521 -380283 301603 25705
15293G430f1341h910A8874Q661d1305C4399a02655B03574d9136p3186B03618D479
15280d5951E9386k3823i8744C7101K72007p8056M596j02492K2557b16280f516
15268h8568d1122k03246A20539N1480G0475L22136a96207D7379k1209J80525n645
15257B01050q4154K21978K7801b5489B61695A03376L04508E7337N93793P69068
15247A420198j47972Q8247K70985G02402B95402a20246a253r1604j44238A26795
15236A24229A55P3817d2195A6081h1777A646J72005p1933c3601G9385J4264f6804
15223C4456C95a05350q2271A09749a50753E03527A84027E8192a03615B43782a13132
15211C27704l4094J66142F9265A5030J72116N4695A07281M9300h3110G0151J95460
$$ plain form
15293 7430 -61341 -8910 18874 27535 -41305 34399 -102655 203574 -49136 -122322 203618 4479
15280 -45951 59386 35563 -98744 37101 309108 231052 235648 133156 155713 -216280 -6516
15268 -88568 -41122 -244368 120539 172019 70475 392611 -196207 47379 26170 206695 201050
15257 201050 116896 338874 366675 -25489 261695 103376 407884 57337 651130 1420198
15247 1420198 1272226 1360473 1631458 702402 295402 -120246 -1253 -92857 -237095 126795
15236 124229 155 73972 -42195 16081 -81777 1646 173651 101718 -33601 79385 93649 -66804
15223 34456 395 -105350 -187621 109749 -150753 503527 184027 58192 -103615 243782 -113132
15211 327704 293610 459752 69265 15030 187146 241841 107281 156581 -83110 70151 265611
15200B65611p7305P6474A20601g3389j04613B2165L23860D9242Q7873J75590b3172
15188A95947m5540m2227B6395a69921A75309F9702n896K92031j73324o9233b31428
15176b90000A40425K36205c207j26819A21191A2520K65785A06725a60820m5333
15166b06153B40137H0177J40566c59716A53735Q6971p9005m0016M4493p9214P2584
15155A59548O1688l6736b18562O7807B60495A21647J99289J64364f3563A51022
15144D69M4544J57613A6695a69317B83653m5786I9060n948L81446A774O8355J07372
15132A77501F1814k5090J14183D8492N01502A53138J0805M6667l8264M1920q5408
15121A28858O940m5254m464i0052C13230A33224a42706D7389Q0675L2756K8031
$$ plain form
15200 265611 188306 264780 120601 -73389 -178002 22165 346025 49242 137115 312705 -23172
15188 195947 150407 108180 26395 -169921 175309 69702 63806 355837 182513 113280 -231428
15176 -290000 140425 376630 -3207 -130026 121191 12520 278305 106725 -160820 -206153
15166 -206153 240137 80177 220743 -359716 153735 240706 161701 121685 166178 86964 159548
15155 159548 221236 184500 -218562 -150755 260495 121647 320936 485300 -63563 151022
15144 469 45013 202626 16695 -169317 283653 237867 99060 93112 474558 1774 70129 177501
15132 177501 61814 36724 150907 48492 549994 153138 163943 210610 172346 214266 128858
15121 128858 135798 90544 86080 -90052 313230 133224 -142706 47389 128064 160820 188851
15110A88851a29958C09586a9429I9784a81617c9407J2714j88447B00614R5098
15100B95712b00258D77392j52576b12368A45940E4493J78879q0395k5018J39534
15090B67493e8218B87154A25974a3090A64686K65669j43248H8545M4956E4744
15079f8D23615A55118O7318J86788H0276c5612B41188g390A80177J60597J33035
15068D73809A38711R0079j05857P3704a38373A60403I92K22197A06347a21761
15057D67660j20876A47134K04578E0817J50203c4036C2825K19116B6739K30318
15047B57057J06175j27469l0526J88470a34627A47424K657b4714m8974J7349p9842
15036a36181B48271r8298b1021A44262L28422j46988r2830K06695j38443K76984
$$ plain form
15110 188851 -129958 309586 -19429 99784 -181617 -39407 -26693 -215140 200614 295712
15100 295712 -200258 477392 324816 -212368 145940 54493 233372 152977 127959 267493
15090 267493 -58218 287154 125974 -13090 164686 430355 287107 88545 133501 54744
15079 -68 423615 155118 222436 409224 80276 -35612 241188 -7390 180177 340774 473809
15068 473809 138711 228790 122933 196637 -138373 160403 992 223189 106347 -121761
15057 467660 346784 147134 351712 50817 201020 -34036 32825 251941 26739 257057
15047 257057 363232 235763 205237 393707 -134627 147424 150081 -24714 -73688 -56339 -136181
15036 -136181 248271 149973 -21021 144262 472684 325696 232866 439561 301118 578102
15026E78102B71659Q9974j60509G5662J69500n8029K6357J1070E4952b58010a2557
15014C43352A48968J7140J35613E9883J31197J44233H4557L3497J90157A03013
15003E96308e9406H4152J44155A07434a1838D00155a33931C23261J20954a57636
14992a016B50785I8041K51250l5393j37650L0806P1301j04288L13951k16527K30946
14981E02437j15846j64928J73726p4246k6642j42034M762B2353g804C36677M1524
14970C78201B2760K52117j23693M27794K8330j13144A23455P7288L09996m8096
14960D62643J20827j90292A84328L07202B23273P7662J27443j39804j03185P7295
14950B62684J79752j70897J54577A44631K08337j28800F267J56150E0274J89046
$$ plain form
15026 578102 271659 361633 201124 75662 245162 187133 213490 224560 54952 -258010 -12557
15014 343352 148968 166108 301721 59883 191080 335313 84557 118054 308211 103013
15003 596308 -59406 84152 228307 107434 -11838 400155 -133931 323261 444215 -157636
14992 -1016 250785 98041 349291 313898 176248 207054 278355 174067 488018 271491 502437
14981 502437 386591 221663 395389 321143 294501 152467 157229 22353 -7804 336677 378201
14970 378201 22760 274877 151184 578978 607308 494164 123455 200743 510739 462643
14960 462643 583470 393178 184328 491530 223273 300935 428378 288574 185389 262684
14950 262684 442436 271539 426116 144631 352968 224168 6267 162417 50274 239320
14940B39320N9512J96346A28399M66483j67783j71154a24867C17607j01206N0339
14930B66740p0572K46681p9076I0131K19750K5202P7670K4370G3815e8861B15567
14918A45823R6473A00564K59024l6215A49189L17445j58545A36322L24017j03150
14908C57189J49259A45716J88021k0124A25860N39569B34306J41087j53683J81804
14898D03514g4329D53351K71095k59780A86072o4353J23858L8679K11745k33852
14888B62149J64183j38425K07975j97551K00506A69626K25841j05917J32120J12194
14878E33864B16742F5014d5274E15590j41346p5931P6968M36279L6586B93467
14867G35127k83614R8744P3532l08771J15293A73809K2383K01177k0743P94L34270
$$ plain form
14940 239320 298832 495178 128399 594882 427099 255945 -124867 317607 216401 266740
14930 266740 196168 442849 363773 90131 309881 335083 412753 437123 73815 -58861 215567
14918 145823 242296 100564 359588 323373 149189 466634 308089 136322 460339 357189
14908 357189 506448 145716 333737 313613 125860 665429 234306 375393 221710 403514
14898 403514 -74329 453351 724446 464666 186072 121719 245577 284256 496001 262149
14888 262149 426332 287907 495882 298331 498837 169626 395467 289550 421670 533864
14878 533864 216742 65014 -45274 515590 374244 298313 375281 811560 848146 293467
14867 735127 451513 550257 623789 315018 430311 173809 196192 397369 376626 377420 711690
14856G11690l22974K21713k19828A93787L18100j01004R6142k01645L50801o5616
14846E90565B01043J85495N671L13721l30413K22907k39561J82702j3170J27995
14836F56390j36764P2915j46151j7799J62022j17255K3993P9182n3320q2708j83448
14825B57057K99449A60429L60502j21621J44715L9893m7712J43439j62237J19994
14815F37402Q4752k58236B17918L79413q3634j32920M53489j77125k69895K41457
14805F28703J6611l20798K69847j97323L16736j37928m0930M7997l2493k51999
14795B98423K66184m0158J46767K17756j60467j62427j99512J12446K93736l12973
14785D59775J99608k20762L53844J50191m22620R6694L96203l49729q2290p453
$$ plain form
14856 711690 388716 610429 390601 193787 511887 410883 507025 305380 656181 590565
14846 590565 201043 386538 392209 705930 375517 598424 358863 541565 528395 656390
14836 656390 519626 592541 446390 428591 590613 473358 497351 576533 523213 440505 257057
14825 257057 556506 160429 520931 399310 544025 583918 536206 679645 517408 637402
14815 637402 722154 463918 217918 597331 513697 380777 834266 657141 387246 628703
14805 628703 645314 324516 594363 397040 713776 575848 534918 582915 550422 298423
14795 298423 564607 524449 671216 888972 728505 566078 366566 479012 772748 459775
14785 459775 659383 438621 792465 942656 520036 616730 1012933 663204 580914 573461
14775E73461k04655J17667k829j45336L31034j69774K53185C09064J78171K28441
14765G15676N8864j58887p0441J4305K53287j43336p173Q8506K41688m37662M2734
14754E97561r4822J31677j00130K78697k48151L06456j13457o4648K23086j08868
14744H07401n7830J44407r1961j57412J10856O5287P1046l19846K00204l5400
14734G36752l7300J12628K4580K4168r7214J84514j6736l00682J81546J31588
14724I43844m886q5374K24331m69475K08518M0708J81008r2739j64209j8409K2067
14713G85384N8516M2452J58950k74797K88496l09199o8748M2061J59573N9596
14703I42284m6657k60226L59136l91663J52480j8538J56610L16429k91247L8057
$$ plain form
14775 573461 368806 486473 483644 338308 669342 499568 752753 309064 487235 715676
14765 715676 774540 615653 545212 559517 812804 669468 662295 750801 992489 554827 597561
14754 597561 502739 634416 534286 812983 564832 871288 757831 693183 916269 807401
14744 807401 749571 893978 802017 644605 755461 820748 891794 571948 772152 736752
14734 736752 699452 812080 836660 860828 763614 948128 931392 630710 812256 943844
14724 943844 938958 853584 1077915 608440 816958 857666 1038674 945935 781726 763317 785384
14713 785384 843900 886352 1045302 770505 1059001 749802 681054 723115 882688 942284
14703 942284 895627 635401 994537 602874 755354 736816 893426 1209855 918608 956665
14693I56665k04881J72363r8016J96159l48579P67101n78840J06856K67708n55865
14683F80671K42057J67313L02073n92449L64041p4938j79905K48246m61157K23929
14673I19881L77222k88730O062R7286J68105m84718M26355M4347k71317J30130
14663A124623j75265k2047J82721L1155L2381m4174L24093r6188m13926L50439
14653A293812l15180J2886P0331L27136j86702j3081N4717J38966k63874j09628
14643A009383L52427m00337K45234O7687K34832R998k51288K51344j56872J08036
14633A470444J17644k19871l66473N2260K32202L2446j94728N47639l66311J96559
14623A501811l4073j25580K81548J30416p8526l02155J24348N6857j94450J11918
$$ plain form
14693 956665 751784 924147 826131 1022290 673711 1440812 861972 968828 1236536 680671
14683 680671 922728 1090041 1392114 799665 1163706 1088768 908863 1157109 695952 919881
14673 919881 1297103 1008373 1014435 1111721 1279826 795108 1221463 1265810 994493 1124623
14663 1124623 949358 927311 1110032 1141187 1173568 1129394 1453487 1357299 943373 1293812
14653 1293812 978632 991518 1061849 1388985 1202283 1189202 1243919 1382885 1119011 1009383
14643 1009383 1361810 961473 1206707 1274394 1509226 1519224 1267936 1519280 1362408 1470444
14633 1470444 1588088 1368217 1001744 1054004 1286206 1318652 1123924 1671563 1305252 1501811
14623 1501811 1467738 1342158 1623706 1754122 1675596 1373441 1497789 1554646 1360196 1472114
14613A472114J81051M1715k48022L71020k4749j88576K36365n2623k84962K15872
14603A719205Q7066J66176m14064K42406k29791M1024K89391l32904L48071k25826
14593A690754k87932K08179J27983k47896L05746o1530J76535K22363k5540j15833
14583A992829o9385L78625j98357l20351L2554K21156l513J94139M9383m46778
14573A830302N71675N5379l19426q2630M10329r1425j70510K68128L38039j62800
14563B647061k63948J22896M31679K2734p6595j17114M77333K257K77009M01022
14553C924334q155K63340P70233J257312J100601M184376P956117J6639129O289200
14544D2376487j8194897A1637151E683528k015362j133770o94492L41357r9251
$$ plain form
14613 1472114 1653165 1694880 1446858 1817878 1793129 1604553 1840918 1788295 1503333 1719205
14603 1719205 1806271 1972447 1558383 1800789 1570998 1612022 1901413 1568509 1916580 1690754
14593 1690754 1402822 1611001 1738984 1491088 1796834 1735304 1911839 2134202 2108662 1992829
14583 1992829 1923444 2302069 2103712 1783361 1815915 2037071 2033558 2227697 2277080 1830302
14573 1830302 2401977 2457356 2137930 2055300 2465629 2374204 2203694 2471822 2809861 2647061
14563 2647061 2383113 2506009 2937688 2960422 2883827 2766713 3244046 3246303 3523312 3924334
14553 3924334 3916179 4179519 4949752 6207064 7307665 11492041 19448158 36087287 42376487
14544 42376487 24181590 11637151 5683528 3668166 2534396 1839904 2181261 2082010
14536B082010n6446k2886J64249n1701Q3002L09456m36181J87694K64611m25481
14526B098327L54958j48929J70074k66271J70821K05311k08633K39343K93829
14517B908830l08826J14281k47738J83986K64854m6917M45516n79630N29292k19168
14507C044480j2321O2897j4354K6576J34447K8695K56297k52858l6960p3379J84311
14496C347831K45476J92188n02125J52981J10530K82204k61631M72077j30754
14487C908777N0072k30883J64274o7168m8703J09231K04902k7621j30940J72399
14477D104340J19450k39990R383L81820R8595J57507R1240o39164M61772o0781
14467D484172L10558j91231K04971j24383K87619O4046k67084M57305m81145M13155
$$ plain form
14536 2082010 2025564 2002678 2166927 2115226 2198228 2507684 2071503 2259197 2523808 2098327
14526 2098327 2453285 2304356 2474430 2208159 2378980 2584291 2375658 2615001 2908830
14517 2908830 2600004 2714285 2466547 2650533 2915387 2868470 3313986 2734356 3263648 3044480
14507 3044480 3032159 3095056 3080702 3107278 3241725 3270420 3526717 3273859 3236899 3163520 3347831
14496 3347831 3593307 3785495 3283370 3436351 3546881 3829085 3567454 4039531 3908777
14487 3908777 3958849 3727966 3892240 3825072 3776369 3885600 4090502 4062881 3931941 4104340
14477 4104340 4223790 3983800 3993183 4375003 4473598 4631105 4722345 4083181 4544953 4484172
14467 4484172 4794730 4603499 4808470 4684087 4971706 5035752 4768668 5225973 4744828 5157983
14457E157983j75633K66463J07597J58461O7922o1182j84126J65368J06212R9936
14447E709001j16201M22308k43644M84324l41101O72566j85045J24604k26171
14438F300641M9778Q9609N61930k83687l11208N94318L0895j7973J63677M0988
14428G218968K09124o9474L36747N9261O7046K21588j13577k387K15925K10672
14418H353893K38560J41758j56740L29192K5395q9039N72219p8789K27454J1225
14408I575128L70458j66495J21153M80315J24743j11917K49303J11768L92095
14399A1146551K04544j68130O0568N01360M98554P3151J62706M17280P8403M8390
14389A3023377K80523L84616J31276j003M57709K14859K69586J39343N56370p0739
$$ plain form
14457 5157983 4982350 5248813 5356410 5514871 5582793 5521611 5337485 5502853 5609065 5709001
14447 5709001 5592800 6015108 5771464 6255788 5914687 6587253 6402208 6526812 6300641
14438 6300641 6350419 6440028 7001958 6718271 6407063 7001381 7032276 7014303 7177980 7218968
14428 7218968 7428092 7358618 7695365 7754626 7821672 8043260 7929683 7927296 8143221 8353893
14418 8353893 8592453 8734211 8577471 8906663 8932058 8843019 9415238 9336449 9563903 9575128
14408 9575128 9945586 9779091 9900244 10380559 10505302 10393385 10642688 10754456 11146551
14399 11146551 11351095 11182965 11243533 11744893 12243447 12316598 12479304 12896584 12974987 13023377
14389 13023377 13303900 13688516 13819792 13818789 14276498 14491357 14760943 14900286 15456656 15385917
14379A5385917M11439L20749M25860N73133K93730j26440N39082J96050K57585
14370A8277105N77542K87133M17481J13556P51112N58905J24677M04391M86973
14361B1998875Q52589K16315L20989P07381P25541M80161L22609O91304P37950
14352B7053714O97087K38860J067364Q54565N43118L36414J016927Q60366Q97970
14343C3566385P54709R18626P96451J018891J114376J081767J233233J486894
14335D1971332R83586Q69299J543907J164480J412426J694682J372338J828733
14327E2840783J724623J781779J657384K009748J887702K288427J991561K839724
14319F9021731K143663K449979K542323L269222K640777L491234L159133L577826
$$ plain form
14379 15385917 15797356 16118105 16543965 17117098 17410828 17284388 17823470 18019520 18277105
14370 18277105 18854647 19141780 19559261 19672817 20423929 20982834 21107511 21511902 21998875
14361 21998875 22851464 23067779 23388768 24096149 24821690 25301851 25624460 26315764 27053714
14352 27053714 27750801 27989661 29057025 29911590 30454708 30791122 31808049 32668415 33566385
14343 33566385 34321094 35239720 36036171 37055062 38169438 39251205 40484438 41971332
14335 41971332 42954918 43824217 45368124 46532604 47945030 49639712 51012050 52840783
14327 52840783 54565406 56347185 58004569 60014317 61902019 64190446 66182007 69021731
14319 69021731 71165394 73615373 76157696 79426918 82067695 85558929 88718062 92295888
14311I2295888L425346M156737L886220M388224M483621M989486M824590N387272
14303A27837384N597054N941325O204573O696549P215346P444960P958888Q238092
14295A83134171Q747130R201180J0125901J0056378J0755517J1384576J1837308
14288B55242161J2338089J2705444J3189538J3479129J3812770J4212429J3988353
14281C48967913J4469085J4106921J3778454J3346290J2107607J1062781R636020
14274D37475071P367800N359363K605782j25189k510576k575131m854680l537350
14266D39205090n797374p953895j0129916j2165643j3005526j4534729j4848609
14259C60769398j5363918j5450869j4857402j5065852j4142170j3333530j3274180
$$ plain form
14311 92295888 95721234 99877971 103764191 108152415 112636036 117625522 122450112 127837384
14303 127837384 133434438 139375763 145580336 152276885 159492231 166937191 174896079 183134171
14295 183134171 191881301 201082481 211208382 221264760 232020277 243404853 255242161
14288 255242161 267580250 280285694 293475232 306954361 320767131 334979560 348967913
14281 348967913 363436998 377543919 391322373 404668663 416776270 427839051 437475071
14274 437475071 444842871 450202234 452808016 452682827 450172251 447597120 442742440 439205090
14266 439205090 433407716 425453821 415323905 403158262 390152736 375618007 360769398
14259 360769398 345405480 329954611 315097209 300031357 285889187 272555657 259281477
14252B59281477j2751536j2380736j1532249j0817313j0534422r774519r197013
14245A82293689q759918p825590p803733p402389p190772o345488o089287n715867
14237A25160645n197783n063576n042107m499952m462492m059048l697312l450898
14229H9687477l623249l208408l371616k810869k890032k650014k515410k448318
14221F6169561k055964k281667k041035j954196k000654j793266j523131j702036
14213E0817612j476329j516947j452195j244924j367914j106566q52186q80277
14205D0920274j572616j211929j106052j260933k23329q39374j097758j245959
14197C2362324p15937q61651r74811k02222q65562n29035j228281m94531n77563
$$ plain form
14252 259281477 246529941 234149205 222616956 211799643 201265221 191490702 182293689
14245 182293689 173533771 165708181 157904448 150502059 143311287 136965799 130876512 125160645
14237 125160645 119962862 114899286 109857179 105357227 100894735 96835687 93138375 89687477
14229 89687477 86064228 82855820 79484204 76673335 73783303 71133289 68617879 66169561
14221 66169561 64113597 61831930 59790895 57836699 55836045 54042779 52519648 50817612
14213 50817612 49341283 47824336 46372141 45127217 43759303 42652737 41800551 40920274
14205 40920274 39347658 38135729 37029677 35768744 35545415 34706041 33608283 32362324
14197 32362324 31646387 30784736 29809925 29607703 28742141 28213106 26984825 26490294 25912731
14188B5912731p31739p97647k78007o02673n98723p38306k28043n69757j92361
14179B1175475l01633p47718k98662o28407j28574l89837m28539o10716j4385
14170A7627004n05015n38723K6243k85145o04351j30334m55972J31574k86769
14161A4978512l32736k67113n79949j10601j35258m08538l51673j48355K6430
14152A2670719j13527j91028m39039j45771m1812j79032n63576M06495p13603
14143A0689826j58184J36181k51867p8825n5180l23838J00959m28427o3588k2077
14133I544980k90360p4893O7527l78495q1955k11016L9596j36866m36436K32372
14123H274454l6596l81457J24672m15976J65914p5542j89506Q5814k32237k90589
$$ plain form
14188 25912731 25180992 24383345 24105338 23502665 22903942 22165636 21937593 21367836 21175475
14179 21175475 20873842 20126124 19827462 19199055 19070481 18680644 18252105 17641389 17627004
14170 17627004 17121989 16583266 16609509 16324364 15720013 15589679 15133707 15265281 14978512
14161 14978512 14645776 14378663 13798714 13688113 13552855 13144317 12792644 12644289 12670719
14152 12670719 12557192 12366164 11927125 11781354 11739542 11560510 10996934 11403429 10689826
14143 10689826 10531642 10667823 10415956 10337131 10281951 9958113 10059072 9630645 9567057 9544980
14133 9544980 9254620 9179727 9247254 8868759 8786804 8575788 8615384 8478518 8042082 8274454
14123 8274454 8237858 7856401 7981073 7565097 7731011 7655469 7465963 7551777 7319540 7028951
14113G028951L59853l06475k50454P4901l64963J16471k18695J72307k37114J2608
14103F387390l17970J43292j72109k8229J04275m55786n4021K08020J0795k05995
14093E619662j46614J68145q2297k25081J66128m42237K13603K08011n46019L25840
14083E259141j97332j92734K38089k02001l33008r4969k8142K28610r8681r1700
14073D487273l0853o6871J91253k58960q2540K24313r4954N9632k92981M3064
14063D178376l22638M36989K4075j20959k44041K90898m60693J88673k50420K39196
14053C959456j17785k07083J45753m28192N3080L86184k78038L5709M8464r4222
14043C503326j79239J76770k70003K20337l26717r946m3010J61070j77665P7479
$$ plain form
14113 7028951 7388804 7082329 6831875 6906776 6541813 6658284 6439589 6611896 6374782 6387390
14103 6387390 6069420 6212712 6040603 6012374 6116649 5660863 5606842 5814862 5825657 5619662
14093 5619662 5473048 5641193 5558896 5333815 5499943 5057706 5271309 5479320 4933301 5259141
14083 5259141 5061809 4869075 5107164 4905163 4572155 4477186 4449044 4677654 4578973 4487273
14073 4487273 4456420 4389549 4580802 4321842 4239302 4463615 4368661 4428293 4135312 4178376
14063 4178376 3855738 4292727 4316802 4195843 3951802 4242700 3782007 3970680 3720260 3959456
14053 3959456 3841671 3634588 3780341 3352149 3405229 3791413 3513375 3549084 3597548 3503326
14043 3503326 3324087 3500857 3230854 3451191 3124474 3114528 3071518 3232588 3054923 3132402
14033C132402j12672j22656O4374J77840l03771N53536l82409r8346j8207O5630
14023B955721j0616k05573Q7339l32321K28698k70256M02639p7118j57580k91889
14013B329044K57631k93708K43831j58939J33391k4948j81425J80419j17269j78091
14003B189936P7010J02618J86519k71546j46006j15488m0492N01900l04051K59080
13993B439480l39129L77000N3051Q35821M28314K311848P017869J6067696J2586350
13984D1778300j5032242j1376825o310116k700147j090198q96793r18938q3995
13976C369046k77948m4878l03398L6194j28103p6420j49261L51282j30547n59402
13966B086565L76766k7590j71914k97807j55210O62981j34036m63125o962J40569
$$ plain form
14033 3132402 3019730 2897074 2961448 3139288 2835517 3389053 3006644 2908298 2890091 2955721
14023 2955721 2945105 2739532 2826871 2494550 2723248 2452992 2855631 2778513 2620933 2329044
14013 2329044 2586675 2292967 2536798 2377859 2511250 2486302 2304877 2485296 2368027 2189936
14003 2189936 2266946 2369564 2556083 2284537 2138531 2023043 1982551 2484451 2180400 2439480
13993 2439480 2100351 2477351 2530402 3366223 3794537 6106385 13124254 29191950 41778300
13984 41778300 26746058 15369233 9059117 6358970 5268772 4371979 3453041 3369046
13976 3369046 3091098 3046220 2742822 2779016 2650913 2574493 2425232 2776514 2645967 2086565
13966 2086565 2463331 2435741 2263827 1966020 1810810 2473791 2339755 1876630 1869668 2010237
13956B010237k8072n819n0795j26493J85721q7285j17164M88633j79719L9161
13946B128405k81572p0946m631O7170M2208l88097M33181Q012j39813j69434k5944
13935A598539J77437l13515K86413j60832j61068K21220n9828j25892K01066J83798
13925A847338j37488k57436j52307J39940L1595J1864J7096L210k25049M30607
13915A709370l64333K07750Q991j77478K49300k303K6841k45388j69595L15836
13905A558991j66462J36033l41243J98925Q0569j87015j04963L7258K82437k79240
13895A215290j52880j92908M51250j52584K71225j75955J67800j70597K7353j70649
13885A117345k47456J83205J51612R7679n0327J267r6572J89478m15796R40L23179
$$ plain form
13956 2010237 1982165 1976346 1925551 1799058 1984779 1897494 1780330 2268963 2089244 2128405
13946 2128405 1846833 1775887 1771256 1838426 1880634 1492537 1925718 1933730 1793917 1624483 1598539
13935 1598539 1775976 1462461 1748874 1588042 1426974 1648194 1588366 1462474 1663540 1847338
13925 1847338 1709850 1452414 1300107 1440047 1471642 1483506 1500602 1503812 1278763 1709370
13915 1709370 1345037 1552787 1561778 1384300 1633600 1631297 1658138 1412750 1243155 1558991
13905 1558991 1392529 1528562 1187319 1386244 1466813 1279798 1174835 1212093 1494530 1215290
13895 1215290 1062410 869502 1320752 1168168 1439393 1263438 1431238 1260641 1287994 1117345
13885 1117345 869889 1053094 1204706 1302385 1252058 1253325 1156753 1346231 930435 931375 1254554
13874A254554j82999L30113k43313m23367M72431k57999J93242j2476r1851P4892
13864A113227k74953J33197P8737J73699k44270J78425K3633Q150J23992n27865
13854G85972L56030J45088l82737q3864P4345O1013J3040j14084p3373K35319
13844A016749j8385J4094J48598n69844O13921k99327K48613l62534P7543j68725
13834G00703P9769j5849j81298K75019K74721J9887l43720j03934L80939k16230
13824H70007L01766l58872J03074j79700K68526J24614m90686L23400j95324k2012
13814G44793K93566J6647D85958J33234M32867M1518j86906N2446j29343j19413
13804G10361J07389q9214K39073k84260j18663R0703M94726m69579j26787M10982
$$ plain form
13874 1254554 1071555 1401668 1158355 734988 1207419 949420 1142662 1130186 1038335 1113227
13864 1113227 838274 971471 1050208 1223907 979637 1158062 1181695 1189845 1313837 785972
13854 785972 1142002 1287090 904353 820489 894834 955847 968887 854803 781430 1016749
13844 1016749 998364 1012458 1161056 591212 1205133 905806 1154419 791885 869428 700703
13834 700703 780472 764623 583325 858344 1133065 1152952 809232 705298 1086237 870007
13824 870007 1171773 812901 915975 736275 1004801 1129415 638729 962129 766805 744793
13814 744793 1038359 1055006 485958 619192 1052059 1093577 906671 959117 829774 710361
13804 710361 817750 728536 967609 683349 564686 655389 1150115 680536 553749 964731
13794I64731j07619R669m3404j70323j01452J94294q0226J20445L6565j41475
13784F81205p8649o8035L17265M6693j68161j58384K06103k57131K09067j88405
13774E41568R7268O3274m1174l5727Q4913j72234L5327j79099K46133K9108j25901
13763E43456K6620n0376J99346l40758L10457j21195J60559K6590j49991j8487
13753E86221k3565M688K10210N2946k94378N140K4592M7566M5746j76269j00720
13742C82177K20710M0057j44972A94906L22681j39450K12687B68574K72733j83667
13732C57640N24408n2454k68380J91894j37727k03293K10749j32191P4504o5166
13722D99984j8438L035k05769R5426L16228m2212J3756B84277M28211p8373B28900
$$ plain form
13794 964731 857112 866781 823377 653054 551602 745896 665670 786115 822680 681205
13784 681205 602556 534521 851786 898479 730318 571934 778037 520906 729973 541568
13774 541568 638836 702110 660936 625209 710122 537888 573215 394116 640249 669357 543456
13763 543456 570076 519700 719046 378288 688745 567550 728109 754699 604708 586221
13753 586221 562656 567344 777554 830500 536122 541262 565854 613420 659166 482897 382177
13742 382177 602887 642944 497972 194906 517587 378137 590824 268574 541307 357640
13732 357640 882048 829594 561214 753108 615381 412088 622837 490646 565150 499984
13722 499984 481546 484581 278812 374238 690466 648254 662010 284277 712488 634115 228900
13710E95381M6917j80464J04328k74859K30230o2062n4144m9763Q6488K54071
13700F96123C34827L52992C38921J28177B03963O02567l27912K09365l01332l1226
13690C55425O9414J49283J73103k54583K35590j40014j27955N4712L9407k17761
13680C36621K43295B39762L02802K35533C53556q2025p1546L62388Q0081j05309
13670E37145j99422M15669A99478J18191K87317k54380l7159K3607A06210M59538
13660E65748J384K25317C08385O3209P3751K31178k29836K87424k07502j36637
13650C89972L14504k40558A36928N07309N5361j03731B64597J13278R2101R613
13640D79589L0198J4242L4687q3851H7764L90464J1257J6832B38126M8059K72109
$$ plain form
13710 595381 642298 461834 566162 291303 521533 459471 405327 355564 442052 696123
13700 696123 334827 687819 338921 467098 203963 806530 478618 687983 386651 355425
13690 355425 424839 574122 747225 492642 728232 588218 460263 514975 554382 336621
13680 336621 579916 239762 542564 778097 353556 271531 199985 562373 642454 537145
13670 537145 337723 753392 199478 317669 604986 350606 313447 337054 106210 565748
13660 565748 567132 792449 308385 371594 445345 676523 446687 734111 526609 389972
13650 389972 704476 463918 136928 644237 699598 595867 264597 377875 469976 479589
13640 479589 509787 524029 558716 474865 87764 478228 489485 506317 238126 286185 558294
13629E58294M7943m9991q1462n4824B03688M27686j42467m3003j17419A33559
13618E35773N1943Q0570A06615J56322P7106A10880K78401J65453k24737A62901
13607A18193L93790q8572j77973A11580L40391K00146B12184j9521J21681J29769
13597D44113j08112q085j13207O490I7203O8514K76424q6884L73154l45819R0239
13586D72831A84538O8974J85624k1701j62358K04830n5061C9220K6317L4708K83159
13575C83404L11714l09865J75524k47147j44257K81913j81522J53062n3826o362
13565C62638k9985J39292k15586K24455j13186R1580J04267A23793M7142P7415
13555B48350a67683H0192M25653q6079j50424j28963L77499k19158A091L43732
$$ plain form
13629 558294 606237 556246 474784 419960 203688 631374 488907 445904 328485 133559
13618 535773 587716 668286 106615 262937 340043 110880 389281 554734 329997 162901
13607 118193 511983 423411 245438 111580 451971 652117 212184 192663 314344 444113
13597 444113 336001 327916 214709 221199 97203 165717 442141 355257 728411 382592 472831
13586 472831 184538 253512 439136 417435 255077 459907 404846 39220 65537 100245 383404
13575 383404 695118 385253 560777 313630 169373 451286 269764 422826 369000 362638
13565 362638 332653 471945 256359 480814 367628 459208 563475 123793 170935 248350
13555 248350 -167683 80192 505845 419766 269342 140379 517878 298720 1091 344823
13545C44823P1938j48836I2827N25276k93603R3138r5160O9871K04489A53261
13534C58999E1121L02443j43917I7587b5314A27045a37977C40052J32301K06711
13524F79064A03644B223J66172j6339J84005o9421q7590K29047j05528J50539
13514D53108j51796j0826j28509K72021A71884L93859j26960A1473K92512J811
13504C05796M1817J7691j40394L181O6392j34403B0440J6225K00484N2914K9695
13493C19758j58486C6310J37078M87088A65513C7443J21977N9141m9067a34993
13482A88068o1369L57526A69119J02351m9435J12209a28503A92999a44318A20995
13471B65986n8104J47644r0530j04281L35597d9390B62579k2540b70642D13384
$$ plain form
13545 344823 416761 267925 92827 618103 324500 417638 322478 392349 596838 153261
13534 358999 51121 353564 209647 97587 -25314 127045 -137977 340052 472353 679064
13524 679064 103644 2223 168395 152056 336061 266640 179050 408097 302569 453108
13514 453108 301312 290486 161977 433998 171884 565743 438783 11473 303985 305796
13504 305796 347613 365304 224910 228091 294483 160080 20440 36665 237149 290063 319758
13493 319758 161272 36310 173388 660476 165513 37443 159420 218561 169494 -134993
13482 188068 126699 484225 169119 271470 222035 334244 -128503 192999 -144318 120995
13471 265986 207882 355526 264996 160715 496312 -49390 262579 240039 -270642 413384
13460A54878p0861h7407A78166K78311M0554j82638M5673k4054A38003J65157
13450C03160A19637J10177K51240I4798J4050R0700J13242G8723P5416J48076
13440C02215E6459e397D50202c3363L896C60740a44931E05818h259B46736k0626
13429B26110b35126D91733A93082K59373g8779C20241q1408p7985R0164J09797
13419C60809q5924n824o7870b4930f979H276J31835O4971B5487j0623P4003K0841
13407A09708a51019J246A36390a80834B71961J50339B04003N4443E3211J97140
13397B50351j20929D5337L0405M13384j13206q3171e978E04511j22381j59148
13387B22982J03411g0744A02584K47770j38100K0453J44175N2364j60747G7125
$$ plain form
13460 154878 84017 -87407 178166 456477 497031 314393 360066 336012 138003 303160
13450 303160 119637 229814 481054 94798 108848 199548 312790 78723 154139 302215
13440 302215 56459 -5397 450202 -33363 -29467 360740 -144931 505818 -8259 246736 226110
13429 226110 -235126 491733 193082 452455 -78779 320241 238833 160848 251012 360809
13419 360809 274885 269061 201191 -24930 -6979 8276 140111 205082 25487 14864 88867 109708
13407 109708 -151019 -149773 136390 -180834 271961 422300 204003 258446 53211 250351
13397 250351 129422 45337 75742 489126 375920 292749 -5978 504511 382130 222982
13387 222982 326393 -70744 102584 350354 212254 232707 376882 429246 268499 77125
13376A96017b50888A97992R5612l4496q1180M4141O8723F9511K04740P2152a34836
13364D22011A22417K41853a78201C01249K1655j0232A41116M1470J19671F9074
13353B22922J27397Q416j35860Q7684p5018m0492j9732M11959k66548j21197e0911
13341C00840j32299K99244G1832J38874g794B41358g3067A01682J79306j33876
13331A47112J50776D4710m813d8486C08198N8526P4416B6144N2247J0002K03972
13320B92365m6818d761A71309m6895P8025o8586m6338J49156q7951a29417G1526
13308a07332C79698g8429c3968K745B09525J34357a35951A41886R7951B1014a97036
13296C55128A31469b4504C52788F5063c7074A83209m9737P9303e2143H4886i4387
$$ plain form
13376 196017 -250888 197992 293604 259108 177928 222069 290792 69511 274251 346403 -134836
13364 422011 122417 364270 -178201 301249 322904 312672 141116 182586 302257 69074
13353 222922 350319 358735 222875 310559 235541 195049 175317 587276 320728 199531 -50911
13341 300840 168541 467785 71832 210706 -7794 241358 -73067 101682 280988 147112
13331 147112 297888 44710 39897 -48486 308198 366724 441140 26144 78391 88393 292365
13320 292365 245547 -4761 171309 124414 202439 133853 87515 236671 148720 -129417 71526
13308 -107332 379698 -78429 -33968 -31223 209525 343882 -135951 141886 239837 21014 -197036
13296 355128 131469 -24504 352788 65063 -37074 183209 133472 212775 -52143 84886 -94387
13284C65080b73368E0148J51210q3556j3193l6249C809N6447K03755N6366H3915
13272B64012e0950F7392K24193r0205M00K42068a59245j123A49982K42429a7918
13260A60522q252a41778B01601n3283k253d3297N09A49744J8013G1039K7216J79600
13248B77855A9413K29806n7892R481q5426J0806J75030K94322b00127I0555f0768
13236A92163a3859k5173A14992m635l1263d9561P698F04362C012J18247b9405
13224g0513A66935a33415B36673j4848O5681H8152I343K05134i3615B3821f2394
13212D7219M5660N3915N8390c5034B3099J19763g9931A50875J45482K09960I3402
13200A32770L38089F0572k756J31005P6907C4711J21892K82403a23369l7338C6994
$$ plain form
13284 365080 -273368 50148 201358 117802 104609 68360 3809 60256 264011 320377 83915
13272 264012 -50950 67392 291585 201380 201780 443848 -159245 -160368 149982 392411 -17918
13260 160522 152270 -141778 201601 148318 146065 -43297 -42788 149744 167757 71039 98255 277855
13248 277855 19413 249219 191327 200808 115382 126188 301218 595540 -200127 90555 -60768
13236 192163 -13859 -39032 114992 110357 79094 -49561 -41863 604362 3012 121259 -29405
13224 -70513 166935 -133415 236673 221825 287506 88152 9343 214477 -93615 23821 -62394
13212 47219 92879 146794 205184 -35034 23099 142862 -79931 150875 296357 506317 93402
13200 132770 470859 60572 57816 188821 265728 34711 156603 439006 -123369 -160707 36994
13188D45688i2928K8877C43306F8652J42691K37440j40036D6475b1239C8163J35112
13177A73275l6222b22427D9366J9409a25350p2297F5244g0847B61857J3823q1931
13166A93749a82902I3274a03013A00833J66813q2406J29419A3740J3914d6645
13155C42314A58567J49431G4195J3181a06132B34290L1463O7646b00689G683J48273
13144A55956a9430B40737A08595R6590K03610A57777K7857f8979B07029O2864
13134B69893F529J6548E577L2710J11103J23918c88544C26548f5141C6836J41721
13123A78557p6450Q3779i982D6991k038b19244a0699n8453C496J46280C5157a47500
13110d9452j88442h7868M2213j20344p7391f5164A9894i6196B04725E7406l235
$$ plain form
13188 445688 -92928 -64051 343306 68652 211343 448783 308747 46475 -21239 38163 173275
13177 173275 137053 -222427 49366 68775 -125350 -197647 65244 -70847 261857 275680 193749
13166 193749 -182902 93274 -103013 100833 267646 185240 314659 13740 27654 -46645
13155 342314 158567 307998 74195 87376 -106132 234290 265753 333399 -200689 7683 155956
13144 155956 -19430 240737 108595 205185 408795 157777 185634 -68979 207029 269893
13134 269893 6529 23077 5577 38287 149390 273308 -388544 326548 -65141 36836 178557
13123 178557 102107 185886 -9982 46991 44953 -219244 -10699 -69152 3496 149776 35157 -147500
13110 -49452 -237894 -87868 -45655 -165999 -243390 -65164 19894 -96196 204725 57406 54171
13099E4171a01547r0086R3040A26255J56360b09689I4577J63554E2887J03960
13089A56847i8932C15693M212j40830a65847B42222C036a2157D36694g6691n3540
13078a30231j84007a36261A07334J41615b52123J17649B40170m5534k1663l0604
13068A42369A3743a07003A46004a78779j29882B90847A2328a46674n4612B60980
13057C42497B2424J32267a50763c1672I3620b7527B74914k1518I194d3615A51455
13045E0479b7304j13095e5639A93557q9496k5467J78785D7136L38671g8972B45518
13033b3681A22243K91204A24535P714F1930L8K38083C3727K9987J37441B7967
13021g8348k2777C44277n0764c7781A51768J06774a162D048i6032H0928N3523
$$ plain form
13099 54171 -101547 -191633 -98593 126255 282615 -209689 94577 258131 52887 156847
13089 156847 -98932 315693 319905 179075 -165847 242222 3036 -12157 436694 -76691 -130231
13078 -130231 -314238 -136261 107334 248949 -252123 -134474 240170 194636 172973 142369
13068 142369 13743 -107003 146004 -178779 -308661 290847 12328 -146674 -201286 260980
13057 342497 22424 154691 -150763 -31672 93620 -27527 274914 253396 9194 -43615 151455
13045 50479 -27304 -140399 -55639 193557 104061 78594 257379 47136 385807 -78972 245518
13033 -23681 122243 413447 124535 132249 61930 61968 300051 33727 63714 201155 27967
13021 -78348 -101125 344277 293513 -37781 151768 258542 -1162 4048 -96032 80928 134451
13010A34451C9475K88134j10978K64272g17A35076J74224p1159C6202K50030d6647
12998a53819A08162n2973D170Q1886h3659b6372C6443J4379e979B06065d9416
12986E903K00651K9939G0297R7913E1473L34795A66814J83713F9597i3974a0525
12974A09817r146e5844G6457J38757D3042R6130K73801A49528m7394c7718B17498
12962H7529P00Q9706p7950B0394M9269a29678F1373B8428M0329j5956e8409C5420
12949a16938A30764f2530F1049J22129g8628J6453j07456L9151m0118G6742e1428
12937c04108B20574R51a7597k62493a161k29221A63279L0038c5858J4665G3931
12925B7489a78813A33323N0021C529f931G7626a34545l98333E2540a6416B77950
$$ plain form
13010 134451 39475 327609 216631 480903 -717 135076 309300 238141 36202 286232 -46647
12998 -153819 108162 55189 4170 86056 -83659 -26372 36443 50822 -5979 206065 -49416
12986 5903 206554 236493 70297 168210 51473 386268 166814 350527 69597 -93974 -10525
12974 109817 100671 -55844 76457 215214 43042 139172 412973 149528 102134 -37718 217498
12962 87529 88229 177935 99985 20394 69663 -129678 61373 28428 68757 52801 -58409 35420
12949 -116938 130764 -62530 61049 183178 -78628 -62175 -169631 -130480 -170598 76742 -51428
12937 -304108 220574 221525 -17597 -280090 -1161 -230382 163279 193317 -35858 -21193 73931
12925 27489 -178813 133323 183344 3529 -6931 77626 -134545 -532878 52540 -16416 277950
12913A06578e9259j00840A83415B0194b49285D054R7023K7703b76387I6333J30916
12902B27249a16608i293q6078j76683p7225J32328j9646h9553B15263B2622d61719
12890a85016f533A23455q672f2941p5042A7926a31603H4238a17747c9760A19458
12878A54618b9373B15507a8233o428n7621k44457E4304e6093B88516b87286E4199
12866G1776a00089B83343F0606J32561p9571D2972a10689k2940A29853a27934
12855d9188C3432A1770K75777a88841E6967b28586b4414C37134b66423A3281J00268
12844A13549C164L62606A47740B5454J0273J39783o1940k1696a37823C57919h6470
12832I0442K58966A3867K7912K48676r3856J8132A02061c5237J4214r1689a1534
$$ plain form
12913 106578 -59259 -160099 183415 20194 -249285 4054 101077 128780 -276387 96333 227249
12902 227249 -116608 -9293 -95371 -272054 -349279 -216951 -236597 -89553 215263 22622 -461719
12890 -185016 -6533 123455 114783 -62941 -137983 17926 -131603 84238 -117747 -39760 119458
12878 154618 -29373 215507 -18233 -24661 -82282 -326739 54304 -56093 288516 -287286 54199
12866 71776 -100089 283343 60606 193167 113596 42972 -110689 -133629 129853 -127934
12855 -49188 33432 11770 287547 -188841 56967 -228586 -24414 337134 -266423 13281 113549
12844 113549 3164 365770 147740 25454 35727 175510 113570 91874 -137823 357919 -86470
12832 90442 349408 13867 41779 290455 196599 214731 102061 -35237 -21023 -112712 -11534
12820A18291K34168d3811p1373j74204B20191D302a53335A84386a04794A0326
12809C27042b74268f7642k40847g8990k379l4505L1305I5277R687a55120A8032
12797A95487B0989a11529L2606E4076f4763a0124k16359O7049g7599j5886A22689
12785c334G4139a99727A90586a58330B21881A08686i8304B98110a34619K7719
12775a06900k7509A60589a96363E8421J94059L42874c98821D15558A71884a25205
12764A14937B1790J24042J85049a570B93972p7700o4546a92907d5463o2352M2496
12753f5319B51308h2573k1294D104P9616a13190H6224J79998q9074a19736B20537
12741I6889O4089E5797a01637B62174g4835A15537h2806K9816C35421A67254I051
$$ plain form
12820 118291 352459 -43811 -115184 -289388 220191 4302 -153335 184386 -104794 10326
12809 327042 -274268 -67642 -308489 -78990 -81369 -115874 -84569 95277 104964 -155120 18032
12797 195487 20989 -111529 -78923 54076 -64763 -10124 -226483 -159434 -77599 -93485 122689
12785 -3334 74139 -199727 190586 -158330 221881 108686 -98304 298110 -134619 -106900
12775 -106900 -134409 160589 -196363 58421 252480 595354 -398821 415558 171884 -125205
12764 114937 21790 145832 330881 -1570 293972 216272 151726 -192907 -45463 -107815 -65319
12753 -65319 251308 -82573 -103867 4104 83720 -113190 86224 266222 177148 -119736 220537
12741 96889 160978 55797 -101637 262174 -74835 115537 -82806 -52990 335421 167254 9051
12729A9651J05993K2429g9453H2378a26244B65202A15305a6682A05273M8847i1108
12717a33924d1192B03541a63422g3594A33522a44185A9501J15245c0118a3226
12706E63N0722Q8793J1541K28185L2446j07778o2125j5163a2618k30464A76197
12694I6021c60412f3693B00165g979C1572J60379q8265a73182D26370p6890C1407
12682A22652c8024A9037K66268m2644r0679d0376B98483A39447g6630B48653l7371
12671B11282n562n6274b21250F374L1321J12702b50402A15674K6545g9176A6706
12659H2119l7732h5289B52983B2321R8963J56694F9815J80720E5259J21940J22117
12648B99316A2218i8075B52162E6406J76248q6751D9387K85281d14055A32054
$$ plain form
12729 19651 125644 148073 -79453 82378 -126244 265202 115305 -16682 105273 154120 -91108
12717 -133924 -41192 203541 -163422 -73594 133522 -144185 19501 134746 -30118 -13226
12706 563 51285 140078 151619 379804 412250 304472 242347 227184 -12618 -243082 176197
12694 96021 -360412 -63693 200165 -7979 31572 191951 103686 -173182 426370 349480 31407
12682 122652 -38024 19037 285305 242661 151982 -40376 298483 139447 -76630 248653 211282
12671 211282 205720 149446 -221250 6374 37695 150397 -250402 115674 142219 -79176 16706
12659 82119 44387 -85289 252983 22321 121284 277978 69815 250535 55259 177199 299316
12648 299316 12218 -98075 252162 56406 232654 145903 49387 334668 -414055 132054
12637a76132e2264j39821A37900E2698b51439A90211C0926N1957J24252o4317
12627A42818J717M1705a3847n666D2874J83707I1711Q2885O0035q0148P7077B7542
12614a1079k2304m293B2173c4597j42383f6143l4700k92501B24813a01151C45849
12602B04153q9736f514j4429j21458B70628a73697A69632K1625L35262a78073
12591F4299i6729c6825k4289A69220G792N8168d1C7282J08555P9050k2350p9711
12579A22826M9917m0644L5362a8734E1649f2170c838m02544c2049l0646j93265
12568b55960A48240a04896c8110B05630b72559g374m46508g4918A09385a26058
12557B184J34375b3796D6688a84863A56915b5579E2886h8419r388H7978k8545
$$ plain form
12637 -176132 -52264 -192085 137900 52698 -251439 190211 30926 82883 207135 142818
12627 142818 144535 186240 -13847 -19513 42874 226581 91711 174596 234631 154483 231560 27542
12614 -11079 -33383 -37676 22173 -34597 -176980 -66143 -100843 -393344 224813 -101151 345849
12602 204153 114417 -6514 -20943 -142401 270628 -173697 169632 191257 526519 -178073
12591 64299 -96729 -36825 -61114 169220 7792 65960 -41 37282 145837 224887 202537 122826
12579 122826 172743 132099 167461 -18734 51649 -62170 -3838 -406382 -32049 -62695 -255960
12568 -255960 148240 -104896 -38110 205630 -272559 -7374 -453882 -74918 109385 -126058
12557 2184 136559 -23796 46688 -184863 156915 -25579 52886 -88419 -97807 87978 59433
12546E9433A7436R3682A3180J38968a61048d9939B6805o814c15256A13337l9895
12535G3442g3058G8988a85080C40013F4107j2813h5708I0978f1816A52645K54197
12524D06842A77114H5681d9925A92209d06165e2873j8597D2071J01418J56464
12514B99953b52488H3746a53369I5469d2357A1757J13613d7921B8811b3898j0975
12503c4873k84815a39372B66260a21976k2852O8974j47400A73418d6018j78358
12493b24376A76937J69277d0011A44830A7001J02616J0128K7992a84316M9016
12483a35300B985R2184O592m2944F013Q2394c1597l13873d4596F0626B8268d6067
12470B08217f8881A78384q5280c42990C06749a27631I0433N5750C5132f9305K9216
$$ plain form
12546 59433 17436 111118 13180 152148 -161048 -49939 26805 19991 -315256 113337 73442
12535 73442 -73058 78988 -185080 340013 64107 51294 -85708 90978 -61816 152645 406842
12524 406842 177114 85681 -49925 192209 -406165 -52873 -71470 42071 143489 299953
12514 299953 -252488 83746 -153369 95469 -42357 11757 125370 -47921 28811 -23898 -34873
12503 -34873 -319688 -139372 266260 -121976 -144828 -75854 -223254 173418 -46018 -224376
12493 -224376 176937 346214 -40011 144830 17001 119617 129745 157737 -184316 -135300
12483 -135300 2985 95169 101761 58817 6013 88407 -31597 -345470 -44596 60626 28268 -46067
12470 208217 -68881 178384 93104 -342990 306749 -127631 90433 146183 35132 -69305 -40089
12459d0089B00830J81018A64415h9948c5603B97009j31316k1062a27246d6231
12448I0726g2672n0798A85739A2488J5937b41432e8940o3348A48915a79058Q8947
12437i0111A15893a60556d9391j32739B5882c3976A49650e9938k15841o7403h945
12425A56096e9306J8190o5568l5951G4131c6724k15543C3710b76658a37421O7723
12414f9698l0384K6753C739c09551J06932R1826g702j44299K435n2714g4193j50279
12402b24472A18924a72002F4164a83821I1191K1747J30487D806M3803J30572b05946
12390G2055M543L5115J85208A0516K525K71420i2722j70072G0565K59348a14194
12378C9732a97500Q3320j737G6208J5049B6830J3688N9174a06223a3255j0545
$$ plain form
12459 -40089 200830 381848 164415 -89948 -35603 297009 165693 144631 -127246 -46231
12448 90726 -72672 -123470 185739 12488 28425 -241432 -58940 -122288 148915 -179058 -90111
12437 -90111 115893 -160556 -49391 -182130 25882 -33976 149650 -59938 -275779 -343182 -8945
12425 156096 -59306 -41116 -106684 -142635 74131 -36724 -252267 33710 -276658 -137421 -69698
12414 -69698 -100082 -73329 3739 -309551 -202619 -110793 -7702 -152001 -149566 -202280 -74193 -224472
12402 -224472 118924 -172002 64164 -183821 91191 112938 243425 4806 48609 179181 -205946
12390 72055 76598 111713 296921 10516 13041 284461 -92722 -262794 70565 329913 -114194
12378 39732 -197500 -114180 -115917 76208 91257 26830 40518 99692 -106223 -13255 -23800
12367b3800j9548j8221B4337i8205a3673A14011a7364p0987k51518D4415L22630
12356C67045B264f6976b486A38969C939b4481D4071J9614a08126k4840j216B41280
12343I2666C1999a37521I3855K0678L7848a17360e2234j0360C625J24905b42368
12331A90858b44630A9010J55759e1428n2451a4320A21694a97343a6761A31631
12320F9374K71883D0960L1887b47553b1001B37589D6636b0568A62129b45796A92967
12308d23755f0018G2334J09831h6446a3229l6643H3229b2414G3709b93382c686
12296a51534A81321j7446a55251A64990E0122a82928A85909d3767K0965I2437
12285a07459H9921g2871E3740K87756b2045E9176M66575G7592J19659r8579K05522
$$ plain form
12367 -23800 -43348 -61569 24337 -98205 -13673 114011 -17364 -88351 -339869 44415 367045
12356 367045 2264 -66976 -2486 138969 3939 -24481 44071 63685 -108126 -132966 -134182 241280
12343 92666 31999 -137521 93855 114533 152381 -117360 -52234 -62594 3625 128530 -242368
12331 190858 -244630 19010 174769 -51428 -103879 -14320 121694 -197343 -16761 131631
12320 69374 341257 40960 72847 -247553 -21001 237589 46636 -20568 162129 -245796 192967
12308 -423755 -60018 72334 182165 -86446 -13229 -49872 83229 -22414 73709 -293382 -3686
12296 -151534 181321 163875 -155251 164990 50122 -182928 185909 -43767 -22802 92437
12285 -107459 89921 -72871 53740 341496 -22045 59176 525751 77592 197251 98672 304194
12274C04194A22330J1530J86667I6502L9071J9440e1015A97555o7384P3853d8051
12262g4064o9878E99248i8507p7666B39416B3214c68633J25835O9368b0590k7842
12251d8432C10894b71555c1144B17841b1290d309D23158f5358A43746a7952l1689
12240d9641j37327A41317K0518i356C27200b37936A2025g0328K6298A04085a37064
12228A55485b9032J1850B48414j12962P5400o7065l8755K06080J37546a88373
12217A87035q3366Q4947A4186K06487a54894L3494A51552K44530a52966I5759
12206A11636N0896J8927K61187F0971h3895B54485c2392G6930M0637b14535A0421
12194A01133P9008L2675n6020J41573k3114b7788l45880R5034G7101j4581R1477
$$ plain form
12274 304194 122330 133860 320527 96502 135573 155013 -51015 197555 130171 204024 -48051
12262 -74064 -143942 599248 -98507 -176173 239416 23214 -368633 -242798 -173430 -20590 -48432
12251 -48432 310894 -271555 -31144 217841 -21290 -4309 423158 -65358 143746 -17952 -49641
12240 -49641 -186968 141317 161835 -9356 327200 -237936 12025 -70328 -44030 104085 -137064
12228 155485 -29032 -17182 248414 135452 210852 143787 105032 311112 448658 -188373
12217 187035 103669 188616 14186 220673 -154894 -121400 151552 396082 -152966 95759
12206 111636 162532 181459 442646 60971 -83895 254485 -32392 76930 117567 -214535 10421
12194 101133 180141 212816 156796 298369 275255 -27788 -373668 -278634 77101 62520 153997
12183A53997n4301K12611A44361a70823A3924M06055k2176A00487b62718a17533
12172G9148M75527A00979b49371A68870K10740G7734J6450m7012M5006l887B3129
12160B96925k8893d137B17985d8935A00829K5573j4712O2889H0738K2787N9180
12149A62705H0734M4917B8512g5822A54301b49425b6971q9071b995D2469a1839
12137E7795b27460e7413j30510A7740J79833q9801j2465B6276J23218P4223i6762
12125a01019D04124A50693b66246D60J16117i632A98023a01306j6630H6062h2061
12113a83691L9240B04310F5173c12955J07686A8921M1416N7831f8135k3496j72425
12102b64056e1517b2786A26165a47337d5914B09425b93661c2166E4104b40718
$$ plain form
12183 153997 99696 312307 144361 -170823 13924 419979 397803 100487 -262718 -117533
12172 79148 554675 100979 -249371 168870 379610 77734 94184 47172 92178 88291 23129
12160 296925 268032 -4137 217985 -48935 100829 126402 111690 174579 80738 103525 162705
12149 162705 80734 125651 28512 -75822 154301 -249425 -26971 -116042 -2995 42469 -11839
12137 57795 -227460 -57413 -187923 17740 197573 107772 95307 26276 149494 223717 -96762
12125 -101019 404124 150693 -266246 460 116577 -9632 198023 -101306 -117936 86062 -82061
12113 -183691 -144451 204310 65173 -312955 -205269 18921 60337 118168 -68135 -91631 -264056
12102 -264056 -51517 -22786 126165 -147337 -45914 209425 -293661 -32166 54104 -240718
12091i7490A26900h2641B0809K35930j27134B5439N797a17051I9538a09758H1796
12079B40504h9779n1312E4599h1806A26942c9223m5955b0220B22886K14142K02861
12068F39889R01114n40691k42712B46329J79396a98241Q7149B29275h6494q4596
12058a71090d5537C53431h91B78974p9499d1992B8853e3196B11657a1034j68664
12047a79698A52095c9124o8492A545N1209b93880h0920l8668k21583J1299h9498
12035b18908A3942b64344a844n12730C69510c68501J42594B08773c0405D323b5721
12023a32033B56200q4009B5453e0185J2082j0832p754k60960F9549b67629A99475
12011A17458J49641b96769n5193c3027B00322e8091G8384a14198I2133d6137k6265
$$ plain form
12091 -97490 126900 -82641 20809 256739 129605 25439 31236 -117051 99538 -109758 81796
12079 240504 -89779 -141091 54599 -81806 126942 -39223 -85178 -20220 222886 437028 639889
12068 639889 1541003 1000312 757600 246329 425725 -198241 -111092 229275 -86494 -171090
12058 -171090 -45537 353431 -891 278974 199475 -41992 28853 -53196 211657 -11034 -179698
12047 -179698 152095 -39124 -107616 1545 52754 -293880 -80920 -119588 -341171 -329872 -89498
12035 -218908 13942 -264344 -1844 -514574 369510 -368501 -225907 208773 -30405 4323 -25721
12023 -132033 256200 172191 25453 -50185 -38103 -48935 -56689 -317649 69549 -267629 199475
12011 117458 267099 -296769 -351962 -33027 200322 -58091 78384 -114198 92133 -46137 -72402
12000g2402B81909a7603k20588B02654D0934M5275N59k7589J42553a95489c3868
11988D2175J04869m6082C5851a18503N1754G9911p969j7287a2029l06100E0592
11976i7570A92766j9980O1737H1514E834N2583K06662h3827C51349a9456j84679
11965b04135G6904g7936k47329C07682b58373a06844A63655a17314A48099b56022
11954B7944n244c39358a60160C02071j24808c09734R171A37757g1774k15772C25192
11942a75464j29111B67424B8873Q0289i2294p5604C4443M16189a28143j33598
11932b61741M0109A44239a58303H0546N394l6555M1178c6384B15792n2610b825
11920B0658a69079d891D06397I5153c72823B85433j17675a45226d1026j15208
$$ plain form
12000 -72402 281909 -17603 -238191 202654 40934 86209 86768 59179 201732 -195489 -33868
11988 42175 147044 100962 35851 -118503 -66749 79911 71942 54655 -12029 -318129 50592
11976 -97570 192766 172786 234523 81514 5834 58417 265079 -83827 351349 -19456 -204135
11965 -204135 76904 -77936 -325265 307682 -258373 -106844 163655 -117314 148099 -256022
11954 27944 22700 -339358 -160160 302071 177263 -309734 -300563 137757 -71774 -287546 325192
11942 -175464 -304575 267424 28873 109162 -92294 -167898 34443 450632 -128143 -261741
11932 -261741 -221632 144239 -158303 80546 85940 49385 90563 -36384 215792 163182 -2825
11920 20658 -169079 -4891 406397 95153 -372823 285433 167758 -145226 -41026 -156234
11910a56234B72789h5814J9477E2893J10642q0756b74445h0571A97648A735J96686
11899A98421a37198k8044P045k22256A64363O0319H2662b4732l6359l2145M4261
11888d8975k81217D1602a40829A0985b30522N7496k4226j58041A86898a21209
11877h0687j60850B4053M4001a07060j12555A17008b6433k810E1429b05F9408
11865A22388h6663m2346j8246j767B70827p2057g2448A06412c8841j56512L8615
11854a56738A25851m6349a06977j27627h1245d349A97961D6581K439b18422G0973
11842A2951k145e24762a56400E1732a40952A44601i5083B45100b13679N5496A58281
11830g6195k4364F7870d2333k64373B8963b28159B2727a37626B4816d2882l366
$$ plain form
11910 -156234 272789 -85814 -66337 52893 163535 82779 -274445 -80571 197648 1735 198421
11899 198421 -137198 -165242 -158197 -380453 164363 224682 82662 -24732 -61091 -93236 -48975
11888 -48975 -330192 41602 -140829 10985 -230522 -173026 -197252 -355293 186898 -121209
11877 -80687 -241537 24053 68054 -107060 -219615 117008 -26433 -29243 51429 -205 69408
11865 122388 -86663 -129009 -147255 -149022 270827 198770 -72448 106412 -38841 -195353 -156738
11854 -156738 125851 79502 -106977 -234604 -81245 -4349 197961 46581 49020 -218422 70973
11842 12951 10806 -524762 -156400 51732 -140952 144601 -95083 245100 -213679 -158183 158281
11830 -76195 -100559 67870 -42333 -306706 28963 -228159 22727 -137626 24816 -42882 -46248
11819d6248a7328I1701M5447b18632A93239h7601J2079A3648b1245j53114h5307
11807A53256b46005G2577h2407n6766I2544P5279o9835l5530g5716G4085k6320
11796D7765c47217A67510b29171a7426q055j65308A42587n7776H004d745j60203
11785a64948A97741b5239l788k8727C14881a3536C19341b00606M699f8441B64774
11773A39928B2544c06867D4772a11836B406J22885a8859N469k1735A0013K00268
11762B10281a940B0318J02971c3423J6588n2377a8000n211H9692A0089N9390j1785
11750E7694K83491j40848a4834F4362a99086C64435A47500G0957b28115A3977
11739b9060A8853a26317A8558a24144b9270A88746K1929a87766O9786j51248a3462
$$ plain form
11819 -46248 -17328 91701 137148 -218632 193239 -87601 -75522 13648 -21245 -174359 -85307
11807 153256 -246005 72577 -82407 -139173 92544 167823 97988 62458 -75716 74085 47765
11796 47765 -347217 167510 -229171 -17426 -25481 -190789 142587 84811 8004 -4745 -164948
11785 -164948 197741 -25239 -29027 -57754 314881 -13536 319341 -200606 -195907 -68441 264774
11773 139928 22544 -306867 44772 -111836 2406 125291 -18859 -13390 -35125 10013 210281
11762 210281 -1940 20318 123289 -33423 -16835 -69212 -18000 -23211 89692 10089 69479 57694
11750 57694 341185 200337 -14834 64362 -199086 364435 147500 70957 -228115 13977
11739 -29060 18853 -126317 18558 -124144 -29270 188746 210675 -187766 -117980 -269228 -13462
11727a11710B5993J36060b84940O4811D25872b12345A77641C4282K4527R1433
11717A50242c18996a38218k2846b0062m3444l35382A89904m4703B1442M6371b0344
11705B71755E9340L3826e0092B50647A10078K10n695a17182E056K74789i1999
11693i5909c3028A64431J2961j5185d2748B95934F3559e638A79309a6683j66763
11682a83446C44337A50372l3952d8727C44452d5876A4799f560p3473D2975J32636
11671A75611J02628b36629j70358B71997A8085J26901j7958b8235j79259E1218
11660e6225A90544f6233b8863B27413A08277L18207C1865a80201E1356A347M1429
11649D2776K80370h3500B13634b2635A65498J66024a67980J0275C9971e0647A05295
$$ plain form
11727 -111710 25993 162053 -284940 -220129 425872 -212345 177641 34282 58809 150242
11717 150242 -318996 -138218 -161064 -20062 -63506 -398888 189904 145201 21442 67813 -20344
11705 271755 59340 93166 -50092 250647 110078 110288 104593 -117182 5056 279845 -91999
11693 -95909 -33028 164431 177392 162207 -42748 295934 63559 -5638 179309 -16683 -183446
11682 -183446 344337 150372 116420 -48727 344452 -45876 14799 -6560 -80033 42975 175611
11671 175611 278239 -236629 -406987 271997 18085 144986 127028 -28235 -207494 51218
11660 -56225 190544 -66233 -28863 227413 108277 426484 31865 -180201 51356 1347 42776
11649 42776 323146 -83500 213634 -22635 165498 331522 -167980 -157705 39971 -50647 105295
11637I0252C2013N7539d1802F8847d6576B73263A25264O3601a6307p9716B55677
11625g0656D8951M73773c66338A43019b45618c5382C73239I5883B7567K70143
11615B97710c4556n7531A1264a03453j02065F0206a14948M7193b3867A12802h2075
11603B08201A7322q474h4366j05675P6289A37861a54103A21761a67477j44153
11593c11630J46680G199K86229j07715p604K02540A58951a31105d9949B99111
11582A66729J02976b57123C1721J02117k9871R533e5823A88150g5827l6328E5126
11570f7736F6579e2692A99525R3280F1559b6761A91165b19648g0704I3520L18129
11559D11649A30849b3430C8183K66039a61412D3662c0882j25581A6238b71168
$$ plain form
11637 90252 32013 89552 -41802 68847 -46576 273263 125264 188865 -16307 -96023 255677
11625 -70656 48951 522724 -366338 143019 -245618 -35382 373239 95883 27567 297710
11615 297710 -34556 -92087 11264 -103453 -205518 60206 -114948 -67755 -23867 112802 -82075
11603 208201 17322 8848 -84366 -190041 -113752 137861 -154103 121761 -167477 -311630
11593 -311630 -164950 7199 293428 185713 178109 380649 158951 -131105 -49949 299111
11582 166729 269705 -257123 31721 133838 103967 113500 -55823 188150 -75827 -112155 55126
11570 -67736 66579 -52692 199525 292805 61559 -26761 191165 -219648 -70704 93520 411649
11559 411649 130849 -23430 38183 304222 -161412 43662 -30882 -156463 16238 -271168
11548a43553E8608K10606b86662C3923K17794l257i6775k22487A72804b6395j73123
11537a99518B77655c41256b6853J96m0803m4221H7548g110B80969p3537k5081
11526A82351e173D54530i3492D56708F5724a6093C80853i6107j97208B34246J0810
11515B45056A15650B6503G16O39N8588B4908a84008Q5950A59613D9955K85770
11504C35725F9897K46789n532A04625J42632b34433H0694O642K33117e444B21296
11492B39285o6017n0891m4761J49591A06777k3417P8054d8141j34796D23190j71957
11481B51233q1002m0601N139J3982o5425a24295D0070b9683A44298J01167j8116
11470B27349k2517a50213A59702k4068c7504A62538J24587b24739A73230d8149
$$ plain form
11548 -143553 58608 269214 -286662 33923 251717 248460 -96775 -319262 172804 -26395 -199518
11537 -199518 277655 -341256 -26853 -26657 -67460 -111681 87548 -7110 280969 207432 182351
11526 182351 -5173 454530 -93492 456708 65724 -16093 380853 -96107 -293315 234246 245056
11515 245056 115650 26503 716 1355 59943 24908 -184008 -98058 159613 49955 335725
11504 335725 69897 316686 311154 104625 247257 -234433 80694 87336 320453 -5444 221296
11492 239285 173268 122377 77616 227207 106777 83360 161414 -48141 -182937 423190 251233
11481 251233 170231 129630 134769 148751 83326 -124295 40070 -29683 144298 245465 227349
11470 227349 204832 -150213 159702 135634 -37504 162538 287125 -224739 173230 -48149
11459d6992B15769r6378j2731e525D3120a56812B54223j5559q5902b2355C36848
11447c4381C6700N3377C2474N2119K7219d0752q251j10437j04411A84366G3841
11435D7128h6390g673A08010b4983A45967E2055L59871b47140C55511j75533b43578
11423b80313E01455a05467H100c44608B08466a39503C74677A322a73002A25011
11412a23388A8557L072b12926B74527a41078h848A84711i8713l761B24773R0873
11401C15646a0825o4326G067i4677a5877A67805J9739g8567b0221M678C5570a3268
11388D1240J32927E4975b08721D1817N5578L6790A3407L67370h5752b6216B95703
11376B54872a29177N1243k74947E9047O6570m5536K28074G6270b47759m2920b3196
$$ plain form
11459 -46992 215769 119391 106660 -5525 43120 -156812 254223 238664 152762 -22355 336848
11447 -34381 36700 90077 32474 84593 111812 -40752 -49003 -159440 -263851 184366 73841
11435 47128 -86390 -7673 108010 -24983 145967 52055 411926 -247140 355511 179978 -243578
11423 -280313 501455 -105467 8100 -344608 208466 -139503 374677 1322 -173002 125011
11412 -123388 18557 21629 -212926 274527 -141078 -8848 184711 -98713 -102474 224773 315646
11401 315646 -10825 -75151 7067 -94677 -15877 167805 187544 -78567 -20221 -15543 35570 -13268
11388 41240 174167 54975 -208721 41817 97395 134185 13407 380777 -85752 -26216 295703
11376 254872 -129177 -77934 -352881 59047 125617 80081 308155 76270 -247759 -290679 -23196
11364b01559B0336K0267f2222A71101a80999Q2279B25646a99324o6671f1464j4784
11353g6248A7986A346M3900c55008J30716j90156c7485j62151q8890B91606D0144
11341a05687b8990j04380f3307E2349A8216b0499E9825c0481j69621M0066m9199
11330b09235i8808G2988b1329j86013B05327D428P7348B1183a79297E4776a3281
11318a93947B70035b32145I8651J10373m053a45203C9318L7662J08175b88280
11307A57596l878k5585E4655b81915A24380D0761a50937H8902E204Q7624b72070
11295d32375f9758B4038b35197G3338b70367d8666j15109M3299k94541a13105
11284d47644K02969L1196A7019l543J77619D1876d8233F9464a80819e7327p6629
$$ plain form
11364 -201559 20336 40603 -62222 171101 -180999 -98720 225646 -199324 -265995 -61464 -76248
11353 -76248 17986 1346 45246 -355008 -224292 -414448 -37485 -199636 -288526 291606 40144
11341 -105687 -28990 -133370 -63307 52349 18216 -20499 59825 -30481 -200102 -160036 -209235
11330 -209235 -98808 72988 -21329 -207342 205327 4428 81776 21183 -179297 54776 -13281
11318 -193947 270035 -232145 98651 209024 204971 -145203 39318 76980 185155 -288280
11307 157596 153718 128133 54655 -281915 124380 40761 -150937 88902 5204 92828 -272070
11295 -432375 -69758 24038 -235197 73338 -270367 -48666 -163775 -120476 -415017 -113105
11284 -447644 -244675 -213479 17019 13476 191095 41876 -48233 69464 -180819 -57327 -133956
11273a33956B10205a53842C93951a5512B48062a81553N8074l06614B23187a13562
11262H0987a70430l1152C05274a18739c8323l2944k0857A4033M9925a38873c3668
11250F5863J60486G3600a69186B79277A35134M9769R096E8295c0148l5451b5747
11238f3563k18220A4532c4476m243A2328b28675B14434b3875G9422c31011A68018
11226b90528J25065C79527i5747L6734m6369A03517J97166a9713j92811A44051
11215a31309A1984R881a30680H7553B8780J84860I2526J40554E227g913k0724
11204b8637l52527A10697D2787J30239P6087A02839K39746a70571l6223J276N5641
11193a49877q752b6977l14050E8297A8032N3672m485e9403F068h3689j41788A32136
$$ plain form
11273 -133956 210205 -153842 393951 -15512 248062 -181553 -123479 -430093 223187 -113562
11262 80987 -170430 -201582 305274 -118739 -38323 -71267 -92124 14033 63958 -138873 -33668
11250 65863 226349 73600 -169186 279277 135134 184903 193999 58295 -30148 -65599 -25747
11238 -63563 -281783 14532 -34476 -38719 12328 -228675 214434 -23875 79422 -331011 168018
11226 -290528 -165463 379527 -95747 -59013 -105382 103517 300683 -19713 -212524 144051
11215 -131309 11984 21865 -130680 87553 28780 213640 92526 233080 5227 -7913 -28637
11204 -28637 -381164 110697 42787 173026 249113 102839 342585 -170571 -206794 -205518 -149877
11193 -149877 -158629 -26977 -341027 58297 18032 71704 67219 -59403 6068 -83689 -225477 132136
11180E532c44534L7739R0366B1966K84483b27082A67038B5093K4786f474k01331
11169b07805a9286j33938B84206a96450B6141a53951K6572B01839J9776j05464
11159A16151f83227i0945A91021g025A00394c22303J53557D6828A4492K9423N4432
11148I8347A8605L6217J54015d73430d2639A16399e7389n6502H7536a306o1390
11137f2696E6883I9K2100c22791C4335J98119m1744o5431O4566C2950d4141q3680
11125a27821d2782K42I8782a11415c9073G9499J70044c8938l5560B0236P4613
11114I4849M1964n4920Q6587b72323f7137D3015c9139E5624O3197a11019p315
11103a18334A91816r402q6704B7113K78198g3553C4190J77538L2113M8960A18163
$$ plain form
11180 5532 -344534 -306795 -216429 21966 306449 -227082 167038 25093 49879 -6474 -207805
11169 -207805 -19286 -153224 284206 -196450 26141 -153951 -127379 201839 221615 116151
11159 116151 -683227 -90945 191021 -7025 100394 -322303 -168746 46828 14492 43915 98347
11148 98347 18605 54822 208837 -473430 -42639 116399 -57389 -113891 87536 -1306 -62696
11137 -62696 56883 99 22199 -322791 34335 232454 190710 125279 189845 32950 -44141 -127821
11125 -127821 -42782 -42540 98782 -111415 -39073 79499 249543 -38938 -74498 20236 94849
11114 94849 136813 81893 168480 -272323 -67137 43015 -39139 55624 118821 -111019 -118334
11103 -118334 191816 182414 95710 27113 305311 -73553 34190 211728 243841 292801 118163
11091C0428L12597G0812P9536J41434j1295o8463D3666c1062J4919A30887C1422
11079f3857B89089M7267n1712J88016g9940E23031A55931J04085N3590J3714O3247
11068C90567A74072L6566P1220J09316P6228K41990j02957p2914j86523Q5563
11058D32561J4730J54945k4580P0482K4974q7984K56285m8316k87837J37312R1970
11047G34542j35862k4788L39308k25270m1655K41427k35594q0397N7607K37491
11037H66809j63353p405N6620l1592k17367r9299J37097p9058M7738L08154p0001
11026G48343j00279J76236j1316C93439J03510M9902K12512j44925j75965J52991
11016E91464B80856M23161k99277K95123M5434C62851R9006K3629J26744R0313
$$ plain form
11091 30428 343025 70812 150348 291782 280487 212024 43666 -31062 -16143 130887 31422
11079 -63857 289089 336356 284644 472660 -79940 523031 155931 260016 313606 327320 390567
11068 390567 174072 210638 281858 391174 467402 709392 606435 533521 346998 432561
11058 432561 447291 602236 577656 648138 673112 585128 841413 793097 505260 642572 734542
11047 734542 598680 573892 913200 687930 646275 887702 652108 571711 629318 866809
11037 866809 703456 696051 752671 721079 503712 404413 541510 462452 510190 818344 748343
11026 748343 648064 824300 812984 393439 496949 546851 759363 614438 438473 591464
11016 591464 280856 704017 404740 699863 745297 362851 461857 485486 612230 702543
11006G02543N6854k23914J87105J19880r7876r8272K13098D07022M25072O2635
10996H94729L8014j86258M754J12468M2199j21501K90575k29507j40126J68193
10986H73540k94786M47288K41620p8666p120J37613o377J35660R5518M51050o9088
10975A926252j4773M13789K15194L23378k07078M7018j36204o196m60576N9289
10965B160093k91807n07126N15986m80122P60023l05089J16152o0971J12021O2187
10955B081347p52345L53478m14396J60695m58203q0607j73728q9053J04349k62785
10945D68752A89988l7691K56370j45575A26726j769K62750b552G6004A7614f113
10933e1407J8271B17410R0476d8054G5900j3380N837J38771a90004C39857B7832
$$ plain form
11006 702543 759397 535483 722588 842468 744592 646320 859418 407022 832094 894729
10996 894729 932743 746485 751239 863707 905906 784405 1074980 845473 705347 873540
10986 873540 578754 1026042 1267662 1188996 1181876 1319489 1313112 1448772 1544290 1995340 1926252
10975 1926252 1911479 2325268 2540462 2863840 2656762 2703780 2567576 2561380 2100804 2160093
10965 2160093 1868286 1361160 1877146 1397024 2157047 1851958 1968110 1907139 2019160 2081347
10955 2081347 1329002 1682480 1268084 1428779 970576 889969 716241 627188 731537 468752
10945 468752 189988 152297 408667 263092 126726 124957 387707 -2552 76004 17614 -6113
10933 -51407 -33136 217410 307886 -48054 75900 62520 68357 207128 -190004 339857 27832
10921A91673d6003B89580b8933j7764B0536i970M278C38105p5405a39050A72249
10909a00390F9892g6738b2751G6596a48232M9105B17254b23929i4294i498p4891
10898h4389B22735j9157c08754C97967b00362a7155G735d29303a69606e5758D74288
10886e909G4304b51068a06081A11927a69125F6794J2225a41994m739L6858j77065
10875b86940O0491C06913E4437I163J30122a24384c7740r6852A45763a9548g128
10863a04986j50261D2031b9685C19072i4975D2674J94934p1169G731a98418e2140
10851c41461J45669d3402k20242J24887A15457c66647a02789A09457e755B7716
10840A02659a00557B59684f376k70623h2333r5155j36311a2941B18754b33703
$$ plain form
10921 191673 -46003 289580 -28933 -46697 20536 -9970 -5692 338105 262700 -139050 172249
10909 -100390 69892 -76738 -22751 76596 -148232 -99127 217254 -223929 -94294 -9498 -84389
10898 -84389 222735 203578 -308754 397967 -200362 -17155 7735 -429303 -169606 -55758 474288
10886 -5909 74304 -251068 -106081 111927 -169125 66794 79019 -141994 -146733 -109875 -286940
10875 -286940 -226449 306913 54437 9163 139285 -124384 -37740 -134592 145763 -19548 -7128
10863 -104986 -255247 42031 -29685 319072 -94975 42674 237608 166439 7731 -198418 -52140
10851 -341461 -195792 -43402 -263644 -138757 115457 -366647 -102789 109457 -5755 27716
10840 102659 -100557 259684 -6376 -276999 -82333 -177488 -313799 -12941 218754 -233703
10829B26037C5501h8758k48212B03389q6033b32745A07655b67267e8668r5235
10819a53903D4378b6997g628j13209q5017A35762a11686C8059g1954k40789J44024
10808a68719f9831n6135A91057d2363k06333m142B24185m9793D3096a62977B7705
10796b06966A42760e2987j17700N3722J8003l98L0356j70052I1447f3268j63577
10785b26845K8158f4619B26250l7980b20513d099A9443f5611k23306O3511A05759
10773a11414L3288j06067c4246k36811J20115m2757C9482b63800M1083g1161A19926
10761E5496R5341i0508j2437j2689A46936R327a85710A46003b7387A8752e5475
10749b36133C0836i0916j09050D8681K0412a83688H6316J4717B9182c43521A76797
$$ plain form
10829 226037 35501 -88758 -336970 203389 117356 -232745 107655 -267267 -58668 -153903
10819 -153903 44378 -26997 -7628 -120837 -205854 135762 -111686 38059 -71954 -312743 -168719
10808 -168719 -69831 -125966 191057 -42363 -248696 -252838 224185 174392 43096 -162977 27705
10796 -206966 142760 -52987 -170687 -116965 -98962 -99360 -69004 -239056 91447 -63268 -226845
10785 -226845 -198687 -64619 226250 188270 -220513 -4099 19443 -65611 -288917 -225406 105759
10773 -111414 -78126 -184193 -34246 -271057 -150942 -193699 39482 -263800 -222717 -71161 119926
10761 55496 150837 -90508 -102945 -115634 146936 156263 -185710 146003 -27387 18752 -55475
10749 -236133 30836 -90916 -199966 48681 69093 -183688 86316 101033 29182 -343521 176797
10737E7195K4541a40612A38217D3808a15128k0981o5180l9756A17197b32840M9432
10726a83408A33589f0349A86859i9904k4631N4633j9271q2612B60390r8225A3691
10714B1753K7049O4121K8705b45711f4069p6866e4340C809a32451C40531a04842
10702A799J60007A5593b48980a2311j02127c4932r4420C53703e9527A76287E2497
10690a6613k72637F7515b29596A20870a91378n7060C7320M3422k5279J7850a22512
10678A51567C1884a32377j01259n9202J38998M8504K8280B6218a89421f5907p1717
10667a37624J0247j11712C6762R7810f4007a6933k42233B28535c17087J48506
10657a68581P5144J5758o0336l14170B38071c88757a72609j345R048j2592D1586
$$ plain form
10737 57195 81736 -140612 138217 43808 -115128 -136109 -201289 -241045 117197 -232840 -183408
10726 -183408 133589 -60349 186859 -99904 -124535 -69902 -89173 -171785 260390 162165 13691
10714 21753 48802 112923 141628 -245711 -64069 -140935 -54340 3809 -132451 340531 -104842
10702 1799 161806 15593 -248980 -12311 -114438 -34932 -129352 353703 -59527 176287 52497
10690 -16613 -289250 67515 -229596 120870 -191378 -248438 37320 80742 55463 73313 -122512
10678 151567 31884 -132377 -233636 -292838 -153840 -105336 -77056 26218 -189421 -65907 -137624
10667 -137624 -127377 -239089 36762 134572 -64007 -16933 -259166 228535 -317087 -168581
10657 -168581 -93437 -77679 -138015 -452185 238071 -388757 -172609 -173954 -164906 -177498 41586
10645h316q0318k36876B18900n4878e0285o4439C61131E3154J64952a10935M738
10634a06197D60984E8779J69773a90017A3818O5515J04998L0931H9031M6318a80255
10622G6569a6388r5927r3025f7279C2114b60328a7666r7007B21134b39295A36750
10610C610c37553m7224a86830A89105g7944A7542a25927j71547a2388j9543D7351
10598A88613A6845e1337k37918h8298J5990k15352B3870L9977b83762m7473a5091
10586b43415B0094i4603n7156A08049a64378f0305L565p0611A12221a51251f175
10574a9395l9034p8737j7987j5627J3659A40454q328C4425a11646J2161l53500
10563d52985A87866G6581a21615M1202G8475i5524B25034k5750K53280c69735
$$ plain form
10645 -8316 -88634 -325510 218900 164022 -50285 -114724 361131 53154 218106 -110935 -106197
10634 -106197 460984 58779 228552 -190017 13818 79333 184331 215262 89031 135349 -180255
10622 76569 -16388 -112315 -205340 -67279 32114 -260328 -17666 -114673 221134 -239295 136750
10610 3610 -337553 -384777 -186830 189105 -77944 17542 -125927 -297474 -12388 -31931 47351
10598 188613 16845 -51337 -289255 -88298 -72308 -287660 23870 63847 -283762 -331235 -15091
10586 -243415 20094 -94603 -151759 108049 -164378 -60305 -56740 -127351 112221 -151251 -6175
10574 -19395 -58429 -137166 -155153 -170780 -157121 140454 132126 34425 -111646 -99485 -452985
10563 -452985 187866 76581 -121615 -80413 78475 -95524 225034 199284 452564 -369735
10552I0642D1229b7115j59055r1753C2622J39693b3905k7484A26699c3710B10491
10540b07148f2473m08851A35804g296m5040D28109b73543A88166a40207o576p8144
10529b24927D5108K19913a98777I888K15293a0897j24440p6742B06505b14530
10518A06878a71644Q2054k0271q1355J5563A3938b18387j25535B8371q588b06681
10506G7568a61739A02995c07860E4608g4509A58322b7189k86686L3009b8122C2527
10494B78212a15656C0028a40395r0728N7141g3967j22834A09895N50116A73819
10483F2383J33113P6195F1951K46951J44497j09915a560q4872j4153r6852C869
10471a85062A37372k4903K06161A6175e03089C67019c3922j55467C9559c2431
$$ plain form
10552 90642 41229 -27115 -186170 -277923 32622 172315 -23905 -51389 126699 -33710 210491
10540 -207148 -62473 -471324 135804 -7296 -52336 428109 -273543 188166 -140207 -146783 -224927
10529 -224927 45108 265021 -198777 9888 225181 -10897 -135337 -212079 206505 -214530
10518 106878 -171644 -89590 -109861 -191216 -175653 13938 -218387 -343922 28371 19783 -206681
10506 77568 -161739 102995 -307860 54608 -74509 158322 -27189 -313875 -280866 -28122 32527
10494 278212 -115656 30028 -140395 -231123 -173982 -73967 -196801 109895 660011 173819
10483 62383 195496 271691 61951 308902 453399 343484 -1560 -86432 -100585 -197437 3869
10471 -185062 137372 112469 318630 16175 -503089 367019 -33922 -189389 39559 -32431
10460A06153j8022k0462a13649A57026a60878A7784a36209A34553f6813k1085
10450h7898K7757C5849a8349k28312A19462b13982f31n2663A40143A6510b7163
10438A19839a0559B78191J82829A21860e3388j20704G1483a88962J9981c1046
10427C32675B1856J92312f12819a02628A50633D3712a44780k19878a24265C23158
10416B77768b5038o0824G0719J85970e0729B81005a59110M4111G8676J3086M1234
10405A32996h6063K7892B67046a21489d3194B0012l064b32696H0419N3539a30389
10393H2915O2429K71372o9614A2901J49479K50967A21833P5087k7558N0347D0492
10381h2190J1268A7888L5283L52909E6601K27639o8721J14374J36554n7686j58595
$$ plain form
10460 106153 88131 67669 -113649 157026 -160878 17784 -136209 134553 -66813 -87898
10450 -87898 -60141 35849 -18349 -246661 119462 -213982 -631 -53294 140143 16510 -27163
10438 119839 -10559 278191 461020 121860 -53388 -174092 71483 -188962 -168981 -31046
10427 332675 21856 214168 -612819 -102628 150633 43712 -144780 -364658 -124265 323158
10416 277768 -25038 -85862 70719 256689 -50729 281005 -159110 -114999 78676 91762 132996
10405 132996 -86063 -58171 267046 -121489 -43194 20012 16948 -232696 80419 133958 -130389
10393 82915 145344 416716 347102 12901 162380 413347 121833 196920 169362 219709 40492
10381 -82190 -70922 17888 53171 406080 56601 284240 215519 329893 466447 408761 250166
10370B50166J18150N9561J29709k30914K98959A94708L66009k54096b4647D38362
10359B34128K52929j05707j05573j8260K72133D9368N16308k54856L50450B13695
10348C82073A03561L55198r0572P3977P2987L275j01872j17317O484O8628J5637
10337C89986A10156i1717o8410K9969A71183a24432A11641E900a90654C3396a7840
10325A04444J30266b2017D27986j73505L40748g6016B86489a41300B02803E0633
10314B30933a70426O3861m2607B1986J15702b25971j55435i3131M5672l8372b7313
10302B11601b0933j10030k3155I8935g5599B21810a45438j62876a23446B8512
10291h2653J9890j54231p5197B63092r0560D4529e0154o41762A4305J07093h8392
$$ plain form
10370 250166 368316 427877 557586 326672 625631 194708 560717 306621 -24647 438362
10359 234128 487057 381350 275777 257517 529650 49368 565676 310820 661270 213695
10348 382073 103561 458759 368187 442164 515151 518426 416554 299237 305721 374349 389986
10337 389986 110156 -91717 -160127 -130158 171183 -124432 111641 5900 -190654 33396 -17840
10325 104444 234710 -22017 427986 254481 595229 -76016 286489 -141300 202803 50633
10314 230933 -170426 -106565 -149172 21986 137688 -225971 -381406 -93131 -47459 -85831 -27313
10302 211601 -20933 -130963 -154118 98935 -75599 221810 -145438 -308314 -123446 28512
10291 -82653 -62763 -216994 -292191 263092 172532 44529 -50154 -691916 14305 121398 -88392
10279c18945F8142Q9472J7434a16790K8039A30213a3817n2841F344c28607I7376
10267i4756M3256j08850D0714R0974h9510D3043L17356J4535L31284B08966j2210
10256A96756K08663j41215J45187E5033b28108D5981c23282A46558b01465A44946
10245A8319b1229l4185E1019a61436N0860o0691A5438K70723I390h3165C3784
10233a63552o6133A19694c0698j19449A08311a69408A18268l5278Q6846a6361
10222d5899j95831R9477m7376d889j64885C4412a10807I384k603J34669c1782
10210A8911J53592J19304j03084b09434A48937e1789F3727a08386o9982h7528
10199a01928l10996B22260b60670A9670c56949p314C897e4959l44298f6558q8948
$$ plain form
10279 -318945 68142 157614 175048 -116790 -88751 130213 -13817 -66658 6344 -328607 97376
10267 -94756 -51500 -160350 40714 131688 -89510 43043 360399 374934 706218 208966 196756
10256 196756 405419 264204 409391 55033 -228108 45981 -323282 146558 -201465 144946
10245 18319 -21229 -55414 51019 -161436 -110576 -171267 15438 286161 9390 -83165 33784
10233 -163552 -229685 119694 -30698 -150147 108311 -169408 118268 82990 169836 -16361
10222 -45899 -241730 -142253 -189629 -4889 -169774 34412 -110807 9384 6781 141450 -31782
10210 18911 172503 291807 188723 -209434 148937 -51789 63727 -108386 -178368 -87528
10199 -101928 -412924 222260 -260670 19670 -356949 -364263 3897 -54959 -399257 -66558 -155506
10188a55506k1782o2667B7338a87174K8362j49677F2418J83599d2176j00530P0917
10177g1789A23298c48504b5376j93929I1021b3784o6468j6270o7300A16206h5677
10165b55702k2786j45195A38841E0052a00968j54545M1588l706c0510j59352Q4522
10154a05340I024a02289B6185d17904B9444O2359h5964A06241f4130j27050A14411
10142e5350q2765f1291H852a40724E7444a12456A78392a08610k31480a29495o7052
10131a96547j20894g2451a8952A35171c40358J06486d8831j39124I9802C9706
10120A61331R9065D0530b82053d2875a3275k00435A7965g0653K0623G5312a52671
10108a85170Q5290l0389F6414B7794b83629J25419j39527J19401e7400o6577f0503
$$ plain form
10188 -155506 -177288 -239955 27338 -187174 -158812 -308489 62418 246017 -42176 -142706 -71789
10177 -71789 123298 -348504 -25376 -219305 91021 -23784 -90252 -106522 -173822 116206 -85677
10165 -255702 -278488 -423683 138841 50052 -100968 -255513 -213925 -217631 -30510 -189862 -105340
10154 -105340 9024 -102289 26185 -417904 29444 91803 -85964 106241 -64130 -191180 114411
10142 -55350 -138115 -61291 8852 -140724 57444 -112456 178392 -108610 -340090 -129495 -196547
10131 -196547 -317441 -72451 -18952 135171 -340358 -233872 -48831 -187955 99802 39706
10120 161331 260396 40530 -282053 -42875 -13275 -213710 17965 -70653 -50030 75312 -152671
10108 -185170 -99880 -130269 66414 27794 -283629 -158210 -297737 -178336 -57400 -123977 -60503
10096a86510M0911f8817A40742a06397E2498a56793r0773R7415A6725K3245N0581
10085I0551M0490l0926f6228J4007j45809C71557a69590k874n3857a3082m58310
10074d71392a15136m4154a0591j35455N4703A10755b10212j41718C6984J54236
10064A91220b42277c8737C7973f8956D09916a75068l54846a2594j78199A872h6668
10052b09806a8065Q698j62072A26164J80550a22398M6729g710K933l347l4170
10041d2294j52597O5864l61344K04588a10806M8797A61577J08206B9767b4790
10030h9476A1931a90253h7076j66559f5997B8336J142p823a52210j76700Q5714
10019b43196H5462G806K2146a07734E8026A2570d47530I0669b16192C5498L3116
$$ plain form
10096 -186510 -145599 -68817 140742 -106397 52498 -156793 -247566 -150151 16725 39970 90551
10085 90551 131041 100115 -66228 -52221 -198030 371557 -169590 -172464 -226321 -13082 -471392
10074 -471392 -115136 -159290 -10591 -146046 -91343 110755 -210212 -351930 36984 191220
10064 191220 -242277 -38737 37973 -68956 409916 -175068 -529914 -12594 -190793 1872 -86668
10052 -209806 -18065 -9367 -171439 126164 306714 -122398 -75669 -7710 -4777 -8124 -42294
10041 -42294 -194891 -129027 -490371 -285783 -110806 -62009 161577 269783 29767 -24790
10030 -89476 11931 -190253 -87076 -253635 -65997 28336 29478 21655 -152210 -328910 -243196
10019 -243196 85462 7806 29952 -107734 58026 12570 -447530 90669 -216192 35498 68614
10008F8614a21050k22450J64829H1707A221K38984B2914J71900f8063B61504d4145
9996C9462g2941a2855j3024q9920p8097B05092b89846C1868c32256B12820d3719
9984C1106a32354d0791j13991h836F7856a61393g0392o9190j02010a3303m44038
9973d57341d39j46286N4625C1201b3040j22208A74296b40907I1217B5686g063
9961E7153a4457n8498A72741a14358m24122a23392A71060m2180c43432a36126
9950e9441j14468k09129A66847D9630a21221N1372A74426c82107E3253k211g3297
9938b15211A03173k3411b01560j6106a4732H7465d9127E4107h3751A33829b60518
9926B25061a46852g207C76416B3113J87729g8066j42156C18487b15472A9683b14960
$$ plain form
10008 68614 -121050 -343500 -178671 81707 1221 240205 22914 194814 -68063 261504 -44145
9996 39462 -72941 -12855 -25879 -115799 -193896 205092 -289846 31868 -332256 212820 -43719
9984 31106 -132354 -40791 -154782 -8836 67856 -161393 -70392 -139582 -241592 -13303 -457341
9973 -457341 -439 -146725 -92100 31201 -23040 -145248 174296 -240907 91217 25686 -7063
9961 57153 -14457 -72955 172741 -114358 -538480 -123392 171060 128880 -343432 -136126
9950 -59441 -173909 -383038 166847 49630 -121221 -69849 174426 -382107 53253 51042 -73297
9938 -215211 103173 79762 -201560 -217666 -14732 87465 -49127 54107 -83751 133829 -260518
9926 225061 -146852 -7207 376416 23113 210842 -78066 -220222 318487 -215472 19683 -214960
9914a11121a2971q6604j95857B68627i52I216h9797j91043J01301g3232j68164
9903b41396I6486J52232A05927J01258r8319c47114f4863r030p9582A57955a08298
9891c9251k03925A46391a37201j13150N0080E1338b2978l37395f1700l1445A75440
9879c4392B15818d1244A21194b64171c8917A08115e2358m37749K34830A8977b95925
9867a64919A4143a86613r9760B07026b45975E9913A820g3757L6282k67816J12981
9856a92310o3527D4395d7040j92297q9562D806b93779A14392b8420A64630c82027
9844c3316D710b3743o2066A2478c754F5831a93188l2032O4A7974c4710C5090R6959
9831A32049f2512A16879K5094h0528K2494l4837M6346j35303d6077p6690A77189
$$ plain form
9914 -111121 -12971 -99575 -295432 268627 -952 9216 -89797 -280840 -179539 -73232 -241396
9903 -241396 96486 248718 105927 207185 108866 -347114 -64863 -73893 -153475 157955 -108298
9891 -39251 -243176 146391 -137201 -250351 -200271 51338 -22978 -360373 -61700 -93145 175440
9879 -34392 215818 -41244 121194 -264171 -38917 108115 -52358 -490107 -255277 18977 -295925
9867 -164919 14143 -186613 -286373 207026 -245975 59913 1820 -73757 -37475 -305291 -192310
9856 -192310 -255837 44395 -47040 -239337 -328899 4806 -293779 114392 -28420 164630 -382027
9844 -33316 4710 -23743 -85809 12478 -3754 65831 -193188 -225220 -225156 17974 -34710 35090 132049
9831 132049 -62512 116879 141973 -80528 -58034 -92871 -46525 -181828 -46077 -122767 177189
9819d3688j80824Q3574B1081J47778q4056c1630p12B84086B9923J58822a65016
9807a8951k8833j32748a1810j59792B13719C3058J43201a82645M1373l475A32296
9795a07544j43893j27177a14140k18256P7227b369p4930A62664a1217C3339a47525
9783d03689K3061d3344A81186E5298g5813A4861d00441a75609D5193j1916e1434
9771a55214j09599k52550a67229b9566J0712r3218I8438f955l513l9038o4128
9760a13634N4975B96535a41846m0805o1342d4354A45901c3302k54432j28294F9260
9748G8277Q2398g3422q3546a5717l32630B05052b9199l8977P871A67148K08013
9737C75161b38987M191e9341A16543h3886J9834l6397l2759j78696P6476O5724
$$ plain form
9819 -43688 -224512 -140938 21081 168859 84803 -31630 -32342 284086 29923 188745 -165016
9807 -18951 -47784 -180532 -11810 -171602 213719 33058 176259 -182645 -141272 -144747 132296
9795 -107544 -251437 -378614 -114140 -332396 -255169 -2369 -77299 162664 -11217 33339 -147525
9783 -403689 -380628 -43344 181186 55298 -75813 14861 -400441 -175609 45193 33277 -51434
9771 -155214 -264813 -517363 -167229 -29566 -18854 -112072 98438 -6955 -10468 -49506 -113634
9760 -113634 -58659 296535 -141846 -182651 -243993 -44354 145901 -33302 -287734 -416028 69260
9748 78277 160675 -73422 -156968 -15717 -348347 205052 -29199 -68176 -60305 167148 375161
9737 375161 -238987 -234796 -59341 116543 -83886 -64052 -100449 -133208 -311904 -235428 -169704
9726a69704B2425b85134J12693n9777g8077j69043P7885k9770J1599O6111j34115
9715b55410A9471K285b59490O2435A07735g8309C98410A0729f7231A9466b50706
9703D6943g6294g294q9101a1732D1781a48187m2108g2938l4097l5927N4621K1023
9691f7318k08567a24653j9544N3775j68139M6424o275b6908k28701A03416k6653
9680G6763a8993k1723p8070j50894a520B38698b8140j24968K4125k32942i2572
9668C0428a4763j39898A11152c5000j1709B4917L08210b99973F2775P4626b4669
9656a97786h0795A7061a99100A94407a92726A22729a97845A58793D5937K23956
9646B69893a43484C622N6845i8129k07498a0572k78766a0108I6019a63773K4468
$$ plain form
9726 -169704 22425 -285134 -172441 -232218 -78077 -247120 -169235 -199005 -187406 -121295 -255410
9715 -255410 19471 21756 -259490 -197055 107735 -78309 398410 10729 -67231 19466 -250706
9703 46943 -76294 -7294 -96395 -11732 41781 -148187 -190295 -72938 -107035 -142962 -88341 -67318
9691 -67318 -275885 -124653 -144197 -90422 -258561 -212137 -218412 -26908 -255609 103416 76763
9680 76763 -18993 -40716 -118786 -269680 -1520 238698 -28140 -153108 -128983 -361925 -92572
9668 30428 -14763 -154661 111152 -35000 -46709 24917 333127 -299973 62775 137401 -24669
9656 -197786 -80795 17061 -199100 194407 -192726 122729 -197845 158793 45937 269893
9646 269893 -143484 3622 60467 -98129 -305627 -10572 -289338 -10108 96019 -163773 -139305
9635a39305K6183A93067p3869a22578F3087g4561A8650b29178J02747F1456f3120
9623B61507d8829b417j0439A51941c50044B8659a16397F8528g3194r3575b6164
9611c2610A61635P3457d22180E3037c48548H5773l7218a30167D38293I0303O5417
9600A55720k232c69972H114P716i1699B32322b55258L5382J08358o365M154k87971
9588d01700g99j12220j7328D2359K4408a4287j47101e8959A41212d0982H1921
9576E5620e49097i6344c978m24320A65642o8084A9898J38122P2285a49481M7089
9565a02392Q581k41824G893j0b19788F9080d2127E9654h6002o2835m7336L4458
9553a61715f7823j53975D7057a76504H7940O4020a33969j1131b5308r56k42514
$$ plain form
9635 -139305 -113122 193067 119198 -122578 63087 -74561 18650 -229178 -126431 61456 -63120
9623 261507 -48829 -2417 -12856 151941 -350044 28659 -116397 68528 -73194 -166769 -26164
9611 -32610 161635 235092 -422180 53037 -348548 85773 48555 -130167 438293 90303 155720
9600 155720 153488 -369972 8114 15830 -91699 232322 -255258 -219876 -111518 -117883 -113729 -401700
9588 -401700 -799 -113019 -130347 42359 66767 -14287 -161388 -58959 141212 -40982 81921
9576 55620 -549097 -96344 -3978 -428298 165642 97558 19898 158020 230305 -149481 -102392
9565 -102392 -93811 -335635 7893 7883 -219788 69080 -42127 59654 -86002 -148837 -196173 -161715
9553 -161715 -67823 -221798 47057 -176504 87940 151960 -133969 -145100 -25308 -26264 -268778
9542b68778n2792a00909A54934a44869d3027j15343O7153A30068a5989l4675D8993
9530g0752K3889p0231f253k6670k18212b8018p0271j84823m4109J50980M9552
9519a26689B89548c37033a55137l7566j13721c3953A8254L10752a10403B01920
9508A80971G5414F548b62616R4894H6020k6243d02207E2255d48144K14080H7633
9496B2316b20177Q9248e8442j4971o5988H8513a78977G282e094E8401J03274b87001
9483b9731j0565B80191a87793A68957f7835a9718A40946K30068b85177K1909j06639
9472c69907A47005a05235l71932K10351J04025c5131B47256j18711i5754k0782
9462a16536J2665b8377d090B44431C5094a41831A658O7534h1355r4122q5333D7002
$$ plain form
9542 -268778 -321570 -100909 154934 -144869 -43027 -158370 -91217 130068 -15989 -50664 48993
9530 -70752 -46863 -117094 -6253 -32923 -251135 -28018 -98289 -283112 -327221 -176241 -126689
9519 -126689 289548 -337033 -155137 -192703 -306424 -33953 18254 329006 -110403 201920
9508 180971 75414 6548 -262616 -167722 86020 59777 -402207 52255 -448144 -234064 87633
9496 22316 -220177 -130929 -58442 -73413 -139401 88513 -178977 7282 -5094 58401 161675 -287001
9483 -29731 -40296 280191 -187793 168957 -67835 -19718 140946 371014 -285177 -263268 -369907
9472 -369907 147005 -105235 -477167 -266816 -162791 -35131 247256 128545 -95754 -116536
9462 -116536 -103871 -28377 -4090 244431 35094 -141831 1658 69192 -81355 -175477 -260810 47002
9449B11091a01375M6914L113A35526a36010j7430k2476B8149J56947L5043a77473
9437c5476l6771G8849l0351r045d6240p5071C68338E5860f9445j08701C13119
9425a46681L7482k48863M0378A54705b54395j14848a14714j87874J27417h5249
9414g9590A40474Q2270a09226j58523k7148B71369a632k73607A8785J28785a6461
9402I0876K366a01969B49036F2171K6505J18585A7910i0258D7467j0827K61184
9391B97824d8423f942B31180a57845E3795b12437G8319a33456M4304G3780e47659
9379E4312M15a46391A44495a40559H109a92578k555o3505A64509A4542b7969H9034
9366D5650a22595F6837k0518c04457J36889n0639j12675B17640b5052E391K2408
$$ plain form
9449 211091 -101375 -54461 -51348 135526 -136010 -153440 -175916 28149 185096 220139 -177473
9437 -35476 -72247 78849 48498 39453 -46240 -121311 368338 55860 -69445 -178146 313119
9425 -146681 -109199 -358062 -317684 154705 -254395 -369243 -114714 -302588 -175171 -85249
9414 -79590 140474 222744 -109226 -267749 -294897 271369 -1632 -275239 18785 147570 -16461
9402 90876 93242 -101969 249036 62171 88676 207261 17910 -90258 47467 36640 297824
9391 297824 -48423 -6942 231180 -157845 53795 -212437 78319 -133456 -89152 73780 -547659
9379 54312 54727 -146391 144495 -140559 8109 -192578 -195133 -258638 164509 14542 -27969 89034
9366 45650 -122595 66837 46319 -304457 -167568 -218207 -330882 217640 -25052 5391 27799
9355B7799K99171A52735a91396A15571l7550b85396m0631f4661k44581B17192
9344a00588B21720c17863D3836L30706b50252C8993g010j3648m0144C40922C950
9332A15294b54544h8909q9439p5907B4909b17468A9740a92170E3799b56907A63497
9320b04425k01776f862l1871B43513a81392d7911l7193J4075C919L3663a90316
9308a75274c1428C2477J46307M6251H3268k8249c05616j6981b9966r3256c1974
9296a92776A05019a02256D2719J68227d0722k83607B62654a2614k70447A44695
9285D73907e6572A13795D1365G151a27032N2456A34070n3341c01316b4245F1544
9273B91929a03430E3530L05729a7495A75992L588b31675g9698j22131L7493L417
$$ plain form
9355 27799 326970 152735 -191396 115571 78021 -285396 -326027 -64661 -309242 217192
9344 -100588 221720 -317863 43836 374542 -250252 38993 -7010 -20658 -60802 340922 3950
9332 115294 -254544 -88909 -178348 -254255 24909 -217468 19740 -192170 53799 -256907 163497
9320 -204425 -406201 -6862 -38733 243513 -181392 -47911 -85104 -71029 3919 37582 -190316
9308 -175274 -31428 32477 178784 225035 83268 55019 -305616 -322597 -29966 -123222 -31974
9296 -192776 105019 -102256 42719 210946 -40722 -324329 262654 -12614 -283061 144695
9285 473907 -56572 113795 41365 7151 -127032 -74576 134070 80729 -301316 -24245 61544
9273 291929 -103430 53530 359259 -17495 175992 179580 -231675 -79698 -201829 -164336 -160919
9262a60919j16947h6956r0002d6410o8962d551B49268e67461a85616b1862D9976
9250a53177B69182c30312c4458j25272a0785p3895l9606m531c4215k26968F9652
9238H2701C6601P539K59762B0894N2330P0253b4414E3488a74157B15089a95246
9226a5383n29068d1373k76873J58428k4073A07962a4807k07248A06463K14944
9216C21407F3737d3146H4867J68163c36842C8587j2038a42874C48377b84448K7802
9205b56646f0944l93251K17298C31819A35943b05203m713A93077d7054j20794
9195a67848G2486L26906A46028c1010l57420A14567j2964k0821N8891a8884j04659
9184a23543A41200m2028c47075C4754f0455j38226K6965B4780b31853P926L0841
$$ plain form
9262 -160919 -277866 -86956 -176958 -46410 -115372 -4551 249268 -567461 -185616 -21862 49976
9250 -153177 269182 -330312 -34458 -159730 -10785 -84680 -124286 -128817 -34215 -261183 69652
9238 82701 36601 44140 303902 20894 73224 143477 -24414 53488 -174157 215089 -195246
9226 -15383 -544451 -41373 -318246 -159818 -183891 107962 -14807 -222055 106463 321407
9216 321407 63737 -43146 84867 253030 -336842 38587 26549 -142874 348377 -284448 -256646
9205 -256646 -60944 -454195 -236897 331819 135943 -205203 -209916 193077 -47054 -167848
9195 -167848 72486 399392 146028 -31010 -388430 114567 101603 80782 139673 -18884 -123543
9184 -123543 141200 99172 -347075 34754 -60455 -198681 -171716 24780 -231853 -223927 -193086
9173a93086j58182M621B07933a13691k17036J52583J1907g1736B76277a8161B57736
9161b41554H5334L239a15667q2910M4170B8267d8708o884A47313b63185A99756
9149C04008b63795C0408a34591A46859i832a051j67580e9076B2898b46908K7705
9138b19203g3227A02005c32382g9475L0614A00969c22116C15608b4599H0465d84863
9126E4175b88829J07345J5735p5444L8269M9395p5450c8772j73672A80734a9675
9114i7641a9752I7109m0939M8004a05627l9864B91784a42203A57364h8568B466
9102G9319J16175D2448c41981J70308j2034M0258n3666Q5859C2262f1263a0208
9090B3773a78964C7451J81460b8877l6617K1696r0128F8474b13448j9011a6545
$$ plain form
9173 -193086 -351268 -346647 207933 -113691 -330727 -178144 -166237 -71736 276277 -18161 257736
9161 -241554 85334 88573 -115667 -198577 -154407 28267 -48708 -55592 147313 -263185 199756
9149 304008 -263795 30408 -134591 146859 -9832 -1051 -168631 -59076 22898 -246908 -219203
9138 -219203 -73227 102005 -332382 -79475 -48861 100969 -322116 315608 -24599 80465 -484863
9126 54175 -288829 -181484 -165749 -241193 -202924 -153529 -228979 -38772 -212444 180734 -19675
9114 -97641 -19752 97109 56170 104174 -105627 -145491 291784 -142203 157364 -88568 2466
9102 79319 195494 42448 -341981 -171673 -183707 -143449 -197115 -111256 32262 -61263 -10208
9090 23773 -178964 37451 218911 -28877 -65494 -43798 -133926 68474 -213448 -232459 -16545
9078a25009d8721o2542A87168B8189K1067B3078b61827A3844J71816b51243D0850
9066B32262a66814A89600n2278E6247M0888m7624L05391b02990A21754a5996j40440
9055a56436n077h0695C00538a10350j02090G1973b18995R0162B69011f9449B73604
9043a50899q8661J6120C2822L3888c43980a68618b7994B2784b02150p6069L3459
9032b44760B00974a41794p8731e919A560g1442B98081A44471O7082r790b99540
9020E6658a33734F6817a07589J6748C29791A12897g6304A32850h0441j026J3045
9009f8422j59948C5730K07538b4325j31968M4952L9261C9685b86893J35305A95524
8997C7532a39261j1515n5645A08813k3788N8987b22777c4728D1503L0018J21836
$$ plain form
9078 -125009 -48721 -111263 187168 28189 49256 23078 -261827 13844 185660 -251243 40850
9066 232262 -166814 189600 137322 56247 97135 49511 354902 -202990 121754 -15996 -156436
9055 -156436 -161513 -80695 300538 -110350 -212440 71973 -218995 -128833 269011 -69449 273604
9043 -150899 -239560 -223440 32822 66710 -343980 -168618 -27994 22784 -202150 -278219 -244760
9032 -244760 200974 -141794 -220525 -5919 1560 -71442 298081 144471 211553 201763 -299540
9020 56658 -133734 66817 -107589 -90841 329791 112897 -76304 132850 -80441 -81467 -68422
9009 -68422 -228370 35730 243268 -24325 -156293 -111341 -72080 39685 -286893 -151588 195524
8997 37532 -139261 -150776 -206421 108813 85025 144012 -222777 -34728 41503 71521 193357
8986A93357B7603J50150a622l04715a0814j52102J826B09530k023b1806M411A74701
8973C65323i3828j41053J13187E9632a70038p7592A09939e8693C8741L81993a34526
8961A12997d41187B38142a37627A83832e184p7920c1869A30500c35156h8547A81893
8949E2682J10585C445N3364a75798N0954q7391C0312R3879f6065B38916i3147
8937d2197A76269J3575K5006B0287O1007f5556B21454h9311A05349b27997D2418
8925E0265K32931L74735R01506K500009j956771G12560A08108O8578L1241I7204
8914H9413i317o9387o9799l8670B0765L71876j90864I8982B9332J0835c2616j38792
8902a71408L9950A04656a32816n0230B10871A0988K4919a51685A09142B8260K47861
$$ plain form
8986 193357 27603 177753 -1622 -306337 -10814 -162916 -161090 209530 207507 -21806 -17395 174701
8973 365323 -93828 -234881 -121694 59632 -170038 -247630 109939 -58693 38741 420734 -134526
8961 112997 -441187 238142 -137627 183832 -5184 -83104 -31869 130500 -335156 -88547 181893
8949 52682 163267 3445 56809 -175798 -124844 -212235 30312 124191 -66065 238916 -93147
8937 -42197 176269 189844 214850 20287 81294 -65556 221454 -89311 105349 -227997 42418
8925 50265 283196 657931 1559437 4059446 2102675 712560 108108 176686 207927 97204
8914 89413 -9317 -78704 -148503 -187173 20765 392641 201777 98982 29332 40167 -32616 -171408
8902 -171408 -131458 104656 -132816 -183046 210871 10988 35907 -151685 109142 28260 276121
8891B76121d352l05529J42637E351O2441k4414K1918e9722B9346J04026a34995
8879A7680D507L35241A04369J85276A16432Q4140c9361r6684j73555B0962a66403
8867A5258a91399P4229C1735e4461j00037f6069r8104D1121B0222a7433m1311
8856e8744m0199k31181a45585j47000A62310A708J83802b76161e5989k5329L2990
8845d8328p7017c4229j36627C8188b67830A14426c41964e7138k48088A31190C9396
8833c56387A8716b26849G9402c40663H8722M545c6030a4856j56778o666O7039
$$ plain form
8891 276121 -4352 -309881 -167244 5351 67792 43378 65296 -59722 29346 133372 -134995
8879 17680 4507 339748 104369 289645 116432 200572 -39361 -136045 -309600 20962 -166403
8867 15258 -191399 -117170 31735 -54461 -154498 -66069 -164173 41121 20222 -17433 -58744
8856 -58744 -98943 -330124 -145585 -292585 162310 1708 185510 -276161 -55989 -81318 -48328
8845 -48328 -125345 -34229 -170856 38188 -267830 114426 -341964 -57138 -305226 131190 39396
8833 -356387 18716 -226849 79402 -340663 88722 93267 -36030 -14856 -171634 -178300 -111261
$$ [...]
##END NTUPLES=NMR SPECTRUM
##END=
