
##TITLE=AC1303_PERAH12115_6641754_p1tBAZZZUx
##JCAMPDX= 6.0         $$ Bruker NMR JCAMP-DX V2.0
##DATA TYPE= NMR SPECTRUM
##DATA CLASS= NTUPLES
##ORIGIN= BRUKER
##OWNER= Administrator
$$ 1.72 TOPSPIN		Version 2.1
$$ 2012-08-08 14:02:55.484 -0500  Administrator@TOPSPIN
$$ Compression mode = diff/dup
##.OBSERVE FREQUENCY= 400.02188249412
##.OBSERVE NUCLEUS= ^1H
##.ACQUISITION MODE= SIMULTANEOUS (DQD)
##.ACQUISITION SCHEME= undefined
##.AVERAGES= 64
##.DIGITISER RES= 22
##SPECTROMETER/DATA SYSTEM= spect
##.PULSE SEQUENCE= noesygpps1d.comp
##.SOLVENT NAME= COFFEE_meoh
##.SHIFT REFERENCE= INTERNAL, COFFEE_meoh, 1, 14.96071
##AUDIT TRAIL= $$ (NUMBER, WHEN, WHO, WHERE, PROCESS, VERSION, WHAT)
$$ ##TITLE= Audit trail, TOPSPIN		Version 2.1
$$ ##JCAMPDX= 5.01
$$ ##ORIGIN= Bruker BioSpin GmbH
$$ ##OWNER= Administrator
$$ $$ C:\Bruker\TOPSPIN/data/COFFEE/nmr/AC1303_PERAH12115_6641754_p1tBAZZZUx/12/pdata/1/auditp.txt
$$ ##AUDIT TRAIL=  $$ (NUMBER, WHEN, WHO, WHERE, PROCESS, VERSION, WHAT)
(   1,<2012-08-08 14:02:50.937 -0500>,<Administrator>,<TOPSPIN>,<go>,<TOPSPIN 2.1>,
      <created by zg
	started at 2012-08-08 13:51:20.375 -0500,
	POWCHK enabled, PULCHK disabled,
       configuration hash MD5:
       6B 1B 68 BB D9 2E 58 E2 7F 35 AD 54 07 DF 0E 41
       data hash MD5: 64K
       5C 52 65 1D 85 D3 EC FF 6B 07 3C 81 F6 1A 8D 12>)
(   2,<2012-08-08 14:02:53.687 -0500>,<Administrator>,<TOPSPIN>,<proc1d>,<TOPSPIN 2.1>,
      <Start of raw data processing
       efp LB = 0.3 FT_mod = 6 PKNL = 1 PHC0 = 0 PHC1 = 0 SI = 128K 
       data hash MD5: 128K
       42 75 36 4D 88 A4 FB A2 4F 87 D1 61 9D F4 1E 88>)
(   3,<2012-08-08 14:02:54.812 -0500>,<Administrator>,<TOPSPIN>,<proc1d>,<TOPSPIN 2.1>,
      <pk PHC0 = -0.335083 PHC1 = 0 
       data hash MD5: 128K
       56 66 A9 43 E3 20 C2 78 95 AD 75 48 61 68 4A EB>)
(   4,<2012-08-08 14:02:55.125 -0500>,<Administrator>,<TOPSPIN>,<proc1d>,<TOPSPIN 2.1>,
      <abs ABSG = 1 
       data hash MD5: 128K
       39 18 A4 54 D4 D2 7E CB 33 66 25 9A FF 9A 53 57>)
(   5,<2012-08-08 14:02:55.203 -0500>,<Administrator>,<TOPSPIN>,<proc1d>,<TOPSPIN 2.1>,
      <abs ABSG = 2 
       data hash MD5: 128K
       1F 46 75 C8 E4 13 0D 61 2B 9C F7 B6 06 EB A3 37>)
(   6,<2012-08-08 14:02:55.250 -0500>,<Administrator>,<TOPSPIN>,<proc1d>,<TOPSPIN 2.1>,
      <abs ABSG = 3 
       data hash MD5: 128K
       4B 91 63 5A 4D FC 7C 95 E7 02 E1 74 0D AC 9C 0E>)
(   7,<2012-08-08 14:02:55.296 -0500>,<Administrator>,<TOPSPIN>,<proc1d>,<TOPSPIN 2.1>,
      <abs ABSG = 4 
       data hash MD5: 128K
       B4 38 BA B6 71 5E 7B 5A F0 BD EB 40 5F 65 D0 8E>)
(   8,<2012-08-08 14:02:55.375 -0500>,<Administrator>,<TOPSPIN>,<proc1d>,<TOPSPIN 2.1>,
      <abs ABSG = 5 
       data hash MD5: 128K
       64 18 4F E2 C5 BA AB E8 5E 4C AF DC E8 A8 E8 C0>)
$$ ##END=
$$ 
$$ $$ hash MD5
$$ $$ 6E 26 6F 94 7F E3 FC F2 E3 BC 46 70 4C 79 C6 A7
##$RELAX= 
##$RELAX= 
##$RELAX= 
##$RELAX= 
##$RELAX= 
##$RELAX= 
##$RELAX= 
##$RELAX= 
$$ Bruker specific parameters
$$ [...]
##$TP07= 0
##$TPNAME0= <>
##$TPNAME1= <>
##$TPNAME2= <>
##$TPNAME3= <>
##$TPNAME4= <>
##$TPNAME5= <>
##$TPNAME6= <>
##$TPNAME7= <>
##$TPOAL= (0..7)
0.5 0.5 0.5 0.5 0.5 0.5 0.5 0.5
##$TPOFFS= (0..7)
0 0 0 0 0 0 0 0
##$TUNHIN= 0
##$TUNHOUT= 0
##$TUNXOUT= 0
##$USERA1= <user>
##$USERA2= <user>
##$USERA3= <user>
##$USERA4= <user>
##$USERA5= <user>
##$V9= 5
##$VALIST= <valist>
##$VCLIST= <CCCCCCCCCCCCCCC>
##$VD= 0
##$VDLIST= <DDDDDDDDDDDDDDD>
##$VPLIST= <PPPPPPPPPPPPPPP>
##$VTLIST= <TTTTTTTTTTTTTTT>
##$WBST= 1024
##$WBSW= 4
##$XGAIN= (0..3)
0 0 0 0
##$XL= 0
##$YL= 0
##$YMAX_a= 11691834
##$YMIN_a= -9209481
##$ZGOPTNS= <>
##$ZL1= 120
##$ZL2= 120
##$ZL3= 120
##$ZL4= 120
##$ABSF1= 14.96071
##$ABSF2= -5.597472
##$ABSG= 5
##$ABSL= 3
##$ALPHA= 0
##$AQORDER= 0
##$ASSFAC= 0
##$ASSFACI= 0
##$ASSFACX= 0
##$ASSWID= 0
##$AUNMP= <proc_prof1d_extract.lims>
##$AXLEFT= 0
##$AXNAME= <>
##$AXNUC= <1H>
##$AXRIGHT= 0
##$AXTYPE= 0
##$AXUNIT= <>
##$AZFE= 0.1
##$AZFW= 0.1
##$BCFW= 0
##$BC_mod= 0
##$BYTORDP= 0
##$COROFFS= 0
##$CY= 15
##$DATMOD= 1
##$DC= 0
##$DFILT= <>
##$DTYPP= 0
##$F1P= 0
##$F2P= 0
##$FCOR= 0.5
##$FTSIZE= 131072
##$FT_mod= 6
##$GAMMA= 0
##$GB= 0
##$INTBC= 1
##$INTSCL= 1
##$ISEN= 128
##$LB= 0.3
##$LEV0= 0
##$LPBIN= 0
##$MAXI= 10000
##$MC2= 0
##$MEAN= 0
##$ME_mod= 0
##$MI= 0
##$NCOEF= 0
##$NC_proc= -2
##$NLEV= 6
##$NOISF1= 0
##$NOISF2= 0
##$NSP= 0
##$NTH_PI= 0
##$NZP= 0
##$OFFSET= 14.96071
##$PC= 1
##$PHC0= -0.335083
##$PHC1= 0
##$PH_mod= 1
##$PKNL= yes
##$PPARMOD= 0
##$PPDIAG= 0
##$PPIPTYP= 0
##$PPMPNUM= 2147483647
##$PPRESOL= 1
##$PSCAL= 4
##$PSIGN= 0
##$PYNMP= <proc.py>
##$REVERSE= no
##$SF= 400.020009753885
##$SI= 131072
##$SIGF1= 0
##$SIGF2= 0
##$SINO= 400
##$SIOLD= 131072
##$SPECTYP= <>
##$SREGLST= <1H.CDCl3>
##$SSB= 0
##$STSI= 131072
##$STSR= 0
##$SW_p= 8223.68421052631
##$SYMM= 0
##$S_DEV= 0
##$TDeff= 65536
##$TDoff= 0
##$TI= <>
##$TILT= no
##$TM1= 0
##$TM2= 0
##$TOPLEV= 0
##$USERP1= <user>
##$USERP2= <user>
##$USERP3= <user>
##$USERP4= <user>
##$USERP5= <user>
##$WDW= 1
##$XDIM= 131072
##$YMAX_p= 399002536
##$YMIN_p= -12278
##$CURPLOT= <Network HP LaserJet P1505>
##$CURPRIN= <$Network HP LaserJet P1505>
##$DFORMAT= <normdp>
##$LAYOUT= <+/1D_H.xwp>
##$LFORMAT= <normlp>
##$PFORMAT= <normpl>
##$SURQMSG= 1
$$ End of Bruker specific parameters
$$ ---------------------------------
##NTUPLES= NMR SPECTRUM
##VAR_NAME=  FREQUENCY,     SPECTRUM/REAL,   SPECTRUM/IMAG
##SYMBOL=    X,             R,               I
##VAR_TYPE=  INDEPENDENT,   DEPENDENT,       DEPENDENT
##VAR_FORM=  AFFN,          ASDF,            ASDF
##VAR_DIM=   131072,        131072,          131072
##UNITS=     HZ,            ARBITRARY UNITS, ARBITRARY UNITS
##FACTOR=    0.0627417313425164, 1,          1
##FIRST=     8223.62146879497, -641,         -57756
##LAST=      0,             810,             -58910
##MIN=       0,             -12278,          0
##MAX=       8223.62146879497, 399002536,    0
$$ Real data points
##PAGE= N=1
##DATA TABLE= (X++(R..R)), XYDATA
$$ [...]
63912C081310k10562k04569j95866j85066j73313j61186j48454j35043j21523
63903A545728j08410r5705q3506p2482o3209n5470m8681m2615l7300l2604k8456
63892H77290k5157k2956k1505k0205j8848j7489j5973j4134j2248j0657r128p126
63880F81864m663k216P9K495M940O832P965Q907J0305J2323J4918J8029K1141
63867G82919K3314K4169K4477K5310K6835K8390K9460L0039L0187K9705K8324
63856A083129K5984K2939J9674J6566J3445R774N394P89l581p792j2006j5948
63844A158367j9414k2844k6692l0468l3128l4430l5193l6121l7088l7719l8028
63833H07242l8025l7310l5607l3387l1427k9878k8182k5945k3516k1570k0287
$$ plain form
63912 3081310 2870748 2666179 2470313 2285247 2111934 1950748 1802294 1667251 1545728
63903 1545728 1437318 1341613 1258107 1185625 1122416 1066946 1018265 975650 938350 905746 877290
63892 877290 852133 829177 807672 787467 768619 751130 735157 721023 708775 698118 688990 681864
63880 681864 677201 674985 675064 677559 682499 689331 697296 706203 716508 728831 743749 761778 782919
63867 782919 806233 830402 854879 880189 907024 935414 964874 994913 1025100 1054805 1083129
63856 1083129 1109113 1132052 1151726 1168292 1181737 1191511 1196905 1197694 1194113 1186321 1174315 1158367
63844 1158367 1138953 1116109 1089417 1058949 1025821 991391 956198 920077 882989 845270 807242
63833 807242 769217 731907 696300 662913 631486 601608 573426 547481 523965 502395 482108
63822D82108j9137j7562j5716j4371j3899j3703j2897j1369r782q680q041p656
63810C29295p379o893n807m241k923k400k486k710k920l129l164k831k283j861
63796B78268j716j850k282k940l539l804l711l398l037k888l112l386l083k148
63782B37374j293j059j107q97o03p14j102j196q69n17l26j20J26K18K49N41J044
63765B29749J290J032M56k15q27j043o36m6km54o07j87J37j06l80n3N75P99O14
63746B30096N75Q64J195J463J845K284K464K326K148K069J876J434J009J021J614
63731B54283K467K969K703J911J345J472K106K913L957N303O408O500N523M231
63717C04091L314K853K612K319J646M40q08j254p53j62k78q63j205j259j534k018
$$ plain form
63822 482108 462971 445409 429693 415322 401423 387720 374823 363454 353672 344992 336951 329295
63810 329295 321916 315023 309216 304975 302052 299652 297166 294456 291536 288407 285243 282412 280129 278268
63796 278268 276552 274702 272420 269480 265941 262137 258426 255028 251991 249103 245991 242605 239522 237374
63782 237374 236081 235022 233915 233018 232415 231701 230599 229403 228534 228017 227691 227571 227697 227915 228164 228705 229749
63765 229749 231039 232071 232527 232312 231485 230442 229806 229760 229758 229304 228697 228510 228647 228541 228161 228108 228683 229482 230096
63746 230096 230671 231535 232730 234193 236038 238322 240786 243112 245260 247329 249205 250639 251648 252669 254283
63731 254283 256750 259719 262422 264333 265678 267150 269256 272169 276126 281429 287837 294337 299860 304091
63717 304091 307405 310258 312870 315189 316835 317275 316467 315213 314460 314298 314020 313157 311952 310693 309159 307141
63701C07141j964r85K46P62M42l2j56j2J74N01J130J907K495K752K801K817K907
63684C22926L118L393L520L295K707J915J071L47q8k25l39o23q06m23M57J166
63668C41411J214Q82P17P92P36M04K7l06r54k207l665m491m291l587l265l650
63652C19767m289m545m228l599k955k391j839j244o72l24l24m49k42N07J477K207
63636B96857K566K704K746K764K898L194L475L651L965M606N293N701O126P073
63622C53619Q368R291R709J0280J1389J2637J3723J5078J7067J9184K0741K1879
63610E22965K3202K4702K5879K6751K7908K9527L0913L1194K9941K7087K2763
63599H22832J7497J2120P213K885q06l549n130n828o213o637p203q068r553j1850
$$ plain form
63701 307141 305177 304192 304438 305200 305642 305610 305454 305442 305616 306117 307247 309154 311649 314401 317202 320019 322926
63684 322926 326044 329437 332957 336252 338959 340874 341945 342292 342204 341979 341640 341017 340211 339788 340245 341411
63668 341411 342625 343507 344224 345016 345752 346156 346183 345877 344923 342716 339051 334560 330269 326682 323417 319767
63652 319767 315478 310933 306705 303106 300151 297760 295921 294677 294005 293681 293357 292908 292666 293173 294650 296857
63636 296857 299423 302127 304873 307637 310535 313729 317204 320855 324820 329426 334719 340420 346546 353619
63622 353619 361987 371278 380987 391267 402656 415293 429016 444094 461161 480345 501086 522965
63610 522965 546167 570869 596748 623499 651407 680934 711847 743041 772982 800069 822832
63599 822832 840329 852449 859662 862547 861741 858192 853062 847234 841021 834384 827181 819113 809560 797710
63585G97710j4702j7502j9812k1698k3402k4680k4830k3545k1420j9303j7384
63574E69432j5335j3115j1086r341p451n091k508j66J792L492M923N873O211O121
63560E33751O099O714Q181J0060J1514J2075J2094J2430J3689J5775J8170K0591
63548F81143K3295K6719L0891L5336L9443M2495M3343M0677L4136K4970J5146
63537A037594N972k019q194j1708j2466j1538j0213r016p893p038p085q604j1672
63524I36120j5842k0404k4713k8475l1617l3905l4930l4608l3422l1937l0202
63513F16065k7929k5172k2522k0509j9051j7656j6066j4470j3022j1487r587p570
63501D11024o109n550n549n548n268m612l552k384j709j698j714j152m21l96j038
$$ plain form
63585 797710 783008 765506 745694 723996 700594 675914 651084 627539 606119 586816 569432
63574 569432 554097 540982 529896 520555 513104 508013 505505 505339 507131 510623 515546 521419 527630 533751
63560 533751 539850 546564 554745 564805 576319 588394 600488 612918 626607 642382 660552 681143
63548 681143 704438 731157 762048 797384 836827 879322 922665 963342 997478 1022448 1037594
63537 1037594 1043566 1041547 1033353 1021645 1009179 997641 987428 978412 970519 963481 956396 947792 936120
63524 936120 920278 899874 875161 846686 815069 781164 746234 711626 678204 646267 616065
63513 616065 588136 562964 540442 519933 500882 483226 467160 452690 439668 428181 418594 411024
63501 411024 404915 399365 393816 388268 383000 378388 374836 372452 370743 369045 367331 366179 365758 365362 364324
63486C64324j296m92Q33J742J952J839J867K299L127L923M149L850L693M047M410
63471D00267M061K941J482n9j638l064m097m797n349n600n185m068k624j274l36
63456C70660n0l57p24o10j26K49N42J366L003M854O046O312O066N949O488P869
63440D17537R658J1047J1812J2892J5538J9836K4518K8402L1478L4186L5913L4965
63428F87782L0321K3017J5425R319N057K432J617K866N743R286J2994J7186K2145
63415H45190K7224L1139L3071L3217L2175L0073K6475K1031J4148O977Q18l606
63403A097932o386q041q891r021q790r023j0404j2881j6041j9826k4307k8801
63391I35520l2057l3586l4164l4551l4367l2875l0364k7829k5546k2959j9956
$$ plain form
63486 364324 363028 362536 363369 365111 367063 368902 370769 373068 376195 380118 384267 388117 391810 395857 400267
63471 400267 404328 407269 408751 408692 407054 403990 399893 395096 389747 384147 378962 374894 372270 370996 370660
63456 370660 370610 370253 369529 368919 368793 369042 369584 370950 373953 378807 384853 391165 397231 403180 409668 417537
63440 417537 427195 438242 450054 462946 478484 498320 522838 551240 582718 616904 652817 687782
63428 687782 718103 741120 756545 765864 770921 773353 774970 777836 783579 792865 805859 823045 845190
63415 845190 872414 903553 936624 969841 1002016 1032089 1058564 1079595 1093743 1100720 1101538 1097932
63403 1097932 1091546 1083505 1074614 1065593 1056803 1047780 1037376 1024495 1008454 988628 964321 935520
63391 935520 903463 869877 835713 801162 766795 733920 703556 675727 650181 627222 607266
63380F07266j7240j5133j2963j0171p275n097l603k188o94P10K280M507P147R301
63366E56847J0628J1831J3618J5820J7904J9919K2250K4773K6891K8475L0157
63355G79113L2424L4823L6486L7126L6967L5819L2852K7619K0868J3990P817K443
63343A098347k063n315p083p734p978q406r405j1233j3990j7589k1771k6064k9776
63330I29940l2306l3498l3552l2604l0743k8318k5807k3251k0226j6465j2227
63319F40943p943m033j302r60l649q568j3926j8193k0721k1501k0812j9153j7131
63306D83051j5229j3648j2213j0528q476o681o014o446o786o016m516l525l589
63293C79384m058m023l269k301j751j852k252k437k349k391k608k380j373l69
$$ plain form
63380 607266 590026 574893 561930 551759 544484 539387 535784 533596 532902 533612 535892 540399 547546 556847
63366 556847 567475 579306 592924 608744 626648 646567 668817 693590 720481 748956 779113
63355 779113 811537 846360 882846 919972 956939 992758 1025610 1053229 1074097 1088087 1095904 1098347
63343 1098347 1096284 1090969 1083886 1076152 1068174 1059768 1050363 1039130 1025140 1007551 985780 959716 929940
63330 929940 897634 864136 830584 797980 767237 738919 713112 689861 669635 653170 640943
63319 640943 633000 628967 627665 626705 623056 614488 600562 582369 561648 540147 519335 500182 483051
63306 483051 467822 454174 441961 431433 422957 416276 410262 403816 397030 391014 386498 382973 379384
63293 379384 375326 371303 368034 365733 363982 362130 359878 357441 355092 352701 350093 347713 346340 345971
63279C45971l96j260j713j130k78j89r10j696j934j535p55K5N45Q92J297J679
63263C38613J678J311J073J248J499J449J334J676K551L467L925L822L502L457
63249C70605L866M346M429M325M732N750O558O568O387P013Q482J0047J1409J2867
63235D67384J4358J5186J5143J5065J5864J7389J8774J9476J9580J9359J9052
63224F56630J8912J9033J9160J9065J9028J9517K0528K1554K2241K2542K2242
63213H80452K0890J8455J5600J2874R991O241J468l736q647j2871j6291j8932
63201I05494k0905k2236k2802k2599k1924k0929j9207j6344j2782r529o876m078
63189G05283o01K986N879Q270J0980J4078J6741J8472J9794K1415K3294K4859
$$ plain form
63279 345971 345575 344315 342602 341472 341194 341005 340095 338399 336465 334930 334175 334200 334745 335637 336934 338613
63263 338613 340291 341602 342675 343923 345422 346871 348205 349881 352432 355899 359824 363646 367148 370605
63249 370605 374471 378817 383246 387571 392303 398053 404611 411179 417566 424579 433061 443108 454517 467384
63235 467384 481742 496928 512071 527136 543000 560389 579163 598639 618219 637578 656630
63224 656630 675542 694575 713735 732800 751828 771345 791873 813427 835668 858210 880452
63213 880452 901342 919797 935397 948271 958262 964503 965971 962235 953588 940717 924426 905494
63201 905494 884589 862353 839551 816952 795028 774099 754892 738548 725766 716237 709361 705283
63189 705283 704682 707668 713547 721817 732797 746875 763616 782088 801882 823297 846591 871450
63177H71450K5837K6439K6953K7387K7528K7156K6322K5397K4655K3728K1801
63166A154653J8534J4529J0514O401J537m287j0583j6849k2968k8745l3635l7246
63154A051855l9684m1142m1542m0980m0054l9126l7625l4812l1137k7913k5580
63143F52260k3207k0090j6994j5115j4414j3750j2378j0567q901p644o730n833
63131D96637m547k934j690j330j427j238p28j80Q19K793M926N533M345L104L209
63116E07292L965M070L755M143N118N287M051K512K037K684L416L320K353J246
63102E55249Q59J373K111K260J692Q37N7n09p48o25l21N3O03J161J077O5j051
63085E64143j170k90O74J211J538J737J519J056J127K099L411M433N203N943O501
$$ plain form
63177 871450 897287 923726 950679 978066 1005594 1032750 1059072 1084469 1109124 1132852 1154653
63166 1154653 1173187 1187716 1198230 1204631 1206168 1201881 1191298 1174449 1151481 1122736 1089101 1051855
63154 1051855 1012171 971029 929487 888507 848453 809327 771702 736890 705753 677840 652260
63143 652260 629053 608963 591969 576854 562440 548690 536312 525745 516844 509200 502470 496637
63131 496637 492090 489156 487466 486136 484709 483471 482743 482563 483382 486175 491101 496634 500979 504083 507292
63116 507292 511257 515327 519082 523225 528343 533630 537681 540193 542230 544914 548330 551650 554003 555249
63102 555249 556108 557481 559592 561852 563544 564381 564438 563929 563181 562556 562235 562288 562891 564052 565129 565194 564143
63085 564143 562973 562683 563357 564568 566106 567843 569362 570418 571545 573644 577055 581488 586691 592634 599135
63070E99135O706O797P116P681Q424R401J0549J1592J2556J3935J5994J8277K0215
63057G48378K1855K3614K5622K7766L0102L2748L5531L8140M0561M3030M5560
63046A112907M7786M9220M9576M9022M8230M7917M8160M8397M8216M7922M8079
63035A645432M8797M9669N0151M9772M8203M5424M1538L6333K9400K0871J1597
63024B077187K213p478j7766k8068l7296m4908n0926n5197n7312n7269n5591n2668
63012A614921m8490m3085l6809l0071k3177j6456j0102l888K579R236J5595K1441
63000A451694K6929L1964L6074L9197M1930M4673M6993M8331M8898M9299M9650
62989A915632M9668M9410M9110M8338M6026M1584L5453K8324K0308J1205J064
$$ plain form
63070 599135 605841 612638 619754 627435 635859 645260 655809 667401 679957 693892 709886 728163 748378
63057 748378 770233 793847 819469 847235 877337 910085 945616 983756 1024317 1067347 1112907
63046 1112907 1160693 1209913 1259489 1308511 1356741 1404658 1452818 1501215 1549431 1597353 1645432
63035 1645432 1694229 1743898 1794049 1843821 1892024 1937448 1978986 2015319 2044719 2065590 2077187
63024 2077187 2079400 2071922 2054156 2026088 1988792 1943884 1892958 1837761 1780449 1723180 1667589 1614921
63012 1614921 1566431 1523346 1486537 1456466 1433289 1416833 1406731 1402843 1405422 1414658 1430253 1451694
63000 1451694 1478623 1510587 1546661 1585858 1627788 1672461 1719454 1767785 1816683 1865982 1915632
62989 1915632 1965300 2014710 2063820 2112158 2158184 2199768 2235221 2263545 2283853 2295058 2296122
62978B296122r908k1613l3671m5057n4727o2580o9282p5050p9202q1028q0672
62967A683332p8882p6229p2871o8829o4159n9027n3848m9187m5281m1813l8328
62956A034878l4715l1216k8180k6028k5009k4726k4214k2957k1545k0788k0551
62945G54949k0017j8909j7661j6444j4932j3222j2115j1990j2100j1495j0257
62934E95807r169q520p900o991n951m993m098l261k682k514k567k442j956j387
62920E31376j255j717k274k284j753j328j453j890k242k557l050l503l438k841
62906D99791k327k446l045l462l233k555k021j885j769j163j84N11N19J12k29
62891D76614l47k86j1M74R14J021P59L32j9q0J76M31L08o5j42K16M01r5r31j420
$$ plain form
62978 2296122 2286214 2264601 2230930 2185873 2131146 2068566 1999284 1924234 1845032 1764004 1683332
62967 1683332 1604450 1528221 1455350 1386521 1322362 1263335 1209487 1160300 1115019 1073206 1034878
62956 1034878 1000163 968947 940767 914739 889730 865004 840790 817833 796288 775500 754949
62945 754949 734932 716023 698362 681918 666986 653764 641649 629659 617559 606064 595807
62934 595807 586638 578118 570218 563227 557276 552283 548185 544924 542242 539728 537161 534719 532763 531376
62920 531376 530121 528404 526130 523846 522093 520765 519312 517422 515180 512623 509573 506070 502632 499791
62906 499791 497464 495018 491973 488511 485278 482723 480702 478817 477048 475885 475701 476212 476731 476843 476614
62891 476614 476267 475981 475970 476444 477358 478379 479138 479470 479451 479371 479547 479978 480286 480221 480079 480295 480696 480601 479670 478250
62871D78250j440j309j084n62Q7K51l65j372k099k192j739j095n27M3Q71J773
62855D67491K056J362L25j03K09N60M55Q6j02J28P71J570J962J562O62j07o10
62838D78277j170j745j778j086k81J7j30l35m86n94m34J18O92Q21O71Q70J661
62821D75088K541K883K602K160K041K322K729K989L106L271L574L926M232M462
62807E17926M596M658M806N165N598N825N852N969O343O885P530Q302Q990R250
62793F07695R274R896J1633J3845J5459J6391J7757K0561K4647K9114L3347L7359
62781H46978M1368M5536N0078N5244O0960O6634P1502P5145P7494P8441P7683
62770A547063P5013P0473O4084N5654M5164L3195K0706Q344l787j5736k7380l8453
$$ plain form
62871 478250 476810 475501 474417 473855 473942 474193 473828 472456 470357 468165 466426 465331 464804 464847 465718 467491
62855 467491 469547 470909 471234 471131 471340 471900 472355 472441 472339 472467 473238 474808 476770 478332 478994 478887 478277
62838 478277 477107 475362 473584 472498 472217 472234 472104 471769 471283 470689 470255 470373 471065 471886 472557 473427 475088
62821 475088 477629 480512 483114 485274 487315 489637 492366 495355 498461 501732 505306 509232 513464 517926
62807 517926 522522 527180 531986 537151 542749 548574 554426 560395 566738 573623 581153 589455 598445 607695
62793 607695 616969 626865 638498 652343 667802 684193 701950 722511 747158 776272 809619 846978
62781 846978 888346 933882 983960 1039204 1100164 1166798 1238300 1313445 1390939 1469380 1547063
62770 1547063 1622076 1692549 1756633 1812287 1857451 1890646 1911352 1919696 1915909 1900173 1872793 1834340
62758A834340m8596n7211o3647o7687o9759p0476p0141o8820o6669o3979o1003
62747A126352n7830n4388n0478m6067m1599l7794l4940l2598l0178k7534k4776
62736F88170k1820j8585j5516j3313j2043j0975r471p662o088m925l886k676j306
62723E59904p9O68R20J255K420M434O395P565Q376R836J2119J4326J5830J7215
62709F61184J9504K2806K6252K9143L1801L5218M0022M5830N1595N6703O1607
62698A081665O7070P2875P7923Q1780Q5419Q9749R3974R6217R5550R2455Q7368
62687B022045P9762O9107N5828M0794K4414O922j0866k7705m2832n6281o8334
62676B092854p8828q6982r1924r3562r2959r1392q9099q5529q0845p6221p2237
$$ plain form
62758 1834340 1785744 1728533 1664886 1597199 1527440 1456964 1386823 1318003 1251334 1187355 1126352
62747 1126352 1068522 1014134 963656 917589 875990 838196 803256 770658 740480 712946 688170
62736 688170 666350 647765 632249 618936 606893 595918 586447 578785 572697 567772 563886 561210 559904
62723 559904 559825 560493 561413 562668 565088 569522 575917 583482 591858 601694 613813 628139 643969 661184
62709 661184 680688 703494 729746 758889 790690 825908 865930 911760 963355 1020058 1081665
62698 1081665 1148735 1221610 1299533 1381313 1466732 1556481 1650455 1746672 1842222 1934677 2022045
62687 2022045 2101807 2170914 2226742 2267536 2291950 2298872 2288006 2260301 2217469 2161188 2092854
62676 2092854 2014026 1927044 1835120 1741558 1648599 1557207 1468108 1382579 1301734 1225513 1153276
62665A153276o7899o2146n5610m9919m5629m1980l8412l5116l2060k8688k4946
62654F70871k1645j9347j7641j5991j4601j3834j3435j2897j2142j1260j0057
62643E08021q482p099o464o222n539m307l215k670k323j767j157q52q75r85j012
62628D55052q91o49n28q68j580k022j682q39j83J08M84J168J707J681J481J852
62612D54291K817L641L954M338N437O907P850Q024Q086Q633R551J0521J1673J3392
62598E59115J5683J8118K0347K2421K4579K6882K9154L1223L3156L5096L6827
62587H52601L7611L6766L4261L0521K5739J9793J2895N796r27p374j3709j9363
62575A014610k3465k5941k7665k9443l1298l2835l3738l3699l2331k9673k6552
$$ plain form
62665 1153276 1085377 1023231 967621 917702 872073 830093 791681 756565 724505 695817 670871
62654 670871 649226 629879 612238 596247 581646 567812 554377 541480 529338 518078 508021
62643 508021 499539 492440 485976 479754 474215 469908 466693 464023 461700 459933 458776 457924 457049 456064 455052
62628 455052 454161 453512 452984 452116 450536 448514 446832 445993 445810 445918 446402 447570 449277 450958 452439 454291
62612 454291 457108 460749 464703 469041 474478 481385 489235 497259 505345 513978 523529 534050 545723 559115
62598 559115 574798 592916 613263 635684 660263 687145 716299 747522 780678 815774 852601
62587 852601 890212 926978 961239 991760 1017499 1037292 1050187 1055983 1055056 1047682 1033973 1014610
62575 1014610 991145 965204 937539 908096 876798 843963 810225 776526 744195 714522 687970
62564F87970k3953k2122k0681j9425j8504j7777j6610j4593j2021r508p445o118
62552D99213n818o329o704o167n047m236l900l372k295j069o5Q87J907K627K788
62537D62420K733K858K970K654K015J573J688K409L620M959N911O380O961Q255
62523E17406J0235J2549J5073J7715K0161K2399K5093K8766L2905L6569L9639
62512G78510M2716M6014M9141N1837N4049N5296N4843N2570M8922M3956L7375
62501A315229K9524K1366J3184M402m896j3313j9692k4472k8597l1768l2845l1606
62489A196516k9057k6078k2604j8304j3363q278l235K003P702J3666J9140K3356
62477A141464K6225K8219K9449K9252K6938K2617J6968J0589L891k760r392j6612
$$ plain form
62564 687970 664017 641895 621214 601789 583285 565508 548898 534305 522284 512776 505331 499213
62552 499213 493395 487066 480362 474195 469148 464912 461012 457640 455345 454276 454211 455098 457005 459632 462420
62537 462420 465153 468011 470981 473635 475650 477223 478911 481320 484940 489899 495810 502190 509151 517406
62523 517406 527641 540190 555263 572978 593139 615538 640631 669397 702302 738871 778510
62512 778510 821226 867240 916381 968218 1022267 1077563 1132406 1184976 1233898 1277854 1315229
62501 1315229 1344753 1366119 1379303 1383705 1378809 1365496 1345804 1321332 1292735 1260967 1228122 1196516
62489 1196516 1167459 1141381 1118777 1100473 1087110 1078832 1075597 1077600 1085302 1098968 1118108 1141464
62477 1141464 1167689 1195908 1225357 1254609 1281547 1304164 1321132 1331721 1335612 1332852 1323460 1306848
62465A306848k4811l3208m0252m4997m7661m8911m9171m8707m7845m6697m4932
62454H29656m2145l8400l4270l0331k6721k3161j9440j5781j2658j0245q286o558
62442E61660n187m255l337j840K47K234L423L751L671L592L448K763J162j121
62428E70211l299m740n561o377p531q750r515r568r001q056p043o415o581p403
62414D70371p995p461n917m458l869l758l330k662k501k946l112k345j174n95
62400D18248q35j220j015j19R38J441J225J041J842L450M521M160L155K879L400
62385D43111L526K750K108K667L904M422L928L617M527O289P941R238J0471J1437
62371E19936J1567J1086J1001J1679J2437J2983J4290J7049K0160K2017K2900
$$ plain form
62465 1306848 1282037 1248829 1208577 1163580 1115919 1067008 1017837 969130 921285 874588 829656
62454 829656 787511 749111 714841 684510 657789 634628 615188 599407 586749 576504 568218 561660
62442 561660 556473 552218 548881 547041 547288 549522 552945 556696 560367 563959 567407 570170 571332 570211
62428 570211 566912 562172 556611 550234 542703 533953 524438 514870 505869 497813 490770 484355 477774 470371
62414 470371 462376 454915 448998 444540 440671 436913 433583 430921 428420 425474 422362 420017 418843 418248
62400 418248 417413 416193 415178 415059 415997 417438 418663 419704 421546 424996 429517 433677 436832 439711 443111
62385 443111 446637 449387 451495 454162 458066 462488 466416 470033 474560 480849 488790 498028 508499 519936
62371 519936 531503 542589 553590 565269 577706 590689 604979 622028 642188 664205 687105
62360F87105K4662K8128L2235L5981L9814M4374M9016N2498N4496N5528N5743
62349A159580N4523N1125M5327L7608K9058K0752J2961N277k440r699j6119k1867
62337A366086k7143l1835l5945l9609m2409m3439m2497m0401l7772l4429l0499
62326I60108k7042k4688k2667k0225j8140j7628j8435j9323j9894k0587k1232
62315G30247k1097k0256j9624j9495j9204j8305j7030j5546j3830j2303j1474
62304E42083j0926r765q142p091o701n840m084k540k050j833q92K89N16k64r27
62289D81833o26N60K098L424M078M069L963M141M301M086L817M058M711N214N395
62274E35122N635O150O677O875O781O870P788R801J2358J4414J5520J6357J7903
$$ plain form
62360 687105 711767 739895 772130 808111 847925 892299 941315 993813 1048309 1103837 1159580
62349 1159580 1214103 1265228 1310555 1348163 1377221 1397973 1410934 1416211 1413771 1404072 1387953 1366086
62337 1366086 1338943 1307108 1271163 1231554 1189145 1145706 1103209 1062808 1025036 990607 960108
62326 960108 933066 908378 885711 865486 847346 829718 811283 791960 772066 751479 730247
62315 730247 709150 688894 669270 649775 630571 612266 595236 579690 565860 553557 542083
62304 542083 531157 521392 513250 506159 499458 493618 489534 486994 484944 483111 482219 482508 483024 482760 481833
62289 481833 481207 481767 483865 487289 491367 495436 499399 503540 507841 511927 515744 519802 524513 529727 535122
62274 535122 540757 546907 553584 560459 567240 574110 581898 591699 604057 618471 633991 650348 668251
62261F68251K0329K3122K6038K9452L3747L8776M4059M9189N3853N7546N9558
62250A103920N9444N7502N4495N0700M5430L7855K8278J8214R120J327n782j2977
62238A447526k0676k8754l6595m3488m9127n3538n6474n7388n6170n3586n0642
62227I41088m7770m4859m1744l8301l4342k9903k5578k2165j9822j7882j5683
62216F03039j3408j1838j1256j0906r814q004o428n683n260m410l248k439k134
62203E08211j798j063j09P68J529K309L372N098P493R786J1112J1590J2189J3385
62189E83872J4609J5184J5202J5212J5539J6149J6732J6730J5721J4017J2393
62178G51360J1078R529P450N369L874K907K259K296L502N718Q386J1367J4965
$$ plain form
62261 668251 688580 711702 737740 767192 800939 839715 883774 932963 986816 1044362 1103920
62250 1103920 1163364 1220866 1275361 1326061 1371491 1409346 1437624 1455838 1464958 1466285 1460503 1447526
62238 1447526 1426850 1398096 1361501 1318013 1268886 1215348 1158874 1101486 1045316 991730 941088
62227 941088 893318 848459 806715 768414 734072 704169 678591 656426 636604 618722 603039
62216 603039 589631 577793 566537 555631 545817 537813 531385 525702 520442 516032 512784 510345 508211
62203 508211 506413 505350 505241 506009 507538 509847 513219 518317 525810 535596 546708 558298 570487 583872
62189 583872 598481 613665 628867 644079 659618 675767 692499 709229 724950 738967 751360
62178 751360 762438 771967 779417 784786 788660 791567 793826 796122 799624 805342 813728 825095 840060
62165H40060J9283K4026K8775L3175L6847L9454M0763M0470L8225L4065K8561
62154A203704K2299J5483Q340J591m006q472j2550j6900k1574k6196l0280l3400
62142A098039l5340l6162l6014l4903l2787k9839k6435k2882j9253j5540j2005
62131G96879r233p686p099o614n730m822m370l995k827o98J667L659N263O535
62117G60929P306P673Q029Q229P350M847J517j188k584l045l195l223l050k840
62103G86755l164m509o540q167q677q428p917o711m222j249O40J336K392M544
62089G36083O483O952O763P492R121J0350J0723J1002J1688J2466J3186J4265
62077H56574J5881J7589J9017K0305K1688K3127K4452K5437K5740K5198K4244
$$ plain form
62165 840060 859343 883369 912144 945319 982166 1021620 1062383 1102853 1141078 1175143 1203704
62154 1203704 1226003 1241486 1249826 1251417 1247411 1238939 1226389 1209489 1187915 1161719 1131439 1098039
62142 1098039 1062699 1026537 990523 955620 922833 892994 866559 843677 824424 808884 796879
62131 796879 787646 779960 772861 766247 760517 755695 751325 747330 744503 743805 745472 749131 754394 760929
62117 760929 768235 775908 783937 792166 799516 804363 805880 804692 802108 799063 795868 792645 789595 786755
62103 786755 783591 779082 772542 764375 755698 747270 739353 732642 728420 727171 727811 729147 731539 736083
62089 736083 742566 749518 756281 763773 772894 783244 793967 804969 816657 829123 842309 856574
62077 856574 872455 890044 909061 929366 951054 974181 998633 1024070 1049810 1075008 1099252
62066A099252K3641K3775K4472K5372K6171K6714K7066K7351K7200K5807K2844
62055A379665J8897J4648J0165N503J329j935n061r176j4196j9028k3158k7037
62043A330616l0978l4676l7847m0474m2234m2579m1644m0399l9530l8747l7382
62032I04126l5214l2532k9813k7454k5427k3201k0498j7971j6575j6324j6312
62021F42805j5863j4950j3621j1909j0358r657r553r040p933p241p526p866p217
62008E10071n976n309n383n186l940j889K21J869K906L404L512L296K825K422
61994E02843K524L026L135K214N73r35j901k540l120l649m150m828n773o754p444
61979D73221p734p734p499o936o042n148m664m547m271l477k465j746j359r65
$$ plain form
62066 1099252 1122893 1146668 1171140 1196512 1222683 1249397 1276463 1303814 1331014 1356821 1379665
62055 1379665 1398562 1413210 1423375 1428878 1430207 1428272 1423211 1414035 1399839 1380811 1357653 1330616
62043 1330616 1299638 1264962 1227115 1186641 1144407 1101828 1060184 1019785 980255 941508 904126
62032 904126 868912 836380 806567 779113 753686 730485 709987 692016 675441 659117 642805
62021 642805 626942 611992 598371 586462 576104 566447 556894 547854 539921 532680 525154 517288 510071
62008 510071 504095 498786 493403 488217 484277 482388 482609 484478 487384 490788 494300 497596 500421 502843
61994 502843 505367 508393 511528 513742 514315 513380 511479 508939 505819 502170 498020 493192 487419 480665 473221
61979 473221 465487 457753 450254 443318 437276 432128 427464 422917 418646 415169 412704 410958 409599 408634
61965D08634m81j59q7p1l3j03k12j2O08J289J720K073K710L584M226M314M116
61948D32116M310N249O503P290P437P543Q071Q725R154R723J0917J2311J2948
61935E42297J2713J2482J2839J3335J3245J2430J1227J0027R208Q904Q631P642
61923F74980N910M185K878J455o34l030m937o068o619o623n862m244j914Q03L393
61908F53673N372O833Q423J0439J2241J2938J2403J1222R899Q461O664M219J021
61895G63808k515n575p633q871r632r852r507r194r656j0762j1558j1403j0548
61882F47102r586q847q477q597r123r637r832r831r860r722q974p668o570o344
61868E24034o636o359m963l117j852j265n51Q01K371L563M504N792P623R542J1020
$$ plain form
61965 408634 408153 407994 407907 407836 407803 407700 407488 407476 408084 409373 411093 413166 415876 419460 423686 428000 432116
61948 432116 436426 441675 448178 455468 462905 470448 478519 487244 496398 506121 517038 529349 542297
61935 542297 555010 567492 580331 593666 606911 619341 630568 640595 649803 658707 667338 674980
61923 674980 680890 685075 687953 689408 688774 685744 680807 674739 668120 661497 655635 651391 649477 650280 653673
61908 653673 659045 665878 674301 684740 696981 709919 722322 733544 743443 751904 758568 762787 763808
61895 763808 761293 755718 748085 739214 729582 719730 710223 701029 691373 680611 669053 657650 647102
61882 647102 637516 628669 620192 611595 602472 592835 583003 573172 563312 553590 544616 536948 530378 524034
61868 524034 517398 511039 506076 502959 501107 499842 499291 500092 502463 506026 510530 516322 523945 533487 544507
61853E44507J2025J2996J4422J6459J8795K0886K2395K3368K4028K4449K4457
61842G58787K3703K1834J8811J5062J1216P618M259J134j609l964o084p787q387
61829H34593p378n158k672l55K156N144Q091J0136J1124J1638J1948J1358R046
61816H99671N241J034k884o693j0574j4068j6676j8551k0063k1088k1275k0773
61804G53301k0115j9552j8954j8212j7230j5782j3913j2239j1233j0464r292q021
61792E78294p502p671p516o589n587n146m983m630m174l806l326k639k131k102
61778E10492k324k516k690k709k273j699j899k922l460k555j050l34l09J83J304
61763D85239J960J550Q50P80J297J797J958J844J612J471J519J506J179Q17R56
$$ plain form
61853 544507 556532 569528 583950 600409 619204 640090 662485 685853 709881 734330 758787
61842 758787 782490 804324 823135 838197 849413 857031 861290 862424 860815 856851 850767 842980 834593
61829 834593 827215 822057 819385 819030 821186 826330 834421 844557 855681 867319 879267 890625 899671
61816 899671 904912 905946 903062 896369 885795 871727 855051 836500 816437 795349 774074 753301
61804 753301 733186 713634 694680 676468 659238 643456 629543 617304 606071 595607 586315 578294
61792 578294 570792 563121 555605 549016 543429 538283 533300 528670 524496 520690 517364 514725 512594 510492
61778 510492 508168 505652 502962 500253 497980 496281 494382 491460 488000 485445 484395 484061 483752 483935 485239
61763 485239 487199 488749 489599 490379 491676 493473 495431 497275 498887 500358 501877 503383 504562 505379 506335
61748E06335J430J327J56j356k058j641q12m34p78j503k082k268k194k115k078
61733D89929j968j805j733j699j440q81l10L6L84J135K193K867K682K067J951
61718D93408K571L152K904K038J317R11L60l89o88k34K60k9r44j612j582j150
61702E00293p52n62o29r73j501k049k519k824k805k470k116k007k064k088k123
61687D72811k349k749l126l331l256k806k084j462j178j107j086j252j715k144
61673D43166k132j783j565j658j777j633j240q00n28n83q93j172j209j060p92
61658D24341l35J84L37k4l33l5M68K48p73j515j065J99J176J423J446J736K016
61641D29494J768J233J327K385L455L363K173R87L68k02j158k021k199j956j937
$$ plain form
61748 506335 507765 509092 509248 507892 505834 504193 503381 502947 502169 500666 498584 496316 494122 492007 489929
61733 489929 487961 486156 484423 482724 481284 480403 480093 480129 480513 481648 483841 486708 489390 491457 493408
61718 493408 495979 499131 502035 504073 505390 506301 506661 506272 505584 505350 505610 505581 504637 503025 501443 500293
61702 500293 499541 498979 498350 497377 495876 493827 491308 488484 485679 483209 481093 479086 477022 474934 472811
61687 472811 470462 467713 464587 461256 458000 455194 453110 451648 450470 449363 448277 447025 445310 443166
61673 443166 441034 439251 437686 436028 434251 432618 431378 430578 430050 429467 428574 427402 426193 425133 424341
61658 424341 424006 424190 424527 424503 424170 424135 424603 424851 424078 422563 421498 421697 422873 424296 425742 427478 429494
61641 429494 431262 432495 433822 436207 439662 443025 445198 446185 446553 446351 445193 443172 440973 439017 437080
61626D37080k198k411k600k989l342l180k567k069j940j906j692j330j003j016
61612D06837j756l101m124m003l140k728l186l748l744l531l816m563n070m825
61598C55502m014l231k895k841k545j872j410j733k455k540j582k85L87J64o30
61583C28020j663k729l550l745l115j895p19j79l29p67j279j982k697k713j713
61568B98945m78J4p6J32P38R27L96q9Q1M69N02M75R50J651J751J050K19p6J72
61549C07753N62P24M99O8p9M37J358J900J527N37k17j29O63J541K034K064J774
61532C23016J314R06P62P86O06J49j07J72M54j56j657k957l097k243j243n91j96
61515C15918J1k12r53j678j608o77K54L92M0J52Q86J258N22p10j258q84l53k94
$$ plain form
61626 437080 434882 432471 429871 426882 423540 420360 417793 415724 413784 411878 410186 408856 407853 406837
61612 406837 405081 401980 397856 393853 390713 387985 384799 381051 377307 373776 369960 365397 360327 355502
61598 355502 351488 348257 345362 342521 339976 338104 336694 334961 332506 329966 328384 328099 328486 328650 328020
61583 328020 326357 323628 320078 316333 313218 311323 310604 310425 310096 309329 308050 306068 303371 300658 298945
61568 298945 298467 298481 298405 298537 299275 300202 300598 300509 300590 301059 301561 302036 302986 304637 306388 307438 307657 307581 307753
61549 307753 308315 309039 309538 309606 309527 309964 311322 313222 314749 315286 315069 314940 315603 317144 319178 321242 323016
61532 323016 324330 325236 325998 326784 327390 327539 327432 327604 328058 327902 326245 323288 320191 317948 316705 316114 315918
61515 315918 315929 315717 314764 313086 311478 310801 311055 311447 311487 311639 312525 313783 314305 313595 312337 311453 311100 310806
61497C10806n77q06p79m66kK58J28k3K85Q41R22L11m21p32p14p51r50j082q12
61478C05436Q4J413K496K764K414K088J977J760J324R18N53p9q55j096n02L58
61462C21053Q33R48J011R55N88J04j34j14o4k4J08K87M12N50P90J034J175J302
61444C30814J472J453J055N61M84R22J438J649J667J831K205K470K351J981J707
61429C54060J583J340Q95O03P28R39P69L48K48P06J411K073K667L058K948K315
61413C76691J522Q06J02m80m89J57Q25Q43K97k67o48j049j457j516j064m84l40
61396C73449p80j433j758j492p79r3Q8l31q52p52J31J124J446J133Q56R46J105
61379C72008J101J152J387J563J598J754J942J567N83o2K66Q92R81R32J521K239
$$ plain form
61497 310806 310229 309423 308644 308178 308176 308434 308562 308539 308824 309665 310587 310898 310477 309745 309031 308280 307330 306248 305436
61478 305436 305520 306933 309429 312193 314607 316695 318672 320432 321756 322674 323227 323148 322293 321197 320695 321053
61462 321053 321886 322834 323845 324800 325388 325492 325358 325244 325180 325156 325264 325551 325963 326513 327303 328337 329512 330814
61444 330814 332286 333739 334794 335355 335839 336761 338199 339848 341515 343346 345551 348021 350372 352353 354060
61429 354060 355643 356983 357878 358481 359209 360148 360917 361265 361513 362219 363630 365703 368370 371428 374376 376691
61413 376691 378213 379019 379121 378641 378152 378309 379134 379977 380274 380007 379359 378310 376853 375337 374273 373789 373449
61396 373449 372669 371236 369478 367986 367207 367114 367202 366871 366019 365267 365398 366522 367968 369101 369957 370903 372008
61379 372008 373109 374261 375648 377211 378809 380563 382505 384072 384655 384593 384859 385751 386732 387664 389185 391424
61363C91424J951Q53K99O71R89P72Q15J646K587K998L245L718M026M028M562O118
61347D30702P650P873P112O724P027O996N891M197K862K361K614L214L574L326
61333E02123K685K143J818J409P48N4m08o98j084j613j886j442n04nm72j161q70
61316E00837M69J740K233K426L010L958M950O005P174Q154Q810R541J0681J1928
61302E81916J2840J3452J3913J3876J2800J0642P874N022K441L26j412l028m609
61289F66053o071p467q781r516r155q172p662p802p556o319m934m445m630m585
61275E68958m058l411k734j794n72P05J806K399K166J378Q11P43P69Q78J795L579
61259E73418N003N203N035N693O815P180O659O109N737M920L511K070Q72k43j077
$$ plain form
61363 391424 393375 394228 394527 395198 396187 396959 397774 399420 402007 405005 408250 411968 415994 420022 424584 430702
61347 430702 438352 446225 453337 460061 467088 474084 479975 484172 487034 489395 492009 495223 498797 502123
61333 502123 504808 506951 508769 510178 510926 510980 510572 509874 508790 507177 505291 503849 503345 503340 502868 501707 500837
61316 500837 501306 503046 505279 507705 510715 514673 519623 525628 532802 540956 549766 559307 569988 581916
61302 581916 594756 608208 622121 635997 648797 659439 667313 672335 674776 675102 673690 670662 666053
61289 666053 659982 652515 643734 634218 625063 616891 609229 601427 593871 587552 582618 578173 573543 568958
61275 568958 564900 561489 558755 556961 556389 557094 558900 561299 563465 564843 565654 566397 567166 568044 569839 573418
61259 573418 578421 583624 588659 594352 601167 608347 615006 621115 626852 631772 635283 637353 638225 637982 636905
61244F36905j201r31j155k062k899l085k822k530k413k529k626k082p41M36M85
61229F10750n3K40J642L071L885M659N853O912P267P311P693Q292Q522Q279P953
61214F92276P833P899Q023Q127Q169Q119P864P214O147M898L661K521J756J758
61200G76265K345K753K783L250M662O285P428Q848J1555J4749J6518J6378J5511
61187H89330J4533J2720R883P310N991N150L594J529Kp83j513k502l353l846m454
61172I33591n734p528q950r314r094r575j1192j2730j2896j2282j2623j4248j5586
61159G91839j5507j4785j4609j4744j4167j2744j1266j0201r340q383p222n759
61147F53112m059k553j615j093o88o25j395k880m267m896m979n222n886o336n640
$$ plain form
61244 636905 635704 634773 633618 631556 628657 625572 622750 620220 617807 615278 612652 610570 609829 610265 610750
61229 610750 610697 610937 612579 615650 619535 624194 630047 636959 644226 651537 659230 667522 676044 684323 692276
61214 692276 700109 708008 716031 724158 732327 740446 748310 755524 761671 766569 770230 772751 774507 776265
61200 776265 778610 781363 784146 787396 792058 798343 805771 814619 826174 840923 857441 873819 889330
61187 889330 903863 916583 926466 933776 939767 944917 948511 950040 950042 949259 947746 945244 941891 938045 933591
61172 933591 927857 920329 911379 902065 892971 883396 872204 859474 846578 834296 821673 807425 791839
61159 791839 776332 761547 746938 732194 718027 705283 694017 683816 674476 666093 658871 653112
61147 653112 649053 646500 644885 643792 643104 642479 641084 638204 633937 629041 624062 618840 612954 606618 600978
61132F00978l658j380PL60O24J779L992O702R171J0931J2098J3297J5022J7070
61118F86993J8807J9925K0729K1735K3266K5269K7249K8568K9048K9052K8779
61107I59420K7878K6171K4282K2995K2294K1555K0275J8109J4786J0652O795L740
61095A178952N25l956r203j3768j7175j9907k1938k2853k3294k4624k6845k8384
61083I67530k8296k7311k6248k4892k3053k1403k0394j9407j7875j6302j5294
61072G27055j4382j2800j0776r197q308p514o274m674l203k202j426j81J725L482
61058F51325M233M291M563N167N632O199P576R451J0736J1367J2383J3983J5124
61045G62030J5473J6116J7730J9625K1337K3589K6682K9416L0712L1066L1450
$$ plain form
61132 600978 597320 595940 595947 596307 596931 598710 602702 609404 618575 629506 641604 654901 669923 686993
61118 686993 705800 725725 746454 768189 791455 816724 843973 872541 901589 930641 959420
61107 959420 987298 1013469 1037751 1060746 1083040 1104595 1124870 1142979 1157765 1168417 1175212 1178952
61095 1178952 1179477 1175521 1166318 1152550 1135375 1115468 1093530 1070677 1047383 1022759 995914 967530
61083 967530 939234 911923 885675 860783 837730 816327 795933 776526 758651 742349 727055
61072 727055 712673 699873 689097 679900 671592 664078 657804 653130 649927 647725 646299 646118 647843 651325
61058 651325 655558 659849 664412 669579 675211 681410 688986 698437 709173 720540 732923 746906 762030
61045 762030 777503 793619 811349 830974 852311 875900 902582 931998 962710 993776 1025226
61034A025226L2058L3036L5116L8325M1372M3484M5569M8321N0576N1047N0518
61023A494648N0728N2020N3660N5680N8956O4013P1029Q0127R0652J01078J10906
61012B283497J21667J35123J52024J73757K03191K42139K90183L48178M20613
61003D370372N11811O23056P57807R26022J135120J375429J619774J834822J980702
60994A5134915J997804J817540J418092Q79376L64872K6249q4632j7667J39872
60985B1676421L08726M07568L41107M3404m54473j017424j485183j765342j859095
60976A6195709j818896j699212j539858j369424j205767j054523r14677p86362
60968E806990o71568n70572m82119m06177l43527k93204k52634k19758j93175
$$ plain form
61034 1025226 1057284 1090320 1125436 1163761 1205133 1248617 1294186 1342507 1393083 1444130 1494648
61023 1494648 1545376 1597396 1651056 1706736 1765692 1829705 1900734 1980861 2071513 2172591 2283497
61012 2283497 2405164 2540287 2692311 2866068 3069259 3311398 3601581 3949759 4370372
61003 4370372 4882183 5505239 6263046 7189068 8324188 9699617 11319391 13154213 15134915
60994 15134915 17132719 18950259 20368351 21247727 21612599 21638848 21554216 21536549 21676421
60985 21676421 21985147 22392715 22733822 22777226 22322753 21305329 19820146 18054804 16195709
60976 16195709 14376813 12677601 11137743 9768319 8562552 7508029 6593352 5806990
60968 5806990 5135422 4564850 4082731 3676554 3333027 3039823 2787189 2567431 2374256
60959B374256j70948j51200j33523j18242j04748r1906p9688o8945n9956n2313
60949A342787m5959m1311l8456l7076l6691l6410l4939l1767k7862k4566k2288
60938I65462k0762j9830j9205j8289j7031j6284j6463j6656j5908j4656j3836
60927G76542j3394j2695j1812j1171j0530r446q278p596p056o095n272n553o542
60914F61102o761n665m084k693j300J53J139J464J697K248K795L024L243L849
60900F60211M695N354N634N639N614N847O377O877P067P136P444P967Q436Q772
60886G53070Q880Q340P036N851N937P295Q773R477R483R166Q687Q343Q674R774
60872H68786J0936J1310J0685R452Q155P164O564O063N336M326L130J699O1j349
$$ plain form
60959 2374256 2203308 2052108 1918585 1800343 1695595 1603689 1524001 1455056 1395100 1342787
60949 1342787 1296828 1255517 1217061 1179985 1143294 1106884 1071945 1040178 1012316 987750 965462
60938 965462 944700 924870 905665 887376 870345 854061 837598 820942 805034 790378 776542
60927 776542 763148 750453 738641 727470 716940 707494 699216 691620 684564 678469 673197 667644 661102
60914 661102 654341 648676 644592 641899 640599 640752 641891 643355 645052 647300 650095 653119 656362 660211
60900 660211 664906 670260 675894 681533 687147 692994 699371 706248 713315 720451 727895 735862 744298 753070
60886 753070 761950 770290 777326 783177 789114 796409 805182 814659 824142 833308 841995 850338 859012 868786
60872 868786 879722 891032 901717 911169 919324 926488 933052 939115 944451 948777 951907 953606 953667 952318
60858I52318k090k415l063m358n938p444q926j0511j2016j3100j3484j3132j2488
60845H43353j2400j3256j4369j4734j4292j3857j3848j3966j4118j4763j5921
60834F87829j6670j6192j4818j3408j2233j1081j0105r799j0108j0237r519q155
60822E45504o920o317o125n740m892l965l499l515l599l582l713m014l948l089
60808D82586j825r58p85r45j048j045r14m20N69J683K236J852Q04k20p21p09n38
60791D79602m83n94p96j018j179j188j038q63q95j366k326l394l905l517k711
60776D54329k328k640l130l274l132l012k937k753k547k496k476k209j796j629
60762D17970j730j665j266r70j093j186o78O6N4r04j748j511n88p5k40l59N7O40
$$ plain form
60858 952318 950228 947813 944750 940392 934454 927010 918084 907573 895557 882457 868973 855841 843353
60845 843353 830953 817697 803328 788594 774302 760445 746597 732631 718513 703750 687829
60834 687829 671159 654967 640149 626741 614508 603427 593322 583523 573415 563178 553659 545504
60822 545504 538584 532267 526142 520402 515510 511545 508046 504531 500932 497350 493637 489623 485675 482586
60808 482586 480761 479803 479018 478073 477025 475980 475066 474646 475215 476898 479134 480986 481790 481570 480849 480140 479602
60791 479602 479119 478525 477729 476711 475532 474344 473306 472443 471548 470182 467856 464462 460557 457040 454329
60776 454329 452001 449361 446231 442957 439825 436813 433876 431123 428576 426080 423604 421395 419599 417970
60762 417970 416240 414575 413309 412339 411246 410060 409382 409448 409502 408598 406850 405339 404751 404676 404436 404077 404134 404774
60744D04774R80J358K166L072L334K778J919J176M98j79o54q38j062j659k474
60729D15189l021l058k799k641k848l366l840l891l506l051k740k386j875j575
60715C74592j865k377k362j774j380j612j922j731j394j565k027j985j348r15
60701C50335j148j545j482r91m35P0M58M98J76q6rJ43J07J36M87Q52Q65P79J005
60682C50215J300J210J039J529K673L640L947L929L950L917L741L592L536L507
60668C91725L710M277M475L240Q84p60m91Q00J488J284J011J028J010Q94J053
60653D15628J458J626J441J272J210R43N14N41J306K186K276J295l11j820k692
60638D26873k895k941l263l623l489l020l028l800m484m108k765j400o81n50o75
$$ plain form
60744 404774 405754 407112 409278 412350 415684 418462 420381 421557 422055 421876 421222 420384 419322 417663 415189
60729 415189 412168 409110 406311 403670 400822 397456 393616 389725 386219 383168 380428 378042 376167 374592
60715 374592 372727 370350 367988 366214 364834 363222 361300 359569 358175 356610 354583 352598 351250 350335
60701 350335 349187 347642 346160 345169 344734 344804 345262 345760 345936 345850 345841 345984 346091 346227 346714 347566 348431 349210 350215
60682 350215 351515 352725 353764 355293 357966 361606 365553 369482 373432 377349 381090 384682 388218 391725
60668 391725 395435 399712 404187 407427 408311 407551 407060 407860 409348 410632 411643 412671 413681 414575 415628
60653 415628 417086 418712 420153 421425 422635 423578 424092 424633 425939 428125 430401 431696 431385 429565 426873
60638 426873 423978 421037 417774 414151 410662 407642 404614 400814 396330 392222 389457 388057 387376 386826 386151
60623C86151q69j037j130j173j168r65m90k8J9l08n66n16l70l01o2N91J360J694
60605C80832J517J266J204J126P96L96K44L51M71M69M51O19J053J564J708J224
60589C95291M98J94L14J06p16j324q65K27P87N54L35O82J341K071L077M232M791
60572D11595M455M095M743O327P941R064R927J0888J1991J2997J3439J2816J1018
60559E31296Q467N613K600l71k790m386n525o563p147o692n350l853k539j154
60545E01606M55K053L503M996O647Q297R862J1522J3347J4985J5930J6023J5521
60532F24747J4607J2993J0151O215K352k50j759l388n591p313p516o662n942n673
60518F26971n331m770m360m073l458k569j979j664q23Q58K530L242L207L511M906
$$ plain form
60623 386151 385282 384245 383115 381942 380774 379809 379319 379291 379310 379002 378436 377920 377550 377249 377187 377778 379138 380832
60605 380832 382349 383615 384819 385945 386741 387137 387381 387732 388203 388672 389123 389742 390795 392359 394067 395291
60589 395291 395789 395983 396297 396403 395687 394363 393498 393725 394512 395066 395401 396083 397424 399495 402572 406804 411595
60572 411595 416050 420145 424888 431215 439156 448220 458147 469035 481026 494023 507462 520278 531296
60559 531296 539763 545376 547976 547605 544815 540429 534904 528341 521194 514502 509152 505299 502760 501606
60545 501606 502061 504114 507617 512613 519260 527557 537419 548941 562288 577273 593203 609226 624747
60532 624747 639354 652347 662498 668713 671065 670815 669056 665668 660077 652764 645248 638586 632644 626971
60518 626971 621640 616870 612510 608437 604979 602410 600431 598767 597944 598802 601332 604574 607781 611292 616198
60503F16198P168R560J1715J4215J8116K3633K9583L4605L8612M2293M5504M7300
60491I38502M7460M6754M5365M2228L6566K8953K0169J0050j493j3195k3382l1710
60479A146267l8822m4672m8414m9781m9410m7803m5016m1484l8053l4915l1497
60468F76400k7784k4786k3094k1760j9416j6009j2730j0499r214q326p559o970
60456D88253o692o717o716o190n006l728l163l565m444n040m882l985k771j736
60442D23618j052o01l74o02j308j957j932j210l03L40O20N93L79J96J67O3l65
60425D16272q84r61n59k59m66q63r21n84j55K59P52J217J327R73N03M08Q55J524
60407D18438J890J740J394J320J511J541J208Q23P56J028J469J952K221J955J330
$$ plain form
60503 616198 623366 632926 644641 658856 676972 700605 730188 764793 803405 845698 891202 938502
60491 938502 985962 1032716 1078081 1120309 1156875 1185828 1205997 1216047 1214554 1201359 1177977 1146267
60479 1146267 1107445 1062773 1014359 964578 915168 867365 822349 780865 742812 707897 676400
60468 676400 648616 623830 600736 578976 559560 543551 530821 520322 511108 502782 495223 488253
60456 488253 481561 474844 468128 461938 456932 453204 450041 446476 442032 436992 432110 428125 425354 423618
60442 423618 422566 421965 421591 420989 419681 417724 415792 414582 414279 414619 415239 415832 416211 416407 416574 416637 416272
60425 416272 415388 414427 413868 413609 413143 412280 411359 410775 410620 410879 411631 412848 414175 415148 415651 416059 416914 418438
60407 418438 420328 422068 423462 424782 426293 427834 429042 429865 430621 431649 433118 435070 437291 439246 440576
60392D40576J109J685K440K561K203K197K734L125K842K167J672J627K038K745
60378D71721L345L536L584L951M373M035K880J935K001K653L048L039K851K334
60364E15286J280K22J5O72J323J329Q83M76K73K30M06R45J932L274M654N670O159
60347E45029O302O270O008N564N235N085M558L077Q82j152k492l319l998m580
60333E72469m811m426l418k298j880k495l551m197m308m417m825n245n268m793
60319E16537l984l146k571k202j596n37N58J260J872K933M264N266O084P538R859
60304E42135J2397J4863J7782K1173K3638K3666K1292J7662J3303P798J069n871
60292G10907j1722j5911j8628k0172k0502j9332j6659j3236j0313q607p732o907
$$ plain form
60392 440576 441685 443370 445810 448371 450574 452771 455505 458630 461472 463639 465311 466938 468976 471721
60378 471721 475066 478602 482186 486137 490510 494545 497425 499360 501361 504014 507062 510101 512952 515286
60364 515286 516566 516788 516803 517475 518798 520127 521010 521486 521759 521989 522395 523340 525272 528546 533200 538870 545029
60347 545029 551331 557601 563609 569173 574408 579493 584051 587128 588010 586858 584366 581047 577049 572469
60333 572469 567658 563232 559814 557516 555636 553141 549590 545393 541085 536668 531843 526598 521330 516537
60319 516537 512553 509407 506836 504634 503038 502501 503059 504319 506191 509124 513388 518654 524738 532276 542135
60304 542135 554532 569395 587177 608350 631988 655654 676946 694608 707911 715709 716778 710907
60292 710907 699185 683274 664646 644474 623972 604640 587981 574745 564432 555825 548093 541186
60280E41186n981n274m695l809k813k674l775n037n049l740k365j872j987k007
60266D90108j827j851k244k699k821k403j481m49J1m80j429j884j454p10l94n88
60250D67405p83n66LN42O97M09p9m29m79k53J71O47Q57N41j52p53r81r10n96J05
60230D65396J230K475L405L714L330K500J754J467J402J157R72J476K583L399
60216D96260L470L373L636L923L924M248N496O984P496P005O643P015P555P564
60202E74592P024O219N382M905N194N947O221N511M329L441K986K630K161J606
60188F38148J030M42j96r95j950k798l334l724m207m636m793m895n246n553n267
60173E92026m563m136l976l277j840p08q61j900k631k537k093j885j955j958j684
$$ plain form
60280 541186 535205 529931 525236 521427 518614 515940 512165 507128 502079 498339 495974 494102 492115 490108
60266 490108 488281 486430 484186 481487 478666 476263 474782 474333 474344 473864 472435 470551 469097 468387 467993 467405
60250 467405 466622 466056 466059 466601 467298 467707 467628 467199 466720 466467 466638 467285 468142 468683 468531 467778 466797 465887 465291 465396
60230 465396 466626 469101 472506 476220 479550 482050 483804 485271 486673 487830 488802 490278 492861 496260
60216 496260 499730 503103 506739 510662 514586 518834 524330 531314 538810 545815 552458 559473 567028 574592
60202 574592 581616 587835 593217 598122 603316 609263 615484 620995 625324 628765 631751 634381 636542 638148
60188 638148 639178 639620 639424 638429 636479 633681 630347 626623 622416 617780 612987 608092 602846 597293 592026
60173 592026 587463 583327 579351 576074 574234 573526 572665 570765 568134 565597 563504 561619 559664 557706 556022
60158E56022j340j325j614j509m62J031J858J669J191J066J173J239J412J770
60144E62181J956J741J472J511J753K162L188M949O550O878N977M903M429M375
60130F14025M199L683K999K410J992J591J096P44Q22J081R46M67M28J214K138
60115F39835K391K070J751J574J423J593K378L272L338K346R09m28j577k449k843
60100F55583k860k846k824k517k004j796k048k238j863j018q5P41J374J644J540
60085F38783J408J650K290L001L455L484L084K327J291O6j116j938k402l077m522
60070F47784o450p891q311q167q143q285q250q069q062q149p860p093o365o067
60056E40622n947n597n083m596l924k830j771j427j574j212nJ209J716J955K652
$$ plain form
60158 556022 554682 553357 551743 550234 549772 550803 552661 554330 555521 556587 557760 558999 560411 562181
60144 562181 564137 565878 567350 568861 570614 572776 575964 580913 587463 594341 600318 605221 609650 614025
60130 614025 618224 621907 624906 627316 629308 630899 631995 632739 633561 634642 635588 636055 636483 637697 639835
60115 639835 642226 644296 646047 647621 649044 650637 653015 656287 659625 661971 662880 662452 660875 658426 655583
60100 655583 652723 649877 647053 644536 642532 640736 638688 636450 634587 633569 633484 634225 635599 637243 638783
60085 638783 640191 641841 644131 647132 650587 654071 657155 659482 660773 660839 659723 657785 655383 652306 647784
60070 647784 641334 633443 625132 616965 608822 600537 592287 584218 576156 568007 560147 553054 546689 540622
60056 540622 534675 529078 523995 519399 515475 512645 510874 509447 507873 506661 506656 507865 509581 511536 514188
60041E14188L623M276M673N197N560N183M343L896L877L496K579J942J911J594
60027E66338J98j744l088l462l302l212l712n148p152q596q677p775o841o293
60013D97534n923n445m698l655k653k217k358k440k069j563j236q96m90m68r35
59998D60488j178q29o16j087j353k98J498K469K336K267K804L112K595J961K144
59983D76313L074M003M368L934K794J580R90Q62L36q23j849k203k308k605k751
59968D85715k417k172k628l268k996j651j39Q08J217J295J063P65R45J779K682
59953D80998K969K605K050J543R92M57L52R67J986K707K721K183J501R30N56L80
59937E05897K96N7n15j338k132k637k704k367j869j540j483j529j478j256q00
$$ plain form
60041 514188 517811 522087 526760 531957 537517 542700 547043 550939 554816 558312 560891 562833 564744 566338
60027 566338 566536 564792 561704 558242 554940 551728 548016 542868 535716 527120 518443 510668 503827 497534
60013 497534 491611 486166 481468 477813 475160 472943 470585 468145 466076 464513 463277 462381 461891 461423 460488
59998 460488 459310 458481 457865 456778 455425 455127 456625 459094 461430 463697 466501 469613 472208 474169 476313
59983 476313 479387 483390 487758 491692 494486 496066 497056 497918 498254 497431 495582 493379 491071 488466 485715
59968 485715 483298 481126 478498 475230 472234 470583 470444 471252 472469 473764 474827 475592 476537 478316 480998
59953 480998 483967 486572 488622 490165 491157 491614 491966 492933 494919 497626 500347 502530 504031 504961 505517 505897
59937 505897 506193 506250 505735 504397 502265 499628 496924 494557 492688 491148 489665 488136 486658 485402 484602
59922D84602o1Q16J531J973K252K370K264K222K739L775M671N147N722O676P234
59907E33933O570N124M075L774L557K964K205J429M88m23p54n33n70j317k169
59892E58353k289j530k44J320K850L758L703L120K790L057L707M355M583M112
59878E91645L250K878L440M238M246L446K709K410J958Q42n93j839l065m560n792
59863F05213n832m750l719l521l631l216k381j787j451p78L55J376K022K769M044
59848E84713N594O960Q045Q835Q995Q207O581M463K174J88q59p03K63J417K245
59833F47118K141N87k023m392n671o281o878p252o906o147n602n211m644m296
59819E84543m743n505n494m682m140m352m563m061l038j899o58N07R66M35n01
$$ plain form
59922 484602 484541 485357 486888 488861 491113 493483 495747 497969 500708 504483 509154 514301 520023 526699 533933
59907 533933 540503 545627 549702 553476 557033 559997 562202 563631 564119 563696 562942 562409 561839 560522 558353
59892 558353 556064 554534 554290 555610 558460 562218 565921 569041 571831 574888 578595 582950 587533 591645
59878 591645 594895 597773 601213 605451 609697 613143 615852 618262 620220 621062 620469 618630 615565 611005 605213
59863 605213 599381 594631 590912 587391 583760 580544 578163 576376 574925 574147 574502 575878 577900 580669 584713
59848 584713 590307 597267 605312 614147 623142 631349 637930 642393 644567 644755 643896 643193 643456 644873 647118
59833 647118 649259 649846 647823 643431 637760 631479 624601 617349 610443 604296 598694 593483 588839 584543
59819 584543 579800 574295 568801 564119 559979 555627 551064 547003 543965 542066 541408 541915 542881 543316 542815
59804E42815j121j280j106o59k34l66j081j703j802j817k287k990l316l071k485
59789E17497j810j340j451k136k773k755k246j914k128k647k913k482j424m45
59775D89033k94r25j519j553j299j164r98m71L26J083J750K383K755K567J957
59760D93631J489J591K183K740K737K215J939K636M063N239N641N641N712N770
59746E43227N646N535N574N418M815M141L845L701L186K355J747J543J426J224
59732E93383J162J376J614J594J338J044Q16O77O61P93R81J016P82M31K27J18
59716F08013k93j096j611j096J77J088J019M80J93J38r7m01k21N98J507J868J628
59699F11894J341J537K082K310J869J240J109J437J642J508J227O04p96k497l043
$$ plain form
59804 542815 541694 540414 539308 538649 538415 538049 536968 535265 533463 531646 529359 526369 523053 519982 517497
59789 517497 515687 514347 512896 510760 507987 505232 502986 501072 498944 496297 493384 490902 489478 489033
59775 489033 488739 487814 486295 484742 483443 482279 481281 480810 481136 482219 483969 486352 489107 491674 493631
59760 493631 495120 496711 498894 501634 504371 506586 508525 511161 515224 520463 526104 531745 537457 543227
59746 543227 548873 554408 559982 565400 570215 574356 578201 581902 585088 587443 589190 590733 592159 593383
59732 593383 594545 595921 597535 599129 600467 601511 602327 603004 603665 604458 605439 606455 607237 607668 607895 608013
59716 608013 607720 606624 605013 603917 604094 605182 606201 606681 606874 607012 606915 606514 606293 606891 608398 610266 611894
59699 611894 613235 614772 616854 619164 621033 622273 623382 624819 626461 627969 629196 629800 629004 626507 623464
59684F23464j731K99J415J370J060Q23N7j518l153l986m068m065m320m556m432
59669E96659m046l782l769l729l380k850k496k404k375k302k203j903j150j21
59655E60149N90P20O69Q93J353J800K253K868L453L453K375K98j854k795k149
59640E74076j200j651l576n246n295m252l457l238k891k021j009l86k96n80r12
59625E38066r61q10r43j567k222k474k579k944l321l230k913l063l683l954l336
59610E00066k203j231o53l55j74J52R20K066K964K978K111J020L87L55N31M94
59594E09428K09j14m00p20r50p81k62P1k32r10j323j171p42n27p83j383j961k296
59576D95153k499k665k491j696p65o17j334j840j316l24Om81r52q81o12o74j061
$$ plain form
59684 623464 621733 622032 623447 624817 625877 626700 626757 625239 622086 618100 614032 609967 605647 601091 596659
59669 596659 592613 588831 585062 581333 577953 575103 572607 570203 567828 565526 563323 561420 560270 560149
59655 560149 560739 561459 562128 563021 564374 566174 568427 571295 574748 578201 580576 580874 579020 576225 574076
59640 574076 572876 571225 567649 562403 557108 552856 549399 546161 543270 541249 540240 539854 539558 538978 538066
59625 538066 537105 536295 535352 533785 531563 529089 526510 523566 520245 517015 514102 511039 507356 503402 500066
59610 500066 497863 496632 495979 495624 495450 495602 496522 498588 501552 504530 506641 507661 508048 508403 508934 509428
59594 509428 509637 509523 509123 508403 507453 506672 506410 506481 506249 505339 504016 502845 502103 501576 500793 499410 497449 495153
59576 495153 492654 489989 487498 485802 485037 484420 483086 481246 479930 479606 479612 479131 478179 477298 476686 476012 474951
59559D74951j345j144l59P16J510J633J291J050J199J556J834K021K355K968L645
59544D93881L940L743L651M477O382Q773J1151J3610J6254J8493J9189J7349J2673
59531F33566N885j212o484q849q850p735o225m383k200J02K171L636M255M224
59517F07901M020L755K971J376n60k039k812l319m150n554p261q650r274r330
59503E67074r288r152q555p565o734o202n482m378l434l063k994k940l026l105
59489D91156k452q55P45J471J703K242K930L103K837K728K718K314J774J964L002
59474E17380L959M081L514K777K209K027K275K550K361J835J580J813K122K132
59460E52615J901J684J706K194L174M322N386O535P905R027R365R175R158R346
$$ plain form
59559 474951 473606 472462 472103 472819 474329 475962 477253 478303 479502 481058 482892 484913 487268 490236 493881
59544 493881 497821 501564 505215 509692 516074 524847 535998 549608 565862 584355 603544 620893 633566
59531 633566 639451 638239 631755 622906 614056 606321 600096 595713 593513 593615 595786 599422 603677 607901
59517 607901 611921 615676 618647 620023 619463 617424 614612 611293 607143 601589 594328 585678 576404 567074
59503 567074 557786 548634 540079 532514 525780 519578 514096 509718 506284 503221 500227 497287 494261 491156
59489 491156 488704 487849 488594 490065 491768 494010 496940 500043 502880 505608 508326 510640 512414 514378 517380
59474 517380 521339 525420 528934 531711 533920 535947 538222 540772 543133 544968 546548 548361 550483 552615
59460 552615 554516 556200 557906 560100 563274 567596 572982 579517 587422 596449 605814 614989 624147 633493
59446F33493R015P693N617L216P27j573l356m633n689o674p557q382r137r392
59432F03368q709p339o098n416m977m219k837q54J403L417M956O330P894R510
59418E96429J0927J2446J4621J7464K0368K2779K4510K5567K5932K5223K2362
59407H18628J6156O869l164j1046j5239j5767j3430r553n660k348R60L982M215
59394G74603p29r545j7784k2214k3230k2792k1711j9834j7431j5070j2693r921
59382E81649p035m898l957l767l447k447r74K50Q30J129J643K216K426K433K790
59367E68841L518M125M452M788N178N378N481N794O088N832N254N308O393P897
59353F44327R172J0193J1127J1988J2930J4149J5352J6017J6319J6959J7961J8490
$$ plain form
59446 633493 642508 650201 655818 659034 659761 658188 654832 650199 644510 637836 630279 621897 612760 603368
59432 603368 594659 587320 581222 575806 570829 566610 563773 562919 564322 567739 572695 579025 586919 596429
59418 596429 607356 619802 634423 651887 672255 695034 719544 745111 771043 796266 818628
59407 818628 834784 841653 838489 827443 812204 796437 783007 773454 767794 765446 766406 770388 774603
59394 774603 773874 764329 746545 724331 701101 678309 656598 636764 619333 604263 591570 581649
59382 581649 574614 569716 565759 561992 558545 556098 555124 555374 556204 557333 558976 561192 563618 566051 568841
59367 568841 572359 576484 580936 585724 590902 596280 601761 607555 613643 619475 624729 630037 636430 644327
59353 644327 653499 663692 674819 686807 699737 713886 729238 745255 761574 778533 796494 814984
59341H14984J8089J7192J6205J4882J2960J0617P998N025J902r77l753o887j0068
59328H98169j2317j3486j4522j5847j6599j6113j5028j4230j3618j2778j1942
59317G41689j1341j0433q777p056o213n995n425m407l721l553l013j379R04K791
59303F74071L847M661O176Q705J1581J3809J4858J4548J2377P763J203n466j0383
59290G57750j2976j3816j3672j3099j2458j1864j1214j0420r399p869n614l024
59278F32325r03L69J091J651K316L512N581Q010R707J0330J0698J1597J2749J3343
59264G22376J2971J1694R727P426N126K785J68k502m684o310p832r326j0341j0780
59250G20498j1063j1213j0652r231p680o635n953n245m364l105j264O98J954K544
$$ plain form
59341 814984 833073 850265 866470 881352 894312 904929 912927 917952 919854 918877 915124 908237 898169
59328 898169 885852 872366 857844 841997 825398 809285 794257 780027 766409 753631 741689
59317 741689 730348 719915 711138 704082 697869 691874 686449 682042 678321 674768 671755 670376 671280 674071
59303 674071 677918 682579 688755 697460 709041 722850 737708 752256 764633 772396 773599 768133 757750
59290 757750 744774 730958 717286 704187 691729 679865 668651 658231 648832 640963 635349 632325
59278 632325 631422 631791 632882 634533 636849 640361 645942 653952 663659 673989 684687 696284 709033 722376
59264 722376 735347 747041 756768 764194 769320 772105 772273 769771 765087 758777 750945 741619 731278 720498
59250 720498 709435 698222 687570 678339 670659 664024 658071 652826 648462 645357 644093 644791 646745 649289
59236F49289L313M313M469L401K413K806M145M997M657L275J150j234l034l770
59222F80190l829l793l838m161n145o537p283o890o015n215m084k447j246j174
59208F18533j394p47N30J417J708J786J492N51m34o20k51j75l87k29L29O90P48
59191F23547R35J328J591J684J757J592R90M15L73N19K14l06k66L77R67J266J582
59174F38565J982K242K469K947L514L844M169M995O288P594Q719R628J0129J0214
59160G17299J0261J0186R159O951M728L452K297J9k824m654n305n994p132p924
59146G30519q095q258q440p946o985o765p459p657o587n413n441o288o729o435
59132F32021n853n169m347l640l267k882k103j126l67J88Q05J459J951K337K948
$$ plain form
59236 649289 652602 656915 661384 664785 667198 670004 674149 679146 683803 687078 688228 686994 683960 680190
59222 680190 676361 672568 668730 664569 659424 652887 645604 638714 632699 627484 623400 620953 619707 618533
59208 618533 617139 616392 616922 618339 620047 621833 623325 623876 623442 622822 622571 622396 622009 621780 622109 622799 623547
59191 623547 624482 625810 627401 629085 630842 632434 633424 633839 634212 634731 634945 634639 634373 634750 635717 636983 638565
59174 638565 640547 642789 645258 648205 651719 655563 659732 664727 671015 678609 687328 696956 707085 717299
59160 717299 727560 737746 746905 753856 758584 762036 764333 764352 761528 756874 751569 745575 738443 730519
59146 730519 722424 714166 705726 697780 690795 684030 676571 668914 662327 656914 651473 645185 638456 632021
59132 632021 626168 620999 616652 613012 609745 606863 604760 603634 603267 603455 604260 605719 607670 610007 612955
59117F12955M039N537O897P389O911O390O827Q061R079R398R306Q862P736O237
59103G15624N457N765O095N322L703K291J440O68l31j235j645j623j531j606j669
59088G36725j330n94j56o94j875k602k385k031k681m503o628q112q657q548q174
59073F77755p737p282o911o726o609o250n526m605l633k630j879j937k899m003
59059F09128m423m147l709l405l233l252l376l144k288j342j019j210j183o86
59045E72711k08j98n66r92j218j075o13k09k03n34q91j036p34J84J355J989J918
59028E69680J982K871M120M904N284N875O730P489Q264R479J0941J1978J2292
59015F61889J2005J1031R193O812M497K556J111L49qp99k170k825j708K40J268
$$ plain form
59117 612955 616994 622531 629428 636817 643728 650118 656945 665006 674085 683483 692789 701651 709387 715624
59103 715624 721081 726846 732941 738263 741966 744257 745697 746365 746034 744799 743154 741531 740000 738394 736725
59088 736725 735395 734801 734645 733951 732076 729474 727089 725058 722377 717874 711246 703134 694477 685929 677755
59073 677755 670018 662736 655825 649099 642490 636240 630714 626109 622476 619846 617967 616030 613131 609128
59059 609128 604705 600558 596849 593444 590211 586959 583583 580439 578151 576809 575790 574580 573397 572711
59045 572711 572503 572305 571739 570747 569529 568454 567841 567632 567429 566895 566004 564968 564234 564418 565773 567762 569680
59028 569680 571662 574533 578653 583557 588841 594716 601446 608935 617199 626678 637619 649597 661889
59015 661889 673894 684925 694118 700930 705427 707983 709094 709443 709435 708636 706466 703641 701933 702173 703441
59000G03441J349J953L529M879N221N239N652O149O286O271O156N323L512J627
58986G66587O86N83L72n56k027l417m086l774k756j444M0J595K817L482M180N622
58970G67904P537Q986R716J0333J1278J2338J3269J3985J4173J3460J2097J0835
58958I05911J0083R678R301Q483O540L262n20l855o807r932j3035j5475j7195
58945H86439j8352j8357j6678j4254j2722j2325j1973j1197j0536r992q766o781
58933G34506n040m138l712l527l683l597k364m90L19l75j064o37Q8k2p33j273
58917G04258j595j865j701r05j10Q1j04j82m9M41J552K951L834M228N098O825
58901G22757Q639R984J1224J2481J3104J2897J2662J2813J2713J2100J1934J2993
$$ plain form
59000 703441 704790 706743 710272 715151 720372 725611 731263 737412 743698 749969 756125 761448 764960 766587
58986 766587 767273 767856 768228 767672 765645 762228 758142 754368 751612 750168 750208 751803 754620 758102 762282 767904
58970 767904 775441 784427 794143 804476 815754 828092 841361 855346 869519 882979 895076 905911
58958 905911 915994 925672 934973 943456 949996 953258 952738 948883 942076 932144 919109 903634 886439
58945 886439 868087 849730 833052 818798 806076 793751 781778 770581 760045 750053 741287 734506
58933 734506 729466 725328 721616 718089 714406 710809 708445 707955 708274 707899 706835 706198 706286 706264 705531 704258
58917 704258 702663 700798 699097 698192 698082 698163 698059 697877 697828 698269 699821 702772 706606 710834 715932 722757
58901 722757 731396 741380 752604 765085 778189 791086 803748 816561 829274 841374 853308 866301
58889H66301J4781J6667J8938K1760K4162K5127K4795K3787K2270K0438J8769
58878A097795J6939J3691Q785L915N27k181n828j0395j4525j7420j9116j9593
58866A052594j8991j8202j7938j7633j6355j4324j2512j1263j0421j0227j0957
58855H93771j2007j2483j2347j2070j1629j0855j0263j0409j0796j0507r636q995
58843G61774q701q176p381o920o944o918o582o265o188o139n939n650n346n113
58829F69512n150n407n321m456l132k003j232n87RN74J346K442L454L976M223
58814F58248M616N028M991M482L937L650L544L416L057K264J062k11j202j781
58800F95101j969j980k261l114m226n029n463n872o293o495o594o796o693n714
$$ plain form
58889 866301 881082 897749 916687 938447 962609 987736 1012531 1036318 1058588 1079026 1097795
58878 1097795 1114734 1128425 1137210 1141125 1141652 1139471 1133643 1123248 1108723 1091303 1072187 1052594
58866 1052594 1033603 1015401 997463 979830 963475 949151 936639 925376 914955 904728 893771
58855 893771 881764 869281 856934 844864 833235 822380 812117 801708 790912 780405 770769 761774
58843 761774 753073 744897 737516 730596 723652 716734 710152 703887 697699 691560 685621 679971 674625 669512
58829 669512 664362 658955 653634 649178 646046 644043 642811 642224 642233 642807 644153 646595 650049 654025 658248
58814 658248 662864 667892 672883 677365 681302 684952 688496 691912 694969 697233 698295 698084 696882 695101
58800 695101 693132 691152 688891 685777 681551 676522 671059 665187 658894 652399 645805 639009 632316 626602
58786F26602m242l203k599j640k86O35J012J730L019L964M119M182M497M281L060
58771F45131J536K82j137k975m518n316n896o497o360n179l931l364k931k225
58757E96620j948k427k498j246L88J113J247J729K326K270J830J742J859J694
58743F04699J633K306L461M546N680O940P605P259O771O956P226O699N778N303
58729F82862N135M906N152O283P290O985N809M996M716M420M233M503M783M586
58715G56659M478N035N620N617N802O949P982P345N372L526K024P6k212m083n787
58700H04403q106j0595j2173j3066j4401j6111j7042j6861j6217j5304j3913j2617
58688F37997j2152j1902j0665q758p578p341o919n924n149m995m883m461l950
$$ plain form
58786 626602 622360 619157 616558 614918 614632 615267 616279 618009 621028 624992 629111 633293 637790 642071 645131
58771 645131 646667 646949 645812 642837 638319 633003 627107 620610 614250 609071 605140 601776 598845 596620
58757 596620 594672 592245 589747 588501 588889 590002 591249 592978 595304 597574 599404 601146 603005 604699
58743 604699 606332 608638 612099 616645 622325 629265 636870 644129 650900 657856 665082 671781 677559 682862
58729 682862 687997 692903 698055 704338 711628 718613 724422 729418 734134 738554 742787 747290 752073 756659
58715 756659 761137 766172 771792 777409 783211 790160 798142 805487 810859 814385 816409 816485 814273 810190 804403
58700 804403 796297 785702 773529 760463 746062 729951 712909 696048 679831 664527 650614 637997
58688 637997 625845 613943 603278 594520 586942 579601 572682 566758 561609 556614 551731 547270 543320
58675E43320l314k331j365q80m41O30J917K565K788L474M706O002P428R081J0125
58660E83705R854Q968Q264O880L758k5k466l545m715o049o319n642n548o407o984
58645E73729o760o449o121m913k939j429p09R5J160J733J928K738L993M379L787
58630E64222L641M460N082M741M030L348K255R44M72R51J229Q46O48J038J380
58615E99287J602K536M133N144N192N370O170O558N884M968M455L669K075M77
58601F57520j62J1L92P46Q67L81n28j323k119l371m413l817j464J081K578L186
58585F49565L479L776M631O445Q365Q998Q430Q018Q191Q045P266O651O459O018
58571G44337N280N127N797O693P946J0338J3443J5722J6857J8147K0151K1920
$$ plain form
58675 543320 540006 537675 536310 535430 534989 535619 537536 540101 542889 546363 551069 557071 564499 573580 583705
58660 583705 593559 602527 610791 617671 621429 621404 618938 615393 610678 604629 598310 592668 587120 580713 573729
58645 573729 566969 560520 554399 549486 546547 545118 544409 544504 545664 547397 549325 552063 556056 560435 564222
58630 564222 567863 572323 577405 582146 586176 589524 591779 592723 593195 594146 595375 596221 596869 597907 599287
58615 599287 600889 603425 607558 612702 617894 623264 629434 635992 641876 646844 651299 654968 657043 657520
58601 657520 657358 657369 657761 658507 659374 659755 659227 657904 655785 652414 648001 644184 642720 643801 646379 649565
58585 649565 653044 656820 661451 667896 676261 685259 693689 701707 709898 717943 725209 731860 738319 744337
58571 744337 749617 754744 760541 767234 775180 785518 798961 814683 831540 849687 869838 891758
58559H91758K3015K4294K6019K6955K6123K3801K0294J5403R723M721R48k285
58547A090769n037o338o153n863o241o708p075q192j0162j1830j2738j3879j5820
58534I74733j7799j9275k0593k1564k1121j9114j6690j4418j1809r079p380o670
58522G89221n396l044r85j35L03R82J338J107J025J164N73p58j487j231j261k140
58506G79276k770k556k467l019l370l207l465m248m147k690j304r84r90q19j218
58491G42022k247k520j521n06j33O55K351L784M367N191O733P878Q349R673J2351
58476G96427J4508J4832J4531J4813J4716J3078J0548Q001N006J379j742l755
58464I02342n562p377p844o646n636n773n396l124j71J991L992O778R574J1366
$$ plain form
58559 891758 914773 939067 965086 992041 1018164 1041965 1062259 1077662 1087385 1092106 1093054 1090769
58547 1090769 1085732 1079394 1073241 1067378 1061137 1054429 1047354 1039162 1029000 1017170 1004432 990553 974733
58534 974733 956934 937659 917066 895502 874381 855267 838577 824159 812350 803271 795891 789221
58522 789221 783825 780781 779796 779661 779964 780946 782284 783391 784416 785580 786153 785395 783908 782677 781416 779276
58506 779276 776506 773950 771483 768464 765094 761887 758422 754174 750027 747337 746033 745049 744059 743240 742022
58491 742022 739775 737255 735734 735228 735095 735750 738101 741885 746252 751443 758176 766054 774403 784076 796427
58476 796427 810935 825767 840298 855111 869827 882905 893453 901454 906460 907839 906097 902342
58464 902342 896780 889403 881559 874913 869277 863504 858108 854984 854813 856804 860796 867574 877148 888514
58450H88514J2408J2720J1271Q178N389L677J354k460n893p400q067q961q945
58437I01785p304n758n566n158l087q73l32m98K20J152J303J977M551P598Q989
58422H98999R171R759J0565J0508R789Q848O796L232j80k017l195m809n960n836
58408I45670n707o576p085o112n192n817o656n978m651m160l920k979k125j794
58394H76918l95K682N002M812M056M780N343L650J306R32J768J725J522K903M839
58379I21843N402N524P056Q927Q991Q010P984Q272P138N600N836P133P289O647
58365A021652P198Q859J0156J1239J2914J4112J3707J3262J4619J6432J6388J5069
58353A175607J4185J2980J0084P008N945N951M955L657L679L991L182L053N656
$$ plain form
58450 888514 900922 913642 924913 933091 938480 942157 943511 941051 935158 927758 919691 910730 901785
58437 901785 894481 888723 883157 877999 874912 874039 873707 873209 873429 874581 875884 877861 882412 890010 898999
58422 898999 908170 917929 928494 939002 948791 957639 964435 967667 967487 965470 962275 957466 951506 945670
58408 945670 939963 933387 926302 920190 914998 909181 902525 896547 891896 887736 883816 880837 878712 876918
58394 876918 876523 879205 884207 889019 893075 897855 903198 906848 908154 909086 910854 912579 914101 917004 921843
58379 921843 927245 932769 939825 948752 957743 965753 973737 982009 989147 994747 1000583 1007716 1015005 1021652
58365 1021652 1028850 1037709 1047865 1059104 1072018 1086130 1099837 1113099 1127718 1144150 1160538 1175607
58353 1175607 1189792 1202772 1212856 1219864 1225809 1231760 1236715 1240372 1244051 1248042 1251224 1254277 1259933
58340A259933Q930R746R229J0441J2724J3346J2898J4044J6273J7035J6813J8075
58328A419487K0247K0585J9132J8106J7360J5100J2075J0453R598P474N105N018
58316A579740O469O839O491P572R397R824R792J1542J3796J3778J2644J3619J6120
58303A717623J7055J6707J7823K0024K0623J9934K0418K1583K1126K0026K1024
58292A933966K3171K3370K2154K2518K4316K5239K5869K8143L0446L0128K9131
58281B218451L1049L4418L5283L4504L5760L8102L7673L5319L5258L7455L8511
58270B611783L8928M2140M7416N1038N3364N7536O2526O4947O6274P0544P6412
58259C242908P9405Q0427Q3792Q8438Q9698Q8310Q8909R1096R0878Q9443R1374
$$ plain form
58340 1259933 1268863 1278609 1287838 1298279 1311003 1324349 1337247 1351291 1367564 1384599 1401412 1419487
58328 1419487 1439734 1460319 1479451 1497557 1514917 1530017 1542092 1552545 1562143 1569617 1574722 1579740
58316 1579740 1586209 1593048 1599539 1607111 1616508 1626332 1636124 1647666 1661462 1675240 1687884 1701503 1717623
58303 1717623 1734678 1751385 1769208 1789232 1809855 1829789 1850207 1871790 1892916 1912942 1933966
58292 1933966 1957137 1980507 2002661 2025179 2049495 2074734 2100603 2128746 2159192 2189320 2218451
58281 2218451 2249500 2283918 2319201 2353705 2389465 2427567 2465240 2500559 2535817 2573272 2611783
58270 2611783 2650711 2692851 2740267 2791305 2844669 2902205 2964731 3029678 3095952 3166496 3242908
58259 3242908 3322313 3402740 3486532 3574970 3664668 3752978 3841887 3932983 4023861 4113304 4204678
58248D204678R5649R7796R9162J04443J12060J17010J21201J30296J42433J51218
58238E375946J57721J67954J80611J89653J96864K09030K24653K36808K47092
58229G186332K62857K82735K99520L15236L37806L65007L88216M10031M40850
58220A0288590M79726N17005N54245O02206O60508P19759P82549Q60861R53762
58211A6419211J050587J155239J283262J436045J604019J794171K026380K303574
58203B9072488K616049K974498L406417L922569M524821N245968O141209P243921
58195F5147940Q577836J0209066J2230233J4698454J7652484K1161700K5219549
58188A74897262K9529139L3468173L6264108L7058879L4824788K8631383J8469459
$$ plain form
58248 4204678 4300327 4398123 4497285 4601728 4713788 4830798 4951999 5082295 5224728 5375946
58238 5375946 5533667 5701621 5882232 6071885 6268749 6477779 6702432 6939240 7186332
58229 7186332 7449189 7731924 8031444 8346680 8684486 9049493 9437709 9847740 10288590
58220 10288590 10768316 11285321 11839566 12441772 13102280 13822039 14604588 15465449 16419211
58211 16419211 17469798 18625037 19908299 21344344 22948363 24742534 26768914 29072488
58203 29072488 31688537 34663035 38069452 41992021 46516842 51762810 57904019 65147940
58195 65147940 73725776 83934842 96165075 110863529 128516013 149677713 174897262
58188 174897262 204426401 237894574 274158682 311217561 346042349 374673732 393143191
58181C93143191N859345o678604j7002898k4272689k8703771l0801716l1003850
58174B60539008k9783755k7693108k5186257k2520659j9852311j7320991j5015285
58167A03166642j2947728j1112438r521890q171252p019786o031384n196316m499706
58159C8666142l906355l391554k955343k593993k285809k015397j785474j594945
58151A8137272j429109j279674j152024j045340r46663q51100p67666o99009o34750
58142I331937n70616n15163m71610m31119l90006l56395l33590l13085k90031
58133E660322k70348k56666k41958k23013k06393j95380j84013j69438j57526
58124C755587j50967j43906j33483j24993j20725j15039j05462r7708r4731r1279
$$ plain form
58181 393143191 399002536 392323932 375321034 351048345 322344574 291542858 260539008
58174 260539008 230755253 203062145 177875888 155355229 135502918 118181927 103166642
58167 103166642 90218914 79106476 69584586 61413334 54393548 48362164 43165848 38666142
58159 38666142 34759787 31368233 28412890 25818897 23533088 21517691 19732217 18137272
58151 18137272 16708163 15428489 14276465 13231125 12284462 11433362 10665696 9966687 9331937
58142 9331937 8761321 8246158 7774548 7343429 6953423 6597028 6263438 5950353 5660322
58133 5660322 5389974 5133308 4891350 4668337 4461944 4266564 4082551 3913113 3755587
58124 3755587 3604620 3460714 3327231 3202238 3081513 2966474 2861012 2763304 2668573 2577294
58114B577294q4050p7275p3595o9217o2558n8181n7717n6106n1168m7788m8352
58103A891287m8022m3985m0657m1163m1912m0225l9292m1043m1718l9097l6890
58092A437283l7543l7638l4603l1358l0218k8711k5235k2620k2427k1884j9888
58081A125158j9698k2335k3690k1634j9774k0668k1556k0262j9200j9894j9611
58070H96836j7067j5606j7012j7899j5954j4037j4370j4253j1571r093r262r745
58058G30967q214o760p588q874q737q876j0567j1365r575p805q458r613q891p540
58044F08104p330p193o223o188p902q809p314n780o268p031o250n448o095o520
58030E13753n348m451n416o443n790m979n682o671o601o558p167o613m158k238
$$ plain form
58114 2577294 2493244 2415969 2342374 2273157 2210599 2152418 2094701 2038595 1987427 1939639 1891287
58103 1891287 1843265 1799280 1758623 1717460 1675548 1635323 1596031 1554988 1513270 1474173 1437283
58092 1437283 1399740 1362102 1327499 1296141 1265923 1237212 1211977 1189357 1166930 1145046 1125158
58081 1125158 1105460 1083125 1059435 1037801 1018027 997359 975803 955541 936341 916447 896836
58070 896836 879769 864163 847151 829252 813298 799261 784891 770638 759067 749974 740712 730967
58058 730967 722753 715993 708405 699531 690794 681918 671351 659986 650411 642606 634148 624535 615644 608104
58044 608104 600774 593581 587358 581170 573268 564459 557145 551365 545097 538066 531816 526368 520273 513753
58030 513753 508405 503954 498538 492095 486305 481326 475644 468973 462372 455814 448647 442034 437876 435638
58016D35638k428k746j607q43k018l245k639j576j683j859j065p76j873k381j118
58001D07781k60j428k575j775p23j436k629k585k415l304l556j685M13N45j71
57986C84197J27O27N0m96J01L54j002k212j556n44j083k022j564n53l64j50Q36
57969C74746Q59j273l311k889j222m84k05O99J038n5m32J625L774L162J073L63
57953C77468N73l64j753j604o70r37j658q07R36J497J367K408M018M299L946N109
57937C93828P304Q232P941Q483J0001J0762J0623J1007J1668J0792Q262N782L876
57924E08561J603r60k656l628n185p344q789r139r214r398r614j0282j1366j1372
57910D11217r355o948o159o237n152l130k054k196k217j851j977k431k186j390
$$ plain form
58016 435638 433210 430464 428857 428014 425996 422751 420112 418536 416853 414994 413929 413153 411280 408899 407781
58001 407781 407521 406093 403518 401743 401020 399584 396955 394370 391955 388651 385095 383410 383823 384368 384197
57986 384197 384324 384951 385001 384505 384606 384960 383958 381746 380190 379646 378563 376541 374977 374424 374060 373910 374746
57969 374746 375605 374332 371021 368132 366910 366426 366221 366920 367958 367903 367471 369096 372870 376032 377105 377468
57953 377468 378041 377677 375924 374320 373650 372713 371055 370248 371184 372681 374048 376456 380474 384773 388719 393828
57937 393828 401132 409364 417305 425788 435789 446551 457174 468181 479849 490641 498903 504685 508561
57924 508561 510164 509204 506548 502920 497735 490391 481602 472463 463249 453851 444237 433955 422589 411217
57910 411217 401862 394914 388755 382518 377366 374236 372182 369986 367769 365918 363941 361510 359324 357934
57896C57934r52o65K19J123J053O30J104K017K143J907K543L479L151J883J470
57881C79039K223K698K200J418P83J17l73n03r94k350l519l458l056l635m572
57866C66018m499l876m049m670m367l240k404j781o37M76N97M34J232K384K515
57851C44133K102K518L306L037K170K285L077K867J653Q83O17l04j542j674j086
57836C64042j614l224l899k976j904j430o87N27J129R49J150J939K067J103J90
57821C57362R1M31J137K663M483N333N190N174N370M740L231J879P11j273l791
57806C92731n178m964m480m487m252l393k671k418k025j438j428j900j745p60
57792C51592k9p0k60l84r84j894k170j824j852k272j868l07J312K308L186M203
$$ plain form
57896 357934 356982 356317 356536 357659 358712 359342 360446 362463 364606 366513 369056 372535 375686 377569 379039
57881 379039 381262 383960 386160 387578 388361 388478 388105 387602 386608 384258 380739 377281 374225 370590 366018
57866 366018 361519 357643 353594 348924 344557 341317 338913 337132 336495 336971 337568 338002 339234 341618 344133
57851 344133 346235 348753 352059 355096 357266 359551 362628 365495 367148 368031 368648 368344 366802 365128 364042
57836 364042 362428 359204 355305 352329 350425 348995 348308 348835 349964 350913 352063 354002 356069 357172 357362
57821 357362 357453 357884 359021 361684 366167 371500 376690 381864 387234 391974 395205 397084 397795 396522 392731
57806 392731 387553 382589 378109 373622 369370 365977 363306 360888 358863 357425 355997 354097 352352 351592
57792 351592 351563 351493 351233 350849 349865 347971 345801 343977 342125 339853 337985 337678 338990 341298 344484 348687
57776C48687M833N010N355N837N742N150M825M637L743K420J855K024J680O18
57762D02416n1j43q40k443l693l861l657l489k769j591j192k014k937l084k848
57747C67804k571j890r57o54r79q02J89R76J116J405K033J928P88L7P91K297L358
57730C74869L958M534M914M883M783M819M714M404M178L789K701J302N90N20J36
57715D25094n70o48k28o61k130l091k727k105k131k189j784j680k334k715j937
57700C98164p21j21P4N88J403K215L094L855L753K537R72l00j382k194k189j518
57684D08230j210j532j423j84J512K961M502O560Q814J1064J3799J7288K1251
57671D91632K5966L2363M0320M8189N4664N9636O2271N9741M9337L1361R138j2981
$$ plain form
57776 348687 353520 358530 363885 369722 375464 380614 385439 390076 393819 396239 398094 400118 401798 402416
57762 402416 402365 402222 401382 398939 395246 391385 387728 384239 381470 379879 378687 376673 373736 370652 367804
57747 367804 365233 363343 362386 361732 360753 359951 360140 361116 362232 363637 365670 367598 368386 368423 369214 371511 374869
57730 374869 378827 383361 388275 393158 397941 402760 407474 411878 416056 419845 422546 423848 424438 424958 425094
57715 425094 424524 423876 423648 422987 420857 417766 415039 412934 410803 408614 406830 405150 402816 400101 398164
57700 398164 397443 397322 397396 397984 399387 401602 404696 408551 412304 414841 415813 415513 414131 411937 409748 408230
57684 408230 407020 405488 404065 403881 405393 408354 412856 419416 428230 439294 453093 470381 491632
57671 491632 517598 549961 590281 638470 693134 752770 815041 874782 924119 955480 964618 951637
57659I51637l1181m3067m8420m8861m6313m2176l7662l3719l0202k6315k2144
57648E41577j8636j5986j3429j0841q976p789o174l829j802o49K42R99Q12j43
57634D55376j85J391L030L244K624K311K062J179J01l29k28j72k13l17p41j247
57618D67886j085l77j77n73l48P09J031r5j040l75R30J424J593K430L135K403
57602D77471R91P70J918K931K986K490J731O40l44o39n56q43j471j901k139k432
57586D81603k509k075j658j829k140j743o65M53J287J651J159m3q78p06k89m88
57570D71130q28m92R8ro32p89k17N62J217J651J568J032R23J849L129L806M015
57553D88013M353M614M281L701L600L868L872L518L007K092O50m77k67J116K642
$$ plain form
57659 951637 920456 877389 828969 780108 733795 691619 653957 620238 590036 563721 541577
57648 541577 522941 506955 493526 482685 473709 465920 459746 455917 454115 453466 453708 454707 455519 455376
57634 455376 455191 456582 459612 462856 465480 467791 469853 471032 471133 470804 470576 470404 470191 469874 469133 467886
57618 467886 466801 466424 466247 465674 465326 466035 467066 466971 465931 465556 466486 467910 469503 471933 475068 477471
57602 477471 478462 479232 481150 484081 487067 489557 491288 491928 491584 490945 490389 489546 488075 486174 484035 481603
57586 481603 479094 477019 475361 473532 471392 469649 468984 469437 470724 472375 473534 473491 472613 471907 471618 471130
57570 471130 470302 469810 469908 469899 469267 468478 468261 468823 470040 471691 473259 474291 475214 477063 480192 483998 488013
57553 488013 492366 496980 501261 504962 508562 512430 516302 519820 522827 524919 525569 525092 524825 525941 528583
57538E28583L655M053L813L208L012L533M011L703K990K623K576K521K685L254
57524E74220L601L183K612K777L505M010M138M237M356M502N106O336P500P991
57510F38074Q130Q317Q122P130N855M904M086L287L172L980M598M074L103K744
57496G09576K679K158J659J990K539K138J123Q33J484K084K207K363K822L410
57482G39065M229N431O510O895O861O858O582N772N179N440N723M909L481K751
57468H15686K812K771K464K390K439K220K214L010L939L999L684M144N062N193
57454H62027M674M822N743O129N516M896M882M936M700M614M856N033N101N430
57440I33359N876N976N976O427P040P205P326Q107Q892Q447P171O664P215P661
$$ plain form
57538 528583 532238 536291 540104 543312 546324 549857 553868 557571 560561 563184 565760 568281 570966 574220
57524 574220 577821 581004 583616 586393 589898 593908 598046 602283 606639 611141 616247 622583 630083 638074
57510 638074 646204 654521 662643 669773 675628 680532 684618 687905 691077 695057 699655 703729 706832 709576
57496 709576 712255 714413 716072 718062 720601 722739 723862 724695 726179 728263 730470 732833 735655 739065
57482 739065 743294 748725 755235 762130 768991 775849 782431 788203 793382 798822 804545 809454 812935 815686
57468 815686 818498 821269 823733 826123 828562 830782 832996 836006 839945 843944 847628 851772 856834 862027
57454 862027 866701 871523 877266 883395 888911 893807 898689 903625 908325 912939 917795 922828 927929 933359
57440 933359 939235 945211 951187 957614 964654 971859 979185 987292 996184 1004631 1011802 1018466 1025681 1033342
57426A033342P679Q141Q976Q859P574O618O825P252P216P566Q851R920R647Q717
57412A147183Q441Q795Q855Q400Q011Q086Q544R103R320Q877Q129P854Q269Q870
57398A266737R333R775J0110R964R452R158R263R448R682J0204J0779J0962J1031
57385A395898J1599J2371J2435J1809J1462J1719J1927J1759J1614J1589J1247
57374A525429J0625J0270J0159R795R394R631J0212J0148R565R601J0383J0749
57362A645961J0393J0518J1732J2907J2945J2290J2000J2479J3693J5375J6628
57351A786921J6637J6092J6457J7600J7959J7361J7458J8676J9085J7617J6163
57340A978026J6671J8105J8329J7464J7112J7416J7208J6511J6565J7572J8248
$$ plain form
57426 1033342 1041021 1049162 1058138 1066997 1074571 1081189 1088014 1095266 1102482 1110048 1118899 1128819 1138466 1147183
57412 1147183 1155624 1164419 1173274 1181674 1189685 1197771 1206315 1215418 1224738 1233615 1241744 1249598 1257867 1266737
57398 1266737 1276070 1285845 1295955 1305919 1315371 1324529 1333792 1343240 1352922 1363126 1373905 1384867 1395898
57385 1395898 1407497 1419868 1432303 1444112 1455574 1467293 1479220 1490979 1502593 1514182 1525429
57374 1525429 1536054 1546324 1556483 1566278 1575672 1585303 1595515 1605663 1615228 1624829 1635212 1645961
57362 1645961 1656354 1666872 1678604 1691511 1704456 1716746 1728746 1741225 1754918 1770293 1786921
57351 1786921 1803558 1819650 1836107 1853707 1871666 1889027 1906485 1925161 1944246 1961863 1978026
57340 1978026 1994697 2012802 2031131 2048595 2065707 2083123 2100331 2116842 2133407 2150979 2169227
57329B169227J7794J6673J5461J4297J3626J4147J5617J6690J6419J5402J5106
57318B340459J6357J8522K0022J9789J8376J7301J7318J7909J8500J9191J9996
57307B543740K0333K0007J9798K0366K1254K1747K1961K2374K2873K3038K2944
57296B780435K2946K3130K3429K3742K3667K2789K1648K1426K2186K2588K1949
57285C029935K1396K1905K2501K1748K0117J9349J9953K0849K1176K1113K1071
57274C261113K1259K2010K3449K4918K5694K6184K7483K9723L1813L2881L3198
57263C559725L3532L4193L4868L5043L4551L3961L4120L5058L5771L5566L5014
57252C941402L4986L5345L5421L5280L5488L5937L5873L5059L4019L3121L2198
$$ plain form
57329 2169227 2187021 2203694 2219155 2233452 2247078 2261225 2276842 2293532 2309951 2325353 2340459
57318 2340459 2356816 2375338 2395360 2415149 2433525 2450826 2468144 2486053 2504553 2523744 2543740
57307 2543740 2564073 2584080 2603878 2624244 2645498 2667245 2689206 2711580 2734453 2757491 2780435
57296 2780435 2803381 2826511 2849940 2873682 2897349 2920138 2941786 2963212 2985398 3007986 3029935
57285 3029935 3051331 3073236 3095737 3117485 3137602 3156951 3176904 3197753 3218929 3240042 3261113
57274 3261113 3282372 3304382 3327831 3352749 3378443 3404627 3432110 3461833 3493646 3526527 3559725
57263 3559725 3593257 3627450 3662318 3697361 3731912 3765873 3799993 3835051 3870822 3906388 3941402
57252 3941402 3976388 4011733 4047154 4082434 4117922 4153859 4189732 4224791 4258810 4291931 4324129
57241D324129L1104K9990K8928K7798K6625K5624K4888K4394K4215K4357K4542
57230D616594K4487K4197K3722K2988K2240K2160K3073K4417K5509K6390K7300
57219D883077K7822K7361K6239K5333K4803K3992K2572K1061J9992J9247J8411
57208E139910J7364J6254J5226J4389J3825J3662J4045J4976J6004J6498J6395
57197E308548J6386J7020J7982J8584J8642J8420J8034J7437J6860J6701J7008
57186E501622J7436J7713J7826J7823J7701J7502J7343J7334J7490J7566J7007
57175E694363J5393J2994J0545Q443O517M589K756R53j178l744o336q558j0367
57162E726370j1764j2636j3148j3831j4972j6324j7566j8632j9470j9997k0431
$$ plain form
57241 4324129 4355233 4385223 4414151 4441949 4468574 4494198 4519086 4543480 4567695 4592052 4616594
57230 4616594 4641081 4665278 4689000 4711988 4734228 4756388 4779461 4803878 4829387 4855777 4883077
57219 4883077 4910899 4938260 4964499 4989832 5014635 5038627 5061199 5082260 5102252 5121499 5139910
57208 5139910 5157274 5173528 5188754 5203143 5216968 5230630 5244675 5259651 5275655 5292153 5308548
57197 5308548 5324934 5341954 5359936 5378520 5397162 5415582 5433616 5451053 5467913 5484614 5501622
57186 5501622 5519058 5536771 5554597 5572420 5590121 5607623 5624966 5642300 5659790 5677356 5694363
57175 5694363 5709756 5722750 5733295 5741738 5748255 5752844 5755600 5756553 5755375 5751631 5745295 5736737 5726370
57162 5726370 5714606 5701970 5688822 5674991 5660019 5643695 5626129 5607497 5588027 5568030 5547599
57151E547599k1110k1888k2259k2160k1965k1668k0927k0041j9949k0942k2323
57140E312367k3671k5402k7727l0122l2453l5505l9691m4159m8110n1972n6365
57129D897190o0614o3415o4350o3776o1780n8302n3858m9215m4605m0090l6302
57118D300883l3954l2887l2365l2004l1711l1032k9298k6176k1621j5576q180
57107D006079K33R984K2314L8163N7196P8691J02900J30880J63619K02066K47459
57096E059584L00679L61733M30584N07966N94471O89113P89431Q92297R93542
57087A0619400J087065J165362J221056J247730J240489J197349J120236J013312
57079A9911999Q79137P16029N19168K85580K0334k60934n36506p86798r98527
$$ plain form
57151 5547599 5526489 5504601 5482342 5460182 5438217 5416549 5395622 5375581 5355632 5334690 5312367
57140 5312367 5288696 5263294 5235567 5205445 5172992 5137487 5097796 5053637 5005527 4953555 4897190
57129 4897190 4836576 4773161 4708811 4645035 4583255 4524953 4471095 4421880 4377275 4337185 4300883
57118 4300883 4266929 4234042 4201677 4169673 4137962 4106930 4077632 4051456 4029835 4014259 4006079
57107 4006079 4006312 4016296 4038610 4076773 4133969 4212660 4315560 4446440 4610059 4812125 5059584
57096 5059584 5360263 5721996 6152580 6660546 7255017 7944130 8733561 9625858 10619400
57087 10619400 11706465 12871827 14092883 15340613 16581102 17778451 18898687 19911999
57079 19911999 20791136 21507165 22026333 22311913 22332247 22071313 21534807 20748009 19749482
57070A9749482j162393j270587j319392j313197j263419j183396j085301r80224
57062A0171573q77687p83641p00055o26927n63876n09967m63620m23343l87998
57053D834459l56377l27458l01029k77220k55518k35101k15932j98499j82648
57044B484677j67608j53092j39375j26523j14434j03408r3684q4654p5577o6738
57034A359584n8841n1552m3851l5451k6706j7355o758M781J6036K5702L1809L0945
57022A228343K0491K084j8742l6790m9841n7449n9539n7230n3157m9450m6176
57011H22544m2542l8582l4905l1636k8614k5880k3438k1075j8900j7359j6351
57000E23262j5169j3656j2571j2383j2517j2332j1915j1464j0644r260p839o980
$$ plain form
57070 19749482 18587089 17316502 15997110 14683913 13420494 12237098 11151797 10171573
57062 10171573 9293886 8510245 7810190 7183263 6619387 6109420 5645800 5222457 4834459
57053 4834459 4478082 4150624 3849595 3572375 3316857 3081756 2865824 2667325 2484677
57044 2484677 2317069 2163977 2024602 1898079 1783645 1680237 1586553 1501899 1426322 1359584
57034 1359584 1300743 1249191 1205340 1169889 1143183 1125828 1119070 1123851 1139887 1165589 1197398 1228343
57022 1228343 1248834 1250918 1232176 1195386 1145545 1088096 1028557 971327 918170 868720 822544
57011 822544 780002 741420 706515 674879 646265 620385 596947 575872 556972 539613 523262
57000 523262 508093 494437 481866 469483 456966 444634 432719 421255 410611 401351 393512 386532
56988C86532o479n552l499j68L686O538P300O504N398M028J375k509n968p831
56974C89355q764r769j0535j0207q876p292n758m203k826j759m67J699M573P338
56960C32509R566J1540J3716J6086J7966J8347J6634J3085Q309K651l380q549
56948D48480j1674j2900j3272j3154j2074j0105q120o443m462j955L54K047L749
56935C60471O036Q693J1528J4907J8733K1734K2551K0801J6615J0085J879o399
56923E07634j3290j8382k1638k2745k1804j9852j7887j5953j3847j1941j0602
56912C19693r441p984o520n557m979m435l978l621k892j549j59P65J592K740L722
56897B77397L984M047M779N942O650O989Q004J0092J2430J4174J5388J6458J7226
$$ plain form
56988 386532 380053 374501 371002 370834 374520 381058 388358 394862 400260 404288 405663 403154 397186 389355
56974 389355 380591 370822 360287 350080 341204 333912 328154 323951 321125 319366 318899 320598 325171 332509
56960 332509 342075 353615 367331 383417 401383 419730 436364 449449 457758 460409 457029 448480
56948 448480 436806 423906 410634 397480 385406 375301 367181 360738 356276 354321 354675 356722 360471
56935 360471 366507 375200 386728 401635 420368 442102 464653 485454 502069 512154 514033 507634
56923 507634 494344 475962 454324 431579 409775 389923 372036 356083 342236 330295 319693
56912 319693 310252 302268 295748 290191 285212 280777 276799 273178 270286 268737 268578 269343 270935 273675 277397
56897 277397 281381 285428 290207 296149 302799 309788 317792 327884 340314 354488 369876 386334 403560
56884D03560J7015J5161J1461O326O25m872r762j3662j5962j6319j5191j3423
56872C64957j1457r212o567l526p3L854Q261J3141J8497K4204L0025L5822M1437
56859E09363M6184M8786M7877M2485L2263J8036K267j1774k1823k7516k9582k8834
56847F27732k6134k2525j8691j4562r771m186K165R267J6977K5116L3916M3811
56835F63115N4474O4534P2438P6995P6714O9406N3431K9655K014k3993m3844n5905
56823A039034o1359o2256n9813n4689m8105m1490l5103k8079k0057j1825m094
56812F12164L509J1809K1104L1049M0754M8729N3368N3626M8727L7629K0118j270
56800I81316k1794l7656m8021n3782n5680n4216n0297m5044l9332l3849k8856
$$ plain form
56884 403560 420575 435736 447197 453523 454148 449276 439514 425852 409890 393571 378380 364957
56872 364957 353500 344288 337721 334195 334122 337976 346237 359378 377875 402079 432104 467926 509363
56859 509363 555547 604333 652210 694695 726958 744994 747261 735487 713664 686148 656566 627732
56847 627732 601598 579073 560382 545820 536049 531863 534028 543295 560272 585388 619304 663115
56835 663115 717589 782123 854561 931556 1008270 1077676 1131107 1160762 1162776 1138783 1094939 1039034
56823 1039034 977675 915419 855606 800917 752812 711322 676219 648140 628083 616258 612164
56812 612164 615673 627482 648586 679635 720389 769118 822486 876112 924839 962468 982586 981316
56800 981316 959522 921866 873845 820063 764383 710167 659870 614826 575494 541645 512789
56789E12789k3726j7666j1161n552r93L914R899J5831K0412K3667K5688K5136
56777E78238K0323J1267k06j1779k1471k8076l1733l3521l3978l2782l0117k7202
56765C58963k4803k2439j9773j7497j5985j4404j2224j0320r425q722p282n721
56753A90368n008m671l731k507j966k004j895j760k136k680k687k323k004j298
56739A53698J44J288R47l04j012j049j306j741j553r37p69p98J8J382J788R95
56723A50791N89J618L176L828L284K149J081O02Q58J305J311J039J015J050N37
56708A74233l44p98o20k75P7M80M75l34j122o03J050K309K380J908J609J409J141
56691A82975R69Q57N63K76L00K21n51j544j676r12k40j1L62R65J004K62l87l36
$$ plain form
56789 512789 489063 471397 460236 454684 453691 457605 467504 483335 503747 527414 553102 578238
56777 578238 598561 609828 609622 597843 576372 548296 516563 483042 449064 416282 386165 358963
56765 358963 334160 311721 291948 274451 258466 244062 231838 221518 212093 203371 196089 190368
56753 190368 185360 180689 176958 174451 172485 170481 168586 166826 164690 162010 159323 157000 154996 153698
56739 153698 153842 155130 156077 155773 154761 153712 152406 150665 149112 148175 147406 146608 146626 148008 149796 150791
56723 150791 151380 152998 156174 160002 163286 165435 166516 167118 167976 169281 170592 171631 172646 173696 174233
56708 174233 173889 173091 172471 172196 172273 172753 173228 172894 171772 171169 172219 174528 176908 178816 180425 181834 182975
56691 182975 183944 184801 185364 185640 185940 186161 185610 184066 182390 181478 181238 181227 181589 182554 183558 183820 183433 183097
56673A83097j3J15K90P05R06N21o7k15K46R24J152M78o72j128m33L46R5o42m95
56654A85210O56J701K024J875J394O55L43R08J254P8j764k103o83M29rr30j195
56637A89843j257j666j746r54r6%j48K20P22O13M9m52r35j498j635j054m39m68
56619A79099p16m48J40L05n8m55o37p12o67m25j81k80q00j456j797j508q09l72
56601A68223m74m94J44R37J046O44N13N74J01p81j211j116j207j362o31Q59J629
56584A67394R86m2m92o91r65o63N75J784K053J820J802J659Q57L6K85J599K992
56567A80989L835M196M362M690N619P179Q812J0035J0913J1632J2119J2241J1830
56554B88452J0409P726M622K495J631J076K91j67K8K66R3l1J97K18m09j295k047
$$ plain form
56673 183097 183084 183199 183489 184194 185100 185621 185554 185339 185585 186509 187661 188139 187467 186339 185906 186252 186347 185705 185210
56654 185210 185866 187567 189591 191466 192860 193515 193858 194766 196020 196098 194334 192231 191548 191977 191968 191038 189843
56637 189843 188586 186920 185174 184220 184124 184124 183976 184196 184918 185531 185580 185128 184193 182695 181060 180006 179567 179099
56619 179099 178383 177935 178075 178380 178322 177867 177230 176518 175851 175426 175245 174965 174165 172709 170912 169404 168595 168223
56601 168223 167749 167255 167399 168336 169382 170026 170539 171113 171214 170433 169222 168106 166899 165537 164906 165765 167394
56584 167394 168380 168338 167846 167155 166190 165527 166102 167886 169939 171759 173561 175220 176077 176113 176398 177997 180989
56567 180989 184824 189020 193382 198072 203691 210870 219682 229717 240630 252262 264381 276622 288452
56554 288452 298861 306587 311209 313704 315335 316411 316702 316535 316563 316829 316922 316891 317088 317306 316897 315602 313555
56537C13555k877l720l837k974k048j967k609l477m458n293n417m942m822n267
56523B59847n117l594j712r68j450k199k633k752k533k068j789j933k216k390
56509B26493k553k549k049j455j716k775l359k823k008j680j444r35p51j241j577
56494A97578j077l55q9J34P15R09J00q04n78N21J362J581J466R63K4o83n90k27
56476B00950m04r94j355j372j137m21O83J361J208R91J361J812J774J707K008
56461B08172J890P44m08j97J032J835J707J221P00J42j27R4K22k21n94j43O66
56444B16735Q99O75P00R54R63Q35Q63P20J55j99J61M89p5r98j224q21n22l36j2
56425B19962o8r76j889j724q93n68q00q11o06p08q06k23O25P38J33m27q57j512
$$ plain form
56537 313555 310678 306958 303121 300147 298099 296132 293523 290046 285588 280295 274878 269936 265114 259847
56523 259847 254730 251136 249424 248456 247006 244807 242174 239422 236889 234821 233032 231099 228883 226493
56509 226493 223940 221391 219342 217887 216171 213396 210037 207214 205206 203526 202082 201147 200396 199155 197578
56494 197578 196501 196146 196057 196191 196906 197815 197915 197111 196533 197054 198416 199997 201463 202426 202450 201767 201177 200950
56476 200950 200546 199552 198197 196825 195688 195267 195950 197311 198519 199510 200871 202683 204457 206164 208172
56461 208172 210062 210806 210398 210201 211233 213068 214775 215996 216696 216838 216711 216805 217027 216806 216212 216069 216735
56444 216735 217634 218309 219009 219963 220926 221761 222624 223344 223499 223300 223461 223950 223875 222877 221653 220832 220310 219974 219962
56425 219962 219894 218918 217029 215305 214412 213844 213044 212233 211627 210919 210113 209890 210515 211253 211386 210959 210102 208590
56407B08590j986j654r66p36o37J00J048J264J102J678K850L486L420L466L663
56392B24688L292K508K274K695K991K986L095L029K237J412J809L039L385K367
56378B61807J194N69j26j141j716j628j712k267k428j733r39o67m53K58J246K113
56362B52377K783K998K314R44k09o11m32J66J138J989K092J646J344J248R48P04
56346B71439J155K013K246J646J062J004J123J115J100J035O69J36k09l02j7J131
56330B86346K970M058L369J967J605K263K626K411K448K833K864K627K807L097
56316C24291K556J400P14N11q1q35o29L68O92Kl76L78J615K706L679M266L966
56299C45223L360L599M442M496L622L125L446L615L339L608M665N360N147M949
$$ plain form
56407 208590 206604 204950 203984 203248 202611 202711 203759 205023 206125 207803 210653 214139 217559 221025 224688
56392 224688 227980 230488 232762 235457 238448 241434 244529 247558 249795 251207 253016 256055 259440 261807
56378 261807 263001 263570 263444 262303 260587 258959 257247 254980 252552 250819 249880 249213 248760 249018 250264 252377
56362 252377 255160 258158 260472 261416 261207 260596 260164 260330 261468 263457 265549 267195 268539 269787 270735 271439
56346 271439 272594 274607 276853 278499 279561 280565 281688 282803 283903 284938 285607 285743 285534 285232 285215 286346
56330 286346 289316 293374 296743 298710 300315 302578 305204 307615 310063 312896 315760 318387 321194 324291
56316 324291 326847 328247 328961 329472 329391 328556 327927 328295 328987 328989 328613 328991 330606 333312 336991 341257 345223
56299 345223 348583 352182 356624 361120 364742 367867 371313 374928 378267 381875 386540 391900 397047 401996
56285D01996N380N861O082O625P526P881P535P534Q293Q925Q972R234J0237J1408
56271E13489J2307J3292J4463J5380J6194J7531J9136K0216K1207K3340K6336
56260G12891K8670L0347L3099L7433M1852M5768N0670N7448O4898P2089Q0019
56249A255184Q9541R9638J09116J18243J27382J35687J42471J48223J53003J55363
56239B533851J54078J49422J41620J29703J13141R3124P1001M6899K1104m672
56229C449271k8699n0613p0415q7401j01211j12542j21806j28352j31909j33388
56219B482935j33332j31138j26740j21498j16355j10660j03848r6742r0002q2947
56209A369673p5130o7667o1687n6798n2156m7816m3929l9950l5670l1833k8854
$$ plain form
56285 401996 407376 413237 419319 425944 433470 441351 448886 456420 464713 473638 482610 491844 502081 513489
56271 513489 525796 539088 553551 568931 585125 602656 621792 642008 663215 686555 712891
56260 712891 741561 771908 805007 842440 884292 930060 980730 1038178 1103076 1175165 1255184
56249 1255184 1344725 1444363 1553479 1671722 1799104 1934791 2077262 2225485 2378488 2533851
56239 2533851 2687929 2837351 2978971 3108674 3221815 3314939 3385940 3432839 3453943 3449271
56229 3449271 3420572 3369959 3299544 3212143 3110932 2998390 2876584 2748232 2616323 2482935
56219 2482935 2349603 2218465 2091725 1970227 1853872 1743212 1639364 1542622 1452620 1369673
56209 1369673 1294543 1226876 1165189 1108391 1056235 1008419 964490 924540 888870 857037 828183
56198H28183k6137k3367k1093j9379j7453j5303j3887j3196j1972j0057q895q892
56186F38552q453o728n088m654m497l650k794k544k047p92J32K0q8O08J189R10
56170F00076O28J011J332J348K220M136N234M557L858M806O486P417P957Q865
56156F59931R538R587J0146J1840J3430J4136J5152J7155J8719J9175K0536K4352
56144H43697K9086L3006L7268M3544N0908N7790O4922P3298Q1074Q5492Q6389
56133A486474Q5020Q1018P3514O4077N5654M9444M5008M2251M0910L9228L5393
56122B097991K9361K1666J2133J561p316j2848j6782k1672k7921l5376m5196n7376
56110A938225o8633p5655p8740p9649p8107p3254o6564o0125n3705m6393l9302
$$ plain form
56198 828183 802046 778679 757586 738207 720754 705451 691564 678368 666396 656339 647444 638552
56186 638552 630099 623371 618283 613629 609132 605482 602688 600144 598097 597305 597437 597457 597369 597977 599166 600076
56170 600076 600704 601715 603047 604395 606615 610751 615985 620542 624400 629206 635692 643109 651066 659931
56156 659931 669469 679056 689202 701042 714472 728608 743760 760915 779634 798809 819345 843697
56144 843697 872783 905789 943057 986601 1037509 1095299 1160221 1233519 1314593 1400085 1486474
56133 1486474 1571494 1652512 1726026 1790103 1845757 1895201 1940209 1982460 2023370 2062598 2097991
56122 2097991 2127352 2149018 2161151 2162712 2155396 2142548 2125766 2104094 2076173 2040797 1995601 1938225
56110 1938225 1869592 1793937 1715197 1635548 1557441 1484187 1417623 1357498 1303793 1257400 1218098
56099A218098l3765k8687k2695j7098j3736j1700r103o282m329k433L30K534K764
56086A073898K413L203M136L989M328O563Q600Q134O859P474Q914Q708P880Q970
56072A164069J1237J2210J2358J3813J6046J7056J7284J8259J8999J7951J6709
56061A335991J7606J9412J9702J9424K0714K2265K1612J9981K0097K1110K0610
56050A558524J9547K0098K0796J9153J7036J7838K0315K0976K0648K2627K6029
56039A783587K7285K6728K7481K9122K8783K7303K7984L0367L1496L2151L5365
56028B107652M0026M2519M3504M6393N0376N1892N1824N4049N8006O0059O1071
56017B667371O4991P0827P3876P4298P6574Q1068Q4060Q5596Q9201R4221R6705
$$ plain form
56099 1218098 1184333 1155646 1132951 1115853 1102117 1090417 1081314 1075032 1070703 1068270 1068600 1071134 1073898
56086 1073898 1076311 1079514 1083650 1087639 1091967 1098530 1107130 1115264 1122123 1129597 1138511 1147219 1155099 1164069
56072 1164069 1175306 1187516 1199874 1213687 1229733 1246789 1264073 1282332 1301331 1319282 1335991
56061 1335991 1353597 1373009 1392711 1412135 1432849 1455114 1476726 1496707 1516804 1537914 1558524
56050 1558524 1578071 1598169 1618965 1638118 1655154 1672992 1693307 1714283 1734931 1757558 1783587
56039 1783587 1810872 1837600 1865081 1894203 1922986 1950289 1978273 2008640 2040136 2072287 2107652
56028 2107652 2147678 2190197 2233701 2280094 2330470 2382362 2434186 2488235 2546241 2606300 2667371
56017 2667371 2732362 2803189 2877065 2951363 3027937 3109005 3193065 3278661 3367862 3462083 3558788
56006C558788R7420J00839J06642J10716J13797J20396J29741J36913J42302J50659
55996D768213J61425J69700J76183J86125J99139K10315K20598K35167K52562
55987F579427K66936K80142K99351L23583L45542L66062L93073M26748M60091
55978I740955M93993N36570N87596O39469O93663P59729Q37987R20861J011393
55969A6222216J121608J252609J396837J560224J760043K000646K275528K593939
55961C0183650K979432L442410L984504M631188N427753O403964P582033R019724
55953G3654658J0799629J2976134J5586960J8701536K2342400K6290872L0016511
55946B10368700L2802110L3820770L2087321K6667049J7383702N465969o724686
$$ plain form
56006 3558788 3656208 3757047 3863689 3974405 4088202 4208598 4338339 4475252 4617554 4768213
55996 4768213 4929638 5099338 5275521 5461646 5660785 5871100 6091698 6326865 6579427
55987 6579427 6846363 7126505 7425856 7749439 8094981 8461043 8854116 9280864 9740955
55978 9740955 10234948 10771518 11359114 11998583 12692246 13451975 14289962 15210823 16222216
55969 16222216 17343824 18596433 19993270 21553494 23313537 25314183 27589711 30183650
55961 30183650 33163082 36605492 40589996 45221184 50648937 57052901 64634934 73654658
55953 73654658 84454287 97430421 113017381 131718917 154061317 180352189 210368700
55946 210368700 243170810 276991580 309078901 335745950 353129652 358595621 351870935
55939C51870935j6871181k3768051k7448481k8595686k7992423k6325425k4139192
55932A76730496k1779446j9405426j7097124j4928674j2950967j1174369r600692
55925F9793798q240396p086130o103556n262711m552930l959361l452557l011612
55917B8124545k634553k317275k043175j801124j593755j420255j268604j131451
55909A3914353j013113r14538q26794p45090o74627o17011n64646n13625m69055
55900G575854m32769l98428l63466l33643l11019k89040k64313k42175k25798
55891D715203k10277j92257j75666j63244j51541j38557j27667j19944j11170
55882C324880j00226r2240q9737q8619q6314q5809q8084q8520q4681q0369p8334
$$ plain form
55939 351870935 334999754 311231703 283783222 255187536 227195113 200869688 176730496
55932 176730496 154951050 135545624 118448500 103519826 90568859 79394490 69793798
55925 69793798 61553402 54467272 48363716 43101005 38548075 34588714 31136157 28124545
55917 28124545 25489992 23172717 21129542 19328418 17734663 16314408 15045804 13914353
55909 13914353 12901240 11986702 11159908 10414818 9740191 9123180 8558534 8044909 7575854
55900 7575854 7143085 6744657 6381191 6047548 5736529 5447489 5183176 4941001 4715203
55891 4715203 4504926 4312669 4137003 3973759 3822218 3683661 3555994 3436050 3324880
55882 3324880 3224654 3132414 3042677 2954058 2867744 2781935 2693851 2605331 2520650 2440281 2361947
55871B361947p5984p1743o8575o7750o5820o1282n7641n6638n4892n0534m6766
55860A684322m5550m4019m0543l8184l8670l8811l6458l4359l4515l4270l1586
55849A267357k9053k9041k9675k8947k8197k8361k7482k4950k3605k4627k5018
55838I68401k2997k1245k1681k1864j9786j7670j7497j7169j4667j1968j1309
55827G70548j1250r967q863r559j0572j0202r622j0136j0507r762r540j0917j2023
55814F37628j1414j0706j1246j1383r699p756p013o139m034k347k298k078k17
55801E51298J479J270P94K130M170M873M637M691M434L055J554P86l63k538m110
55786E78160l909l429m135n136n646p010r960j2569j3307j3593j4806j5474j3980
$$ plain form
55871 2361947 2285963 2214220 2145645 2077895 2012075 1950793 1893152 1836514 1781622 1731088 1684322
55860 1684322 1638772 1594753 1554210 1516026 1477356 1438545 1402087 1367728 1333213 1298943 1267357
55849 1267357 1238304 1209263 1179588 1150641 1122444 1094083 1066601 1041651 1018046 993419 968401
55838 968401 945404 924159 902478 880614 860828 843158 825661 808492 793825 781857 770548
55827 770548 759298 749331 740468 730909 720337 710135 700513 690377 679870 670108 660568 649651 637628
55814 637628 626214 615508 604262 592879 583180 575424 568411 562272 558238 555891 553593 551515 551298
55801 551298 552777 554047 554841 556971 561141 566014 570651 575342 579776 582831 584385 585171 584808 582270 578160
55786 578160 574251 570822 566687 561551 555905 548895 538935 526366 513059 499466 484660 469186 455206
55773D55206j1565r906q225n487l139k800l358l105k689l267l752k735j324j387
55759C92467k516l189l372l749m009l963m569n856n896l881k019k225l230l282
55745C40711l252m404n443m766l578l780m554m062k854k605k970k648k088k308
55731B91399k400j146K28k48j958k872k912l368m032l758k955k914l339l054k334
55716B54337k186k181j304r3K90K06O00J010P43P75K093L389K930J592J384J961
55700B65546J358o21k515l926n463o597o269n154m809n007m325k907k125j999
55686B15187j354j98M61P73J648K666K707K320K989M370M649L449K113J241K42
55671B43263q03j141j088j642k442k220j109m38l96n2N56N42K02P15J887K413
$$ plain form
55773 455206 443641 433735 425510 420023 416884 414084 410726 407621 404932 401665 397913 395178 393854 392467
55759 392467 389951 386762 383390 379641 375632 371669 367100 361244 355348 351467 349448 347223 343993 340711
55745 340711 337459 333055 327612 322846 319268 315488 310934 306872 304018 301413 298443 295795 293707 291399
55731 291399 288999 287853 288081 287833 285875 283003 280091 276723 272691 268933 265978 263064 259725 256671 254337
55716 254337 252151 249970 248666 248573 248863 249069 249669 250679 251422 252197 254290 257679 260609 262201 263585 265546
55700 265546 266904 266283 263768 259842 254379 247782 241513 236359 231550 226543 222218 219311 217186 215187
55686 215187 213833 213635 214096 214869 216517 219183 221890 224210 227199 231569 236218 239667 241780 243021 243263
55671 243263 242460 241319 240231 238589 236147 233927 232818 232380 231984 231932 232488 233030 233232 233947 235834 238247
55655B38247K304K705L359K715P86m32N2J034J333J175Q19k13j821k955l255l571
55639B42282m397n186n608o040o489o389n743n215m889m207l183k372j775j094
55625A79695q46j618k525k138q53l58q32o85O76J799J432lj626l139m069l718
55609A61192k457j717k064k595k582k387k307j980j387j171j446j495j034o56
55595A35914o69p35q20j247j581q43Q18K049K193J937J678P41j102k574k285l25
55579A33149K008L431L395K392J776K546M171N453O247P277Q478Q929Q378P455
55565B05085O259M242J632m91j803l071m589n713o272o953p819p879o754n449
55551A60425m837m574m173l891l866l472k383j374j235j653j787j336m81N61J473
$$ plain form
55655 238247 240551 243256 246615 249330 250116 249684 249736 250770 252103 253278 254097 253884 252063 249108 245853 242282
55639 242282 237885 232699 227091 221051 214562 208173 202430 197215 192326 188119 184936 182564 180789 179695
55625 179695 178849 177231 174706 172568 171715 171357 170525 169840 170516 172315 173747 173744 172118 168979 164910 161192
55609 161192 158735 157018 154954 152359 149777 147390 145083 143103 141716 140545 139099 137604 136570 135914
55595 135914 135245 134510 133690 132443 130862 130019 130837 132886 135079 137016 138694 139435 138333 135759 133474 133149
55579 133149 135157 138588 141983 144375 146151 148697 152868 158321 164568 171845 180323 189252 197630 205085
55565 205085 211344 215586 217218 216727 214924 211853 207264 201551 195279 188326 180507 172628 165874 160425
55551 160425 155588 151014 146841 142950 139084 135612 133229 131855 130620 128967 127180 125844 125363 125924 127397
55536A27397J853J622J026J99p28j169o70K01M46R7N3N39Q61P03M78K94k37r50
55518A32015j191j102j584k667l241k857k500l044m006m449m173l454k538j823
55504I3386j681j720j068K46J137R81L65M9J46O19J560K598K997K692K402K494
55488A07203K666K875L427L905L345J831P88J014J578J274K51n00m84K5M55K23
55472A29876q07j922k297k078k019k161j916j419j461j988k042j394r19j008r87
55457A05458n07j71k84k80R4K43o0k13J3L3k77k28K41J93n66q67j04O33L51l16
55437A03386m27l27o87j052o74O2K64m8k25r4J36M55P52N25k96q90o02J42N94
55418A00994O68O02M39L78Q03J372J063k64j376j439j169j426j779j486q16l50
$$ plain form
55536 127397 129250 130872 131898 132097 131369 130200 129530 129731 130177 130274 130327 130866 131727 132430 132908 133202 132965 132015
55518 132015 130824 129722 128138 125471 122230 119373 116873 113829 109823 105374 101201 97747 95209 93386
55504 93386 91705 89985 88917 89163 90300 91281 91646 91695 91841 92460 94020 96618 99615 102307 104709 107203
55488 107203 109869 112744 116171 120076 123421 125252 126040 127054 128632 129906 130157 129657 129173 129198 129653 129876
55472 129876 129069 127147 124850 122772 120753 118592 116676 115257 113796 111808 109766 108372 107453 106445 105458
55457 105458 104951 104780 104496 104216 104310 104553 104493 104280 104293 104326 104049 103821 104062 104255 103689 102822 102718 103351 103702 103386
55437 103386 102959 102632 101945 100893 100219 100281 100545 100497 100272 100178 100314 100769 101521 102046 101750 100860 100258 100400 100994
55418 100994 101662 102264 102703 103081 103884 105256 106319 106055 104679 103240 102071 100645 98866 97380 96564 96214
55402I6214M0N15M95k73q29l34N07N90J52J21M69N65N14Q28J149P33j71o27m81
55383A00177k90r0N80J515J851J321N77K30L11N82P28L34o59j583j684r73m0O30
55365A03517P49J59p50j129p68n08r45j385r00J92Q65Q59P04O55N69N12O14N04
55347A03514j99j082j311p01J50O20M29l24j028r41j74K57j34n83m14j83n84j053
55329I6259o34L53Q00M87J38Q9J09K66Q15J309R09l79j668k343k435j959q39N30
55311I1807J386J356O24m37j255j097R4J238J321O79K64P7n75j549j893j334o24
55294I0082k76j5L85O88Q69J344K079K347J696O23j25l93m86n71n48l24jJ18j16
55275I7376l68q5O56J009M40n05r40p15k26L71J056J438J176O60N28O70M58j37
$$ plain form
55402 96214 96254 96769 97264 96991 96162 95828 96335 96925 97077 97198 97667 98232 98746 99574 100723 101456 101285 100658 100177
55383 100177 99887 99797 100377 101892 103743 105064 105641 105871 106182 106764 107492 107826 107167 105584 103900 102927 102887 103517
55365 103517 104266 104425 103675 102546 101778 101270 100325 98940 98040 98232 99097 99956 100660 101315 101884 102396 103010 103514
55347 103514 103315 102233 100922 100221 100371 100991 101420 101096 100068 99127 98953 99210 99076 98493 98079 97896 97312 96259
55329 96259 95625 95978 96778 97265 97403 97492 97601 97867 98682 99991 100900 100521 98853 96510 94075 92116 91277 91807
55311 91807 93193 94549 95173 94736 93481 92384 92478 93716 95037 95716 95980 96057 95482 93933 92040 90706 90082
55294 90082 89806 89791 90176 90864 91733 93077 95156 97503 99199 99822 99697 99304 98818 98247 97699 97375 97374 97492 97376
55275 97376 97008 96923 97579 98588 99028 98523 97583 96868 96642 97013 98069 99507 100683 101343 101871 102541 102999 102862
55257A02862m71k74n0k68o05l33P14J695J428k16j847k047j228j068k041k694
55241I3557j848k61P72J242J722J894J225L63L84J052J264Q63N74M50j35r74j051
55224A01093k55L09J4n07n85m88o28p97o54k87J00M66O37L16l68q06o19k1N37
55205I7457P06L17l70o17J7R98J397J033M26r9n85q99q09m65j63K28R67J741J977
55186A03257J604R09Or14j227o62Nmk56N9N38J96p01q86j27M71K85j08k45l68
55166A01832m30J61J204J507O02l77l60J64Q8o06r42l19Q51J671J554P41R2J04
55148A07537K56j31p34p41l08l43q72q33J26R20N94l73r16p31j89L78O75M02k35
55129A04482n04q0M59M81P8k80l57j09L88P09L82k67k58P41J846K091J514P58
$$ plain form
55257 102862 102391 102117 102067 101799 101194 100861 101575 103270 104698 104482 102635 100588 99360 98292 96251 93557
55241 93557 91709 91448 92220 93462 95184 97078 98303 98666 99050 100102 101366 102229 102803 103253 103118 102144 101093
55224 101093 100838 101147 101161 100654 100069 99581 98953 98156 97502 97215 97315 97781 98418 98734 98366 97560 96941 96920 97457
55205 97457 98163 98480 98110 97493 97510 98508 99905 100938 101364 101265 100680 99781 98972 98507 98344 98572 99539 101280 103257
55186 103257 104861 105770 105776 104862 103635 102973 102978 102974 102718 102777 103315 103511 102810 101924 101797 102268 102553 102445 102200 101832
55166 101832 101402 101563 102767 104274 104876 104499 104139 104303 104391 103785 102843 102524 103375 105046 106600 107341 107433 107537
55148 107537 107793 107662 106928 106187 105879 105536 104664 103831 103957 104877 105471 105098 104182 103451 103262 103640 104315 104717 104482
55129 104482 103978 103898 104357 104838 104916 104636 104279 104170 104558 105267 105649 105382 105124 105865 107711 109802 111316 112074
55111A12074J74k75o52j038j463j677j325n67PJ57K27M40O23O82P62P61L54k62
55093A09002m20M8N40O70Q19J330J825J757J149M12j48l97l43j74l1K74Q01R79
55075A18093K95o57p58j7L56k24q86o93Q0N92N88L61J42Q0K56M25K11k78n54n84
55055A16828p89j159j201r01p99r11o06J57N76L41J39K87L3j018j927j733r02
55038A06415m52m31k27J09o4q18j444j255j69J280K193J958R64K50K53M86N83
55021A09631Q11J189J118M21j12R1M87M01J46L11O74O41K62j6j58l56m67l09j02
55002A14663m7O4L42M06J04o4K55O05N41L92N13N14j4n77m63J45N62O10N19K87
54982A19357m9jP13J520J668J204N75j20q26j049n30J12J64k39o17r48j175p06
$$ plain form
55111 112074 112248 111973 111321 110283 108820 107143 105818 105251 105258 105415 105642 106082 106705 107387 108149 108910 109264 109002
55093 109002 108582 108630 109170 109840 110659 111989 113814 115571 116720 117132 116984 116587 116244 116070 116039 116313 117114 118093
55075 118093 118388 117731 116973 116956 117312 117088 116202 115509 115589 116181 116769 117130 117272 117352 117608 118033 118244 117966 117412 116828
55055 116828 116039 114880 113679 112778 111979 111068 110462 110619 111195 111536 111675 111962 111995 110977 109050 107317 106415
55038 106415 105963 105532 105305 105414 105350 104532 103088 101833 101664 102944 105137 107095 108059 108309 108562 109048 109631
55021 109631 110442 111631 112749 113170 113058 113149 113636 114037 114183 114494 115168 115809 116071 116055 115897 115541 115074 114765 114663
55002 114663 114616 114680 115022 115428 115532 115468 115723 116328 116869 117261 117774 118288 118274 117697 117234 117379 117941 118551 119070 119357
54982 119357 119308 119307 120020 121540 123208 124412 124987 124867 124041 122992 122462 122574 122738 122499 121882 120934 119759 119053
54964A19053N61J471J006j41n36n1L84N46R72J494J253K22o47r34j122j331r56
54947A21244L6O94M00k80n79n28m64k97J73P06Q65M93k38r66j165n77L38P54M59
54928A21068Q3K65J013J879K463K654K744L216M103M789M800M567M804N436N781
54913A69665N608N241M646L285J072j208k773l637m294m995n570n733n395m788
54899A51124m244l744k918j723p74o20r56j062q30p47j022j175o45N77J832K214
54883A35287J343l8o00J61J463K422L073L794M479M973N680O789P435O701N084
54868A88046L812L021J765j73j820k602l235m489n930o540o110n352m930m809
54854A50654m497l698k601j557o36J77L83o91k700m106l780k213o38L69Q08N43
$$ plain form
54964 119053 119614 121085 122091 121950 121414 121363 121747 122293 123265 124759 126012 126234 125587 124653 123531 122200 121244
54947 121244 121280 121974 122374 122094 121515 120987 120523 120226 120399 121105 121970 122463 122225 121259 120094 119517 119855 120609 121068
54928 121068 121151 121416 122429 124308 126771 129425 132169 135385 139488 144277 149077 153644 158448 163884 169665
54913 169665 175273 180514 185160 188445 189517 188309 185536 181899 177605 172610 167040 161307 155912 151124
54899 151124 146880 143136 140218 138495 137721 137101 136145 135083 134253 133506 132484 131309 130664 131241 133073 135287
54883 135287 136630 136592 135992 136153 137616 140038 143111 146905 151384 156357 162037 168826 176261 182962 188046
54868 188046 191858 194879 196644 196471 194651 192049 188814 184325 178395 171855 165745 160393 155463 150654
54854 150654 146157 142459 139858 138301 137665 137842 138225 137534 134834 130728 126948 124735 124097 124466 125274 125817
54838A25817l31r91q23l81m33n76j0Q05P26j41o18m53n22r12n35P93J539O12r62
54819A22604j572j170q29r09q13k15M73P95P13M19R4j11r6J05L53L70r9q02r29
54800A18381p5J013J318R59Q37J063Q49N0l88N4N51K22n57q60n56j91%J95M00
54781A23265M55M33N79R30J337J704J966K001J798J548J424J507J928K749L672
54766A47296M259M481M770N397O170O698O585N507L619J800Q39M30m26j955l379
54751A92091m158m625n095n217m660l804l232l001k870k758k667k444k023j576
54737A43961j258j032q57p09m46o0J09q3m0Q58K111K582K141J797K094K435K357
54720A55960K378L022L944M665N340O013N944M514K272L38r12j895k918l899m652
$$ plain form
54838 125817 125486 124495 123672 123291 122858 122282 122272 123077 123803 123662 123044 122591 122069 121157 120622 121415 122954 123566 122604
54819 122604 121032 119862 119033 118124 117311 117096 117569 118364 119077 119496 119590 119479 119383 119488 119841 120211 120112 119310 118381
54800 118381 118306 119319 120637 121596 122433 123496 124345 124395 124007 124061 124612 124834 124277 123417 122861 122670 122670 122865 123265
54781 123265 123720 124153 124732 125662 126999 128703 130669 132670 134468 136016 137440 138947 140875 143624 147296
54766 147296 151555 156036 160806 166203 172373 179071 185656 191163 194782 196582 197421 197851 197425 195470 192091
54751 192091 187933 183308 178213 172996 168336 164532 161300 158299 155429 152671 150004 147560 145537 143961
54737 143961 142703 141671 140814 140105 139659 139599 139708 139625 139585 140443 142554 145136 147277 149074 151168 153603 155960
54720 155960 158338 161360 165304 169969 175309 181322 187266 191780 194052 194390 193478 191583 188665 184766 180114
54705A80114n023m934m638m542m550m043k931k055k096k570k539j827j027o45
54691A36694p29j067j241q83j96J11k46p48r24r77j126j020l89K34J69m10q16
54674A26436q05o02k46L24P69N78j91r36j198r92n52j15J13O4j80n52r49r97l89
54655A19580M86P61K34l53l93j52o9m4J07J68O3K30Q30J182P61J64L51J251J944
54636A27101J872J201K19q31j529j570j171p06j45N78J039P63Qm70k98L27J069
54619A27457J539J268K19r41j502j394r05j63N79P31J31m34k06M69P30M73K50
54602A28301K41K09J45J46l4m92n93J16Q21L86q48j433q79j16J33J45J52k24r51
54583A25225j151l50P13J122Q95N01P6k63n6Q02J534J406P39K86Q3l54r33j005
$$ plain form
54705 180114 175091 170157 165519 160977 156427 152384 149453 147398 145302 142732 140193 138366 137339 136694
54691 136694 135965 134898 133657 132774 132578 132689 132443 131695 130771 129794 128668 127648 127259 127493 127662 127252 126436
54674 126436 125631 125029 124783 125107 125876 126454 126263 125327 124129 123137 122585 122470 122583 122647 122467 121915 120966 119969 119580
54655 119580 120066 120827 121061 120708 120315 120163 120094 120050 120157 120325 120388 120618 121448 122630 123391 123555 123906 125157 127101
54636 127101 128973 130174 130393 129562 128033 126463 125292 124586 124441 125019 126058 126821 126829 126359 126061 126388 127457
54619 127457 128996 130264 130483 129542 128040 126646 125741 125578 126157 126888 127019 126585 126379 126848 127578 128051 128301
54602 128301 128542 128751 128896 129042 129008 128516 127923 128039 128860 129246 128398 126965 126086 125970 126103 126248 126400 126176 125225
54583 125225 124074 123724 124437 125559 126454 126955 127031 126768 126712 127514 129048 130454 131193 131479 131562 131208 130275 129270
54565A29270l51N76J362J896J864Q28q27j737j014M81J023J44q52o46M26R62L66
54548A33771n20n82L73J642K434K390J713R50N24L68K58L75J040J905K087J344
54532A50072M67J37K7m54j086j121l75N72J087R54K86o09j333j650j547j025j79
54515A44223N12N48J96J61L45j53j363j904r08N13P46j35q74r56p00m4J201K182
54497A43590J681M7j081j081r44j307j455q97m91j009j688j259K29J536J818J283
54481A38972O22L96P79J387J528J011L79J96L49M18L22L18N60R28J147R36L38
54464A50586j52j13K14K88J49K75N92M64k17p14n12j1K59L81O09Q05P97P21N80
54445A55001N9p82j282j167j156j821k523k285j306o79q12j004n79L26J217J792
$$ plain form
54565 129270 128919 129495 130857 132753 134617 135445 134618 132881 131867 132348 133371 133515 132663 132017 132443 133405 133771
54548 133771 133251 132669 133042 134684 137118 139508 141221 142171 142695 143063 143321 143696 144736 146641 148728 150072
54532 150072 150539 150676 150703 150249 149163 148042 147667 148239 149326 150280 150566 149957 148624 146974 145427 144402 144223
54515 144223 144735 145283 145479 145640 145985 145832 144469 142565 141657 142170 142916 142781 141907 140951 140251 140207 141408 143590
54497 143590 145271 145318 144237 143156 142212 140905 139450 138553 138062 137053 135365 134106 134335 135871 137689 138972
54481 138972 139594 139990 140769 142156 143684 144695 145074 145270 145619 146037 146359 146677 147237 148165 149312 150248 150586
54464 150586 150434 150321 150535 150823 150972 151247 151839 152303 152086 151372 150860 150849 151108 151489 152098 152903 153700 154421 155001
54445 155001 155060 154278 152996 151829 150673 148852 146329 144044 142738 142059 141247 140243 139664 139990 141207 142999
54429A42999J895J508R32O56P93R86Q97N70K73K34N48J096J499J425R74N54L82
54412A58221K98J07j84m46o26p24o86m24O6O00Q52O73K94O2j2j77l22N8J070J962
54392A60662J932J192O57O67O17M8n34l68L87P62K26p11j233j187j010j017j084
54375A60006r82o41j25M45R05J225J516J765J617Q98J87K69R86J279N77m55q67
54358A68605n70n7M37Q42Q12J34n66l12J071K724L660L508K627J882K041K892
54342A89730L281K590J672J596J945J473J59p88r74j455k827m010l811k718k105
54327A83758k310k542k334k075k113k170j837j185o04l36l00l14l66o50j218j741
54311A61663j859j611j282q64j96N00P45N40M03N73P59Q00R31J122Q59j3q31r82
$$ plain form
54429 142999 144894 146402 147334 147990 148783 149769 150666 151236 151509 151743 152291 153387 154886 156311 157285 157839 158221
54412 158221 158519 158626 158442 157996 157370 156646 155960 155536 155602 156202 157054 157727 158021 158083 158071 157894 157572 157630 158700 160662
54392 160662 162594 163786 164443 165110 165727 165775 165241 164873 165260 166022 166248 165537 164304 163117 162107 161090 160006
54375 160006 159024 158383 158258 158703 159608 160833 162349 164114 165731 166629 166816 167085 168071 169350 169927 169472 168605
54358 168605 168035 167978 168415 169257 170069 170203 169637 169325 170396 173120 176780 180288 182915 184797 186838 189730
54342 189730 193011 195601 197273 198869 200814 202287 202446 201658 200684 199229 196402 192392 188581 185863 183758
54327 183758 181448 178906 176572 174497 172384 170214 168377 167192 166588 166252 165952 165638 165272 164622 163404 161663
54311 161663 159804 158193 156911 156047 155851 156351 157096 157636 158039 158612 159371 160171 161102 162224 163083 163070 162239 161257
54293A61257p44o92p96o49k38J21L64O16P35N37L04N02J026J256Q62J70l51n28
54275A63752m13q1L09M89L41M8j50k51m33o62n67Q8R03J137O55J65K51N69M45
54256A66595j21o10q38r01n00O87K011K232J198J41k9J40j80p00o48j53q3p34
54238A67507j496j681j170k97L99M53r2o76r56j239j829k296j924o95O97J615
54222A56320J869J521P66J0l15q7M56Q76P37Ro45m55M40J071R51O08M72J24p12
54203A64016j228o05M94O41l62j342j532j379j363j148m16L32M71K02J50L16J27
54186A57374n76j179j083m56K4L3j22o1J19J12qJ54P25J397J840J904J447M38
54168A62082o26j062r16r49j405j513p13K72L55m08r80p55l7O81J185J300Q68
$$ plain form
54293 161257 160513 159821 159025 158376 158138 158259 158623 159239 159974 160511 160815 161317 162343 163599 164461 164631 164280 163752
54275 163752 163339 163258 163567 164056 164397 164445 164295 164044 163611 162949 162382 162470 163373 164510 165165 165330 165581 166150 166595
54256 166595 166474 165864 165026 164125 163625 164312 166323 168555 169753 169894 169865 170005 169825 169125 168477 168324 168241 167507
54238 167507 166011 164330 163160 162863 163262 163715 163623 162947 161991 160752 158923 156627 154703 154008 154705 156320
54222 156320 158189 159710 160476 160486 160171 160084 160540 161416 162153 162162 161517 161062 161502 162573 163524 164132 164604 164728 164016
54203 164016 162788 162183 162677 163318 162956 161614 160082 158703 157340 156192 155776 156108 156579 156781 156931 157247 157374
54186 157374 156798 155619 154536 154080 154104 154137 154015 153954 154073 154185 154177 154331 155056 156453 158293 160197 161644 162082
54168 162082 161456 160394 159478 158529 157124 155611 154898 155170 155525 155117 154137 153382 153345 154026 155211 156511 157379
54151A57379J16m70o80o44m52j45O2k6k02j27J75M47O90J026J241J030N78L61
54133A60359M45N11M99O19Q01P13M02K54K72k6p62j280q42N05K002K826K652J833
54115A71783J076P37N13J0o01q40o27l24j95l02p19j332j602j068r1N28N81M85
54097A68012M01N8n05p63m61P3N51J066J573J612R11j36q84r94m96K70O95L93
54079A71376j89j59O60J532J846J774J649J439J122R97J109R50K52l65j25Q82
54063A84750J913K536K766K587J926J133Q58J382K361L272L886M340M953N976
54049B24639P309Q520R255R491R225Q147N916K816j40j829j892r98k40q4M4Q94
54033B81073K290L275L403L259L493L875L761L115K477K091J632Q74J87J28P08
$$ plain form
54151 157379 157495 157025 156345 155701 155249 155104 155166 155140 154938 154811 154986 155433 156123 157149 158390 159420 159998 160359
54133 160359 160804 161315 161814 162433 163234 163947 164349 164603 164875 164849 164087 162807 161965 162470 164472 167298 169950 171783
54115 171783 172859 173596 174109 174119 173518 172678 172051 171727 171532 171230 170511 169179 167577 166509 166418 166946 167527 168012
54097 168012 168413 168471 167966 167203 166742 166815 167366 168432 170005 171617 172528 172392 171508 170514 170018 170288 170983 171376
54079 171376 171187 171028 171688 173220 175066 176840 178489 179928 181050 182047 183156 184106 184358 183993 183868 184750
54063 184750 186663 189199 191965 194552 196478 197611 198469 199851 202212 205484 209370 213710 218663 224639
54049 224639 231948 240468 249723 259214 268439 276586 282502 285318 285178 283349 281457 280459 280219 280135 280179 281073
54033 281073 283363 286638 290041 293300 296793 300668 304429 307544 310021 312112 313744 314618 314805 314933 315641
54018C15641J273J111J11j145j977k218k238k476l155m267n506o262o124n466
54004B77302n159n467n680n107m045l344l276l328k979k228j391q60j046k082
53990B31310l413m012l348j948q07m17n68q72j133j238j093q28p58r89j217j120
53974B07549p25k22L19P97R14N74K51M01O60K96n67r72m99J40L26M72J218K272
53956B13204K848K793K539K335K257K586L376L927L596K903K918L713M423M786
53942B58204N492O807P968Q349Q318Q394Q364P781O700N416L955K386J044Q9o76
53927C38591j174q85K51J359J727J797K372L332L949M112M444N259O225P025P716
53912C86100Q354Q730Q653Q127P277O389N906N979O122N705M860M510N404P395
$$ plain form
54018 315641 316914 318025 318136 316991 315014 312796 310558 308082 304927 300660 295154 288892 282768 277302
54004 277302 272143 266676 260996 255889 251844 248500 245224 241896 238917 236689 235298 234438 233392 231310
53990 231310 227897 223885 220537 218589 217782 217365 216797 215925 214792 213554 212461 211633 210875 209886 208669 207549
53974 207549 206824 206602 206921 207718 208632 209206 209457 209858 210518 210814 210247 209275 208776 208916 209242 209714 210932 213204
53956 213204 216052 218845 221384 223719 225976 228562 231938 235865 239461 242364 245282 248995 253418 258204
53942 258204 263696 270503 278471 286820 295138 303532 311896 319677 326377 331793 335748 338134 339178 339267 338591
53927 338591 337417 336532 336783 338142 339869 341666 344038 347370 351319 355431 359875 365134 371359 378384 386100
53912 386100 394454 403184 411837 419964 427241 433630 439536 445515 451637 457342 462202 466712 472116 479511
53898D79511R680J1532J2656J2955J2059R195L806l548j1152j7224k0975k2639
53886D75856k2768k1820k0127j7947j5569j3516j2319j1874j1328j0020q282o951
53874C03335o295n821n090m244l639l365l246l147l092l170l306l270k972k700
53860B49978k799l178l448l475l413l156k410j429r94j231j267n73P1k20q50n18
53844B21088O64J088j27j899k584j813m59N72R03N34j41m38L0Q17J146Q00K24
53827B20405j46l20m92o75o70k39P14J897K618K318J295O10R89J973K484K176
53811B34937J784K079K875L447L509L380L342L419L703M332N022N160M599L916
53797B85504L645L694L744L800L940L944L587L084K766K549K140J629J393J436
$$ plain form
53898 479511 489191 500723 513379 526334 538393 547588 551394 547846 536694 519470 498495 475856
53886 475856 453088 431268 411141 393194 377625 364109 351790 339916 328588 318568 310286 303335
53874 303335 297040 291219 286129 281885 278246 274881 271635 268488 265396 262226 258920 255650 252678 249978
53860 249978 247179 244001 240553 237078 233665 230509 228099 226670 225676 224445 223178 222605 222676 222456 221606 221088
53844 221088 221752 222840 222713 220814 218230 216417 215958 216530 217433 217967 217826 217388 217418 218235 219381 220181 220405
53827 220405 220259 219939 219447 218772 218102 217863 218577 220474 223092 225410 226705 227315 228304 230277 232761 234937
53811 234937 236721 238800 241675 245122 248631 252011 255353 258772 262475 266807 271829 276989 281588 285504
53797 285504 289149 292843 296587 300387 304327 308271 311858 314942 317708 320257 322397 324026 325419 326855
53783C26855J300O42l83j397k175k750l294l962m667n126n236n231n364n532n456
53768B78224n085m592m163l936l987m099l815k999k130j741j776j835j842j958
53754B34266k100k031j890k058k416k349j596p33m54p45r86p22q2M80O79N91M39
53737B18293K32j93p63j004n23M73J349J653J406R49O89Q73J316J518J234Q39
53721B28341Q27J147J332J245J272J773K573L085K822J855Q65O04J107J662J708
53706B52218J486J541J889K115K037J827J628J526J730K296K728K451J678J342
53692B78492K064L491M700M912L933K262Q04R5j27l80p01q46r61j374j897k006
53676B92461j701j452j318q17J18Q41Q27K68m22j062j452j344r34q00j024r87
$$ plain form
53783 326855 328155 328797 328414 327017 324842 322092 318798 314836 310169 305043 299807 294576 289212 283680 278224
53768 278224 273139 268547 264384 260448 256461 252362 248547 245548 243418 241677 239901 238066 236224 234266
53754 234266 232166 230135 228245 226187 223771 221422 219826 219093 218639 217894 216908 216186 216104 216584 217263 217854 218293
53737 218293 218525 218332 217569 216565 216042 216515 217864 219517 220923 221872 222561 223434 224750 226268 227502 228341
53721 228341 229168 230315 231647 232892 234164 235937 238510 241595 244417 246272 247137 247741 248848 250510 252218
53706 252218 253704 255245 257134 259249 261286 263113 264741 266267 267997 270293 273021 275472 277150 278492
53692 278492 280556 284047 288747 293659 297592 299854 300658 300753 300626 300246 299545 298699 297738 296364 294467 292461
53676 292461 290760 289308 287990 287173 287291 288132 288959 289227 288805 287743 286291 284947 284013 283213 282189 281202
53660B81202l80L01N99P42R23O42m50j623j865j240o74n74n05j63J49J13j38l60
53642B76699m48k82L13J209J997K422K596K652K496K010J315P44O50J181K039
53627B97593K588K456K029K003K522L062L207L151L269L488L416K985K658K877
53613C37304L489L904L801L391K956K516K207K589L914N281N326L915K382J773
53599C84748J671J268Q28J180K266L123L186K713K068J435J182J640K334K328
53585D11970J512P72N98L55n81j797k603l118l831m509m480l813l324l394l561
53570C80196l415l167l002k518j363l8N37J56m75p62r10j323j681j220J14J283
53554C62412J305M34k24m0O72J408K033K488K538K195J949K196K790L511M500
$$ plain form
53660 281202 280822 281123 281722 282464 283387 284029 283579 281956 280091 278851 278177 277603 277098 276935 277084 277197 277059 276699
53642 276699 276251 275969 276282 277491 279488 281910 284506 287158 289654 291664 292979 293723 294373 295554 297593
53627 297593 300181 302637 304666 306669 309191 312253 315460 318611 321880 325368 328784 331769 334427 337304
53613 337304 340793 344697 348498 351889 354845 357361 359568 362157 366071 371352 376678 380593 382975 384748
53599 384748 386419 387687 388515 389695 391961 395084 398270 400983 403051 404486 405668 407308 409642 411970
53585 411970 413482 414254 414852 415207 414626 412829 410226 407108 403277 398768 394288 390475 387151 383757 380196
53570 380196 376781 373614 370612 368094 366731 366693 367230 367386 366911 366149 365239 363916 362235 361015 361129 362412
53554 362412 363717 364151 363927 363887 364559 365967 368000 370488 373026 375221 377170 379366 382156 385667 390167
53539C90167N760O657O579N889N527N776O164O537P357Q741J0007J0573J0674
53526D86408J0760J0773J0617J0749J1621J2795J3457J3619J4119J5365J6806
53515F27089J7818J8558J9547K0839K1998K2697K3052K3355K3756K4147K4327
53504H67183K4234K4057K3989K3989K3799K3239K2341K1275K0255J9512J9135
53493A113008J8952J8662J8112J7385J6671J6172J6047J6280J6670J7093J7619
53482A302671J8230J8589J8360J7642J6757J5711J4154J1876R080O202L702J905
53470A454879O94o08k688n552q591j1174j2898j3610j3659j3888j4756j5579j5477
53457A327093j4913j5332j7123j8994j9806j9982k0457k1070k0999k0194j9383
$$ plain form
53539 390167 395927 402584 409163 415052 420579 426355 432519 439056 446413 455154 465161 475734 486408
53526 486408 497168 507941 518558 529307 540928 553723 567180 580799 594918 610283 627089
53515 627089 644907 663465 683012 703851 725849 748546 771598 794953 818709 842856 867183
53504 867183 891417 915474 939463 963452 987251 1010490 1032831 1054106 1074361 1093873 1113008
53493 1113008 1131960 1150622 1168734 1186119 1202790 1218962 1235009 1251289 1267959 1285052 1302671
53482 1302671 1320901 1339490 1357850 1375492 1392249 1407960 1422114 1433990 1443070 1449272 1452974 1454879
53470 1454879 1455573 1454965 1452277 1446725 1438134 1426960 1414062 1400452 1386793 1372905 1358149 1342570 1327093
53457 1327093 1312180 1296848 1279725 1260731 1240925 1220943 1200486 1179416 1158417 1138223 1118840
53446A118840j8893j8355j7451j6247j4819j3191j1574j0138q685p046n619m842
53434I71980m336l284j623j54O42J177K057L373M924O528P928Q898R671J0849
53420A018630J2643J4606J6221J7418J8311J8996J9800K1248K3441K5781K7725
53409A234820K9417L1287L3252L4822L5866L6894L8486M0666M2922M4775M6213
53398A649420M7599M9114N0530N1576N2380N3225N4086N4718N5066N5207N4962
53387B227883N4060N2689N1379N0187M8449M5616M1924L8089L4635L1692K8996
53376B705599K5855K1571J6267J0963O442K308k423q094j4217k0299k6291l2173
53364B685508l7626m2254m5916m8682n0655n1904n2474n2378n1735n0871n0089
$$ plain form
53446 1118840 1099947 1081592 1064141 1047894 1033075 1019884 1008310 998172 989487 982441 976822 971980
53434 971980 967644 964360 962737 962583 963225 964402 966459 969832 974756 981284 989212 998110 1007781 1018630
53420 1018630 1031273 1045879 1062100 1079518 1097829 1116825 1136625 1157873 1181314 1207095 1234820
53409 1234820 1264237 1295524 1328776 1363598 1399464 1436358 1474844 1515510 1558432 1603207 1649420
53398 1649420 1697019 1746133 1796663 1848239 1900619 1953844 2007930 2062648 2117714 2172921 2227883
53387 2227883 2281943 2334632 2386011 2436198 2484647 2530263 2572187 2610276 2644911 2676603 2705599
53376 2705599 2731454 2753025 2769292 2780255 2786697 2789005 2786582 2778488 2764271 2743972 2717681 2685508
53364 2685508 2647882 2605628 2559712 2511030 2460375 2408471 2355997 2303619 2251884 2201013 2150924
53353B150924m9266m7944m5938m3736m2084m1300m1144m1323m1768m2272m2189
53342A671960m0941l8780l6616l5002l3601l1872k9905k8241k7012k5705k3729
53331A320556k1083j8413j6509j5673j5437j5132j4671j4517j4806j4965j4503
53320A144847j3641j2765j1703j0167q487p193o088m543k594r85n5O58J675L086
53306A072045M857O876Q622R572J0110J1251J3200J5013J6081J7059J8739K0808
53294A224233K2451K3617K4868K6348K7648K8436K8559K7746K5903K3609K1703
53283A505121K0385J9079J7219J4758J1993R253O679M047R57k532n678p840r340
53270A584101j1113j3623j6420j8719k0119k0885k1703k3058k4612k5477k5324
$$ plain form
53353 2150924 2101658 2053714 2007776 1964040 1921956 1880656 1839512 1798189 1756421 1714149 1671960
53342 1671960 1631019 1592239 1555623 1520621 1487020 1455148 1425243 1397002 1369990 1344285 1320556
53331 1320556 1299473 1281060 1264551 1248878 1233441 1218309 1203638 1189121 1174315 1159350 1144847
53320 1144847 1131206 1118441 1106738 1096571 1088084 1080891 1074803 1070260 1067666 1066681 1066626 1067284 1068959 1072045
53306 1072045 1076902 1083778 1092400 1101972 1112082 1123333 1136533 1151546 1167627 1184686 1203425 1224233
53294 1224233 1246684 1270301 1295169 1321517 1349165 1377601 1406160 1433906 1459809 1483418 1505121
53283 1505121 1525506 1544585 1561804 1576562 1588555 1597808 1604487 1608534 1609491 1606959 1601281 1593441 1584101
53270 1584101 1572988 1559365 1542945 1524226 1504107 1483222 1461519 1438461 1413849 1388372 1363048
53259A363048k4937k5358k6720k8234k9097k9007k8154k7094k6463k6360k6178
53248A065446k5434k4457k3848k3627k3470k3487k3954k4452k4140k2960k1755
53237H03862k1012k0221j8885j7388j6311j5385j3836j1603r594q627q588q821
53225F33591r003r335r955j0575j0913j1188j1846j2850j3657j3927j3846j3583
53213D92913j2926j1710j0259r029q150p592p454p590p420o677o025o236o943
53200C84902p045o314n773o223p110p316o512n289m278l649l314l203l252l353
53186C12271l351l133k710k255j937j845k026k417k644k203j166l79m89j006r32
53171B83778k29R3n63j566k032j900j598j172m45K46J92p03j573j496n35K92O4
$$ plain form
53259 1363048 1338111 1312753 1286033 1257799 1228702 1199695 1171541 1144447 1117984 1091624 1065446
53248 1065446 1040012 1015555 991707 968080 944610 921123 897169 872717 848577 825617 803862
53237 803862 782850 762629 743744 726356 710045 694660 680824 669221 659627 651000 642412 633591
53225 633591 624588 615253 605298 594723 583810 572622 560776 547926 534269 520342 506496 492913
53213 492913 479987 468277 458018 448989 440839 433247 425793 418203 410783 404106 398081 391845 384902
53200 384902 377857 371543 365770 359547 352437 345121 338609 333320 329042 325393 322079 318876 315624 312271
53186 312271 308920 305787 303077 300822 298885 297040 295014 292597 289953 287750 286584 286205 285716 284710 283778
53171 283778 283549 283642 283079 281513 279481 277581 275983 274811 274366 274612 274804 274101 272528 271032 270497 270789 270853
53154B70853j092k158k331j870j640j988k387k239j613r57m26J31P19J095J136
53139B55233J020R78J033J056R41O70L01p3l61m99m73l22j40j9oj44m85r76j297
53120B56437j002N4J460K485K647K079J322P85M60J35k16m08l39j37J6N7o1m14
53102B65360j028j763k375k648k458j922j420j265j326j212p97l09N7K12o7q77
53086B46162j564j186J50J093P46j72m84k08o1L5O68J475J340K63l45K77J038
53069B49227O01o94j392q78J24O18K39o69j284q26N53J620J329P6q53q17k27L60
53051B47107P46P30J28o45p00J94J087R30j90j225j371o89K39Q40Q33L34k55o22
53033B47471p93q86p99m03J08M27N69P41Q16M71q3r8O68J384J132J29o01n63k06
$$ plain form
53154 270853 269761 267603 265272 263402 261762 259774 257387 255148 253535 252578 252152 252283 253002 254097 255233
53139 255233 256253 257231 258264 259320 260261 260931 261232 261159 260798 260299 259826 259504 259364 259345 259339 259195 258710 257734 256437
53120 256437 255435 255489 256949 259434 262081 264160 265482 266267 266727 266862 266646 266238 265899 265762 265778 265835 265774 265360
53102 265360 264332 262569 260194 257546 255088 253166 251746 250481 249155 247943 247146 246837 246894 247106 247039 246162
53086 246162 244598 243412 243562 244655 245401 245229 244745 244537 244476 244511 245179 246654 247994 248257 247912 248189 249227
53069 249227 249828 249134 247742 246864 246988 247606 247845 247176 245892 245066 245619 247239 248568 248644 247791 246974 246747 247107
53051 247107 247853 248583 248711 248066 247366 247560 248647 249577 249387 248162 246791 246102 246341 247181 248014 248348 248093 247471
53033 247471 246678 245792 244993 244590 244698 245125 245694 246435 247251 247722 247639 247541 248209 249593 250725 250854 250253 249690 249484
53014B49484JK06P39J430J732J276K08r05j406j067l00L24P14J079J290J009M12
52997B56226J13J91N5m83p23j82N37O49L60L83P40Q87P37O68O92M84J50J51M31
52978B62066M79L19N61J273J679J361R66J191J745J943J831J961K265J974P62
52963B82376o08j086o07j83o42j500j434O6J931K672J976O80m69j363k020k288
52947B77501k204j994j555n90N77R70J71j015j519j173o00l39n87j348k282k773
52931B61240k557k149k106k213j885j156o32n00k53M69J266J502J083M87J87L09
52915B53092O39Q50O88J55n08j011j204j091p53l57j02j19k95l79k55p3J5J49
52897B49441N43R92R61K93m86q14p45o91p44o99m96k09K94J116J826J735Q03k02
$$ plain form
53014 249484 249485 249691 250430 251860 253592 254868 255076 254171 252765 251698 251398 251722 252436 253515 254805 255814 256226
52997 256226 256339 256530 256585 256102 255379 255197 255734 256383 256743 257126 257866 258753 259490 260158 260850 261334 261484 261635 262066
52978 262066 262545 262864 263425 264698 266377 267738 268704 269895 271640 273583 275414 277375 279640 281614 282376
52963 282376 281768 280682 280075 279892 279250 277750 276316 276382 278313 280985 282961 283641 283172 281809 279789 277501
52947 277501 275297 273303 271748 271158 271735 272705 272876 271861 270342 269169 268569 268230 267643 266295 264013 261240
52931 261240 258683 256534 254428 252215 250330 249174 248542 248042 247789 248258 249524 251026 252109 252596 252783 253092
52915 253092 253731 254581 255269 255424 254916 253905 252701 251610 250857 250500 250398 250279 249984 249605 249350 249277 249292 249441
52897 249441 249984 250976 251937 252230 251744 250930 250185 249494 248750 248051 247555 247346 247640 248756 250582 252317 253120 252918
52879B52918n82m11j71j30k59m28m61k38J07K98L55O43J354K200K722K749K423
52862B63089J985J634J410J142O83J24l56p27r45p77j85K30k51j491k568k874
52846B60123k702k594k682k800k841k756k533k316k190j860r92M9L84k69j128
52831B32893j269n91L16R24J091J000R60J017Q23J67m99n91l09k85m67k49K35
52814B35166K2j085j874j298J73J406K037K330K291J798J186R03Q78P51M08j58
52798B44934j029j907k093j558j338k095k891k416q84K97N21M75P46J071J067
52783B32900Q25N17J12k43k18J61M17K85K7L9M83J289K088K236J407J25o91p23
52765B41036m15k77n24j193k068k503j935o46M23P47O84Q08J170J329Q97K6n96
$$ plain form
52879 252918 252336 251925 251754 251624 251365 250937 250476 250238 250345 250643 250998 251641 252995 255195 257917 260666 263089
52862 263089 265074 266708 268118 269260 269943 270067 269711 268984 268039 267262 267077 267307 267056 265565 262997 260123
52846 260123 257421 254827 252145 249345 246504 243748 241215 238899 236709 234849 233857 233906 234290 234021 232893
52831 232893 231624 231033 231349 232273 233364 234364 235324 236341 237164 237331 236832 236241 235932 235647 235180 234931 235166
52814 235166 235188 234103 232229 230931 231104 232510 234547 236877 239168 240966 242152 243055 243933 244684 245092 244934
52798 244934 243905 241998 239905 238347 237009 234914 232023 229607 228723 229020 229541 230016 230762 231833 232900
52783 232900 233725 234242 234354 234111 233893 234054 234471 234756 234783 234822 235305 236594 238682 240918 242325 242450 241759 241036
52765 241036 240621 240344 239820 238627 236559 234056 232121 231475 231898 232645 233329 234137 235307 236636 237533 237559 236963
52748B36963m24J68K53k63k31J142K896L380K407J334J189J641J952J954J857
52733B56218J780J881K310K768K577J551L46k93k81m4L7j60n33q38r68j141j563
52716B63647j989k006j663j355j107n06N28J369J316L27r75j833j894j415r90
52701B51454r46j111j222j183p81K42J493J886R40l25o08K5M95M00L08N59P72
52684B52398P01O68Q93J076Q77L28k71n14j41M52L75m91r91k96O39M60l61l05
52666B55497N39N58n94j294n74L73K98k20j03M07N66O22J134J657J519J150J420
52649B62955K113K331J949J547J225O40l3l14l84q46j633k081k018j840j636j041
52633B60934m0R10J603K162K473K272J834J881K611L368L384K422P30j177k640
$$ plain form
52748 236963 236539 236707 236960 236697 236466 237608 240504 243884 246291 247625 248814 250455 252407 254361 256218
52733 256218 257998 259879 262189 264957 267534 269085 269431 269138 268857 268813 268850 268690 268157 267319 266351 265210 263647
52716 263647 261658 259652 257989 256634 255527 255021 255549 256918 258234 258561 257586 255753 253859 252444 251454
52701 251454 250508 249397 248175 246992 246211 246453 247946 249832 250772 250447 249839 249864 250359 250759 251067 251626 252398
52684 252398 253099 253767 254660 255736 256613 256941 256670 256156 256015 256467 256842 256351 255360 255064 255703 256163 255802 255497
52666 255497 256036 256594 256000 254706 254132 254505 254803 254583 254480 254887 255453 256075 257209 258866 260385 261535 262955
52649 262955 265068 267399 269348 270895 272120 272760 272727 272413 272029 271183 269550 267469 265451 263611 261975 260934
52633 260934 260894 261804 263407 265569 268042 270314 272148 274029 276640 280008 283392 285814 286544 285367 282727
52618B82727l258l198k835k262j479q02n41m61j59K25K49o3l40n67r82j324j010
52601B63920j23N07L94m8k42j18J14L36M20K29k6J39P57J265J251J018J050J307
52583B72150J367J043N03n9n64r15r59n89J81J161J970K236J905J285O48o2r73
52566B80328j838k094j509o40l35p43j163j054q25j158j839j932j139k35N6l7
52550B63843Q4M92Q71J074J036O01r6m50j33L18K08l27o92p85q87q97n00K7L4
52531B63821m18n47m9M44L55p1l01k21L5M57R66J197Q89K78k20m51m16M9J036
52512B66833K174K819K789K599K843L415L572K874J792J134R61N60m61j578k097
52497B90229k028j825j661j476j456j824k366k620k459k054j421n94K0P4q5P6
$$ plain form
52618 282727 279469 276271 273436 271174 269695 268893 268352 267891 267732 267957 268206 268143 267803 267236 266254 264930 263920
52601 263920 263797 264304 264698 264650 264408 264290 264404 264740 265160 265389 265363 265502 266259 267524 268775 269793 270843 272150
52583 272150 273517 274560 275063 275004 274440 273525 272566 271977 272158 273319 275289 277525 279430 280715 281363 281301 280328
52566 280328 278490 276396 274887 274247 273912 273169 272006 270952 270127 268969 267130 265198 264059 263824 263880 263843
52550 263843 263927 264419 265290 266364 267400 268001 267905 267455 267322 267640 267848 267521 266829 266044 265157 264260 263760 263787 263821
52531 263821 263403 262856 262807 263251 263606 263535 263234 263013 263048 263505 264471 265668 266557 266835 266615 266164 265748 265797 266833
52512 266833 269007 271826 274615 277214 280057 283472 287044 289918 291710 292844 293805 294365 293904 292326 290229
52497 290229 288201 286376 284715 283239 281783 279959 277593 274973 272514 270460 269039 268445 268465 268539 268454 268530
52481B68530K96j04q67q07N55K190K879K596K082J685J255P81M33K26J42L44Q51
52464B83067J260J284J338J987K968L389K936K242J830J365L27r53j574j303r58
52449B99205j387k439l256l362l076k826k546j938j093n19n53r68j204r59m82
52434B72597k39l25l54j52j67p89j466j237j62N77L29n7M50J548K168K039J789
52417B76549J725J555J227J128J313J428J581K438M157N922O980P533Q234R236
52403C31006J0106J0310R451P416M552J340k103n735q745r852q847p106n987n362
52389C20444m411l235k655k774k749k032r76o2O98J338J599J413J265J586K173
52374C11622K541K676K970L603M366N037N529N676N202M133K871J803R44K04l03
$$ plain form
52481 268530 268826 268722 267855 267048 267603 269793 272672 275268 277350 279035 280290 281071 281504 281730 281872 282216 283067
52464 283067 284327 285611 286949 288936 291904 295293 298229 300471 302301 303666 303993 303040 301466 300163 299205
52449 299205 297818 295379 292123 288761 285685 282859 280313 278375 277282 276763 276210 275242 274038 273079 272597
52434 272597 272358 272033 271679 271527 271360 270571 269105 267868 267706 268283 268612 268555 269005 270553 272721 274760 276549
52417 276549 278274 279829 281056 282184 283497 284925 286506 288944 293101 299023 306003 313536 321770 331006
52403 331006 341112 351422 360873 368289 372841 374181 372078 366343 357598 347746 338899 331793 325806 320444
52389 320444 316033 312798 310143 307369 304620 302588 301612 301550 302248 303586 305185 306598 307863 309449 311622
52374 311622 314163 316839 319809 323412 327778 332815 338344 344020 349222 353355 356226 358029 358973 359177 358874
52359C58874m23k77n9K60P32J020P24M8l43k02R1L19P95J707K692L398L915M164
52341C77435L644K419J724K618M472N765O148O626P779Q996R630R910J0380J1226
52327D68772J2507J4242J5942J6838J6988J7380J8557J9838K0357K0079J9313
52316F60813J8045J6512J5614J5941J6821J7198J6966J6662J6323J5614J4798
52305H41307J4531J4722J4575J3770J2832J2184J1565J0681R706Q820P761O185
52293I78639M148J960j80k241m146n713o647o756o305o001o291o764o611n604
52279I21488m212k866j513K4J710L383M875O033O865P707Q906J0312J1441J2145
52265I86298J2716J3265J3440J2954J2112J1548J1657J2352J3181J3577J3207
$$ plain form
52359 358874 358451 358174 358115 358375 359107 360127 360851 360899 360556 360354 360445 360764 361559 363266 365958 369356 373271 377435
52341 377435 381079 383498 385222 387840 392312 398077 404225 410851 418630 427626 437256 447166 457546 468772
52327 468772 481279 495521 511463 528301 545289 562669 581226 601064 621421 641500 660813
52316 660813 678858 695370 710984 726925 743746 760944 777910 794572 810895 826509 841307
52305 841307 855838 870560 885135 898905 911737 923921 935486 946167 955873 964693 972454 978639
52293 978639 982787 984747 984567 982326 978180 972467 965820 959064 952759 946758 940467 933703 927092 921488
52279 921488 917276 914410 912897 912921 914631 918014 922889 928922 935787 943494 952400 962712 974153 986298
52265 986298 999014 1012279 1025719 1038673 1050785 1062333 1073990 1086342 1099523 1113100 1126307
52254A126307J2273J1392J1068J1280J1517J1071R469O829L831J150j031k812
52242A212344m137m927n475o234p194p892q068p978p894p736p360o878o456o036
52228A118079n441m663l843l133k591k104j448n57L22J009J687K537L210L269
52214A106333L090L610M961O078O112N600N631O326O889O916O858P142P507P521
52200A190574P234P020O980O828O332N693N381N637O182O475O317N943N518M858
52186A276972L812K583J355j09j959l631m418m620n372p092q780r272q705q107
52172A222657q014q110q039p790p264o121m403k755j703j024j54J004K121L008
52158A173413L701M093L905L111K056J077K78k89n26n44o68r80j156j008q83j178
$$ plain form
52254 1126307 1138580 1149972 1161040 1172320 1183837 1194908 1204377 1211206 1215037 1216187 1215156 1212344
52242 1212344 1208207 1203280 1197805 1191571 1184377 1176485 1168417 1160439 1152545 1144809 1137449 1130571 1124115 1118079
52228 1118079 1112638 1107975 1104132 1100999 1098408 1096304 1094856 1094299 1094621 1095630 1097317 1099854 1103064 1106333
52214 1106333 1109423 1113033 1117994 1124072 1130184 1135784 1141415 1147741 1154630 1161546 1168404 1175546 1183053 1190574
52200 1190574 1197808 1204828 1211808 1218636 1224968 1230661 1236042 1241679 1247861 1254336 1260653 1266596 1272114 1276972
52186 1276972 1280784 1283367 1284722 1284613 1282654 1279023 1274605 1269985 1264613 1257521 1248741 1239469 1230764 1222657
52172 1222657 1214643 1206533 1198494 1190704 1183440 1177319 1172916 1170161 1168458 1167434 1167280 1168284 1170405 1173413
52158 1173413 1177114 1181207 1185112 1188223 1190279 1191356 1191634 1191345 1190819 1190275 1189607 1188627 1187471 1186463 1185580 1184402
52142A184402j653j721j336j119j466k021k230k034j721j300m52J004K891M895
52128A176139O775Q454J0127J2175J4744J7443J9773K1743K3671K5493K6805K7675
$$ plain form
52142 1184402 1182749 1181028 1179692 1178573 1177107 1175086 1172856 1170822 1169101 1167801 1167349 1168353 1171244 1176139
52128 1176139 1182914 1191368 1201495 1213670 1228414 1245857 1265630 1287373 1311044 1336537 1363342 1391017
$$ [...]
##END NTUPLES=NMR SPECTRUM
##END=
