
##TITLE=AC1303_PERAH12115_6641754_p1tBAZZZUx
##JCAMPDX= 6.0         $$ Bruker NMR JCAMP-DX V2.0
##DATA TYPE= NMR SPECTRUM
##DATA CLASS= NTUPLES
##ORIGIN= BRUKER
##OWNER= Administrator
$$ 1.72 TOPSPIN		Version 2.1
$$ 2012-08-09 14:53:21.281 -0500  Administrator@TOPSPIN
$$ Compression mode = diff/dup
##.OBSERVE FREQUENCY= 400.02188249412
##.OBSERVE NUCLEUS= ^1H
##.ACQUISITION MODE= SIMULTANEOUS (DQD)
##.ACQUISITION SCHEME= undefined
##.AVERAGES= 8
##.DIGITISER RES= 22
##SPECTROMETER/DATA SYSTEM= spect
##.PULSE SEQUENCE= zg30
##.SOLVENT NAME= COFFEE_meoh
##.SHIFT REFERENCE= INTERNAL, COFFEE_meoh, 1, 14.98509
##AUDIT TRAIL= $$ (NUMBER, WHEN, WHO, WHERE, PROCESS, VERSION, WHAT)
$$ ##TITLE= Audit trail, TOPSPIN		Version 2.1
$$ ##JCAMPDX= 5.01
$$ ##ORIGIN= Bruker BioSpin GmbH
$$ ##OWNER= Administrator
$$ $$ C:\Bruker\TOPSPIN/data/COFFEE/nmr/AC1303_PERAH12115_6641754_p1tBAZZZUx/20/pdata/1/auditp.txt
$$ ##AUDIT TRAIL=  $$ (NUMBER, WHEN, WHO, WHERE, PROCESS, VERSION, WHAT)
(   1,<2012-08-09 14:53:11.140 -0500>,<Administrator>,<TOPSPIN>,<go>,<TOPSPIN 2.1>,
      <created by zg
	started at 2012-08-09 14:52:04.562 -0500,
	POWCHK enabled, PULCHK disabled,
       configuration hash MD5:
       6B 1B 68 BB D9 2E 58 E2 7F 35 AD 54 07 DF 0E 41
       data hash MD5: 64K
       C1 95 95 38 80 9E CD FE 98 17 AD CE 66 3E B3 9F>)
(   2,<2012-08-09 14:53:14.609 -0500>,<Administrator>,<TOPSPIN>,<proc1d>,<TOPSPIN 2.1>,
      <Start of raw data processing
       efp LB = 0 FT_mod = 6 PKNL = 1 PHC0 = 0 PHC1 = 0 SI = 32K 
       data hash MD5: 32K
       C5 70 75 CC 2C 30 9C CC 69 FF D3 F2 4D 0A 8B 1E>)
(   3,<2012-08-09 14:53:14.968 -0500>,<Administrator>,<TOPSPIN>,<proc1d>,<TOPSPIN 2.1>,
      <pk PHC0 = 173.941 PHC1 = 0 
       data hash MD5: 32K
       9D D8 A1 7C A5 CF E0 69 98 71 96 39 54 D9 73 E3>)
(   4,<2012-08-09 14:53:15.140 -0500>,<Administrator>,<TOPSPIN>,<proc1d>,<TOPSPIN 2.1>,
      <abs ABSG = 1 
       data hash MD5: 32K
       BE A8 3A 08 FE 30 DD 56 97 8B 7C 03 30 B8 A9 81>)
(   5,<2012-08-09 14:53:15.296 -0500>,<Administrator>,<TOPSPIN>,<proc1d>,<TOPSPIN 2.1>,
      <abs ABSG = 2 
       data hash MD5: 32K
       FA D6 7E DB D3 D4 59 9B 36 F4 5F E5 69 E7 22 AA>)
(   6,<2012-08-09 14:53:15.359 -0500>,<Administrator>,<TOPSPIN>,<proc1d>,<TOPSPIN 2.1>,
      <abs ABSG = 3 
       data hash MD5: 32K
       B4 5D 16 EE 99 65 23 01 E1 EC 75 0C 1F BF F1 A1>)
(   7,<2012-08-09 14:53:15.406 -0500>,<Administrator>,<TOPSPIN>,<proc1d>,<TOPSPIN 2.1>,
      <abs ABSG = 4 
       data hash MD5: 32K
       77 04 20 72 6B 6E EB 22 0C B1 9F CE A9 2A A2 5A>)
(   8,<2012-08-09 14:53:15.453 -0500>,<Administrator>,<TOPSPIN>,<proc1d>,<TOPSPIN 2.1>,
      <abs ABSG = 5 
       data hash MD5: 32K
       F2 7B 80 77 68 BC 3D 58 02 31 CF 4C C4 02 44 54>)
$$ ##END=
$$ 
$$ $$ hash MD5
$$ $$ 80 CD 64 E9 C9 6E C8 3A 64 C1 F0 F0 36 0B EE AC
##$RELAX= 
##$RELAX= 
##$RELAX= 
##$RELAX= 
##$RELAX= 
##$RELAX= 
##$RELAX= 
$$ Bruker specific parameters
$$ --------------------------
$$ [...]
##$TP= (0..7)
150 150 150 150 150 150 150 150
##$TP07= 0
##$TPNAME0= <>
##$TPNAME1= <>
##$TPNAME2= <>
##$TPNAME3= <>
##$TPNAME4= <>
##$TPNAME5= <>
##$TPNAME6= <>
##$TPNAME7= <>
##$TPOAL= (0..7)
0.5 0.5 0.5 0.5 0.5 0.5 0.5 0.5
##$TPOFFS= (0..7)
0 0 0 0 0 0 0 0
##$TUNHIN= 0
##$TUNHOUT= 0
##$TUNXOUT= 0
##$USERA1= <user>
##$USERA2= <user>
##$USERA3= <user>
##$USERA4= <user>
##$USERA5= <user>
##$V9= 5
##$VALIST= <valist>
##$VCLIST= <CCCCCCCCCCCCCCC>
##$VD= 0
##$VDLIST= <DDDDDDDDDDDDDDD>
##$VPLIST= <PPPPPPPPPPPPPPP>
##$VTLIST= <TTTTTTTTTTTTTTT>
##$WBST= 1024
##$WBSW= 4
##$XGAIN= (0..3)
0 0 0 0
##$XL= 0
##$YL= 0
##$YMAX_a= 494698
##$YMIN_a= -622581
##$ZGOPTNS= <>
##$ZL1= 120
##$ZL2= 120
##$ZL3= 120
##$ZL4= 120
##$ABSF1= 14.98509
##$ABSF2= -5.573092
##$ABSG= 5
##$ABSL= 3
##$ALPHA= 0
##$AQORDER= 0
##$ASSFAC= 0
##$ASSFACI= 0
##$ASSFACX= 0
##$ASSWID= 0
##$AUNMP= <proc_prof1d_extract_pilot.lims>
##$AXLEFT= 0
##$AXNAME= <>
##$AXNUC= <1H>
##$AXRIGHT= 0
##$AXTYPE= 0
##$AXUNIT= <>
##$AZFE= 0.1
##$AZFW= 0.1
##$BCFW= 0
##$BC_mod= 0
##$BYTORDP= 0
##$COROFFS= 0
##$CY= 15
##$DATMOD= 1
##$DC= 0
##$DFILT= <>
##$DTYPP= 0
##$F1P= 0
##$F2P= 0
##$FCOR= 0.5
##$FTSIZE= 32768
##$FT_mod= 6
##$GAMMA= 0
##$GB= 0
##$INTBC= 1
##$INTSCL= 1
##$ISEN= 128
##$LB= 0
##$LEV0= 0
##$LPBIN= 0
##$MAXI= 10000
##$MC2= 0
##$MEAN= 0
##$ME_mod= 0
##$MI= 0
##$NCOEF= 0
##$NC_proc= -8
##$NLEV= 6
##$NOISF1= 0
##$NOISF2= 0
##$NSP= 0
##$NTH_PI= 0
##$NZP= 0
##$OFFSET= 14.98509
##$PC= 1
##$PHC0= 173.941
##$PHC1= 0
##$PH_mod= 1
##$PKNL= yes
##$PPARMOD= 0
##$PPDIAG= 0
##$PPIPTYP= 0
##$PPMPNUM= 2147483647
##$PPRESOL= 1
##$PSCAL= 4
##$PSIGN= 0
##$PYNMP= <proc.py>
##$REVERSE= no
##$SF= 400.02
##$SI= 32768
##$SIGF1= 0
##$SIGF2= 0
##$SINO= 400
##$SIOLD= 32768
##$SPECTYP= <>
##$SREGLST= <1H.CDCl3>
##$SSB= 0
##$STSI= 32768
##$STSR= 0
##$SW_p= 8223.68421052631
##$SYMM= 0
##$S_DEV= 0
##$TDeff= 65536
##$TDoff= 0
##$TI= <>
##$TILT= no
##$TM1= 0
##$TM2= 0
##$TOPLEV= 0
##$USERP1= <user>
##$USERP2= <user>
##$USERP3= <user>
##$USERP4= <user>
##$USERP5= <user>
##$WDW= 1
##$XDIM= 32768
##$YMAX_p= 465321397
##$YMIN_p= -688319
##$CURPLOT= <Network HP LaserJet P1505>
##$CURPRIN= <$Network HP LaserJet P1505>
##$DFORMAT= <normdp>
##$LAYOUT= <+/1D_H.xwp>
##$LFORMAT= <normlp>
##$PFORMAT= <normpl>
##$SURQMSG= 1
$$ End of Bruker specific parameters
$$ ---------------------------------
##NTUPLES= NMR SPECTRUM
##VAR_NAME=  FREQUENCY,     SPECTRUM/REAL,   SPECTRUM/IMAG
##SYMBOL=    X,             R,               I
##VAR_TYPE=  INDEPENDENT,   DEPENDENT,       DEPENDENT
##VAR_FORM=  AFFN,          ASDF,            ASDF
##VAR_DIM=   32768,         32768,           32768
##UNITS=     HZ,            ARBITRARY UNITS, ARBITRARY UNITS
##FACTOR=    0.250966925370066, 1,           1
##FIRST=     8223.43324360094, -61924,       24528
##LAST=      0,             49300,           -88234
##MIN=       0,             -688319,         0
##MAX=       8223.43324360094, 465321397,    0
$$ Real data points
##PAGE= N=1
##DATA TABLE= (X++(R..R)), XYDATA
$$ [...]
19558i6385F3770a0467l21795R1625Q3536I8581P6454G1092r103Q177a35976B8529
$$ -96385 63770 -10467 -332262 -240637 -157101 98581 175035 71092 61989 70166 -135976 28529
19545a91106i0114B77511i5583c7722A65500E6911c167D8751b80878a35593d2176
$$ -191106 -90114 277511 -95583 -37722 165500 56911 -3167 48751 -280878 -135593 -42176
19533A11448b33709J350J5621A1683b63852a16285I6647b77347h6821b1055F4892
$$ 111448 -233709 -232359 -216738 11683 -263852 -116285 96647 -277347 -86821 -21055 64892
19521h2647B9588d9431D3748D930g4330b312B8745K87529d10393i325k03011c2141
$$ -82647 29588 -49431 43748 4930 -74330 -2312 28745 316274 -410393 -9325 -212336 -32141
19508b1368l66076a26576E1520I721c8383L340F7127K4563a76706j14512A67945
$$ -21368 -387444 -126576 51520 9721 -38383 -35043 67127 91690 -176706 -291218 167945
19496b01204i7813m6869L6839p5247j28232a16192A35502b95768A22394l8369
$$ -201204 -97813 -144682 -107843 -183090 -311322 -116192 135502 -295768 122394 84025
19486H4025a57311j56011J49140r2334a20594C409J28297C2194O9655h9903o6245
$$ 84025 -157311 -313322 -164182 -256516 -120594 3409 131706 32194 101849 -89903 -156148
19475a56148C6601a13101j35546j3496P5447j41891h3769k60989B50710p9773
$$ -156148 36601 -113101 -248647 -262143 -186696 -328587 -83769 -344758 250710 170937
19465A70937p4669C5325P5090a8126I8940D6035c9132j338J0535r2352j12430
$$ 170937 96268 35325 110415 -18126 98940 46035 -39132 -40470 -29935 -122287 -234717
19454b34717H6902K09680a5034p3545b4591G6429a96839Q1249A88995G0423b8118
$$ -234717 86902 296582 -15034 -88579 -24591 76429 -196839 -115590 188995 70423 -28118
19442h3456J3030A38751b690l82405c8906j80186e4976j56904K1610j02285d0890
$$ -83456 -70426 138751 -2690 -385095 -38906 -219092 -54976 -211880 -190270 -292555 -40890
19430a84776A51934g8600b6613k4498I3354b59562A21408a04942a6507n5391G7769
$$ -184776 151934 -78600 -26613 -51111 93354 -259562 121408 -104942 -16507 -71898 77769
19418A45367a15356b8040j95518h7273j27492g4248a233F6347g3054j05627N6151
$$ 145367 -115356 -28040 -223558 -87273 -214765 -74248 -1233 66347 -73054 -178681 -122530
19407a22530A21524H192H6e68252h0748m5696G0683J63059h9615B03573I4428
$$ -122530 121524 8192 86 -568252 -80748 -126444 70683 233742 -89615 203573 94428
19395h7465j29511a5530I134K01059p1002b65372h4151K6587j8605O743A25144
$$ -87465 -216976 -15530 9134 210193 139191 -265372 -84151 -57564 -76169 -69426 125144
19383d9192B37869a53372j06556j91074G5364c27537A46764a39659A54431O5539
$$ -49192 237869 -153372 -259928 -451002 75364 -327537 146764 -139659 154431 219970
19373B19970d5094j21277d0106A5622h3389A0336a82549k20088A06988Q8305c34611
$$ 219970 -45094 -166371 -40106 15622 -83389 10336 -182549 -402637 106988 195293 -334611
19361A54309g0174l26041a13998D6668j3846b60834d5803J2469j66370m375l9301
$$ 154309 -70174 -396215 -113998 46668 32822 -260834 -45803 -33334 -199704 -204079 -243380
19350b43380f9690j72500C68102b52729a08213j16302B66159e6582k44255C408
$$ -243380 -69690 -242190 368102 -252729 -108213 -224515 266159 -56582 -300837 3408
19339A24781i654r9635d4599j07391O7119M1268H7916b05734N7775m4555H4609
$$ 124781 -9654 -109289 -44599 -151990 -84871 -43603 87916 -205734 -147959 -192514 84609
19327A69212a99596d128j25865A30389e576o9992L5492A15440c2690B31792h7104
$$ 169212 -199596 -4128 -129993 130389 -5576 -75568 -40076 115440 -32690 231792 -87104
19315e6210B05487a00105k77083a8427k54872B74657a33023d4464D7001a07570
$$ -56210 205487 -100105 -377188 -18427 -273299 274657 -133023 -44464 47001 -107570
19304c60041g7992A78850c05018a33864F7676B2734b62382d7057B56877a42465
$$ -360041 -77992 178850 -305018 -133864 67676 22734 -262382 -47057 256877 -142465
19293a86286N9343a0562o3982A66821I091c90644G6038M4713i4475D7006g5411
$$ -186286 -126943 -10562 -74544 166821 9091 -390644 76038 120751 -94475 47006 -75411
19281A11683d9573B75238r6815h1877j58186G2306a1400C0597c89612a03366q3674
$$ 111683 -49573 275238 178423 -81877 -240063 72306 -11400 30597 -389612 -103366 -187040
19270a87040K3037B56052b09469m9137J26795A4916b40529N6920k9288Q4576M1819
$$ -187040 -164003 256052 -209469 -258606 -131811 14916 -240529 -183609 -212897 -128321 -86502
19259h6502c6815B95972A36566a58108J8946M0046p2251O2507D3616k895a69053
$$ -86502 -36815 295972 136566 -158108 -139162 -99116 -171367 -108860 43616 40721 -169053
19247A87725c1421A88496a08339n1094E4365a31568B65387a9406l22593a61480
$$ 187725 -31421 188496 -108339 -159433 54365 -131568 265387 -19406 -341999 -161480
19236g3948F3432b07295C0937d3162k5911m1183H1135a8669p5415B82311d5820
$$ -73948 63432 -207295 30937 -43162 -69073 -110256 81135 -18669 -94084 282311 -45820
19224D3348K6584f5257l0231D9429J46612d5988j89203M0361B35441F5676f3566
$$ 43348 69932 -65257 -95488 49429 196041 -45988 -235191 -194830 235441 65676 -63566
19212c04466f3904o183a340j5124k21271B02685i6816j75841A8629c3927a4494
$$ -304466 -63904 -70087 -1340 -16464 -237735 202685 -96816 -272657 18629 -33927 -14494
19200h4648j65620j45071F6047N3396c78999e8876a6790k6817H6208e6853H271
$$ -84648 -250268 -395339 66047 119443 -378999 -58876 -16790 -43607 86208 -56853 8271
19188D4716J08133a16142H8877b07466O31C6369J5900j653Q5955a48255L897g0003
$$ 44716 152849 -116142 88877 -207466 -206835 36369 52269 50616 136571 -148255 -144358 -70003
19175a06218M3522j60267E5497b62163j16317A17059f364p4422o9337l64367a15006
$$ -106218 -62696 -222963 55497 -262163 -378480 117059 -6364 -80786 -150123 -514490 -115006
19163d03040a20504n6323I4299a13137j68727A54358l629a84430j31454b4530
$$ -403040 -120504 -176827 94299 -113137 -281864 154358 150729 -184430 -315884 -24530
19152A96122b44028B665d0713j52643O5685f0998D4533J81877B2174r383a67389
$$ 196122 -244028 2665 -40713 -193356 -127671 -60998 44533 226410 22174 12791 -167389
19140E37704f8629k63143g5004o1969n5349A51741f1879A57598K12697A34176
$$ 537704 -68629 -331772 -75004 -136973 -192322 151741 -61879 157598 370295 134176
19129G2395d779k31485M1640j72612a03688c6916I9432e7204l257C8385O5404
$$ 72395 -4779 -236264 -194624 -367236 -103688 -36916 99432 -57204 -60461 38385 103789
19118A03789f2345a5577e17j3978j9861D35K1454d4831I2151d77702h9321d2189
$$ 103789 -62345 -15577 -517 -14495 -34356 435 21889 -44831 92151 -477702 -89321 -42189
19105d9848j37459f5600B8602Q1147d5640J4074Q623q5721E10i7606L4466l8522
$$ -49848 -187307 -65600 28602 109749 -45640 -31566 -22943 -108664 510 -97606 -63140 -101662
19093a01662b2826p5226H0222c76051O0935J40941H9204a1303A67303a43906H303
$$ -101662 -22826 -98052 80222 -376051 -315116 -174175 89204 -11303 167303 -143906 8303
19081a35128A53705D1042N1258N1918a4764B86146i7073M5597j10221j01749D6420
$$ -135128 153705 41042 92300 144218 -14764 286146 -97073 -51476 -161697 -263446 46420
19069a68048J5637H3329Q1227a10027B61121f726o0433B0325a20109o5700c4249
$$ -168048 -152411 83329 164556 -110027 261121 -6726 -67159 20325 -120109 -185809 -34249
19057a49787j92651i843k42116Q60G4103a14228O481D1347A2025a9099j19964
$$ -149787 -342438 -9843 -251959 -251099 74103 -114228 -107747 41347 12025 -19099 -139063
19046a39063e7865k3161G2832b21503i685l1423A8470b50558r3716B82928i6986
$$ -139063 -57865 -81026 72832 -221503 -9685 -41108 18470 -250558 -344274 282928 -96986
19034d4373D88270A81928d1109D7747J57529H2835C7705K34524e6732o5851B23599
$$ -44373 488270 181928 -41109 47747 205276 82835 37705 272229 -56732 -122583 223599
19022a24149b062E6098g4671J3430A41678a11160a0422B2996m098b75333a13124
$$ -124149 -2062 56098 -74671 -61241 141678 -111160 -10422 22996 18898 -275333 -113124
19010E2384a03370L9803j60952B28265C956f3600m3231k85954g7053q7908n8686
$$ 52384 -103370 -63567 -224519 228265 3956 -63600 -106831 -392785 -77053 -164961 -223647
18999b23647R8185l9455P7531I534c2542G8447h6660j88415O5164p4885Q5867
$$ -223647 -125462 -164917 -87386 9534 -32542 78447 -86660 -275075 -209911 -284796 -198929
18988a98929J1140L7805f5320B7882J14261m7446M2313j4282c1007A59368F908
$$ -198929 -187789 -149984 -65320 27882 142143 94697 137010 122728 -31007 159368 6908
18976B79784f3287B34372a39945d694o1834F7829M3295I309J05149E4397a47870
$$ 279784 -63287 234372 -139945 -4694 -66528 67829 111124 9309 114458 54397 -147870
18964b17913A8001c39658R8020J11824d9731j95334g547j70680f697k35631l2024
$$ -217913 18001 -339658 -241638 -129814 -49731 -245065 -7547 -178227 -6697 -242328 -274352
18953b74352h4862n0699F3374Q6974b1214e325m6391B37492a95259b5841B23999
$$ -274352 -84862 -135561 63374 150348 -21214 -5325 -51716 237492 -195259 -25841 223999
18941c7254o3816j71681B9073F057P7760a01531A16061a95172a9048r435m75523
$$ -37254 -101070 -272751 29073 6057 83817 -101531 116061 -195172 -19048 -28483 -504006
18930e04006A54559E1646N4761O063g5306B00800q4827g2912D7024c01897B0073
$$ -504006 154559 51646 106407 112470 -75306 200800 115973 -72912 47024 -301897 20073
18918d2703r2685D9978a867k18889A65544a75592P5770j2572n8378B60690c57828
$$ -42703 -135388 49978 -1867 -220756 165544 -175592 -99822 -112394 -170772 260690 -357828
18906c98096B16965R0225g4595b7753k95481F2624A118a20528B31761a80610C0135
$$ -398096 216965 307190 -74595 -27753 -323234 62624 1118 -120528 231761 -180610 30135
18894a0153B46336a31289G6630a44776B0756K52354A25981c6593j07191k75449
$$ -10153 246336 -131289 76630 -144776 20756 273110 125981 -36593 -143784 -419233
18884d19233F4743O8011h2513B71289a50839e3170A49163b41202A13394i2483
$$ -419233 64743 132754 -82513 271289 -150839 -53170 149163 -241202 113394 -92483
18873A5666J50146b6083A63381G2402b34977R0801k12169l8279a38299K7474B2062
$$ 15666 165812 -26083 163381 72402 -234977 -144176 -356345 -394624 -138299 -110825 22062
18861b51328C15688c4649q3502j3790N5098q5818a0422o6559n3899j31630b5073
$$ -251328 315688 -34649 -118151 -131941 -76843 -162661 -10422 -76981 -130880 -262510 -25073
18849c05148b5563j46081A8346J31223a3779m45971D00582b44400a03257A4472
$$ -305148 -25563 -171644 18346 149569 -13779 -459750 400582 -244400 -103257 14472
18838i6696b3596A33601R1308a93211j06536Q5608d5827j71710A84110A3991b70403
$$ -96696 -23596 133601 224909 -193211 -299747 -214139 -45827 -217537 184110 13991 -270403
18826G3052f7929B04081b59997j60831a17646j2923j03775A39490b0844E3715
$$ 73052 -67929 204081 -259997 -420828 -117646 -130569 -234344 139490 -20844 53715
18815A35708m6274C7473a82422D55969A60490d3543k8608G6220l2886J38686a97554
$$ 135708 89434 37473 -182422 455969 160490 -43543 -72151 76220 43334 182020 -197554
18803h3791B59393a0864o356I7088b33702H0817a66250a1162A29113a97182K1465
$$ -83791 259393 -10864 -17220 97088 -233702 80817 -166250 -11162 129113 -197182 -175717
18792a75717M3557n3425k3869c4077p3690I7689l33B9157c1373A97089e2595p6484
$$ -175717 -132160 -185585 -209454 -34077 -107767 97689 97356 29157 -31373 197089 -52595 -129079
18780a29079J6954q0315A79509N7736E6000a9428p9466M7252O268F6999D025J83475
$$ -129079 -112125 -192440 179509 237245 56000 -19428 -98894 -51642 -45374 66999 4025 187500
18768A87500C9469J32877b0452o0312q497A14001a81036d4343B60766i908k60565
$$ 187500 39469 172346 -20452 -80764 -89261 114001 -181036 -44343 260766 -9908 -270473
18757b70473j8939A67728L1102G2396a28860E2829a88864N2700F7432k9830K81642
$$ -270473 -289412 167728 198830 72396 -128860 52829 -188864 -136164 67432 37602 319244
18746C19244c87513g6825I4824b41482H4749C2342h386A82267C0994a68655M3474
$$ 319244 -387513 -76825 94824 -241482 84749 32342 -8386 182267 30994 -168655 -125181
18735a25181l4127H6220B114L3582b0993A32471O3207e94H5958b08945C66781
$$ -125181 -159308 86220 2114 35696 -20993 132471 195678 -594 85958 -208945 366781
18723C02427a26233J8699C24405j19984H801c1912k22602p7443A52721i9812n9710
$$ 302427 -126233 -107534 324405 204421 8801 -31912 -254514 -331957 152721 -99812 -159522
18712a59522B7802b81779j67817a50418N3735j1971L8804g677o7036k75451B65052
$$ -159522 27802 -281779 -449596 -150418 -96683 -108654 -69850 -7677 -74713 -350164 265052
18700a11522j22820A92146e30712B97338b2865j11440k59180Q5810f1300b0241
$$ -111522 -234342 192146 -530712 297338 -22865 -134305 -393485 -307675 -61300 -20241
18689F4124d4465n8789k33825f2452j41919a4493A19576f7996l7949M772A54444
$$ 64124 -44465 -103254 -337079 -62452 -204371 -14493 119576 -67996 -105945 -101173 154444
18677a7605B2871b57639O8022I045c03412E0761a81937N9929K482j68797i3496
$$ -17605 22871 -257639 -189617 9045 -303412 50761 -181937 -122008 -119526 -288323 -93496
18665h1806j04539B6082J18590J72483H3143P0258b54410M1660j30047A79622
$$ -81806 -186345 26082 144672 317155 83143 153401 -254410 -212750 -342797 179622
18654a525j4263F7650i0684B4317g6837A5010K13493n3531b02039P1096N6951
$$ -1525 -15788 67650 -90684 24317 -76837 15010 228503 174972 -202039 -130943 -73992
18643g3992j52979B5466c66702I392a77532j90560f3552j27846B25850a76418
$$ -73992 -226971 25466 -366702 9392 -177532 -368092 -63552 -191398 225850 -176418
18632a50543C09726I0580c2756j8942b3427A79406a37102A36644J14116e8569
$$ -150543 309726 90580 -32756 -51698 -23427 179406 -137102 136644 250760 -58569
18621a36008D10124J25298a01422B6808a89897P3511A3214J4488b17042M4342
$$ -136008 410124 535422 -101422 26808 -189897 -116386 13214 27702 -217042 -172700
18611a72700J098B24276a34022A85655M4699a74525m9998A04550d06789d3602
$$ -172700 -171602 224276 -134022 185655 230354 -174525 -224523 104550 -406789 -43602
18600d9542A69194a97677P012B86780c73718J21446B6251P5790N6516F4664j3183
$$ -49542 169194 -197677 -190665 286780 -373718 -252272 26251 102041 158557 64664 51481
18589E1481d5195j41956h0014l2015L6197I8218e5358A70737c28001m3893A02454
$$ 51481 -45195 -187151 -80014 -112029 -75832 98218 -55358 170737 -328001 -371894 102454
18577a21153j56194J677E3904b18380E9327k1898P1177K8391a83732Q7823i108
$$ -121153 -277347 -275670 53904 -218380 59327 37429 108606 136997 -183732 -95909 -9108
18565d7313A9373a53131O8315G3848H596b329k39053a00061A70272c45210f8689
$$ -47313 19373 -153131 -84816 73848 8596 -2329 -241382 -100061 170272 -345210 -68689
18553a49461j60594J21469B95250b49233e115k02446N5671I8426c69610E3330
$$ -149461 -310055 -188586 295250 -249233 -5115 -207561 -151890 98426 -369610 53330
18542B74815H5544b62341A87039a82183n6491A54753d19036J92400k66513A6488
$$ 274815 85544 -262341 187039 -182183 -238674 154753 -419036 -226636 -493149 16488
18531A45102a63228l4589c0501n4287r5717F0823J83290h0794k2227F1792c02665
$$ 145102 -163228 -197817 -30501 -84788 -180505 60823 244113 -80794 -103021 61792 -302665
18519a57652B68314b26886a1529E6258a40736B55967O4142b48404B9842K2178
$$ -157652 268314 -226886 -11529 56258 -140736 255967 320109 -248404 29842 52020
18509E2020i8718j06314c1185l09883H3486B0323L82910G1476c8553l34294a55492
$$ 52020 -98718 -205032 -31185 -341068 83486 20323 403233 71476 -38553 -372847 -155492
18497F7245j4698c01940a4022n9600F3287a15954j9935A36830F0737J31467a10728
$$ 67245 52547 -301940 -14022 -73622 63287 -115954 -135889 136830 60737 192204 -110728
18485E697K43240h1789J7400A16567c91119H6715P0194E3340b31664J8900B09679
$$ 5697 248937 -81789 -64389 116567 -391119 86715 156909 53340 -231664 -212764 209679
18473a97363O3314a1246c502j07807j62817A50179a91322M506f6384E6293g8862
$$ -197363 -134049 -11246 -3502 -111309 -274126 150179 -191322 -186816 -66384 56293 -78862
18461b0364q7133j09647C0945O979c03313j26768H8781b91068D8939P4443a23433
$$ -20364 -107497 -217144 30945 37924 -303313 -430081 88781 -291068 48939 123382 -123433
18449a28616J5160a3101A12233m2280i8431j76742A0741a57886H7299a21461b03
$$ -128616 -113456 -13101 112233 69953 -98431 -275173 10741 -157886 87299 -121461 -203
18437a32446q643A29920e9102l2688B12170b8059J2287j77200G6903c24608p4496
$$ -132446 -141089 129920 -59102 -91790 212170 -28059 -15772 -192972 76903 -324608 -399104
18426c99104F1374J19716e2712a4686I5600J56937a70341A37013a58051A65382
$$ -399104 61374 181090 -52712 -14686 95600 252537 -170341 137013 -158051 165382
18415a76205L4697B09926C6927a19647o937e237I4393J63034i4438B26344b53232
$$ -176205 -141508 209926 36927 -119647 -126584 -5237 94393 257427 -94438 226344 -253232
18403f5589B80653d2194H9002B8670g8560a7553l41748f9176C52657a95924G2814
$$ -65589 280653 -42194 89002 28670 -78560 -17553 -359301 -69176 352657 -195924 72814
18391c02690d7200k20729A07624c198j92495B24637g7725k29002F0251J91223
$$ -302690 -47200 -267929 107624 -3198 -195693 224637 -77725 -306727 60251 251474
18381B51474F801h9758G6524M1431n761c51775J53602J0645F3545b54868K7817
$$ 251474 6801 -89758 76524 117955 112194 -351775 -198173 -187528 63545 -254868 -227051
18370b27051l93855b54757A44952D2653nK40162d4794m6168M4975j0917A40157
$$ -227051 -620906 -254757 144952 42653 42648 282810 -44794 -90962 -45987 -56904 140157
18358b64897f9123k62336a04800k18816a24921C5141L96382a36977K6030j02289
$$ -264897 -69123 -331459 -104800 -323616 -124921 35141 431523 -136977 -110947 -213236
18348b13236J05227r9920L6193F8294b94274g1282k18247C4598d3491j20753C02292
$$ -213236 -108009 -207929 -171736 68294 -294274 -71282 -289529 34598 -43491 -164244 302292
18336B54065a96352k1179J02679e4688B65066l2961a43721j4219g7809l7870j35730
$$ 254065 -196352 -217531 -114852 -54688 265066 232105 -143721 -157940 -77809 -115679 -251409
18325b51409J16310P296q615A83162N1227a18776j12591A29211K40230H249M2502
$$ -251409 -135099 -127803 -136418 183162 234389 -118776 -231367 129211 369441 8249 50751
18314E0751O9692m4403J2587a38086J892D4681Q6990E0330m848L55799b9583o366
$$ 50751 120443 76040 88627 -138086 -136194 44681 131671 50330 45482 401281 -29583 -35949
18302c5949D0678a08754A9989d2626F9100h1799j44658D5397a9877B18536a54473
$$ -35949 40678 -108754 19989 -42626 69100 -81799 -226457 45397 -19877 218536 -154473
18290a03198B08327B5329a9263p7307K5678C3291J18222N0047r0551e4672C6526
$$ -103198 208327 25329 -19263 -96570 -70892 33291 151513 201560 111009 -54672 36526
18278A2928J52623J2024q1574R3230c31165a06626d3212j86366q1373P7756p2233
$$ 12928 165551 177575 96001 189231 -331165 -106626 -43212 -229578 -310951 -233195 -305428
18267c05428c2817A07426j2115a55394b8487B64138c90755B84689a00796B74868
$$ -305428 -32817 107426 95311 -155394 -28487 264138 -390755 284689 -100796 274868
18256g2256C03367A16998a4854j06232A32220L1006n8092l9513b54667H8660f8240
$$ -72256 303367 116998 -14854 -121086 132220 163226 105134 65621 -254667 88660 -68240
18244a84114A26220J1655n493l9751a09685a4279j58119N7182K0264A06767b30397
$$ -184114 126220 137875 132382 92631 -109685 -14279 -172398 -115216 -94952 106767 -230397
18232a69214P094j22463b5645l25867d8245k84979a41954N1836H1446J79615G7438
$$ -169214 -162120 -284583 -25645 -351512 -48245 -333224 -141954 -90118 81446 261061 77438
18220h3245L5807q2165D6357i3804H6540a51870C72081b07364Q5558k27924B74677
$$ -83245 -47438 -129603 46357 -93804 86540 -151870 372081 -207364 -121806 -349730 274677
18208A13405J13547O4126b71734L9539N3887C4525a09189j98288a29510J1234
$$ 113405 226952 291078 -271734 -232195 -178308 34525 -109189 -307477 -129510 -118276
18198a18276K3842q3656h7124b8429A27553c3627K289l50122A06295l1950K08943
$$ -118276 -94434 -178090 -87124 -28429 127553 -33627 -31338 -381460 106295 74345 283288
18187B83288F1448a64732a8302A68490n2196f6216j17142n7748B37214d9257j25320
$$ 283288 61448 -164732 -18302 168490 116294 -66216 -183358 -241106 237214 -49257 -174577
18176a74577K6363k07091A46678a1953A96891C7081K260Q80R936h6439k8246a639
$$ -174577 -148214 -355305 146678 -11953 196891 37081 39341 40221 50157 -86439 -114685 -1639
18163b48123L7959A71536J18199b46130i2524K6224A15213K982a57002a5042D619
$$ -248123 -210164 171536 289735 -246130 -92524 -66300 115213 118195 -157002 -15042 4619
18151a47143c8510j97796d9553j98865A39196a60410p956B12192c37877J60078
$$ -147143 -38510 -236306 -49553 -248418 139196 -160410 -168366 212192 -337877 -177799
18141a77799B5732N5803f620j9632O635k70687A9000J92370D1944j5164Q6657
$$ -177799 25732 81535 -6620 -26252 -19617 -290304 19000 211370 41944 26780 113437
18130A13437f22969a24168A26887a0787C62462A53701C8453F303b19828f4438
$$ 113437 -622969 -124168 126887 -10787 362462 153701 38453 6303 -219828 -64438
18119A84754d2204j00449I1100L20315e2407k34774A71922a6938m1925q2952B13949
$$ 184754 -42204 -142653 91100 411415 -52407 -287181 171922 -16938 -58863 -141815 213949
18107B9133P7815a95040A36236K9463b54925A57985g1938B51390a76402A87088
$$ 29133 106948 -195040 136236 165699 -254925 157985 -71938 251390 -176402 187088
18096B35225p4824J48250b73663B196a1266j53321L9843A11856D6777J54752M1075
$$ 235225 160401 308651 -273663 2196 -11266 -164587 -124744 111856 46777 201529 242604
18085B42604l0186j00509D2833a75035a307o1512j57063h6283C44561c65545R5795
$$ 242604 212418 111909 42833 -175035 -1307 -62819 -219882 -86283 344561 -365545 -269750
18074b69750K3655A26907g5834A88452b71459a55k5524A03823j0760m2961a42951
$$ -269750 -246095 126907 -75834 188452 -271459 -155 -25679 103823 93063 50102 -142951
18062f9613A62445c10980i0703C50240a49898l02452g6500I6878b61619A35518
$$ -69613 162445 -310980 -90703 350240 -149898 -452350 -76500 96878 -261619 135518
18051a87097M4638b6446b661p0965D92317a33466A58482D379a26154e6207j20433
$$ -187097 -142459 -26446 -2661 -73626 492317 -133466 158482 4379 -126154 -56207 -176640
18040a76640A275R3068b26090j01439K4244A91899b74933J05760A71142b32367
$$ -176640 1275 94343 -226090 -327529 -303285 191899 -274933 -169173 171142 -232367
18029g0342C1262G201N38c43937J39365A50987b8744q4365N1157B54683b3571
$$ -70342 31262 7201 7739 -343937 -204572 150987 -28744 -113109 -61952 254683 -23571
18017B412i4112C7185i5846A68357p1075m1696J67074l0701b86040B58370I0816
$$ 2412 -94112 37185 -95846 168357 97282 55586 222660 191959 -286040 258370 90816
18005h7177H985a04466A70588a13564C7783P7349K1943h7784j20257I7704J6772
$$ -87177 8985 -104466 170588 -113564 37783 115132 137075 -87784 -208041 97704 114476
17994A14476b53286f5602B70201c02860a19546D0187a60276j54734Q0342e8327
$$ 114476 -253286 -65602 270201 -302860 -119546 40187 -160276 -315010 -234668 -58327
17983D2613a81134A94572a10659o696j52784a01510F0327n269h4171j50113m6128
$$ 42613 -181134 194572 -110659 -117355 -270139 -101510 60327 55058 -84171 -234284 -280412
17972b80412J14513A69583d8384K0835H8964N7422F768h7166K8109a7854p5702
$$ -280412 -165899 169583 -48384 -27549 88964 146386 6768 -87166 -59057 -17854 -93556
17961i3556B3914d9853A95751J61406b17606F7568a17358o6639N3475D7810N219
$$ -93556 23914 -49853 195751 357157 -217606 67568 -117358 -183997 -130522 47810 53029
17950E3029L83372D5257L62543a0782E1359a16178C9521R2084a20185m0621I2965
$$ 53029 436401 45257 407800 -10782 51359 -116178 39521 131605 -120185 -160806 92965
17938B04971e8493j02055o1113b4543q0714j74903J32997c4006E2807a97415a6933
$$ 204971 -58493 -160548 -221661 -24543 -105257 -280160 -147163 -34006 52807 -197415 -16933
17926a3662H3774a5028A4853J08874c39411A7435O8548h0832K4721b4872q5487
$$ -13662 83774 -15028 14853 123727 -339411 17435 85983 -80832 -56111 -24872 -110359
17915a10359B67451a55729M1404G2568B7853a14656A79343b19915i7791j06688
$$ -110359 267451 -155729 -114325 72568 27853 -114656 179343 -219915 -97791 -204479
17905b04479B21733C9905d04936d5499A37170b1382l0688B55720k2006o3514e7799
$$ -204479 221733 39905 -404936 -45499 137170 -21382 -52070 255720 233714 170200 -57799
17893D9127a42023B51840c8781A8835c29015J26353B9068k025R1135k426K237
$$ 49127 -142023 251840 -38781 18835 -329015 -202662 29068 27043 118178 115752 117989
17882A17989d92238a4711j38933j58817j4636d9122D05322g2232C4220a4371A60408
$$ 117989 -492238 -14711 -153644 -312461 -327097 -49122 405322 -72232 34220 -14371 160408
17870G3112l3475b36082G423d2041j0222D77430a36417l4744A61950a68291k80800
$$ 73112 39637 -236082 7423 -42041 -52263 477430 -136417 -171161 161950 -168291 -449091
17859d49091D6396J55692n7809b30606J11168b0139k0548J4553a0088j64875B85522
$$ -449091 46396 202088 144279 -230606 -119438 -20139 -40687 -26134 -10088 -174963 285522
17847C7131R6412K0609B1228O40761A86996a92952f2929D48468A93387G9955A4237
$$ 37131 133543 154152 21228 661989 186996 -192952 -62929 448468 193387 79955 14237
17835A31241b09768b2997l31658G8850d326B17475c36679J6677d0418C7665e8721
$$ 131241 -209768 -22997 -354655 78850 -4326 217475 -336679 -320002 -40418 37665 -58721
17823B9904f0974A8749c11943C42685H2817d60518J96894j9234C4844g3445j9133
$$ 29904 -60974 18749 -311943 342685 82817 -460518 -263624 -282858 34844 -73445 -92578
17812i2578A11714k9233h935B59257O2335a41536k788C16296A22718C0959b07445
$$ -92578 111714 82481 -8935 259257 321592 -141536 -144324 316296 122718 30959 -207445
17800e0177B53756g2715K5407F3587a96988B35658a0263C6401J19328d24984i5536
$$ -50177 253756 -72715 -47308 63587 -196988 235658 -10263 36401 155729 -424984 -95536
17788c25264J61734O6579C87055a3638l50178h9456I6226a8304l2631q8868k9194
$$ -325264 -163530 -96951 387055 -13638 -363816 -89456 96226 -18304 -50935 -139803 -168997
17777a68997D5396a17636B64735J7689A40890R241a01342C3513a38110a1573k10667
$$ -168997 45396 -117636 264735 282424 140890 150131 -101342 33513 -138110 -11573 -222240
17766b22240A37168B7072J53070R7493A02374D2450K4592J23045c2022A52644
$$ -222240 137168 27072 180142 277635 102374 42450 67042 190087 -32022 152644
17755e16307h4908A82114b65033e4293k90964G8750Q1466b63404A90640D1872
$$ -516307 -84908 182114 -265033 -54293 -345257 78750 160216 -263404 190640 41872
17744B60754i0292Q545A26029C2182h9402j4194p5844B84829A15663n0360a2282
$$ 260754 -90292 -81747 126029 32182 -89402 -103596 -179440 284829 115663 65303 -12282
17732a02879B43545e67337a6628A21341b77182a12503C16165e1013C63628I687
$$ -102879 243545 -567337 -16628 121341 -277182 -112503 316165 -51013 363628 9687
17721A28624c41779D1751i9359E5125R289i7929F1929M029b94350a46353P0547
$$ 128624 -341779 41751 -99359 55125 64414 -97929 61929 65958 -294350 -146353 -75806
17710g5806f79p085r4199N0730o0257C12438h2543D43795A74297a25546A45786
$$ -75806 -679 -7764 -101963 -51233 -111490 312438 -82543 443795 174297 -125546 145786
17698G2628O5599L8623F5478d3590A28235h802D1339j0810J4664a13201E2579
$$ 72628 138227 176850 65478 -43590 128235 -8802 41339 30529 45193 -113201 52579
17686H6075C6817e5036A27862b50362a2119l23145A45401l4707j8352K17289b77687
$$ 86075 36817 -55036 127862 -250362 -12119 -335264 145401 110694 92342 309631 -277687
17674c634E854M5166b79715B55972g9467B58874J2775F2069a05298j26107a2899
$$ -3634 5854 51020 -279715 255972 -79467 258874 271649 62069 -105298 -231405 -12899
17662B07296F6028b93123d704B17329H4725J28807p5152e5201k8188G9039J34483
$$ 207296 66028 -293123 -4704 217329 84725 213532 138380 -55201 -83389 79039 213522
17651B13522p2337a91339B90768b78333h8039j00110B60270n685O0300J1129A7309
$$ 213522 141185 -191339 290768 -278333 -88039 -188149 260270 254585 314885 326014 17309
17639C6473J25037l5856g6006q4822d0345A3854J3200J06130f3676D5689A7894
$$ 36473 161510 125654 -76006 -160828 -40345 13854 27054 133184 -63676 45689 17894
17627b30923O5242C6132O3562J07589d403q9219j94749F0742J7540a93374B70034
$$ -230923 -165681 36132 99694 207283 -4403 -93622 -288371 60742 78282 -193374 270034
17615c1078B39520e1079k51798F2170J26963c68625a56823A30687a97872q0180
$$ -31078 239520 -51079 -302877 62170 189133 -368625 -156823 130687 -197872 -278052
17605b78052K7283m1344B22974q6984g1594F1302B7185a81410A1930J7575P2307
$$ -278052 -250769 -292113 222974 135990 -71594 61302 27185 -181410 11930 29505 101812
17594A01812J85273b38957E5109f5020m6123A46097a35551j21472A01790d8463
$$ 101812 287085 -238957 55109 -65020 -111143 146097 -135551 -257023 101790 -48463
17583a73086r0175A77629p5117J32109j00788J08857g8218q6514n7567I4760k4067
$$ -173086 -263261 177629 102512 234621 133833 242690 -78218 -164732 -222299 94760 70693
17572G0693b5758A46299l8692d31127E7869a43227D73383a32620M2168B30771
$$ 70693 -25758 146299 107607 -431127 57869 -143227 473383 -132620 -90452 230771
17561a20442C4816P9036j46j7187a69771f1120N522D0203K34049G4114L63124
$$ -120442 34816 113852 113706 96519 -169771 -61120 -55598 40203 274252 74114 437238
17550D37238B14216b39530B97153G8961a83953C20015E392L4183N0905j0640Q3727
$$ 437238 214216 -239530 297153 78961 -183953 320015 5392 39575 90480 79840 163567
17539A63567F8167K77823i6909K6997I5487J26685a53615H3969K67173C1198B065
$$ 163567 68167 345990 -96909 -69912 95487 222172 -153615 83969 351142 31198 2065
17527H7277i2437B64119N2498h0876K3952B49578d3474A40843B8069J25278a62829
$$ 87277 -92437 264119 316617 -80876 -56924 249578 -43474 140843 28069 153347 -162829
17515c5605A22384c020j25847M7944G311b30881b0219l1921C411a55318A32686
$$ -35605 122384 -3020 -128867 -80923 7311 -230881 -20219 -52140 3411 -155318 132686
17503D4264N7600F310M8655K36866b19171E79966n6586J6013J19475A35177L44060
$$ 44264 101864 6310 54965 291831 -219171 579966 523380 539393 658868 135177 479237
17492D79237d7292C75432j56236K31135c5441A98504a29919M4172A22535b115
$$ 479237 -47292 375432 219196 450331 -35441 198504 -129919 -85747 122535 -2115
17481G5077k2793L59370A08410J11525i4333j441j0258A34811m8479D268J61890
$$ 75077 52284 411654 108410 219935 -94333 -95774 -106032 134811 86332 4268 166158
17470A66158J33086J13060a27302O1839R235B04653L0294p3887J28378i0724j15923
$$ 166158 299244 412304 -127302 -65463 -56228 204653 234947 161060 289438 -90724 -206647
17459b06647B13442Q0893A8186b2597A44951O4279b24005B24229L19359j80905
$$ -206647 213442 294335 18186 -22597 144951 209230 -224005 224229 543588 362683
17449C62683R4052n2900n7729L8273j52064J75194k4062j77474q3527D9423K46769
$$ 362683 456735 403835 346106 384379 232315 407509 383447 205973 122446 49423 296192
17438B96192J9970J24169A17647P0827N426k6528G942K56081j16999J82805I8410
$$ 296192 316162 440331 117647 188474 193900 167372 7942 264023 147024 329829 98410
17426A75950o5565J17632K35858j17277H5762L30812j0731K9247H6543L27042
$$ 175950 110385 228017 463875 346598 85762 416574 405843 435090 86543 413585
17416D13585F5817J84733k5241J03503A22379G342K56853j29328o483A5378J44861
$$ 413585 65817 250550 225309 328812 122379 7342 264195 134867 128384 15378 160239
17405A60239N8396m7405F4466L2812L23289a06753F31373B15482o6295F5752E421
$$ 160239 218635 171230 64466 97278 420567 -106753 631373 215482 149187 65752 5421
17393A74735j6978I281M05561b6417G4746b87263B34569k4730C8055g522A42550
$$ 174735 157757 9281 414842 -26417 74746 -287263 234569 209839 38055 -7522 142550
17381A02163A8796e5159E7849M7709d15952C1583K89315j55111l7315B8920J03485
$$ 102163 18796 -55159 57849 105558 -415952 31583 320898 165787 128472 28920 132405
17370A32405K59272h809D37160j81503P6761A54895N0262D3973a25751A20759
$$ 132405 391677 -8809 437160 255657 332418 154895 205157 43973 -125751 120759
17359e0742b121b43o8495B51753f9507r098D0876j0397L04635K30988A43044M4572
$$ -50742 -2121 -243 -68738 251753 -69507 -78605 40876 30479 335114 566102 143044 187616
17347A87616K1756R021P8697K40984A85322O3108G1081k0900L0397K59370F9424
$$ 187616 209372 218393 297090 538074 185322 248430 71081 50181 80578 339948 69424
17335D24918o5134E3507J73983p1455n0197K97637L5148B05957F9673e4245F2477
$$ 424918 359784 53507 227490 156035 105838 403475 438623 205957 69673 -54245 62477
17323B37822A08528n2657J56373D4931K40168N8674a08569A3904K02531f3368
$$ 237822 108528 55871 212244 44931 285099 343773 -108569 13904 216435 -63368
17312G4274K41333A07993f123F7987Q6175c3942B39415J31340A01560E0111R7396
$$ 74274 315607 107993 -6123 67987 154162 -33942 239415 370755 101560 50111 147507
17301A47507i3652a6263A1853K54446Q294A2545K09754J49970A81462J82753F0599
$$ 147507 -93652 -16263 11853 266299 274593 12545 222299 372269 181462 364215 60599
17289E8443K12760D7306a29368B45495h534B93877c6818F14029q2630j30672d4087
$$ 58443 271203 47306 -129368 245495 -8534 293877 -36818 614029 531399 400727 -44087
17277B82532B851J39375i3510A70503L49519G6197K94417A5191d8874A85622a9086
$$ 282532 2851 142226 -93510 170503 520022 76197 370614 15191 -48874 185622 -19086
17265I760J04905k077K5380K59050j39009j00788J26260A29945J75182b13297
$$ 9760 114665 112588 137968 397018 258009 157221 283481 129945 305127 -213297
17254B41187r2160K21339a67442B87893l2340e648F1350R131b34065K9287D02304
$$ 241187 149027 370366 -167442 287893 255553 -5648 61350 70481 -234065 -204778 402304
17242D31233a85322C5175N16600n8975B03065F2766c5865B21663K21754I8998
$$ 431233 -185322 35175 551775 492800 203065 62766 -35865 221663 443417 98998
17231B59567K28627j47106n7726J31514l4969l2384A67177J57731j05403q0437
$$ 259567 488194 341088 283362 414876 379907 347523 167177 324908 219505 139068
17221A39068O3295J6174K64311j00814A49591K7913J79227D4004L34886j44570
$$ 139068 202363 218537 482848 382034 149591 177504 356731 44004 378890 234320
17211B34320k8520O0344j7056L6027l4516k8069j2493R2426J7395r6454L5016
$$ 234320 205800 266144 249088 285115 250599 222530 210037 302463 319858 223404 258420
17200B58420L0691D6733L30571j32362O3908J70054p9378A43283a062G8386L36548
$$ 258420 289111 46733 377304 244942 308850 478904 399526 143283 -1062 78386 414934
17189D14934I1688J71201F0372L03366J04011A00058J54851L23047B76540m3271
$$ 414934 91688 262889 60372 363738 467749 100058 254909 577956 276540 233269
17179B33269P1909j09852m7180K85246B07027J28061E2664h1120C56374j45381
$$ 233269 305178 195326 148146 433392 207027 335088 52664 -81120 356374 210993
17169B10993L59085A84344E1119J04521L35320j66776j45436K4616l6638K74854
$$ 210993 570078 184344 51119 155640 490960 324184 178748 203364 166726 441580
17159D41580q2579A39483L48118l2853A16899J98398j45035c2824A82820J16077
$$ 441580 359001 139483 487601 454748 116899 315297 170262 -32824 182820 298897
17149B98897j07731K78481A65919N2952m2345J37675l3254A6143J20704P2985
$$ 298897 191166 469647 165919 218871 176526 314201 280947 16143 136847 209832
17139B09832m6036J87047c4853B05806L32578Q7277A68602K34867J68062m9382
$$ 209832 163796 350843 -34853 205806 538384 625661 168602 403469 571531 522149
17129E22149j19991D1840K36364L2100j05396K62158G5847K91461A80806K68599
$$ 522149 402158 41840 278204 310304 204908 467066 75847 367308 180806 449405
17119D49405d521D6576M95623B07137K55192B02460K64803M2129A18012K95996
$$ 449405 -4521 46576 542199 207137 462329 202460 467263 509392 118012 414008
17109D14008j40490J57860J62629k08387C5098K42721j3716L43464m9884p4111
$$ 414008 273518 431378 594007 385620 35098 277819 264103 607567 557683 483572
17099D83572j13899M07007B12002L93851k1528A00193N57468k84711J70323j54777
$$ 483572 369673 776680 212002 605853 584325 100193 657661 372950 543273 388496
17089C88496o9014q2479K11323J82902B42053M86156j93033j8677B49001K14946
$$ 388496 319482 237003 448326 631228 242053 728209 535176 516499 249001 463947
17079D63947K9093k26281N5030M71030l23964j34834K94264k28396K84696K8903
$$ 463947 493040 266759 321789 792819 468855 334021 628285 399889 684585 713488
17069G13488C07738K36674l1833K2825j73064J00340J69319j69877o2758j77390
$$ 713488 307738 544412 512579 535404 362340 462680 631999 462122 399364 221974
17059B21974L83641B36988M68067l8886o3784j8315m8610K344N0520K32974C35868
$$ 221974 605615 236988 705055 666169 602385 584070 535460 537804 588324 821298 335868
17047G20496J10115k02713m3247k51956M88969m00983J90783J17455k6042C32516
$$ 720496 830611 627898 584651 332695 821664 420681 611464 728919 702877 332516
17036C85771N61103D41630Q5684L63784k67064j76204M2233J49732j60317j36079
$$ 385771 946874 441630 527314 891098 624034 447830 490063 639795 479478 343399
17026C43399N02905K17627D99865j32419L56158P0376o0582B69068L58846J08952
$$ 343399 846304 1063931 499865 367446 723604 793980 733398 269068 627914 736866
17016G36866l0238M19352m74525J47090j66752J21494r6085N8416Q6799K34525
$$ 736866 706628 1125980 651455 798545 631793 753287 657202 715618 802417 1036942
17006A036942l14946j15165n716J21105Q8792C78019L49125N9601J67426j49046
$$ 1036942 721996 606831 601115 722220 811012 378019 727144 786745 954171 805125
16996H05125O1318o3516K08228j80987j76333K53020j66234J41076k17766j37005
$$ 805125 866443 802927 1011155 830168 653835 906855 740621 881697 663931 526926
16986E26926O58858k57725j7356j0698k20485J17567q2007K01377L04541n35530
$$ 526926 1185784 928059 910703 900005 679520 797087 715080 916457 1220998 685468
16976F85468j66094J52931J69867k50750K14789J67181j40799n253n576m9579
$$ 685468 519374 672305 842172 591422 806211 973392 832593 827340 821764 772185
16966G72185L67266m60730N35489j86802k8536K12045m2518l50744J44591J29846
$$ 772185 1139451 678721 1214210 1027408 998872 1210917 1168399 817655 962246 1092092
16956A092092k39646K89125j03844J80735k04244R6300K34914j3879j20361J6172
$$ 1092092 852446 1141571 1037727 1218462 1014218 1110518 1345432 1331553 1211192 1227364
16946A227364J94986l22470J99883k10225k5520m2772L33716l7454j24871J00737
$$ 1227364 1422350 1099880 1299763 1089538 1064018 1021246 1354962 1317508 1192637 1293374
16936A293374K33707l98005M4045J6468O0238j10559L26248l96970M85896j55568
$$ 1293374 1527081 1129076 1173121 1189589 1249827 1139268 1465516 1068546 1554442 1398874
16926A398874P7346j16682n6224k7635J84867o8387J43956j48079L39794J87227
$$ 1398874 1476220 1359538 1303314 1275679 1460546 1392159 1536115 1388036 1727830 1915057
16916A915057j02048m38955L45091l76107K56342J9572J43005j40769o1054J74121
$$ 1915057 1813009 1374054 1719145 1343038 1599380 1618952 1761957 1621188 1560134 1734255
16906A734255J60778o8098j18054K70067m13579J13961J79123p0223n6762J93919
$$ 1734255 1895033 1826935 1708881 1978948 1565369 1679330 1858453 1788230 1731468 1925387
16896A925387J63640J37496l92731L04027m41423K37367J16514k8721o5266m2509
$$ 1925387 2089027 2226523 1833792 2137819 1696396 1933763 2050277 2021556 1956290 1913781
16886A913781J78573n69M50565J30816l73708K309r445K60676q3196l49419L10636
$$ 1913781 2092354 2091785 2542350 2673166 2299458 2301767 2292322 2552998 2469802 2120383 2431019
16875B431019k13103O73438m73042M20566m85775K23429K23219j85164k09460
$$ 2431019 2217916 2891354 2418312 2838878 2353103 2576532 2799751 2614587 2405127
16866B405127L4478J28491M19165k5736J21048k03409O059J43305N3158K70553
$$ 2405127 2439605 2568096 2987261 2961525 3082573 2879164 2885223 3028528 3081686 3352239
16856C352239k52659m39008O97623k4758m8347p6495l9790P5709K18480J36357
$$ 3352239 3099580 2660572 3358195 3333437 3285090 3208595 3168805 3244514 3462994 3599351
16846C599351j12206L26173n9715J61084k05457L09492r9602Q0030Q8462K6662
$$ 3599351 3487145 3813318 3753603 3914687 3709230 4018722 3919120 3999150 4087612 4114274
16836D114274L09448J8216j7602M4071j64069L44071j97322K55567k5961L22815
$$ 4114274 4423722 4441938 4424336 4468407 4304338 4648409 4451087 4706654 4680693 5003508
16826E003508k52344L95449K03526m1656J20254Q5716k9375J06639k5284M2534
$$ 5003508 4751164 5146613 5350139 5308483 5428737 5514453 5485078 5591717 5566433 5608967
16816E608967M11602J97916K93786j27361K0981J421M54893R8065K58170R4034
$$ 5608967 6020569 6218485 6512271 6384910 6405891 6407312 6862205 6960270 7218440 7312474
16806G312474J57905L510L89873q6364J75725N84736q1286L38605K67277K14612
$$ 7312474 7470379 7473889 7863762 7777398 7953123 8537859 8456573 8795178 9062455 9277067
16796I277067j02334M40654O5412O25775L51106L4671J24093L54058L95881L23788
$$ 9277067 9174733 9615387 9680799 10306574 10657680 10692351 10816444 11170502 11566383 11890171
16786A1890171J65577M13597M37026M85210q9183P47457K90894M36339J96925
$$ 11890171 12055748 12469345 12906371 13391581 13302398 14049855 14340749 14777088 14974013
16777A4974013R84302K68936M50922O40324N87941N88681N50721P81380P43253
$$ 14974013 15958315 16227251 16678173 17318497 17906438 18495119 19045840 19827220 20570473
16768B0570473O48089O36887P76942Q69749J276706N09675J215251J029167Q95324
$$ 20570473 21218562 21855449 22632391 23502140 24778846 25288521 26503772 27532939 28428263
16759B8428263J224418J120025J445479J191477J726752J616848J629717J940239
$$ 28428263 29652681 30772706 32218185 33409662 35136414 36753262 38382979 40323218
16751D0323218J610699K226957K019057K381364K814454K578647K475976L392806
$$ 40323218 41933917 44160874 46179931 48561295 51375749 53954396 56430372 59823178
16743E9823178L161307M015863L336744M214070M023068M647074M901004N156805
$$ 59823178 62984485 67000348 70337092 74551162 78574230 83221304 88122308 93279113
16735I3279113N815536O225385O130481O671018O613997P635996P035377P653133
$$ 93279113 99094649 105320034 111450515 118121533 124735530 132371526 139406903 147060036
16727A47060036P664968P814333O908390O742638O031923N508158M052997L439635
$$ 147060036 154725004 162539337 169447727 176190365 182222288 187730446 191783443 195223078
16719A95223078J735432R22107p43055j921933l228846m372338n393509n971617
$$ 195223078 196958510 197880617 197137562 195215629 191986783 187614445 182220936 176249319
16711A76249319o734346p566683p645058p367299p521101p731938p612869o754977
$$ 176249319 169514973 161948290 154303232 146935933 139414832 131682894 124070025 117315048
16703A17315048p055141o492793n940320n654139n473510n134218m743109m545567
$$ 117315048 110259907 103767114 97826794 92172655 86699145 81564927 76821818 72276251
16695G2276251m182163l694627l793040l202407l272310k816120k679785k304351
$$ 72276251 68094088 64399461 60606421 57404014 54131704 51315584 48635799 46331448
16687D6331448k317072k365550j825123j939705j708386j865996j335492j291701
$$ 46331448 44014376 41648826 39823703 37883998 36175612 34309616 32974124 31682423
16679C1682423j671478j150784j256878j443180j055732r99035j021044r86387
$$ 31682423 30010945 28860161 27603283 26160103 25104371 24105336 23084292 22097905
16671B2097905n56115q40131p22206p55481p74735o41234o96780n11344q70789
$$ 22097905 21541790 20701659 19979453 19223972 18449237 17808003 17111223 16599879 15729090
16662A5729090j63551q06654l84605m15351l93831n51739k24167l56935k22190
$$ 15729090 15565539 14758885 14374280 13958929 13565098 13013359 12789192 12432257 12210067
16653A2210067n79004j54459o97249k68063j81084l35967l17714k26721m70780
$$ 12210067 11631063 11476604 10779355 10511292 10330208 9994241 9676527 9449806 8979026
16644H979026n0305O4896o92897j54765J00944l26535l72957K28859l62995o78439
$$ 8979026 8928721 8993617 8300720 8145955 8246899 7920364 7547407 7776266 7413271 6734832
16634F734832P4152j90182N8752l57128J62978j09378l47944l51154K75670k84147
$$ 6734832 6808984 6618802 6677554 6320426 6483404 6374026 6026082 5674928 5950598 5666451
16624E666451p2593O1704l51057j5410J24145l94388l08488k42068O7031J61979
$$ 5666451 5593858 5655562 5304505 5289095 5413240 5018852 4710364 4468296 4535327 4697306
16614D697306r5640k46579J41495j52119K04760k82131k23465q301l81914r7985
$$ 4697306 4601666 4355087 4496582 4344463 4549223 4267092 4043627 4035326 3653412 3555427
16604C555427J12268j02275k23899N60146q60472O01637m80695k82444J37094
$$ 3555427 3667695 3565420 3341521 3901667 3041195 3642832 3162137 2879693 3016787
16595C016787J56960l21650L34061l28020j7526K03225k85598M9820L951J34381
$$ 3016787 3173747 2852097 3186158 2858138 2840612 3043837 2758239 2808059 2812010 2946391
16585B946391l31557k2014j32362J81888l45909J44040J78592o7786k37967K58084
$$ 2946391 2614834 2592820 2460458 2642346 2296437 2440477 2619069 2551283 2313316 2571400
16575B571400r4060l55044l4446K95065k9926k06375l56852K96089O0712k08767
$$ 2571400 2477340 2122296 2087850 2382915 2352989 2146614 1789762 2085851 2146563 1937796
16565A937796L59753k07059J5420O0286l16460j51476K39827k15765J52456l32143
$$ 1937796 2297549 2090490 2105910 2166196 1849736 1698260 1938087 1722322 1874778 1542635
16555A542635L5575J57652l3962Q8151L06025p56846M20167l57728P2033j37473
$$ 1542635 1578210 1735862 1701900 1790051 2096076 1339230 1759397 1401669 1473702 1336229
16545A336229N9662K06640n4607m20744K43238n6434K41878J83783p8316m31636
$$ 1336229 1395891 1602531 1547924 1127180 1370418 1313984 1555862 1739645 1661329 1229693
16535A229693M26164n53016K17791Q34l09733M80533k75502K97615r1851r5578
$$ 1229693 1655857 1102841 1320632 1321466 1011733 1492266 1216764 1514379 1422528 1326950
16525A326950p6941l10817N69564m29710K8997k27617j06882O18220m11396K87311
$$ 1326950 1250009 939192 1508756 1079046 1108043 880426 773544 1391764 980368 1267679
16515A267679E82627M37493m3238J94119m30211L64956n8522k54389K78196j52601
$$ 1267679 582627 1020120 976882 1171001 740790 1105746 1047224 792835 1071031 918430
16505I18430K46732N7365q8800k78965J22137J54088r1700K50757l57859j93987
$$ 918430 1165162 1222527 1133727 854762 976899 1130987 1039287 1290044 932185 738198
16495G38198K7682J85870J3132k36751j35384K11539J99941j98791B92938N42376
$$ 738198 765880 951750 964882 728131 592747 804286 1004227 805436 292938 835314
16485H35314j79499J03440M3020J70925k19159j06335L70453k54797J32329k34919
$$ 835314 655815 759255 802275 973200 754041 647706 1018159 763362 895691 660772
16475F60772K25163l38595J20115L56985C17519L94634K188j31439B53785J97670
$$ 660772 885935 547340 667455 1024440 317519 712153 714341 582902 253785 451455
16465D51455J68949k82705J26306k7191J26709K68825k79022k37194K04644o7425
$$ 451455 620404 337699 464005 436814 563523 832348 553326 316132 520776 453351
16455D53351P3534J45335B12591L05110K69295C87919K38664l07332L91262N0590
$$ 453351 526885 672220 212591 517701 786996 387919 626583 319251 710513 761103
16445G61103C72722K25427J67233l18650M880Q9902J95880j17394l1583k9148
$$ 761103 372722 598149 765382 446732 451612 541514 737394 620000 588417 559269
16435E59269j78542R3498P7397m532j64528J98672J7288B85927N65389D25347
$$ 559269 380727 474225 551622 547090 382562 581234 598522 285927 851316 425347
16424B40517N47844C15136K01538J07849p4509Q4868j48185L7233m5034M1627
$$ 240517 788361 315136 516674 624523 550014 634882 486697 523930 478896 520523
16414E20523M8971j12645j26046J703j21349K07981l3638I8921M15854A72938
$$ 520523 569494 456849 330803 332506 211157 419138 385500 98921 514775 172938
16403A05748L17092J72621L5390A44744m061R7328r1156n4661N91518B51731M08102
$$ 105748 422840 595461 630851 144744 140683 238011 146855 92194 683712 251731 659833
16392F59833B33094J16532J45861A35022N64428C41938L4822m6245J11530B2395
$$ 659833 233094 349626 495487 135022 699450 341938 376760 330515 442045 22395
16381C64564j59228J21202I8739M13207B29056K95602B00776E98J99663L45266
$$ 364564 205336 326538 98739 511946 229056 524658 200776 598 200261 545527
16371E45527A50218O0488K98377G5201K30028J03788l3258b4439A65178R7544
$$ 545527 150218 210706 509083 75201 305229 409017 375759 -24439 165178 262722
16361B62722M9823p6577Q2996J2241L7J24857K0512k21093c9469D79238j09470
$$ 262722 312545 235968 318964 331205 331242 456099 476611 255518 -39469 479238 369768
16350C69768A23494N131J15633E9377J96143b97j31806b501C65706j15046j07783
$$ 369768 123494 128625 244258 59377 255520 -297 -132103 -2501 365706 250660 142877
16339A42877m2211R5004B6869N8771a8160C13437a7306m3296C05333A45977C7832
$$ 142877 100666 195670 26869 85640 -18160 313437 -17306 -60602 305333 145977 37832
16327B52857A8829K42681l7454o2058N6316j3351e0038A36130K34031F6961J07767
$$ 252857 18829 261510 224056 161998 218314 204963 -50038 136130 370161 66961 174728
16316A74728P8711Q4859A42036M0167k102n6066o75B0113k57J35188c57B04363
$$ 174728 253439 338298 142036 182203 180101 124035 123360 20113 19856 155044 -357 204363
16303B10295L5960j16986K93164k4629f050D22793D7989J67984c8424j42888B41608
$$ 210295 246255 129269 422433 397804 -6050 422793 47989 215973 -38424 -181312 241608
16291C51501A56910a1868r7309B26280d0386j9694F2523N896J93513F1060N9743
$$ 351501 156910 -11868 -109177 226280 -40386 -60080 62523 68419 261932 61060 120803
16280A20803B6495J93907p6642k0961M2224f5175j43764B06625a31940l0509D3174
$$ 120803 26495 220402 143760 122799 165023 -65175 -208939 206625 -131940 -162449 43174
16268B45117O7045l727E3211K11665E6221J24917B181a02864C5120n567J09599
$$ 245117 312162 308435 53211 264876 56221 181138 2181 -102864 35120 29553 139152
16257A39152K0774J12549k1852I9325J43079d7807I4280b99148a36644c2158k0189
$$ 139152 159926 272475 250623 99325 242404 -47807 94280 -299148 -136644 -32158 -52347
16246e2347o5837A91877J61497c78950D08576m2885c5552D8135g849B37734k7687
$$ -52347 -118184 191877 353374 -378950 408576 365691 -35552 48135 -7849 237734 210047
16235B10047m7338b9564B21100M3464c06032C42464B8731K06237A15218K42219
$$ 210047 162709 -29564 221100 264564 -306032 342464 28731 234968 115218 357437
16225C57437a96507D5476Q4313l5732b4427r1456F6667J7147K58729A05526j6979
$$ 357437 -196507 45476 129789 94057 -24427 -115883 66667 83814 342543 105526 88547
16214H8547b80890A49559P1763e21585c8535j26263b72o9073B98443A24730L74221
$$ 88547 -280890 149559 221322 -521585 -38535 -164798 -272 -69345 298443 124730 498951
16203D98951a25989C49046r8418q3878P269e2115p7741B09362f4385k2473A47947
$$ 498951 -125989 349046 250628 166750 174019 -52115 -129856 209362 -64385 -86858 147947
16191A0481L18887A55210J47018H5519b5627C18941J0819c8819E740L01301c48650
$$ 10481 329368 155210 302228 85519 -25627 318941 329760 -38819 5740 307041 -348650
16179B25548a94055A1483J34693e3629D0995K7075b46938c7738A00083K3426J69999
$$ 225548 -194055 11483 146176 -53629 40995 68070 -246938 -37738 100083 123509 293508
16168B93508m7000c27613B66751A30044a9677B45707j03673F1600R7348h7556
$$ 293508 246508 -327613 266751 130044 -19677 245707 142034 61600 158948 -87556
16157c33775C206R1629Q9927J24873n5580p7871b34596I1265a55445J5826A51766
$$ -333775 3206 94835 184762 309635 254055 176184 -234596 91265 -155445 -139619 151766
16145a15182n4113P3781C2431J09880b97636i3236k5258B30012H5164a81006A65631
$$ -115182 -169295 -95514 32431 142311 -297636 -93236 -118494 230012 85164 -181006 165631
16133i5511A42214b3897j28910j81142f4904G4141k754J66451a3359j01259E4018
$$ -95511 142214 -23897 -152807 -333949 -64904 74141 71387 237838 -13359 -114618 54018
16121B20086I1709e710A57847d093p4253k393F734a20283B1212n876K78113a51232
$$ 220086 91709 -5710 157847 -4093 -78346 -80739 6734 -120283 21212 15336 293449 -151232
16108a82136D8708a3404C7997O5006b99453d0403B39770K54274B23513m9434b06774
$$ -182136 48708 -13404 37997 103003 -299453 -40403 239770 494044 223513 174079 -206774
16096F197d7253D7923A1365b44427P2348O8429A14909B0649K06007a5338l30219
$$ 6197 -47253 47923 11365 -244427 -172079 -103650 114909 20649 226656 -15338 -345557
16085c45557A43411b85570C15869F2626b51915A36885A5056a70195J0567P3004
$$ -345557 143411 -285570 315869 62626 -251915 136885 15056 -170195 -159628 -86624
16075h6624j48754a06318D55h5720A42122D3592b36911A88343A8503K31649J84806
$$ -86624 -235378 -106318 455 -85720 142122 43592 -236911 188343 18503 250152 434958
16064D34958F7314b0729B97152c82666A39835b1250A1125F65b97763A86150c86188
$$ 434958 67314 -20729 297152 -382666 139835 -21250 11125 665 -297763 186150 -386188
16052C40249e6175k64524A06569I604a54187A28864l3840b32519B91020O0395
$$ 340249 -56175 -320699 106569 9604 -154187 128864 95024 -232519 291020 351415
16042C51415a07448A77237c12433a34089o6158j9510A72913n5763a23352A05998
$$ 351415 -107448 177237 -312433 -134089 -200247 -219757 172913 117150 -123352 105998
16031F6136h5460K8992a6579j80686Q1738l30211A45400l9900j1453K6922b48032
$$ 66136 -85460 -56468 -16579 -197265 -115527 -445738 145400 105500 94047 120969 -248032
16019a07489h473j70706r2687g8324k02898C0510O8657c13253B47298e0914A52877
$$ -107489 -8473 -179179 -271866 -78324 -281222 30510 99167 -313253 247298 -50914 152877
16007B53121a39276j65314L7511A37029l6571a77054D9486K1765O9763a77838
$$ 253121 -139276 -304590 -267079 137029 100458 -177054 49486 71251 141014 -177838
15996b0183m9599I3266C1845J23710c380B8769b01668B55400E6349B6262L65592
$$ -20183 -69782 93266 31845 155555 -3380 28769 -201668 255400 56349 26262 391854
15985C91854b7590A88216L3746F4409J67702L7840l0716j03044a29540I7317L9361
$$ 391854 -27590 188216 221962 64409 232111 269951 239235 136191 -129540 97317 136678
15974A36678k3981c1584k592I9026Q8462a02298k3909l30536I0605J95460H6008
$$ 136678 112697 -31584 -34176 99026 187488 -102298 -126207 -456743 90605 286065 86008
15962I6337Q3515q0842j8586a50449j03918K7297I0082c772j10729b629A20221
$$ 96337 179852 99010 80424 -150449 -254367 -227070 90082 -3772 -114501 -2629 120221
15950G391K30504a0227k03494j57433d0397k8919k83412J44705A04021N0656b37925
$$ 7391 237895 -10227 -213721 -371154 -40397 -69316 -352728 -208023 104021 154677 -237925
15938A64967J23375e7151C9886i6062B97612b8209k06149B1551K56418c9643j01511
$$ 164967 288342 -57151 39886 -96062 297612 -28209 -234358 21551 277969 -39643 -141154
15927a41154B6908L1253a2063k57285h7900C760f1586B64773a45953K5083d8509
$$ -141154 26908 58161 -12063 -269348 -87900 3760 -61586 264773 -145953 -120870 -48509
15915A12859a70292D7430h0917l32567G4708c5285l81894A80424i8879k96771
$$ 112859 -170292 47430 -80917 -413484 74708 -35285 -417179 180424 -98879 -395650
15905c95650P8478h0828F0249Q9238G0855J1303d6975A28037a01894j15335h2647
$$ -395650 -317172 -80828 60249 149487 70855 82158 -46975 128037 -101894 -217229 -82647
15893f8656A07473e6458i068q9451c3846o7333A15528Q2017c84181B93628a9371
$$ -68656 107473 -56458 -9068 -98519 -33846 -101179 115528 197545 -384181 293628 -19371
15881d14324i008B04440d8758j88014K5065j40359a34703i453H470J2636c67306
$$ -414324 -9008 204440 -48758 -236772 -211707 -352066 -134703 -9453 8470 21106 -367306
15869F0788e8269H0337L08621h6680B76923A23442l1251a64308o629E9906c03281
$$ 60788 -58269 80337 388958 -86680 276923 123442 92191 -164308 -170937 59906 -303281
15857b5050m4085A05664a54462g5208L7513k7149O588A56571J191a42129E2686
$$ -25050 -69135 105664 -154462 -75208 -37695 -64844 -58256 156571 157762 -142129 52686
15845e4005k87086i5316C7738M5014i8404j02003a5224G604K7910a80085f994
$$ -54005 -341091 -95316 37738 82752 -98404 -200407 -15224 7604 35514 -180085 -6994
15833B85953e7031b4425I0837a41308m6490d8221j13917k4023i1746d5290L676
$$ 285953 -57031 -24425 90837 -141308 -187798 -48221 -162138 -186161 -91746 -45290 -41614
15822d1614l5204D11019a41904a1873j11311H7684b7115B83561b47655J23645
$$ -41614 -76818 411019 -141904 -11873 -123184 87684 -27115 283561 -247655 -124010
15812a24010A63152j8124a03414j53658j60022b2744A83833E8805k0158L1624
$$ -124010 163152 145028 -103414 -257072 -417094 -22744 183833 58805 38647 70271
15802G0271a21031N6063j77110a11292k46949i0872A4211a38318A02275D7604
$$ 70271 -121031 -64968 -242078 -111292 -358241 -90872 14211 -138318 102275 47604
15791D8863J34882a81138K1218q8724A87434o2449N6239b66799n726k8358C46143
$$ 48863 183745 -181138 -159920 -248644 187434 124985 181224 -266799 -272525 -300883 346143
15779a08590A29934d6731k50815G8329b89352F2228b98709b6398l62136J75918
$$ -108590 129934 -46731 -297546 78329 -289352 62228 -298709 -26398 -388534 -212616
15769b12616A7533a22779j78095H6369l662h6036j98025B2188J25161F5787c23475
$$ -212616 17533 -122779 -300874 86369 82707 -86036 -284061 22188 147349 65787 -323475
15757a14549n5419A82682j3022l3036M1969J02268c9238j31415B62977a46145
$$ -114549 -169968 182682 169660 136624 178593 280861 -39238 -170653 262977 -146145
15746C83738I6390R0300D1289K38998F245a50167j05784B9622O1305c10242h645
$$ 383738 96390 186690 41289 280287 6245 -150167 -255951 29622 90927 -310242 -8645
15734A79070C218P1770M1901h9089o9713I1264g4198o7920b6080n4181q2129B8442
$$ 179070 3218 74988 116889 -89089 -158802 91264 -74198 -142118 -26080 -80261 -162390 28442
15721A30510b0876j13132J4798G6162b76407e8641r5189B5548R4054a45558c4939
$$ 130510 -20876 -134008 -119210 76162 -276407 -58641 -153830 25548 119602 -145558 -34939
15709a70599d617k53544J16278k38240a79416N990A48291i2951A33854a0184m5720
$$ -170599 -4617 -258161 -141883 -380123 -179416 -173426 148291 -92951 133854 -10184 -55904
15698e5904k77202C04130a92782n6823I9835a22499M8041r0413A09429M2853a13610
$$ -55904 -333106 304130 -192782 -249605 99835 -122499 -74458 -164871 109429 152282 -113610
15686A46386a1313k9194j02000H2057M9318g0142p4642N1115j31014i3295A89229
$$ 146386 -11313 -40507 -142507 82057 131375 -70142 -144784 -93669 -224683 -93295 189229
15674a33635O2354F2463R0476J66633b2934B17222a79436N7488B8207K81417E6927
$$ -133635 -71281 62463 152939 319572 -22934 217222 -179436 -121948 28207 309624 56927
15662a8344j3932j56089a0931B35656h2616I6777B1853e9804k49374J28161A42470
$$ -18344 -32276 -188365 -10931 235656 -82616 96777 21853 -59804 -309178 -181017 142470
15650d479H8526b41860H740L2712K83292b74859h0489A27230m8512I283a12644
$$ -4479 88526 -241860 8740 41452 324744 -274859 -80489 127230 78718 9283 -112644
15638F3606J8222g8873l03590J04875e3758G4390J47194A9134i084B06185e279
$$ 63606 81828 -78873 -382463 -277588 -53758 74390 221584 19134 -9084 206185 -5279
15626i1927m1334B4062M3518d8602r6503i782D4232P3629a66880P6884E4193K61491
$$ -91927 -133261 24062 67580 -48602 -145105 -9782 44232 117861 -166880 -89996 54193 315684
15614C15684j44556A0167R8978A2237h4083D1778a38896E7748a12857J7722j0539
$$ 315684 171128 10167 109145 12237 -84083 41778 -138896 57748 -112857 -95135 -105674
15603a05674m4029B26409B1439b41859J07204B02928c76656B43378c0605l1092
$$ -105674 -149703 226409 21439 -241859 -134655 202928 -376656 243378 -30605 -61697
15593f1697j08101g4676B42469b47301c1050A04722b8914B30598J47170b62488
$$ -61697 -169798 -74676 242469 -247301 -31050 104722 -28914 230598 377768 -262488
15582B34056J61992a87289A46487a71713c4019l737A93576E0331b00817l819K1126
$$ 234056 396048 -187289 146487 -171713 -34019 -37756 193576 50331 -200817 -204636 -183510
15571a83510Q488A83665a9539I9754a05095k0173A09167b15668h0108A41504a67368
$$ -183510 -175022 183665 -19539 99754 -105095 -125268 109167 -215668 -80108 141504 -167368
15559D43467Q4725c40517B82049B0638R0615i5656D1626Q6455j6891a38824C8324
$$ 443467 528192 -340517 282049 20638 111253 -95656 41626 128081 111190 -138824 38324
15547f9746K870m6571o4129L7533A07972M8470f9579B3293a05504I1241k8254
$$ -69746 -66876 -113447 -177576 -140043 107972 156442 -69579 23293 -105504 91241 62987
15536F2987d3175p0949A79924b22041A10026b47079G3859J34020f2880B25535
$$ 62987 -43175 -114124 179924 -222041 110026 -247079 73859 207879 -62880 225535
15525b34551A9270a38350A9266a68030A27572l7594i9628n3000F6019K3767J6602
$$ -234551 19270 -138350 19266 -168030 127572 89978 -99628 -152628 66019 89786 106388
15514A06388E2013c967A700R4281a09639B78161i8256H2546c81641J44476D4568
$$ 106388 52013 -3967 1700 95981 -109639 278161 -98256 82546 -381641 -237165 44568
15502a12589J5175B12977b95839A73284N924J51204a37723B30505J55267C9656
$$ -112589 -97414 212977 -295839 173284 179208 330412 -137723 230505 385772 39656
15491a33800A11232a64325B15055B5661J85055a64168K1855E8833e7183F6841
$$ -133800 111232 -164325 215055 25661 210716 -164168 -142313 58833 -57183 66841
15480a3855j8368C645e418q8858j46219i0311l06436A06859g2629A31662b50056
$$ -13855 -32223 3645 -5418 -94276 -240495 -90311 -396747 106859 -72629 131662 -250056
15468C64710d27813c8303C6376Q5734B4769J99421f2773D75446A49106K8368D6914
$$ 364710 -427813 -38303 36376 122110 24769 224190 -62773 475446 149106 177474 46914
15456a9991j20407j53447D5845H993a07754G2580a9050j60797C92673G3427b317
$$ -19991 -140398 -293845 45845 8993 -107754 72580 -19050 -179847 392673 73427 -2317
15444c69854d8517A13122c2121H6644d12108G5767K0183a69885p9445O4169B89898
$$ -369854 -48517 113122 -32121 86644 -412108 75767 95950 -169885 -249330 -185161 289898
15432C5703f8452B63095a27175A31858l2423k4978l6491K34431a89764M4974B72781
$$ 35703 -68452 263095 -127175 131858 99435 74457 37966 272397 -189764 -144790 272781
15420D0983K06615c67638B43472a2502m05762a44439C77721j51250a0051k20924
$$ 40983 247598 -367638 243472 -12502 -418264 -144439 377721 226471 -10051 -230975
15410b30975j46501g8272j11468P0530C49409b15978P9068O4054B45336b21524
$$ -230975 -377476 -78272 -189740 -119210 349409 -215978 -136910 -72856 245336 -221524
15399a16055B4515K17150i3165A9924g1347A44781h730l58073A59463d20084e7711
$$ -116055 24515 241665 -93165 19924 -71347 144781 -8730 -366803 159463 -420084 -57711
15387c447A31051j7015m2568e3881j01267e248B40869b35861h5874B03084d4651
$$ -3447 131051 114036 71468 -53881 -155148 -5248 240869 -235861 -85874 203084 -44651
15375G3628J17535a48186A73082q0210K6625K5590a1473D8358A3974h7144G3724
$$ 73628 191163 -148186 173082 92872 119497 145087 -11473 48358 13974 -87144 73724
15363B2050E419a77847A37171e1634A77249l0245f929I9394B1961J28904B391
$$ 22050 5419 -177847 137171 -51634 177249 147004 -6929 99394 21961 150865 2391
15351a835j34066H1693J39149a05370B52418A24105f1100q4582k8828B89037a87981
$$ -1835 -135901 81693 220842 -105370 252418 124105 -61100 -145682 -174510 289037 -187981
15339A90516c55981C7205c8788j85571E2297B4946a92495r7921A88792B926M2732
$$ 190516 -355981 37205 -38788 -224359 52297 24946 -192495 -290416 188792 2926 45658
15328D5658K788a04662A35909m8895j6386k8132a00278F5161e3630B9999A3782
$$ 45658 48446 -104662 135909 87014 70628 42496 -100278 65161 -53630 29999 13782
15316A68561j5086e8531n7797C05724k2260D5830J95848r9971d0455A12080K07367
$$ 168561 153475 -58531 -116328 305724 283464 45830 241678 141707 -40455 112080 319447
15305C19447G9333a13858A24257a6071j6884k67808b8441o6901H8809d7858j7569
$$ 319447 79333 -113858 124257 -16071 -32955 -300763 -28441 -95342 88809 -47858 -65427
15294f5427c1328o7758F4596A661a21347r941j53065A87931a40803A21194P5098
$$ -65427 -31328 -99086 64596 1661 -121347 -131288 -284353 187931 -140803 121194 196292
15283A96292p8113g535F7921a38817N1312M0305B32858E1564K55490G9815j5593
$$ 196292 118179 -7535 67921 -138817 -87505 -47200 232858 51564 307054 79815 64222
15272F4222J36144I0998M2619K4084b59233J17009C38012D928b6083n2294B79374
$$ 64222 200366 90998 133617 157701 -259233 -142224 338012 4928 -26083 -78377 279374
15260A11530K19626j24309a49911B20061G3182m759N8049M35498C0382k395M49196
$$ 111530 331156 206847 -149911 220061 73182 68423 126472 561970 30382 27987 477183
15249D77183j29181L66417Q15625k90858J13212M60108F08686B87979A42536K20966
$$ 477183 348002 714419 1530044 1239186 1352398 1812506 608686 287979 142536 363502
15239C63502j56536J72578A38546C0560K45399q8481l5743e4383q1642A50362
$$ 363502 206966 379544 138546 30560 275959 187478 151735 -54383 -136025 150362
15228d465F6117P5675E0932b04565A08770k4284L76169A46744n2540a24932c1945
$$ -4465 66117 141792 50932 -204565 108770 84486 460655 146744 94204 -124932 -31945
15216c59997A00024a9062B34408j15976A7739b78400A05436J36432Q5962c0776
$$ -359997 100024 -19062 234408 118432 17739 -278400 105436 241868 327830 -30776
15205E0967Q3494B7575L2732J04586J57734p9709I830d2150A94067n9624E1240
$$ 50967 134461 27575 60307 164893 322627 242918 9830 -42150 194067 134443 51240
15193C1963J33403P8234a35254j916A82725b01099a8967C33707O114A26718q352
$$ 31963 165366 243600 -135254 -137170 182725 -201099 -18967 333707 339821 126718 118366
15182A18366L5754i8392a5584B11409J01755H3429K71451k6236j51621a0822G9838
$$ 118366 154120 -98392 -15584 211409 313164 83429 354880 328644 177023 -10822 79838
15170a97517A39167F1494J17068g662A19373J96042A33829J47286b8827C99312
$$ -197517 139167 61494 178562 -7662 119373 315415 133829 281115 -28827 399312
15159C37233J26718c9339C41719I1286c3195G6307J10001a12525d5190C20979
$$ 337233 463951 -39339 341719 91286 -33195 76307 186308 -112525 -45190 320979
15148A48824D6065j2685b146o0111A25399R2456a43997C88353q5135F7593J7660
$$ 148824 46065 33380 -2146 -62257 125399 217855 -143997 388353 303218 67593 85253
15137H5253J05226Q355a04672c0744C74666f6601A30346m6585K07178B1943K67169
$$ 85253 190479 198834 -104672 -30744 374666 -66601 130346 83761 290939 21943 289112
15126B89112J9247I7065a30614A50051K26564D5157N1764o109M4807L0672E3987
$$ 289112 308359 97065 -130614 150051 376615 45157 96921 90812 135619 166291 53987
15114B53974A0524a39210f086A53008F8630K45657B837K96967o065k1009A18924
$$ 253974 10524 -139210 -6086 153008 68630 314287 2837 299804 293739 272730 118924
15102f6947A4430b19832C90583D7679e7703a8920n9302I3696k4811R5074D6918
$$ -66947 14430 -219832 390583 47679 -57703 -18920 -78222 93696 68885 163959 46918
15090A23317K0511h4544a0072B24314b54479A33944e457B2282K6633J01443M2658
$$ 123317 143828 -84544 -10072 224314 -254479 133944 -5457 22282 48915 150358 193016
15079A93016K1776o2601C5410O7989l0892O8270K59912q1231a3545e100E228L80913
$$ 193016 214792 152191 35410 103399 72507 140777 400689 319458 -13545 -5100 5228 386141
15067C86141j52918o6560K12800r522j45408Q5051A38101a11033A56167L08939
$$ 386141 233223 166663 379463 369941 224533 309584 138101 -111033 156167 465106
15057D65106j72446p228H2674d295j4715B50853m8978L2428G8946j8418L9830
$$ 465106 292660 285432 82674 -4295 -19010 250853 201875 234303 78946 60528 100358
15046A00358L27267n1869q4049F1173b4321A64755K15583I1433L97067D7109Q0864
$$ 100358 427625 375756 291707 61173 -24321 164755 380338 91433 488500 47109 127973
15035A27973L050M00029A04146K16549i6402D41873A65946J10924j04423b0583
$$ 127973 131023 531052 104146 320695 -96402 441873 165946 276870 172447 -20583
15024C44354n9041A9542J45593a16233B52746b08994C03132A5379L07141j26225
$$ 344354 285313 19542 165135 -116233 252746 -208994 303132 15379 322520 196295
15014A96295F7018J2284d2754E3571L6405K3692M8864K00444O9197A71689F3821
$$ 196295 67018 79302 -42754 53571 89976 113668 162532 362976 432173 171689 63821
15002A08613J63477k8224j4082b5052C23513R928K09047A28122J41497d7060E4480
$$ 108613 272090 243866 229784 -25052 323513 333441 542488 128122 269619 -47060 54480
14990C73545C5515Q9551L8805K52880A40566K42582r2632j04072K5842Q8805J07229
$$ 373545 35515 125066 163871 416751 140566 383148 290516 186444 212286 301091 408320
14979D08320I3178L07136J32467b6536k6970B36210m9310J78112j41960F6103
$$ 408320 93178 400314 532781 -26536 -53506 236210 186900 365012 223052 66103
14968A27761M55857A26154N5024l6648a46773A11039K99201j95808K18742J29942
$$ 127761 583618 126154 181178 144530 -146773 111039 410240 214432 433174 563116
14958E63116j83044A05626K79713p9930P4182n7757M8160J56458k04477G8569
$$ 563116 380072 105626 385339 305409 379591 321834 369994 526452 321975 78569
14947B40989K24080J3358G3935J89248G4928L08530A57868F6477d684C85107j29564
$$ 240989 465069 478427 73935 263183 74928 383458 157868 66477 -4684 385107 255543
14936B55543M7103K88751A55509J67842j42687M2029J29003L6680L02632l02485
$$ 255543 302646 591397 155509 323351 180664 222693 351696 388376 691008 388523
14926C88523j72029J6167n8693J01054q2452K95695A71240L07811A59796R1965
$$ 388523 216494 232661 173968 275022 192570 488265 171240 479051 159796 251761
14916B51761k7519L34090A70823J60361A47249g5168C04203j23486j713J84403
$$ 251761 224242 558332 170823 331184 147249 -75168 304203 180717 179004 363407
14906C63407j01147R9647J54353D1781L33181A07416L06352A95296N44609J02097
$$ 363407 262260 361907 516260 41781 374962 107416 413768 195296 739905 842002
14896H42002j17319A37401Q0000M13340A08291K19616n4480Q9910J44842A67535
$$ 842002 724683 137401 217401 630741 108291 327907 273427 363337 508179 167535
14885F76477A49155J27978A34397K93544M0579p0516j8853J69523e0059E90667
$$ 676477 149155 277133 134397 427941 468520 398004 379151 548674 -50059 590667
14874B09023J07492O6272A79544L58711B40271q6702N20903k10873J4991p2684
$$ 209023 316515 382787 179544 538255 240271 153569 674472 463599 478590 405906
14864D05906Q5409n8451l1415J65241k14802J941D9992L11394K59465B21783N54668
$$ 405906 491315 432864 401449 566690 351888 353829 49992 361386 620851 221783 776451
14853G76451k17248j92039n7455L53131P2049A40672M92146B72071N8795J87029
$$ 776451 559203 367164 309709 662840 734889 140672 632818 272071 330866 517895
14843E17895B36451J05240j8650G2482L32338A92330J44442L26289B34081n5000
$$ 517895 236451 341691 323041 72482 404820 192330 336772 663061 234081 179081
14833A79081K93796M6011O673j06643m2545L49662C33218A10425L78900k14133
$$ 179081 472877 518888 525561 418918 376373 726035 333218 110425 489325 275192
14823B75192J8225J79748j84668K13581p6747L34419l35595L666K83739k5875
$$ 275192 293417 473165 288497 502078 425331 759750 424155 427821 711560 685685
14813F85685M9300C64409K65460j79065L04304j94907J24621j14342k14186J69237
$$ 685685 734985 364409 629869 450804 755108 560201 684822 570480 356294 525531
14803E25531J35798k6665m1403p1635K77089l56939Q0145n7202j92344M44669
$$ 525531 661329 634664 593261 521626 798715 441776 521921 464719 272375 717044
14793G17044k69010M20607m20094Q1128J05699C03247L71487j28452J93388l07845
$$ 717044 448034 868641 448547 529675 635374 303247 674734 546282 739670 431825
14783D31825j62298L84848B20474M50890q5346r0161K85632k87906O9103j70583
$$ 431825 269527 654375 220474 671364 586018 495857 781489 493583 562686 392103
14773C92103L30412l5873O4494M27584n13300m87j50753O14756l66505l9535j6881
$$ 392103 722515 686642 751136 1178720 665420 664933 514180 1128936 762431 722896 706015
14762G06015K35652C00974Q3686J84065M01163m05489K54688j08955P5350r276
$$ 706015 941667 300974 384660 568725 969888 564399 819087 710132 785482 776206
14752G76206N0644k70617j78323J06209J74671N471J2583j79616L15224P0445
$$ 776206 826850 556233 377910 484119 658790 664261 676844 497228 812452 882897
14742H82897P2918D30059J69499L79316k58790l20502L52584N6075k01279M27755
$$ 882897 955815 430059 599558 978874 720084 399582 752166 808241 606962 1034717
14732A034717l06532l7433j23039M65769m02720J07664K2405j34668J45052j62156
$$ 1034717 728185 690752 567713 1033482 630762 738426 760831 626163 771215 609059
14722F09059M03223l06687K61822k41272K23333Q4707J45525m98533M73148k94327
$$ 609059 1012282 705595 967417 726145 949478 1034185 1179710 681177 1154325 859998
14712H59998Q8873O1802J89183m94358K81315l06181M65870l54517Q9509K76072
$$ 859998 948871 1010673 1199856 705498 986813 680632 1146502 791985 881494 1157566
14702A157566k03617l33071O19227k13768R3225l86322K49100r685m3243K41214
$$ 1157566 953949 620878 1240105 1026337 1119562 733240 982340 972655 929412 1170626
14692A170626l22935k5738K51474m22127J87684n5104L20080J67659j84827J2751
$$ 1170626 847691 821953 1073427 651300 838984 783880 1103960 1271619 1086792 1099543
14682A099543K4220k10056L76972n27909K63154K45818l56478L15171l49139K82676
$$ 1099543 1123763 913707 1290679 762770 1025924 1271742 915264 1230435 881296 1163972
14672A163972M7001k6507J82123k6672m05294J12769n1184M56452l35322K919
$$ 1163972 1210973 1184466 1366589 1339917 934623 1047392 996208 1452660 1117338 1120257
14662A120257M3749J19649j73524k15486R4146R5430J42837k25047L00614j83341
$$ 1120257 1164006 1283655 1110131 894645 988791 1084221 1227058 1002011 1302625 1119284
14652A119284J17366l1974J2715k37721M17466j08434j87994L36262j71789K35695
$$ 1119284 1236650 1204676 1217391 979670 1397136 1288702 1100708 1436970 1265181 1500876
14642A500876k04682M7614P3252l2929n441L02071k36972j70867M36421j98531
$$ 1500876 1296194 1343808 1417060 1384131 1378690 1680761 1443789 1272922 1709343 1510812
14632A510812J75759m29992M53508k7461Q792k07826k50336Q9324N84557n78695
$$ 1510812 1686571 1256579 1710087 1682626 1691418 1483592 1233256 1322580 1907137 1328442
14622A328442J12434j08486L26784N8263l40115M38403l71980K09433q0355k5001
$$ 1328442 1440876 1332390 1659174 1717437 1377322 1815725 1443745 1653178 1572823 1547822
14612A547822K57640k26210J7830J71599l31065K88877j33395K1310j3810L16663
$$ 1547822 1805462 1579252 1597082 1768681 1437616 1726493 1593098 1614408 1600598 1917261
14602A917261j46064k30399O8751o1253J69007J32021o0476o9563R1149j74603
$$ 1917261 1771197 1540798 1609549 1548296 1717303 1849324 1788848 1719285 1810434 1635831
14592A635831L12675k98112K88603J58397P1380k36971j20184J55108J30721j33207
$$ 1635831 1948506 1650394 1938997 2097394 2168774 1931803 1811619 1966727 2097448 1964241
14582A964241K30246r1615r5652J68822P9451j62875k09678L46799j7979L0298
$$ 1964241 2194487 2102872 2007220 2176042 2255493 2092618 1882940 2229739 2211760 2242058
14572B242058K3325j25503J95258O9705p7445M44129k61128k34259N06868k62502
$$ 2242058 2265383 2139880 2335138 2404843 2327398 2771527 2510399 2276140 2783008 2520506
14562B520506K68639j99895R9018L65285l77971N38640L7521K65713m6082J52979
$$ 2520506 2789145 2589250 2688268 3053553 2675582 3214222 3251743 3517456 3471374 3624353
14552C624353L85609Q83222P25679J897968L046346P727236J9146059J0197688
$$ 3624353 4009962 4893184 5618863 7516831 10563177 18290413 37436472 47634160
14544D7634160k3141645j1193220o105076l128951r92876k69459m87859m99272
$$ 47634160 24492515 13299295 7194219 4065268 3072392 2802933 2315074 1815802
14536A815802J21076K95134k00679L3815K554R7688j0939L35375j064J07258k14836
$$ 1815802 1936878 2232012 2031333 2065148 2067702 2165390 2154451 2489826 2488762 2596020 2381184
14525B381184L61471l57930K50995o3260m6404J0910K83330N8207l8248J945N4152
$$ 2381184 2742655 2384725 2635720 2572460 2526056 2536966 2820296 2878503 2840255 2842200 2896352
14514B896352L8604m3631m0849L24554j39918Q3744k22829J21544K10947K4733
$$ 2896352 2934956 2891325 2850476 3175030 3035112 3118856 2896027 3017571 3228518 3253251
14504C253251j06932L60414k42565J19378Q254J58718k2814j34311l0403k15363
$$ 3253251 3146319 3506733 3264168 3383546 3391800 3550518 3527704 3393393 3362990 3147627
14494C147627M39243J14979j24397q7231l825K33323K00960j10314J3701L54922
$$ 3147627 3586870 3701849 3577452 3490221 3486396 3719719 3920679 3810365 3824066 4178988
14484D178988l45731l2846K93407L6054N55047p37838J17749K97539K0374J3548
$$ 4178988 3833257 3800411 4093818 4129872 4684919 3947081 4064830 4362369 4382743 4396291
14474D396291r0197O2727M86913m53101J89659J39355j67583O44646n09023N61695
$$ 4396291 4306094 4368821 4855734 4402633 4592292 4731647 4564064 5208710 4699687 5261382
14464E261382k92957j00805J6320J44643n488L33249K07073j33672N038k87947
$$ 5261382 4968425 4867620 4883940 5028583 5023095 5356344 5563417 5429745 5434783 5146836
14454E146836K70512J77058R1540K69136K00116j74923p0637K37354J41211K8176
$$ 5146836 5417348 5594406 5685946 5955082 6155198 5980275 5909638 6146992 6288203 6316379
14444F316379L5759j63855K34140p7955L41263K83234l56426J06157J18422M8665
$$ 6316379 6352138 6188283 6422423 6344468 6685731 6968965 6612539 6718696 6837118 6885783
14434F885783K36104p6182K99815n400o8242o3790L12307K42266J50360j19466
$$ 6885783 7121887 7045705 7345520 7340120 7271878 7208088 7520395 7762661 7913021 7793555
14424G793555R7972K50844P4734J27658L00824l14229M64377n423L90224k23399
$$ 7793555 7891527 8142371 8217105 8344763 8645587 8331358 8795735 8790312 9180536 8957137
14414H957137M98560j44247j88108L92559J84928L36548j23168J01097N76429
$$ 8957137 9455697 9311450 9123342 9515901 9700829 10037377 9914209 10015306 10591735
14405A0591735o5642L32942o4496N4378P89861k94507M36315n2250M83096Q6697
$$ 10591735 10526093 10859035 10794539 10848917 11638778 11344271 11780586 11728336 12211432 12298129
14395A2298129K09167j74543K12024K95040P06010J830J76409K70791j29514L20135
$$ 12298129 12507296 12332753 12544777 12839817 13545827 13547657 13724066 13994857 13865343 14185478
14385A4185478M59697K84760K30076j15365P53452N51117k42453M98328M19176
$$ 14185478 14645175 14929935 15160011 15044646 15798098 16349215 16106762 16605090 17024266
14376A7024266j52916N90709L04490L21290K83199P00935K95421L66859M63176
$$ 17024266 16871350 17462059 17766549 18087839 18371038 19071973 19367394 19734253 20197429
14367B0197429M20808K90212K26990P01904K89098P65225L39428M97142L14349
$$ 20197429 20618237 20908449 21135439 21837343 22126441 22891666 23231094 23728236 24042585
14358B4042585O53359N04612N78498Q33701L45117R29259N59637O00999J031719
$$ 24042585 24695944 25200556 25779054 26612755 26957872 27887131 28446768 29047767 30079486
14349C0079486L79476Q28882R37764R58129O37084J048021J151851Q47089Q28250
$$ 30079486 30458962 31287844 32225608 33183737 33820821 34868842 36020693 36867782 37696032
14340C7696032O23332J220323J062332J116495J191984J720069J167886J246002
$$ 37696032 38319364 39539687 40602019 41718514 42910498 44630567 45798453 47044455
14332D7044455J467125J399625J366499J688991J850633J210463K316350J799734
$$ 47044455 48511580 49911205 51277704 52966695 54817328 56027791 58344141 60143875
14324F0143875K176872K100287J941383K265366K934502K377402K785913K478955
$$ 60143875 62320747 64421034 66362417 68627783 71562285 73939687 76725600 79204555
14316G9204555L160438L285532L075492L487314L617526M194107L773410M352625
$$ 79204555 82364993 85650525 88726017 92213331 95830857 100024964 103798374 108150999
14308A08150999M544932M979372M412094N459728N671101O041370O591024O561224
$$ 108150999 112695931 117675303 122087397 127547125 133218226 139259596 145850620 152411844
14300A52411844P214355P236742Q370720Q297044R018283R337694R915726J0626343
$$ 152411844 159626199 166862941 175233661 183530705 192548988 201886682 211802408 222428751
14292B22428751J0489642J2146661J2014792J2482409J3307037J3772469J4062680
$$ 222428751 232918393 245065054 257079846 269562255 282869292 296641761 310704441
14285C10704441J4665250J4994952J4374947J5255519J4685110J4611789J3735885
$$ 310704441 325369691 340364643 354739590 369995109 384680219 399292008 413027893
14278D13027893J2940043J2114315J0407568Q802251N900617K128710l05105j309842
$$ 413027893 425967936 438082251 448489819 457292070 463192687 465321397 465016292 463706450
14270D63706450k705498n187009n908149p491697q911539r547020j0689888j2024555
$$ 463706450 461000952 455813943 449905794 442414097 433502558 423955538 413265650 401241095
14262D01241095j3037058j3995842j5312154j4968586j5226057j5441514j4868465
$$ 401241095 388204037 374208195 358896041 343927455 328701398 313259884 298391419
14255B98391419j4700461j3344432j2810538j2506388j2062786j1177001j1305821
$$ 298391419 283690958 270346526 257535988 245029600 232966814 221789813 210483992
14248B10483992j0124275j0137373q648705q836031p961669p206539p438054o870399
$$ 210483992 200359717 190222344 181573639 172737608 164775939 157569400 150131346 143260947
14240A43260947o549971o181639n148357n484759m871779m964735m693628m279507
$$ 143260947 136710976 130529337 125380980 119896221 115024442 110059707 105366079 101086572
14232A01086572l975929l341062l807795l721004l260871k983064l023575k803305
$$ 101086572 97110643 93769581 89961786 86240782 82979911 79996847 76973272 74169967
14224G4169967k397704k886174k234792k107089k047435j898652k384100k085223
$$ 74169967 71772263 68886089 66651297 64544208 62496773 60598121 58214021 56128798
14216E6128798j692764j669353j374438j090197j737420j477911j770944j297670
$$ 56128798 54436034 52766681 51392243 50302046 48564626 47086715 45315771 44018101
14208D4018101j025327p06425o26427j719942j444248r39738j011682p25673q13907
$$ 44018101 42992774 42286349 41659922 39939980 38495732 37555994 36544312 35818639 35004732
14199C5004732p53520j161029q63021j053114l99563p85032o93528o66898q68155
$$ 35004732 34251212 33090183 32227162 31174048 30774485 29989453 29295925 28629027 27760872
14190B7760872o81404n59071m96076r17451n33043l80834m98383p23759j68972
$$ 27760872 27079468 26520397 26024321 25106870 24573827 24192993 23694610 22970851 22801879
14181B2801879o07716n46218m36703m16997n77656Q7099p01378m51603m79621
$$ 22801879 22194163 21647945 21211242 20794245 20216589 20303688 19602310 19150707 18671086
14172A8671086j92384n05469j18420n59089o1551m38436k25131j07988o34213
$$ 18671086 18478702 17973233 17854813 17295724 17234173 16795737 16570606 16462618 15828405
14163A5828405o95687J13231o33464J33335m69045k49494J28613l07489m99093
$$ 15828405 15132718 15245949 14612485 14745820 14276775 14027281 14155894 13848405 13349312
14154A3349312k31357j02704m37542j13844k3830j51044n11589K55092o54387
$$ 13349312 13117955 13015251 12577709 12463865 12440035 12288991 11777402 12032494 11378107
14145A1378107L46588m41217L81353p49233r5252j13772k50618q0168l06022r4540
$$ 11378107 11724695 11283478 11664831 10915598 10820346 10706574 10455956 10375788 10069766 9975226
14135I975226l2276l04884j69166K3194l97762M2696k6544k03148P7312k9611
$$ 9975226 9942950 9638066 9468900 9492094 9094332 9137028 9110484 8907336 8984648 8955037
14125H955037l41579k65971k35151K49339l01401j69210l53741M46721k49863
$$ 8955037 8613458 8347487 8112336 8361675 8060274 7891064 7537323 7984044 7734181
14116G734181l40395J51326q1758k06594j17230o1262o2124j69069K13225j16186
$$ 7734181 7393786 7545112 7463354 7256760 7139530 7078268 7016144 6847075 7060300 6944114
14106F944114k40000j4297o8088J74784j33239l25007k39956l1242J24152n4366
$$ 6944114 6704114 6689817 6621729 6796513 6663274 6338267 6098311 6067069 6191221 6136855
14096F136855J2289K0073m21369K23529l21630K05619l75472K78838k89218J665
$$ 6136855 6149144 6169217 5747848 5971377 5649747 5855366 5479894 5758732 5469514 5471179
14086E471179J1223n03591J62787m105J07917j56490J3325j4800j43375J59128
$$ 5471179 5482402 4978811 5141598 5137493 5245410 5088920 5102245 5087445 4944070 5103198
14076E103198n70135J9009K87930m43239J08463R6552m29002J02472M5850K82584
$$ 5103198 4533063 4552072 4840002 4396763 4505226 4601778 4172776 4275248 4321098 4603682
14066D603682k43938m16095L00038M2776j54040k1063J65838j35504j2862K44213
$$ 4603682 4359744 3943649 4243687 4286463 4132423 4111360 4277198 4141694 4128832 4373045
14056D373045k16066l06519K5477k61048J62579j41272J53568l11550j19906J32545
$$ 4373045 4156979 3850460 3875937 3614889 3777468 3636196 3789764 3478214 3358308 3490853
14046C490853K4824j45808L40101k98145J16781j44140j07036k7718q9204N6820
$$ 3490853 3515677 3369869 3709970 3411825 3528606 3384466 3277430 3249712 3160508 3217328
14036C217328j89562n7925R7689K17608k1718m10318J23496L52099k01905O0121
$$ 3217328 3027766 2969841 3067530 3285138 3263420 2853102 2976598 3328697 3126792 3186913
14026C186913j99832L4933k46726K6851m2985l1856K53435o7843q6008j78524
$$ 3186913 2987081 3022014 2775288 2802139 2759154 2727298 2980733 2912890 2826882 2648358
14016B648358P3209j46839l9826K67489n03762N49447k68403j70423Q8903j77375
$$ 2648358 2721567 2574728 2534902 2802391 2298629 2848076 2579673 2409250 2498153 2320778
14006B320778m2633R4887j2726L20052m41900J85156k47355l11035M04316o7032
$$ 2320778 2278145 2373032 2360306 2680358 2238458 2423614 2176259 1865224 2269540 2202508
13996B202508O6630k78442K66885J79544k53604K25501L32322Q40734K095395
$$ 2202508 2269138 1990696 2257581 2437125 2183521 2409022 2741344 3582078 5677473
13987E677473N742025J6724713K0061224j9227470j3936154n750175k335311j303073
$$ 5677473 11419498 28144211 48205435 28977965 15041811 9291636 6956325 5653252
13979E653252j113967n42727p4664o56285K0205m68773K8599l39244K73905l25950
$$ 5653252 4539285 3996558 3921894 3265609 3285814 2817041 2845640 2506396 2780301 2454351
13969B454351K7368q2315K46277N456j20040o49656L54334j35323K75025k55424
$$ 2454351 2481719 2399404 2645681 2651137 2531097 1881441 2235775 2100452 2375477 2120053
13959B120053M8596L2479K43053j64618l08496j11204J03094r1841L40133p3440
$$ 2120053 2168649 2201128 2444181 2279563 1971067 1859863 1962957 1871116 2211249 2137809
13949B137809J04919n24174o6551J724L20765k49896K80817J62408l34297P7966
$$ 2137809 2242728 1718554 1652003 1653727 1974492 1724596 2005413 2167821 1833524 1911490
13939A911490j34768J24736R4093j88689k2920J71404l16695k17416O88743m61097
$$ 1911490 1776722 1901458 1995551 1806862 1783942 1955346 1638651 1421235 2109978 1648881
13929A648881k2538L34692l65092L26347k4913m04126J78491L5777P8125j40805
$$ 1648881 1626343 1961035 1595943 1922290 1897377 1493251 1671742 1707519 1785644 1644839
13919A644839j05294J29575j86833M23205l89767J73882j89403r4929K53905k84740
$$ 1644839 1539545 1669120 1482287 1905492 1515725 1689607 1500204 1405275 1659180 1374440
13909A374440J23079J09980j63192r7788P3823k24522L33870k74880J28416p2275
$$ 1374440 1497519 1607499 1444307 1346519 1420342 1195820 1529690 1254810 1383226 1310951
13899A310951j29045J08137N2971l0662L34791l23602j28666J61925K7592J19745
$$ 1310951 1181906 1290043 1343014 1312352 1647143 1323541 1194875 1356800 1384392 1504137
13889A504137j04732P9120J14576j97617L0088m41080L41073L6855J50935l49671
$$ 1504137 1399405 1478525 1593101 1395484 1425572 984492 1325565 1362420 1513355 1163684
13879A163684r9276M11920j29665k79255P3953O5389j44115J47274O284P1000
$$ 1163684 1064408 1476328 1346663 1067408 1141361 1206750 1062635 1209909 1216193 1287193
13869A287193k21347J0189n4800L65127j13117j3415m4199p7435j33904n2043
$$ 1287193 1065846 1076035 1021235 1386362 1273245 1259830 1215631 1138196 1004292 952249
13859I52249J47442k6462K58376j89235O2016k0514j90608r2466J51515J53641
$$ 952249 1099691 1073229 1331605 1142370 1204386 1183872 993264 900798 1052313 1205954
13849A205954m93699K62020p3652M50762k88720J67387k97102J99241J5727l1297
$$ 1205954 712255 974275 900623 1351385 1062665 1230052 932950 1132191 1147918 1116621
13839A116621L8832j86457j08573J6596J17491J01540l26088K20370j70951J68453
$$ 1116621 1155453 968996 860423 877019 994510 1096050 769962 990332 819381 987834
13829I87834J18535k2523J50671k87233J83302k47012o7448J31434J37936k56291
$$ 987834 1106369 1083846 1234517 947284 1130586 883574 816126 947560 1085496 829205
13819H29205l56421P07639j2570l12189J05119j7406j93153j21830J98731J58205
$$ 829205 472784 1180423 1167853 855664 960783 943377 750224 628394 827125 985330
13809I85330j75017j04922J08732O746l77521M50785k23761L74510j77716k25758
$$ 985330 810313 705391 814123 820869 443348 894133 670372 1044882 867166 641408
13799F41408Q9140L30433E08739M65116m29596L90813k32710J71375q6334K42355
$$ 641408 730548 1060981 508739 973855 544259 935072 702362 873737 787403 1029758
13789A029758l73344K51160j03377k04365J5503K19679K40180m43868L71926k8908
$$ 1029758 656414 907574 804197 599832 615335 835014 1075194 631326 1003252 974344
13779I74344m18179L41667q1027J63898m10480M34193k87193m5491J15292k25163
$$ 974344 556165 897832 816805 980703 570223 1004416 717223 671732 787024 561861
13769E61861J58092j13856L738J08210j22202P5065L5254j42610N20520n16604
$$ 561861 719953 606097 609835 718045 595843 670908 706162 563552 1084072 567468
13759E67468L39541K3101k24434J69237k56611l3146J01237p5653J86433j32396
$$ 567468 907009 930110 705676 874913 618302 585156 686393 610740 797173 664777
13749F64777J90866N9381k46797R0384k61788J93024q590J583R894l5776L4527
$$ 664777 855643 915024 668227 758611 496823 689847 681257 682840 692734 656958 691485
13738F91485k39467L50012j12382j67167K02062j01058j21433L1192r0708n8926
$$ 691485 452018 802030 689648 522481 724543 623485 502052 533244 442536 383610
13728C83610j33175M85995j88136J50634B10934O67257k93951j33093L46108j83103
$$ 383610 250435 736430 548294 698928 210934 878191 584240 451147 797255 614152
13718F14152k42398L77307I4757N35555L0883q8810J62091j0960B57737L9821
$$ 614152 371754 749061 94757 630312 661195 572385 734476 723516 257737 297558
13708B97558J9266Q2287M01179j56254A16567K35116n3146J73683K39319k04349
$$ 297558 316824 399111 800290 644036 116567 351683 298537 472220 711539 507190
13698E07190K45779l19138Q5402b5467A86572K61733m1339K62206k62460K44470
$$ 507190 752969 433831 519233 -25467 186572 448305 406966 669172 406712 651182
13688F51182q0639J0581B73792K47011j16936k7738j7822K21219k80311K45553
$$ 651182 570543 581124 273792 520803 403867 376129 358307 579526 299215 544768
13678E44768r2143j07012J54783n9750l2471P6137J33283m8785l9604q943l3600
$$ 544768 452625 345613 500396 440646 408175 484312 617595 568810 529206 520263 486663
13667D86663B28851J87363J09215j4778m8145k20424K01197J23800j0407J64799
$$ 486663 228851 416214 525429 510651 462506 242082 443279 567079 556672 721471
13657G21471k54736r0828K45339B19707J74883r3702J85409J2155j90434A7277
$$ 721471 466735 375907 621246 219707 394590 300888 486297 498452 308018 17277
13646D42254r0382K10562k6486q6042A12165L51810k08729F0528N00070j69943
$$ 442254 351872 562434 535948 449906 112165 463975 255246 60528 560598 390655
13636C90655J83991k31421q7779J48738l1876L13482k7506k30318K12078B70622
$$ 390655 574646 343225 255446 404184 372308 685790 658284 427966 640044 270622
13625D31787J36958j57314j56695K83176n8200j48850R6368r4219L54644k03606
$$ 431787 568745 411431 254736 537912 479712 330862 427230 333011 687655 484049
13615D84049j13759K23167k06188A04063M92872k41177j39121J14808P1364j03182
$$ 484049 370290 593457 387269 104063 596935 355758 216637 331445 402809 299627
13605B99627k8760J98903o6264j28673Q4868K8246p1930j44118P446L13908A27570
$$ 299627 270867 469770 403506 274833 359701 387947 316017 171899 179345 493253 127570
13593A21900J26015J13555K62021B42834P651r6893N18030l21162KL051J42200
$$ 121900 247915 361470 623491 242834 250485 153592 671622 350460 350462 353513 495713
13582D95713J83502A73072J0568K34104P2919k3630N7639J31751k27838q3635
$$ 495713 679215 173072 183640 417744 490663 467033 524672 656423 428585 344950
13572C44950Q6636j04361P9958O7995K42825k60157A37766K21786j53124K18085
$$ 344950 431586 327225 407183 475178 718003 457846 137766 359552 206428 424513
13562D24513j98738K16862K91296B11857L12098I1862M96516j34183A48666l6580
$$ 424513 225775 442637 733933 211857 523955 91862 588378 454195 148666 112086
13552A12086N8473Q24K35737B01092n9796M16115O924k54425n0010j01632M5328
$$ 112086 170559 171383 407120 201092 141296 557411 564335 309910 259900 158268 203596
13541B03596J00050J23021j21060J61713J31522B88993C9842P9856M37922j87495
$$ 203596 303646 426667 305607 467320 598842 288993 39842 119698 557620 370125
13531C70125M7345M0248A53475M21891k66602L614M5889n2820L8872K57711B87309
$$ 370125 417470 457718 153475 575366 308764 312378 358267 305447 344319 602030 287309
13519B59737Q6674l6235L5638a20306C71934a0521l5379A98584O9564O1248k049
$$ 259737 346411 310176 345814 -120306 371934 -10521 -45900 198584 268148 329396 327347
13508C27347A10116K10314A37003M91074A78572J79754A77559L73707k68399j24303
$$ 327347 110116 320430 137003 628077 178572 358326 177559 551266 282867 158564
13498A58564J85223a34850D64979A48956J01797m6448O1455k7023l090B5930K48116
$$ 158564 343787 -134850 464979 148956 250753 204305 265760 238737 235647 25930 274046
13487B74046L5963A7587L09488N8205j63040K43345l0829j20718A17138K68399
$$ 274046 310009 17587 327075 385280 222240 465585 434756 314038 117138 385537
13477C85537j80544K21063q3297A24373J88915j29383c8874H4051J67963F2998
$$ 385537 204993 426056 342759 124373 313288 183905 -38874 84051 252014 62998
13466E77001B3258L35637I739M51601M9986H5679P8937j8167K06780n4148q53
$$ 577001 23258 358895 9739 461340 511326 85679 164616 146449 353229 299081 298228
13455B98228k0331P9565B5917Q9765L09862j47257J89518g0285B4836N56874B30657
$$ 298228 277897 357462 25917 115682 425544 278287 467805 -70285 24836 581710 230657
13443h5910A21098J418K33888A45154m5353c5901m5731j1969E18310F7518K84688
$$ -85910 121098 122516 356404 145154 99801 -35901 -81632 -93601 518310 67518 352206
13432C52206A05382K1728l201K12780I9355L10425n5579a80262A65476E9011L70573
$$ 352206 105382 127110 123909 336689 99355 409780 354201 -180262 165476 59011 429584
13421D29584j8716G6698J40462n7970L91598H5062l1331Q5157N8321J7927J8262
$$ 429584 410868 76698 217160 159190 550788 85062 53731 138888 197209 215136 233398
13410B33398L1855q3660P4505b49506B59975R885L45847B40362m7951J11348c6553
$$ 233398 265253 181593 256098 -249506 259975 269860 615707 240362 192411 303759 -36553
13398B49283P9364j32891p9375L54189E9905J24654J64066c2117B48458L5037
$$ 249283 328647 195756 116381 470570 59905 184559 348625 -32117 248458 283495
13388B83495A09444K30240j42836B4682J57005j784e9761A95488g9338A45906
$$ 283495 109444 339684 196848 24682 181687 179903 -59761 195488 -79338 145906
13377E3408K60872A41789J36369a23572B34996q2372c0715D3636Q3142Q1159p6468
$$ 53408 314280 141789 278158 -123572 234996 152624 -30715 43636 126778 207937 131469
13366A31469P8001j6661J47090A2980M35245a61140A48983K01234K41664k67640
$$ 131469 209470 192809 339899 12980 448225 -161140 148983 350217 591881 324241
13356C24241R6476A93253J43151F1226K58079A07993J27032J69823a8741D71044
$$ 324241 420717 193253 336404 61226 319305 107993 235025 404848 -18741 471044
13345E04714A42689L43298j26844Q4009F2434J60738J90092j7976j72346J37869
$$ 504714 142689 485987 359143 443152 62434 223172 413264 395288 222942 360811
13335C60811n3417L7192E6015K20888J92008A28906K31116i2975E82322k83585
$$ 360811 307394 344586 56015 276903 468911 128906 360022 -92975 582322 298737
13325B98737R4143H5274K5687K02888p7595a4700A17865L48011A62251K16936
$$ 298737 392880 85274 110961 313849 236254 -14700 117865 465876 162251 379187
13315C79187j49274r6440N5151Q4902r9274D4774L72997f924A16471Q1401r0950
$$ 379187 229913 133473 188624 273526 174252 44774 417771 -6924 116471 197872 106922
13304A06922C9727a68135D2140K32181D1340J87964a6807A4271K23777o2894H2102
$$ 106922 39727 -168135 42140 274321 41340 229304 -16807 14271 238048 175154 82102
13292b2251A34758A7338N155R5380a11938j98060E9348F896K23981J74755F6099
$$ -22251 134758 17338 22493 117873 -111938 -309998 59348 6896 230877 405632 66099
13280C31411A40557e1010B29802n625k6671M3903m4651b404C97N4586K21654F1250
$$ 331411 140557 -51010 229802 224177 197506 241409 196758 -2404 397 54983 276637 61250
13267E67081G0906e8040B89877A34782m8909K7143K7739L8373J70101A22445K47191
$$ 567081 70906 -58040 289877 134782 85873 113016 140755 179128 349229 122445 369636
13256C69636J42870E9431f7152H5515G548L05733a13908C92514j52382a5070k49859
$$ 369636 512506 59431 -67152 85515 7548 313281 -113908 392514 240132 -15070 -264929
13245b64929A72197R2726r6372E4974B2659R7847C3241p907N03332G4328L3350
$$ -264929 172197 264923 168551 54974 22659 120506 33241 25334 528666 74328 107678
13234A07678N6365a3616C70499j43029K27382k03606a5869j10780B38215F0730
$$ 107678 164043 -13616 370499 227470 454852 251246 -15869 -126649 238215 60730
13223a02071G7133e8721D08465a3618I9326j3912B0408K30989c510j56991E42998
$$ -102071 77133 -58721 408465 -13618 99326 85414 20408 251397 -3510 -160501 542998
13211a21937a6177A19036b2341C49665j3884C8579J41697q9700a77777A73511
$$ -121937 -16177 119036 -22341 349665 335781 38579 180276 90576 -177777 173511
13200A39209Q6615j12116K10922I8479c3869A0215J18886J41785I0918j8697J71110
$$ 139209 225824 113708 324630 98479 -33869 10215 129101 270886 90918 72221 243331
13189B43331H6567J17154C9765J36303K03840e1601B47125a25438E5516B7485
$$ 243331 86567 203721 39765 176068 379908 -51601 247125 -125438 55516 27485
13178D71705j26123j45332b312B72212a8646B76339j05256R5313r143e765B96252
$$ 471705 345582 200250 -2312 272212 -18646 276339 171083 266396 257253 -5765 296252
13166A81784n8402J40215H1959O2941i1043q8401A63449J1219M7501f5446E30227
$$ 181784 123382 263597 81959 144900 -91043 -179444 163449 174668 222169 -65446 530227
13154B38767o7803a73157B01709A3032M8601K4466a92730B62656j14469G2909
$$ 238767 170964 -173157 201709 13032 61633 86099 -192730 262656 148187 72909
13143B84334a21395b4507h187A33499a1063I4660b50645A46606N1761a47798K5100
$$ 284334 -121395 -24507 -8187 133499 -11063 94660 -250645 146606 198367 -147798 -122698
13132a22698A23995J99540l5660a1102H0105f8139A53464J9290j2139b8160B52152
$$ -122698 123995 323535 287875 -11102 80105 -68139 153464 172754 160615 -28160 252152
13120A79966D6307K54963A25559K43301j67118d6936A07203P2720b0047q4205
$$ 179966 46307 301270 125559 368860 201742 -46936 107203 179923 -20047 -104252
13110a04252A3846J93226a5832j32150j4134A26470C2161J40915k7756N1089J12793
$$ -104252 13846 207072 -15832 -147982 -162116 126470 32161 173076 145320 196409 309202
13099C09202a63072O2128b7168L717C4669J84920F1758a99094e5276H8522J13776
$$ 309202 -163072 -100944 -27168 -23451 34669 219589 61758 -199094 -55276 88522 202298
13088B02298G1733k5239M9962a80209j2424C35231H8044K69222j44138j05597
$$ 202298 71733 46494 96456 -180209 -192633 335231 88044 357266 213128 107531
13078A07531h5362H0373j2612a62089A81785B2798b44152B4681L39J0559J95990
$$ 107531 -85362 80373 67761 -162089 181785 22798 -244152 24681 25020 35579 231569
13067B31569A9233K23709C648a10614A37116F4751J77119g855o6738B01351J31457
$$ 231569 19233 242942 3648 -110614 137116 64751 241870 -7855 -74593 201351 332808
13056C32808c4104A20707J06018H2742g0219C61132a44341B31531a54826j07690
$$ 332808 -34104 120707 226725 82742 -70219 361132 -144341 231531 -154826 -262516
13046b62516A01232J00M9362a47149O8000A1281b97892B43471I0886K9131K47383
$$ -262516 101232 101332 150694 -147149 -79149 11281 -297892 243471 90886 120017 367400
13035C67400j46013J7033a19763j8073H205L1095C377L39120m8747a14208E1001
$$ 367400 221387 238420 -119763 -137836 8205 39300 3377 342497 293750 -114208 51001
13023C45915e4659A63772P3801H4373L45582A66593a717C73033C2393L6784b05338
$$ 345915 -54659 163772 237573 84373 429955 166593 -1717 373033 32393 69177 -205338
13011B12135b44153C64773J4597A47007a7322B58750Q5158a3285B04929A3056
$$ 212135 -244153 364773 379370 147007 -17322 258750 343908 -13285 204929 13056
13000H6875a67529I9571j9039g1121l8743n718M1818D4534J23484F6009R5778
$$ 86875 -167529 99571 80532 -71121 -109864 -115582 -73764 44534 168018 66009 161787
12989A61787R8858P573h1960A75157a72039B26579a24815A83397b20603C47620
$$ 161787 260645 268218 -81960 175157 -172039 226579 -124815 183397 -220603 347620
12978b12451a421C73767b01584R781j2971g1382B30256G5399J66680n1408a6531
$$ -212451 -1421 373767 -201584 -191803 -204774 -71382 230256 75399 242079 190671 -16531
12966h5887a4317p6882C18616A25782n7340J62532a05090K3097A80191j0102j4302
$$ -85887 -14317 -91199 318616 125782 68442 230974 -105090 -81993 180191 170089 155787
12955A55787m5581n3275a08289B00736a30606B8040b32128A39032J05924A119
$$ 155787 110206 56931 -108289 200736 -130606 28040 -232128 139032 244956 1119
12944I7673D4681O4629J19336n0227h5590j48778l6628B4342a77762H4721G798
$$ 97673 44681 109310 228646 178419 -85590 -234368 -270996 24342 -177762 84721 7798
12932A577J15526a37707C8147a39298D4469J76050L282c1478I0540K35291e544
$$ 1577 117103 -137707 38147 -139298 44469 220519 223801 -31478 90540 325831 -5544
12920A1693K06934i7213M3177f40n0331D86132A33352K07677I2152b7717j42348
$$ 11693 218627 -97213 -54036 -640 -50971 486132 133352 341029 92152 -27717 -170065
12909a70065C78159d0298A54456J37371h1575A02423J85052G6712J61492a78642
$$ -170065 378159 -40298 154456 291827 -81575 102423 287475 76712 238204 -178642
12898A03308B4158Q1501E191A203a23683p4588E6763b50259A21437A6691g5328
$$ 103308 24158 105659 5191 1203 -123683 -198271 56763 -250259 121437 16691 -75328
12886a81085P1266B63199c42051A02645a85207A34058O5927n3045c3659j04849
$$ -181085 -109819 263199 -342051 102645 -185207 134058 199985 146940 -33659 -138508
12876a38508A52061o4296J61299b23820C18724r8565a70854B09208F4230B0656
$$ -138508 152061 87765 249064 -223820 318724 220159 -170854 209208 64230 20656
12865a22707A87843a61202H2397C0899J6362L07483a0008B63605j19896n5842
$$ -122707 187843 -161202 82397 30899 47261 354744 -10008 263605 143709 87867
12855H7867a9358r5847C7393a66625j73275B19490b08727C29195A47178M7740
$$ 87867 -19358 -115205 37393 -166625 -339900 219490 -208727 329195 147178 194918
12845A94918J1419n1262e7024A49203a68947j18647B43191A8230L65019A47101
$$ 194918 206337 155075 -57024 149203 -168947 -287594 243191 18230 383249 147101
12834A74935j9359a6866j64719k1538A35536A6960h887D07023h4397j71648R9497
$$ 174935 155576 -16866 -181585 -203123 135536 16960 -8887 407023 -84397 -256045 -156548
12823a56548A41496F9237b657B91840p5174b34589a12210J1848j47368J23782
$$ -156548 141496 69237 -2657 291840 216666 -234589 -112210 -100362 -247730 -123948
12813a23948j26171D5441K22249A25041J14722r9472J66375a14579n1738M5032
$$ -123948 -250119 45441 267690 125041 239763 140291 306666 -114579 -166317 -121285
12803a21285B6981J48298j3690J51854a22022I1284d4435E9790b0553A25963a23073
$$ -121285 26981 175279 161589 313443 -122022 91284 -44435 59790 -20553 125963 -123073
12791B04586P9455A21964k3139a52676f1652B4788a79091A57355M0137c89175
$$ 204586 284041 121964 98825 -152676 -61652 24788 -179091 157355 197492 -389175
12780F4388N980a00927G6133p687b9002H2715L2585j8996K30425b7329A74353
$$ 64388 70368 -100927 76133 68446 -29002 82715 115300 96304 326729 -27329 174353
12768a87032p989A32139a72371A11256c24374G7955i2539A48375f461A03630b90464
$$ -187032 -195021 132139 -172371 111256 -324374 77955 -92539 148375 -6461 103630 -290464
12756G4643b1701l7905b5035E70274g4928E9375e4391J4677C4775b114k16603
$$ 74643 -21701 -59606 -25035 570274 -74928 59375 -54391 -39714 34775 -2114 -218717
12745b18717m7276a27252d4485q0392E440b14712h6317A62056d5897C30354f3705
$$ -218717 -265993 -127252 -44485 -124877 5440 -214712 -86317 162056 -45897 330354 -63705
12733I5283J62766J00276F1324e0308l6848a868C15064f0372D7077M463a27991
$$ 95283 258049 358325 61324 -50308 -87156 -1868 315064 -60372 47077 51540 -127991
12721F4203B2818b77540C11665a13583K8554j42224A62459g1032A64043f7117
$$ 64203 22818 -277540 311665 -113583 -85029 -227253 162459 -71032 164043 -67117
12710b6324B62640K62254a321B42084O8388k6068a06480L9107E21615Q1974k64469
$$ -26324 262640 524894 -1321 242084 310472 284404 -106480 -67373 521615 603589 339120
12699C39120C5372a29607B57291A6801e1944B4298K55789q0353J63338I5189O5605
$$ 339120 35372 -129607 257291 16801 -51944 24298 280087 199734 363072 95189 160794
12688A60794f1764B00191o535a08685M8907E0460P3569D5929b97510D77246A81644
$$ 160794 -61764 200191 193656 -108685 -59778 50460 124029 45929 -297510 477246 181644
12676g8145A45976K13324r4217n0968n1966k3752M5628J09841a37296l6451B6618
$$ -78145 145976 359300 265083 214115 162149 138397 184025 293866 -137296 -173747 26618
12664d7063B26391o5042J3600b4466C41985a41058A12472K44660j36647B9385
$$ -47063 226391 161349 174949 -24466 341985 -141058 112472 357132 220485 29385
12653A14803a18136B00471J19640a554C79673h9695E94356C3913J07406b09403
$$ 114803 -118136 200471 320111 -1554 379673 -89695 594356 33913 141319 -209403
12642a14748B74842p0563a07416A12876Q4705b12978C3374g4460D9092K39884
$$ -114748 274842 204279 -107416 112876 197581 -212978 33374 -74460 49092 288976
12632B88976H8686a57605a7325j16000A82557D1742J11712j995P4487q7175g0438
$$ 288976 88686 -157605 -17325 -133325 182557 41742 153454 151459 225946 138771 -70438
12620A82562i2821D22077I7276m8096K90278M8044a57267M9529C4896M21423e0140
$$ 182562 -92821 422077 97276 49180 339458 387502 -157267 -107738 34896 456319 -50140
12608h7034I1898b54557f2726A23023K1210B0073L45471C0839P3863K85130h5609
$$ -87034 91898 -254557 -62726 123023 144233 20073 365544 30839 104702 389832 -85609
12596A72647j1468D1805R855c9265a8399a669n7928B42603a6371C7283a44731
$$ 172647 161179 41805 51660 -39265 -18399 -1669 -59597 242603 -16371 37283 -144731
12584B05163I2320C044b4230j32044A10055K75766c00324B874e1792j67560a02525
$$ 205163 92320 3044 -24230 -156274 110055 385821 -300324 2874 -51792 -219352 -102525
12572b29746C946b86302h9006B40456B0113b48364D20947P5384B24667B805J85851
$$ -229746 3946 -286302 -89006 240456 20113 -248364 420947 496331 224667 2805 188656
12561A88656a97911B0626J25303m0794k9989o494J50300I2516b42195h2073l58531
$$ 188656 -197911 20626 145929 105135 75146 68652 218952 92516 -242195 -82073 -440604
12550d40604I8935k9154l1830J4385O326K07417G9836M5862l0188J82215a32904
$$ -440604 98935 69781 37951 52336 58662 266079 79836 125698 95510 277725 -132904
12538g0647B6082J01709H659b38004B35955c0868l9440A83910e428p5028H3411
$$ -70647 26082 127791 8659 -238004 235955 -30868 -70308 183910 -5428 -80456 83411
12526A45543a28577I8765J72986b6016C6165K2967J29667J6625K8246J75115b04566
$$ 145543 -128577 98765 271751 -26016 36165 59132 188799 205424 233670 408785 -204566
12514A62463F2321c45120a8699E8563R4253L42235A64783J90937C7237a1139j33407
$$ 162463 62321 -345120 -18699 58563 152816 495051 164783 355720 37237 -11139 -144546
12503a44546m4326C93322A04276J4990h9524b4267k58020A0734b31048B10873
$$ -144546 -188872 393322 104276 119266 -89524 -24267 -282287 10734 -231048 210873
12492A37605a53482r0194C0419g5683j45638B86450f5273j52803L6974c5722B02363
$$ 137605 -153482 -243676 30419 -75683 -221321 286450 -65273 -218076 -181102 -35722 202363
12480a6710j55200B65937H6450d5532j61908g7498k90079d4125m1480A19873N8421
$$ -16710 -171910 265937 86450 -45532 -207440 -77498 -367577 -44125 -85605 119873 178294
12469A78294j9799O6049a92095j25448B63905a73808B96760b82303D2725J42165
$$ 178294 158495 224544 -192095 -317543 263905 -173808 296760 -282303 42725 184890
12459A84890g2571j36471d5837j43340q150k1005B11706p9411C3355J085d69502
$$ 184890 -72571 -209042 -45837 -189177 -197327 -218332 211706 132295 33355 34440 -469502
12447G5567k6798i9073d0142o726C50592C1809R1152A0725J16589f1678A63266
$$ 75567 48769 -99073 -40142 -46868 350592 31809 122961 10725 127314 -61678 163266
12435D4525b10224D0197Q5665Q058J48484A01100d7431J0939m039l27959E5479
$$ 44525 -210224 40197 125862 133920 282404 101100 -47431 -36492 -40531 -368490 55479
12423h9547B27463n7730J52508i6479E6181c56170f1604b951k35989j86411B14025
$$ -89547 227463 169733 322241 -96479 56181 -356170 -61604 -2951 -238940 -425351 214025
12411A20892A183b73477a09430n8328A78783a3306j12351E2805c00500B11792
$$ 120892 1183 -273477 -109430 -167758 178783 -13306 -125657 52805 -300500 211792
12400a13823F0168r205c734C36301a77327b0118D3199J1371B1933R7780d4590
$$ -113823 60168 50963 -3734 336301 -177327 -20118 43199 54570 21933 119713 -44590
12388A36510B7520Q4087J86871A11940b441j2660A30989r258a95495G1315k1318
$$ 136510 27520 111607 298478 111940 -2441 -15101 130989 121731 -195495 71315 49997
12377D9997J03807A794a88176d0785A78808c17454a57649g7044b3831j27134A44642
$$ 49997 153804 1794 -188176 -40785 178808 -317454 -157649 -77044 -23831 -150965 144642
12365A77799q6755L20817b10412j24872C06404b89644f4785k6439J1711a0041
$$ 177799 91044 411861 -210412 -335284 306404 -289644 -64785 -91224 -79513 -10041
12354C05843a72572j3499B10666E6945A3549J31500a83417A27467n4786b68278
$$ 305843 -172572 -186071 210666 56945 13549 145049 -183417 127467 72681 -268278
12343b59501J4882a00942E5254J91063b18286f6264l39E10577A3425a11624H0553
$$ -259501 -244619 -100942 55254 246317 -218286 -66264 -66603 510577 13425 -111624 80553
12331D7877A8523o352K93530G8278f5902E5854J72885g4634j13737e9570j52784
$$ 47877 18523 12171 305701 78278 -65902 55854 228739 -74634 -188371 -59570 -212354
12320b12354b4678p0922j92203A82186B0234Q1553f0344a42j095C1305J05782
$$ -212354 -24678 -95600 -287803 182186 20234 101787 -60344 -142 -1237 31305 137087
12309A37087K48784A50671A6908a7248A59288A0668K57664A6458K08366A11087
$$ 137087 385871 150671 16908 -17248 159288 10668 268332 16458 224824 111087
12298h1305D0473L67933b37472B09863E1847b19886d2280n5260D9947a16145E9596
$$ -81305 40473 408406 -237472 209863 51847 -219886 -42280 -97540 49947 -116145 59596
12286A14331b4277F3111d091j1787B62933a10964B14106J55619a4252q3119B60856
$$ 114331 -24277 63111 -4091 -15878 262933 -110964 214106 369725 -14252 -97371 260856
12274A98407D7902b0724D91327F2021J73614B5181i2704A46712P7079a40356I7605
$$ 198407 47902 -20724 491327 62021 235635 25181 -92704 146712 223791 -140356 97605
12262D6863J82148E8513c43615A58386a09751A95269c62228C6673J88124D0967
$$ 46863 229011 58513 -343615 158386 -109751 195269 -362228 36673 224797 40967
12251i9506A96211K03003a58343G522K40048h5289H7302a1095A11008B3833K07507
$$ -99506 196211 399214 -158343 7522 247570 -85289 87302 -11095 111008 23833 231340
12240B31340C3506J66738A3381d3904A89046D641J94170c5380B35086a57522i062
$$ 231340 33506 200244 13381 -43904 189046 4641 198811 -35380 235086 -157522 -9062
12228a38874J3180C73677j05891P0176A62804K20557j37295M3479M4944j02843
$$ -138874 -125694 373677 267786 337962 162804 383361 246066 289545 334489 231646
12218B31646p1902a49512C36877J45668B5083L03341h8420D39103p7315J6432
$$ 231646 159744 -149512 336877 482545 25083 328424 -88420 439103 361788 378220
12208C78220J75662B60869m1337j03716R2291o5348L32694n6096L3663G9893J97234
$$ 378220 553882 260869 219532 115816 208107 142759 475453 419357 453020 79893 277127
12197B77127h7528A97562L47762G6065K06242A21761R5848e5144F0234h9231o6328
$$ 277127 -87528 197562 545324 76065 282307 121761 217609 -55144 60234 -89231 -155559
12186a55559A96370A334J85808g2007A84032c0330j82918B56457R4103l1803d1005
$$ -155559 196370 1334 187142 -72007 184032 -30330 -213248 256457 350560 318757 -41005
12174C42247j10426j10036a41980C28421A33588K17972i8582C10191m7482A11093
$$ 342247 231821 121785 -141980 328421 133588 351560 -98582 310191 262709 111093
12163b00159C07845a66398B35158p9832J6221a7027A9847a77239P5550G3299r379
$$ -200159 307845 -166398 235158 155326 171547 -17027 19847 -177239 -101689 73299 63920
12152F3920k7132d0085p5557B31723G8576J9873M384J18016c20l0530l3740k20245
$$ 63920 36788 -40085 -115642 231723 78576 98449 102833 220849 -320 -30850 -64590 -284835
12140b84835F291J65164G1206j5906a37603K2260A7371a40776G3731h2440j00450
$$ -284835 6291 171455 71206 55300 -137603 -115343 17371 -140776 73731 -82440 -182890
12129a82890I9028d6022G5839N2545f1346D17584A60346b05227B01828F4288b82236
$$ -182890 99028 -46022 75839 128384 -61346 417584 160346 -205227 201828 64288 -282236
12117b18809A39619f8865A57719C7494L31396G3763c6564n560l66767A08166J13891
$$ -218809 139619 -68865 157719 37494 368890 73763 -36564 -42124 -408891 108166 222057
12106B22057b72891C07534j49628a10492D0463h1124a7207A00229a46169k2024
$$ 222057 -272891 307534 157906 -110492 40463 -81124 -17207 100229 -146169 -168193
12096a68193H5630J38285a30567G648J36446J34267i9131j53275h2214l5453l126
$$ -168193 85630 223915 -130567 7648 144094 278361 -99131 -252406 -82214 -117667 -120793
12085a20793A9846K34603j4222h9950k15027E4909g1750A72815f1910B60189b36646
$$ -120793 19846 254449 240227 -89950 -304977 54909 -71750 172815 -61910 260189 -236646
12073c13370h1975j24062B27850J87242L45833J420553p93212C10289L22823D3354
$$ -313370 -81975 -206037 227850 415092 760925 2181478 1388266 310289 633112 43354
12062B45112E891b31014D6102a77746B30331e434D5493N1419K1115b71833a2186
$$ 245112 5891 -231014 46102 -177746 230331 -5434 45493 96912 118027 -271833 -12186
12050I8979l5697K4977J4884f7784A71266O060b7639k95760A36818J27169G6010
$$ 98979 63282 88259 103143 -67784 171266 177326 -27639 -323399 136818 263987 76010
12038b9606r1201m1296r5007F0321a07599C34908j00105g7509n0409C7246M71668
$$ -29606 -120807 -162103 -257110 60321 -107599 334908 234803 -77509 -127918 37246 508914
12027E08914A89813E4809c05323P3610J06246C36147a4070A25253b9709j16393
$$ 508914 189813 54809 -305323 -231713 -125467 336147 -14070 125253 -29709 -146102
12017a46102j64476a18434b2352j59796d1814A52552G220a25418A0389L2966a8494
$$ -146102 -310578 -118434 -22352 -182148 -41814 152552 7220 -125418 10389 43355 -18494
12005G7610k0587A3359a02418j47085I6568i6599A37541a93642O7281q5419M9964
$$ 77610 57023 13359 -102418 -249503 96568 -96599 137541 -193642 -126361 -211780 -161816
11994a61816P6024J0923p7129b21k23202K6263L9975F7239a17541e701k44810
$$ -161816 -85792 -74869 -151998 -221 -223423 -197160 -157185 67239 -117541 -5701 -250511
11983b50511M6007C3925d81882F1440e42111A11168J16088F2368a4516j06955
$$ -250511 -204504 33925 -481882 61440 -542111 111168 227256 62368 -14516 -121471
11973a21471L9988B1502K00660i8096E4325a3961k6520j63536f5208j32377b3770
$$ -121471 -81483 21502 222162 -98096 54325 -13961 -40481 -204017 -65208 -197585 -23770
11961B03576J9405F2158b39G915b57213b687l5948m3581H0232d3046k1486h665
$$ 203576 222981 62158 -239 7915 -257213 -2687 -38635 -82216 80232 -43046 -64532 -8665
11948c03578A65231g261A26288d2507A23561E2611a90332g7286b9927k40129C112
$$ -303578 165231 -7261 126288 -42507 123561 52611 -190332 -77286 -29927 -270056 3112
11936H7374n65J6099a75282h1908A47320b63492b4184A95608j4253o2059B11c087
$$ 87374 86809 102908 -175282 -81908 147320 -263492 -24184 195608 181355 119296 211 -3087
11923D2711J44252F9249k5605b4179A41671a56402I0786J04417B9121J9843i3753
$$ 42711 186963 69249 43644 -24179 141671 -156402 90786 195203 29121 48964 -93753
11911I6898c1385k3707j2296K9179k73843A58821n6027L94241J0647a36863I0043
$$ 96898 -31385 -55092 -67388 -38209 -312052 158821 102794 497035 507682 -136863 90043
11899d40387F8400b21839d0454J0190G8912b47929e566j71943c8439A45508a68290
$$ -440387 68400 -221839 -40454 -30264 78912 -247929 -5566 -177509 -38439 145508 -168290
11887a8541o971A57178Q8817b69721R1008E7062a87754m4128C90721b42468A80231
$$ -18541 -25512 157178 245995 -269721 -178713 57062 -187754 -231882 390721 -242468 180231
11875A26714d308A2368c17475F891R4747R8967a62772A9871N7509a44382A76802
$$ 126714 -4308 12368 -317475 6891 101638 200605 -162772 19871 77380 -144382 176802
11863A00812c47332hA47512g9312A28688a4915l26232d8779A55007F9563c36852
$$ 100812 -347332 -8 147512 -79312 128688 -14915 -341147 -48779 155007 69563 -336852
11851i2406G2671a08123c2861k42232B09664c1705A83901H0186c21799A72895
$$ -92406 72671 -108123 -32861 -275093 209664 -31705 183901 80186 -321799 172895
11840C3064a99594l65538K48374a31355O0859L3496r972A89190b29570k21863
$$ 33064 -199594 -565132 -316758 -131355 -70496 -37000 -46972 189190 -229570 -451433
11830d51433C25573F48J41159a54035P5033j52911N4804b2238g927j57255A54716
$$ -451433 325573 648 141807 -154035 -79002 -231913 -177109 -22238 -7927 -165182 154716
11818A35162a08206o9998B32500h2581D379b5784F017b28891r6961a15163A90971
$$ 135162 -108206 -178204 232500 -82581 4379 -25784 6017 -228891 -325852 -115163 190971
11806i3803j3463M1286j85422E2062f5005I5660D5288K25464H1170a1918q7832
$$ -93803 -107266 -65980 -251402 52062 -65005 95660 45288 270752 81170 -11918 -99750
11795i9750k0033j88412B2194K4785a05223l16206b42m4983a9183A03383l1447
$$ -99750 -119783 -308195 22194 46979 -105223 -421429 -242 -45225 -19183 103383 71936
11784G1936c05528C3250a97252P0056N3034C23618i796l6228A1099L40623i4531
$$ 71936 -305528 33250 -197252 -127196 -74162 323618 -9796 -46024 11099 351722 -94531
11772B03017h776C84825E2456b59725B2299J29386b53547A29496a41848A0125
$$ 203017 -8776 384825 52456 -259725 22299 151685 -253547 129496 -141848 10125
11761G4741d7369A67101a29112C15456I818b8674k1934C5135b50188A20312n3656
$$ 74741 -47369 167101 -129112 315456 9818 -28674 -50608 35135 -250188 120312 66656
11750F6656c63779A30807c99983R4966D27907b8094j07996o8456j2141R5465A07361
$$ 66656 -363779 130807 -399983 -305017 427907 -28094 -136090 -204546 -216687 -121222 107361
11738i6333p5500B14066k4822f3159C13213r5492c4669j18254d833D7773a49637
$$ -96333 -171833 214066 189244 -63159 313213 217721 -34669 -152923 -4833 47773 -149637
11726A94546b40039B58963i5143o417D5347a39382B48301H7947a71035A3144J23278
$$ 194546 -240039 258963 -95143 -101560 45347 -139382 248301 87947 -171035 13144 136422
11715A36422h992B42347o3086b23495A80256o0623C6729K84081e2112j954C9468
$$ 136422 -8992 242347 179261 -223495 180256 119633 36729 320810 -52112 -54066 39468
11703D3050j2725e6502A60875n5314g7945G3795b16132L107A11860g8858A3014
$$ 43050 30325 -56502 160875 105561 -77945 73795 -216132 -213025 111860 -78858 13014
11691C8122d7012E8921J5029L4476E2359M1732J38524J95395A79854I948K64076
$$ 38122 -47012 58921 73950 108426 52359 94091 232615 428010 179854 9948 274024
11680B74024j21612n3367P2282a20457C9774K72842A27902a15176F5956J50856
$$ 274024 152412 99045 171327 -120457 39774 312616 127902 -115176 65956 216812
11670B16812o4978P3877b79157A65547J23765j5616D7470A5346J19108c8275G1432
$$ 216812 151834 225711 -279157 165547 289312 273696 47470 15346 134454 -38275 71432
11658D21308A30110e3556l14474E932K06109L7871a9776A73434d1313j14293c456
$$ 421308 130110 -53556 -368030 5932 212041 249912 -19776 173434 -41313 -155606 -3456
11646A95342J7261c8036q8524c5964k6277j49876d3202k04377b5414l5268j65874
$$ 195342 212603 -38036 -126560 -35964 -62241 -212117 -43202 -247579 -25414 -60682 -226556
11635b26556H3418m9P0454f9062B05472b74724d8885B37296b4783D4892R9609
$$ -226556 83418 83369 153823 -69062 205472 -274724 -48885 237296 -24783 44892 144501
11624A44501b8626G2172C4802L99117a8600H8800k3771L1741c14657J18402B34606
$$ 144501 -28626 72172 34802 433919 -18600 88800 65029 96770 -314657 -196255 234606
11612B35121K3508c0241B03847a42747d0373B61726H1524a55230A05264a05126
$$ 235121 258629 -30241 203847 -142747 -40373 261726 81524 -155230 105264 -105126
11601a68246c9926o4398A76707a73820B4330M75106o9747g0542j9835o0243E6545
$$ -168246 -39926 -104324 176707 -173820 24330 499436 429689 -70542 -90377 -150620 56545
11589b15716i8336C53349D0954R8900K8663q999G8348C055L20244G2386d7944
$$ -215716 -98336 353349 40954 139854 168517 159518 78348 3055 323299 72386 -47944
11577E868c94547D57239D5708J07445B54L02481J8344C1960e0586I4838J202l4935
$$ 5868 -394547 457239 45708 153153 254 302735 321079 31960 -50586 94838 96040 61105
11565F1105J07269m9321J03589B7142P3265g726B76322J02703G4809i8644A35579
$$ 61105 168374 119053 222642 27142 100407 -7726 276322 379025 74809 -98644 135579
11553b55737a00844A29956L5474a70429D3613a77404c9817A79510E7821g8198
$$ -255737 -100844 129956 165430 -170429 43613 -177404 -39817 179510 57821 -78198
11542D18681a23795B1197Q8115a77779C7224f1941A77328j0599d3420B75455o1995
$$ 418681 -123795 21197 109312 -177779 37224 -61941 177328 166729 -43420 275455 213460
11531B13460J80484A8930L8780P6674b51906B74375A178J17378l3745Q862B9153
$$ 213460 393944 18930 57710 134384 -251906 274375 1178 118556 84811 93673 29153
11519a21719B13748K3349A06815D5132J29413b06425A42733J88806j06414D9605
$$ -121719 213748 237097 106815 45132 174545 -206425 142733 331539 225125 49605
11508C02094j13704C0678P2387K68672M5711A18607P9943J10312a35869I4447
$$ 302094 188390 30678 103065 371737 417448 118607 198550 308862 -135869 94447
11497D52514K5699i1899n5306A13599a1845j56082B05747h0566j61139B35614
$$ 452514 478213 -91899 -147205 113599 -11845 -167927 205747 -80566 -241705 235614
11486B35728f9497p9998B68091j01978l3277b6165m6030B93901J71307j57384
$$ 235728 -69497 -149495 268091 166113 132836 -26165 -72195 293901 465208 307824
11476C07824a4561A60059R1602b6650E131b8587F7414L5933A6366N03199A16015
$$ 307824 -14561 160059 251661 -26650 5131 -28587 67414 103347 16366 519565 116015
11464C86436A91212J73661f36C17449A32224J13690a19891D1469j5621J13723
$$ 386436 191212 364873 -636 317449 132224 245914 -119891 41469 25848 139571
11454A39571c0869D59248d8258A46833A6634a04592G2367k1925L07132j76618
$$ 139571 -30869 459248 -48258 146833 16634 -104592 72367 50442 357574 180956
11444A80956n3171k3334A6502K43281a8085j07476G6849m294O5963k9452a88919
$$ 180956 127785 104451 16502 259783 -18085 -125561 76849 72555 138518 109066 -188919
11432A49388L40491a44661m7506A16820h2138H9841B4760g6162Q000G7789e4462
$$ 149388 489879 -144661 -192167 116820 -82138 89841 24760 -76162 -68162 77789 -54462
11420B11194g8573a8665l1350j22726Q4049p9254f2051E9587M0100a26840C3296
$$ 211194 -78573 -18665 -50015 -172741 -88692 -167946 -62051 59587 99687 -126840 33296
11408b2960j40738B05481I7752J80970n3010E400K77290F8050c5198I9773K29182
$$ -22960 -163698 205481 97752 278722 225712 5400 282690 68050 -35198 99773 328955
11397C28955m7481m6468d3006A36901F1244a0148A43579b62407G862R3017D6261
$$ 328955 281474 235006 -43006 136901 61244 -10148 143579 -262407 7862 100879 46261
11385a8812A02940A2474a09280A9076n450a11986M6136j89519A83485a3583A58383
$$ -18812 102940 12474 -109280 19076 13626 -111986 -65850 -255369 183485 -13583 158383
11373B92467a43296B8851M1975c17985B03781a69788C29i770j06826C7732a17822
$$ 292467 -143296 28851 70826 -317985 203781 -169788 329 -9770 -116596 37732 -117822
11361I1643c12470c2446j57986A18788l8173M4995d1393a073j6643G5626P4267
$$ 91643 -312470 -32446 -190432 118788 80615 125610 -41393 -1073 -17716 75626 149893
11350A49893a11469r2367A587K55793b4693B35409r9633l178K6164L9643J54825
$$ 149893 -111469 -203836 1587 257380 -24693 235409 135776 132598 158762 198405 353230
11339C53230r2015a03620d3503B60440a9094k26677D3549J39186p9135a25082
$$ 353230 261215 -103620 -43503 260440 -19094 -245771 43549 182735 103600 -125082
11328F1428N2121a59706N5736D4934d0803k62781B10507O0013b75028C2362i0761
$$ 61428 113549 -159706 -103970 44934 -40803 -303584 210507 270520 -275028 32362 -90761
11316g2565G309d5686m91p0741d3978C07067b03795i1894I3715M9898D5600a15666
$$ -72565 7309 -45686 -46177 -116918 -43978 307067 -203795 -91894 93715 143613 45600 -115666
11303a66082H1687K5183a54423q1758Q4254A23075b18748l2786A12264a04248
$$ -166082 81687 106870 -154423 -236181 -151927 123075 -218748 -251534 112264 -104248
11292B6848a23871M0244m7523A94893a46467m1663o6823L1735J06188C8236d42900
$$ 26848 -123871 -83627 -131150 194893 -146467 -188130 -254953 -223218 -117030 38236 -442900
11280a12809R88M5119a4623A08923j3596b55115a0214A78285b43195o7160A21702
$$ -112809 -111821 -66702 -14623 108923 95327 -255115 -10214 178285 -243195 -310355 121702
11268b06418C2489a6161k54067c8286r6454a4563k76997B55202F9472b87658p588
$$ -206418 32489 -16161 -270228 -38286 -134740 -14563 -291560 255202 69472 -287658 -295246
11257b95246A47155g7008G1266K8233L522h5426r0994A83919a82686n4957a1002
$$ -295246 147155 -77008 71266 99499 103021 -85426 -176420 183919 -182686 -237643 -11002
11245A04866f6802p9260d5163l75d415A68261Q5967b71408k577a6203A27133l4511
$$ 104866 -66802 -146062 -45163 -45538 -4415 168261 254228 -271408 -273985 -16203 127133 92622
11233I2622A6152N5339J17257a72863j0173e6924k00154H3961E256b01318G6268
$$ 92622 16152 71491 188748 -172863 -183036 -56924 -257078 83961 5256 -201318 76268
11221a39956g934j37273N2382H7523B8589N1402K5669i1451j12062A74406n1933
$$ -139956 -7934 -145207 -92825 87523 28589 79991 105660 -91451 -203513 174406 122473
11210A22473b7085F401b05274O4698d7855l0689j6921l3185B08281m9848B4343
$$ 122473 -27085 6401 -205274 -140576 -47855 -78544 -95465 -128650 208281 158433 24343
11198B2265K28584A12495h8512j24533J04469j23315J10902A66311a4979k87177
$$ 22265 250849 112495 -88512 -213045 -108576 -231891 -120989 166311 -14979 -302156
11188c02156K002R0190M9489f266H1617d3881B25740b47958H7562c51704a34629
$$ -302156 -300154 -209964 -160475 -6266 81617 -43881 225740 -247958 87562 -351704 -134629
11176a06128D81554A17648A3499g67A45313O4152b55969Q781B38170a46833A59865
$$ -106128 481554 117648 13499 -767 145313 209465 -255969 -247188 238170 -146833 159865
11164d46790B24270b35343B12615a43806c28D8708a75690N6741L8377p2185j68780
$$ -446790 224270 -235343 212615 -143806 -328 48708 -175690 -118949 -80572 -152757 -321537
11153c21537A72044B9127g1443j74339D73779a8629j61929A40714c63329g5894
$$ -321537 172044 29127 -71443 -245782 473779 -18629 -180558 140714 -363329 -75894
11142G3076J92075b18858g7414A25113a54241B59424A07300f4274o5634C494K72909
$$ 73076 265151 -218858 -77414 125113 -154241 259424 107300 -64274 -129908 3494 276403
11131B76403J51315A76217L5543B8440Q1609D2336M7311d4442F0817J69824H8059
$$ 276403 427718 176217 211760 28440 110049 42336 89647 -44442 60817 230641 88059
11119c9238D162J07795a15231k5684K3502A48370b60983A90541g217k45363I5385
$$ -39238 4162 111957 -115231 -140915 -117413 148370 -260983 190541 -7217 -252580 95385
11107G7917d7798B35560b00111i5618A27942M3810l1487N295a35688f5566A17744
$$ 77917 -47798 235560 -200111 -95618 127942 171752 140265 145560 -135688 -65566 117744
11095D37795i2661A43263J79627l2087n9733M7464n8879J19167n9359p1272I5320
$$ 437795 -92661 143263 322890 290803 231070 278534 219655 338822 279463 208191 95320
11083a32517D34711A80051K5396f5621A13678K21144q279M4821j34442j6128K27685
$$ -132517 434711 180051 205447 -65621 113678 334822 326543 371364 236922 220794 448479
11072D48479m4843j37436J83515E2425r202L07058m261J61502A69633J45076K68768
$$ 448479 403636 266200 449715 52425 43223 350281 346020 507522 169633 314709 583477
11061E83477A46184J50124L27939j02517j65324P12195l85266k23452L7840J75952
$$ 583477 146184 296308 624247 521730 356406 1068601 683335 459883 497723 673675
11051F73675k25620K94305j55885M74269j94307l8954j37352L55747k40954k29923
$$ 673675 448055 742360 586475 1060744 866437 827483 690131 1045878 804924 575001
11041E75001L8936j32376M22688k22617j84536R4163N97501n79455J30938J28367
$$ 575001 613937 481561 904249 681632 497096 591259 1188760 609305 740243 868610
11031H68610j74653q8636r0323n7112j06735N82782l16164K48585k37825R1420
$$ 868610 693957 605321 514998 457886 351151 933933 617769 866354 628529 719949
11021G19949k32790L12938K0504k96972q1139L34482j00652p969K76701j97353
$$ 719949 487159 800097 820601 523629 442490 776972 676320 668351 945052 747699
11011G47699j53391L6120q8244o3722j19938J14636J07142L86454m47964J00556
$$ 747699 594308 630428 542184 478462 358524 473160 580302 966756 518792 619348
11001F19348J30082k45646P8997k0383J06369J02048O7695N7627k71470K79091
$$ 619348 749430 503784 582781 562398 668767 770815 838510 896137 624667 903758
10991I03758j07074L46141n07189K33531K24705l22788K22831k7212O1032L17738
$$ 903758 796684 1142825 635636 869167 1093872 771084 993915 966703 1027735 1345473
10981A345473j14262K31367j58824P389K82897K95911L74182j34138L08007Q3631
$$ 1345473 1231211 1462578 1303754 1311143 1594040 1889951 2264133 2129995 2438002 2521633
10971B521633N83652m94654K54528j86811j43155l35089J0759j3744n12727M09219
$$ 2521633 3105285 2610631 2865159 2678348 2535193 2200104 2210863 2197119 1684392 2093611
10961B093611j98007J37438L5342k44910J05863j15088J17027l72100M9345k41523
$$ 2093611 1895604 2033042 2068384 1823474 1929337 1814249 1931276 1559176 1608521 1366998
10951A366998j13750F09270J13975k37361J51847k23070O196L43203j78745j97365
$$ 1366998 1253248 609270 723245 485884 637731 414661 420857 764060 585315 387950
10941C87950j91016M85582B54751Q0874I8148K27010B4248n761d176H8984m427
$$ 387950 196934 682516 254751 335625 98148 325158 24248 18487 -4176 88984 84557
10930H4557K89396I1619f1353B20704f6467A75578a69701a9826D9048J7644K88360
$$ 84557 373953 91619 -61353 220704 -66467 175578 -169701 -19826 49048 66692 355052
10919C55052e6397C6381a1968E7598c5527A9502K04219F5208c44400a41528B72014
$$ 355052 -56397 36381 -11968 57598 -35527 19502 223721 65208 -344400 -141528 272014
10907b00153g684A11054a14708p4096O2626I144R1114h7045C02253b43438J20571
$$ -200153 -7684 111054 -114708 -188804 -126178 9144 100258 -87045 302253 -243438 -122867
10896a22867D1686b9265j28599B4473M34385D7255a98942f4805j34956A19261
$$ -122867 41686 -29265 -157864 24473 458858 47255 -198942 -64805 -199761 119261
10885a56193F0503c01110B3533K07307a39512A91885g1522e023j54910B29430
$$ -156193 60503 -301110 23533 230840 -139512 191885 -71522 -5023 -159933 229430
10874a70537E6917K07711a06222j0885K712j36902B67570o8048n4894m1249J9462
$$ -170537 56917 264628 -106222 -117107 -114395 -251297 267570 199522 144628 103379 122841
10863A22841b8552A60938b00126L4728g10j67211a7992m2836J3858A8974L9928
$$ 122841 -28552 160938 -200126 -165398 -710 -167921 -17992 -60828 -46970 18974 58902
10852E8902J35321j8402o9174K08715A18919P5593n2894a21043A56245a95889
$$ 58902 194223 175821 106647 315362 118919 194512 141618 -121043 156245 -195889
10841B83755C2737b20477A01526b4845j7267A34970b41297B54841i1708B04622
$$ 283755 32737 -220477 101526 -24845 -42112 134970 -241297 254841 -91708 204622
10830H9813l5701a26145A2629O4913a13963k76381D268R2715i7256l0699A22215
$$ 89813 54112 -126145 12629 77542 -113963 -390344 4268 96983 -97256 -127955 122215
10818a6441A53175a56220A73084l1468a79283A79453n4934B9858J15135d3303
$$ -16441 153175 -156220 173084 141616 -179283 179453 124519 29858 144993 -43303
10807c6296a5737G737b60923M4659o518H262Q4374a8446j70085A3864L979J51144
$$ -36296 -15737 7737 -260923 -216264 -222782 8262 92636 -18446 -188531 13864 17843 168987
10795A68987A654N8291J66552k2449a06450j16225n2064C1692A2218c1056k3553
$$ 168987 1654 59945 226497 204048 -106450 -222675 -274739 31692 12218 -31056 -54609
10784e4609m2861j44938R6510j42448M1077A77677b50886a04003C27647b85837
$$ -54609 -97470 -242408 -145898 -288346 -247269 177677 -250886 -104003 327647 -285837
10773E3044d77604a07772r120q0198n7153B794c71303a67043b6733n8216A41715
$$ 53044 -477604 -107772 -116892 -197090 -254243 2794 -371303 -167043 -26733 -84949 141715
10761a79084c9180e196j28850b596G8644N2910e0314a7293A61386j3865f8169
$$ -179084 -39180 -5196 -134046 -2596 78644 131554 -50314 -17293 161386 147521 -68169
10749c0575G8395c4655k03909A10323B2265b35916A31323D103a89957B66230a81524
$$ -30575 78395 -34655 -238564 110323 22265 -235916 131323 4103 -189957 266230 -181524
10737b59987h9317M3458n2590b6752r4955j99655C4174Q3986J31853a797m5371
$$ -259987 -89317 -45859 -98449 -26752 -121707 -321362 34174 118160 250013 -1797 -47168
10726d7168j47447a4390C38429d0139H1211A6745N7509b02916h8764d2249J5852
$$ -47168 -194615 -14390 338429 -40139 81211 16745 74254 -202916 -88764 -42249 -26397
10715b6397m36078A471c8908n5962n0293K7294j75235G6518c20909k1446R3851
$$ -26397 -462475 1471 -38908 -94870 -145163 -117869 -293104 76518 -320909 -342355 -248504
10704b48504L2471i9415A66898a98618R3908A80765a82665A51866c9071F7614
$$ -248504 -216033 -99415 166898 -198618 -104710 180765 -182665 151866 -39071 67614
10693b5662B1860d20935B60506a54007e6340J7649A93710E7952b05282D705J5063
$$ -25662 21860 -420935 260506 -154007 -56340 -38691 193710 57952 -205282 4705 19768
10682A9768H441h6593j94067e7459A755P7835a61637M9056j50213Q5850b4773
$$ 19768 8441 -86593 -280660 -57459 1755 79590 -161637 -112581 -262794 -176944 -24773
10670g4910A18939a61717A03312B8807a1513F6731b74364D0476d3911E7200a2786
$$ -74910 118939 -161717 103312 28807 -11513 66731 -274364 40476 -43911 57200 -12786
10658G8625o018C5610a59615f7157o4063j5248P036E2706f7269B29941a68310
$$ 78625 72607 35610 -159615 -67157 -131220 -146468 -139432 52706 -67269 229941 -168310
10646E2071L0623b3251C8454G476R6128b1843k1086l20834D8756J41219b31949
$$ 52071 82694 -23251 38454 7476 103604 -21843 -42929 -363763 48756 189975 -231949
10634E0318f4216j772l47362B81644I6169c00j75642A2982J25670A0554P2421
$$ 50318 -64216 -65988 -413350 281644 96169 -300 -175942 12982 138652 10554 82975
10623H2975a66142E7389B8170f9259j957K1992r0409B43276D7570c04228N1315
$$ 82975 -166142 57389 28170 -69259 -71216 -49224 -139633 243276 47570 -304228 -252913
10612b52913i7212m8115f3880A28842d3880m2575A75539F8188b42837g4133a8264
$$ -252913 -97212 -145327 -63880 128842 -43880 -86455 175539 68188 -242837 -74133 -18264
10600A0624a75713O2174k63331a79833L7305C16012c72114J52418N5581Q132A17292
$$ 10624 -175713 -113539 -376870 -179833 -142528 316012 -372114 -219696 -164115 -155983 117292
10588a67952A26465h6450c9335j86627H3389g855j39528A26479R2552a49714B06196
$$ -167952 126465 -86450 -39335 -225962 83389 -7855 -147383 126479 219031 -149714 206196
10576a18000G870K15079j10979e2842H856b72436L9365K4471A17696a536F374
$$ -118000 7870 222949 111970 -52842 8856 -272436 -233071 -208600 117696 -1536 6374
10564b01020h4279f049A14625d9798j29238h2259m9270k06344F6034J62346n7177
$$ -201020 -84279 -6049 114625 -49798 -179036 -82259 -131529 -337873 66034 228380 171203
10553A71203B974c32975g9752A61922l2714B2710O3883R6682b1963e724m4040
$$ 171203 2974 -332975 -79752 161922 129208 22710 86593 183275 -21963 -5724 -49764
10542d9764B95646j05886b05259C0256J95332c16367i7196A403N3950c21627a21585
$$ -49764 295646 189760 -205259 30256 225588 -316367 -97196 1403 55353 -321627 -121585
10530A79938G3118J41603A3570L64846D62g7540I9991c4814j83123A55603b34152
$$ 179938 73118 214721 13570 378416 462 -77540 99991 -34814 -217937 155603 -234152
10518F2229a24715p7293N7704N1925E37610k56014B7406b56446M8450A78999b36879
$$ 62229 -124715 -202008 -144304 -92379 537610 281596 27406 -256446 -207996 178999 -236879
10506c2661A92453n7362A55a81000k3959C5618b3569B50184e6231j30989m4979
$$ -32661 192453 135091 155 -181000 -204959 35618 -23569 250184 -56231 -187220 -232199
10495b32199c2289D4133e7087C28226H920g4172D0600a777A72128c0781A49057
$$ -232199 -32289 44133 -57087 328226 8920 -74172 40600 -1777 172128 -30781 149057
10483I5653j0881a24235D66414j7920j65459J07411A7565J78263m3094J86214
$$ 95653 84772 -124235 466414 448494 283035 390446 17565 195828 152734 338948
10473C38948F5153L6148h9531A13790J258i7948A74576c11k21808j02260e6605
$$ 338948 65153 101301 -89531 113790 115048 -97948 174576 -311 -222119 -324379 -56605
10461b55712l953d3781l51948F4227h094r6043p338a6809B21622G0449O2582a64734
$$ -255712 -259665 -43781 -395729 64227 -8094 -104137 -111475 -16809 221622 70449 133031 -164734
10448E8026m809a3523G8153J0848b2947A99335b20748a7861I8270c02055i7376
$$ 58026 53217 -13523 78153 89001 -22947 199335 -220748 -17861 98270 -302055 -97376
10436f463n5545f039j80390A74183e3859B4782N259K1158d0006o9599d0439q0727
$$ -6463 -62008 -6039 -186429 174183 -53859 24782 30041 51199 -40006 -109605 -40439 -121166
10424a21166p6971R4850I8324a85740B46603l7875J68115e5052G9401c6365j04086
$$ -121166 -198137 -103287 98324 -185740 246603 208728 376843 -55052 79401 -36365 -140451
10413a40451k78348E4851b82445f9217c2370j62907A47699c8226a6926F1485J46747
$$ -140451 -418799 54851 -282445 -69217 -32370 -195277 147699 -38226 -16926 61485 208232
10402B08232h5280L5078B05604e195j8502o8800B72145l6447F997P3201f2838
$$ 208232 -85280 -50202 205604 -5195 -23697 -92497 272145 235698 6997 80198 -62838
10390A4995P2269J99734a10333a0819A14551K07160a11907B68634K379A7574a07166
$$ 14995 87264 286998 -110333 -10819 114551 321711 -111907 268634 271013 17574 -107166
10378A20381O8011a37000A26214n8713L5172P5100o7162L68962M7483B48977A3031
$$ 120381 188392 -137000 126214 67501 102673 177773 110611 479573 527056 248977 13031
10366C95720K22540L2245B98100L1116A42065K02203j11405G9782j5911Q1529
$$ 395720 618260 650505 298100 329216 142065 344268 232863 79782 63871 145400
10356A45400J50949J17425F9337J56678K43980k31792L25299n1370k25977J53898
$$ 145400 296349 413774 69337 226015 469995 238203 563502 512132 286155 440053
10346D40053j53780K51727B04831M29029G587K82010O0264E4558L47146F8935
$$ 440053 286273 538000 204831 633860 7587 289597 349861 54558 401704 68935
10335A27796L3630m648K14801j06515I6612j6952i1217E5170a44166d9163C00235
$$ 127796 161426 156778 371579 265064 96612 79660 -91217 55170 -144166 -49163 300235
10323F6227r117K76357A46625D3265J25502J68303m2311G9612J32776g9526F613
$$ 66227 57110 333467 146625 43265 168767 337070 294759 79612 212388 -79526 6613
10311A00526a89313e2284q6768J1855A77903a06941b6936A27340c3925L922A28021
$$ 100526 -189313 -52284 -139052 -127197 177903 -106941 -26936 127340 -33925 -30003 128021
10299A46780h9733a460n575l10880J37711r7703D38724c9619B5088K3714J49709
$$ 146780 -89733 -1460 -7035 -317915 -180204 -277907 438724 -39619 25088 48802 198511
10288A98511o5602c18269a4395l02545q9710D249O3186a52322N5359C8725a43171
$$ 198511 132909 -318269 -14395 -316940 -406650 4249 67435 -152322 -96963 38725 -143171
10276D4394d6852a7769A76072b07699c4500j95505B96630a2742A14596c8790a4647
$$ 44394 -46852 -17769 176072 -207699 -34500 -230005 296630 -12742 114596 -38790 -14647
10264G8490J6981K11034d6003I8034L53496A68373L5703L11411m2233h2821A57385
$$ 78490 95471 306505 -46003 98034 451530 168373 204076 515487 473254 -82821 157385
10252A71714c8502A29640a17340K842j4576j33443i5849A2512a41365K83A21439
$$ 171714 -38502 129640 -117340 -114498 -129074 -262517 -95849 12512 -141365 -141082 121439
10240b9911m11605J49803N432A05485c1715j14590E9024b88779p0112R1725g6033
$$ -29911 -441516 -291713 -286281 105485 -31715 -146305 59024 -288779 -358891 -267166 -76033
10228I5724c51441I2716A3385b75209I072o98K1318J9542a98973P3017A21086
$$ 95724 -351441 92716 13385 -275209 9072 8374 29692 49234 -198973 -125956 121086
10216A7277N575c88520a20185M9378A26398g9003n6752B53659g1455m9176D4399
$$ 17277 22852 -388520 -120185 -70807 126398 -79003 -135755 253659 -71455 -120631 44399
10204C19629F4709J54421l1341f8329B19573n2336F6752M5070B0368c5499j90371
$$ 319629 64709 219130 187789 -68329 219573 167237 66752 111822 20368 -35499 -225870
10193b25870C3706d2355A2204J68829C5075J37847d3546B3900a03684j64175O4386
$$ -225870 33706 -42355 12204 181033 35075 172922 -43546 23900 -103684 -267859 -203473
10182b03473A50823d3294l03545h3746A4464f0779j45093B2308a6640j1026j93127
$$ -203473 150823 -43294 -346839 -83746 14464 -60779 -205872 22308 -16640 -27666 -220793
10171b20793a9926n82187K50360J70397A93276b4309A08777D0510J74652B6983
$$ -220793 -19926 -602113 -351753 -181356 193276 -24309 108777 40510 215162 26983
10160a43373C28213G1089B6084K6461c4851B7425g0156F6672a3851I6603N2640
$$ -143373 328213 71089 26084 52545 -34851 27425 -70156 66672 -13851 96603 149243
10149A49243d04014J39652A43627E049a04818m20105a39785A42957a0886j80458
$$ 149243 -404014 -264362 143627 5049 -104818 -524923 -139785 142957 -10886 -191344
10139a91344G6710B0644j097a37613b8441I9617b36949C0431P8849b92221A52049
$$ -191344 76710 20644 19547 -137613 -28441 99617 -236949 30431 109280 -292221 152049
10127b39103A69774g5383n2231d244k02572N0261C5984g382B7665i7201A27587
$$ -239103 169774 -75383 -127614 -4244 -206816 -156555 35984 -7382 27665 -97201 127587
10115a38779F7950i9354G218a82451r7733A33990a67011o5278k6411K8170B3254
$$ -138779 67950 -99354 7218 -182451 -280184 133990 -167011 -232289 -258700 -230530 23254
10103G6156P4545b49354d7042q4524A72813b20503e6661A37458n2507b2836H5187
$$ 76156 150701 -249354 -47042 -131566 172813 -220503 -56661 137458 84951 -22836 85187
10091c18588c8183G3303d1187j94419o5231N0897a1136k26622A45203c9469j17177
$$ -318588 -38183 73303 -41187 -235606 -300837 -249940 -11136 -237758 145203 -39469 -156646
10080a56646D29007d6568o7232c0048D3265K19613G3066b00830H4922b11285j17158
$$ -156646 429007 -46568 -113800 -30048 43265 262878 73066 -200830 84922 -211285 -328443
10069c28443a11351J5499j26346p7174H0868L2829a79513G0637l1173J45955c67429
$$ -328443 -111351 -95852 -222198 -299372 80868 113697 -179513 70637 39464 185419 -367429
10057c02207A84163b81370e2701a3563p5349K4892K0280C3019a23588j19023a10661
$$ -302207 184163 -281370 -52701 -13563 -88912 -64020 -43740 33019 -123588 -242611 -110661
10045c5747A80144c19587Q7131h0487E1974a21077e0284m18795H6778d7502j11518
$$ -35747 180144 -319587 -232456 -80487 51974 -121077 -50284 -469079 86778 -47502 -159020
10034a59020l1092J1630A41935b88405J44119M6249D8588M3673a89755A3458K0890
$$ -159020 -190112 -178482 141935 -288405 -144286 -98037 48588 92261 -189755 13458 34348
10023C4348a32743a4986n8933l505a8754k36100c641A81334J1156B325b03113
$$ 34348 -132743 -14986 -73919 -77424 -18754 -254854 -3641 181334 192490 2325 -203113
10011b77028Q4862Q5560B39547L0599b96948A3916J05958d52288e1722j42070
$$ -277028 -192166 -106606 239547 270146 -296948 13916 119874 -452288 -51722 -193792
10001a93792D0223i7793k62242a39403k1504j00847D57M8484J57238G5280a06174
$$ -193792 40223 -97793 -360035 -139403 -160907 -261754 457 48941 206179 75280 -106174
9989i6636C09453c15617A54658g0313A37008b41893n6531A0511N5626a60914A589
$$ -96636 309453 -315617 154658 -70313 137008 -241893 -298424 10511 66137 -160914 1589
9977G0539c09850e5490A52519f727q4470j14639j1465O2700r9462a24998j9351
$$ 70539 -309850 -55490 152519 -6727 -91197 -205836 -217301 -154601 -254063 -124998 -144349
9966a44349H2113a63285k20567a87359B42001k6782c01110a42662A08146l4361
$$ -144349 82113 -163285 -383852 -187359 242001 215219 -301110 -142662 108146 73785
9956G3785f7735A52456c03378r7776J57229h7652b1422j63320B63378a78718d0944
$$ 73785 -67735 152456 -303378 -401154 -243925 -87652 -21422 -184742 263378 -178718 -40944
9944h1088I294K1606h212k2761j04160j11476a3991m1433E4917I764b39780j3425
$$ -81088 9294 30900 -8212 -30973 -135133 -246609 -13991 -55424 54917 9764 -239780 -253205
9932b53205D12273B3325e450k39040O0544A98529a22797q412B41024A6568J32434
$$ -253205 412273 23325 -5450 -244490 -183946 198529 -122797 -131209 241024 16568 149002
9921A49002b83565a7506b906j99850B4696e9120D99196a82294K3739e6679F881
$$ 149002 -283565 -17506 -2906 -202756 24696 -59120 499196 -182294 -158555 -56679 6881
9909h7730A91255f6321q9639m1723j1364L1201A64518G0799P0153C2675f2553
$$ -87730 191255 -66321 -155960 -197683 -209047 -177846 164518 70799 140952 32675 -62553
9897g5877F1651R3252R424H0490e31943a00033A5004J19293f9289k52185B23129
$$ -75877 61651 154903 164327 80490 -531943 -100033 15004 134297 -69289 -321474 223129
9885a80999B1187d4222k06422o4735H5641A0575c17546J12408B8872J23693K12975
$$ -180999 21187 -44222 -250644 -315379 85641 10575 -317546 -205138 28872 152565 365540
9874C65540I9197a55017A62073a06621b0538k27918L3874g3863c577l5831A68537
$$ 365540 99197 -155017 162073 -106621 -20538 -248456 -214582 -73863 -3577 -39408 168537
9862A2738a27278C129a96159N1082B1375b13898J04938k37924P7059c2692C1513
$$ 12738 -127278 3129 -196159 -145077 21375 -213898 -108960 -346884 -269825 -32692 31513
9850d19563B11705G8876a45607d5081A28490a03439c8611j13398C02080A2048
$$ -419563 211705 78876 -145607 -45081 128490 -103439 -38611 -152009 302080 12048
9839G5534i1726p5694d2168F4806J47627b7247j62867a9454j92517A978a69709
$$ 75534 -91726 -167420 -42168 64806 212433 -27247 -190114 -19454 -211971 1978 -169709
9827h7233c5894C0694b50074J13588L3681r407k07485c9973k8993B6026R6749
$$ -87233 -35894 30694 -250074 -136486 -102805 -112212 -319697 -39973 -68966 26026 122775
9816A22775J20960d29428a40759n0815B77106j37815L597b79954I8291L2248n396
$$ 122775 243735 -429428 -140759 -191574 277106 139291 142888 -279954 98291 130539 125143
9805A25143B6378J54746a3143A23118P049a61169M0807F2026a75549a9190j44590
$$ 125143 26378 181124 -13143 123118 130167 -161169 -120362 62026 -175549 -19190 -163780
9794a63780l9563l4284a01409j41293H6073b63046e527B59e1012F0957A9855f2622
$$ -163780 -203343 -237627 -101409 -242702 86073 -263046 -5527 259 -51012 60957 19855 -62622
9781f7509j40863k06588a52065A09309a41491L2530k31607b4312k02591A72766
$$ -67509 -208372 -414960 -152065 109309 -141491 -108961 -340568 -24312 -226903 172766
9770c26174a50535D1204A4880b1620m4627k25172d1078H1466L859B8031e07750
$$ -326174 -150535 41204 14880 -21620 -66247 -291419 -41078 81466 85325 28031 -507750
9758c9059q5639q9657j59920J83544d4729j1136k5366n6333q4505A58361o8429
$$ -39059 -124698 -214355 -374275 -190731 -44729 -55865 -81231 -137564 -222069 158361 89932
9747H9932P2896f468j59268A11304c89259H843J51998g6003r6791k27006F2435
$$ 89932 162828 -6468 -165736 111304 -389259 8843 160841 -76003 -172794 -399800 62435
9735b06917j33779E0966a53746g174l03849E4425i84o0270A83831a9821k09955
$$ -206917 -340696 50966 -153746 -7174 -311023 54425 -984 -61254 183831 -19821 -229776
9724b29776a09826j24006G3305K16209b61823C52260c2463A66442J0538G4525
$$ -229776 -109826 -233832 73305 289514 -261823 352260 -32463 166442 176980 74525
9713b91050K591A82616f6172l26639O7971d2894n3199n3297F3003N5802a29418
$$ -291050 -288459 182616 -66172 -392811 -324840 -42894 -96093 -149390 63003 118805 -129418
9701a23284e0940n4336k39366r1247B34588C3889d8638B95138h8076E7872J13468
$$ -123284 -50940 -105276 -344642 -435889 234588 33889 -48638 295138 -88076 57872 171340
9690A71340a25024A39185a13646K1340L7180A2174a61375k0940A43394a72667
$$ 171340 -125024 139185 -113646 -92306 -55126 12174 -161375 -182315 143394 -172667
9679a44393k54753E1678a71480C906L2795h1237k50813A4203g4727j8948B36352
$$ -144393 -399146 51678 -171480 3906 36701 -81237 -332050 14203 -74727 -93675 236352
9667H7326a36299B91633a44575A20803k2647J98066B7827b17677m0431E6358a5930
$$ 87326 -136299 291633 -144575 120803 98156 296222 27827 -217677 -258108 56358 -15930
9655C5748K1783i1182n6275m569a7635n5194k27486A10820c98001a05898i257
$$ 35748 57531 -91182 -147457 -152026 -17635 -72829 -300315 110820 -398001 -105898 -9257
9643a4746B55772e4260B99M978a50184g4156c5365j18514O1979F8723b35441R3689
$$ -14746 255772 -54260 299 5277 -150184 -74156 -35365 -153879 -91900 68723 -235441 -141752
9631a41752J062l13876b7275q7099d1502B315M2231b19302h767k08705A04034
$$ -141752 -140690 -454566 -27275 -114374 -41502 2315 44546 -219302 -8767 -217472 104034
9619g4083C21539b05486F4086M8469J67456j06376g3809c1783j10767k54978J71069
$$ -74083 321539 -205486 64086 112555 280011 173635 -73809 -31783 -142550 -397528 -226459
9608b26459F3349h0442Q607k5382A50384O3120D7429i775A13094c35689R2416
$$ -226459 63349 -80442 -71835 -97217 150384 213504 47429 -9775 113094 -335689 -243273
9597b43273J1469q0207J31301n1583c1683n1909o9089K090c1579j28387C69847
$$ -243273 -231804 -312011 -180710 -232293 -31683 -83592 -152681 -150591 -31579 -159966 369847
9585g7834k9593j70387o0221f1133j3614j01667P5404A4730a46116c3623j96759
$$ -77834 -107427 -277814 -338035 -61133 -74747 -176414 -101010 14730 -146116 -33623 -230382
9574b30382g0230b0050k5415E7495J373a95480l97666e7774p252b822C9139L77416
$$ -230382 -70230 -20050 -45465 57495 58868 -195480 -593146 -57774 -65026 -2822 39139 416555
9562D16555A652J672a1648j15217K9735H9617g8231A21298a94976c0358l003c123
$$ 416555 1652 3324 -11648 -126865 -97130 89617 -78231 121298 -194976 -30358 -33361 -3123
9549a704A16314b94195d7340C1634E145c5544B45654A08946i6461p9534j8510
$$ -1704 116314 -294195 -47340 31634 5145 -35544 245654 108946 -96461 -175995 -194505
9538a94505r4025A5909a41945J2929D5864K5794j0197L5228d7558K0542k81560
$$ -194505 -288530 15909 -141945 -129016 45864 71658 61461 96689 -47558 -27016 -308576
9527c08576j35742f2091k43153a47415C5437c2840q9163k16822H3499K04545a47392
$$ -308576 -444318 -62091 -305244 -147415 35437 -32840 -122003 -338825 83499 288044 -147392
9515b22562j55269K3442D4761b37495B33124b2989L236A63742F3566b6757m4399
$$ -222562 -377831 -354389 44761 -237495 233124 -22989 -19753 163742 63566 -26757 -71156
9504g1156m8855G6677J24739g6260A37828b96662a03411A36689i9599B00631C011
$$ -71156 -120011 76677 201416 -76260 137828 -296662 -103411 136689 -99599 200631 3011
9492A82745q4621a16556A03486b99786j65004g8806a4580q9105j07201N1966A44012
$$ 182745 98124 -116556 103486 -299786 -464790 -78806 -14580 -103685 -210886 -158920 144012
9480a04508r9557f494q8821L038K8468N406k02502A45969d6360l1239H0959a1826
$$ -104508 -204065 -6494 -95315 -92277 -63809 -58403 -260905 145969 -46360 -77599 80959 -11826
9467B57054a0259j30464B28796c93294j01796B49476c80048J37555P7844B21118
$$ 257054 -10259 -140723 228796 -393294 -495090 249476 -380048 -242493 -164649 221118
9456A05595B2055d05638g5925K7088j50565l0495k89875b54585O8360e670j07219
$$ 105595 22055 -405638 -75925 -48837 -199402 -229897 -519772 -254585 -186225 -5670 -112889
9445a12889c2107r4010K0564j3389F7520a17114C7493c04860G1817b01282j23992
$$ -112889 -32107 -126117 -105553 -118942 67520 -117114 37493 -304860 71817 -201282 -325274
9434c25274a08439n7080K4175f1985j24982r7122B352e6515A0438d4791B20933
$$ -325274 -108439 -165519 -141344 -61985 -186967 -284089 2352 -56515 10438 -44791 220933
9422c34838e2565n8969A21480c14111A02361b1918C7949d83A25752b33535g8219
$$ -334838 -52565 -111534 121480 -314111 102361 -21918 37949 -483 125752 -233535 -78219
9410a62271A57061m9632b28869A50088d3961D9409b42874a8408m36095A31091
$$ -162271 157061 107429 -228869 150088 -43961 49409 -242874 -18408 -454503 131091
9399a10855a4449B96372a54553E35g9279j6199a1527j55563a0582H4662k6202
$$ -110855 -14449 296372 -154553 535 -79279 -95478 -11527 -167090 -10582 84662 58460
9388E8460N6489a30379M8598C18276a64617A31932d640C31751A49159a99824l7795
$$ 58460 114949 -130379 -81781 318276 -164617 131932 -4640 331751 149159 -199824 -237619
9377b37619A33992a6025l96924g3370B5142c19182A66565h7257F3913a03803l23907
$$ -237619 133992 -16025 -412949 -73370 25142 -319182 166565 -87257 63913 -103803 -427710
9366d27710J38758e2759I832M2682j0435L03852A1603Q8856c45650f9597c2693
$$ -427710 -288952 -52759 9832 52514 42079 345931 11603 100459 -345650 -69597 -32693
9354h66l03107J29207d7788A48113i4674J9922a5099A09424K56806d3048P35G1204
$$ -866 -303973 -174766 -47788 148113 -94674 -74752 -15099 109424 366230 -43048 -42313 71204
9341b07547d0402H5069a40049N3767B16070E5695h8588A95371b8258j22828l15671
$$ -207547 -40402 85069 -140049 -86282 216070 55695 -88588 195371 -28258 -151086 -466757
9330d66757h8099k38517P6884A47470a26271A68369f4857j00016N592d1182j02264
$$ -466757 -88099 -326616 -249732 147470 -126271 168369 -64857 -164873 -159281 -41182 -143446
9319a43446d4706A73308b50917M5092b0433E6866a17505B43513a72965d4893B41143
$$ -143446 -44706 173308 -250917 -205825 -20433 56866 -117505 243513 -172965 -44893 241143
9307b42574i3229n7216H9076b81218g0737j33609P6861a6539l00544a0744l54445
$$ -242574 -93229 -150445 89076 -281218 -70737 -204346 -127485 -16539 -317083 -10744 -365189
9296c65189c0978H0926b49917r2886J04429R812Q9841k2565j54782p4765a67997
$$ -365189 -30978 80926 -249917 -342803 -238374 -228562 -138721 -161286 -316068 -390833 -167997
9284B70194j17472J33479D0374a91655A57535a31546B72515a41529A8724a41561
$$ 270194 152722 286201 40374 -191655 157535 -131546 272515 -141529 18724 -141561
9273g8581m1120j11019E3795c56040L9432B41548d0293j95668g8257B32360a48323
$$ -78581 -119701 -230720 53795 -356040 -316608 241548 -40293 -235961 -78257 232360 -148323
9261a47747P3333j52986d1531k13290h642l05162A25280b84811H7059h9324j22397
$$ -147747 -74414 -227400 -41531 -254821 -8642 -313804 125280 -284811 87059 -89324 -211721
9250b11721j5121F5635J6180C7884a12235d7229A0086a02625k37482A92524c73667
$$ -211721 -226842 65635 81815 37884 -112235 -47229 10086 -102625 -340107 192524 -373667
9238F1129K45821n1863B4028R5438b33827o0607c4942j12123o0774b892B5606
$$ 61129 306950 255087 24028 119466 -233827 -294434 -34942 -147065 -207839 -2892 25606
9226A09100a6347j42753A77372A9487a77374l75567B891a17166j43588L9444C07860
$$ 109100 -16347 -159100 177372 19487 -177374 -552941 2891 -117166 -260754 -221310 307860
9214b26399g4901j45386D7558d05286f3541j34623A41594b23766c3055A13802
$$ -226399 -74901 -220287 47558 -405286 -63541 -198164 141594 -223766 -33055 113802
9203B72659j15806i4557j75624g096j34005d9200n3671p7848r9884H5492B518
$$ 272659 156853 -94557 -270181 -7096 -141101 -49200 -102871 -180719 -280603 85492 2518
9191h4445C1889M9190N5894Q0346J9895b8258o9278l9154c8693A9043a01789F2631
$$ -84445 31889 81079 136973 217319 237214 -28258 -97536 -136690 -38693 19043 -101789 62631
9178a88248A90375a98533d3863B09761g6855A48301K3376a83499E7941h2915K4375
$$ -188248 190375 -198533 -43863 209761 -76855 148301 171677 -183499 57941 -82915 -58540
9167e8540q1050C2556P5515e2485B8821J67981h1162j41664A43946E0251a08762
$$ -58540 -139590 32556 108071 -52485 28821 196802 -81162 -222826 143946 50251 -108762
9155b08284A95963a24949A11207a09688K3114B11789C4920b18140n6032R498j59298
$$ -208284 195963 -124949 111207 -109688 -86574 211789 34920 -218140 -274172 -264674 -423972
9144d23972F3119b23294R4495j9421l3183A15983h2206j65569B64253a12865k40119
$$ -423972 63119 -223294 -128799 -148220 -181403 115983 -82206 -247775 264253 -112865 -352984
9133c52984K8092A1798L1899a65941p2977J08328A17940J41726a53879A20868
$$ -352984 -324892 11798 43697 -165941 -238918 -130590 117940 259666 -153879 120868
9122B4431a8355A05159k7256a65018O8740H1084b28266B6671c08428H1946N4152
$$ 24431 -18355 105159 77903 -165018 -96278 81084 -228266 26671 -308428 81946 136098
9111A36098m0846a48457c7816p7095j49477H7238b06197P1353O2751I7952f2282
$$ 136098 95252 -148457 -37816 -114911 -264388 87238 -206197 -134844 -72093 97952 -62282
9099a19593n2104A81696a02254Q281A6701R8033a57559d4918B8814b44265B28778
$$ -119593 -171697 181696 -102254 -93973 16701 114734 -157559 -44918 28814 -244265 228778
9087a41348F0023B113b15406K6811Q2079G4186a31155N4388E310e4263K3356J2548
$$ -141348 60023 2113 -215406 -188595 -106516 74186 -131155 -76767 5310 -54263 -30907 -18359
9075a8359k67634A37038i3036F5068e624A26548d9450j92513j5346f3863k55160
$$ -18359 -285993 137038 -93036 65068 -5624 126548 -49450 -241963 -257309 -63863 -319023
9064c19023F1098L0183a31304J919h534j20642A55212c9985E3022c37510J43969
$$ -319023 61098 91281 -131304 -129385 -8534 -129176 155212 -39985 53022 -337510 -193541
9053a93541J4224A6570O1486c1352A51216R1709a53616f4067E3002N5401K19456
$$ -193541 -179317 16570 78056 -31352 151216 242925 -153616 -64067 53002 108403 327859
9042C27859b33509G1909J36858G5869c64096g751l63098h5564p8672J0150D7763
$$ 327859 -233509 71909 208767 75869 -364096 -7751 -370849 -85564 -164236 -154086 47763
9030B19253D4156h0456j39049Q459A0899O2942l6330J3403a33980l39438a233
$$ 219253 44156 -80456 -219505 -211046 10899 73841 37511 50914 -133980 -473418 -1233
9018a11756a9561r8880p4352h9024H1699N2253c4380j00889m4508A11586b8625
$$ -111756 -19561 -118441 -192793 -89024 81699 133952 -34380 -135269 -179777 111586 -28625
9006c02228b0450B8679f4879F9419a35158E7387j4257K0571O4544i8941l3207
$$ -302228 -20450 28679 -64879 69419 -135158 57387 43130 63701 128245 -98941 -132148
8995a32148h44l38625A30488a94645A41612b90628H4709l3086h5343A68141C0969
$$ -132148 -844 -339469 130488 -194645 141612 -290628 84709 51623 -85343 168141 30969
8983A07044a76397k20187e5659B88225j17475J01201G2980e7662E5855a90963
$$ 107044 -176397 -396584 -55659 288225 170750 271951 72980 -57662 55855 -190963
8972A45320B3437g3747K4479A47212F3544P3182i3355j64092e0902j19788k64
$$ 145320 23437 -73747 -49268 147212 63544 136726 -93355 -257447 -50902 -170690 -170954
8961a70954C1849f1768n2926k16720f5404A27759N3777d3532E1032a14900j1598
$$ -170954 31849 -61768 -114694 -331414 -65404 127759 181536 -43532 51032 -114900 -126498
8950a26498r5355p8647a3318o7885j3393B05459p8973E5360k3094N6123a64186
$$ -126498 -221853 -300500 -13318 -81203 -94596 205459 126486 55360 32266 88389 -164186
8938H7974b3786k25827A79521J77853E3560b5601A34998B7787J74092A7999a22463
$$ 87974 -23786 -249613 179521 357374 53560 -25601 134998 27787 201879 17999 -122463
8926a77458I3417N40883Q47568R95794R282963p2412C972728A503315o87499C79470
$$ -177458 93417 634300 1481868 2477662 11760625 11688213 3972728 1503315 815816 379470
8915B81952j28608c91249A00098a16247k00182b784A33859d3815a3288k71639
$$ 281952 153344 -391249 100098 -116247 -316429 -2784 133859 -43815 -13288 -284927
8905b84927J07764d1597l9427a4812p7776k19583R232k8463a63435h0907A05200
$$ -284927 -177163 -41597 -81024 -14812 -92588 -312171 -302939 -331402 -163435 -80907 105200
8893a50292l8408N803E8509L29285a56764C31163j18603D2734J81728a59328A59052
$$ -150292 -188700 -182897 58509 387794 -156764 331163 212560 42734 224462 -159328 159052
8881I1605l9196d3019r8245J2180p352K3980B31690k4606h1666C7808a03508D0795
$$ 91605 52409 -43019 -141264 -129084 -136436 -112456 231690 207084 -81666 37808 -103508 40795
8868A43668i9592j02295i0488a1830j42915C5762a55178E2415J6057r5b15526
$$ 143668 -99592 -201887 -90488 -11830 -154745 35762 -155178 52415 68472 68377 -215526
$$ [...]
##END NTUPLES=NMR SPECTRUM
##END=
