
##TITLE=AC1303_PERAH12115_6641754_p1tBAZZZUx
##JCAMPDX= 6.0         $$ Bruker NMR JCAMP-DX V2.0
##DATA TYPE= NMR SPECTRUM
##DATA CLASS= NTUPLES
##ORIGIN= BRUKER
##OWNER= Administrator
$$ 1.72 TOPSPIN		Version 2.1
$$ 2012-08-09 15:06:27.468 -0500  Administrator@TOPSPIN
$$ Compression mode = diff/dup
##.OBSERVE FREQUENCY= 400.02188249412
##.OBSERVE NUCLEUS= ^1H
##.ACQUISITION MODE= SIMULTANEOUS (DQD)
##.ACQUISITION SCHEME= undefined
##.AVERAGES= 64
##.DIGITISER RES= 22
##SPECTROMETER/DATA SYSTEM= spect
##.PULSE SEQUENCE= noesygpps1d.comp
##.SOLVENT NAME= COFFEE_meoh
##.SHIFT REFERENCE= INTERNAL, COFFEE_meoh, 1, 14.9609
##AUDIT TRAIL= $$ (NUMBER, WHEN, WHO, WHERE, PROCESS, VERSION, WHAT)
$$ ##TITLE= Audit trail, TOPSPIN		Version 2.1
$$ ##JCAMPDX= 5.01
$$ ##ORIGIN= Bruker BioSpin GmbH
$$ ##OWNER= Administrator
$$ $$ C:\Bruker\TOPSPIN/data/COFFEE/nmr/AC1303_PERAH12115_6641754_p1tBAZZZUx/22/pdata/1/auditp.txt
$$ ##AUDIT TRAIL=  $$ (NUMBER, WHEN, WHO, WHERE, PROCESS, VERSION, WHAT)
(   1,<2012-08-09 15:06:20.046 -0500>,<Administrator>,<TOPSPIN>,<go>,<TOPSPIN 2.1>,
      <created by zg
	started at 2012-08-09 14:54:48.968 -0500,
	POWCHK enabled, PULCHK disabled,
       configuration hash MD5:
       6B 1B 68 BB D9 2E 58 E2 7F 35 AD 54 07 DF 0E 41
       data hash MD5: 64K
       6F 21 DC 98 49 77 7F A6 69 02 28 9C 65 C3 A2 0E>)
(   2,<2012-08-09 15:06:24.250 -0500>,<Administrator>,<TOPSPIN>,<proc1d>,<TOPSPIN 2.1>,
      <Start of raw data processing
       efp LB = 0.3 FT_mod = 6 PKNL = 1 PHC0 = 0 PHC1 = 0 SI = 128K 
       data hash MD5: 128K
       DD 36 2B 8B 85 73 94 98 4C 4E E4 2A EC A1 A5 47>)
(   3,<2012-08-09 15:06:25.421 -0500>,<Administrator>,<TOPSPIN>,<proc1d>,<TOPSPIN 2.1>,
      <pk PHC0 = -3.526611 PHC1 = 0 
       data hash MD5: 128K
       27 5A 20 EE D2 37 7D C9 CD 80 C4 3E 22 22 81 E5>)
(   4,<2012-08-09 15:06:27.015 -0500>,<Administrator>,<TOPSPIN>,<proc1d>,<TOPSPIN 2.1>,
      <abs ABSG = 1 
       data hash MD5: 128K
       A6 DC 94 F3 48 70 96 D8 97 A8 E5 2F E1 46 F4 03>)
(   5,<2012-08-09 15:06:27.109 -0500>,<Administrator>,<TOPSPIN>,<proc1d>,<TOPSPIN 2.1>,
      <abs ABSG = 2 
       data hash MD5: 128K
       DF C8 06 95 36 C6 26 53 9F 79 05 4A 9E 5A 1D 7E>)
(   6,<2012-08-09 15:06:27.187 -0500>,<Administrator>,<TOPSPIN>,<proc1d>,<TOPSPIN 2.1>,
      <abs ABSG = 3 
       data hash MD5: 128K
       9A 74 09 A6 44 A5 49 BC A0 BC 04 F7 04 E9 23 4D>)
(   7,<2012-08-09 15:06:27.234 -0500>,<Administrator>,<TOPSPIN>,<proc1d>,<TOPSPIN 2.1>,
      <abs ABSG = 4 
       data hash MD5: 128K
       4B C0 94 CE FA 41 C7 9A 08 69 4D FE 0D 3F 57 AD>)
(   8,<2012-08-09 15:06:27.281 -0500>,<Administrator>,<TOPSPIN>,<proc1d>,<TOPSPIN 2.1>,
      <abs ABSG = 5 
       data hash MD5: 128K
       50 21 50 B0 11 34 DA 20 C8 D4 7D E0 2A 2F 3D 58>)
$$ ##END=
$$ 
$$ $$ hash MD5
$$ $$ 4B 13 2E 66 0D BD 3E 60 DC 5F CE BC AB 1D F1 48
##$RELAX= 
##$RELAX= 
##$RELAX= 
##$RELAX= 
##$RELAX= 
##$RELAX= 
##$RELAX= 
##$RELAX= 
$$ Bruker specific parameters
$$ [...]
150 150 150 150 150 150 150 150
##$TP07= 0
##$TPNAME0= <>
##$TPNAME1= <>
##$TPNAME2= <>
##$TPNAME3= <>
##$TPNAME4= <>
##$TPNAME5= <>
##$TPNAME6= <>
##$TPNAME7= <>
##$TPOAL= (0..7)
0.5 0.5 0.5 0.5 0.5 0.5 0.5 0.5
##$TPOFFS= (0..7)
0 0 0 0 0 0 0 0
##$TUNHIN= 0
##$TUNHOUT= 0
##$TUNXOUT= 0
##$USERA1= <user>
##$USERA2= <user>
##$USERA3= <user>
##$USERA4= <user>
##$USERA5= <user>
##$V9= 5
##$VALIST= <valist>
##$VCLIST= <CCCCCCCCCCCCCCC>
##$VD= 0
##$VDLIST= <DDDDDDDDDDDDDDD>
##$VPLIST= <PPPPPPPPPPPPPPP>
##$VTLIST= <TTTTTTTTTTTTTTT>
##$WBST= 1024
##$WBSW= 4
##$XGAIN= (0..3)
0 0 0 0
##$XL= 0
##$YL= 0
##$YMAX_a= 11880724
##$YMIN_a= -9717508
##$ZGOPTNS= <>
##$ZL1= 120
##$ZL2= 120
##$ZL3= 120
##$ZL4= 120
##$ABSF1= 14.9609
##$ABSF2= -5.597281
##$ABSG= 5
##$ABSL= 3
##$ALPHA= 0
##$AQORDER= 0
##$ASSFAC= 0
##$ASSFACI= 0
##$ASSFACX= 0
##$ASSWID= 0
##$AUNMP= <proc_prof1d_extract.lims>
##$AXLEFT= 0
##$AXNAME= <>
##$AXNUC= <1H>
##$AXRIGHT= 0
##$AXTYPE= 0
##$AXUNIT= <>
##$AZFE= 0.1
##$AZFW= 0.1
##$BCFW= 0
##$BC_mod= 0
##$BYTORDP= 0
##$COROFFS= 0
##$CY= 15
##$DATMOD= 1
##$DC= 0
##$DFILT= <>
##$DTYPP= 0
##$F1P= 0
##$F2P= 0
##$FCOR= 0.5
##$FTSIZE= 131072
##$FT_mod= 6
##$GAMMA= 0
##$GB= 0
##$INTBC= 1
##$INTSCL= 1
##$ISEN= 128
##$LB= 0.3
##$LEV0= 0
##$LPBIN= 0
##$MAXI= 10000
##$MC2= 0
##$MEAN= 0
##$ME_mod= 0
##$MI= 0
##$NCOEF= 0
##$NC_proc= -2
##$NLEV= 6
##$NOISF1= 0
##$NOISF2= 0
##$NSP= 0
##$NTH_PI= 0
##$NZP= 0
##$OFFSET= 14.9609
##$PC= 1
##$PHC0= -3.526611
##$PHC1= 0
##$PH_mod= 1
##$PKNL= yes
##$PPARMOD= 0
##$PPDIAG= 0
##$PPIPTYP= 0
##$PPMPNUM= 2147483647
##$PPRESOL= 1
##$PSCAL= 4
##$PSIGN= 0
##$PYNMP= <proc.py>
##$REVERSE= no
##$SF= 400.020009675457
##$SI= 131072
##$SIGF1= 0
##$SIGF2= 0
##$SINO= 400
##$SIOLD= 131072
##$SPECTYP= <>
##$SREGLST= <1H.CDCl3>
##$SSB= 0
##$STSI= 131072
##$STSR= 0
##$SW_p= 8223.68421052631
##$SYMM= 0
##$S_DEV= 0
##$TDeff= 65536
##$TDoff= 0
##$TI= <>
##$TILT= no
##$TM1= 0
##$TM2= 0
##$TOPLEV= 0
##$USERP1= <user>
##$USERP2= <user>
##$USERP3= <user>
##$USERP4= <user>
##$USERP5= <user>
##$WDW= 1
##$XDIM= 131072
##$YMAX_p= 407890160
##$YMIN_p= -12007
##$CURPLOT= <Network HP LaserJet P1505>
##$CURPRIN= <$Network HP LaserJet P1505>
##$DFORMAT= <normdp>
##$LAYOUT= <+/1D_H.xwp>
##$LFORMAT= <normlp>
##$PFORMAT= <normpl>
##$SURQMSG= 1
$$ End of Bruker specific parameters
$$ ---------------------------------
##NTUPLES= NMR SPECTRUM
##VAR_NAME=  FREQUENCY,     SPECTRUM/REAL,   SPECTRUM/IMAG
##SYMBOL=    X,             R,               I
##VAR_TYPE=  INDEPENDENT,   DEPENDENT,       DEPENDENT
##VAR_FORM=  AFFN,          ASDF,            ASDF
##VAR_DIM=   131072,        131072,          131072
##UNITS=     HZ,            ARBITRARY UNITS, ARBITRARY UNITS
##FACTOR=    0.0627417313425164, 1,          1
##FIRST=     8223.62146879497, 485,          -65783
##LAST=      0,             2006,            -66012
##MIN=       0,             -12007,          0
##MAX=       8223.62146879497, 407890160,    0
$$ Real data points
##PAGE= N=1
##DATA TABLE= (X++(R..R)), XYDATA
$$ [...]
61570C33662p72l83o11p60l72J81L44N0m07p74r26q29n25j10K97N69O88Q49J260
61551C31431J761J890J423P02L30O24J325J775J506Q53O36J083J401Q66p8m34
61535C47094K6P43J397K074K584K487J846J147N22j66o00l83o1o52j991k736k260
61518C51071j376q84o17l65m96r75r61j72M41K29OO42J464J234K1j084j614j936
61500C44628k139j870j133l93P8L03K82J62L72R57J180M91m95p63k91J53K61L52
61482C42135M76K83j46j38O65J790K499K528K218K099K254K090J005n75j390q69
61466C56924J22M66J41j63k10k24j52K78R19J269J129P25L23J08K54P65J352J717
61448C65743J745J350N87m9m4K52l9q38r08M11K252L510M126M320L697K164Q43
$$ plain form
61570 333662 332890 332507 331896 331136 330764 330945 331289 331339 330932 330158 329232 328403 327878 327768 328065 328634 329322 330171 331431
61551 331431 333192 335082 336505 337207 337537 338161 339486 341261 342767 343620 344256 345339 346740 347606 347528 347094
61535 347094 347120 347863 349260 351334 353918 356405 358251 359398 359920 359754 359154 358771 358710 358058 356067 353331 351071
61518 351071 349695 348811 348194 347829 347333 346358 345397 345225 345666 345895 345901 346543 348007 349241 349262 348178 346564 344628
61500 344628 342489 340619 339486 339093 339171 339474 339756 339918 340290 341247 342427 342918 342423 341660 341369 341522 341783 342135
61482 342135 342611 342894 342748 342610 343275 345065 347564 350092 352310 354409 356663 358753 359758 359183 357793 356924
61466 356924 357046 357512 357653 357490 357280 357056 356904 357182 358101 359370 360499 361224 361547 361655 361909 362674 364026 365743
61448 365743 367488 368838 369425 369376 369332 369584 369545 368707 367799 368210 370462 373972 378098 382418 386115 388279 389122
61431C89122Q48J718K230K163K100K023J445O42M10P52R68R41J154J518J361P22
61415D10117N12J142J929K130J737J075K94l69n28q2N88R77P96M0r10j469j518
61398D16461j594k022k292j835r56l23PL06M17J05j97J33Q71J211Q92L26j20k69
61380D11121J39J093J965K205K034J826J362N58K00Q88J768J635Q34P71J737K569
61364D32705K359J302o2j219j373j18J510J915J029L67Q74J918K668L235M027
61349D51137M971N880O853P942Q951R695R932R245P646O047N282M975M309L452
61335E46317L079K907K175J228J094J548J332L02l41k37m55j467k245k120j889
61320E51228k188k225j172L28J139J204J244J710K732M379O188P222P224P113
$$ plain form
61431 389122 389970 391688 393918 396081 398181 400204 401649 402291 402701 403453 404421 405362 406516 408034 409395 410117
61415 410117 410629 411771 413700 415830 417567 418642 418936 418567 418039 417957 418545 419522 420318 420358 419448 417979 416461
61398 416461 414867 412845 410553 408718 407762 407439 407446 407752 408169 408274 408077 408210 409081 410292 411184 411510 411390 411121
61380 411121 411260 412353 414318 416523 418557 420383 421745 422303 422503 423391 425159 426794 427628 428399 430136 432705
61364 432705 435064 436366 436304 435085 433712 433594 435104 437019 438048 438415 439289 441207 443875 447110 451137
61349 451137 456108 461988 468841 476783 485734 495429 505361 514606 522252 528299 533581 538556 542865 546317
61335 546317 549396 552303 554478 555706 556800 558348 559680 559982 559641 559404 558949 557482 555237 553117 551228
61320 551228 549040 546815 545643 545971 547110 548314 549558 551268 554000 558379 564567 571789 579013 586126
61306E86126P871R586J1874J4273J5959J6115J5108J4287J4157J3714J2015R242
61294G40327N797J740k323n134o505p784r641j0725r802q030p606q895j0274j0366
61280F50779r170p411n949n484n853n833m435k095mJ193J464Q61r9l31O21J752
61264F10006J925J437J329J759K219K833M135N844P065P637Q167Q741Q719P903
61250F79719O863N902M595K700P64n65j322j959k681l286l490l290l046l175l552
61235F74177l508k619j348o06p49j262j318m85J025K624L999N429P248R079J0097
61220G01783J0059R591R356R424R555R584R380Q924Q513Q408Q263P496O270N329
61206H21935M810M090K937J952J576J587J854K701M071N297O131P174Q866J0896
$$ plain form
61306 586126 593997 603583 615457 629730 645689 661804 676912 691199 705356 719070 731085 740327
61294 740327 746124 747864 745541 740407 733902 726118 716477 705752 695950 687920 680314 671419 661145 650779
61280 650779 641609 634198 628249 622765 616912 611079 606644 604549 604545 605738 607202 608063 607964 607633 608254 610006
61264 610006 611931 613368 614697 616456 618675 621508 625643 631487 638552 646189 654356 663097 671816 679719
61250 679719 686582 692484 697079 699779 700543 699978 698656 696697 694016 690730 687240 683950 680904 677729 674177
61235 674177 670669 668050 666702 666096 665347 664085 662767 662282 663307 665931 669930 675359 682607 691686 701783
61220 701783 711842 721433 730789 740213 749768 759352 768732 777656 786169 794577 802840 810336 816606 821935
61206 821935 826745 830835 833772 835724 837300 838887 840741 843442 847513 852810 858941 866115 874981 885877
61192H85877J3014J5444J7864J9092J8483J6779J4856J2492R241N671K875J279
61180A032967O65O91P54L3j559l106l963m591n566o707p876r610j2010j3937j4384
61165I51801j3910j3674j3858j4131j4842j6404j8097j8748j8347j7792j7414
61154G74584j6815j5875j4755j3123j0470p189m401k659j589o72K47J073J446
61141F89802Q05j026l424n529o875p263o673n637m924m403l108q76J142K268L418
61126F47697N464P671Q994R947J1790J4589J7397J9766K1829K3483K4727K6197
61114H39551K8217K9931L0592L0952L2025L3215L3156L1812L0211K8589K6399
61103A174650K3790K1514J9525J7112J4207J1235P944L747j097n911j0832j6217
$$ plain form
61192 885877 898891 914335 932199 951291 969774 986553 1001409 1013901 1023142 1028813 1031688 1032967
61180 1032967 1033632 1034323 1035077 1035110 1033551 1030445 1026482 1021891 1016325 1009618 1001742 992132 980122 966185 951801
61165 951801 937891 924217 910359 896228 881386 864982 846885 828137 809790 791998 774584
61154 774584 757769 741894 727139 714016 703546 696357 691956 689297 687708 687036 687283 688356 689802
61141 689802 690607 689581 686157 680628 673753 666490 659817 654180 649256 644853 641745 640869 642011 644279 647697
61126 647697 653161 660832 669826 679773 691563 706152 723549 743315 765144 788627 813354 839551
61114 839551 867768 897699 928291 959243 991268 1024483 1057639 1089451 1119662 1148251 1174650
61103 1174650 1198440 1219954 1239479 1256591 1270798 1282033 1289977 1293724 1292627 1286716 1275884 1259667
61091A259667k1254k4716k6815k8770l0767l1908l1940l1466l0623k9150k7627
61080I44631k6976k6804k5857k4024k2297k0799j8671j5969j3950j3109j2497
61069G23678j1288r686q033o399n114m417l644k123o41l99p61JJ894L171L251
61054F79490L495M723O122P155Q574J0705J2619J3780J4876J6321J7567J8563
61042H13990K0169K2412K3987K4325K4534K5537K6841K7910K9160L0712L1730
61031A101307L1883L2068L2898L3927L5003L6786L9247M1249M2306M3158M3947
61020A513779M3716M2479M1957M3430M6610N1336N8316O7363P7049Q6967R8140
61009B171142J10642J23712J39151J61211J91597K28091K70039L21129L84381
$$ plain form
61091 1259667 1238413 1213697 1186882 1158112 1127345 1095437 1063497 1032031 1001408 972258 944631
61080 944631 917655 890851 864994 840970 818673 797874 779203 763234 749284 736175 723678
61069 723678 712390 702704 694671 688272 683158 678741 675097 672974 672333 671934 671173 671174 673068 676239 679490
61054 679490 682985 687708 693830 700985 709559 720264 732883 746663 761539 777860 795427 813990
61042 813990 834159 856571 880558 904883 929417 954954 981795 1009705 1038865 1069577 1101307
61031 1101307 1133190 1165258 1198156 1232083 1267086 1303872 1343119 1384368 1426674 1469832 1513779
61020 1513779 1557495 1599974 1641931 1685361 1731971 1783307 1841623 1908986 1986035 2073002 2171142
61009 2171142 2281784 2405496 2544647 2705858 2897455 3125546 3395585 3716714 4101095
61000D101095M59443N49007O62851Q10016R92713J215995J494169J824033K141524
60991A4250846K322723K255426J922696J415809Q69797L95637O6705o6320R557
60982B3442876K27887M40179M87513K92538j10127o18706j125869j548388j832984
60973A9654919j963095j961276j870636j727191j550981j357512j165333r89218
60965G069677q33877o98835n84768m91765m16102l53264l01811k61326k29028
60956B898901k01509j77876j58384j41649j25862j11249r8785q7648p6422o5840
60946A653677n7881n2838m9309m6602m4964m3915m2314m0073l8063l6449l4592
60935A166677l2513l0961k9969k8659k6615k4344k2310k0447j8693j7111j5588
$$ plain form
61000 4101095 4560538 5109545 5772396 6582412 7575125 8791120 10285289 12109322 14250846
60991 14250846 16573569 18828995 20751691 22167500 23037297 23432934 23499639 23433319 23442876
60982 23442876 23670763 24110942 24598455 24890993 24780866 24162160 23036291 21487903 19654919
60973 19654919 17691824 15730548 13859912 12132721 10581740 9224228 8058895 7069677
60965 7069677 6235800 5536965 4952197 4460432 4044330 3691066 3389255 3127929 2898901
60956 2898901 2697392 2519516 2361132 2219483 2093621 1982372 1883587 1795939 1719517 1653677
60946 1653677 1595796 1542958 1493649 1447047 1402083 1358168 1315854 1275781 1237718 1201269 1166677
60935 1166677 1134164 1103203 1073234 1044575 1017960 993616 971306 950859 932166 915055 899467
60924H99467j4124j3239j3213j3239j2255j0424q728p334n560l485k250k370k801
60911G90445k266p72Q12K077L327M786O137O884O937O802P162Q248R661J0874
60897H61114J1650J1906J1502J0549R603R113Q918Q734Q867R745J0915J1249J0343
60884I94208R046Q353Q251P972O939N197L192J511N87L25J19n62j735l112m450
60869A035841n503n996o008o203p173q637r692r936r874j0048j0302j0220r926
60856I26323r934j0325j0559j0257r812j0009j1217j2979j4251j4120j2593j0692
60844G89575r555r391r615r887j0498j1586j2579j2872j2670j2649j2932j2940
60832F52401j2216j1029j0051r638r485q929p727o450n859n870n597m571l385
$$ plain form
60924 899467 885343 872104 858891 845652 833397 822973 814245 806911 801351 797866 795616 793246 790445
60911 790445 788179 787407 788219 790296 793623 798409 804546 811430 818367 825169 832331 840579 850240 861114
60897 861114 872764 884670 896172 906721 916324 925437 934355 943089 951956 961701 972616 983865 994208
60884 994208 1003254 1011607 1019858 1027830 1034769 1039966 1043158 1044669 1045256 1045581 1045700 1045138 1043403 1040291 1035841
60869 1035841 1030338 1024342 1018334 1012131 1004958 996321 986629 976693 966819 956771 946469 936249 926323
60856 926323 916389 906064 895505 885248 875436 865427 854210 841231 826980 812860 800267 789575
60844 789575 780020 770629 761014 751127 740629 729043 716464 703592 690922 678273 665341 652401
60832 652401 640185 629156 619105 609467 599982 591053 583326 576876 571017 565147 559550 554979 551594
60819E51594k762k583k366k179k339k562k306j771j688k071k089j341m25j2l9
60804E25061j72l72n74m10K18P92Q50O29N42M54M4m73o18m42m14o18p38q30j412
60785E21517k550l495l534k864k256k141k429k911l430l727l557l035k618k645
60771D80325l129l887m687n159m987m252l397k696k023j281o72l07R4P47J305
60756D45994J309R01N65L33j33p16p86j40O55J066J252J628K246L006L898M646
60740D65724M529L143J160k95r10j355k212l188l572l197k717k925l859m700m663
60725D40963l871l124k893k913k835k724k763k841k775k647k617k605k423k059
60711D01873j707j627j941k351k192j250l56n23j488j953j408p60q12j154j175
$$ plain form
60819 551594 548832 546249 543883 541704 539365 536803 534497 532726 531038 528967 526878 525537 525112 525100 525061
60804 525061 524889 524517 523943 523533 523751 524543 525393 526022 526564 527018 527062 526589 525971 525529 525115 524497 523759 522929 521517
60785 521517 518967 515472 511938 509074 506818 504677 502248 499337 495907 492180 488623 485588 482970 480325
60771 480325 477196 473309 468622 463463 458476 454224 450827 448131 446108 444827 444155 443848 443942 444689 445994
60756 445994 447303 448204 448769 449102 448969 448253 447467 447327 447982 449048 450300 451928 454174 457180 461078 465724
60740 465724 470253 473396 474556 474261 473351 471996 469784 466596 463024 459827 457110 454185 450326 445626 440963
60725 440963 437092 433968 431075 428162 425327 422603 419840 416999 414224 411577 408960 406355 403932 401873
60711 401873 400166 398539 396598 394247 392055 390805 390449 389926 388438 386485 385077 384317 383505 382351 381176
60696C81176j100j208q73M49J988K555K251K031K034J609R04Q84J691K247J922
60681C98560J474J779K588L199L541L927M302M435M524M966N736O405O579O001
60667D58016M567K613R81L42M75N35K9p00r67n57O8L37K06R1K50N27P11Q42R44
60648D69310Q46N44M00O24Q38N62j60r58j732k494k981l009k949l325m008m421
60632D47087m348l966l271k215j303j193j672j738r29J06N40K86k48p61j128j283
60616D23964j281j227j099q52o21m19O6R35J584J446J015J164J691J539N77l8
60600D28444L73J002Q98L40J16L11N85J054J944K827L075K825K701K756K461J650
60584D53362P59J28l55q26j147j230j192j060o15K56J247J866J958J958K558L988
$$ plain form
60696 381176 380076 378868 377995 378444 380432 382987 385238 387269 389303 390912 391816 392700 394391 396638 398560
60681 398560 400034 401813 404401 407600 411141 415068 419370 423805 428329 433295 439031 445436 452015 458016
60667 458016 462583 465196 466177 466519 466994 467529 467558 466858 465891 465334 465402 465739 465945 466036 466286 466813 467524 468366 469310
60648 469310 470156 470700 471100 471724 472562 473124 472964 472006 470274 467780 464799 461790 458841 455516 451508 447087
60632 447087 442739 438773 435502 433287 431984 430791 429119 427381 426452 426558 427098 427384 427136 426375 425247 423964
60616 423964 422683 421456 420357 419505 418884 418465 418531 419466 421050 422496 423511 424675 426366 427905 428482 428444
60600 428444 428817 429819 430717 431057 431173 431484 432069 433123 435067 437894 440969 443794 446495 449251 451712 453362
60584 453362 454121 454249 453894 453068 451921 450691 449499 448439 447824 448080 449327 451193 453151 455109 457667 461655
60568D61655N700O905P541Q376J0116J2544J4764J6046J6168J5197J3293J0736
60556E99041P876M878J714j567m560o665p540p349o510n331m021k904k184j472
60542E63406o3K116M288N931P504R644J2131J4357J6399J8687K0813K1638K0650
60529G17501J8285J4875J0296N045N63k238m064o094q250r421r125q127p393p096
60515G04757o809o234n418m515l577k610j604n10P48K030K886L055L126M205O696
60500F96226R889J3114J6735K1338K6458L1051L5049L9328M4166M8628N1797N3605
60488A087384N4107N2717M8812M2578L4780K6025J6570O501m121j4953k5099l3671
60476A291630m0679m6726n1733n4745n5238n3858n1446m8164m4053l9693l5608
$$ plain form
60568 461655 467355 474260 481801 490177 500293 512837 527601 543647 559815 575012 588305 599041
60556 599041 606917 611795 613509 611942 607382 600717 593177 585828 579318 573987 569966 567062 564878 563406
60542 563406 563343 565459 569747 575678 583182 592826 604957 619314 635713 654400 675213 696851 717501
60529 717501 735786 750661 760957 766002 766565 764327 760263 754169 745919 736498 727373 719246 711853 704757
60515 704757 697948 691714 686296 681781 678204 675594 673990 673480 674228 676258 679144 682199 685325 689530 696226
60500 696226 706115 719229 735964 757302 783760 814811 849860 889188 933354 981982 1033779 1087384
60488 1087384 1141491 1194208 1243020 1285598 1320378 1346403 1362973 1369474 1365353 1350400 1325301 1291630
60476 1291630 1250951 1204225 1152492 1097747 1042509 988651 937205 889041 844988 805295 769687
60465G69687l1695k7843k4554k2193k0163j7724j5193j3469j2667j1994j0913
60454E61279r583q295p198o637o942p739q003p082n284l365j851r41o69q53j132
60439D85705j212j041p64n90o66r57j255j449j618j793j746j281o42l54o72j276
60423D68389j590j337p75l70k57r9L49P59N43l09j053q99K80J857K898K848K103
60406D73337J734K304L132L138K199J091L07k45n33k45M03O94M87N26J315K427
60390D92071L275L796L888L165J858J157J736K606K344J122M67J231K664L504
60376E24884L236K275J436J342J947K570K694K554K618K786K570J925J338J148
60362E55323J174J049O42J31p8L15J128J776J981K079K427K832K964L039L625
$$ plain form
60465 769687 737992 710149 685595 663402 643239 625515 610322 596853 584186 572192 561279
60454 561279 551696 543401 536203 529566 522624 514885 506882 499800 494516 491151 489300 488359 487690 486837 485705
60439 485705 484493 483452 482688 482098 481432 480475 479220 477771 476153 474360 472614 471333 470691 470337 469665 468389
60423 468389 466799 465462 464687 464317 464060 463961 464310 465069 465612 465303 464250 463351 463631 465488 468386 471234 473337
60406 473337 475071 477375 480507 483645 485844 486935 487242 486997 486464 486219 486622 487316 487803 488329 489644 492071
60390 492071 495346 499142 503030 506195 508053 509210 510946 513552 515896 517018 517485 518716 521380 524884
60376 524884 528120 530395 531831 533173 535120 537690 540384 542938 545556 548342 550912 552837 554175 555323
60362 555323 556497 557546 558188 558319 558241 558556 559684 561460 563441 565520 567947 570779 573743 576782 580407
60347E80407M888O345P321P467P004O570O605O715O012M185J765p22l251n629
60333F35682p099p262o816o660o677o155n038l988l341k834k333k167k565l236
60319E69511l653l493k793j946j442j383j355r55j84Q51K201L798N302O664Q344
60304E79467J0579J2923J5014J7255K0065K2812K4345K4252K2895K0282J5884
60293G85773R588K191n149j1473j6100j8751j9768j9762j9043j7662j5890j4116
60281F39838j2386j0530q697p252o231n433m967n141n768o140n883n410n303n551
60267E45146n575m859l464k048j280j205j286j172j061j180j367j407j373j240
60253E16629o97J98O39M9r66j301p13J66Q58J354J587J441J179J100Q97Q8q86
$$ plain form
60347 580407 585295 591640 598961 606428 613432 620002 626607 633322 639334 643519 645284 644562 641311 635682
60333 635682 628583 621321 614505 607845 601168 595013 589975 585987 582646 579812 577479 575312 572747 569511
60319 569511 565858 562365 559572 557626 556184 554801 553446 552491 552307 553158 555359 559157 564459 571123 579467
60304 579467 590046 602969 617983 635238 655303 678115 702460 726712 749607 769889 785773
60293 785773 795361 797552 792403 780930 764830 746079 726311 706549 687506 669844 653954 639838
60281 639838 627452 616922 608225 600973 594742 589309 584342 579201 573433 567293 561410 556000 550697 545146
60267 545146 539571 534712 531248 529200 527920 526715 525429 524257 523196 522016 520649 519242 517869 516629
60253 516629 515932 516130 516769 516818 515852 514551 513838 514004 514862 516216 517803 519244 520423 521523 522420 522508 521622
60236E21622r04L04J663K074J605J032Q45J083J664K367K753K500J826J336J470
60221E43240K140K887L315L407L409L411L301L193L570M744O371P737Q371Q270
60207F07366P791P525P871Q572Q939Q699Q157P460O359N085M570N192N921N496
60193G05003M016K568J703J103M58k10r15j733k486k970l336l785m206m587n295
60178F85328o364p005o605n673n053m684m036l250k832k648k285j955j947j691
60164F29300o18M00kj530k532k365j930j757j322n09j37m29n25q1O6l95l89P89
60146F16034K146K550K457K913L773M210M238M434M707M578M292M512N142N513
60132F71499N583N855O192N774M350K708J611J063P77P86J150J580J728J666J757
$$ plain form
60236 521622 520718 521022 522685 524759 526364 527396 528241 529324 530988 533355 536108 538608 540434 541770 543240
60221 543240 545380 548267 551582 554989 558398 561809 565110 568303 571873 576617 582988 590725 599096 607366
60207 607366 615157 622682 630553 639125 648064 656763 664920 672380 678739 683824 688394 693586 699507 705003
60193 705003 709019 711587 713290 714393 714851 714641 713726 711993 709507 706537 703201 699416 695210 690623 685328
60178 685328 678964 671959 665354 659681 654628 649944 645908 642658 639826 637178 634893 632938 630991 629300
60164 629300 628682 629082 629080 627550 625018 622653 620723 618966 617644 617135 616998 616569 616044 615963 616029 615634 615245 616034
60146 616034 618180 620730 623187 626100 629873 634083 638321 642755 647462 652040 656332 660844 665986 671499
60132 671499 677082 682937 689129 694903 699253 701961 703572 704635 705412 706198 707348 708928 710656 712322 714079
60117G14079K131K493K479K117J901K274L061L582L343K517J654J096P28K07o96
60102G42966j854k876l464l664l733l863m089m304m210l496k261r86Q4J215K537
60087G08002L557L797L540L402L450L344L055K781K397J687R32N26J35r64k755
60072G36886m489n790o954q144r093r726j0289j0686j0476r716r089q957q940
60059F24537q625q059p362o454n431m592m022l584l335l327l070k017n26N07R89
60044E65629J707K947M077M730N333O092O447O122N778O040O474O205M996L279
60030F35856J578K95m54j094k198l670m870n600o295p079p549p640p811q059p799
60015E67611p038o686p104p350o524n037l822l075k477k043j936j957j813j536
$$ plain form
60117 714079 716210 718703 721182 723299 725200 727474 730535 734117 737460 739977 741631 742727 743455 743662 742966
60102 742966 741112 738236 734772 731108 727375 723512 719423 715119 710909 707413 705152 704166 704250 705465 708002
60087 708002 711559 715356 718896 722298 725748 729092 732147 734928 737325 739012 739944 740470 740605 739641 736886
60072 736886 732397 726607 719653 711509 702416 692690 682401 671715 661239 651523 642434 633477 624537
60059 624537 615912 607853 600491 594037 588606 584014 579992 576408 573073 569746 566676 564659 564133 564640 565629
60044 565629 567336 570283 574360 579090 584423 590515 596962 603084 608862 614902 621376 627581 632577 635856
60030 635856 637434 637729 637275 636181 633983 630313 625443 619843 613548 606469 598920 591280 583469 575410 567611
60015 567611 560573 553887 546783 539433 532909 527872 524050 520975 518498 516455 514519 512562 510749 509213
60001E09213j154m82L75Q78Q07N80N58O69R77J744K590K575J640J055J813L440
59985E27278M907N836O183N708M557L441K578J308m79j664j577j281k003l234
59971E51558l675l336l245l612l727l382l047k751j951n28R72K136K876L085K807
59956E34180K561K789L206L342L329L431L368K855K420K660L168L121K549K044
59942E75023J636R65K14k06o26j636k825l214k864k832l524m155l994l168k104
59927E46690j048l44k82n10l40K20N21M56P11J657K799L585M134M775N430N798
59911E74252N850N881O225O868P230O614N128L751L048K398J086l55q46l92l6
59896F26702l67r68j372j566j532j033o7J083K257L338L960L900L634L725L898
$$ plain form
60001 509213 508059 507577 507952 508830 509637 510217 510775 511444 512421 514165 516755 519330 520970 522025 523838 527278
59985 527278 532185 538021 544204 549912 554469 557910 560488 561796 561317 559653 558076 556795 554792 551558
59971 551558 547883 544547 541302 537690 533963 530581 527534 524783 522832 522304 523276 525412 528288 531373 534180
59956 534180 536741 539530 542736 546078 549407 552838 556206 559061 561481 564141 567309 570430 572979 575023
59942 575023 576659 577624 577838 577632 577006 575370 572545 569331 566467 563635 560111 555956 551962 548794 546690
59927 546690 545642 545298 545016 544506 544166 544386 544907 545363 546074 547731 550530 554115 558249 563024 568454 574252
59911 574252 580102 585983 592208 599076 606306 612920 618048 621799 624847 627245 628331 627976 627130 626738 626702
59896 626702 626335 625367 623995 622429 620897 619864 619797 620880 623137 626475 630435 634335 637969 641694 645592
59881F45592L523K858K854L703M544M726M510M306M014L385K353Q62j026k688
59867F83516l377l200l136l771m684n203n233n051m806m453l870k984j981j321
59853F30446j105p50K39J434K101K392L165M722O605Q439J0113J1142J0858R414
59839F99215P690O065M123J859J86j67M34J196J774K039J612K46j643l322m443
59824G16864n166n872o915q360r776j0546j0445r675q465p011n742n081m884m586
59810F14340l957l226k486j555n54l1k41p54r63p20l09j72o82j803k871l087k395
59793E88534j586j504k266l305l868l608k844k210j981j982k167k715l341l216
59779E51941k146j132j090j574j620j286j324j746j859j499j150q65j88P98J402
$$ plain form
59881 645592 649115 651973 654827 658530 663074 667800 672310 676616 680630 684015 686368 687230 686204 683516
59867 683516 680139 676939 673803 670032 665348 660145 654912 649861 645055 640602 636732 633748 631767 630446
59853 630446 629341 628591 628830 630264 632365 634757 637922 642644 649249 657688 667801 678943 689801 699215
59839 699215 706905 712970 717093 718952 719138 718971 719405 720601 722375 724414 726026 726272 724629 721307 716864
59824 716864 711698 705826 698911 690551 680775 670229 659784 650109 641644 634633 628891 623810 618926 614340
59810 614340 610383 607157 604671 603116 602562 602531 602290 601536 600573 599853 599544 599372 598690 596887 594016 590929 588534
59793 588534 586948 585444 583178 579873 576005 572397 569553 567343 565362 563380 561213 558498 555157 551941
59779 551941 549795 548663 547573 545999 544379 543093 541769 540023 538164 536665 535515 534650 534462 535260 536662
59764E36662J379J208J179J154J259J869K804L437L771M441N461N948N474M753
59750E80799M603N001N558O174O749O950O713O445O371O178N578M746L940L147
59736F58952K337J600R47L63R7L73Q40R51P43O11M74O5j40O44K013K534J672N53
59718F75629L03O53P58N27L58K64m3n25q53p92k29P32J572J691J185Q17R81J274
59700F84302J231R61Q10R34J363J982K324J960J171O68N86M56J60N9J06k08q81
59683F97984j285j283j463j936j956j227o02q87j745k488l162m130n197n874o135
59668F58614o268o317o141n696m955l968l142k914k970k430j076L13J117J578
59654F15745K063K416K539K808L413L899L889L587L188K454J314J92p23j826l251
$$ plain form
59764 536662 538041 539249 540428 541582 542841 544710 547514 550951 554722 559163 564624 570572 576046 580799
59750 580799 585402 590403 595961 602135 608884 615834 622547 628992 635363 641541 647119 651865 655805 658952
59736 658952 661289 662889 663836 664199 664296 664669 665509 666460 667203 667814 668288 668353 668213 668857 670870 673404 675076 675629
59718 675629 675932 676585 677343 677870 678228 678492 678449 677924 677071 676279 676050 676782 678354 680045 681230 682047 683028 684302
59700 684302 685533 686494 687304 688238 689601 691583 693907 695867 697038 697706 698292 698748 698908 698967 699073 698865 697984
59683 697984 696699 695416 693953 692017 690061 688834 688232 687345 685600 683112 679950 675820 670623 664749 658614
59668 658614 652346 646029 639888 634192 629237 625269 622127 619213 616243 613813 612737 613050 614167 615745
59654 615745 617808 620224 622763 625571 628984 632883 636772 640359 643547 646001 647315 647507 646784 644958 641707
59639F41707m405m866m994n126m978m383l838l608l134k107j331j639k535k921
59625E91842k659k466k639k840k955l192l437l292k843k697l124l602l431k564
59611E50101j683j476j768j556k58J361K081J861J699J956J893J138M00J97o4
59596E55882r27j729j533n50K52M12Q2o33j506j802j001K89Q76L32p65j690k060
59579E43929j733q64m5J36k83q11j180j556k130k728k822k046q02j50n97j334
59563E24984j265m87Ml6K5K94R2o14q16%J023J425J455J638J894K057K341K687
59545E36701K647K445L041M525N700N968O393Q015J0405J2892J5777J8931K0548
59532F53988J8947J4748R723M470j032n526p248o341m548k731m66J996L427L567
$$ plain form
59639 641707 637302 632436 627442 622316 617338 612955 609117 605509 602375 600268 598937 597298 594763 591842
59625 591842 589183 586717 584078 581238 578283 575091 571654 568362 565519 562822 559698 556096 552665 550101
59611 550101 548418 546942 545174 543618 543360 544721 546802 548663 550362 552318 554211 555349 555749 555946 555882
59596 555882 554955 553226 551693 551143 551395 551807 551889 551256 549750 547948 546947 547236 548112 548444 547679 545989 543929
59579 543929 542196 541332 541287 541423 541140 540329 539149 537593 535463 532735 529913 527867 527065 526915 526318 524984
59563 524984 523719 523232 523236 523200 523225 523519 523611 522997 522181 522181 523204 524629 526084 527722 529616 531673 534014 536701
59545 536701 539348 541793 544834 549359 555059 561027 567420 575435 585840 598732 614509 633440 653988
59532 653988 672935 687683 697406 701876 700844 695318 688070 681729 677181 674450 673984 675980 679407 682974
59518F82974L603M117M060K494P7k019l686n494p435q934r755j0174j0414j0407
59504F29007j0108r749r515r091p883n946m416m307m989m771l155j522j129j485
59490E50941j454r69o87o70n04j77M9K88O85R82J178J963L547M811M681L786L463
59473E71913L793L880L652L848M396M331L417K548K308K280K043J872K103K608
59459F14992L128L618M076M564N317O383P376Q046Q716R545R926R405Q643Q499
59445G12234Q539P562N288K516j92k898n559p881r798j1205j1561j0635r321q644
59431F58445q299p271n604m283l532k586j013Q64K894N209P442R029J0282J2012
59417F73589J4148J5864J6993J8098J9325K0535K2419K5669K8835K8697K3474
$$ plain form
59518 682974 686577 690694 694754 697248 697325 695306 691620 686126 678691 669757 660002 649828 639414 629007
59504 629007 618899 609150 599635 590544 582661 576715 572299 567992 563003 558232 555077 553555 552426 550941
59490 550941 549487 548518 547831 547161 546657 546480 546529 546817 547502 548484 549662 551625 555172 559983 564664 568450 571913
59473 571913 575706 579586 583238 587086 591482 595813 599230 601778 604086 606366 608409 610281 612384 614992
59459 614992 618120 621738 625814 630378 635695 642078 649454 657500 666216 675761 685687 695092 703735 712234
59445 712234 720773 728335 733623 736139 735947 733049 727490 719609 709811 698606 687045 676410 667089 658445
59431 658445 650146 642875 637271 632988 629456 626870 625857 626721 629615 634824 642266 651295 661577 673589
59417 673589 687737 703601 720594 738692 758017 778552 800971 826640 855475 884172 907646
59406I07646J4441M170n388j2743j6765j7741j7190j5540j1376m178L354P244
59394H35934N968J077n211j1634j7381k1489k3365k3251k1785j9451j6556j3445
59382F69411j0547q229o617n492m407k954j036R78K361K639K241K188K906L804
59368F47246M261M475M825N063M891M783N390O473P307P805Q348Q814Q806Q638
59354G37125R035R931J0583J0890J1603J3116J4943J6495J7582J8142J8240J8283
59342I05968J8502J8352J7293J5888J5037J4290J2165Q314M114P95j950n052q692
59329A015024j2321j5380j7559j8862j9623k0066j9888j8781j7186j5784j4502
59318H25072j2863j1082r819r010p957o535n268m290l277k409k257k645k747k402
$$ plain form
59406 907646 922087 926257 920869 908126 891361 873620 856430 840890 829514 825336 828690 835934
59394 835934 841902 842979 837768 826134 808753 787264 763899 740648 718863 699412 682856 669411
59382 669411 658864 650635 644018 638526 634119 631165 630129 631107 633468 636107 638348 640536 643442 647246
59368 647246 651507 655982 660807 665870 670761 675544 680934 687407 694714 702519 710867 719681 728487 737125
59354 737125 746160 756091 766674 777564 789167 802283 817226 833721 851303 869445 887685 905968
59342 905968 924470 942822 960115 976003 991040 1005330 1017495 1025809 1029923 1030718 1028768 1023716 1015024
59329 1015024 1002703 987323 969764 950902 931279 911213 891325 872544 855358 839574 825072
59318 825072 812209 801127 791308 782298 774341 767806 762538 758248 754971 752562 750305 747660 744913 742511
59304G42511k232k309j882o09R94K556M267O154Q007J0098J2761J5098J5320J2694
59290H23428Q079K450l796r801j4049j5915j6300j6136j5285j3468j1131q700
59278G09376n921k678K95K251L349M329N770P932J0652J3139J4583J5041J5085
59265G93203J4672J3362J1547J0121Q906O684L109p53m078p082r734j1238j1469
59252H17250j1600j2393j3033j2470j0956r375p984o638n484m632l772k686j549
59239G14678l36J297L236M775N638O228O648O502N898N521N311M353K513Q69k0
59224G73111r83k697m572n927p076q385r326r336q656p640o235m737l888l570
59210F90083k728j215l38o12n99Q00K358K345J159M13L70Q1n42o00J6L50n0n53
$$ plain form
59304 742511 740279 737970 736088 735479 736473 739029 743296 749450 757457 767555 780316 795414 810734 823428
59290 823428 831507 833957 830161 820360 806311 790396 774096 757960 742675 729207 718076 709376
59278 709376 703455 700777 701072 703323 706672 711001 716771 724703 735355 748494 763077 778118 793203
59265 793203 807875 821237 832784 842905 851811 858495 861604 860851 856773 849691 839957 828719 817250
59252 817250 805650 793257 780224 767754 756798 747423 739439 732801 727317 722685 718913 716227 714678
59239 714678 714342 715639 718875 723650 729288 735516 742164 748666 754564 760085 765396 769749 772262 773131 773111
59224 773111 772128 769431 764859 758932 751856 743471 734145 724809 716153 708513 702278 697541 693653 690083
59210 690083 687355 686140 685802 685190 684591 685391 687749 690094 691253 691666 692036 692117 691575 690975 690991 691341 691291 690738
59192F90738o50o60j020j605j922j595n80P44J803K259K111J425M74J7O45J825
59176F94009K475K517K822L542L809L446L588M953O725P905Q630R434J0269J1052
59162G75176J2050J3014J2930J1453R515P835N899L268N90j558l641n951p655
59149H32925q181q422r382j0574j1008j0833j0768j0723j0241r545r064q597p963
59136G07624p653p888p896p115o168n669n053l789k643k435k522j899r16n10m85
59121F44983K9J065K184L583N535P371Q325Q798R488J0028R896R858J0874J2165
59107G44182J2042J0331Q434P255O522N942N562N018L786K093O50l50j119j518
59093H08830j432j440k012k590k485k178k486l031k866k148j883k320k947l725
$$ plain form
59192 690738 690088 689428 688408 686803 684881 683286 682706 683450 685253 687512 689623 691048 691522 691539 692184 694009
59176 694009 696484 699001 701823 705365 709174 712620 716208 721161 727886 735791 744421 753855 764124 775176
59162 775176 787226 800240 813170 824623 834138 841973 847872 851140 851730 850172 846531 840580 832925
59149 832925 824744 816322 806940 796366 785358 774525 763757 753034 742793 733248 724184 715587 707624
59136 707624 699971 692083 684187 677072 670904 665235 660182 656393 653750 651315 648793 646894 645978 645468 644983
59121 644983 645012 646077 648261 651844 657379 664750 673075 681873 691361 701389 711285 721143 732017 744182
59107 744182 756224 766555 774989 782244 788766 794708 800270 805288 809074 811167 811817 811467 810348 808830
59093 808830 807398 805958 803946 801356 798871 796693 794207 791176 788310 786162 784279 781959 779012 775287
59079G75287m989o312o842o665o718p346q053q498q736q615p932p058o580o447
59065F74496o187n591m595l088j563j197k298l448l272k316j978k363k534k281
59051F31785k171k231j969j466j203j022l88O01J394J867K079J700O04n13j065
59036F28002j401j824j710p07J58m1m56K18J692K839L708M967O157O444O536P907
59020F62489J0275J1800J1719J1143J1128J1442J1325J0198P739M319J151r40
59008G63788k397l674m018k838j259o19l21J006K991M169M471N011N829O036N888
58993G84063O487P547P572O323N101M544L969L009K047R87o04k120k499k175k559
58978H21692l555l565k084l68P79J978L704N504P199R225J1381J2751J3229J3687
$$ plain form
59079 775287 770298 763986 757144 750479 743761 736415 728362 719864 711128 702513 694581 687523 680943 674496
59065 674496 668309 662718 658123 655035 653472 652275 649977 646529 643257 640941 638963 636600 634066 631785
59051 631785 629614 627383 625414 623948 622745 621723 621335 621936 623330 625197 627276 628976 629580 629067 628002
59036 628002 626601 624777 623067 622360 622518 622477 622021 622239 623931 626770 630478 635445 641602 648046 654582 662489
59020 662489 672764 684564 696283 707426 718554 729996 741321 751519 759258 763577 764728 763788
59008 763788 761391 757717 753699 750861 749602 748983 748662 749668 752659 756828 761299 766310 772139 778175 784063
58993 784063 790550 798097 805669 811992 817093 821637 825606 828615 830662 831649 831045 828925 826426 824251 821692
58978 821692 818137 814572 812488 812120 812899 814877 818581 824085 831284 840509 851890 864641 877870 891557
58964H91557J4483J5132J5522J5992J6220J5565J4339J3188J1445Q010L567q6
58952A034934k833o195j0397j3797j5616j6985j8692j9912j9894j9130j8177j6926
58940H56380j5501j4369j3159j1051q551p116o753n897m003k340j723j445r93
58927G63479r47j504j892j864k082k495k174j229j031j933k590k157j381r09m18
58912G38873N0k37r76p50O58J760J922K358L819N354O405Q073J1026J3953J5434
58897H07722J5812J6007J6050J5901J6270J7372J8201J8122J7984J8751K0302
58886I98494K2351K5035K7755K8974K8089K6210K4170K1327J7168J2568Q333L924
58874A244398j261o538j0931j4395j7220j9268k0515k1228k1185j9930j8137j7166
$$ plain form
58964 891557 906040 921172 936694 952686 968906 984471 998810 1011998 1023443 1031453 1035020 1034934
58952 1034934 1032101 1025906 1015509 1001712 986096 969111 950419 930507 910613 891483 873306 856380
58940 856380 840879 826510 813351 802300 793749 786633 779880 773983 769980 767640 765917 764472 763479
58927 763479 762532 761028 759136 757272 755190 752695 750521 749292 748261 746328 743738 741581 740200 739291 738873
58912 738873 738923 738686 737710 736960 737618 739378 741300 743658 747477 752831 759236 767309 778335 792288 807722
58897 807722 823534 839541 855591 871492 887762 905134 923335 941457 959441 978192 998494
58886 998494 1020845 1045880 1073635 1102609 1130698 1156908 1181078 1202405 1219573 1232141 1240474 1244398
58874 1244398 1243137 1236599 1225668 1211273 1194053 1174785 1154270 1133042 1111857 1091927 1073790 1056624
58862A056624j6937j5956j3889j2179j1637j1450j1258j1909j3268j3600j2395
58851I12146j1577j2449j3472j2782j1021r867r379q720q104q206q590q479q188
58838G81312q416q879q907q553q106p384o394n688n366m820m072l952m366l990
58824F92419k495j248r00k02J619L211L290K773L091L909M136L937M068M387M377
58809G26372M233M160L713K825K309K325J713q6j922k802l372m394n273n406n438
58794G18957n902o096n621n560o706p983p972o699m777k310J82J355R55N68J227
58779F63618J959J939K172L429M495M184L385L175K576K79k813m824n484n651
58765F72439n519n057m969n523n544m252k791k333k128j138o4J40K95J492K923
$$ plain form
58862 1056624 1039687 1023731 1009842 997663 986026 974576 963318 951409 938141 924541 912146
58851 912146 900569 888120 874648 861866 850845 840978 831599 822879 814775 806569 797979 789500 781312
58838 781312 772896 764017 755110 746557 738451 731067 724673 718985 713619 708799 704727 700775 696409 692419
58824 692419 689924 688676 687776 687574 689193 692404 695694 698467 701558 705467 709603 713540 717608 721995 726372
58809 726372 730605 734765 738478 741303 743612 745937 747650 747564 745642 742840 739468 735074 729801 724395 718957
58794 718957 713055 706959 701338 695778 689072 681089 673117 666418 661641 659331 659513 660868 661823 662391 663618
58779 663618 665577 667516 669688 673117 677612 681796 685181 688356 690932 691211 688398 683574 678090 672439
58765 672439 666920 661863 656894 651371 645827 641575 638784 636451 634323 633185 633121 633261 633556 635048 637971
58750F37971L225K830K949L352L135K633K658K891K818L152M549O072O715P192
58736F92142Q386R340Q847P699P380P619P361O920P060P099O120N002N033N536
58722G91544N051L907L463L693L774M140N648P462P981P398P165P564P739P509
58708H74038P198O260M076J514j86j529l969p531j0951j3628j5881j7815j9342
58695H02254k0658k1525k1071j9392j8014j7562j6570j4099j1587j0355r236o936
58683F15249m816m825o191o826o593o601o532n456m180m083m466l644j760j08
58669E49168J392L515N548O371O817Q447J0808J2301J2866J3270J2781J0223O599
58656F60106L963K387N20j638k994l606m233m489l772l099l546l933k743j143
$$ plain form
58750 637971 641196 644026 646975 650327 653462 656095 658753 661644 664462 667614 672163 678235 684950 692142
58736 692142 700528 709868 718715 726414 733794 741413 748774 755694 762754 769853 775973 780975 786008 791544
58722 791544 796595 800502 803965 807658 811432 815572 821220 828682 836663 844061 851226 858790 866529 874038
58708 874038 881236 887496 891572 893086 892900 891371 887402 879871 868920 855292 839411 821596 802254
58695 802254 781596 760071 739000 719608 701594 684032 667462 653363 641776 631421 622185 615249
58683 615249 610433 605608 599417 592591 585998 579397 572865 567409 563229 559146 554680 551036 549276 549168
58669 549168 550560 554075 559623 565994 572811 581258 592066 604367 617233 630503 643284 653507 660106
58656 660106 664069 666456 666976 665338 662344 658738 654505 650016 646244 643145 639599 635666 632923 631780
58642F31780j366l005l848l450l081k899k104j120p92j96J899M215M490L051J921
58627F25495J250l12k443l523l648m134m593l471j006J234L165N669Q074R122
58613F30879R657J1197J2658J1819R231P336O394M798K720J820J850J167J95P40
58599G12461K199K198P62J90Q34O64j036l033n024p650r732r148o380l754j478
58584F72073J944N786P642P722Q450R841R509P428O345O969P049N881N536O801
58570G68976P953Q517J0231J3301J5567J6464J8045K1009K3439K4569K6102K8526
58558I82699K9776K8885K7513K6520K4320K0006J5036J0556N977J275k209m244
58546A166110o124p965q403p592p516q818j0334j1942j4648j7694j9071j9141
$$ plain form
58642 631780 630414 627409 623561 620111 617030 614131 612027 610907 610115 609919 611818 616033 620523 623574 625495
58627 625495 626745 626433 623990 620467 616819 612685 608092 604621 603615 604849 608014 613683 621757 630879
58613 630879 640536 651733 664391 676210 685441 692777 699171 703969 706689 708509 710359 711526 711721 712461
58599 712461 714660 716858 717620 717810 718644 719308 718272 715239 710215 702565 692833 683685 677305 673551 672073
58584 672073 674017 679803 687445 695167 703617 713458 722967 730395 736740 743709 750758 756639 762175 768976
58570 768976 776929 785446 795677 808978 824545 841009 859054 880063 903502 928071 954173 982699
58558 982699 1012475 1041360 1068873 1095393 1119713 1139719 1154755 1165311 1171288 1172563 1170354 1166110
58546 1166110 1159986 1152021 1143618 1136026 1128510 1119692 1109358 1097416 1082768 1065074 1046003 1026862
58534A026862k0129k1893k2092k0723k0305k1044k0196j6924j3620j1500r151
58523H29285o344m934m916l783j033Q97J133J549K458J725o40j624m87j95k015
58508H11076l353k812k701m350n491m624l764m379m722l591k827l637m271l616
58494G56938l355m294m308k221n1P61J628L293L943L045L158N637Q268R374J0519
58479G92335J2898J4909J5611J6649J8535J8874J6673J4474J3746J2109P655K222
58467I56690k143o164j0307j2677j2444j1654j1352r717o219l453k463n88L498
58454H71007P063Q312R619J2714J5073J4372J2310J0787Q345L691j198m726q414
58441I58955j2871j5178j3650j1203j0510r848p127m017k508j250J078K589J988
$$ plain form
58534 1026862 1006733 984840 962748 942025 921720 900676 880480 863556 849936 838436 829285
58523 829285 822941 818007 813091 809308 808275 809172 810305 811854 814312 816037 815397 813773 813286 813091 811076
58508 811076 807723 804911 802210 797860 792369 787745 783981 779602 774880 771289 768462 764825 760554 756938
58494 756938 753583 749289 744981 742760 742709 743470 745098 748391 752334 755379 758537 764174 772442 781816 792335
58479 792335 805233 820142 835753 852402 870937 889811 906484 920958 934704 946813 954468 956690
58467 956690 954547 948383 938076 925399 912955 901301 889949 880232 874013 870560 868097 867509 871007
58454 871007 878070 886382 896001 908715 923788 938160 950470 961257 969602 973293 972095 967369 958955
58441 958955 946084 930906 917256 906053 895543 885695 878568 874551 872043 870793 871871 874460 876448
58428H76448J742L855O236O729P026R017J1048J1341J1412J2572J2697J0046O566
58415I86735M134J344k718n554n590n330o809q122p850q418j1320j3524j2531
58402I04447j0563r932q758n396k456k150k104r0J649J059N46K196L428K056R71
58387H74903K961N474N461M846O217P587O571N224N697N513K437n07j22J315P59
58372I34336K48K615N803O933P656J0124J2054J1191J0117J1312J2175J0437R406
58359A044407J2094J5225J5065J4127J5860J7795J6425J3815J2886J1237O329
58348A195265J625P25N67k487n173l256L79J182J331M745Q847R457R071J2034
58334A234312J6072J6838J6324J8479K1037K0040J7888J8587J9586J6878J3357
$$ plain form
58428 876448 878190 882045 888281 895010 902036 911053 922101 933442 944854 957426 970123 980169 986735
58415 986735 990869 992213 989495 983941 978351 973021 966212 958090 950240 941822 930502 916978 904447
58402 904447 893884 883952 875194 869798 867342 865192 863088 862998 864647 865706 866252 868448 871876 873932 874903
58387 874903 877864 883338 888799 893645 899862 907449 914020 919244 924941 930454 932891 932384 932262 933577 934336
58372 934336 934584 937199 943002 949935 957591 967715 979769 990960 1001077 1012389 1024564 1035001 1044407
58359 1044407 1056501 1071726 1086791 1100918 1116778 1134573 1150998 1164813 1177699 1188936 1195265
58348 1195265 1196890 1197615 1198182 1195695 1190522 1187266 1187645 1188827 1190158 1194903 1203750 1213207 1222278 1234312
58334 1234312 1250384 1267222 1283546 1302025 1323062 1343102 1360990 1379577 1399163 1416041 1429398
58323A429398J3421J4197J1102P221P719R772P753L808L458N116L961J951L852
58310A522729P414P559O300Q581J2368J2938J2630J6124K0453K0093J7531J8235
58298A682955J9862J7348J3845J5294J8956J8807J7479K0892K5995K6238K4388
58287A902059K7203L2072L1937K8924K9738L2139K9635K5161K6065K9920K9478
58276B224331K7310L0826L7106L7815L5103L7268M2705M3782M2655M7080N4318
58265B660299N5598N2928N4995O0171O0502N8666O3417P1970P4607P2985P5831
58254C361969Q0604P8308P2403P3436P8873P8327P4547P8346Q6871Q8702Q6500
58243D238886R2174J03439J08467J09811J19557J34532J41551J43577J54503J71414
$$ plain form
58323 1429398 1442819 1457016 1468118 1475339 1483058 1492830 1500583 1504391 1507849 1512965 1516926 1518877 1522729
58310 1522729 1530143 1537702 1544002 1552583 1564951 1577889 1590519 1606643 1627096 1647189 1664720 1682955
58298 1682955 1702817 1720165 1734010 1749304 1768260 1787067 1804546 1825438 1851433 1877671 1902059
58287 1902059 1929262 1961334 1993271 2022195 2051933 2084072 2113707 2138868 2164933 2194853 2224331
58276 2224331 2251641 2282467 2319573 2357388 2392491 2429759 2472464 2516246 2558901 2605981 2660299
58265 2660299 2715897 2768825 2823820 2883991 2944493 3003159 3066576 3138546 3213153 3286138 3361969
58254 3361969 3442573 3520881 3593284 3666720 3745593 3823920 3898467 3976813 4063684 4152386 4238886
58243 4238886 4331060 4434499 4542966 4652777 4772334 4906866 5048417 5191994 5346497 5517911
58233E517911J79480J81160J92180K11326K23640K30898K48322K73409K89835
58224G548161L00228L22246L54313L79390M00324M35466M81712N19931N54608
58215A1296379O07763O76168P37547P96889Q80808R88265J096084J211285J365294
58206A9656482J558491J768126K009600K327637K728334L187741L724566M387093
58198D1348070N171414O043639P046630Q288770R829575J1694085J3999370J6921688
58190A20343241K0532544K4830982K9870015L5422751M0270903M2178609L9141818
58183C52590863L0854573J8882050N562674p020502j7306869k4329696k8017158
58176C31215935k9210963k9016333k8096114k6639267k4769755k2700789k0568784
$$ plain form
58233 5517911 5697391 5878551 6070731 6282057 6505697 6736595 6984917 7258326 7548161
58224 7548161 7848389 8170635 8524948 8904338 9304662 9740128 10221840 10741771 11296379
58215 11296379 11904142 12580310 13317857 14114746 14995554 15983819 17079903 18291188 19656482
58206 19656482 21214973 22983099 24992699 27320336 30048670 33236411 36960977 41348070
58198 41348070 46519484 52563123 59609753 67898523 77728098 89422183 103421553 120343241
58190 120343241 140875785 165706767 195576782 230999533 271270436 313449045 352590863
58183 352590863 383445436 402327486 407890160 400869658 383562789 359233093 331215935
58176 331215935 302004972 272988639 244892525 218253258 193483503 170782714 150213930
58169A50213930j8390076j6220834j4196235j2387453j0754414r266352p959161
58162F1039405o851131n900827n076996m390369l832708l354844k927863k566105
58154B6138562k272263k015652j780498j583559j428463j289850j156277j044519
58146A3567481r58865q77910p93168p21301o67120o12078n49882m97597m61081
58137G428479m23671l79007l42431l19936k97118k68561k48080k40104k29779
58128D679792k11023j96838j92508j85052j68632j54935j49237j40728j25585
58119C155254j15710j15501j12759j01693r2877r1621q7910p6772o8058o7084
58109B225269o5185n7977n3927n6460n6140m8915m4086m6154m6347m0132l5804
$$ plain form
58169 150213930 131823854 115603020 101406785 89019332 78264918 68998566 61039405
58162 61039405 54188274 48287447 43210451 38820082 34987374 31632530 28704667 26138562
58154 26138562 23866299 21850647 20070149 18486590 17058127 15768277 14612000 13567481
58146 13567481 12608616 11730706 10937538 10216237 9549117 8937039 8387157 7889560 7428479
58137 7428479 7004808 6625801 6283370 5963434 5666316 5397755 5149675 4909571 4679792
58128 4679792 4468769 4271931 4079423 3894371 3725739 3570804 3421567 3280839 3155254
58119 3155254 3039544 2924043 2811284 2709591 2616714 2525093 2437183 2360411 2292353 2225269
58109 2225269 2160084 2102107 2048180 1991720 1935580 1886665 1842579 1796425 1750078 1709946 1674142
58098A674142l7777l8181l2986l0035l3164l4367k9663k7056l0849l3290k9718
58087A317056k7141k9825l0898k6234k2595k4116k4364j9612j6595j9266k0905
58076A055505j7248j4721j7824k0719j9039j8010k1145k2649j8714j5080j5882
58065H54474j6074j2118r177j0513j0716o607m089o991r786q485q148j2245j5125
58052G24400j2623r873j1075j1464p163l247m113n268k517k28k583n362m299l183
58038F41402n810q144o212l872n122o333l742j128k501m390k908j449m012p581
58024E78198q323q702j1482j3266j1031q567r484j0169o668k308j567k307r97
58011D83327K52j396l265k435j686l844n757m211k164k870l394m14L170L736L524
$$ plain form
58098 1674142 1636365 1598184 1565198 1535163 1501999 1467632 1437969 1410913 1380064 1346774 1317056
58087 1317056 1289915 1260090 1229192 1202958 1180363 1156247 1131883 1112271 1095676 1076410 1055505
58076 1055505 1038257 1023536 1005712 984993 965954 947944 926799 904150 885436 870356 854474
58065 854474 838400 826282 817105 806592 795876 789269 785180 778189 768403 759918 751770 739525 724400
58052 724400 711777 701904 690829 679365 672202 668955 664842 659574 657057 656829 654246 648884 644585 641402
58038 641402 635592 627448 621236 617364 612242 605909 602167 601039 598538 594148 591240 589791 585779 578198
58024 578198 569875 561173 549691 536425 525394 516827 507343 497174 490506 488198 486631 484324 483327
58011 483327 483579 482183 478918 476483 474797 470953 465196 460985 458821 455951 452557 452143 455313 459049 462573
57996D62573N372O387L424m05j189j062l211n225l900j711j960k297L91L276K378
57981D62841l76j246j490l800o209n810m554n165n512k960j97n84j885p58O88
57966D22983r42l564l423j922k363l486k373m41m23p98Q60K405R55j208n29J338
57950D07069R11n77o1J127Q1j575n00K110K978K837M342O473O698O228P682R914
57934D55737J0523J0767J2750J4490J3232J0854J0551J0926Q926N849M675M125
57922E73405J173k974n164o182q629j1202j0937r011q671r359q436o691o583p018
57908D73721n493l433l823n468n200l889m512o120n513l389l039m250m155k844
57894D12593k658l074j667Q23J667J196J731K740K163J145K283M458M619L408
$$ plain form
57996 462573 467945 474332 477756 477351 476162 475100 471889 466664 462764 461053 459093 456796 457187 460463 462841
57981 462841 462465 461219 459729 455929 449720 443910 439356 434191 428679 425719 425522 424938 423053 422295 422983
57966 422983 422041 418477 415054 413132 410769 407283 404910 404469 404046 403248 404108 406513 407468 406260 405731 407069
57950 407069 407980 407403 407342 408469 408550 406975 406475 408585 411563 414400 418742 425215 431913 438141 445823 455737
57934 455737 466260 477027 489777 504267 517499 528353 538904 549830 558756 564605 569280 573405
57922 573405 574578 571604 566440 560258 551629 540427 529490 520479 511808 502449 494013 487322 480739 473721
57908 473721 468228 464795 460972 455504 450304 446415 441903 435783 430270 426881 423842 419592 415437 412593
57894 412593 409935 406861 405194 406017 407684 408880 410611 413351 415514 416659 418942 423400 428019 431427
57880D31427L773N252M951L099K290K248O30j865k560k066l235n527n741l786
57866D28890k673l153l345l065l807m861m232k727k602l056j769K23J62r84pK595
57850C95589L538K888L602N421N082K519J223K038K048J43j456j844k641l902
57836D14248l600j941j598k924l382k292j767k279j685N36K184K282K234K522
57822D02538K043J194J824L618M248L421L133L745L605K683K758L760L690K325
57808D44585J379R39m54k320k677j867j996k842k317q11p51j955j845k87J87q60
57792D26108j222n30q16k249k726k137k652m259m454k897k054k602k669k099k839
57777C89903m361l447L84L795N049O001P578P924O559N866O692O625M365J907
$$ plain form
57880 431427 435200 440452 445403 448502 450792 453040 453670 451805 449245 447179 443944 438417 432676 428890
57866 428890 426217 423064 419719 416654 412847 407986 403754 401027 398425 395369 393600 393823 393985 393001 392994 395589
57850 395589 399127 402015 405617 411038 416120 418639 419862 421900 423948 424091 422635 420791 418150 414248
57836 414248 410648 408707 407109 404185 400803 398511 396744 394465 392780 393316 395500 397782 400016 402538
57822 402538 404581 405775 407599 411217 415465 418886 422019 425764 429369 432052 434810 438570 442260 444585
57808 444585 445964 446903 446449 444129 441452 439585 437589 434747 432430 431619 430868 428913 427068 426781 426968 426108
57792 426108 424886 424356 423540 421291 418565 416428 413776 409517 405063 402166 400112 397510 394841 392742 389903
57777 389903 385542 382095 382479 386274 391323 397324 404902 412826 419385 425251 431943 438568 442933 444840
57763D44840O88n60k469l389k747k433l185l189j806j020j602j526J22J337J009
57748D24070R20K078K567J131m56o26n66j562k683k964l161l634l238j863j299
57733D08714k138k598j783j109j205n24J449K726K260J795K588L235K522J594
57719D17526J537J484P98N15R68O30j055k294j939j303j570j966j913k330l309
57704D05779l213j583l75q07j549j384j013q81n4J390J682N46J92J550K503J513
57688D04296J30M1M05R2q6O77J420J535K265M330O404P568R021J1673J4544J7106
57672D81421K0688K5937L1432L6718M4096N5246O7898P7511Q0362P3952N7357
57661A052618L3223P309j5796l4896m9487n7953n9954n7884n4035m8610m1944
$$ plain form
57763 444840 445528 444968 442499 439110 436363 433930 430745 427556 425750 424730 423128 421602 421724 423061 424070
57748 424070 424990 427068 429635 430766 430310 429684 429118 427556 424873 421909 418748 415114 411876 410013 408714
57733 408714 406576 403978 402195 401086 399881 399357 400806 403532 405792 407587 410175 413410 415932 417526
57719 417526 419063 420547 421345 421860 422828 423458 422403 420109 418170 416867 415297 413331 411418 409088 405779
57704 405779 402566 400983 400608 399801 398252 396868 395855 394974 394920 396310 397992 398538 398730 400280 402783 404296
57688 404296 404426 404467 404872 404964 404878 405555 406975 408510 410775 415105 421509 429077 438098 449771 464315 481421
57672 481421 502109 528046 559478 596196 640292 695538 763436 840947 921309 995261 1052618
57661 1052618 1085841 1093150 1077354 1042458 992971 935018 875064 817180 763145 714535 672591
57650F72591l5903l1295k6585k0977j6219j3528j1495q931p067o834o616m968
57638D82173l099k405j937n78O19N57L55J198K031J616Q74R98J276Q62O80J524
57622D86744K221J689P83L03o29k384l320k506j597j908k002m27J468J830J242
57607D81507J128J263J162J688L018L282J574N0N71J635J211K87O68J431P17p58
57591E00434j112o02n76o38K31J085M70p76r13k75k63n13K12J402J645J133R31
57574E01875P96j5p59l70M66N13K45P47J570J673J431J678K023J961K303L535
57558E19672M313L593K645K851L272K685K183L195M589M557L830M140M856M056
57544E70437J941L38l95j191j905j616o36J11R97K720M373M594L781L092K364
$$ plain form
57650 672591 636688 605393 578808 557831 541612 528084 516589 507658 500591 493757 487141 482173
57638 482173 479074 476669 474732 474154 474773 475330 475685 476883 478914 480530 481404 482402 483678 484540 485220 486744
57622 486744 488965 490654 491437 491740 491111 488727 485407 482901 481304 479396 477394 476967 478435 480265 481507
57607 481507 482635 483898 485060 486748 489766 493048 494622 494672 495243 496878 498089 498376 499044 500475 501192 500434
57591 500434 499322 498720 498144 497506 497737 498822 499292 498516 497603 497328 497065 496552 496764 498166 499811 500944 501875
57574 501875 502671 502656 501897 501527 501993 502506 502751 503498 505068 506741 508172 509850 511873 513834 516137 519672
57558 519672 523985 527578 530223 533074 536346 539031 541214 544409 548998 553555 557385 561525 566381 570437
57544 570437 572378 572716 572321 571130 569225 567609 566973 567084 568081 570801 575174 579768 583549 586641 589005
57529E89005J169O13J780L451L818L286L339L818L735L587M302N036M555L802
57515F35296M450N973O653O566O971P625P341O307N491M594L011J808K195L104
57501G07385K826J986K242L116K991K273K555L456L290K263K033K583K458J744
57487G43201J887K833L159K875L356M581N063M554M358M899N277N237N446N876
57473H02602N833N463N432N502N165N025N729O347N751M721M602M957M688M381
57459H76198N121O123O025N544O155P156O842N647N288N665N485N136N936P274
57445I59595P543P194P770Q701Q248P021P148Q337Q275O741N911O550P186P118
57431A063338P101O971N767M332M652O404P291O882P010Q114Q528P768P397Q010
$$ plain form
57529 589005 590174 590787 592567 596018 599836 603122 606461 610279 614014 617601 621903 626939 631494 635296
57515 635296 639746 645719 652372 658938 665909 673534 680875 687182 692673 697267 700278 702086 704281 707385
57501 707385 710211 712197 714439 717555 720546 722819 725374 728830 732120 734383 736416 738999 741457 743201
57487 743201 745088 747921 751080 753955 757311 761892 766955 771509 775867 780766 786043 791280 796726 802602
57473 802602 808435 813898 819330 824832 829997 835022 840751 847098 852849 857570 862172 867129 871817 876198
57459 876198 881319 887442 893467 899011 905166 912322 919164 924811 930099 935764 941249 946385 952321 959595
57445 959595 967138 974332 982102 990803 999051 1006072 1013220 1021557 1029832 1036573 1042484 1049034 1056220 1063338
57431 1063338 1070439 1077410 1083177 1087509 1092161 1098565 1105856 1112738 1119748 1127862 1136390 1144158 1151555 1159565
57417A159565Q388Q156Q346Q919Q648P902Q487J0184J0553Q916P472P682Q443
57404A271661Q717R139R979J0296J0048J0482J1527J1438R933R079R977J1082
57392A393358J0910J0158R978J0267J0588J0951J1031J0529J0575J2560J5406
57381A516311J6466J5437J4661J5129J5140J3632J1907J1031J0300R386R443J0804
57369A669647J1944J1846J1285J0822R938Q937R297J1057J2262J2043J1912J2932
57357A803922J3952J3870J3433J3552J3904J4208J4905J5745J5684J5018J5357
57346A963550J6846J7653J7022J6323J6350J6127J5361J5333J6233J6281J4789
57335B141868J3556J3872J4628J4755J4983J5764J5952J5167J5022J6261J7081
$$ plain form
57417 1159565 1167953 1176109 1184455 1193374 1202022 1209924 1218411 1228595 1239148 1248064 1255536 1263218 1271661
57404 1271661 1280378 1289517 1299496 1309792 1319840 1330322 1341849 1353287 1363220 1372299 1382276 1393358
57392 1393358 1404268 1414426 1424404 1434671 1445259 1456210 1467241 1477770 1488345 1500905 1516311
57381 1516311 1532777 1548214 1562875 1578004 1593144 1606776 1618683 1629714 1640014 1649400 1658843 1669647
57369 1669647 1681591 1693437 1704722 1715544 1725482 1734419 1743716 1754773 1767035 1779078 1790990 1803922
57357 1803922 1817874 1831744 1845177 1858729 1872633 1886841 1901746 1917491 1933175 1948193 1963550
57346 1963550 1980396 1998049 2015071 2031394 2047744 2063871 2079232 2094565 2110798 2127079 2141868
57335 2141868 2155424 2169296 2183924 2198679 2213662 2229426 2245378 2260545 2275567 2291828 2308909
57324B308909J6085J4673J4639J5499J6021J6436J7222J7524J6714J5900J6181
57313B485803J6871J7027J7112J7731J8275J8214J8151J8323J7807J6487J5877
57302B677678J6708J7533J7194J6680J7060J7578J7386J7308J8081J8662J8034
57291B869902J7041J6755J6632J5979J5580J6170J6855J6746J6637J7418J8339
57280C054054J8483J8498J9192J9913J9905J9881K0633K1514K1785K2053K2835
57269C278746K3252K2670K2074K2284K2392K1538K0593K0363J9825J7996J6012
57258C507745J5340J5426J5033J4569J5006J5722J5557J4977J5103J5566J5232
57247C675276J4348J4050J4387J4469J4015J3300J2228J0805R788R647R732R545
$$ plain form
57324 2308909 2324994 2339667 2354306 2369805 2385826 2402262 2419484 2437008 2453722 2469622 2485803
57313 2485803 2502674 2519701 2536813 2554544 2572819 2591033 2609184 2627507 2645314 2661801 2677678
57302 2677678 2694386 2711919 2729113 2745793 2762853 2780431 2797817 2815125 2833206 2851868 2869902
57291 2869902 2886943 2903698 2920330 2936309 2951889 2968059 2984914 3001660 3018297 3035715 3054054
57280 3054054 3072537 3091035 3110227 3130140 3150045 3169926 3190559 3212073 3233858 3255911 3278746
57269 3278746 3301998 3324668 3346742 3369026 3391418 3412956 3433549 3453912 3473737 3491733 3507745
57258 3507745 3523085 3538511 3553544 3568113 3583119 3598841 3614398 3629375 3644478 3660044 3675276
57247 3675276 3689624 3703674 3718061 3732530 3746545 3759845 3772073 3782878 3792666 3802313 3812045 3821590
57235C821590R840J1203J2671J3002J2408J1797J1371J1107J1455J2340J2652
57224C951436J1869J1022J0904J0729R718Q611Q239Q035P368O923P297P509O454
57211D066114M679L299K336J380O42J22r22k416k980k188j723k778m145m361l986
57196D053073m067m134l672l790n190o138m797k336j297j987k725k765k646k431
57182D005098j775j310j973l374m436n056n687o083o007o302p700r380j0273j0855
57168C924887j2175j3996j5464j6642j7934j8992j9637k0797k2931k4728k4978
57157C716613k4590k5020k5781k5404k3865k2291k1089k0047j9463j9571j9599
57146C469893j8844j7834j7151j6266j4829j3805j3896j4150j3653j3234j3860
$$ plain form
57235 3821590 3831430 3842633 3855304 3868306 3880714 3892511 3903882 3914989 3926444 3938784 3951436
57224 3951436 3963305 3974327 3985231 3995960 4005678 4014289 4022528 4030563 4037931 4044854 4052151 4059660 4066114
57211 4066114 4070793 4074092 4076428 4077808 4078450 4078572 4077650 4075234 4072254 4070066 4068343 4065565 4061420 4057059 4053073
57196 4053073 4049006 4044872 4041200 4037410 4032220 4026082 4021285 4018949 4017652 4015665 4012940 4010175 4007529 4005098
57182 4005098 4003323 4002013 4000040 3996666 3992230 3987174 3981487 3975404 3969397 3963095 3955395 3946015 3935742 3924887
57168 3924887 3912712 3898716 3883252 3866610 3848676 3829684 3810047 3789250 3766319 3741591 3716613
57157 3716613 3692023 3667003 3641222 3615818 3591953 3569662 3548573 3528526 3509063 3489492 3469893
57146 3469893 3451049 3433215 3416064 3399798 3384969 3371164 3357268 3343118 3329465 3316231 3302371
57135C302371j4782j4985j5069j5919j6894j7130j7281j8054j8509j7749j6850
57124C119149j7020j7216j5682j2662r386n592l22N871J1680J7159K3104K9264
57112C128347L5006M0871M7767N5744O5029P7020R2662J11384J33302J60814J96263
57101D144209K39848K91826L54816M31801N23477O29736P52018Q92284J051537
57092I311552J231213J433361J656638J893682K134230K368369K584936K769689
57084B5383670K906880K979256K965874K847289K617635K284577J850644J303335
57076D5139160O38647j04442q44102j495649k009504k375421k604785k716343
57068C3627561k730636k666850k542373k375946k187858j994227j803295j618944
$$ plain form
57135 3302371 3287589 3272604 3257535 3241616 3224722 3207592 3190311 3172257 3153748 3135999 3119149
57124 3119149 3102129 3084913 3069231 3056569 3047183 3041591 3041269 3047140 3058820 3075979 3099083 3128347
57112 3128347 3163353 3204224 3251991 3307735 3372764 3449784 3542446 3653830 3787132 3947946 4144209
57101 4144209 4384057 4675883 5030699 5462500 5985977 6615713 7367731 8260015 9311552
57092 9311552 10542765 11976126 13632764 15526446 17660676 20029045 22613981 25383670
57084 25383670 28290550 31269806 34235680 37082969 39700604 41985181 43835825 45139160
57076 45139160 45777807 45673365 44829263 43333614 41324110 38948689 36343904 33627561
57068 33627561 30896925 28230075 25687702 23311756 21123898 19129671 17326376 15707432
57060A5707432j445031j284633j138449j006643q90272p89256p01256o24198n57867
57051G269827n01820m54091m13205l79141l50987l26081l02675k81325k62466
57042C998036k44889k27769k11902j97784j84525j71649j59957j49615j39480
57033B310466j29095j19260j09986j00070q9267p8611o8056n6211m2813k8760
57023A488337j3489M286K2167L3661L3753K2621L206k1475m7178o8236q1382q7919
57011A288352r0501q9729q5435p8857p1491o3530n5163m7650m1629l6001k9838
57000E98528k3848j8814j4394j0504q000o847n523l382j696j269j051k41L20J19
56986E03398L19J858L972N775P344Q160O620K385k650o918j0783j4551j7098j7847
$$ plain form
57060 15707432 14262401 12977768 11839319 10832676 9942404 9153148 8451892 7827694 7269827
57051 7269827 6768007 6313916 5900711 5521570 5170583 4844502 4541827 4260502 3998036
57042 3998036 3753147 3525378 3313476 3115692 2931167 2759518 2599561 2449946 2310466
57033 2310466 2181371 2062111 1952125 1852055 1762788 1684177 1616121 1559910 1517097 1488337
57023 1488337 1474848 1479134 1501301 1534962 1568715 1591336 1594542 1573067 1525889 1457653 1376271 1288352
57011 1288352 1197851 1108122 1022687 943830 872339 808809 753646 705996 664367 628366 598528
57000 598528 574680 555866 541472 530968 522968 516121 510598 507216 505520 504251 503200 502959 503279 503398
56986 503398 503717 505575 509547 515322 522666 530826 537446 539831 537181 530263 519480 504929 487831 469984
56972D69984j7975j8228j7550j5332j2979j1709j0624q528n873l478r93K029N160
56959C53904Q381J2482J7002J9671J9122J6282J2105O204r71p049j0596j2953
56947D33584j5515j7334j7175j5859j4537j2589r329o058m236l088r64K214N675
56934C24789R623J4535J9826K4660K8751L1053K9363K2908J3892M897l686j2188
56922E08423j9460k4071k6294k7080k6359k4028k1240j9000j6744j3856j1273
56911B79018r979r304q348p625p747p917p331o656o487n812l803j584m88R1J320
56896A97348K837L873N099P407J0108J2150J3984J6474J9180K1469K3975K7036
56884C60940K8874K7325K2448J5792Q233L25o437j0721j2972j4253j4454j3092
$$ plain form
56972 469984 452009 433781 416231 400899 387920 376211 365587 357059 351186 347708 346715 348744 353904
56959 353904 362285 374767 391769 411440 430562 446844 458949 465153 464182 457133 446537 433584
56947 433584 418069 400735 383560 367701 353164 340575 331246 325188 320952 317864 316900 319114 324789
56934 324789 334412 348947 368773 393433 422184 453237 482600 505508 519400 524297 520611 508423
56922 508423 488963 464892 438598 411518 385159 361131 339891 320891 304147 290291 279018
56911 279018 269039 259735 251387 243762 236015 228098 220767 214111 207624 201812 198009 196425 195937 196028 197348
56896 197348 200185 204058 209157 216564 226672 238822 252806 269280 288460 309929 333904 360940
56884 360940 389814 417139 439587 455379 463612 463937 457500 446779 433807 419554 405100 392008
56872C92008j0870q735o389l310n7K914O530J1512J6795K1256K5901L2482M0810
56859E20847M8823N4269N4905M8658L5662J9175K910j1559k3577l1582l4655l4420
56847F49456l3098l0625k5738j8837j1672n018J461P884J4507K2432L2292M3240
56835F46284N4717O7622Q1483R1808R2820Q2348O2323L5890O490k1269m3020n7379
56823A100117o5633o9067o8214o4024n7751m9796m0289l0416k1624j3832n789
56812F13682L115J2574K2414L2754M3573N4486O3897O7968O2431M6804K5373L031
56800A052102j7932l6092m9008n5486n7595n7872n6110n1250m4510l8047l2050
56789E56150k5803k0111j5833j1493n177K307Q970J5054K1862K8164L0907K8884
$$ plain form
56872 392008 381138 372403 366014 362704 362647 365561 372091 383603 400398 421654 447555 480037 520847
56859 520847 569670 623939 678844 727502 763164 782339 785249 773690 750113 718531 683876 649456
56847 649456 616358 585733 559995 541158 529486 524468 525929 533813 548320 570752 603044 646284
56835 646284 701001 768623 850106 941914 1034734 1117082 1179405 1215295 1221785 1200516 1157496 1100117
56823 1100117 1034484 965417 897203 833179 775428 725632 685343 654927 633303 619471 613682
56812 613682 616797 629371 651785 684539 728112 782598 846495 914463 976894 1023698 1049071 1052102
56800 1052102 1034170 998078 949070 893584 835989 778117 722007 670757 626247 588200 556150
56789 556150 530347 510236 494403 482910 477733 480040 489010 504064 525926 554090 584997 613881
56777F13881K3025J3833J558j1617k2493k9897l4619l6971l6858l5495l4267l2473
56765C77607k8737k4074k0841j9204j7341j4675j2215j0180q014o389o379p036
56753B02522o456m969m453m902m567l292k691k960k525j122m05j040j749j700
56739A59691j467j296o91n5n33j958k883k780k288j474j3J152O39r26j504o20
56723A42994M62J167J921K308J510M60R99K757L466K435J261R19O55J07M5O14
56707A64080R50Q77J014J128M29n63n74J11R0n87o10%m3o84n03P12J689K024K414
56688A71954K664J896O85N09J152J189Q06J408K573K373P91j09K88M30k39l96
56672A87974M23R52O86O65J164J182O67P40J357J222L52J07N09K46m63M0J602
$$ plain form
56777 613881 636906 650739 652297 640680 618187 588290 553671 516700 479842 444347 410080 377607
56765 377607 348870 324796 303955 284751 267410 252735 240520 230340 222326 215937 209558 202522
56753 202522 196066 191097 186644 181742 177175 173883 171192 168232 165707 164585 164180 163140 161391 159691
56739 159691 158224 156928 156237 156182 155649 153691 150808 148028 145740 144266 144253 145405 146044 145118 143614 142994
56723 142994 143456 144623 146544 148852 150362 150822 151821 154578 158044 160479 161740 162659 163314 163421 163466 164080
56707 164080 165030 165907 166921 168049 168478 167915 167341 167452 167542 166955 166345 166345 166302 165618 165115 165827 167516 169540 171954
56688 171954 174618 176514 177199 177708 178860 180049 180855 182263 184836 187209 188000 187891 188179 188609 188370 187974
56672 187974 188397 189349 190035 190700 191864 193046 193713 194453 195810 197032 197384 197491 198000 198246 197783 197823 199425
56655A99425K127J165O01J210J597J155J057J525J192o4o24k50o62k087k461j073
56639B03833J11n1j20R39J966K170K624L865M707M718N139O134N959M159K678
56624B48831K380J495r79l262l903m196n557p130p807q215q885q837p656o729
56610A79550o766o504n417n108o327p136o032m444m137m382l774k692j925r02
56596A14004P53J772J365Q90J665K865L274L312L643L644K983K766L496L773K680
56581A52885J561J730K361K325K201K699K959K220J514J950K863L257L455L915
56567A87895M116L938M336N442N932N554O083Q474J1220J2976J4391J5851J5884
56554C02092J3647J0720Q582O575M123K605K909L417K551J220O71J13j333k490
$$ plain form
56655 199425 201552 202717 203318 204528 206125 207280 208337 209862 211054 210990 210366 210116 209454 207367 204906 203833
56639 203833 203944 203893 203773 204712 206678 208848 211472 215337 220044 224762 229901 236035 241994 246153 248831
56624 248831 251211 252706 251727 248465 244562 240366 234809 227679 219872 211657 202772 193935 186279 179550
56610 179550 172784 166280 160863 155755 149428 142292 136260 131816 127679 123297 119523 116831 114906 114004
56596 114004 114757 116529 117894 118784 120449 123314 126588 129900 133543 137187 140170 142936 146432 150205 152885
56581 152885 154446 156176 158537 160862 163063 165762 168721 170941 172455 174405 177268 180525 183980 187895
56567 187895 192011 195949 200285 205727 211659 217213 223296 231770 242990 255966 270357 286208 302092
56554 302092 315739 326459 335041 341616 345739 348344 351253 354670 357221 358441 359112 359225 357892 355402
56540C55402k231j818k718l934l816k918k795l540m471n723p234p819p120o675
56526B92590p341p582o233m737m574m629l467k162k337l215l179k603k659k850
56512B35022k187j418j718k440k275j376m85N56J609J308p14k463k371j566j484
56497B17998j307j7J092N08q02j122p60p22n27L17N75n67j499p85K12j32o52L20
56479B12130J657J434M26N05J166Q02l9K15J022Q21J72P84K321L005K556J984
56463B30961J407M64j33K45N22k69r92m58J84m78j296n53Q16P94k99o89k07J58
56445B30177M19Q77P52j08N1J956L138J576o80o90O83P41l03l81K48j43r56k58
56427B37099J363J694Q51P49J398J248M78N01Q40k9j398j227J89P82L37L61R06
$$ plain form
56540 355402 353171 351353 348635 344701 340885 337967 335172 331632 327161 321438 314204 306385 299265 292590
56526 292590 285249 277667 271434 266697 262123 257494 254027 251865 249528 246313 243134 240531 237872 235022
56512 235022 232835 231417 229699 227259 224984 223608 223123 223679 225288 226596 225882 223419 221048 219482 217998
56497 217998 216691 216674 217766 218274 217472 216350 215590 214868 214341 214658 215233 214666 213167 212382 212594 212462 211810 212130
56479 212130 213787 215221 215647 216152 217318 218120 218081 218296 219318 220139 220311 221095 223416 226421 228977 230961
56463 230961 232368 232832 232699 232944 233466 233197 232205 231747 231931 231453 230157 229604 230420 231214 230915 230226 230019 230177
56445 230177 230596 231473 232225 232117 232168 234124 237262 238838 238158 237468 238151 238892 238589 238208 238456 238313 237357 237099
56427 237099 238462 240156 241007 241756 243154 244402 244880 245381 246221 246192 244794 243567 243756 244538 244875 245236 246142
56410B46142O89j36l64k30o58q65K92J643J437O25J111J967R60j160j661l58N94
56393B50028P64J538K657K372Q39j03k28p80j522j251o66j325k362j641M26J640
56377B50386J917K805L903L493K215K285L463L461J975P41L5j158k010p31J778
56362B74558K904K554K719L495L405L109M540O727O655M105J537m73l341o307
56348C06187o772m974l922m321l894k061r71j379j611j167j350j925j082Q34J571
56333B73163J196K037M179N218M818N103O205N882M136L697N049N429L757K275
56319C32144K208K021J040P90J558J535M22Q4Q19Q24N6N79K305K630J135M80J641
56302C52271K517K224K537L909M314L253K906M048M839M643N074O239O035M283
$$ plain form
56410 246142 246831 246695 246331 246101 245443 244578 244870 246513 247950 248575 249686 251653 252613 251453 249792 249434 250028
56393 250028 250792 252330 254987 257359 258198 258095 257867 257087 255565 254314 253648 252323 249961 248320 248746 250386
56377 250386 252303 255108 259011 262504 264719 267004 270467 273928 275903 276644 276679 275521 273511 272780 274558
56362 274558 277462 280016 282735 286230 289635 292744 297284 304011 310666 314771 316308 315835 312494 306187
56348 306187 299415 294441 290519 286198 282304 280243 279272 277893 276282 275115 273765 271840 270758 271592 273163
56333 273163 274359 276396 280575 285793 290611 295714 301919 307801 311937 315634 320683 326112 329869 332144
56319 332144 334352 336373 337413 338203 339761 341296 341718 341802 342621 343445 343501 344080 346385 349015 350150 350630 352271
56302 352271 354788 357012 359549 363458 367772 371025 373931 377979 382818 387461 392535 398774 404809 409092
56288D09092L371L912L922L110L599N481O236N619O325Q739R845Q751Q311R763
56274D96076J0645R819R611J1104J2137J1972J3073J6121J8046J7443J7237J9576
56262F62860K2516K4255K6250K9613L2708L4843L8290M4130N0168N5210O1377
56251A082220O9921P8893Q7161R6569J07859J18694J27911J37446J47762J55844
56241B210280J60078J62677J64778J63587J57006J46659J33838J16880R5199P1514
56231C582496M7403K1156p368l4362n7361p8294r8409j14814j25339j32232j37850
56220B865026j40974j40570j38792j36975j32933j25472j17365j10719j03724
56211A717502r5132q7488q2565p8014p1848o5933o1772n7331n1409m6494m3902
$$ plain form
56288 409092 412463 416375 420297 423407 427006 432487 438723 444342 450667 459406 469251 478002 486313 496076
56274 496076 506721 516540 526151 537255 549392 561364 574437 590558 608604 626047 643284 662860
56262 662860 685376 709631 735881 765494 798202 833045 871335 915465 965633 1020843 1082220
56251 1082220 1152141 1231034 1318195 1414764 1522623 1641317 1769228 1906674 2054436 2210280
56241 2210280 2370358 2533035 2697813 2861400 3018406 3165065 3298903 3415783 3510982 3582496
56231 3582496 3629899 3651055 3643687 3609325 3551964 3473670 3375261 3260447 3135108 3002876 2865026
56220 2865026 2724052 2583482 2444690 2307715 2174782 2049310 1931945 1821226 1717502
56211 1717502 1622370 1534882 1452317 1374303 1302455 1236522 1174750 1117419 1066010 1019516 975614
56200I75614m0794l5549l1227k9928k8623k4658k0573j9161j8412j5859j3411
56189F97419j3218j3040j0413p453o880p119n778m186m142l955k017m57j121j808
56175F15832n42O00m5J20K961N247L963J620J575K353J415L77J466K885K570K661
56159F45058N319Q098Q277P766R008J0144R157Q465J0425J2539J2179J1735J3965
56146G72135J6794J7988K0360K6739L4272L9499M4655N3016O2378O9351P5847
56135A233034Q4907R3905R8183R7915R5493R0038Q0566P0775O4584O0417N5386
56124B125203N0890M8291M3613L3087J9896R202O80p829j4102j5857j7014k2640
56112B253420l1625m0799n1664o6035p9596q7176r0394r2945r2879q6944p8106
$$ plain form
56200 975614 934820 899271 868044 838116 809493 784835 764262 745101 726689 710830 697419
56189 697419 684201 671161 660748 653295 646415 639296 633518 629332 625190 621235 619218 618761 617640 615832
56175 615832 615290 615890 615845 615965 618926 624173 628136 629756 631331 633684 635099 635476 636942 639827 642397 645058
56159 645058 650377 658475 666752 674518 683526 693670 702827 711292 721717 734256 746435 758170 772135
56146 772135 788929 806917 827277 854016 888288 927787 972442 1025458 1087836 1157187 1233034
56135 1233034 1317941 1411846 1510029 1607944 1703437 1793475 1874041 1944816 2009400 2069817 2125203
56124 2125203 2176093 2224384 2267997 2301084 2320980 2330182 2330862 2323033 2308931 2293074 2276060 2253420
56112 2253420 2221795 2180996 2129332 2063297 1983701 1896525 1806131 1713186 1620307 1533363 1455257
56101A455257p0937o3801n3308m2213l4993k9793k2742j5953j3186j1886p817
56090A088628l307k577l232r19K027J237o98J170M883N739N373P688J0301R255
56076A125568P597R843J2658J0774P269P885J0086Q461N985Q708J3899J4997J3922
56063A257652J6713K1153K0949J8165J9240K2303K0982J7175J7427J9994J8378
56052A470131J4478J5174J8939J8922J6406J7893K1713K1052J7534J8211K1715
56041A672168K1101J7718J8406K1737K1143J8830K2098K8625L0226K8383L0946
56030A931381L6476L7401L5826L9923M7323M8679M5239M6028N0213M9663M6457
56019B414609M9748N7414N9369N7065O0715O9084P1515O8514P0406P6932P8425
$$ plain form
56101 1455257 1384320 1320519 1267211 1224998 1190005 1160212 1137470 1121517 1108331 1096445 1088628
56090 1088628 1085321 1082744 1079512 1078593 1080620 1081857 1081159 1082329 1087212 1092951 1098324 1106012 1116313 1125568
56076 1125568 1133165 1143008 1155666 1166440 1173709 1181594 1191680 1200141 1206126 1214834 1228733 1243730 1257652
56063 1257652 1274365 1295518 1316467 1334632 1353872 1376175 1397157 1414332 1431759 1451753 1470131
56052 1470131 1484609 1499783 1518722 1537644 1554050 1571943 1593656 1614708 1632242 1650453 1672168
56041 1672168 1693269 1710987 1729393 1751130 1772273 1791103 1813201 1841826 1872052 1900435 1931381
56030 1931381 1967857 2005258 2041084 2081007 2128330 2177009 2222248 2268276 2318489 2368152 2414609
56019 2414609 2464357 2521771 2581140 2638205 2698920 2768004 2839519 2908033 2978439 3055371 3133796
56008C133796P5953P9531Q7575Q9438Q6968R1670J01813J05229J03554J09837
55998D065364J23087J29999J31156J39861J55364J63870J66017J75935J92922
55989E443575K02642K06672K20987K44561K60595K69802K89833L20532L44085
55980G803284L61264L91435M34396M70106M99158N43584O04267O59827P11593
55971A2478914P84804Q80780R76073J074414J208017J381374J569769J781073
55963B2135218K058486K413593K822956L300156L896143M616435N424282O345309
55955E3012578P477603Q881435J0571311J2641300J5261993J8517848K2407669
55948A48771737K7002407L2219176L7115437L9644562L7669110L0489969J9337421
$$ plain form
56008 3133796 3209749 3289280 3376855 3466293 3553261 3644931 3746744 3851973 3955527 4065364
55998 4065364 4188451 4318450 4449606 4589467 4744831 4908701 5074718 5250653 5443575
55989 5443575 5646217 5852889 6073876 6318437 6579032 6848834 7138667 7459199 7803284
55980 7803284 8164548 8555983 8990379 9460485 9959643 10503227 11107494 11767321 12478914
55971 12478914 13263718 14144498 15120571 16194985 17403002 18784376 20354145 22135218
55963 22135218 24193704 26607297 29430253 32730409 36626552 41242987 46667269 53012578
55955 53012578 60490181 69371616 79942927 92584227 107846220 126364068 148771737
55948 148771737 175774144 207993320 245108757 284753319 322422429 352912398 372249819
55941C72249819O456762o055370j6687781k4488892k9155063l1086465l1040652
55934B40192358k9645747k7294541k4357556k1251401j8281101j5572032j3181583
55927I0608397j1161875r499685q110160o931016n955416n162240m491419l906862
55919C5389724l417550l018881k671840k355493k085440j864902j667029j479555
55911A6829034j320253j194087j078010r61602q62404p87887p19896o49256n90178
55902H665461n47966n06207m58022m18262l93004l67082l33168l04322k86569
55893E050859k66667k38372k14492k01759j88682j69172j54238j49473j43660
55884C324344j30326j18954j14671j07783r3439q1632p7918p3611o4393n9697
$$ plain form
55941 372249819 378706581 372651211 355963430 331474538 302319475 271233010 240192358
55934 240192358 210546611 183252070 158894514 137643113 119362012 103789980 90608397
55927 90608397 79446522 69946837 61836677 54905661 48950245 43788005 39296586 35389724
55919 35389724 31972174 28953293 26281453 23925960 21840520 19975618 18308589 16829034
55911 16829034 15508781 14314694 13236684 12275082 11412678 10624791 9904895 9255639 8665461
55902 8665461 8117495 7611288 7153266 6735004 6342000 5974918 5641750 5337428 5050859
55893 5050859 4784192 4545820 4331328 4129569 3940887 3771715 3617477 3468004 3324344
55884 3324344 3194018 3075064 2960393 2852610 2759171 2677539 2599621 2526010 2461617 2401920
55874B401920o3984o7183o3226o0440o4221o6659o2784o0443o4425o6658o1694
55863A700203n6740n6985n5630m7788m0410l9187l8810l4821l2200l3872l3413
55852A230347k7521k3455k5964k8805k7012k5760k9096l1529k8783k5821k6486
55841I30115k5971k1097j7314j8138j8190j3968j1072j3307j5128j2470j0739
55830G52721j4177j7251j4719j0917j0955j1585q823o158p323q819p142n799q001
55817F21052r982q525p535j0241j2487j0580q358r480j0070o105j175K06L29K623
55803E29672M743M094L859O934R865R140P595Q411Q833N990K914K641K283r94
55789F05980l995l585k865n165p629o963n872p625r767r435r558j3281j7384j7604
$$ plain form
55874 2401920 2337936 2270753 2207527 2147087 2082866 2016207 1953423 1892980 1828555 1761897 1700203
55863 1700203 1643463 1586478 1530848 1483060 1442650 1403463 1364653 1329832 1297632 1263760 1230347
55852 1230347 1202826 1179371 1153407 1124602 1097590 1071830 1042734 1011205 982422 956601 930115
55841 930115 904144 883047 865733 847595 829405 815437 804365 791058 775930 763460 752721
55830 752721 738544 721293 706574 695657 684702 673117 664294 658136 650813 641994 634852 629053 621052
55817 621052 611070 602545 595010 584769 572282 561702 553344 543864 533794 527689 526514 526720 527049 529672
55803 529672 534415 538509 542368 549302 559167 568307 575902 584313 593146 599136 602050 604691 606974 605980
55789 605980 601985 598400 595535 590370 582741 575778 569906 562281 552514 543079 533521 520240 502856 485252
55775D85252j5683j5008j4054j0315o185m817m401k378r32k566m601l846k447
55762C98019l413m621l005n95o52j766j355j036l070n243m901m171n939q340q543
55747C41369q096r185r600o886l646l188l619j906m4j443m526n670n350n807n785
55732B66618l166K0O44j09M56J278O1j829k163k471m823o970n930l609l526m810
55716B29671m588l648m277n104l482o58N74J099L220N587N471L994L980M742L869
55701B40450K119J623J341q13l380l729k863l253m036l117j805k362l271j870
55687B15034M36O69j88O85K382K146Q90J446L021K807J616K429M628N013L558
55672B46572K927L224K312N51K28R30K90j376j796j294j985l279k748p98M3j77
$$ plain form
55775 485252 469569 454561 440507 430192 424007 419190 414789 412411 411479 408913 404312 400466 398019
55762 398019 394606 389985 386980 386385 385733 383967 382612 381576 378506 373263 368362 364191 358252 349912 341369
55747 341369 333273 324088 314488 307602 303956 300768 297149 295243 295199 293756 289230 283560 278210 272403 266618
55732 266618 263452 263472 264116 264007 264463 265741 265802 263973 261810 259339 254516 247546 241616 238007 234481 229671
55716 229671 225083 221435 217158 212054 208572 207914 208488 209587 212807 218394 223865 227859 231839 236581 240450
55701 240450 242569 244192 245533 244720 241340 237611 234748 231495 227459 224342 222537 220175 216904 215034
55687 215034 215470 216139 215951 216636 219018 221164 222054 223500 226521 229328 230944 233373 238001 243014 246572
55672 246572 249499 252723 255035 255586 255814 256744 257034 255658 253862 252568 250583 247304 244556 243758 243801 243624
55656B43624O14K054J913N71M72J668K068J593J872K518J782K79j02r1j755m176
55640B54904m801m179m877o516o454m828m330n328n749n407n952o768n556k833
55626A81326j500j922j803q40j037k294k212o14l6j180j934j375r47j193j009
55611A61430m76q93j768j371k67p00k440l047k244k135k988k848j612j448k596
55596A34597k698j017L54K79Q4M87L84n82j268j400j779j919n97J237J295j69
55580A27288p18O1K09o09m70J096K341K720L520M725M733L681L475M111L549J744
55564A61456J083K090K453J191J50L35L22n66r45l50l12j238j507p34p94k350
55548A60284l507l175k764l237l378k420j633j889k231k103k496l652m105l100
$$ plain form
55656 243624 244238 246292 248205 248776 249248 250916 252984 254577 256449 258967 260749 261028 260926 260835 259080 254904
55640 254904 250103 245924 241047 234531 228077 223249 218919 213591 207842 202435 196483 189715 184159 181326
55626 181326 179826 177904 176101 175261 174224 171930 169718 169104 169068 167888 165954 164579 163632 162439 161430
55611 161430 160954 160061 158293 156922 156655 155955 153515 150468 148224 146089 143101 140253 138641 137193 134597
55596 134597 131899 130882 131236 131515 131599 132086 132470 131888 130620 129220 127441 125522 124925 126162 127457 127288
55580 127288 126570 126631 126840 126231 125761 126857 129198 131918 135438 140163 144896 148577 152052 156163 159712 161456
55564 161456 162539 164629 167082 168273 168423 168758 169080 168514 167569 167219 166907 165669 164162 163428 162634 160284
55548 160284 156777 153602 150838 147601 144223 141803 140170 138281 136050 133947 131451 127799 123694 120594
55534A20594j714n91R94K998L930L306K503K349K084J345P81K27j267l082l331
55519A31126k055j400k126k668k251j990k192j527J84J240R47N24L39q83l142
55504A14126m404l790k851k681k505k046k424l594l755k349j075q56o50n8k02
55489H0886r86n84J188K084J311J006K393L590L061K133K237K433J760J321J953
55474A05786K220R12o50p94n2K85J88j46j320l042l512k094o93q46j451r79J03
55457I3915P15J077J596J683J109P96R98N84o29j005J88J310J011K28Q9P1l17
55440A03419j64Q85J446O96j17lJ38l95n60K43O90p9p65k79L14m7m58J9N09K05
55420A05697oM66N31k81m04R55J909R30n04n22O5l08r63n72J12l26j274j318p73
$$ plain form
55534 120594 118880 118289 119283 122281 126211 129517 132020 134369 136453 137798 138579 138806 137539 134457 131126
55519 131126 129071 127671 125545 122877 120626 118636 116444 114917 115101 116341 117288 117812 118151 117268 114126
55504 114126 109722 105932 103081 100400 97895 95849 93425 89831 86076 83727 82652 81796 81146 81088 80886
55489 80886 79900 79316 80504 82588 83899 84905 87298 90888 93949 96082 98319 100752 102512 103833 105786
55474 105786 108006 108918 108268 107474 107422 107707 107895 107749 106429 103387 99875 97781 97088 96242 94791 93812 93915
55457 93915 94630 95707 97303 98986 100095 100891 101889 102473 101844 100839 101027 102337 103348 103576 103665 103736 103419
55440 103419 103255 104140 105586 106282 106165 106162 106300 105905 105345 105588 106278 106199 105434 105155 105469 105422 104964 104983 105492 105697
55420 105697 105691 106157 106688 106407 106003 106958 108867 109797 109293 108771 108836 108528 107565 106993 107105 106779 105505 104187 103414
55401A03414p23q65m75j69n98p87J25R65M01o91q17l28k20n6P26J077J77n35L86
55382A01007J603J054o43j430j195j178j170j65J055Q76j79j31J210K111J824
55367A04649J231Q31K11n38q21p82r33r17j87O31O21K12K89M16k72j152r77L2
55349A02544O93Q72J223J533J177O17O88R06K91p14q81l30k42q09j164r87p29
55332A04688n53m33p80j697k209j507k81L66M70M19j84j381j783m20J363J731
55316I7809J097J064J608J452N00j78l23n02n82r4L67m9p02l74N88Q55L97L50
55298A03283R15J148O56p0p61j370j417o58Q4J14R7P53J269O30m08m94J31M27
55280A04329O40J490K164J357k73r26m59k01l94k2R93J566J275O14l20j580k203
$$ plain form
55401 103414 102691 101826 101351 101182 100584 99797 99922 100887 101288 100597 99780 99452 99232 99176 99902 100979 101156 100621 101007
55382 101007 102610 103664 103021 101591 100396 99218 98048 97883 98938 99814 99635 99504 100714 102825 104649
55367 104649 105880 106711 106922 106384 105563 104781 103848 102931 102744 103375 103996 104208 104497 104913 104641 103489 102512 102544
55349 102544 103237 104109 105332 106865 108042 108659 109347 110253 110544 109830 108949 108619 108377 107568 106404 105417 104688
55332 104688 104135 103702 102922 101225 99016 97509 97228 97594 98064 98483 98299 96918 95135 94715 96078 97809
55316 97809 98906 99970 101578 103030 103530 103352 103029 102527 101945 101851 102218 102169 101467 101093 101681 102536 102933 103283
55298 103283 104198 105346 106002 105932 105171 103801 102384 101726 101810 101924 102021 102774 104043 104673 104265 103771 103902 104329
55280 104329 104969 106459 108623 109980 109707 108781 108322 108121 107727 107705 108698 110264 111539 112153 111833 110253 108050
55263A08050j240L46Q27L48M20J172J287M73j85l36o60j089q06j36l99j664k452
55246A03956j967q77J37R68J232N38l62l53K26J62m50m45K23M55P5n6O4m30j329
55227A01767j379l71O07J063J384J241j60k080k575j213M41J293J751K052J569
55212A05390L61m29k82J48N13J141J723J408M99K77P69N94n83j393j072o37r60
55195A07467j448j304o91PP41J130O81l2J85J115J266K90m11J7O81O82L34M7m58
55176A10299j076r68k9O81N65K72L25L88L44O82J236J085K55M3R92J958J873J082
55158A20007K65n72j266j107p5O82L89l67q13j046j363j595j609j532j158k21
55142A08619O25L66o56r84j81P06J023J227J414R18j00m57R0L71k1P8J195J993
$$ plain form
55263 108050 106810 107156 107983 108331 108751 109923 111210 111683 111498 111162 110502 109413 108607 108471 108072 106408 103956
55246 103956 101989 101112 101249 102217 103449 103987 103625 103272 103498 103660 103210 102765 102988 103443 103518 103462 103526 103096 101767
55227 101767 100388 100017 100624 101687 103071 104312 104152 102072 99497 98284 98725 100018 101769 103821 105390
55212 105390 105751 105322 105040 105188 105701 106842 108565 109973 110472 110749 111518 112112 111529 110136 109064 108427 107467
55195 107467 106019 104715 104024 104031 104772 105902 106583 106551 106736 107851 109117 109407 108996 109013 109694 110376 110710 110757 110299
55176 110299 109223 108255 108226 108907 109472 109744 110069 110457 110801 111483 112719 113804 114059 114102 115094 117052 118925 120007
55158 120007 120272 119700 118434 117327 117252 117934 118323 117956 117143 116097 114734 113139 111530 109998 108840 108619
55142 108619 109244 109610 108954 107970 107789 108495 109518 110745 112159 113077 112977 112520 112610 112981 112960 113038 114233 116226
55124A16226J301j08r15j046j017p58j99J33L7J71P52R72M41N0N09J158J134O39
55106A19480J62l95j009j064m43kj77k09M65J195J292J076R33N24j85l52L49R33
55088A22573O37J52K36L46k12q30n42L94R96R93P85N91N23Q16J271J155L29l10
55070A29903j46L01M51N68Q74Q13J23m01j23L57K19l05n85o75q28p72l48j26n20
55051A28780r93r12n21l68m86p73j340j855j450RJ393J725J278O92Jp46r46l27
55033A23161N00J004J331J411O91n49r78j57N67R4p69p90k72k34p09j120j443
55016A21738j717j343q3J026J034N36N61Q29M53l85q53r22j057j022l59L70K64
54999A19070l42k79O67J529J671J442J335J374J396J259Q29K29j26q4om4K26J024
$$ plain form
55124 116226 117527 117419 116504 115458 114441 113683 113484 113617 113654 113825 114577 115549 115990 116040 116549 117707 118841 119480
55106 119480 119642 119247 118238 117174 116731 116729 116552 116343 116808 118003 119295 120371 121304 121828 121643 121291 121640 122573
55088 122573 123210 123362 123598 123944 123732 122902 122360 122754 123750 124743 125528 126119 126642 127458 128729 129884 130213 129903
55070 129903 129757 130058 130509 131077 131951 132764 132887 132486 132363 132720 132939 132634 132049 131374 130546 129774 129426 129300 128780
55051 128780 127787 126875 126354 125986 125500 124727 123387 121532 120082 120091 121484 123209 124487 125179 125180 124434 123488 123161
55033 123161 123661 124665 125996 127407 128098 127549 126571 126414 126981 127075 126306 125516 125244 125010 124301 123181 121738
55016 121738 120021 118678 118595 119621 120655 121191 121752 122581 123034 122649 121796 120874 119817 118795 118436 118806 119070
54999 119070 118728 118449 119116 120645 122316 123758 125093 126467 127863 129122 129951 130180 130054 129970 129964 129920 130146 131170
54981A31170J796J957J581R59R6q47j348j229q82m57K83J003Q54o0m70J64Q55
54964A35425Q03O27R05R78K66m95n18l06n07o25j74J32k65m18N07J401P93o32
54946A37897r71k0O37J13q75j440j343n88N63J216P63j02k49K88O73P01P80Q94
54928A38937P76P60J306K096K560K825L182L321L146L628N460P621Q653Q621Q347
54913B01239P504N296K449N46l86j741l806n273n512n525o142o772o555n627m667
54898A65028m047l756l508k793j506m32l40q05q27l21K4J46O58J548K046J907
54882A53022J753J971K226K266K436L137M280N396N905N526M737M463M849M943
54868B06910M023K527J023p39k880m553n163n472o289o925o382n210m582m350
$$ plain form
54981 131170 132966 134923 136504 137463 137559 136712 135364 134135 133253 132796 133079 134082 134936 134876 134406 134570 135425
54964 135425 136228 136855 137760 138738 139004 138509 137991 137685 137178 136553 136379 136511 136246 135828 136335 137736 138529 137897
54946 137897 136926 136906 137543 137656 136781 135341 133998 133410 133973 135189 135952 135850 135601 135889 136562 137263 138043 138937
54928 138937 139713 140473 141779 143875 146435 149260 152442 155763 158909 162537 167997 175618 184271 192892 201239
54913 201239 208743 214039 216488 217034 216648 214907 211101 205828 200316 194791 188649 181877 175322 169695 165028
54898 165028 160981 157225 153717 150924 149418 148986 148646 147841 147014 146693 146717 146863 147521 149069 151115 153022
54882 153022 154775 156746 158972 161238 163674 166811 171091 176487 182392 187918 192655 197118 201967 206910
54868 206910 210933 213460 214483 213744 210864 206311 201148 195676 189387 182462 176080 170870 166288 161938
54854A61938l680k885k808l008k436j512j499k124j941r33n80j243j589r15j34
54839A34651K0p2k31r18j794j604k08Q96P74K57K23K57j18l08K52R61J038O57
54821A34733L14n9n56p45m53k15l79m63j21R4m02j199j472r96j71N64Q96P16L56
54802A30442K18J06m59j175j112j28P19O09Mj15N29J428J920J647Q30J82J34L04
54784A36083J88L3K82N74L50Q2O23J539J564P52O07J782L113L504L374L545L905
54767A61900M044M229M931O004O986P643P708O822N176L564K401J296p5j363k194
54752B19072k787l538m516n544o343o506n875m933m167l302j979q81j001j956
54738A65744k331j793j401j661j750j152n23k81L04J661K776K565J537J073J666
$$ plain form
54854 161938 158258 155373 152565 149557 147121 145609 144110 141986 140045 139112 138532 137289 135700 134785 134651
54839 134651 134671 134599 134368 133450 131656 130052 129844 130740 131514 131771 131994 132251 132133 131825 132077 133038 134076 134733
54821 134733 135047 134988 134432 133687 133234 133019 132640 132177 132056 132150 131748 130549 129077 128081 127910 128474 129370 130086 130442
54802 130442 130660 130766 130307 129132 128020 127892 128611 129220 129224 129109 129638 131066 132986 134633 135463 135645 135779 136083
54784 136083 136271 136304 136586 137160 137510 137592 138215 139754 141318 142070 142677 144459 147572 151076 154450 157995 161900
54767 161900 165944 170173 175104 181108 188094 195737 203445 210267 215443 219007 221408 222704 222629 221266 219072
54752 219072 216285 212747 208231 202687 196344 189838 183963 179030 174863 171561 169582 168701 167700 165744
54738 165744 163413 161620 160219 158558 156808 155656 155133 154852 155156 156817 159593 162158 163695 164768 166434
54723A66434K719L605M188M633N241O111O719O341N077L738K548Q81j412l401
54709B13422m314m525m780n146n346n400n362m991m160l125k071r86j72j58p78
54694A62108j128q14m90q09j521k007k040j637q41NL94L38K71J72m69j567k265
54677A47700k085j501j052o85k27K87Q57J425J426L80j073j794j728j750j880
54662A38300j170L81J387J102M61M61P65O77K59k24q46j316r50J2K76n76j278
54645A37721q29P7M14L78N32O59M97N05Q37O83k28o94J76J280J050k89j346j628
54627A39795j534j067l4R91J266J027Q54M39o84j721j461j69O62M02j81l28j23
54610A38134J68N22Q08Q09O39N20L14k13q50j242j375j282p99j38mm82n02O82
$$ plain form
54723 166434 169153 172758 176946 181579 186820 192931 199650 205991 211068 214806 217354 218235 216823 213422
54709 213422 209108 204583 199803 194657 189311 183911 178549 173558 169398 166273 164202 163216 163044 162886 162108
54694 162108 160980 160166 159676 158867 157346 155339 153299 151662 150821 150826 151220 151558 151829 152001 151532 149965 147700
54677 147700 145615 144114 143062 142377 142150 142437 143294 144719 146145 146525 145452 143658 141930 140180 138300
54662 138300 137130 137511 138898 140000 140461 140922 141687 142364 142623 142399 141553 140237 139287 139299 139575 138999 137721
54645 137721 136892 136969 137383 137761 138293 138952 139449 139954 140791 141474 141246 140552 140728 142008 143058 142769 141423 139795
54627 139795 138261 137194 137160 138151 139417 140444 141298 141737 141053 139332 137871 137702 138364 138766 138585 138257 138134
54610 138134 138302 138824 139632 140441 141080 141600 141914 141701 140851 139609 138234 136952 136153 136015 136011 135529 135027 135709
54592A35709K193K668K079J345P87J17n22p52q72j347j657r00O35J662J701J498
54576A44344J644J766J396O85O6k38j75J01J87j09m51n11n60r00j140p54o6J72
54558A45457m6q2K24M53M94O35P63L23o90j387j017J53J182J454J178J019J308
54541A51421J620J382Q22P81J486K194K251J838J274M86m16p79l79K2k20n60j76
54524A63047O66J002N24k81r20j133p75j42L4m60q68n76r6j82o76r69r64p94k66
54505A56171M99O60j17p85l58M48L04o39j115p40k32J4J99J85l27q09m30M45O35
54486A54008k2m61j95N9k57o43m97Q8P49J336J649J509J211J211J297Q28j10o37
54468A61123l11L51P25P71P12O56P03Q39P78L62P3M81J313J749J460P42j89j226
$$ plain form
54592 135709 137902 140570 142649 143994 144781 144898 144376 143624 142752 141405 139748 138848 139483 141145 142846 144344
54576 144344 145988 147754 149150 149835 149901 149663 149488 149589 149776 149667 149216 148705 148145 147245 146105 145351 145285 145457
54558 145457 145411 145329 145553 146006 146500 147135 147898 148221 147531 146144 145127 145280 146462 147916 149094 150113 151421
54541 151421 153041 154423 155245 156026 157512 159706 161957 163795 165069 165555 165139 164360 163981 164003 163783 163223 163047
54524 163047 163713 164715 165239 164958 164038 162905 162130 161988 162022 161562 160694 160118 160022 159840 159164 158195 157231 156437 156171
54505 156171 156670 157330 157213 156428 156070 156518 156822 156183 155068 154328 154096 154110 154309 154494 154167 153358 152928 153373 154008
54486 154008 153986 153525 153330 153389 153132 152489 151992 152080 152829 154165 155814 157323 158534 159745 161042 161870 161760 161123
54468 161123 160812 161163 161888 162659 163371 164027 164730 165569 166347 166709 166782 167263 168576 170325 171785 172527 172338 171112
54450A71112j912j794j258j158j611j861j369l74O04J224J326J024P14N76K92
54435A65535l03p78q04p52q66o39J66O53J26m82Q7J242J342L43j27O58J574J589
54417A68564J053O12K07k22k30K93P05O16M56O12Q17Q39R72J382J636J288M66
54400A80066m30j087j234q07j80K70P34J451J909J470O17M80J142J496R32P0l94
54383A86505n42n90m33j29r4m37q17j130j547j876j680j169j000j120p91Q2P17
54366A73949P49O76P18L11o94j367q10P31K319L210L036J904O43K44P14J168J190
54349A88691J257J650J953J986K207K730K934K616K593L480M596M741L575J659
54335B26668l71k074l142l559l626l568l410l255l202k964k178j161p12j052j613
$$ plain form
54450 171112 169200 167406 166148 164990 163379 161518 160149 159775 160379 161603 162929 163953 164667 165243 165535
54435 165535 165232 164454 163650 162898 162032 161393 161559 162212 162338 161856 161943 163185 164527 164870 164743 165401 166975 168564
54417 168564 169617 170229 170436 170214 169984 170277 170982 171598 172054 172666 173483 174322 175294 176676 178312 179600 180066
54400 180066 179636 178549 177315 176508 176328 176598 177332 178783 180692 182162 182779 183259 184401 185897 186829 186899 186505
54383 186505 185963 185373 184940 184811 184717 184280 183463 182333 180786 178910 177230 176061 175061 173941 173150 173232 173949
54366 173949 174698 175374 176092 176403 175709 174342 173532 174263 176582 179792 182828 184732 185375 185619 186333 187501 188691
54349 188691 189948 191598 193551 195537 197744 200474 203408 206024 208617 212097 216693 221434 225009 226668
54335 226668 226297 224223 221081 217522 213896 210328 206918 203663 200461 197497 195319 194158 193446 192394 190781
54320A90781j896j950j813j278l57N96J304J668J449N30o52j557k195k676k551
54305A79403j529m55l20p06m92J93K34l94n39P3L82q5n16m48m43o73m49K08K59
54286A73703m24m94N74J365P97o2J65R40R13J57k76j47K6J53M17M73J7m16j88
54267A77693L67N98N93O57M22m65j358j393p92l46n8O46J694K328K139J398N39
54250A84662rR7O91J064Q55M78K82n5p19j146r18n41n58o13k29J64j39r71j586
54231A80809j643j199k48R44J642J472R92P98O76K75j05j29j06l79o60o89p18
54214A81732p37j47R53J227o5j693k117j590j317j365q85J61J052J657K315K684
54198A81865K169J197P00N57q3j075j376q02l64n93q93p68n35m90l72q2n2m97
$$ plain form
54320 190781 188885 186935 185122 183844 183487 184083 185387 187055 188504 189034 188382 186825 184630 181954 179403
54305 179403 177874 177419 177099 176393 175901 176094 176328 175934 175395 175468 175850 175765 175249 174801 174358 173685 173236 173444 173703
54286 173703 173279 172785 173359 174724 175521 175459 175624 176564 177477 177634 177358 177211 177237 177390 177807 178280 178297 177881 177693
54267 177693 178060 178658 179251 179908 180330 179865 178507 177114 176322 175976 175918 176564 178258 180586 182725 184123 184662
54250 184662 184653 184750 185441 186505 187360 187838 188120 188065 187346 186200 185282 184741 184183 183570 183341 183505 183366 182395 180809
54231 180809 179166 177967 177719 178663 180305 181777 182769 183567 184243 184518 184413 184284 184178 183799 183139 182450 181732
54214 181732 180995 180848 181801 183028 182963 181270 179153 177563 176246 174881 173996 174157 175209 176866 179181 181865
54198 181865 184034 185231 185931 186488 186405 185330 183954 183152 182788 182195 181302 180534 179999 179509 179137 179055 179003 178506
54180A78506r57r20m17J65M68L38m8k38m8J69N4k74o38j158j709j682q92q5J34
54161A70768J54L79L41k52m75M39J503J305L26J92R66J113J63n67k28K87P3l35
54143A76152n5O69J008P41J59n03r66q23j46L70K78n2j12K8J8j40k06o0K87P61
54123A77408J174J329J256J075P68L37Q0K14M58M36L13M86Q20Q62O71O80Q49O56
54105A89872N3k85R5P74J011N86o8l65j43J48k5m89n38J8N60P18R57J577J883
54086A96339J169j19j008j287j251q12J52J015J104P87Q42J084Q77M89P06J340
54070B01427J527J336J605K180J939Q10J85Q67J911K179J913K008K670L538M404
54055B30499N222N964O931Q540J0384J1165J0042P564M873K547N69j085k366l335
$$ plain form
54180 178506 177549 176629 176212 176377 176845 177183 177135 176897 176849 177018 177072 176798 176160 175002 173293 171611 170719 170634 170768
54161 170768 170922 171301 171642 171390 170915 171354 172857 174162 174488 174680 175646 176759 176922 176355 176127 176414 176487 176152
54143 176152 176097 176766 177774 178515 178674 178171 177205 176382 176236 176606 176884 176832 176720 176748 176766 176626 176420 176360 176647 177408
54123 177408 178582 179911 181167 182242 183010 183347 183427 183641 184099 184535 184848 185334 186154 187016 187687 188367 189216 189872
54105 189872 189925 189640 189735 190509 191520 192106 192038 191673 191530 191678 191653 191164 190626 190644 191204 191922 192879 194456 196339
54086 196339 197508 197389 196381 195094 193843 193031 193183 194198 195302 196089 196931 198015 198892 199381 200087 201427
54070 201427 202954 204290 205895 208075 210014 210824 211009 211876 213787 215966 217879 219887 222557 226095 230499
54055 230499 235721 241685 248616 257156 267540 278705 288747 296311 301184 303731 304300 303215 300849 297514
54041B97514m083m534m435l474j630M04J523J499J503K684M597N817N779N047
54027C08211M164L326K950L364L923L599K562J995K245K344J627O17q2o56j398
54012C38791k101k644l378m402n218n449n273m931m509m306m600m938m658m092
53998B78292m209m884m830l618k440k293k588k330j627j220j323j673k088k306
53984B40863k026j532j555k058k076j250m74m04l92K75J020Q90M8o83j106j453
53968B28087j498r02q6K65L36Q93K066L128L503L242K690K196K088K462L027L561
53952B55058M217N098N813N873N258M317L353K607K256K125J799J264J062J464
53938C01564K026K280K408K818L443L863L826L334K613K146K323K771K651J846
$$ plain form
54041 297514 293431 288897 284462 280988 279358 279762 281285 282784 284287 286971 291568 297385 303164 308211
54027 308211 312375 315701 318651 322015 325938 329537 332099 334094 336339 338683 340310 340927 340845 340189 338791
54012 338791 336690 334046 330668 326266 321048 315599 310326 305395 300886 296580 291980 287042 282384 278292
53998 278292 274083 269199 264369 260751 258311 256018 253430 251100 249473 248253 246930 245257 243169 240863
53984 240863 238837 237305 235750 233692 231616 230366 229892 229488 229096 229371 230391 231281 231329 230646 229540 228087
53968 228087 226589 225687 225601 225866 226202 227095 229161 232289 235792 239034 241724 243920 246008 248470 251497 255058
53952 255058 259275 264373 270186 276059 281317 285634 288987 291594 293850 295975 297774 299038 300100 301564
53938 301564 303590 305870 308278 311096 314539 318402 322228 325562 328175 330321 332644 335415 338066 339912
53924C39912J288J744K892L971M724N271N666O037O627P301P573P529P968R161
53910D17664J0206J0304R911R914J0190J0020R378Q968R145R724J0722J2447J4688
53897E53281J6381J6248J3555Q405J684n321j1538j6434j9802k1595k2109k1896
53885D90859k1212j9911j8056j6180j4681j3394j2088j0873r838q752p513o462
53873C31899n901n646n418n223n060m677l982l305k937k754k546k357k225k093
53859B77775k103k483k970k873k039j130p36q21j225j981k806l034k502j870j685
53844B47517j746j662j421j065n84l81r77j966k190j356m67j82L4N62O83q8r19
53827B33792r16m96l34m7Q67J621J225K87J96R40J227O04l2KM29R51J723K596
$$ plain form
53924 339912 341200 342944 345836 349807 354531 359802 365468 371505 378132 385433 393006 400535 408503 417664
53910 417664 427870 438174 448085 457999 468189 478209 487587 496555 505700 515424 526146 538593 553281
53897 553281 569662 585910 599465 607870 609554 604233 592695 576261 556459 534864 512755 490859
53885 490859 469647 449736 431680 415500 400819 387425 375337 364464 354626 345874 338361 331899
53873 331899 325998 320352 314934 309711 304651 299974 295992 292687 289750 286996 284450 282093 279868 277775
53859 277775 275672 273189 270219 267346 265307 264177 263441 262620 261395 259414 256608 253574 251072 249202 247517
53844 247517 245771 244109 242688 241623 241039 240658 239681 237715 235525 234169 233702 233520 233554 234116 234799 234711 233792
53827 233792 232876 232380 232046 231999 232866 234487 235712 235999 236195 237135 238362 238966 238934 238936 239365 240316 242039 244635
53809B44635K923K483J949K110L086M396N377N606N247M872M720M527M341M804
53795C01076O017O898O512N382M616M294L757L010K662K782K876K796K683K191
53781C57552Q19j081k616l530m172m545m395m145m616n737o588o724o550o337
53767B97335n818m963m234l895l710l463l152k672j952j365j352j721j991k203
53753B54844k647k993k629j780j263j262j211q66n66m47l43m59j101j707j284
53738B34286qP57L56k93j21P29J450J704J610J218O47L02N08J132J754J971J518
53721B49520N30l48n19p8N13J121J747J948J342M96L99J110J787K104K540L202
53705B67414L420K859K126J885K099K505L032L440L327K831K693L203L741L682
$$ plain form
53809 244635 247558 250041 251990 254100 257186 261582 266959 272565 277812 282684 287404 291931 296272 301076
53795 301076 307093 313991 320503 325885 330501 334795 338552 341562 344224 347006 349882 352678 355361 357552
53781 357552 358371 357290 354674 351144 346972 342427 338032 333887 329271 323534 316946 310222 303672 297335
53767 297335 291517 286554 282320 278425 274715 271252 268100 265428 263476 262111 260759 259038 257047 254844
53753 254844 252197 249204 246575 244795 243532 242270 241059 240193 239627 239180 238837 238378 237277 235570 234286
53738 234286 234278 235035 235391 235098 234977 235706 237156 238860 240470 241688 242335 242637 243145 244277 246031 248002 249520
53721 249520 250050 249702 249183 249105 249618 250739 252486 254434 255776 256272 256671 257781 259568 261672 264212 267414
53705 267414 270834 273693 275819 277704 279803 282308 285340 288780 292107 294938 297631 300834 304575 308257
53691C08257L162K684K439K358K311K119J772J567J547R87o67k551l129k249j317
53676C19290j230j335q32q0J48k44r28j690k127j713o55K5r7l06j15j90j086k033
53658C04802j990j199o66o26o40o39q45r40m17L52M23l19r57p96j44L09K55j18
53640B95845l27J05J132K016K150J906K136K943L507L206K229J091N7o15n05M83
53624C17359J743K501K622K596K765K931K771K402K287K706L480M230M679M699
53610C59771M384M083M185M604M852M712M520M542M451L843K928K249K005K078
53596D13207K461L017L165K466J398Q66J025J314J452J663J936J912J668J703
53582D39253K004J863R03l93j454k259k945l445l836m417n166n631n565n055m003
$$ plain form
53691 308257 311419 314103 316542 318900 321211 323330 325102 326669 328216 329203 328536 325985 322856 320607 319290
53676 319290 318060 316725 315893 315813 315961 315717 314789 313099 310972 309259 308604 308629 308532 308226 308111 307921 306835 304802
53658 304802 302812 301613 300947 300321 299681 299042 298197 297257 296840 297192 297615 297296 296339 295543 295399 295708 295963 295845
53640 295845 295518 295623 296755 298771 300921 302827 304963 307906 311413 314619 316848 317939 317996 317381 316876 317359
53624 317359 319102 321603 324225 326821 329586 332517 335288 337690 339977 342683 346163 350393 355072 359771
53610 359771 364155 368238 372423 377027 381879 386591 391111 395653 400104 403947 406875 409124 411129 413207
53596 413207 415668 418685 421850 424316 425714 426580 427605 428919 430371 432034 433970 435882 437550 439253
53582 439253 441257 443120 444023 443630 442176 439917 436972 433527 429691 425274 420108 414477 408912 403857 399854
53567C99854k281o01k32j346k502k391j364n67l48k84k37m23p00o04J2Q73J730
53550C88589K396K578K157J502J169J356J940K747L497L824L680L523L777M392
53536D27127N114N823O395O603O502O469O643O765O862P478Q781J0078J0708J0948
53522E32296J1431J2145J2741J3349J4324J5405J5964J6032J6321J7262J8669
53511F95939K0311K2085K3583K4175K3849K3450K3767K4681K5511K5800K5527
53500I58678K4846K4032K3473K3337K3208K2510K1284K0271J9926J9792J9225
53489A200582J8500J8495J9234J9619J8939J7924J7691J8234J8721J8877J9082
53478A405898J9366J9175J8182J6542J4358J1641Q821O416M231J697r80k999m380
$$ plain form
53567 399854 397573 396972 396740 395394 392892 390501 389137 388570 388222 387938 387701 387278 386578 385974 385986 386859 388589
53550 388589 390985 393563 395720 397222 398391 399747 401687 404434 407931 411755 415435 418958 422735 427127
53536 427127 432241 438064 444459 451062 457564 464033 470676 477441 484303 491781 500562 510640 521348 532296
53522 532296 543727 555872 568613 581962 596286 611691 627655 643687 660008 677270 695939
53511 695939 716250 738335 761918 786093 809942 833392 857159 881840 907351 933151 958678
53500 958678 983524 1007556 1031029 1054366 1077574 1100084 1121368 1141639 1161565 1181357 1200582
53489 1200582 1219082 1237577 1256811 1276430 1295369 1313293 1330984 1349218 1367939 1386816 1405898
53478 1405898 1425264 1444439 1462621 1479163 1493521 1505162 1513983 1520399 1524630 1526327 1525347 1522348 1517968
53465A517968o111q585j0946j2489j3623j4897j5981j6356j6229j6082j6026j6288
53453A354355j7522j9797k1863k2418k1642k0691k0125j9687j9252j9000j8807
53442A133551j8274j7288j5953j4102j1574q891o997o228o024n632m775l626k489
53429A011698j508n34O81K066L331M495N911P645R333J0836J2495J4406J6036
53416A096891J7009J7732J8818K0364K2166K4107K5985K7432K8499K9794L1618
53405A360415L3527L5086L6509L8077L9699M1417M3594M6050M7927M9061N0537
53394A821899N2929N5065N5639N5319N5788N7258N8343N8149N7077N5604N3675
53383B436745N1441M9476M7949M6369M4374M1959L8937L4987L0403K5956K1837
$$ plain form
53465 1517968 1511857 1503272 1492326 1479837 1466214 1451317 1435336 1418980 1402751 1386669 1370643 1354355
53453 1354355 1336833 1317036 1295173 1272755 1251113 1230422 1210297 1190610 1171358 1152358 1133551
53442 1133551 1115277 1097989 1082036 1067934 1056360 1047469 1040472 1034244 1028220 1022588 1017813 1014187 1011698
53429 1011698 1010190 1009656 1010337 1012403 1015734 1020229 1026140 1033785 1043118 1053954 1066449 1080855 1096891
53416 1096891 1113900 1131632 1150450 1170814 1192980 1217087 1243072 1270504 1299003 1328797 1360415
53405 1360415 1393942 1429028 1465537 1503614 1543313 1584730 1628324 1674374 1722301 1771362 1821899
53394 1821899 1874828 1929893 1985532 2040851 2096639 2153897 2212240 2270389 2327466 2383070 2436745
53383 2436745 2488186 2537662 2585611 2631980 2676354 2718313 2757250 2792237 2822640 2848596 2870433
53372B870433J7475J2514P294K136l188r058j5498k2213k8749l4619l9629m3977
53360B712921m7743n0574n2264n3268n4049n4385n3991n3287n2707n1684m9451
53349B139518m6535m4357m3394m2855m2151m1583m1385m1175m0711m0271l9987
53338A675114l9439l8285l6608l4539l2080k9419k6827k4293k1822j9901j8926
53327A352975j8368j7473j6506j6225j6324j5763j4679j4371j5031j5067j3460
53316A179708j1384j0434j0355r708p994n912l955j962J38J961L180L880M485
53303A131648N619P633R993J1593J2170J2895J4983J8121K0911K2544K3422K4242
53291A315774K5181K5997K6600K7243K8157K8979K8806K7231K5116K3621K2540
$$ plain form
53372 2870433 2887908 2900422 2907716 2909852 2906664 2897606 2882108 2859895 2831146 2796527 2756898 2712921
53360 2712921 2665178 2614604 2562340 2509072 2455023 2400638 2346647 2293360 2240653 2188969 2139518
53349 2139518 2092983 2048626 2005232 1962377 1920226 1878643 1837258 1796083 1755372 1715101 1675114
53338 1675114 1635675 1597390 1560782 1526243 1494163 1464744 1437917 1413624 1391802 1371901 1352975
53327 1352975 1334607 1317134 1300628 1284403 1268079 1252316 1237637 1223266 1208235 1193168 1179708
53316 1179708 1168324 1157890 1147535 1137827 1129833 1123921 1119966 1118004 1118142 1120103 1123283 1127163 1131648
53303 1131648 1137267 1144900 1154893 1166486 1178656 1191551 1206534 1224655 1245566 1268110 1291532 1315774
53291 1315774 1340955 1366952 1393552 1420795 1448952 1477931 1506737 1533968 1559084 1582705 1605245
53280A605245K0522J7167J3790J1481R433O246K117j483l938o042q477j0881j2736
53267A642444j4229j5849j7712j9697k1706k3476k4554k4902k5202k6121k7506
53256A401490k8658k9254k9535k9641k9302k8379k7358k6840k6740k6385k5524
53245A093874k4737k4648k5075k5322k5102k4777k4694k4731k4489k3675k2214
53234H24410k0270j8247j6604j5564j4959j4350j3265j1594r864q891q946r481
53222F62375r827r910j0017j0343j1054j2357j3948j4881j4651j3995j3833j3782
53210E13777j2756j0849r436r251r502r260q690q289p876p103o355o262o703p002
53196C94443o930o832o889o796o281n473m709m161l760l360k967k716k652k602
$$ plain form
53280 1605245 1625767 1642934 1656724 1668205 1677638 1683884 1686001 1684518 1680580 1674538 1666061 1655180 1642444
53267 1642444 1628215 1612366 1594654 1574957 1553251 1529775 1505221 1480319 1455117 1428996 1401490
53256 1401490 1372832 1343578 1314043 1284402 1255100 1226721 1199363 1172523 1145783 1119398 1093874
53245 1093874 1069137 1044489 1019414 994092 968990 944213 919519 894788 870299 846624 824410
53234 824410 804140 785893 769289 753725 738766 724416 711151 699557 689693 680802 671856 662375
53222 662375 652548 642638 632621 622278 611224 598867 584919 570038 555387 541392 527559 513777
53210 513777 501021 490172 480736 471485 461983 452723 444033 435744 427868 420765 414410 408148 401445 394443
53196 394443 387513 380681 373792 366996 360715 355242 350533 346372 342612 339252 336285 333569 330917 328315
53182C28315k492k508k666k519j778j026j057j597j548o53J0m48j480j965j680
53167C04908j309j357j711j960j730q93J20M90j29j183j880k052j987j857j709
53152B85761j655j684j467q88m28o10j180j367q35j9M37K81k05m33oP70J124P55
53134B78351K14J02K56K29J17L32P40P86M70L97P79R68M62k44l36J40M24K51K19
53115B84657P15J150Q22J49K24J227K035J751Q24J97n7n32j296j752j566j001
53099B87547l71J55K35m25j426j934j747j494j583j691j520j341j390j290o19
53084B71106L46Q76O18j32p36o85q6L37R1l23p9O17P29O0l50J39P21N14K6K71
53064B74060J065J308O75o0k59j16l8j71o27j510k456k706j953q15j40q3o1L93
$$ plain form
53182 328315 325823 323315 320649 318130 316352 315326 314269 312672 311124 310471 310481 310033 308553 306588 304908
53167 304908 303599 302242 300531 298571 296841 295948 296068 296558 296429 295246 293366 291314 289327 287470 285761
53152 285761 284106 282422 280955 280067 279639 279029 277849 276482 275647 275628 276065 276346 276141 275708 275702 276472 277596 278351
53134 278351 278565 278667 278923 279152 279269 279601 280341 281127 281597 281994 282773 283741 284203 283959 283623 283763 284187 284438 284657
53115 284657 285372 286522 287344 287493 287717 288944 290979 292730 293554 293751 293694 293162 291866 290114 288548 287547
53099 287547 287176 287331 287566 287141 285715 283781 282034 280540 278957 277266 275746 274405 273015 271725 271106
53084 271106 271452 272328 272946 272814 272078 271393 271307 271644 271735 271412 271333 271950 272679 272739 272389 272528 273249 273763 273789 274060
53064 274060 275125 276433 277108 277048 276789 276673 276635 276464 275837 274327 271871 269165 267212 266397 266257 266174 266113 266506
53046B66506J011J138P07M61R65J669J500L41q07j151r30p44p87j025j437j618
53030B65799r44L88J168P12j48l15K7L8j99O5P43R25M31J65O90J394J509J165
53012B73613R29R14Q24N72L69L60M63M74K50j14k93n6M02O87O80O28P61J035J201
52993B83699J014M89P2L17J174J826J542N06m27o22l0R91J846K023J608J308J574
52976B98910J997J951J474J016O78L79M34J143J932J766N52o03p22L3Q12J016
52960C12768N52k57p81n32K92R88J134Q62L00n96j532j803j202n29o93j546k106
52943C05319j817j120q09j135j707k029j865j256m12L09N37K60l5R0L73J04q75
52926B93932j817j953j335n80p6O5k60r63j489j356q80q43j404j844j470l82P46
$$ plain form
53046 266506 267517 268655 269362 269823 270788 272457 273957 274298 273491 272340 271410 270666 269879 268854 267417 265799
53030 265799 264855 265243 266411 267123 266975 266660 266687 266725 266526 266591 267334 268259 268690 268855 269545 270939 272448 273613
53012 273613 274542 275456 276280 276852 277221 277581 278044 278518 278768 278654 278361 278305 278707 279394 280074 280702 281463 282498 283699
52993 283699 284713 285202 285274 285591 286765 288591 290133 290639 290212 289590 289560 290551 292397 294420 296028 297336 298910
52976 298910 300907 302858 304332 305348 306026 306405 306839 307982 309914 311680 312232 311629 310907 310940 311752 312768
52960 312768 313320 313063 312282 311750 312042 313030 314164 315026 315326 314730 313198 311395 310193 309664 308971 307425 305319
52943 305319 303502 302382 301573 300438 298731 296702 294837 293581 293169 293478 294015 294275 294240 294330 294703 294807 293932
52926 293932 292115 290162 288827 288247 288171 288236 287976 287013 285524 284168 283288 282445 281041 279197 277727 277345 278091
52909B78091J305J088L63k67l76j86k30o10q76p37m87n25p23n68J34R11J068M32
52891B77807l76n44J05J047J697J851J485O33l32p80n62k33j84r1L10M45k73j200
52873B80805j120LR05Q46M76N44P19M09Q5P90K579M215M539L606K354J611J578
52856C04944J954K205J792M71j425l120m020m218m260m420m474m204l796l550
52842B73879l424l150k625j876r28N3O18M43j74n92n68m77p47j316j693j457o78
52825B55288J20N33P48J164J562J201l5j177j319p06j45K27Q05J484J694J393
52809B62837J200J408J537J178O70O04J042J488J349L35j204k314k178j058j14
52794B66780j95j011j639j514q27k55l94j187j876j748r25j31J98K00P9j27k34
$$ plain form
52909 278091 279396 280484 280847 280580 280204 280018 279788 279178 278302 277565 277078 276553 275830 275262 275396 276307 277375 277807
52891 277807 277431 276887 276992 278039 279736 281587 283072 283705 283373 282593 282031 281798 281614 281523 281833 282278 282005 280805
52873 280805 279685 279688 280593 281439 281915 282459 283178 283587 283672 284462 287041 291256 295795 299401 301755 303366 304944
52856 304944 306898 309103 310895 311366 309941 306821 302801 298583 294323 289903 285429 281225 277429 273879
52842 273879 270455 267305 264680 262804 261876 261929 262547 262990 262816 262224 261656 261179 260432 259116 257423 255966 255288
52825 255288 255408 255941 256689 257853 259415 260616 260581 259404 258085 257379 257234 257461 258266 259750 261444 262837
52809 262837 264037 265445 266982 268160 268830 269434 270476 271964 273313 273648 272444 270130 267952 266894 266780
52794 266780 266585 265574 263935 262421 261594 261339 260945 259758 257882 256134 255209 255078 255276 255476 255555 255428 255194
52777B55194Q0P52J305J548J789K146K143J447N93L91Q13J002L97n92j214j333
52761B66461j426j741j836j172K5Q93R24M76J69J17N0j42l13l93l85j83K90P95
52743B62609R50O86K96J59N72J608K811L325K719J577Q58Q40J074J224J373J563
52727B84244J600J425J269J280J304J107O20om44l94M4L40J36l25o37p97r60j028
52709B88778q90q26j126j535j627j423j130o26J26M65k79j621k311j913j127n83
52693B72352j53L67P75R90J309J832K132J860J237P14N42P20R55O82k95j205j007
52676B83807K35J344J484R27K86k22n40n10k23n2p3oJ58R3j76k24k1j1k09l9O27
52655B86655J105J027R92J592K483K969K948K668K141J335M71l28j247k155k413
$$ plain form
52777 255194 255274 256026 257331 258879 260668 262814 264957 266404 266997 267388 268201 269203 269600 269008 267794 266461
52761 266461 265035 263294 261458 260286 260311 261204 262128 262604 262773 262890 262940 262798 262485 262092 261707 261524 261814 262609
52743 262609 263559 264245 264541 264700 265272 266880 269691 273016 275735 277312 278170 279010 280084 281308 282681 284244
52727 284244 285844 287269 288538 289818 291122 292229 292849 292843 292399 292005 292049 292389 292525 292200 291563 290766 289806 288778
52709 288778 287888 287062 285936 284401 282774 281351 280221 279595 279721 280186 279907 278286 275975 274062 272935 272352
52693 272352 272199 272566 273341 274331 275640 277472 279604 281464 282701 283415 283957 284677 285632 286314 286019 284814 283807
52676 283807 284042 285386 286870 287797 288083 287861 287321 286811 286588 286536 286463 286457 286615 286708 286532 286308 286287 286276 286067 286028 286655
52655 286655 287760 288787 289779 291371 293854 296823 299771 302439 304580 305915 306386 306058 304811 302656 300243
52640C00243j799j089j071j476j474r47n40o61r53p30L50J958L234L556L210K983
52624C04794L073K939K267J393N60m61j678k564k813k775k677k179j216m77n00
52609B97686r20j214j491j903k030j551r25o04k48M91J084R58O09P93J185J007
52593B92927N62P99J530J504L84n98m22L73O86M24L44Q17J440J712J601J347J017
52576C06447M75j74m28N5Q22J047N64Pk16m40j005j645j986k007j673p79L19O24
52558C00007j64r78q35k79l78r54r79l26J39O3l0J20J31j12j95n3k05q49j460
52539B92663j614j444j138o02O6M21K75M4J93O81J065R15R7r72j563j405r86p11
52521B85985j70J032K243K504K024J851K202K285J822J514J829K393K920L626
$$ plain form
52640 300243 298444 297355 296284 294808 293334 292387 291847 291186 290233 289503 289853 291811 295045 298601 301811 304794
52624 304794 307867 310806 313073 314466 315026 314565 312887 310323 307510 304735 302058 299879 298663 298186 297686
52609 297686 296766 295552 294061 292158 290128 288577 287652 287048 286800 287291 288375 289333 289942 290735 291920 292927
52593 292927 293489 294288 295818 297322 297706 297108 296686 297059 297745 298169 298513 299330 300770 302482 304083 305430 306447
52576 306447 306922 306748 306320 306375 307197 308244 308808 308815 308599 308159 307154 305509 303523 301516 299843 299064 299383 300007
52558 300007 299843 298865 298030 297751 297373 296419 295440 295114 295253 295316 295286 295406 295537 295425 295230 295177 294972 294123 292663
52539 292663 291049 289605 288467 287865 287931 288352 288627 288671 288864 289545 290610 291525 291622 290650 289087 287682 286696 285985
52521 285985 285815 286847 289090 291594 293618 295469 297671 299956 301778 303292 305121 307514 310434 314060
52507C14060M294M086K871J687J225Q01l60j765k496k632k844l084k828k183j728
52492C09104j468j000n80r76k145k965k550j208J93J090J330R85M94M79J013J437
52476C03233J243Q09Q28J271J463J142Q69J191J789J900J396J057J637K934M048
52461C26810M342L981L465L004K442J619O10m06j350k218k984l584l985m194m184
52446C23368l897l381k792k207j582r60o00o70r84j228j318j305j106o85l87n74
52430B99692j002j103q53q08j120j213p06m4K47L89Q59J504J687J195M76J07L48
52413B99655J044J711J939J927K309L280M344N237O411Q168R877J0829J1253J1622
52399C79606J1392R460N775J598j909m531o434p586q023q028p758p093o018m772
$$ plain form
52507 314060 318354 322440 325311 326998 328223 329024 328664 326899 324403 321771 318927 315843 313015 310832 309104
52492 309104 307636 306636 306056 305080 302935 299970 297420 296212 296405 297495 298825 299810 300304 300783 301796 303233
52476 303233 304476 305285 306113 307384 308847 309989 310858 312049 313838 315738 317134 318191 319828 322762 326810
52461 326810 331152 335133 338598 341602 344044 345663 346273 345867 344517 342299 339315 335731 331746 327552 323368
52446 323368 319471 316090 313298 311091 309509 308549 307949 307279 306295 305067 303749 302444 301338 300653 300266 299692
52430 299692 298690 297587 296734 295926 294806 293593 292887 292843 293090 293479 294338 295842 297529 298724 299200 299307 299655
52413 299655 300699 302410 304349 306276 308585 311865 316209 321446 327857 336025 345902 356731 367984 379606
52399 379606 390998 400458 406233 407831 405922 401391 394957 387371 379348 371320 363562 356469 350451 345679
52385C45679l582k589j930j516r04J00R66J130R72J267J930K189K028K385L729
52370C51854N326O265O432O061N225M187L503L172K354N97j226j944j600j187
52356C89019j208j264r49m32k0K92O43J000J212J218J128J156J464J975K410K551
52340D00195K476K421K593L087L839M602N088N295N580O360P728R365J0734J1492
52326D80855J1827J2307J3254J4358J5133J5576J6173J7186J8280J8780J8264
52315F51993J6947J5604J4993J5178J5662J6199J7067J8307J9255J9325J8865
52304H39395J8629J8692J8523J7932J7236J6615J5998J5446J5015J4288J2746
52293A020515J0533Q157N590K534m85k347k924l450m831o440p139o798o158n685
$$ plain form
52385 345679 342097 339508 337578 336062 335158 335258 336224 337354 338326 339593 341523 343712 345740 348125 351854
52370 351854 357180 363445 369877 375938 381163 385350 388853 392025 394379 394976 393750 391806 390206 389019
52356 389019 387811 386547 385598 385166 385146 385438 386081 387081 388293 389511 390639 391795 393259 395234 397644 400195
52340 400195 402671 405092 407685 410772 414611 419213 424301 429596 435176 441536 449264 458629 469363 480855
52326 480855 492682 504989 518243 532601 547734 563310 579483 596669 614949 633729 651993
52315 651993 668940 684544 699537 714715 730377 746576 763643 781950 801205 820530 839395
52304 839395 858024 876716 895239 913171 930407 947022 963020 978466 993481 1007769 1020515
52293 1020515 1031048 1039205 1044795 1047329 1046844 1044497 1041573 1038123 1033292 1026852 1019713 1012915 1006757 1001072
52279A001072n314m965m654m232l451k317j011L88J916L502M959O158P162Q222
52265A007435R524J0804J1492J1495J1568J2378J3490J3953J3704J3636J4230
52254A143709J5042J5609J6064J6483J6406J5455J3858J1991R907P690N645L793
52242A291652J693p58k869l945m144m115m137m161m303m835n742o642p109o978
52228A233607o489o123o086n992n371m387l560k934k121j165n75m62l49K4M76
52213A188493J068K128L351L941L992M680O502Q252Q660Q137P914Q166Q014P109
52199A270407O119N734O000O602P180P405P225O988O976P003O814O563O504O481
52185A364001O158N425M297K738R74n08j715l395o033q936j0926j1593j1390j0856
$$ plain form
52279 1001072 995758 990793 986139 981907 978456 976139 975128 975516 977432 980934 985893 992051 999213 1007435
52265 1007435 1016959 1027763 1039255 1050750 1062318 1074696 1088186 1102139 1115843 1129479 1143709
52254 1143709 1158751 1174360 1190424 1206907 1223313 1238768 1252626 1264617 1274524 1282214 1287859 1291652
52242 1291652 1293345 1292587 1289718 1285773 1281629 1277514 1273377 1269216 1264913 1260078 1254336 1247694 1240585 1233607
52228 1233607 1227118 1220995 1214909 1208917 1203546 1199159 1195599 1192665 1190544 1189379 1188804 1188342 1187993 1188017 1188493
52213 1188493 1189561 1191689 1195040 1198981 1202973 1207653 1214155 1222407 1231067 1239204 1247118 1255284 1263298 1270407
52199 1270407 1276526 1282260 1288260 1294862 1302042 1309447 1316672 1323660 1330636 1337639 1344453 1351016 1357520 1364001
52185 1364001 1370159 1375584 1379881 1382619 1383593 1383085 1381370 1377975 1371942 1363006 1352080 1340487 1329097 1318241
52171A318241j0313r994r830r320q136o554m992l385j572K08J592K570L202L311
52157A265028K961K737K872K694J610J57o88q71j048j434j748k046k524k698j801
52142A263201j06J069R27j7p94j058j070j240j830k721l322l037j784J38K466
52127A250822M809O586P785R455J2562J6522J9771K1719K3219K5033K6778K7710
52115A452771K7753K7271K6426K5173K3541K1707J9975J8744J8100J7462J6150
52104A695073J4280J2628J1585J0875J0303J0094J0270J0298R758Q799P720O409
52092A818092M530J923j313m918q470j1593j4191j6265j7640j8170j8113j7708
52080A696164j6612j4337j1268q486o481m793k980j205M90K599N225P426Q196
$$ plain form
52171 1318241 1307928 1297934 1288104 1278784 1270648 1264094 1259102 1255717 1254145 1254353 1255945 1258515 1261717 1265028
52157 1265028 1267989 1270726 1273598 1276292 1277902 1278059 1277371 1276500 1275452 1274018 1272270 1270224 1267700 1265002 1263201
52142 1263201 1263095 1264164 1265091 1265074 1264280 1263222 1262152 1260912 1259082 1256361 1253039 1250002 1248218 1248356 1250822
52127 1250822 1255631 1262217 1270002 1279457 1292019 1308541 1328312 1350031 1373250 1398283 1425061 1452771
52115 1452771 1480524 1507795 1534221 1559394 1582935 1604642 1624617 1643361 1661461 1678923 1695073
52104 1695073 1709353 1721981 1733566 1744441 1754744 1764838 1775108 1785406 1795164 1803963 1811683 1818092
52092 1818092 1822622 1824545 1823232 1818314 1809844 1798251 1784060 1767795 1750155 1731985 1713872 1696164
52080 1696164 1679552 1665215 1653947 1645461 1638980 1634187 1631207 1630002 1630492 1633091 1638316 1645742 1653938
52067A653938P835P671Q649J0590J2639J3961J4187J3630J3031J2798J2592J1985
52055A793506J1211J0836J0822J0430R168P305N332L288R64j583m114o707r709
52042A840749j3047j5933j7542j7920j7898j8169j8680j8986j8836j8276j7405
52031A648057j6286j5079j3983j3110j2445j1966j1648j1432j1249j1147j1272
52020A508440j1686j2111j2069j1453j0884j1064j1682j1505r955q099p461q261
52008A382210r598j0967j2585j4375j5790j6825j8128j9814k1172k1916k2739
51997A198301k4038k5098k5237k4764k4024k2465j9691j6722j5059j4882j5158
51986I71163j5132j4831j4491j4367j4832j5831j6588j6574j6347j6598j6980
$$ plain form
52067 1653938 1661773 1669444 1678093 1688683 1701322 1715283 1729470 1743100 1756131 1768929 1781521 1793506
52055 1793506 1804717 1815553 1826375 1836805 1845973 1853278 1858610 1861898 1862862 1861279 1857165 1850458 1840749
52042 1840749 1827702 1811769 1794227 1776307 1758409 1740240 1721560 1702574 1683738 1665462 1648057
52031 1648057 1631771 1616692 1602709 1589599 1577154 1565188 1553540 1542108 1530859 1519712 1508440
52020 1508440 1496754 1484643 1472574 1461121 1450237 1439173 1427491 1415986 1406031 1397932 1390471 1382210
52008 1382210 1372612 1361645 1349060 1334685 1318895 1302070 1283942 1264128 1242956 1221040 1198301
51997 1198301 1174263 1149165 1123928 1099164 1075140 1052675 1032984 1016262 1001203 986321 971163
51986 971163 956031 941200 926709 912342 897510 881679 865091 848517 832170 815572 798592
51975G98592j6850j6556j6810j7124j6251j3978j1274q793o376m023k050k42J991
51962F70256M426O105O760P155P807Q368Q349P540N552K177j692m601o320p920
51948G13962r762j0627r464o920m412k514r24P14K649N116P935J0387J1892J2487
51934G20519J2518J2321J2212J2086J1055Q309M410P76k169n235q714j1705j3619
51921G52764j5106j6732j7958j8224j7995j7766j7032j5264j3094j1455j0156
51910E81982q442o369m607l195j535O45L111N750Q534J1105J3084J4679J6370
51897F31112J8180J9559J9736J7789J3011N873j829q436j3661j7806k0493k1149
51885F41886k0271j9048j7759j5599j2169q339n264l191j535K81K334M476O692
$$ plain form
51975 798592 781742 765186 748376 731252 715001 701023 689749 680956 674580 670557 668507 668265 670256
51962 670256 674682 680787 687547 694702 702509 710877 719226 726766 732318 734495 732803 728202 721882 713962
51948 713962 704200 693573 684109 677189 672777 670263 669339 670053 672702 677818 685753 696140 708032 720519
51934 720519 733037 745358 757570 769656 780711 789020 793430 794206 792037 786802 778088 766383 752764
51921 752764 737658 720926 702968 684744 666749 648983 631951 616687 603593 592138 581982
51910 581982 573540 567171 562564 559369 557834 558479 561590 567340 575874 586979 600063 614742 631112
51897 631112 649292 668851 688587 706376 719387 725260 723431 714995 701334 683528 663035 641886
51885 641886 621615 602567 584808 569209 557040 548701 543437 540246 538711 538992 541326 545802 552494
51872E52494Q990J0851J1235R728P447N939N199L735Q81k244m562o560q897j0615
51858E83621j0220p947n573m131l091j721o8J492K707L306L129K420J379l21k776
51843E62206m991n805n514n390n714n589m827m524n211n793n170l873l023k484
51829D94298j250P46K408L008K950K752K152P32j146k547l026k950k809k631k266
51814D90421j831j519j153l88O87J642K315K829K940K093M15j122j936k559l542
51799D89292m304l966k789j792j165k28J036J554O18j067k287k634k537k403k249
51784D65079j869j052J02R79Q34l46j679k288k090j578j097o25k6P00J435K133
51768D58612L041M617O944R341J0857J1201J0793J0023Q879P349N658L842J543
$$ plain form
51872 552494 561484 572335 583570 593298 600745 606684 611883 615618 616499 614255 609693 603133 594236 583621
51858 583621 573401 565454 559881 555750 552659 550938 550870 552362 555069 558375 561504 563924 565303 564982 562206
51843 562206 557215 551410 545896 540506 534792 529203 524376 519852 514641 508848 503678 499805 496782 494298
51829 494298 493048 493794 496202 499210 502160 504912 507064 507796 506650 504103 501077 498127 495318 492687 490421
51814 490421 488590 487071 485918 485530 486217 487859 490174 493003 495943 498036 498451 497329 495393 492834 489292
51799 489292 484988 481022 478233 476441 475276 475048 476084 477638 478256 477189 474902 472268 469731 467328 465079
51784 465079 463210 462158 462260 463239 464073 463727 462048 459760 457670 456092 454995 454370 454344 455044 456479 458612
51768 458612 461653 466270 473214 482555 493412 504613 515406 525429 534308 541657 547315 551157 552700
51755E52700j357m264o400p614q339q853q965q476p558o557n604m588l478k495
51741D68152j857j417o38R20L146N451P280Q482R244R706R759R205Q032O413M420
51726E46298K071j81j340p98P55J795J510L20j116k706m396n529n465m515l596
51711E23107l169l038l081l475m122m474m082l030j666k20J199K505L637M470
51697E04561M650L798J981j12j599j974j310o4J310K509L134K532L24k803n430
51682E11507o747p197p503p591o980n826m699l534j634J087L541M496L801K404
51668D75125J451J572K691M257N715O892P889Q654Q807P912N727K336j683n247
51654E32098p270p431o336m862l356j502J128M407P479R238R006O792L164r31
$$ plain form
51755 552700 551343 547079 540679 533065 524726 515873 506908 498432 490874 484317 478713 474125 470647 468152
51741 468152 466295 464878 464240 465160 468306 473757 481037 489519 498763 508469 518228 527433 535465 541878 546298
51726 546298 548369 548188 546848 546050 546805 548600 550110 550430 549314 546608 542212 536683 531218 526703 523107
51711 523107 519938 516900 513819 510344 506222 501748 497666 494636 492970 492750 493949 496454 500091 504561
51697 504561 509211 513009 514990 514878 513279 511305 509995 509931 511241 513750 516884 519416 519740 516937 511507
51682 511507 504760 497563 490060 482469 475489 469663 464964 461430 459796 460883 464424 468920 472721 475125
51668 475125 476576 478148 480839 485096 490811 497703 505592 514246 523053 530965 536692 539028 537345 532098
51654 532098 524828 517397 511061 506199 502843 501341 502469 506876 514355 523593 532599 539391 542555 541624
51640E41624m391o616p986r311j0610j0932r667p564n993n473n354m693l159j247
51626D48628R6L23q1j20L82N01l90j617k168k047j932j941j663j166j011j338
51610D34456j699j892k163k483k333j409K8J538K774L392L251K881L115M128N350
51595D48934O383P419Q702J0127J1461J2360J2103R950O188K138j100l438n120
51582E26107n966n747m835l733k362l40K137M367O164Q240J1259J4744J7343J8333
51568E85711J8521J9383K1374K3530K4772K5032K4882K4684K4740K5827K8710
51557H47166L3137L7906M2024M5126M6806M6171M2395L5379K5711J4305K164r828
51545A208462k0974l0587l7977m2983m6220m8308m9029m7871m5117m1691l8021
$$ plain form
51640 541624 537233 530617 522631 513320 502710 491778 482111 474547 468554 463081 457727 453034 449875 448628
51626 448628 448724 449047 448966 448846 449228 449729 449339 447722 445554 443507 441575 439634 437971 436805 435794 434456
51610 434456 432757 430865 428702 426219 423886 422477 422505 424043 426817 430209 433460 436341 439456 443584 448934
51595 448934 455317 462736 471438 481565 493026 505386 517489 527439 533627 535765 534665 531227 526107
51582 526107 520141 514394 509559 505826 503464 503124 505261 509628 515792 524032 535291 550035 567378 585711
51568 585711 604232 623615 644989 668519 693291 718323 743205 767889 792629 818456 847166
51557 847166 880303 918209 960233 1005359 1052165 1098336 1140731 1176110 1201821 1216126 1218290 1208462
51545 1208462 1187488 1156901 1118924 1075941 1029721 981413 932384 884513 839396 797705 759684
51534G59684l3887k9448k5461k2285j9452j6624j4241j2751j1778j0589r009p454
51522E46705o361n849n733n623n325n173n553o153o205n577m929m606m128l159
51508D72331k260k040k184j932j193n05j81q9q0o1K40J122K443L661M321M310
51492D77903L751K859J876J011L97J05Ol37j269k490l269l316l050k977l228l797
51476D64175m694n617n962n564m949m600m362l985l712l814l920l447k533j964
51462D05052k170k805l226l071k340j240p7Q43J337J362J124J156J936L241M217
51447D05339M357M151M479N602P137Q771J0580J2609J4574J6070J6746J6214J4048
51434E40677J0267N809K204M44J37j3r07k492m442o734r268j1403j2543j2821
$$ plain form
51534 759684 725797 696349 670888 648603 629151 612527 598286 585535 573757 563168 554159 546705
51522 546705 540344 534495 528762 523139 517814 512641 507088 500935 494730 489153 484224 479618 475490 472331
51508 472331 470071 468031 465847 463915 462722 462217 462036 461947 461867 461806 462046 463168 465611 469272 473593 477903
51492 477903 481654 484513 486389 487400 487797 487902 487908 487571 486302 483812 480543 477227 474177 471200 467972 464175
51476 464175 459481 453864 447902 442338 437389 432789 428427 424442 420730 416916 412996 409549 407016 405052
51462 405052 402882 400077 396851 393780 391440 390200 390123 390966 392303 393665 394789 395945 397881 401122 405339
51447 405339 409696 413847 418326 423928 431065 439836 450416 463025 477599 493669 510415 526629 540677
51434 540677 550944 556753 558957 559401 559538 559525 558618 556126 551684 544950 535682 524279 511736 498915
51420D98915j2605j1688r749p409n803n085m320l025j833j214o00O11J910K364
51406D40469J938J395J264J582K352L591M919N709N618M847L993L741M378N407
51392D91203O048O258O797P997R212R895J0587J2198J4800J7851K1236K5244K9783
51379F69109L4373L8942M3915M9454N5118O0222O4056O5775O4618O0336N3096
51368A259014M3102L0716J6865K750j0881k3772l5437m4982n1896n6568n9741
51357A069170o1610o1752n9827n6136n1463m6481m1434l6378l1472k6910k2644
51346E73063j8608j5097j2594j1157j0336r803r555r401q756p326n595m271l494
51333D47070k982k565k254j946j576j368j673k541l667m586m822m132k863j774
$$ plain form
51420 498915 486310 474622 464873 457464 451661 446576 442256 439231 437398 436184 435584 436195 438105 440469
51406 440469 442407 443802 445066 446648 449000 452591 457510 463219 468837 473684 477677 481418 485796 491203
51392 491203 497251 503509 510306 518303 527515 537410 547997 560195 574995 592846 614082 639326 669109
51379 669109 703482 742424 786339 835793 890911 951133 1015189 1080964 1145582 1205918 1259014
51368 1259014 1302116 1332832 1349697 1352447 1341566 1317794 1282357 1237375 1185479 1128911 1069170
51357 1069170 1007560 945808 885981 829845 778382 731901 690467 654089 622617 595707 573063
51346 573063 554455 539358 526764 515607 505271 495468 485913 476512 467756 460430 454835 450564 447070
51333 447070 444088 441523 439269 437323 435747 434379 432706 430165 426498 421912 417090 412958 410095 408321
51319D08321j288j147r49p40p43r01r43p82n15k20O2L48Q44J645K339K294J561
51302D09186R08Q26J028J174J387J619J306L18l86R2J231J690J011o1p65j040
51286D19524j080r34o84n58o04n74j86N78J401J823J788J905K677L450K916R79
51270D32421q58j399j135r89o60O40K468L529L434K918K493J961J203L70o26j875
51254D43895k819k824k342k365k817k688j825j312j734k268k106j573j282j100
51240D14840p40n18p52j032q81n48m40k47N30J549J923J445P90N04L88j1o74j133
51222D14993j002m11Q0M3l60o07m46r3J18N4k36n08l55L69J244J768K047K499
51204D19197K988K943K406K204K773L536L820L739L655L394K638J686J132R59
$$ plain form
51319 408321 407033 405886 404937 404197 403454 402553 401610 400828 400313 400093 400155 400503 401347 402992 405331 407625 409186
51302 409186 410094 410920 411948 413122 414509 416128 417434 417752 417366 417458 418689 420379 421390 421329 420564 419524
51286 419524 418444 417510 416826 416268 415664 415090 414904 415482 416883 418706 420494 422399 425076 428526 431442 432421
51270 432421 431563 430164 429029 428040 427380 428020 430488 434017 437451 440369 442862 444823 446026 446396 445770 443895
51254 443895 441076 438252 435910 433545 430728 428040 426215 424903 423169 420901 418795 417222 415940 414840
51240 414840 414100 413582 412830 411798 410917 410369 409929 409682 410212 411761 413684 415129 415919 416423 416811 416800 416126 414993
51222 414993 413991 413580 413660 413703 413343 412736 412290 412197 412315 412369 412133 411625 411270 411639 412883 414651 416698 419197
51204 419197 422185 425128 427534 429738 432511 436047 439867 443606 447261 450655 453293 454979 456111 457070
51190D57070O44K9n34q18r71j000o06J77N41l15k101l470l371k153j048p25p19
51173D40630l86N8o3q04j492j631j386j071o42K0P57J238J350J228J120J283J784
51156D41993K372K669K565K190J585O49n13j551k246k586k499j881j053p22j216
51141D39756k026k404k136j476n60O41J898K626K472J743J095Q12O32K35k55n02
51125D42551m56l11j17J45J61l95j037o99Q25K319K651K146J827J838J674J518
51109D54640K117L306L867L209K182J753J803J820J930K441K915K641J833J556
51095D88013K386L690M332L745K200L51j200k080k223j917j727k005k426k251
51081D88888j249p4N53P16Q93R87M44o97j543j352l21Q32J676K217K615K957L262
$$ plain form
51190 457070 457714 457743 457209 456391 455420 454420 453814 453991 454532 454217 452116 448646 445275 443122 442074 441349 440630
51173 440630 440244 440302 440239 439435 437943 436312 434926 433855 433213 433233 433990 435228 436578 437806 438926 440209 441993
51156 441993 444365 447034 449599 451789 453374 454023 453510 451959 449713 447127 444628 442747 441694 440972 439756
51141 439756 437730 435326 433190 431714 431154 431795 433693 436319 438791 440534 441629 442441 443073 443308 443053 442551
51125 442551 442095 441784 441667 441812 441973 441578 440541 439842 440667 442986 445637 447783 449610 451448 453122 454640
51109 454640 456757 460063 463930 467139 469321 471074 472877 474697 476627 479068 481983 484624 486457 488013
51095 488013 490399 494089 498421 502166 504366 504717 503517 501437 499214 497297 495570 493565 491139 488888
51081 488888 487639 487565 488118 488834 489727 490714 491158 490461 488918 487566 487245 488077 489753 491970 494585 497542 500804
51064E00804L484L676M049M778N900P557J0018J3020J5393J5900J4411J1808R013
51051F19811O721N862P235J0424J3771J5756J6103J5449J4505J3662J2734J0961
51039G62994P713L418p03l868o098p462p810p558p924r791j2879j6189j8789j9855
51025F55199j8821j6078j3026j0855r544q261o407l926j174J139K348K615K940
51012E76149M081N806P374Q290Q418Q006P814Q555R888J0653J0485J0355J1092
50999F86966J2192J2725J2697J2671J2743J2660J2469J2197J1425R984Q645Q175
50987H25549Q176P696O676N778N203M733M699N653P099P797P639Q021R821J1978
50973I26518J2875J2425J2000J2652J4253J6338J9033K2791K7532L2459L6846
$$ plain form
51064 500804 504288 507964 512013 516791 522691 530248 540266 553286 568679 584579 598990 610798 619811
51051 619811 626532 632394 639629 650053 663824 679580 695683 711132 725637 739299 752033 762994
51039 762994 770707 774125 773422 769554 763456 755994 748184 740626 732702 722911 710032 693843 675054 655199
51025 655199 636378 620300 607274 596419 586875 578614 572207 568281 567107 568246 570594 573209 576149
51012 576149 580230 586036 593410 601700 610118 618124 625938 634493 644381 655034 665519 675874 686966
50999 686966 699158 711883 724580 737251 749994 762654 775123 787320 798745 808729 817374 825549
50987 825549 833725 841421 848097 853875 859078 863811 868510 874163 881262 889059 896698 904719 914540 926518
50973 926518 939393 951818 963818 976470 990723 1007061 1026094 1048885 1076417 1108876 1145722
50962A145722M0766M4763M8927N2765N5968N8827O1512O3390O3638O2278O0114
50951A758670N7693N4881N1374M7156M2431L7518L2929K9200K6510K4748K3933
50940B187043K4244K5493K6740K6739K4831K1402J7472J3693R882N610J053l294
50928B380908p653j3000j9735k6954l3529l9425m5393n1704n7847o3209o7452
50917A955007p0331p1755p1946p1138o9190o5975o1963n7849n3725m9196m4273
50906A267666l9587l5599l2163k8997k6154k3797k1851k0135j8614j7408j6578
50895I86783j5938j4980j3192j0664q179o455n413m531l639k981k580k132j468
50882H94631p28O0J092K396L625M404M731M931N322O002O818P590Q368R299J0315
$$ plain form
50962 1145722 1186488 1231251 1280178 1332943 1388911 1447738 1509250 1572640 1636278 1698556 1758670
50951 1758670 1816363 1871244 1922618 1969774 2012205 2049723 2082652 2111852 2138362 2163110 2187043
50940 2187043 2211287 2236780 2263520 2290259 2315090 2336492 2353964 2367657 2377539 2383149 2384202 2380908
50928 2380908 2373255 2360255 2340520 2313566 2280037 2240612 2195219 2143515 2085668 2022459 1955007
50917 1955007 1884676 1812921 1740975 1669837 1600647 1534672 1472709 1414860 1361135 1311939 1267666
50906 1267666 1228079 1192480 1160317 1131320 1105166 1081369 1059518 1039383 1020769 1003361 986783
50895 986783 970845 955865 942673 932009 923830 917375 911962 907431 903792 900811 898231 896099 894631
50882 894631 893903 893963 895055 897451 901076 905480 910211 915142 920464 926466 933284 940874 949242 958541 968856
50867I68856J1195J2080J3408J5145J6622J7576J8883K1543K5243K8703L1380
50856A180634L4054L7708M2468M7822N3299N8698O4174P0286P7611Q5991R4499
50845A847244J02347J09530J16480J23321J29703J35136J39296J42060J43222
50836B988339J42113J37691J29423J18022J04998R1441P7571O3425M9540L6773
50826C939336K5895J7603J2534J0871J2111J5530K0811K7824L5786M2986M7553
50815D208840M8388M5142L7556K5402R211r477k9235m9854p1768r4419j15970
50804D003816j34696j50044j62012j70271j74368j74308j70444j63205j53387
50795B551081j42219j30565j18415j05718r3253q2020p2109o2938n4301m6452
$$ plain form
50867 968856 980051 992131 1005539 1020684 1037306 1054882 1073765 1095308 1120551 1149254 1180634
50856 1180634 1214688 1252396 1294864 1342686 1395985 1454683 1518857 1589143 1666754 1752745 1847244
50845 1847244 1949591 2059121 2175601 2298922 2428625 2563761 2703057 2845117 2988339
50836 2988339 3130452 3268143 3397566 3515588 3620586 3712027 3789598 3853023 3902563 3939336
50826 3939336 3965231 3982834 3995368 4006239 4018350 4033880 4054691 4082515 4118301 4161287 4208840
50815 4208840 4257228 4302370 4339926 4365328 4374539 4365062 4335827 4285973 4214205 4119786 4003816
50804 4003816 3869120 3719076 3557064 3386793 3212425 3038117 2867673 2704468 2551081
50795 2551081 2408862 2278297 2159882 2054164 1960911 1878891 1806782 1743844 1689543 1643091
50785A643091l9326l2530k6172k0880j6925j3887j1380r509q526q427r026r973
50773A436530j0753j1120j1488j2450j3894j5142j5849j6301j6816j7455j8285
50762A276977j9306k0116k0221j9732j9104j8243j6643j4521j2879j2075j1079
50751A093058q737n240j789P88K635M396O587R254J1959J4315J6616J9585K3364
50738A186791K7277L0842L4505L8929M4043M9303N4501N9712O4644O8640P1362
50727A730549P2978P3751P3836P3485P3012P2369P1112O8920O5881O2115N7222
50716B495230N0489M1579L0899J9354P943k291j0312j5488j7971j8309j6642j2657
50704B551824o523O07P434J3599J9417K4734K8564K9818K7916K2580J3605J201
$$ plain form
50785 1643091 1603765 1571235 1545063 1524183 1507258 1493371 1481991 1472482 1463956 1455529 1446503 1436530
50773 1436530 1425777 1414657 1403169 1390719 1376825 1361683 1345834 1329533 1312717 1295262 1276977
50762 1276977 1257671 1237555 1217334 1197602 1178498 1160255 1143612 1129091 1116212 1104137 1093058
50751 1093058 1084321 1079081 1077292 1078080 1080715 1085111 1091698 1100952 1112911 1127226 1143842 1163427 1186791
50738 1186791 1214068 1244910 1279415 1318344 1362387 1411690 1466191 1525903 1590547 1659187 1730549
50727 1730549 1803527 1877278 1951114 2024599 2097611 2169980 2241092 2310012 2375893 2438008 2495230
50716 2495230 2545719 2587298 2618197 2637551 2645494 2643203 2632891 2617403 2599432 2581123 2564481 2551824
50704 2551824 2545301 2545908 2553342 2566941 2586358 2611092 2639656 2669474 2697390 2719970 2733575 2734776
50692B734776j3680k9615m5346o0037p3098q3891r1682r5958r6791r4747r0404
50681A959527q4142p6467o8203o0063n2239m4605l7135k9827k2529j5142p899
50670A461276j129N035J0456J4777J7760J9570K0389K0098J8806J7299J6337J5767
50658A636441J4983J4006J3443J3506J3874J4343J4916J5248J4995J4729J5592
50647A796076J7732K0042K1827K3897K7352L1937L6385M0046M3393M7040N0936
50636B156663N4620N7764O0103O1086O0137N7436N4203N1699M9985M8241M6302
50625B758239M4944M3982M0950L2880J9241K261j5294l1487m4530n2500n4662
50614B744024n2235m7092m0253l2134k3596j5859r593m721j029J378K114P70k827
$$ plain form
50692 2734776 2721096 2691481 2646135 2586098 2513000 2429109 2337427 2241469 2144678 2049931 1959527
50681 1959527 1875385 1798918 1730715 1670652 1618413 1573808 1536673 1506846 1484317 1469175 1461276
50670 1461276 1460147 1465182 1475638 1490415 1508175 1527745 1548134 1568232 1587038 1604337 1620674 1636441
50658 1636441 1651424 1665430 1678873 1692379 1706253 1720596 1735512 1750760 1765755 1780484 1796076
50647 1796076 1813808 1833850 1855677 1879574 1906926 1938863 1975248 2015294 2058687 2105727 2156663
50636 2156663 2211283 2269047 2329150 2390236 2450373 2507809 2562012 2613711 2663696 2711937 2758239
50625 2758239 2803183 2847165 2888115 2920995 2940236 2942497 2927203 2895716 2851186 2798686 2744024
50614 2744024 2691789 2644697 2604444 2572310 2548714 2532855 2523262 2518541 2517512 2518890 2521004 2521774 2518947
50601B518947q555j6286k5978l7081m8004n6975o3573o8727p3086p6107p6995
50590A967580p5816p3174o9458o4947o0091n5109m9727m3828l8025l3058k8954
50579A375393k5285k2012j9514j7854j6478j4735j2456j0058q105o583m737j963
50567A215613J183L416M287M791O155Q529J1131J3237J4686J5809J7269J9636
50555A335742K2863K6337K9575L2406L4466L5155L4405L2896L1174K9083K6511
50544A670613K4080K2573K2094K2280K3031K4561K7012L0478L5073M0623M6565
50533A988983N2467N8396O4534P0900P7683Q5325R3865J02655J11096J19167J26771
50522B951842J33207J37783J40526J41556J40333J36181J29170J19793J08031
$$ plain form
50601 2518947 2510392 2494106 2468128 2431047 2383043 2326068 2262495 2193768 2120682 2044575 1967580
50590 1967580 1891764 1818590 1749132 1684185 1624094 1568985 1519258 1475430 1437405 1404347 1375393
50579 1375393 1350108 1328096 1308582 1290728 1274250 1259515 1247059 1237001 1228896 1222313 1217576 1215613
50567 1215613 1216796 1220212 1224499 1229290 1235445 1243974 1255105 1268342 1283028 1298837 1316106 1335742
50555 1335742 1358605 1384942 1414517 1446923 1481389 1516544 1550949 1583845 1615019 1644102 1670613
50544 1670613 1694693 1717266 1739360 1761640 1784671 1809232 1836244 1866722 1901795 1942418 1988983
50533 1988983 2041450 2099846 2164380 2235280 2312963 2398288 2492153 2594808 2705904 2825071 2951842
50522 2951842 3085049 3222832 3363358 3504914 3645247 3781428 3910598 4030391 4138422
50513D138422R3497P6306N7064L6239J4171q308l0054n0421o9301q6268j00192
50502D071155j09946j15151j16130j13327j06872r6636q2821o6457m8962l1135
50492C183718j2992N131K1834L5372M4665M9193M8360M1603K8975J1225j0410
50481C446674l4063n7419p8572r6640j11195j21650j27740j30155j29907j27394
50471B431939j22664j16297j09156j01483r3059q4172p5641o7924o0883n4419
50461A546241m8624m3266l7874l2445k7456k3048j8855j4726j0957p603m255p29
50449A276403K548N245P658J0180J2626J4536J5820J6682J7107J6884J6057J4974
50437A426720J3768J2152R851P129M684K988J946J253R07J126J880K866L893N036
$$ plain form
50513 4138422 4231919 4308225 4365289 4401528 4415699 4407391 4377337 4326916 4257615 4171347 4071155
50502 4071155 3961209 3846058 3729928 3616601 3509729 3413093 3330272 3263815 3214853 3183718
50492 3183718 3170726 3175857 3197691 3233063 3277728 3326921 3375281 3416884 3445859 3457084 3446674
50481 3446674 3412611 3355192 3276620 3179980 3068785 2947135 2819395 2689240 2559333 2431939
50471 2431939 2309275 2192978 2083822 1982339 1889280 1805108 1729467 1661543 1600660 1546241
50461 1546241 1497617 1454351 1416477 1384032 1356576 1333528 1314673 1299947 1288990 1281387 1277132 1276403
50449 1276403 1278951 1284196 1291854 1302034 1314660 1329196 1345016 1361698 1378805 1395689 1411746 1426720
50437 1426720 1440488 1452640 1462491 1469620 1474304 1477292 1479238 1480491 1481398 1482524 1484404 1487270 1491163 1496199
50423A496199O360P869R736J2151J4848J7287J9451K2004K5449K9640L4349L9668
50411A735011M5441N0885N5340N9021O2481O5656O8014O9261O9411O8336O5874
50400B414731O2096N7132N0957M3761L6076K7973J8569P025o232j9916l3168m5685
50388B613319n6865o5799p2090p5999p7694p6989p3883o8735o1831n3266m3279
50377A886889l2375k1163j0410r72O848J3503J9171K2707K2475J8092J0687J630
50365A937082q229j8155k7425l5798m3318m9517n3557n5384n5927n5922n5210
50354A478640n3511n1206m8875m6577m4005m1026l7725l4237l0803k7710k4997
50343A037968k2413j9736j6881j3791j0565p588n115k796j76K497M571O012P431
$$ plain form
50423 1496199 1502559 1510428 1520164 1532315 1547163 1564450 1583901 1605905 1631354 1660994 1695343 1735011
50411 1735011 1780452 1831337 1886677 1945698 2008179 2073835 2141849 2211110 2280521 2348857 2414731
50400 2414731 2476827 2533959 2584916 2628677 2664753 2692726 2711295 2718320 2712088 2692172 2659004 2613319
50388 2613319 2556454 2490655 2418565 2342566 2264872 2187883 2114000 2045265 1983434 1930168 1886889
50377 1886889 1854514 1833351 1822941 1821969 1828817 1842320 1861491 1884198 1906673 1924765 1935452 1937082
50365 1937082 1928853 1910698 1883273 1847475 1804157 1754640 1701083 1645699 1589772 1533850 1478640
50354 1478640 1425129 1373923 1325048 1278471 1234466 1193440 1155715 1121478 1090675 1062965 1037968
50343 1037968 1015555 995819 978938 965147 954582 946994 941879 939083 938907 941404 945975 951987 959418
50330I59418R051J0493J1670J3118J5124J7317J9391K1393K2843K2457J9448J4625
50318A156348R561N145J518j167k764l690m621n632o220o125n586m800l683k307
50304A125977j130n49m57l44K46J409K866M291N725P474R419J0752J0945J0871
50290A187495J2188J5322J8774K1086K3043K6774L2538L7306L7147L0584J9188
50279A461445N697p461j8278k5306k8346k8427k6687k3709j9961j6112j2519r040
50267A251296n742l255j997j640j774k444l525m254m077l481l248l373l404l453
50253A205629l969m792n260n138m735m301l856l429k801j392R40L359N019O209
50239A181483P717R544J1300J3357J6382J9897K2578K4026K4957K5578K5141K3470
$$ plain form
50330 959418 968469 978962 990632 1003750 1018874 1036191 1055582 1076975 1099818 1122275 1141723 1156348
50318 1156348 1165909 1171054 1172572 1171405 1168641 1164951 1160330 1154698 1148478 1142353 1136767 1131967 1128284 1125977
50304 1125977 1124847 1124298 1123841 1123497 1123743 1125152 1128018 1132309 1138034 1145508 1154927 1165679 1176624 1187495
50290 1187495 1199683 1215005 1233779 1254865 1277908 1304682 1337220 1374526 1411673 1442257 1461445
50279 1461445 1467142 1459681 1441403 1416097 1387751 1359324 1332637 1308928 1288967 1272855 1260336 1251296
50267 1251296 1245554 1242299 1240302 1238662 1236888 1234444 1230919 1226665 1222588 1219107 1215859 1212486 1209082 1205629
50253 1205629 1201660 1196868 1191608 1186470 1181735 1177434 1173578 1170149 1167348 1165956 1166896 1170255 1175274 1181483
50239 1181483 1189200 1198744 1210044 1223401 1239783 1259680 1282258 1306284 1331241 1356819 1381960 1405430
50227A405430K1545J9997J8188J5569J2997J1676J1395J0655Q318M456k20n219
50215A534787j0618j6713k3251k9030l2754l4232l4292l3514l1653k8426k4222
50204A236082j9756j5586j2270j0420j0337j1856j4622j8080k1324k3471k4366
50193A053994k4362k3542k1815j9638j7794j6298j4506j2539j1516j1918j2580
50182H67486j2012j0211q443p709p879q155p876p070o292n900n510m664l653l168
50168G68944l177k982k321j612j119p38n31n42r9J443L159L233J553K63R81K874
50152G69329M364N427O881Q462R117Q693Q001P393O468N058L523K045N08r18j762
50137H42589j937j858j782j419k55J883M510O747Q131R180J0661J2387J3442J3711
$$ plain form
50227 1405430 1426975 1446972 1465160 1480729 1493726 1505402 1516797 1527452 1535770 1540226 1540006 1534787
50215 1534787 1524169 1507456 1484205 1455175 1422421 1388189 1353897 1320383 1288730 1260304 1236082
50204 1236082 1216326 1200740 1188470 1178050 1167713 1155857 1141235 1123155 1101831 1078360 1053994
50193 1053994 1029632 1006090 984275 964637 946843 930545 916039 903500 891984 880066 867486
50182 867486 855474 845263 836820 829111 821232 813077 805201 798131 791839 785939 780429 775765 772112 768944
50168 768944 765767 762785 760464 758852 757733 756995 756464 755922 755823 757266 760425 763658 765211 765474 766455 769329
50152 769329 773693 779120 786001 794463 803580 812273 820274 827667 834135 839193 842716 844761 845269 844351 842589
50137 842589 840652 838794 837012 835593 835338 837221 841731 848478 856609 865789 876450 888837 902279 915990
50123I15990J4263J5940J8421K1197K4514K8660L3062L6911M0049M2515M3900
50112A235422M4008M3602M3622M4091M4526M4940M5613M6226M6090M4856M2283
50101A725279L7731L0756K1870J1938J196j0228k1310l0698l8121m4167m8761
50090A635485n1055n0824m8983m6329m2723l7859l2165k6511k1487j7336j4165
50079A246048j1893j0215q901p970p436p042o352n106l501k106j350j115j055
50066A172006j242k011l161l985m251m587n486o611p487q270r214r969j0088r826
50052A085818r739r799r521q720p544o054m338k782j648n80R67L052N344P602
50038A042058R559J0801J1296J1707J2621J3749J4411J4455J4188J3723J3014
$$ plain form
50123 915990 930253 946193 964614 985811 1010325 1038985 1072047 1108958 1149007 1191522 1235422
50112 1235422 1279430 1323032 1366654 1410745 1455271 1500211 1545824 1592050 1638140 1682996 1725279
50101 1725279 1763010 1793766 1815636 1827574 1828770 1818542 1797232 1766534 1728413 1684246 1635485
50090 1635485 1584430 1533606 1484623 1438294 1395571 1357712 1325547 1299036 1277549 1260213 1246048
50079 1246048 1234155 1223940 1215039 1207069 1199633 1192591 1186239 1181133 1177632 1175526 1174176 1173061 1172006
50066 1172006 1170764 1168753 1165592 1161607 1157356 1152769 1147283 1140672 1133185 1124915 1115701 1105732 1095644 1085818
50052 1085818 1076079 1066280 1056759 1048039 1040495 1034441 1030103 1027321 1025673 1025093 1026060 1029112 1034456 1042058
50038 1042058 1051617 1062418 1073714 1085421 1098042 1111791 1126202 1140657 1154845 1168568 1181582
50027A181582J2249J1544J0501Q614O018L389J312l4q77j785l168m656n584o269
50013A212836p924j0814j3544j4814j4881j4429j3185j0890q674p807p640o241
50001A081993k882J525O192J1192J6434K1350K5784K9977L3428L4873L3809L1211
49989A324886K8476K6342K4878K3709K2108J9596J6494J3244R300L503m325j3044
49977A495167k1344k8615l4704l9619m3424m5869m6306m4638m1911l9139l6033
49966A073565l2025k7945k5197k3513k1217j7834j4759j2996j1787j0162q371
49955H67759o931n373k999o3K699N096P375R486J1115J2000J1845J0320P657M843
49941I34829K830J840J472J142K88j304l317n516q369j2330j6595j9524k0453
$$ plain form
50027 1181582 1193831 1205375 1215876 1224490 1230508 1233897 1235209 1235175 1234298 1232513 1229345 1224689 1219105 1212836
50013 1212836 1204912 1194098 1180554 1165740 1150859 1136430 1123245 1112355 1103681 1095874 1088234 1081993
50001 1081993 1079111 1080636 1086828 1098020 1114454 1135804 1161588 1191565 1224993 1259866 1293675 1324886
49989 1324886 1353362 1379704 1404582 1428291 1450399 1469995 1486489 1499733 1509033 1512536 1508211 1495167
49977 1495167 1473823 1445208 1410504 1370885 1327461 1281592 1235286 1190648 1148737 1109598 1073565
49966 1073565 1041540 1013595 988398 964885 943668 925834 911075 898079 886292 876130 867759
49955 867759 860828 855455 852456 852393 855092 860188 867563 877049 888164 900164 912009 922329 929986 934829
49941 934829 937659 939499 940971 942113 942401 941097 937780 932264 923895 911565 894970 875446 854993
49928H54993k0204j9679j8855j7524j6043j4790j3650j2414j1137r700p664m964
$$ plain form
49928 854993 834789 815110 796255 778731 762688 747898 734248 721834 710697 700997 693333 688369
$$ [...]
##END NTUPLES=NMR SPECTRUM
##END=
