
##TITLE=AC1303_PERAH12115_6641754_p1tBAZZZUx
##JCAMPDX= 6.0         $$ Bruker NMR JCAMP-DX V2.0
##DATA TYPE= NMR SPECTRUM
##DATA CLASS= NTUPLES
##ORIGIN= BRUKER
##OWNER= Administrator
$$ 1.72 TOPSPIN		Version 2.1
$$ 2012-08-10 14:20:44.484 -0500  Administrator@TOPSPIN
$$ Compression mode = diff/dup
##.OBSERVE FREQUENCY= 400.02188249412
##.OBSERVE NUCLEUS= ^1H
##.ACQUISITION MODE= SIMULTANEOUS (DQD)
##.ACQUISITION SCHEME= undefined
##.AVERAGES= 8
##.DIGITISER RES= 22
##SPECTROMETER/DATA SYSTEM= spect
##.PULSE SEQUENCE= zg30
##.SOLVENT NAME= COFFEE_meoh
##.SHIFT REFERENCE= INTERNAL, COFFEE_meoh, 1, 14.98509
##AUDIT TRAIL= $$ (NUMBER, WHEN, WHO, WHERE, PROCESS, VERSION, WHAT)
$$ ##TITLE= Audit trail, TOPSPIN		Version 2.1
$$ ##JCAMPDX= 5.01
$$ ##ORIGIN= Bruker BioSpin GmbH
$$ ##OWNER= Administrator
$$ $$ C:\Bruker\TOPSPIN/data/COFFEE/nmr/AC1303_PERAH12115_6641754_p1tBAZZZUx/30/pdata/1/auditp.txt
$$ ##AUDIT TRAIL=  $$ (NUMBER, WHEN, WHO, WHERE, PROCESS, VERSION, WHAT)
(   1,<2012-08-10 14:20:36.531 -0500>,<Administrator>,<TOPSPIN>,<go>,<TOPSPIN 2.1>,
      <created by zg
	started at 2012-08-10 14:19:29.562 -0500,
	POWCHK enabled, PULCHK disabled,
       configuration hash MD5:
       6B 1B 68 BB D9 2E 58 E2 7F 35 AD 54 07 DF 0E 41
       data hash MD5: 64K
       7F B4 1A BC FE 45 81 BA E1 65 55 C6 AE 0A 89 EF>)
(   2,<2012-08-10 14:20:39.718 -0500>,<Administrator>,<TOPSPIN>,<proc1d>,<TOPSPIN 2.1>,
      <Start of raw data processing
       efp LB = 0 FT_mod = 6 PKNL = 1 PHC0 = 0 PHC1 = 0 SI = 32K 
       data hash MD5: 32K
       97 16 D4 C6 BC 2D 58 88 8F FE 6B 85 00 15 0B 79>)
(   3,<2012-08-10 14:20:40.062 -0500>,<Administrator>,<TOPSPIN>,<proc1d>,<TOPSPIN 2.1>,
      <pk PHC0 = 180.9943 PHC1 = 0 
       data hash MD5: 32K
       DF 35 07 47 57 FC BE D9 9F 12 1C A2 DE B3 30 09>)
(   4,<2012-08-10 14:20:40.281 -0500>,<Administrator>,<TOPSPIN>,<proc1d>,<TOPSPIN 2.1>,
      <abs ABSG = 1 
       data hash MD5: 32K
       88 B9 F1 7B BB 13 75 0A B9 65 8A 46 FF 89 AE 04>)
(   5,<2012-08-10 14:20:40.437 -0500>,<Administrator>,<TOPSPIN>,<proc1d>,<TOPSPIN 2.1>,
      <abs ABSG = 2 
       data hash MD5: 32K
       A7 39 A3 8C FF 00 74 19 53 20 59 CA FE 6C 10 32>)
(   6,<2012-08-10 14:20:40.468 -0500>,<Administrator>,<TOPSPIN>,<proc1d>,<TOPSPIN 2.1>,
      <abs ABSG = 3 
       data hash MD5: 32K
       CC 2A D3 F5 9A F5 33 0F C5 88 EB FC 06 0F 27 AE>)
(   7,<2012-08-10 14:20:40.500 -0500>,<Administrator>,<TOPSPIN>,<proc1d>,<TOPSPIN 2.1>,
      <abs ABSG = 4 
       data hash MD5: 32K
       9B 8E CE 34 C0 8A 2E F5 B9 2C 54 83 C1 A0 37 46>)
(   8,<2012-08-10 14:20:40.531 -0500>,<Administrator>,<TOPSPIN>,<proc1d>,<TOPSPIN 2.1>,
      <abs ABSG = 5 
       data hash MD5: 32K
       90 DA 00 40 EC B4 1F 8A 63 A3 51 62 BC 8A 5C 7C>)
$$ ##END=
$$ 
$$ $$ hash MD5
$$ $$ E8 F5 D8 25 6D 7A 11 D8 C7 72 F4 0D 04 E6 BE B6
##$RELAX= 
##$RELAX= 
##$RELAX= 
##$RELAX= 
##$RELAX= 
##$RELAX= 
##$RELAX= 
$$ Bruker specific parameters
$$ --------------------------
$$ [...]
150 150 150 150 150 150 150 150
##$TP07= 0
##$TPNAME0= <>
##$TPNAME1= <>
##$TPNAME2= <>
##$TPNAME3= <>
##$TPNAME4= <>
##$TPNAME5= <>
##$TPNAME6= <>
##$TPNAME7= <>
##$TPOAL= (0..7)
0.5 0.5 0.5 0.5 0.5 0.5 0.5 0.5
##$TPOFFS= (0..7)
0 0 0 0 0 0 0 0
##$TUNHIN= 0
##$TUNHOUT= 0
##$TUNXOUT= 0
##$USERA1= <user>
##$USERA2= <user>
##$USERA3= <user>
##$USERA4= <user>
##$USERA5= <user>
##$V9= 5
##$VALIST= <valist>
##$VCLIST= <CCCCCCCCCCCCCCC>
##$VD= 0
##$VDLIST= <DDDDDDDDDDDDDDD>
##$VPLIST= <PPPPPPPPPPPPPPP>
##$VTLIST= <TTTTTTTTTTTTTTT>
##$WBST= 1024
##$WBSW= 4
##$XGAIN= (0..3)
0 0 0 0
##$XL= 0
##$YL= 0
##$YMAX_a= 481209
##$YMIN_a= -618543
##$ZGOPTNS= <>
##$ZL1= 120
##$ZL2= 120
##$ZL3= 120
##$ZL4= 120
##$ABSF1= 14.98509
##$ABSF2= -5.573092
##$ABSG= 5
##$ABSL= 3
##$ALPHA= 0
##$AQORDER= 0
##$ASSFAC= 0
##$ASSFACI= 0
##$ASSFACX= 0
##$ASSWID= 0
##$AUNMP= <proc_prof1d_extract_pilot.lims>
##$AXLEFT= 0
##$AXNAME= <>
##$AXNUC= <1H>
##$AXRIGHT= 0
##$AXTYPE= 0
##$AXUNIT= <>
##$AZFE= 0.1
##$AZFW= 0.1
##$BCFW= 0
##$BC_mod= 0
##$BYTORDP= 0
##$COROFFS= 0
##$CY= 15
##$DATMOD= 1
##$DC= 0
##$DFILT= <>
##$DTYPP= 0
##$F1P= 0
##$F2P= 0
##$FCOR= 0.5
##$FTSIZE= 32768
##$FT_mod= 6
##$GAMMA= 0
##$GB= 0
##$INTBC= 1
##$INTSCL= 1
##$ISEN= 128
##$LB= 0
##$LEV0= 0
##$LPBIN= 0
##$MAXI= 10000
##$MC2= 0
##$MEAN= 0
##$ME_mod= 0
##$MI= 0
##$NCOEF= 0
##$NC_proc= -8
##$NLEV= 6
##$NOISF1= 0
##$NOISF2= 0
##$NSP= 0
##$NTH_PI= 0
##$NZP= 0
##$OFFSET= 14.98509
##$PC= 1
##$PHC0= 180.9943
##$PHC1= 0
##$PH_mod= 1
##$PKNL= yes
##$PPARMOD= 0
##$PPDIAG= 0
##$PPIPTYP= 0
##$PPMPNUM= 2147483647
##$PPRESOL= 1
##$PSCAL= 4
##$PSIGN= 0
##$PYNMP= <proc.py>
##$REVERSE= no
##$SF= 400.02
##$SI= 32768
##$SIGF1= 0
##$SIGF2= 0
##$SINO= 400
##$SIOLD= 32768
##$SPECTYP= <>
##$SREGLST= <1H.CDCl3>
##$SSB= 0
##$STSI= 32768
##$STSR= 0
##$SW_p= 8223.68421052631
##$SYMM= 0
##$S_DEV= 0
##$TDeff= 65536
##$TDoff= 0
##$TI= <>
##$TILT= no
##$TM1= 0
##$TM2= 0
##$TOPLEV= 0
##$USERP1= <user>
##$USERP2= <user>
##$USERP3= <user>
##$USERP4= <user>
##$USERP5= <user>
##$WDW= 1
##$XDIM= 32768
##$YMAX_p= 437544414
##$YMIN_p= -812210
##$CURPLOT= <Network HP LaserJet P1505>
##$CURPRIN= <$Network HP LaserJet P1505>
##$DFORMAT= <normdp>
##$LAYOUT= <+/1D_H.xwp>
##$LFORMAT= <normlp>
##$PFORMAT= <normpl>
##$SURQMSG= 1
$$ End of Bruker specific parameters
$$ ---------------------------------
##NTUPLES= NMR SPECTRUM
##VAR_NAME=  FREQUENCY,     SPECTRUM/REAL,   SPECTRUM/IMAG
##SYMBOL=    X,             R,               I
##VAR_TYPE=  INDEPENDENT,   DEPENDENT,       DEPENDENT
##VAR_FORM=  AFFN,          ASDF,            ASDF
##VAR_DIM=   32768,         32768,           32768
##UNITS=     HZ,            ARBITRARY UNITS, ARBITRARY UNITS
##FACTOR=    0.250966925370066, 1,           1
##FIRST=     8223.43324360094, -170659,      -55535
##LAST=      0,             30907,           -153078
##MIN=       0,             -812210,         0
##MAX=       8223.43324360094, 437544414,    0
$$ Real data points
##PAGE= N=1
##DATA TABLE= (X++(R..R)), XYDATA
$$ [...]
23882 -134401 75123 -11746 -364022 -205274 53269 43252 -108419 -73711 -4061 -61452 -268080
23871 -268080 -148524 -21535 11913 176170 178803 -160218 131483 171505 -39099 21945 -108208
23859 76446 -143112 -257956 -221418 -209587 9553 138630 164297 8722 191486 -213150 207160
23847 -132417 -136800 -88639 -82049 180389 201413 44593 17023 -50877 2550 -160031 -62028 269700
23834 -23681 -133982 109965 -2918 162870 -31893 -158624 -26248 140793 158684 -317050 -105879
23822 -51850 32250 -64839 -114120 -131290 120695 198880 -247941 204454 64053 -210132 84532
23810 -49709 361046 174145 -18318 -147817 149028 9753 193881 126554 -67556 -380899 -330154
23799 -330154 359873 -4309 293078 157701 91262 140846 -2547 -121052 -92439 -276948 -191351
23788 -191351 -150731 -46287 -155176 -116910 -67927 83187 -178140 332628 247245 -145270 -54376
23776 15825 -189 -143321 -108759 218235 206202 77952 -199955 204301 -179311 -3130 19062
23764 -73709 136670 282425 -328267 135870 135748 74084 -109299 223150 -435052 137971
23753 167919 123131 -118641 30464 -167716 96156 -20347 168882 -73536 -169681 229436 125907
23742 125907 -90246 -220050 16390 -114671 -60618 -131955 -47797 -151990 8528 -128359 -44698
23730 -334556 -189593 -21191 65590 308070 10463 39039 -45172 74048 -467069 147573 203881
23719 203881 -24069 -19773 -63078 152094 236532 102661 112088 89844 161977 -385750 -171816
23707 76246 34840 -35517 28395 -339848 318001 -43802 -232866 -9767 -329804 60488 223617
23696 223617 309330 127371 107024 124334 321324 -148574 -199109 49962 21476 -80230 -474048
23685 -474048 510024 -114189 75833 131357 -209864 201542 111707 -225009 155017 129085
23675 129085 374838 141137 -26831 -45524 -269249 149232 -164526 -117870 -194747 -220846
23665 -220846 178367 47327 -54020 -293430 25199 -269011 -108487 -289018 -29723 -71473
23655 -71473 -25167 110752 156587 149247 137929 -95894 -61845 318175 122641 -36323 -323199
23644 -323199 -1955 -158699 -83058 -216405 -64912 183495 297422 126704 81483 44847 279
23632 105718 73477 -145119 -182635 -184921 82297 -33523 -363666 -435036 -136505 -101705 -20918
23620 -74613 27578 7960 -343569 -56555 -172414 -19228 201 -64663 -81770 -435071 70661 -123497
23607 -91355 -75988 188490 42482 -4123 -100675 250448 -151697 93902 117219 -131824 -104197
23596 -104197 130373 -109314 -104567 131914 132488 -213591 217362 492788 250473 82980 -146524
23584 37253 -228438 58861 -141768 -165623 294325 -107969 -108532 123053 65654 121406 -32925
23572 142221 -12369 131873 111057 30367 43127 61339 -25021 80595 197854 -54947 -67919
23561 -67919 -88344 -400281 -321706 -358447 -67334 164217 -177721 -217493 142412 344886 214175
23550 214175 -19581 145573 -142832 -64305 -214415 -198752 280872 -39582 12966 -214608
23539 1765 243875 -19246 -179819 294668 253590 -169329 -29706 4369 -221779 -292418 127880
23527 67462 20056 -176700 21061 49957 230491 65767 -124207 -17975 -42266 -241709 -103802
23515 188935 -92558 130186 -108139 -127337 -11981 -226828 -80700 -62157 99140 -287238 49012
23503 62933 -240091 -41557 -27210 -137583 216180 274174 -72299 358520 247398 216549 -160304
23491 53905 66381 -280829 -130374 -42602 -122338 -141183 103244 -369922 4415 101502 -259441
23479 -107972 98041 -30778 -10999 -230064 -171136 1335 -145647 -41751 -103836 -179493 -2351
23467 -128680 134931 -217099 6196 -5313 -167723 -37266 -11784 -126148 4386 -10771 -289046
23456 -289046 92319 81048 100849 13954 451603 48716 -366549 16415 14193 -29480 138327
23444 20805 -18944 -188692 -197714 124228 -295207 147768 10983 -262468 261960 -41300 71910
23432 -86248 19118 -41484 -76157 -517204 27908 26457 267454 260579 -50516 -5275 88507 -69274
23419 -87011 -363670 -17818 147459 187327 161310 -146171 -133894 392880 45894 50296 15453
23407 -146599 -144714 -34654 -35601 -8454 194634 -84533 -81103 210887 271680 -226177 -1814 273469
23394 -264192 408548 -661052 155414 -193242 -154317 -183089 -209710 -201449 55421 -182083 -171115
23383 -171115 1090 -162242 -157083 10107 -155800 77067 -162261 -97115 176867 -103201 74194
23371 -380899 186584 97269 -84011 78857 -268776 54991 -239668 171832 -17076 231663
23360 -190022 82875 -191753 -72782 -238979 101100 -160371 100826 -279896 131672 -45336
23349 -152569 152106 10987 -104643 -344824 149370 70304 102540 26970 -219155 -129287
23339 -129287 -268193 304872 -11931 23344 -37591 -267787 105564 53808 -191719 386350
23328 57798 -50143 -53920 -208082 -26923 -55730 97473 156037 -187034 256002 192203 -174273
23316 -100395 -34996 97007 638 -5086 -313613 -152109 69962 -1312 -14254 43161 -41753 -94396
23304 -94396 -72369 -90571 27523 -187855 -216996 71869 -103786 -130948 410137 -14959 -62651
23293 -62651 13300 -40151 -63537 97009 31155 -251329 6 3096 3381 -192376 397055 -62776
23280 16220 184876 122759 -89211 16904 -129349 -48736 -295182 190281 78939 -148320 -58909
23268 -186734 -438666 -209854 16033 619517 -122387 -2910 28987 -59321 -20582 184415 -289284
23256 18647 172952 -177986 21792 -59843 -221187 103938 -65516 -44836 283924 273083 -80942
23244 -51253 -23875 82591 -261524 -241208 95629 -178778 120802 64182 207551 6049 -221973
23232 291153 -271299 140144 -18869 -174532 11035 -56035 328375 28112 -142253 33733
23221 93836 -21126 -169713 -121936 -154495 235333 -37562 -319161 -74772 -318932 -86916 67192
23209 245914 254286 26999 385652 -119293 39204 217485 -136693 69234 272706 187680 157490
23198 157490 -49911 -312046 42613 71358 270005 -50376 -196174 66490 90831 27673 301601
23187 301601 14269 -297212 12743 -224452 -380571 160448 -44876 16067 -213324 -186726
23177 -186726 -222832 118091 -42426 115081 -221621 -100476 -35373 102505 148185 -260583
23166 -229748 97225 -94577 115119 -309936 35240 135564 211366 -18499 90345 -83819 11383
23154 -157893 263070 -51154 -103961 170320 -261897 -110338 -279988 -173319 105654 -105204
23143 -176433 -17236 -196948 61493 12865 -2546 105125 -115183 14750 -24075 -78017 -66677
23132 -66677 -149085 -265603 -262306 118231 12286 165674 70805 -124556 252186 -45759 -147850
23121 -147850 229772 -2644 177513 -20472 -75912 -240878 -93331 -180546 -281807 -328906 -466459
23110 -466459 127835 -287234 -90946 41839 123916 396091 -72591 -139787 -217987 261097 137679
23099 137679 -261494 50381 78778 113826 12050 177137 -76923 208126 134338 -200651 -76307
23087 156534 106266 -96932 -1737 -55896 22279 88801 47465 121259 29162 -26966 348455
23075 2730 -248120 -150282 5269 -114367 -140363 -6646 530014 -230420 -147698 126085 241945
23064 241945 -52305 163863 -4130 60926 -194100 -227607 -25783 -127738 -234376 -228573 172022
23052 -236099 306382 -272732 -74892 77318 207132 -50903 141296 -216180 210019 2014
23041 -21679 227359 -309301 -33558 9527 166952 -134216 293882 52879 118510 15863 -34986
23029 -66082 -298839 -257257 -79690 59305 -75410 -9531 -121762 198038 149299 -8143 -64209
23018 -64209 -44197 240337 37857 -205383 -149211 117178 -76054 -195091 -175390 346548 -318108
23006 -139315 -252338 -139094 -208293 182595 -12302 82189 -3122 -202080 -171861 141623 -93735
22994 -282690 25671 -41190 84959 -51720 -123058 -747 272362 -85914 163627 90437 193041
22983 193041 -79885 -34358 40629 230676 -221008 -81804 216348 99322 -113619 371061
22972 -32226 -164321 -46768 158260 -145290 -170858 259580 18550 -212761 -158734 38527 157878
22961 157878 -72561 59157 -230645 -15974 -117191 -174365 344636 -160880 133850 -197339
22950 -75630 -83107 -171885 68133 190975 -91230 60470 41201 -203448 -366699 -87841 -51879
22939 -51879 -163327 34324 103088 -123362 -224374 -228240 -122988 108159 37350 83714 86619
22928 86619 153079 -6469 -89825 -11051 92036 -307612 180874 41500 34107 -42993 -98168 108366
22915 -104478 -13025 -162315 -297086 -26477 -40306 8560 40202 250698 -108867 474481 74548
22903 -241000 163898 -4524 53148 -171971 -135578 70484 32572 -304220 -134081 302154 49
22891 -25311 269844 -296169 -109804 -98002 -365362 -54963 -56640 78601 -142554 143107 -278982
22879 -162337 -68349 -155118 -14784 163451 123478 -2861 -191175 168769 167067 27350 -122925
22867 -32430 84600 20642 185200 86080 91688 76359 148722 -180827 -245544 -411485 -151085
22855 24534 -329405 -127470 92234 -278811 24131 197188 84856 -187204 -128787 -201549 -158725
22844 -158725 119705 -46298 54644 62614 -210181 95139 -72817 97594 186256 219282 -168409
22832 -74683 166025 126458 67620 189494 -223221 243844 33348 306313 333540 -49417 -156934
22821 -156934 162699 -103146 17143 132635 273035 -65961 234990 -192306 -42695 169095
22810 157289 -139759 -83484 137094 -79649 93942 -38520 136101 79851 26478 -35594 179039
22798 175915 206925 155180 74625 16570 -151297 52889 128636 90701 -169302 -156739 61717
22786 -156939 -131136 169025 4594 -112348 55542 -107974 -3706 -70232 -25256 155497 -7768
22774 -62304 -203314 263360 163852 -36685 94315 -71250 -37192 219945 -103725 -143535 93949
22762 73255 179951 505 -54269 -187315 -154513 54628 174140 -284877 -172462 -69815 140699
22750 -145136 -197862 -43077 238088 3213 51606 -24956 -315951 82952 73772 -434887 -102342
22738 -291837 11601 -27507 -107260 -143903 -308544 45837 -268396 122831 -41068 -343793 -21886
22726 -153325 -380623 -112443 -534776 -217261 14903 -355056 12987 -97998 270674 -170224
22715 207409 -192900 -127065 -95319 97934 131399 -4119 61488 -130136 -113692 -159633 25606
22703 43987 80369 -39198 -209544 122822 -146983 -74628 -29490 -99705 7268 -180867 -171842
22692 -171842 -363235 86728 -60810 103568 267875 -251891 -5229 -71389 -194728 286463
22681 12399 -114834 -117863 -98005 -338638 -271211 -137802 51781 813 -16380 24306 151919
22670 151919 -420995 9836 13205 -135196 -40052 -239053 195799 -85710 83628 -175958 -143320
22659 -143320 -167 235208 110418 -228532 22048 -218098 66018 -249967 -245214 -134323 289689
22647 13463 -362864 -324660 102295 285157 111144 45449 -13490 35454 -90824 -8944 111481
22635 -122474 43101 182635 97544 -222155 64873 -149627 25990 -195658 133522 -123086
22624 -309175 -42374 -124604 372955 -58994 -153891 -39268 124936 -180370 -238171 -196690 166062
22612 118745 -307088 -68311 63882 30053 63118 -125741 44662 -255841 -73296 -120216 -223768
22601 -223768 218643 -165734 42117 82931 19645 -130864 -297989 -100730 -134406 12498
22590 147316 172785 -131770 -52264 -73743 257110 -64411 -163743 -258640 -388675 -28456 -43200
22579 -43200 -175534 -85502 106396 -40200 -63864 311066 -73390 -183232 134911 -75568 212735
22567 -12481 100309 35157 123888 -162990 359994 125106 70539 31421 -290222 44705 48573
22556 48573 10757 -135016 119371 38710 -162913 -3111 -359700 104716 65969 -182447 23558
22544 -199696 143942 -13305 -321537 484933 -251857 -140035 7203 -39093 54558 77187 -193484
22532 -132906 -102244 74699 198022 -56905 170904 -4767 89105 -143827 -29290 45109 -168176
22520 33874 -283318 320 -15985 -256980 133855 -151707 157747 99653 -16701 206589 -213633
22508 36105 -136922 450413 69364 -130895 -180883 -184232 -87633 -429914 -168194 260056 -81444
22496 186310 -245618 -351140 178275 -175448 64468 -2346 -102329 -55443 -161123 -249226 -21625
22484 -356791 -79637 171927 1599 160496 -11107 -56948 106539 142852 -245755 166434 244205
22473 244205 -34699 400044 39109 -163230 -137541 -129590 -71129 194947 -43228 407304 -72548
22461 -220092 -55512 76054 75763 -230200 -99595 109604 -168013 -180859 -162796 193225 67323
22449 -195584 7497 -32517 36036 281340 -57142 -33049 105296 -123233 -81112 48002 47601
22438 47601 -69292 -276544 -371534 145281 91071 32346 28767 189584 115543 34878 -137 -25083
22426 -25083 -77740 37331 -75116 182664 -58086 -99805 -257005 105106 10780 -196423 -40113
22414 -40166 -8248 168058 -92499 39262 204542 312185 -17228 174249 -42125 -19442 -272766
22403 -272766 -67792 -200683 177090 13063 -267925 -27901 136759 -142651 96816 -238096
22392 -250302 -489572 -90727 -69271 96425 -199679 131385 -84794 152086 -103278 -284208
22382 -284208 51139 -148942 -409663 -85831 -21808 -245316 -89043 -290724 -290655 240544 4672
22370 -13409 131720 -25223 128399 -211693 248505 78671 -112595 306123 -239141 -64758
22359 41499 -150691 147484 158451 164310 218987 -225625 224187 240850 -25513 -32245 -80687
22348 -80687 -54340 -80092 -233780 -362685 11740 -188171 257393 56941 70092 49818 -230651
22336 -325276 118099 298800 45693 45719 -93057 -73987 -47424 -72954 -437015 56249 21845
22324 -112614 243548 -116478 2442 116981 -120657 215946 -175141 76521 -136839 -109575
22314 -109575 -148879 336172 60146 -78779 -34026 28773 -417703 -104718 39868 -262347 -70773
22302 -215354 215287 131276 -177098 3487 -58989 278774 -149338 3067 -40075 103212 -46850
22290 -69723 238813 -35861 258003 -89111 -93128 19023 -184727 -258099 112620 -95625 83778
22278 220232 191507 -49509 15809 33403 98629 -8180 -172397 -65530 21081 -119285 -310886
22267 -310886 -53773 -90450 -169219 -207237 -246258 -269848 -22576 -36217 -336105 139058 423198
22256 423198 -324279 -117497 -134595 77114 -84311 -159774 -59908 -151626 38485 -191492 -256209
22245 -256209 -307870 -240274 -142573 -229557 -72334 -268090 214976 -94898 -4025 208621 -489333
22233 -90686 -168654 12130 50086 -9404 -92581 -160871 -191591 217973 -22986 -57762 48762 18838
22220 -155439 -231207 -560670 -191143 -231626 181318 251002 -19605 174720 256972 55524 -3973
22208 171438 -50101 -153662 142626 -89541 374480 -137623 -150397 -99947 -101863 -77048 174933
22196 -103150 -178509 -172231 -156222 -161537 -6584 135179 14521 337235 293183 -17089 -1639 -47003
22184 -47003 -368392 47444 -62292 -76289 241713 59620 12288 390424 129355 230849 112518
22172 -42529 70768 254220 159472 -16019 -387207 225229 60873 91079 -61271 112479 106669
22161 106669 -76536 -209399 -251031 199575 -254648 2924 -242095 -170867 -182263 22946 105371
22150 105371 -62285 -18355 -46199 167260 -51292 241242 -307770 123486 -15195 -72658 -342262
22139 -342262 26663 -13876 -268821 -208052 -85473 -60167 -34969 253208 121076 138668 72765
22128 72765 178558 -184779 -105665 -310892 227375 75492 157956 -40603 -230467 -138838 177547
22116 -177277 36285 219312 75817 -175068 -303364 98870 -452332 12108 -370250 -477894
22106 -477894 -226259 70396 192127 -41832 -260249 188114 37608 -356766 -178771 59505
22095 -97646 -165222 46857 -38969 63186 126664 -333325 93418 137259 -190077 -106506 10364
22083 -133397 -61626 -216009 -38911 -196104 225182 -18068 37187 67576 -28944 -283681 -221187
22072 -221187 -12419 -59624 -152730 43432 135187 131329 -143495 -60993 36340 -170378 -34017
22060 -28075 -69223 7921 -251394 -32233 -187985 279437 -170654 -129053 -152772 56545 378485
22049 378485 274797 -33906 111142 -133775 215441 -206181 86737 200654 -80712 7429
22038 -329961 313337 -96879 -247133 -209567 -197542 -173729 -39735 85651 -98995 -99338 -363809
22027 -363809 52667 -315351 -205126 -32733 -3259 90253 -87476 -71295 58991 -203273 -197876
22016 -197876 -239881 -40646 38400 -51491 -172790 -14474 340970 -194224 97857 118527 -124531
22004 26611 -43996 61830 -125099 34737 224947 97775 -174981 -230219 -69479 -201837 -240119
21993 -240119 -12361 3756 -274801 33443 -98122 -6719 -98882 -150176 58461 -114948 -46327
21981 -157119 294215 150723 -29225 35194 -197515 -30312 -400785 43775 -162802 -15068
21970 -9242 356512 -13270 -172223 132530 -5796 -69841 -160132 301682 -26919 -68309 227034
21958 -210973 -50811 235808 -182283 -101554 -371522 10456 -163528 78945 -43726 4403 -107084
21946 194863 -19303 3946 65262 295957 -308839 -198526 -89415 327239 -147887 127556
21935 -237960 -176455 -302602 -374026 170608 -666 -182443 113327 191398 52677 -272158 -220214
21924 -220214 114934 -164918 -259231 -140717 -97769 58229 163535 86316 -110106 152837
21913 87037 -100490 -99181 -184665 -90995 -354856 -170836 153963 -430643 -8488 -94438 181110
21901 -238802 -111492 -235999 67994 -107971 -24104 -46065 63544 -332643 -48269 81865 32873
21889 -43665 333981 34235 -275264 -495147 -6385 -145049 -45499 -153005 -93118 284615 33228
21877 -199234 13476 -84224 64583 -217040 -331096 -222257 -86159 -132306 -51723 -2833 229583
21865 77682 -25096 43404 -9642 -349437 -18564 -104778 -166858 151080 365792 243474 51802
21853 -249709 281575 -143374 -42355 -181212 -306455 132543 -141982 -32281 -68707 60294
21842 -762063 -130727 -24848 111157 35611 -273406 11012 -191935 -398440 -92829 248611
21831 84746 -91817 -53368 222496 -468019 -194676 221083 235206 48656 -206245 62107 -41575
21819 222580 -324157 23061 108051 -241962 -411009 -5761 -128237 -34685 -76442 -48774 214108
21807 -314801 37591 -132436 -57978 -27450 -107931 -129307 74188 -73112 -206178 86610 -130471
21795 45592 -2075 73973 4996 -73505 -163308 -237901 -119336 -30845 -200080 215276 23156
21783 -194523 82050 -252510 -36256 -235247 -232177 152135 -21863 -58927 158844 -62891 -224848
21772 -224848 -79982 159723 -16556 -186135 -39766 -63386 -102793 135391 123386 96283 49004
21761 49004 51789 284736 -380729 51723 -116617 179258 -300175 26674 -273880 -121776
21750 77993 92479 -50059 -273805 -343070 -32430 19225 -73829 114029 108397 5745 -281368
21738 -229868 -64274 105626 -98045 14699 70809 310288 317294 107021 -337943 108763 32625
21726 -112968 -395368 104590 208871 -20808 -204201 -236230 -108189 72689 43540 10034
21715 139931 -176196 54992 198667 -145227 -208304 120813 -142052 -136022 -18535 -85627 248300
21703 60532 -42434 298387 174469 -148224 298780 140450 -121359 312327 22479 17728
21693 17728 284277 173460 -367759 28257 324380 89860 88297 -15569 -190886 -23118 117473
21681 -316803 -208985 -213230 -80431 -205623 -47016 -305811 -70540 -122866 -83699 119424 -23644
21669 140818 -171253 303097 -94510 -322525 67454 -36981 43103 168372 -24604 224226
21658 -194425 -9237 -91402 72305 65696 -123957 189905 131394 -115247 -155717 -139187 -209585
21647 -209585 220584 86601 -90779 -6915 -410402 321743 -28561 -105221 63152 -123714 -118354
21636 -118354 -242671 92844 -32366 -69915 52825 35791 -173845 91179 94269 152931 -81545
21624 -172723 -148718 146723 -63456 -92239 20537 110164 260602 -186444 -164418 -89355 130473
21612 -245845 254546 -380438 219688 -135715 121879 24987 -98490 153780 -484737 358727
21601 -77458 96773 333841 -284626 -177633 153613 -390214 104478 -480343 142199 166438
21591 166438 -322463 -53637 -49767 7142 -82979 -41905 208147 -82409 64901 -241208 -170496
21580 -170496 -138908 -26289 16407 -567680 487510 -21659 -100443 -111630 66356 -149365 143290
21568 40106 93509 121851 -246216 148918 -47387 15381 211736 167080 -183326 -145527 31978
21556 182680 71072 -33786 140229 -28976 -180408 -66152 140933 -168482 -44779 -242237
21546 -242237 -51380 200483 -318729 108479 -90125 -184581 174673 -47155 -97494 95093 -265256
21534 342466 -173988 -187488 170835 183273 -121539 -84415 -305790 -209680 28136 -210696
21523 -162315 -4956 -126249 -7058 -199206 -72174 -108422 203288 -239159 -400100 123093 -512665
21511 -13232 -148133 -373318 -195477 -201082 -100918 300574 120724 194626 -154448 6596 13103
21500 13103 -86796 -209632 -191474 31278 89033 -436532 71098 -214565 -95014 -226278 168810
21488 -267366 -50531 -151912 -178506 54147 -59557 -167682 94374 38077 326171 334483 -12706
21476 -299670 -222858 -224030 99994 107635 -41469 -274894 113408 205822 -428059 -422337 191631
21464 77984 -31272 347334 111647 10597 -1213 -71368 -132105 -73223 -30877 64755 91639
21453 91639 -35292 -235200 131712 -32731 75161 -44403 -45990 -110862 -34044 6301 -119916
21441 331645 132650 247866 -30051 477920 629089 260435 143870 351033 88803 23491
21430 -46284 189788 -100257 -132690 -71251 -137479 -24514 -149584 -81150 -337680 -89094 -366048
21419 -366048 -61239 100983 -116651 242624 218130 132362 38920 -44672 118014 -1920 25115
21407 108838 -85313 -6418 -121777 -18614 -33675 -65653 -178964 -242800 85471 -45176 54033
21395 -195704 -206278 -419742 44135 -109864 -21273 -283547 2661 -134327 46747 -285643 2885
21383 74821 -19590 10501 4263 17734 -220987 -448035 -10382 -130054 56909 -20254 -89239
21372 -89239 -1106 -28273 -185797 73572 90657 118725 149295 -135221 19709 110922 383386
21361 383386 -196362 -150601 57601 -135547 91402 44713 -140782 113318 -18356 -220551
21351 -220551 -123373 14375 -117539 -312455 122259 -198797 -224190 31316 -150681 -182782
21341 -182782 -58563 -259379 -230221 -414003 64118 -37235 -217852 165143 279050 2104 121981
21330 121981 -175468 168496 -19751 175127 -194566 93860 -140515 76350 77236 -120363 105766
21318 299894 -55200 120686 173173 -183473 -95058 164159 -227108 174773 -209065 49112
21307 -36562 151904 -87789 -73081 -45741 -227195 -34870 -68200 65598 -8933 79168 -398905
21295 -138238 -131492 -10730 -118162 -183663 -93550 23216 -193835 -71118 -260064 261259 -63423
21283 37250 -230041 48141 -219972 60091 205529 -306889 -125401 -117778 108541 179988 -81618
21271 41638 120856 -119214 3704 228632 -17664 -294048 95322 60144 -214565 -183779 -11760
21259 47473 351194 350360 -364789 -106590 -11294 48790 -82499 -287685 85695 -112120 79266
21247 61885 -187927 -53739 -110112 -20074 54019 -177579 159758 -108445 20585 -66830 -136455
21236 -136455 -1758 104774 137821 -62613 -32722 -95430 -400718 6578 -39738 -334266 -198939
21225 -198939 116681 -115238 110387 12682 -138540 -36641 146495 43060 -33180 -330944
21215 -330944 55458 55244 126521 -486037 -468071 -115062 172700 63090 9070 2610 -130886
21203 111629 -129450 -370160 93556 -2004 131066 -149696 447990 -239210 -191248 22298
21192 -269397 22515 -214272 5455 -186988 -72299 12777 -63521 -183884 -310301 -76087 226292
21180 -85696 -71571 -459494 -46617 -34526 -95257 24729 -358679 30523 -132718 -102548 280169
21168 -144313 355042 -203098 67760 40839 -117919 116732 116984 -102259 58036 165083 213353
21157 213353 -64410 -380593 -147689 56092 -153213 58934 34792 90329 162085 -280700 -221822
21146 -221822 -205843 -71403 -15985 78742 74748 139105 -117638 -56013 -43383 99756 19037
21134 51177 126770 -64587 -75751 273791 -18223 188945 -15253 -43658 165346 -165340 -22149
21122 -118904 182837 71764 -198253 -132380 -17588 -124268 -213683 -69309 -20110 -74361 -271147
21111 -271147 158289 117248 -97632 189081 -208042 87894 -265466 103716 -193951 204525
21100 -98911 293419 -28307 -243080 -172989 -343071 31119 175531 -306989 -203450 96457
21089 88444 176011 -123446 88022 -191769 109021 199158 -36775 -53111 -370229 -135759 8481
21077 99690 -394128 96499 -159506 54621 -304873 -207438 104185 19887 87799 -116529 78646
21065 -62252 -2350 -185393 176189 28102 29237 -182404 -155673 -372860 -39842 -97434 -6406
21053 81982 199392 -166188 26700 -172728 245696 61475 -432578 -407096 -95978 -272868
21043 -272868 -157760 -73971 180091 59253 50637 254535 -128670 -66132 -84737 -220180 227647
21031 -169516 25002 76307 -299049 -238580 -88086 -158873 -578490 48633 303607 110754 45180
21019 -94296 2467 -583 -169417 84905 -166935 -40551 -92735 42053 226355 -76206 65084 9500
21006 -262412 120816 105969 -166686 -378082 -10082 111548 -39118 -239888 251426 53846
20995 -144022 -378466 8474 -147140 151450 -12205 5469 -156394 -227435 -123360 -301588 -325816
20984 -325816 -161541 -2483 73856 -128654 -151286 -153532 -100956 -12416 112916 -56232 -522002
20973 -522002 -53054 26225 314225 122809 105084 -95700 244661 90865 134356 54987 147641
20962 147641 -105577 -43726 -87295 168558 37616 69154 48494 -220305 -64542 -131017 -99106
20951 -99106 -366664 -355352 64525 -326462 193498 -335122 78567 -398483 -102209 -901 -30111
20940 -30111 52191 239453 -60540 -56917 141989 -194966 -8207 180182 -265343 -36805 -374423
20929 -374423 -22363 70605 -268691 -65221 164839 -101234 -150043 151675 -190367 -140812
20919 -140812 67992 -150308 171913 -302755 149295 -254139 -369121 -85478 -328953 -262574
20909 -262574 67844 -8706 42909 108952 9776 -314612 -106018 -91624 4202 198987 -319620
20897 -220454 -104688 -253869 -142752 -173118 24449 -9800 -213360 33778 77179 -228291 18831
20885 -159601 83785 307184 -130915 181899 137072 124604 190907 313816 -1918 58137 -118197
20873 -79515 -262541 -53196 -83212 -291957 205017 218676 -296789 84814 -159552 -114784 57309
20861 -212798 -372705 135322 -152420 27191 -190394 -113116 173390 27922 -260074 -131048
20851 -131048 57378 -133751 99744 53485 -118137 12046 -129709 93890 -14680 -160738 -159675
20840 -159675 -142917 228425 -85458 -262548 33385 -233558 99137 336741 51212 -33070 -22680
20829 -22680 110525 323979 70586 191223 23741 -6843 -157088 -76244 -220144 -118779 -54849
20817 -46127 -245854 133545 102588 -111748 358809 -135602 -10277 -297984 -173602 -154477
20807 -154477 84893 -91781 5185 -80453 -217576 -285785 -113901 45893 195853 239443 -200425
20795 -412322 135352 256879 -29394 -138032 105082 -156190 -60374 -90476 -272846 40214
20784 -379606 -205462 -84932 -10749 123755 -275495 87586 -12176 132891 17093 62854 -240364
20772 23289 -40650 -80478 -194451 68704 75899 84908 -261300 -59321 -333341 -138238 101145
20760 -275451 218401 -1578 148365 422812 -162273 -57759 -177138 -139713 -113360 36838 -59094
20748 -281352 176232 -83826 -168496 146077 -246830 350769 -46142 -41499 208797 88357 -15349
20736 341272 -25792 247698 -16705 -256497 -285420 53808 30090 16520 97743 -290756 69960
20724 -130355 131001 -237788 -168116 178903 132293 -238287 -223623 -236965 3381 86392 -21987
20712 320981 25746 13012 -208906 140175 -149433 -90732 96846 184995 -36544 9878 -48186
20700 167313 101893 50395 305656 -100055 18287 -334366 -147242 82623 -328259 15504
20689 211044 -212893 3638 -364990 211988 421895 -25984 218663 -23712 -102832 -208991
20679 -208991 51626 -166164 173539 -350576 -124744 91615 131910 -157362 196256 -126911
20668 -12772 -229706 -112651 -260358 56597 -243445 -72929 -229390 -64599 -118805 -61777 -191032
20657 -191032 -74741 44678 -179789 -175429 -91146 -87659 24726 143114 -178372 112005 73716
20646 73716 -393671 -704 -353946 193866 113934 170019 -125712 74925 194952 -266455 -228858
20635 -228858 1722 -160349 -521223 86310 -102777 -268134 28372 61153 -79428 82702 -268788
20623 40728 -202276 -225995 62735 -50314 53461 103953 -84456 -62865 -102520 -91245 -52749
20612 -52749 2015 367292 66051 32239 39945 384985 -90925 -38524 -38207 -200162 -468038 -86342
20599 -53326 155489 -117278 -243811 65494 98649 203466 -121134 367243 -50760 -135358
20589 -135358 -2680 234230 -74334 -153251 79656 77491 190003 -58705 71436 43016 -65880
20577 -110014 -116901 -41026 -189817 -33457 348481 -390593 -421366 332395 -203242 -242433 -280518
20566 -280518 -67053 10917 -321170 -266258 -42581 -157610 -105861 30382 -113208 182713 6056
20554 135664 -132204 103168 5978 -369438 -223076 30366 -27153 -121797 -117602 137731 98839
20543 98839 50514 170903 48250 -96790 -90428 -309433 -114854 109430 46210 -141802 -186374
20532 -186374 19364 -86916 185597 -325514 132720 -114872 343798 -118800 -258110 -241811
20522 -241811 47725 111692 -218252 -38540 -46805 -64926 169198 -174945 167109 -184719 -62628
20510 -98978 -9632 -90976 -234553 99388 151692 130858 -167971 12835 -184149 -188140 18242
20498 -472850 -21647 204798 225072 -115552 46372 -178355 -223114 216668 -152562 46905
20487 41239 -30134 -12790 26345 8287 -63470 -202317 188867 -89339 -29931 -149142 33124
20475 -171105 95180 -121308 171621 189004 225156 -8894 424670 -163457 -280212 -110481
20464 465907 -64543 -11407 208269 78764 253109 52423 -96501 -88575 117550 -115215 -110599
20453 -110599 -187129 -102389 59260 -32416 66236 -142508 -13928 -312353 120725 -109810 151357
20441 111385 375929 -144812 96258 349026 -9184 -240728 -240728 168368 20561 206310 -227191
20429 -57421 -265923 105269 14242 -92558 178129 95414 -94266 34143 -474816 105260 39847
20417 11464 -9437 7759 -211365 -132635 -29110 130600 -60995 145846 -152296 -317765 -252235
20406 -252235 -205585 41852 -206272 114088 -34418 64716 66992 -93931 116338 13879 -16268
20394 -143536 -176794 26768 -89897 -249113 48563 37341 -134667 -23537 135478 126038 -183506
20382 119990 2564 -34406 -249123 -191804 244538 211127 36926 106308 -204415 -428182 91284
20370 21664 132131 -34698 -74208 -80005 41604 -292363 66595 99417 148493 -173508 309242
20358 -55521 -288524 -134753 -217758 -72215 194647 70566 116532 -280003 -19780 318962 -308857
20346 -1190 -141953 34492 128334 82894 62336 -25128 100669 -146958 -266270 168579 148811
20335 148811 -244367 7145 -167930 192811 -30384 -32606 -186105 -143420 -207764 -90953 -28259
20323 -158746 836 360457 139806 89264 -68291 -213921 -81897 -43261 119221 -83409 -60039
20312 -60039 202227 119365 -60834 -77718 -244333 40192 -69571 -134801 141559 -278961 -387801
20301 -387801 28060 24928 182545 -267449 151255 403708 -54005 7299 108380 -159337 -126309
20290 -126309 -221451 60128 -158578 -102481 63499 -222951 -357117 33167 241330 150525 50872
20278 -107878 -75739 -32269 221975 -200467 131986 -130802 -279072 -109265 385625 1862
20267 285258 -76971 104656 268733 -292919 -98921 -44452 -26380 -59151 -64221 -69564 -275793
20256 -275793 29990 63038 -53128 -184245 -171453 -13974 -102885 -89513 -47858 -54299 -111944
20245 -111944 -169103 96700 -75026 -61562 12368 141058 -47589 -255505 -256876 -82699 -39114
20233 -3804 -112373 -19655 -23532 -82579 -39186 -40700 206629 -71379 -287418 147485 -331498
20221 1672 -24525 -224348 168282 -64389 151339 -402898 -151322 -598 56591 -100855 37496
20209 -7796 224315 -26912 -35353 -359326 293154 -6279 -226592 -357232 170184 -2849 363629
20197 -252236 -326392 -1450 -192300 156396 -51655 -101351 -1428 -68481 -300807 -161884 -62001
20185 -394770 -202448 -36950 63094 -38725 -233579 66598 -88661 -290431 125206 -12742 176635
20173 48868 -73706 -363580 -43005 -75487 -335585 -237153 96166 -224850 -47957 -316086 -1249
20161 97457 4000 304713 -32552 234789 -187766 -30587 -60764 343796 32851 -319332 354262
20149 -202034 -213614 302354 -102827 100587 -263396 132863 -151642 106445 81475 21908
20138 -8295 -190743 -122913 205749 -10530 -13806 87329 157834 -12950 217708 -2386 -47622 -4894
20125 -422400 159991 -99300 19012 -30429 -275674 -220446 -199999 -181335 86044 -299009 -83317
20113 -179268 86624 -9069 -125152 -115728 -144900 -26483 -42195 -107892 40242 201253 71985
20101 173280 -155195 -238600 127940 8618 -47009 -39557 -70848 -251926 65397 -28216 -21767
20090 -21767 -136302 -28579 -104412 16058 -107622 -71308 72600 -50155 -96027 9107 23371
20079 23371 -215614 -176952 50235 -121972 -8187 -450359 33697 312101 -285177 39649 271211
20068 271211 -37219 64810 -9474 -237205 292127 -69100 -9324 121585 -327698 -53687 42299
20056 5033 -18167 -133715 43707 -228118 57748 -77826 169137 431162 85978 -250345 -82758
20044 -74677 -69999 39154 -142453 -237782 -51341 -32978 -224931 127030 206605 -89667 -279095
20033 -279095 227455 22537 128827 -95732 479505 -495213 42164 -118050 15432 -278509
20022 243673 72943 -79859 -86600 187879 -32693 -255026 -124825 -142305 -139035 -181688 217032
20010 -132747 -20783 -8361 55937 -376585 -431630 -91813 -364389 -176122 -4137 -155347 -102499
19999 -102499 -93798 -328406 -38180 12122 -16141 77347 37976 134210 -22487 -225621 -53707
19987 340835 -299848 260106 -355055 -70697 -4168 161432 -79650 470299 2167 138641 -350618
19975 -30752 -226007 141865 11075 -273800 38391 -170678 -409614 -56340 174677 -94014
19964 -75764 -62354 -94961 -271153 157869 -105705 -81599 -80556 -245187 -90303 -137116 -32251
19952 -104585 -96802 -408248 -103003 -63882 148308 -253520 125901 83098 -237040 171903
19941 -323029 -186805 -237528 -26062 -65363 71329 48122 -88670 -35269 -59794 -60926 -234244
19930 -234244 -130957 -65120 -54019 291 309193 -46805 -152052 -140006 -259888 -3399 -104807
19919 -104807 116472 -252551 -366652 97126 22064 48193 4335 -105498 -625345 127487
19908 349753 -25891 -185632 23378 -131831 -147057 -147073 -199342 -243792 59735 158889 73092 -135085
19895 109044 -132070 -369202 -342928 -390783 55840 -82307 -108046 -101471 -24010 55081 238394
19884 238394 -182834 31662 -74270 295787 -53825 -66083 -29108 217957 -286209 183883
19873 86383 -156507 -228239 -48335 -367107 -140349 37653 227834 57637 55962 59210 29536
19861 -63349 -187353 -360829 -88202 223656 -169968 -31517 -74388 53538 -151997 -347391
19851 -347391 -281279 -41068 267163 -222148 131146 -125481 25664 -178647 96268 7186 -153485
19839 -106775 54218 245660 -141367 -204423 53082 -195930 -92938 -74618 -216671 -23982 -18817
19828 -18817 -20405 293408 145052 9936 -234789 -78867 -63875 -156745 -170241 32188 -308677
19816 -234425 150073 -16575 -176424 82175 -132745 -196734 -73149 -35038 17308 44051 127866
19805 127866 -132596 -78598 -259899 -36066 -174683 93649 -127050 34776 57460 48466 -90377
19793 -135830 -1290 259354 -169174 38612 53222 -118533 21325 -357098 -154181 -196899 -17410
19781 -120939 -283663 63428 306800 -214487 46456 -139626 -73236 -304877 -73289 -24147
19770 -58241 169791 -38082 238230 40784 33490 99561 -162105 -52909 -212316 -418069 -130426
19758 -134348 111296 37153 -93843 -180389 -276069 -48123 -238479 49752 -15647 -60270 -167534
19747 -167534 -98174 -265408 -235305 -179056 20773 -149127 -96241 38634 184113 -34878 184384
19735 68671 -94009 56092 -252312 -308156 -27378 -142067 181812 -86121 -191012 -76835 230185
19723 -18103 -126016 -31584 205222 -159949 -42480 -93102 -163410 95449 34313 207612 -88428
19711 179012 96185 102215 -326093 196153 51009 -124102 50218 -94716 52176 -65988 172536
19699 -58236 89012 -151743 -109245 -45371 -148104 -102087 -411434 -168737 -184744 168676 -134477
19687 -30418 -158729 -250772 -53640 -86087 -234228 17163 -124625 -99381 -170565 28235 -236026
19675 -118719 147184 -76212 90579 68381 -200858 50665 -250841 52915 -285834 335515
19664 -288984 106876 247196 61057 -268477 -10790 -74214 -72743 -117838 499613 -238911 83066
19652 153198 236651 -121381 17514 -32036 -105791 -180225 43454 207959 -98353 163106 -103273
19640 20874 155260 -374733 -122599 -153486 41445 124550 10104 154798 109158 132616 -260792
19628 -12244 -283516 8582 -136052 124064 -63610 -206581 -24910 260904 -306540 42736 -42913
19616 -51925 -312678 -114205 -103203 249905 -395568 250026 -110574 99679 177530 -188639
19605 138626 26910 53074 20858 88211 -538456 -142313 117832 -339719 69358 -164809
19594 -36781 -544171 -133743 17307 22489 272427 -290908 -221022 360677 98466 -200474 64310
19582 316452 -85630 -320622 148847 10521 -63329 32874 -43490 -169336 -120451 -246503 176861
19570 133434 -64888 -22372 6409 -192416 72296 -30480 -161454 2571 -202032 -264024 286576
19558 -15846 24641 193192 -97542 -351461 343068 131301 -123629 -126029 50592 34327 16186
19546 -164617 -52305 -52772 -330245 101767 -89818 -92498 -141360 -299642 -124805 3586 43696
19535 43696 -87310 -74021 -268070 380653 -52668 -172695 14185 26193 -2411 293226 130903
19523 -27775 -192965 -167935 -157724 115488 -37860 55978 126023 -63968 93884 -151542 -227305
19512 -227305 6690 -37571 119457 -182384 401427 264286 39593 -383215 11178 -119278
19501 2955 -234376 -84945 164671 149050 -21483 -224765 182133 -64058 -50538 -349241 -191892
19490 -191892 213444 -173761 -55386 -120811 28041 -308217 -182071 -64313 70462 -86819 -322765
19479 -322765 -51744 -237925 -101700 106868 -211303 215408 -179939 82553 166085 -100568
19468 375731 9952 -53897 -162438 -125814 6424 -137433 -92088 82983 838 71911 -280248 147044
19455 -164750 -252545 -60582 -224090 -104796 -52179 -142501 -105496 72962 -81824 208638 -147451
19443 436378 161026 -275673 -164113 -296183 -129313 -100319 -171111 169753 56269 -70905
19432 -18190 108087 368247 218160 148568 -29377 -99832 -183476 195837 -234181 -381919
19422 -381919 135622 54142 -128733 -285377 -53150 -85171 -284050 147549 -278743 12987
19411 -177206 -78685 312139 -226296 -305864 292173 272446 519343 -222820 -221561 -57528 -157395
19400 -157395 -64215 -294401 -191770 237014 -515132 194272 -167650 -483398 -150944 -308979
19390 -308979 -422 161040 -195921 14638 216454 300406 -89899 -70717 301293 -196057 -499657
19379 -499657 70322 36914 8262 -364186 -40831 -261845 -120405 -110196 -274928 -70277 139228
19367 63900 -17578 -197100 -197084 -211206 -217210 -96660 -226971 -41611 -152906 33733 166340 -91296
19354 3262 -143252 126876 -410787 -36255 -27785 -302574 131140 -10020 62857 27028 -168652
19342 25986 -289725 -126702 102175 -174377 -292862 -80277 -316482 284161 -209092 54095
19331 -186669 321907 -166000 -356466 60333 -92379 -229581 -138240 133676 -53188 149724
19320 -75846 70558 -117853 29624 -182426 -199233 -96465 -60712 56001 182648 -9461 36507
19308 216343 -17048 -296777 -89379 -237629 -336647 -131381 116783 -34049 104140 -454495
19297 -181917 -211260 -121599 -191069 -121155 23987 -120382 -344775 -208759 17613 -87302 -48266
19286 -48266 43126 204239 281215 -65586 -20795 428170 -291758 52822 -287835 167311 35715
19274 -118028 247601 22665 29758 -79698 101 -248051 -225196 -264406 36415 -193672 24925
19262 -111474 278482 -249491 83369 -238187 -137076 -36267 -76643 161599 -201960 62591
19251 -2883 -91987 -84956 -124399 399547 1423 132452 -53830 54944 -270649 -245546 -405587
19240 -405587 -74119 -156135 -15714 8611 -229285 -123729 238717 9958 -71855 125485 109369
19229 109369 232730 -136163 -78598 -259584 168536 378118 -100611 -303419 218321 80840
19218 -31106 -35521 -52118 68103 13603 -654682 -396636 -354309 61987 -97215 91288 -107781
19206 248346 155445 54260 148339 -416835 -157484 -10942 -28930 -275088 -193168 -249417 -17243
19194 -31448 -118538 277948 -51497 -200425 -48438 54799 -108404 -228103 16144 26908 -178248
19182 83642 -89469 -227165 -83397 -129767 140979 199541 78956 -72917 235525 -190740 152896
19170 -115120 -127611 10699 48018 167278 -344341 -165197 -21630 -354953 -16210 -42046 20280
19158 -48190 282082 -178002 -159784 69188 18127 161971 89456 -149649 -161 -112214 1541
19146 -57504 -29334 -18965 146661 -224217 252918 -200556 -91652 -75230 129325 -12259 -253730
19135 -253730 42683 -80006 209414 -248429 -222493 -195062 -197812 189167 -93814 -171368 -139645
19124 -139645 -76890 40802 -199905 -11233 134105 190075 129763 152238 -31709 269398 128997
19112 -249877 29435 -246021 -200678 -187913 -100866 16592 25004 94398 -115981 -50180 99071
19100 -127575 85635 -230672 131033 109448 -229530 200529 -123470 -230230 -31964 -44552
19090 -44552 -52994 -349241 -342843 305902 -63131 -304451 -36019 235509 -21881 -251954 -168818
19079 -168818 -36937 -115330 36547 -34095 67255 25149 -200416 -99174 169688 -279177 -152938
19068 -152938 -106180 -69592 68317 183699 324714 1929 -9148 -96618 -172117 51455 -104186
19056 -4296 -80581 -259858 176970 -121906 108103 -199238 225531 39905 87749 205795
19046 205795 -8442 -91907 -158045 -339258 57851 236678 -178089 97694 105918 -38282 29432
19034 71420 -245970 -88028 -30278 122937 230364 -21058 226156 -294350 -400446 -85983
19023 -55881 91201 50389 -106981 -21857 -134170 -251623 46625 -116740 18217 211644 -14462
19011 -147736 -135624 114492 142674 235156 -173039 -62644 73538 -158686 -159063 -18492 115877
18999 107394 37991 -73725 -313343 82421 -213860 -213621 -172870 268175 -2176 28042 124854
18988 124854 213610 -175038 -195178 491906 135297 88498 -70067 -96657 249427 11668 549
18976 362859 95731 -220863 -237962 -31460 65950 -5663 -56690 115384 -78000 159000 74425
18964 299307 223063 -337870 100300 -117734 -198307 -94722 79825 51237 35213 -34075 157733
18952 19052 -58454 -197926 -165918 -20897 -359917 -208637 -118350 79175 10995 -214874 116833
18940 -298408 124288 -55568 -132608 292052 -143369 -102035 135863 1266 -115058 144333
18929 -96081 -59061 232585 -185685 -5132 -215122 564 -431465 -67501 137287 -119533 -254349
18918 -254349 90271 -138759 -189784 -143070 -34767 210978 -263024 -10714 -128724 -31860 66412
18906 -177714 71293 -274214 3933 108556 -366356 -298289 -156003 -242864 -334871 -247916 -228877
18895 -228877 -233655 -277791 -169853 16726 -254337 -261413 130020 -31078 308901 -82189 106724
18883 225294 -161996 317904 248505 235508 -177796 -86170 -48815 -83742 -281983 277617
18872 -115903 89595 -286810 -30155 11496 205375 -19955 -143353 -85370 -196563 273503
18861 198735 -235827 -17022 213339 -416316 -144860 206764 -238177 -10245 -124951 -164796
18851 -164796 116286 203437 -57886 -253854 99990 -161020 399689 259222 -66475 -77066
18841 -77066 -24556 -8336 -36237 -224390 -151722 50330 -208735 -206726 -214557 -170313 -302889 62853
18828 -20143 164496 -45169 76868 -176206 -187928 102886 155381 100322 -285335 -291098 68 157014
18816 157014 79955 170286 55522 59298 20948 -927 119883 279884 154595 -189585 -253293
18805 -253293 -207829 -54099 -285419 193448 97934 264362 8657 56720 168769 130812 224677
18794 224677 -16921 -96691 123590 63141 186295 84456 -120920 -49457 -74323 181273 -32872
18782 -83769 171393 30910 -441262 -34652 59987 -83497 -25349 136611 453 -12709 131285
18770 78561 47331 -214231 -204126 -223343 -21911 -90192 145412 -73352 -168068 115853 -38944
18758 -84743 -57698 -336707 -68014 -432291 184565 23947 -103062 -63436 -4412 -120108 108253
18746 200882 -11407 -69034 -128251 124707 -127536 -17061 158800 176727 182959 58185 -2899
18734 -131665 -357305 25702 180196 -225917 109000 -149627 -243179 -124074 352580 144097
18723 -110450 -4114 -322310 -193016 -159971 -136416 -350044 -170074 -291194 -52015 -98479 462111
18711 94218 -300582 -27301 74439 39557 4496 -17348 13748 280458 112562 156048 -8216
18699 -83238 -277619 10635 51294 -4202 95564 -223259 -107488 -122771 6297 -96738 -243746
18688 -243746 -144132 237798 7485 151561 -50786 -72774 191088 232067 -252267 -107665 97783
18676 -103664 -34130 -25104 -444306 -116493 -129089 -88929 -13888 -5902 32518 -70202 -231174
18665 -231174 305547 223427 -174001 -146775 -224522 -404113 -180473 372 200326 -146305 130012
18653 -177839 -232397 -17691 -237703 -164187 12694 17224 -237251 191566 -81750 -185992 104988
18641 -14225 -303360 59447 70368 47721 -51566 -239091 -108953 -147431 -60249 -203431 -123414
18630 -123414 -169245 83957 -44362 -55851 292528 -115475 -6758 43969 -417127 -270153 157900
18618 -63334 100229 -111293 -161680 -166666 -103127 -147319 54490 -138041 -112833 25955 -231347
18606 -309723 -147657 39900 -64223 88193 73372 -4788 -273518 84053 -493926 -131504 -436312
18595 -436312 -17570 -2720 33331 -54934 -135038 -105420 -164149 -116772 -58839 11074 40330 170405
18583 170405 -250746 68938 125776 -215675 74981 160774 -52337 -332066 -49709 -396551 25712
18571 -229275 60641 46924 -107731 -107564 -257422 101216 -181023 -135426 -131246 -96520 -128663
18560 -128663 34553 -72887 -31588 170579 -131853 -40915 72877 -156742 -85295 -293334 92108
18548 -9290 -71129 -112642 -157985 117482 -105739 -176711 164902 -211787 245072 -6658 78490
18536 178597 -20583 9556 96695 144328 -16122 -104504 -333360 -258564 -178435 29314 184086
18525 184086 -132511 -72487 -50714 -151219 -128407 48459 61496 49881 89133 -306694 -291975
18514 -291975 143430 -116533 -180560 -11890 -1719 12063 -124986 -257382 24323 70154 -208886
18502 -358867 64603 23663 74037 40702 -11818 -126020 57160 253548 -286007 103678 175105
18491 175105 154779 43001 108566 -61927 141162 69188 35620 -114650 -231719 -280309 273020
18479 -314157 -26712 56255 -43100 -33180 219988 -94282 -52295 20681 121881 -114996 11701
18467 -133973 -5580 -375168 -93472 267756 -41020 -139120 -284441 -137377 11461 130123 24289
18455 -118659 211969 -83214 108991 176844 399509 11263 -79464 -71950 40548 -385869 -118721
18443 132307 74808 215638 -6136 -13715 229250 -63712 -234697 175354 -237229 161628 30753
18431 -45176 -39358 -18741 32376 19662 -179377 178928 153330 144312 -164661 174468 -177928
18419 -198411 271988 189658 -376099 -108939 -111017 -198421 -181135 -174200 -346657 -23372 135315
18407 146524 227273 186719 -70358 -258432 168724 100148 197271 -26500 129128 -287068 -69809
18395 -209870 115876 243727 -152964 34512 -55556 -98407 242876 -143866 -51062 207939
18384 -115868 -133888 -252953 52435 217878 93938 -174165 42649 -162679 -308761 129832
18373 72196 100563 -305358 186830 -439847 -30328 269205 -161446 -205255 -1853 -35758 -91044
18362 -91044 -377181 42311 -444546 -36894 -178941 187084 30115 -76952 -184213 259223
18351 -774 -117378 47774 70138 -220748 -47995 -181534 -110783 8921 -256208 121999 -50426
18339 -80112 43515 47712 -89192 -173527 -302090 97639 -303786 25566 -272566 132662 161761
18328 161761 181443 -31778 -27402 44435 263450 199207 -115352 99062 167387 -125585 -48219
18316 -37786 106358 -226670 -97082 87391 79642 -28662 -41278 -159274 -137866 -175969 28529
18304 -349630 234393 43159 -382134 -83531 61635 -98518 -121583 70926 -209442 -41795 -14303
18292 -46357 -435625 146963 -124362 -49423 144030 479661 -275923 -28852 -9607 -186775
18282 -186775 127717 -115382 -383501 95669 -70228 6130 139435 -72471 -139454 -171188 -236047
18271 -236047 249401 -369383 5222 70560 -140763 341846 128027 -7346 -166543 -24921 -261900
18260 -261900 -37154 -30528 -224611 15598 92581 -271569 -61845 75473 -129286 -157401 207777
18248 2288 39699 22343 -63590 -153263 193418 94397 -79412 -99854 -219212 58827 191352
18237 191352 -129197 67460 116505 -200613 91981 -159464 -129918 22253 150893 -47163 -64903
18226 -64903 253816 291814 -216679 -167304 188532 -188196 -240475 -409006 5708 103141 -170481
18214 -42635 -188908 -113624 139265 -117788 -109208 236365 -66115 -263450 -271591 -121545 -263349
18203 -263349 -263531 -4178 -265706 -31184 -240873 136634 -363546 202537 -210925 129415 -320615
18191 134952 81357 -52950 -51010 256585 -57858 -66737 58940 9209 96568 176097 48642 -159469
18178 -241582 -6686 -30912 68644 189975 -195088 410529 -142793 -92414 51905 -140904 -313184
18167 -313184 -44092 29529 81192 -266368 80048 -262846 -91069 -113882 7262 43033 -309587
18155 469343 76016 14183 150408 -22991 116513 -36324 313387 -348935 -87376 408917
18144 -187097 -48865 -169420 -125497 -234778 -58966 47237 240183 -97018 -112271 284430 -44585
18132 -207725 -93518 249270 142698 39997 -81049 -16193 189822 69544 -288609 -65296 232865
18120 175244 -10569 -213016 -50050 33788 116703 38891 -189157 -278228 45482 -34800 -49650
18109 -49650 30938 137290 -92745 -261820 -188747 65773 102318 -44599 44822 -358425 -392762
18098 -392762 -72891 22586 12993 -94338 -13757 -323786 -289478 220457 -28974 -183659 -300447
18087 -300447 450963 108400 -49752 -56831 -57154 67398 141815 -160069 197893 -104605 -55232
18076 -55232 -113759 -66010 -124758 81832 -75366 257807 331904 -79024 -258118 -120766 -145753
18065 -145753 -111711 68910 -224336 -96246 -3918 99215 135424 265913 -128545 -260503 -177066
18054 -177066 -200442 -160302 -207563 -150596 173348 30111 -300841 -132676 -276203 -66015 -346706
18043 -346706 21267 38143 71966 134626 217766 164924 95109 -310861 26257 63810 -96392
18031 -325700 -193641 5731 -140501 -19701 32137 -189847 -210074 -220557 -119162 -141893 24323
18019 -124093 -105449 46967 -270691 393003 -75413 4209 110725 -17936 -186419 -87779 -167699
18008 -167699 -92087 -116650 -73824 37547 32350 127425 186109 426890 -35051 -144649 -212707
17997 -212707 286027 -247324 212886 326830 -231403 -61907 113532 -19989 327675 -245228
17986 67169 -189214 -111257 -204188 260903 -276807 -47266 -83863 283621 -193633 106025
17975 -139335 224274 228712 41418 -102705 -37260 -279643 231096 -31199 -57159 55205 -396754
17963 104596 -28365 -209302 18181 97683 100130 29559 -288424 139904 -115675 80945 18580
17951 5671 119534 44809 4383 170515 -233272 6545 42651 5526 -457404 -11482 -209029
17940 -209029 111330 -65937 -310559 -71987 -113769 45275 -263406 64456 120616 321400 260319
17929 260319 -196619 -73408 -517 -156374 258436 -186400 -89053 46213 -347995 -89154 5963
17917 -71646 -187508 -334548 164535 75882 174724 315064 153397 48585 -42742 271538
17906 -28652 -292896 32700 282923 128908 8560 -101504 -51310 140389 -305969 -73683 103938
17894 -33728 229137 -132614 -228721 142870 -14794 -2954 164060 233985 -221906 -219795 -285813
17883 -285813 262096 -42206 37825 -202277 34467 114240 73352 -5683 163223 453944 15930
17871 -223015 100899 -194398 63934 320226 -249020 106593 -90303 122908 9777 -102513
17860 -205293 193248 -2449 -10717 -17190 304831 296034 -9203 -187852 -92635 14604 50567 -10378
17847 -166832 -77618 260579 47375 258488 -134175 9249 67555 31218 -325940 141723 127537
17836 127537 87053 267215 195253 61356 -127312 17745 33746 -358430 73550 176066 -222611
17824 399096 55273 -21758 -161134 -6926 130526 -213359 -71501 -111087 -165593 -33870 -97626
17813 -97626 115164 163132 -112765 72878 -338477 191000 -42233 382973 -109222 -222757
17803 -222757 165317 73033 -61543 -166310 152870 -80316 -115223 -60479 114165 -2540 209158
17791 134047 197873 -13171 -257665 112440 -144968 -52918 -171351 -259565 56720 -137292
17780 -71745 437203 91424 77582 133252 -115481 74827 245554 -222103 35295 -138100 186193
17768 73666 -93675 -116168 81981 -314052 65977 -138236 27675 -200004 -70211 -67453 188578
17756 -149558 96076 13817 -379789 161152 -308131 19348 144330 -134832 -56936 169222
17745 153106 215383 -194727 -245542 285098 -259839 52191 -125550 109452 22996 105076
17735 105076 213208 57010 160306 267145 -380202 -26286 16474 203156 -86242 -128565
17725 -128565 404357 -183386 4194 228739 -18113 144053 -187206 -272735 57547 -208635
17714 7514 132999 449316 318931 -320076 302901 -133783 -181629 -335031 -103888 -108180
17704 -108180 23846 324089 166584 -93306 -2558 -96528 -17800 -31684 49269 200759 -162935
17692 97126 176646 108982 -120942 -211264 98795 -147738 -30532 -241046 87881 51351 259083
17681 259083 -140383 -102944 -86783 126650 143526 -107962 106701 204632 212972 -211174 -179392
17670 -179392 156604 -79757 230093 149365 47826 -9808 252132 14193 -277009 40676 -80012
17658 95849 77172 218271 -6398 25101 73579 20868 36016 105770 -202337 211809 -218450
17646 353736 14766 -244030 303545 57819 -157117 134802 -147763 -96171 -144419 39482
17635 7256 -222010 191671 -206119 -364494 18784 258013 262798 -14779 -108912 -209836 -190227
17624 -190227 140592 -92596 340648 -69739 -46784 180298 96552 177234 -164897 379835
17613 237184 190948 38204 185260 116005 -28349 266873 -19154 225418 161222 -96195 -23041
17601 46900 82861 -52956 210909 161494 130128 -87255 153897 144185 -342460 144345 91004
17590 91004 -279779 111719 79400 77969 101685 162203 -196659 352044 -167119 -40521 142310
17578 -63868 -20304 -166538 -229122 51452 173491 252737 45082 242468 40630 -161234 279753
17566 -234826 67038 479053 19450 174704 -217718 -115696 -75180 134318 91279 212604
17556 212604 76908 -109881 186344 152082 143605 8611 -61820 142986 284835 -31728 258149
17544 -136416 135320 -109854 238041 197723 -4673 136029 205118 -188865 -33126 126729
17533 220488 -25226 73262 456454 226299 73409 -85172 -99483 61695 -305024 183725 444920
17522 444920 16887 144274 125417 116356 -87182 59945 -17427 85446 200059 198776 26362
17510 144283 88145 -35582 119950 -8416 -20233 -26302 190331 49335 67011 148764 -2060 237171
17497 -22026 29738 85165 -93287 357029 -233126 223199 42724 -131501 1269 128673 216623
17486 216623 12500 327562 194342 254820 -4782 307170 104065 157399 -44496 82486 252309
17475 252309 232398 550545 100379 -15513 249119 430242 185251 470100 -50438 118312
17464 186168 107391 217492 -119900 294587 249380 9441 59337 318811 37708 192250 95886
17452 117578 43986 150538 287159 245458 343114 424371 476025 269701 44297 77754 292356
17441 292356 138472 119721 166332 364064 403875 175796 385081 458712 275438 567806
17431 567806 502133 18152 -21985 468644 318563 92554 386116 174417 363623 232575
17421 232575 189930 154982 63703 78334 120040 208080 47468 92721 332660 -128079 -28691
17409 274588 -75535 -100394 -180052 179792 -29331 205611 -234475 -150191 307517 210367 319986
17398 319986 515931 -41456 158560 676861 420805 -153547 -55242 408321 -278360 70181
17387 219066 263584 422036 297235 -49658 102810 53745 322903 -34786 106682 127925
17377 127925 326397 233576 29191 122938 269993 570511 163390 416073 178292 320228
17367 320228 202839 -111677 189059 -52041 63863 255787 81856 -75128 40501 286820
17357 286820 -125378 382160 -95036 365129 332345 309234 400403 545734 259821 -105904
17346 132246 -136243 211225 190461 202405 160060 357316 213993 354437 102144 62420
17336 62420 -30753 317522 -20758 -233388 72267 433476 166962 187751 -11777 -39674 266439
17324 297990 282110 -7897 -49065 -216821 -2604 51140 30124 122529 43087 226715 63813
17312 608010 366740 67738 -6256 -44919 303445 -19813 33208 -25445 -124771 296829 137457
17300 629341 134446 45642 -90678 215186 317979 372287 246599 315539 -76067 342973
17289 123307 345851 149260 -130588 307267 257690 -38957 220610 474778 278926 221359
17279 221359 200145 55971 91346 365076 -134202 187222 63082 333497 566322 45777
17268 457077 17356 683951 -135696 186010 324087 190701 31310 256837 533420 139512
17257 318815 392961 198575 306198 374277 347829 -96490 -101672 -190557 127887 157278 9784
17245 28106 342874 341224 103679 54456 -72108 -4396 231930 272539 190905 108169 356884
17234 356884 275198 446602 297226 63603 172731 363843 -7294 -119769 382472 337072
17224 337072 -114932 209908 365372 282529 403093 -25304 -46187 361320 329237 36790
17213 133356 312839 196710 54795 72656 205202 236102 200048 58346 118345 -10802 334245
17201 273643 237565 569276 383191 128977 638471 166280 36175 209877 228431 376155
17191 376155 383918 181117 236470 91597 219945 82883 491375 152716 312432 224693 122094
17180 122094 447389 566903 263340 301321 60490 392183 313337 307956 350234 302836 198123
17169 198123 416218 120549 439060 305711 454507 -58358 313007 372335 268467 29603
17158 71373 237431 237514 233675 13001 290839 316725 661761 690894 505209 159338 338466
17147 338466 193593 413063 124429 361971 354417 278695 310290 252813 200367 641547 185149
17135 365244 503485 437970 435391 513618 157495 279458 298140 286482 134751 257964 204387
17124 204387 193974 219699 698528 339600 404036 637648 552136 173233 195850 381360
17114 381360 156587 360741 505365 422503 62790 628730 255569 407516 473758 184387
17103 396472 209200 496757 707713 483581 607217 523741 276847 465355 168631 436028
17093 436028 592732 409180 484020 58919 139832 384230 558000 519286 190277 293525
17083 293525 163678 612614 554453 297244 758986 482917 584465 499024 328140 404663
17073 404663 125003 552393 402330 285123 358896 567213 292144 256952 821567 493094
17063 493094 653716 642739 378691 207455 744262 743467 368863 480435 216863 884252
17053 884252 610629 649668 815848 592033 649426 706258 690794 552084 307508 596137
17043 596137 563511 613103 274205 351806 626374 488130 626160 724605 386975 540503
17033 540503 631288 323837 633177 537164 602686 644052 813112 584255 593153 591984 473752
17022 473752 657381 648762 677676 548947 629063 905670 466429 980198 495373 775676
17012 775676 738077 708681 602919 1010772 663616 697832 894607 636207 792766 434240
17002 434240 685331 670731 1030273 819831 839575 1106353 808922 491230 851864 589513
16992 589513 703256 886964 709309 505320 854809 1000081 570732 1023980 937046 690645
16982 690645 802503 881266 816845 1039490 1072997 962561 1130128 702803 741632 948284
16972 948284 1102767 753886 1051406 1188567 1127131 1125299 1070021 1051556 902207 1190234
16962 1190234 1018257 1054338 1071430 1044173 1094507 917328 1178266 1100144 1244175 1033907
16952 1033907 1113507 1202098 960836 1053456 1196833 825210 1040079 988929 1176801 1365232
16942 1365232 922061 1370719 1195130 1241616 1399977 987152 1430791 1100660 1093766 1454775
16932 1454775 1216975 1242148 1305028 1131289 1396889 1409835 1536602 1464732 1450274 1360243
16922 1360243 1309256 1428529 1767313 1573875 1659929 1575566 1488346 1630756 1804861 1736596
16912 1736596 1550709 1764206 1758174 1406849 1877073 1485544 1122040 1683885 1755089 1496955
16902 1496955 1594913 1521264 1893978 1705408 1762674 1902434 1773992 1490001 1685952 1397837
16892 1397837 2333067 1909006 1942570 1898337 1842495 1957358 2175680 1874738 2121055 2042238
16882 2042238 1760634 2400561 2304773 2228689 2477284 2314082 2198211 2282504 2377944 2092247
16872 2092247 2642579 2472645 2306792 2404488 2462685 2697989 2616376 2862940 2897980 2591899
16862 2591899 2992802 2638809 3155464 2542983 2951236 2862282 2943841 3109735 3091161 2991362
16852 2991362 3295695 3326887 3161749 3723151 3535873 3225815 3260471 3782043 3510878 3711834
16842 3711834 3712192 3685511 3728397 4047375 4032060 4036824 4150096 4332303 4412519 4352252 4454930
16831 4454930 4409466 4272248 4455388 4772508 4760838 5160843 4933759 4978020 5074293 5314287
16821 5314287 5284753 5271194 5618819 5674697 5671517 5583260 6106458 5927725 6074969 6348172
16811 6348172 6349475 6400798 7023655 7062814 7073703 7351898 7097658 7600538 7510543 8097817
16801 8097817 7885967 8047781 8406466 8640986 8730290 8841484 9232016 9570491 9687096 9701013
16791 9701013 10212886 10248315 10489387 10788544 11305242 11583974 11946333 12257662 12755243 12934242
16781 12934242 13177850 13343211 13748753 14480969 15086180 15236670 15780726 16131621 16893151
16772 16893151 17649647 17921925 18462375 19248434 19834276 20557380 21494528 22175560 22986871
16763 22986871 23776708 24964510 25780126 26309589 28264728 28958282 30112034 31402603 32704901
16754 32704901 34460974 36116239 37359691 39523027 41230922 43362906 45540055 47612668
16746 47612668 50082933 52501683 55254053 58646283 61866794 65175504 68699880 72643102
16738 72643102 76592334 81322628 85934539 91199040 96769781 102200063 108209883 114733892
16730 114733892 121240310 128188012 135344921 142647194 149681911 156420774 163330236 169618576
16722 169618576 175142954 179912557 183470719 186041285 187613013 187733484 186827330 184608162
16714 184608162 180921176 176706734 170914012 165059423 158356780 151303375 144247249 137003890
16706 137003890 129461641 122649970 115808978 109115084 102696450 96448482 90835773 85419832
16698 85419832 80410057 75715074 71187933 67048792 63285554 59518308 56388159 53451617
16690 53451617 50555525 47879479 45186553 42801787 40891077 38784811 36851971 35116301
16682 35116301 33559446 31723847 30156032 28878418 27551138 26367557 25495693 24287879
16674 24287879 23441830 22517534 21967752 20490898 19994037 18943706 18509856 18064100 17089197
16665 17089197 16567202 16180787 15591857 15231225 14610028 13834518 13428939 13173191 12565122
16656 12565122 12059161 11754545 11437787 11447822 10888723 10509059 10004780 9951959 9469779 9009253
16646 9009253 9440297 8921258 8255232 8865538 8077170 8199688 7676132 7839612 7406077
16637 7406077 7263994 7216683 6787577 6840911 6453767 6382449 6112168 5963902 5865869 5929625
16627 5929625 5273557 5393304 5325621 5008943 5545778 5151720 5324661 5036768 4449934 4582349
16617 4582349 4362996 4148780 4388327 4605415 4198588 4506714 3905797 4094124 4150046 3445731
16607 3445731 3556684 3956409 3370937 3499014 3382522 3593636 3397092 3453409 3338370 3435367
16597 3435367 3101378 3236199 2820919 3511409 2968920 3034144 2745050 2465139 2440877 2778520
16587 2778520 2691691 2601575 2611617 2721406 2554552 2758824 2370067 2304969 2481615 2151656
16577 2151656 2250615 2076307 2223483 2108299 2014798 1961401 1967841 1894519 2299638 1846318
16567 1846318 1808681 1892946 1707797 2153487 2005378 1634397 1935789 1489992 1848700 1564033
16557 1564033 1759496 1851140 1720118 1862789 1730353 1601498 1734646 1577216 1531583 1436515
16547 1436515 1406076 1194205 1526657 1331945 1455692 1465410 1643069 1466836 1503365 1445635
16537 1445635 1238916 1492778 1461180 1324490 1224234 1079249 1081988 1289782 916121 1191885
16527 1191885 1415623 1133920 1152360 1188797 1314278 1105963 1048373 1104114 824360 857005
16517 857005 1253560 993375 984591 942346 1138345 882916 885185 919258 1168944 953141 847597
16506 847597 821869 1129519 900390 899632 1055319 979941 877815 807595 865704 749324 1250041
16495 1250041 647922 857591 796927 696195 802581 726628 679712 712247 824617 1053217
16485 1053217 1076224 696653 533188 808803 596573 714962 1024093 761793 766819 484659
16475 484659 691984 769313 565587 786190 692797 700577 432134 608747 370949 535200
16465 535200 520343 507877 441005 1022736 718993 472187 774413 720365 598955 781138
16455 781138 750542 431302 690185 877252 731208 224399 432452 567650 693256 552773
16445 552773 808434 409881 434484 503618 407113 615073 703106 640281 512408 323516
16435 323516 428355 482477 382082 507804 529877 586675 514309 443060 336892 434853 6984
16423 458082 435021 302405 514135 401725 551071 480442 240588 520789 643953 330860
16413 330860 239495 371561 603837 377645 275136 224989 483434 -134999 300684 119199
16402 454721 200009 645255 156224 285968 546508 118593 376738 287835 644559 -51445
16391 263914 304357 416658 236142 216213 360376 277173 658795 502723 303064 360124
16381 360124 420500 294071 28829 364703 16787 63038 227330 223207 92131 -144409 414779
16369 641070 444724 177985 414008 143400 468555 163680 305894 231032 -195612 132597
16358 214426 -115521 -32875 226217 230954 5029 246772 517228 -14527 150544 282414 302363
16347 302363 11608 334460 203205 232016 76231 385255 -58801 165141 298864 -85696
16336 253568 -63580 3551 168973 102594 273872 312368 450069 98356 81874 218259 328708
16325 328708 -39145 167276 351569 -64159 438345 191839 179984 127451 36684 365381
16315 365381 97115 205214 252605 81119 99490 304676 255594 97993 28356 440958 58787
16303 41127 149790 40479 -10444 109441 18881 -36295 556923 294871 59089 159299 517462
16292 517462 243741 -51055 190626 -2218 99923 -82975 241756 283092 36236 265903 45215
16280 204416 87788 232214 144684 385389 112403 244916 -85816 203539 549204 150349
16269 194064 308405 -183629 398886 145104 499544 147521 -152764 61798 186880 93462
16259 93462 -72929 20149 66954 144774 -108221 129058 183030 137063 124593 120506 -283515
16247 -133896 -258573 22149 88104 -10192 -64077 104762 282475 -77998 176155 -199665
16236 205955 88172 -188191 -170845 114290 -4638 7026 123817 -104040 280585 319647 78467
16224 -239709 280923 8001 81729 248759 -92153 -160094 -100936 103618 96545 426468 -2487
16212 -145491 249074 381238 -187214 -82765 -117804 83860 73397 75925 142642 26599 106373
16201 106373 -12481 -449814 230880 -47930 200463 -56252 50904 72143 167619 46837 69814
16190 69814 -117816 147143 517865 -199024 37883 80646 1620 301076 46364 -56164 -152162
16179 -152162 -30750 20236 -41746 -242584 192104 299917 252795 291311 59639 -237528 205550
16167 133592 -32883 -41495 -86046 -26883 -113809 44418 545 -110225 -160916 36788 -328180 25685
16154 -113056 -39759 -17490 100220 125121 -225858 44839 26682 -186911 -26768 -5840 31363
16142 77779 -247544 5502 -11150 115854 28490 73087 -29753 112467 -105952 196782 -277246
16130 -45689 119895 294343 138600 -26693 408191 -255577 -42556 145694 -2853 -77973 -76401
16119 -76401 -215801 94418 -126654 151704 221541 305323 72592 14471 -32027 280152 306801
16108 306801 -133398 109730 112870 167104 -100872 240699 44726 168777 45107 265661
16098 265661 -72476 138672 -135091 200089 -145276 -318657 124673 -119942 105368 234181
16088 234181 139422 -48185 10928 -181803 -137752 -32995 15369 -7607 -251733 -44495 -336160
16077 -336160 10153 -17261 -232057 -144908 9061 -64453 42547 -86062 171986 -249848 -460046
16066 -460046 -245517 -9873 -89269 -281090 -28028 -164542 -50774 176254 -44469 -166077 75667
16054 90312 155300 -237348 8952 200512 -117162 229895 291926 -219991 -21042 -284144 -316643
16043 -316643 -106763 -149775 -55262 -157412 -198058 104692 -558099 -52701 -324440 15745
16032 -74263 -136005 1967 -94139 -387172 -273970 181736 -181054 -78732 -188251 -361417 212662
16020 -198369 -78584 -194753 -67373 -96549 109857 375596 -129097 158150 39670 -177319
16009 -56689 -179690 -13277 -97580 -206366 165493 -186869 -5388 -78040 -168141 -92890 -46551
15998 -46551 331853 271486 -177583 -71042 -54197 -82927 -90534 215998 -171329 -398430 11020
15986 -62698 450046 -161932 -407673 -235017 697316 -27244 117209 327427 -271280 42276
15975 21691 196021 -60240 -45330 140564 318019 21296 144084 193992 -292191 -100243
15964 9203 147546 290778 -91372 -281295 -103752 248291 161035 323472 -137613 183952
15953 -72033 -88818 -137570 -131301 20460 -43551 -36239 1637 196011 -277559 -112241 -135183 -335
15940 -173413 -360569 -407536 -116763 4042 -166326 -15345 -138462 110036 208481 196917 56402
15928 48447 285998 -118322 -46380 -16463 91139 -228796 -21141 -175370 -184168 106690 -364847
15916 91773 25533 -109229 171001 -286957 -80730 15232 112251 -216347 -183291 338675 -20832
15904 -136448 199130 245442 199847 169979 308738 1850 -255708 81001 352493 34474 58668
15893 58668 15373 -237995 28422 -170699 -94758 139632 -61409 393653 9400 36528 19028
15882 19028 209296 -146138 -314380 -74946 406877 -55815 -180511 -210876 68766 -180711
15871 -5392 -215274 65158 -30763 -105426 -188447 -191041 -264015 -188005 -95564 -295140 -17502 12646
15858 -91582 197428 269621 15089 -69741 -49566 -254230 177163 255742 247153 258384 -90060
15846 -236941 -151289 -247570 -177900 -116645 141685 208149 57626 -48416 224932 -320202 -143672
15834 -130365 -59740 -20719 -32440 181730 47632 -199680 -64005 -138430 165853 100570 40001
15822 21468 -108474 126897 238142 -140105 -118914 -267935 -380452 124521 -376676 291388
15811 127206 252247 -109309 -488773 -154804 -92824 106568 203567 -155790 -242783 -194762
15801 -194762 -56481 -409582 -93992 -406336 108701 -130935 64297 198799 104507 -284241
15790 194607 25771 -54272 95662 74517 -90883 -89981 -94418 -109440 -106431 -484610 88425 301723
15778 301723 -200930 -169999 23477 -183408 -99821 -8255 -273141 -184137 1543 243403 173587
15767 173587 -500776 -299196 -186347 35396 431449 118561 243881 -128835 114904 -5119
15756 -172172 193743 -83658 78984 27076 153224 143884 520043 -134969 70897 -76838 182680
15744 -206589 234581 -35941 -144355 235972 -114910 -224987 105739 4572 157772 -44026
15733 -411769 7021 81115 -53429 83409 -168438 -184183 64700 375726 -108245 -149392 3259
15721 21704 129881 77334 17354 -23342 -91057 -10076 -85621 -147745 51567 -679 72694 128989
15709 128989 142162 -38562 89330 -96385 45046 -311716 142769 -235587 -16812 124476 -16246
15697 9146 -210468 -8091 -29573 -17639 172662 74758 -14706 146970 -71395 254471 -129587
15685 123088 -399787 42081 73633 -76901 -305706 -93409 114633 -24974 -259929 237803
15674 -228072 205161 -88426 -161587 94881 357048 187443 -285573 145264 75775 23289
15663 -158890 142983 293388 67971 206945 -132042 -185043 103304 -224373 -244416 -25578
15652 -6436 -130232 74832 -220172 17812 159549 -192414 -3055 192616 88100 27329 139157
15641 139157 9572 -153102 -167401 -167562 270837 38216 87344 -303836 317165 -82965 117344
15629 44418 -158051 -10208 -150820 210921 60048 139385 -88667 269966 218361 77318 -73149
15617 53791 -14025 -273754 -61351 -151700 -201956 -246592 196919 -13061 119981 -66076 30534
15605 -297370 -2598 -9685 269337 -411144 -279627 -66961 127456 82108 -276768 227906 -176982
15593 76104 25770 -90817 -48410 82157 170599 -227973 -210368 35797 6982 317681 5176 171467
15581 171467 173845 93284 -386510 -167967 97110 56567 230579 264495 50226 -359171 -71048
15569 -164327 20311 -163042 136807 49825 146013 -34583 -130067 26231 57081 -328626 -186934
15558 -186934 56105 -179472 -306949 13510 392617 -14554 -192566 -15437 192524 -397910
15547 -328239 -174355 41945 -325758 -45825 -249351 -105390 8339 218073 -98100 227667
15536 345697 221035 185539 -109319 -200734 198904 576237 65912 -165381 -135573 -12283
15525 123701 -58827 -16916 -137441 -387474 -171278 -143196 39654 176346 223067 197598 -310986
15513 -3885 -18351 76680 6191 69356 29058 4377 161401 -312636 -18340 53207 -107706 226338
15500 -87534 983 -70890 -98783 -210236 198919 -266456 226307 201312 84169 -165266 -166557
15489 -166557 6815 124908 192165 70762 224630 103031 88056 -180120 -152265 65785 30591
15477 8460 109688 243159 -116012 -12835 278862 -112786 -76505 210966 -24347 191356
15466 -147744 -146782 -2891 -271058 -144679 -232056 -100871 -38924 -149938 185371 -10219 -70653
15455 -70653 83271 -90296 90477 -73065 -215674 180008 -151552 -9921 -161363 -94845 -175058
15444 -175058 13969 240597 243672 40140 57749 269889 242107 -108497 122184 -229446 95963
15432 -123502 -107354 -5098 119627 176261 107247 -128915 -148873 288519 288230 -54936 -91334
15421 -91334 10316 -299605 413067 208722 -341292 39055 277930 -143027 -185703 -42195
15410 -107270 103483 -94519 8315 234723 332536 -253666 88178 -47660 29863 144629 131507
15399 131507 -114769 30314 -109703 -4826 -19704 -40096 154088 339530 -49121 319266 77745
15387 137398 422093 171926 -129281 -58783 -67702 89587 -80376 211121 -198944 149353
15376 -105494 -127834 -34850 -63080 109681 44933 43609 -305216 126850 -115802 -254958 325162
15364 56230 22869 -5598 -477907 -405715 23671 76579 99679 8727 264472 123606 248325
15353 248325 81507 -68226 -102688 70515 -136779 -81644 -5368 69443 192376 193966 107721
15342 107721 -20647 -195726 116137 279957 -48505 -44362 -411491 112052 176420 -267751
15331 160516 5914 195597 340029 -54787 -102304 322340 254389 -88553 -90652 -236006 -11060
15319 -215549 77052 33293 130631 -70862 -144176 60873 -64609 -110351 -54011 -173658 21054
15307 58699 -285291 4291 -181894 58203 122070 48274 61597 194858 143102 68409 -58845
15295 174193 262823 158680 118014 -491774 115183 140243 -13571 163694 176485 62874 189702
15284 189702 1079 194138 517361 -177909 163065 443206 131633 -259266 -122999 45929
15273 141084 32685 142504 43644 354956 -241240 126822 -66596 386618 -36518 201097
15262 -285077 376532 -56600 172463 299303 -156960 -284116 27920 -121917 119601 359004
15252 359004 -117128 466142 -212588 728944 1235405 1350964 1315166 1286297 920035 580830
15242 580830 344277 240313 301469 333114 -11137 240334 152901 -66586 117362 64361 -135218
15230 398770 397093 38063 163030 -67563 -24195 -33024 533973 108278 -237074 -37146 140205
15218 159976 192736 367139 136768 284690 39740 -92933 33518 148725 77014 -70249 242237
15206 178170 -20052 44588 219259 -319183 211503 120411 -26144 -140475 -142089 -114785 253989
15194 185636 317036 -10099 -158104 -57141 67751 413790 -58950 128830 -59429 40263 183809
15183 183809 33321 398016 131856 408545 -90486 -95185 3876 324256 -55038 286661 -8154
15171 142184 -128074 -249342 52362 -416 -38095 197616 -392425 190622 215208 30212 -44581
15159 322745 175168 -51241 34806 -160281 119111 93084 172034 59951 13967 128465 315358
15148 315358 48548 -9055 55359 434195 380850 178903 253662 -8697 75521 59914 201005
15137 201005 -108350 130412 -171792 47535 39326 195282 -50331 -284842 119791 9491 -40490
15125 91767 122113 -67623 -104141 4684 417046 257234 60576 50670 98730 310904 133259
15113 -51109 38369 96705 295503 297109 -31445 74555 308620 100195 405378 179735 220592
15102 220592 142257 211323 147832 362739 169235 137832 -73394 320691 424821 -191642
15091 -16816 76695 30998 -9226 -156535 320648 433405 164308 61883 299332 155439 149240
15080 149240 282949 560901 -20793 -52189 -162890 83798 65302 -12547 197468 108781 354914
15069 354914 31845 262116 182108 428772 -55967 415754 141047 746345 152024 127724
15059 127724 335195 630741 459175 604771 152203 162068 -15731 316425 -17231 315296
15048 -22611 15223 277975 260372 -32782 7869 -3604 119696 141007 162844 95171 193465 440480
15036 440480 51103 511117 187493 7435 348147 152851 -3399 366338 253082 302134 -79792
15024 -79968 84207 69014 297593 632252 435150 397804 101001 498857 566784 249073
15013 39106 408388 76424 -58167 -116694 298650 113882 166802 215111 -211027 77910 -41996
15001 538634 538339 -172818 25389 18930 342475 261885 226444 113770 216707 374196 55483
14989 415740 167360 147916 246714 323055 368356 257484 396756 44042 421288 139897
14978 137756 467075 317560 310568 86147 214114 -68654 259315 385686 399529 392875 112566
14966 85428 -14926 305160 461766 246888 365775 101115 77907 338837 263726 128885
14955 494613 89496 408067 117656 87852 154007 149327 534236 350010 279697 420450 44793
14943 278365 581668 144368 110095 737910 413696 28585 327400 361950 379238 410234
14933 410234 584489 49581 105009 455490 66699 459792 271199 669139 167233 394198
14923 394198 439621 581705 326978 515611 405079 323366 283539 360198 379561 223893
14913 223893 340598 369206 337858 553311 85762 599350 676928 407356 350104 476044
14903 476044 324983 381662 632789 471883 314680 417217 624968 258339 557273 269134
14892 5674 473357 282118 333575 169870 133039 -52520 255546 521081 272965 359189 296171
14881 296171 172706 192501 839196 331324 408258 693453 336901 437889 136542 257854
14871 257854 899831 440000 261257 290006 510068 373052 327017 429893 403897 452474
14861 452474 791568 668452 173384 232407 535776 258790 416143 544567 456048 281193
14851 281193 596681 516560 403016 509219 823640 318940 453085 463317 688765 385757
14841 385757 307761 377275 656440 513856 162153 466587 413113 544470 602695 231267
14830 802909 309094 451593 556527 651216 325736 549380 548068 371975 476412 581807
14820 581807 615090 319760 569337 411765 529183 489779 507322 362251 673505 134441
14809 487929 657995 749087 239287 501984 547690 415060 679298 730360 647777 431457
14799 431457 861198 647833 632273 358038 708779 567837 616121 398722 784831 523591
14789 523591 456372 823092 780034 647911 268876 458674 707914 242981 507462 707720
14779 707720 633848 502360 828011 609061 737981 734040 674983 344638 760490 384245
14769 384245 541768 728844 829646 554423 407278 625184 674147 495415 790789 819832
14759 819832 608425 765870 728400 706113 731764 647564 252568 1024284 875874 918638
14749 918638 689479 782521 514513 686628 830065 502537 849890 1181302 553255 754458
14739 754458 366032 661855 756559 693504 697816 179205 699718 717467 786871 836583 863386
14728 863386 1036759 853260 807803 849861 882971 800685 904067 1021028 785554 717387
14718 717387 840811 841285 730742 978258 638204 908700 990778 869492 1057867 686011
14708 686011 701795 585010 697893 701667 1024642 1104995 699897 857671 1118577 850543
14698 850543 1099370 804036 1035078 733276 882924 1053952 700258 1082423 713793 999502
14688 999502 1194252 957983 1134131 1089635 845662 817165 1273397 1243350 924657 1080357
14678 1080357 975634 1009462 955444 823047 690202 1281386 1020762 1070289 1120379 958162
14668 958162 949187 1190863 1151815 1232459 1177083 1204710 1124897 1013657 1118121 1580434 1195519
14657 1195519 1129332 1190529 1196133 1271230 1047690 1045815 1062108 1286146 1228535 1279922 1136228
14646 1136228 1339805 1392615 1067359 1428907 1641816 1226705 1330950 1036221 1352251 1537120
14636 1537120 1388853 1368301 1044778 1306196 1794905 1190196 1511042 1848056 1549992 1485358
14626 1485358 1406791 1692460 1847323 1437943 1579220 1471856 1442523 1565086 1272141 1480834
14616 1480834 1365911 1592900 1656289 1661787 1653080 1389875 1460497 1617549 1722387 1591266
14606 1591266 1780364 1723261 1612185 1669976 1893546 1693523 1694655 1789175 1820063 2381267
14596 2381267 2021702 1946119 1718474 2025819 1869784 1973813 1708431 1775679 1958833 1976404
14586 1976404 1926613 1957667 1933711 2244007 2013575 2397263 1956735 2028949 2303029 2304907
14576 2304907 2503874 2427355 2527297 2200751 2170158 2342580 2182970 2316985 2685336 2583614
14566 2583614 2382292 2699476 2236314 2631326 2729392 2956205 2830936 3207086 2884086 3120918
14556 3120918 3253304 3853123 3654737 4175954 4342128 5091551 5581801 7745138 11125080
14547 11125080 19077814 35254731 39694056 23933870 11719494 5819697 3914653 2907161
14539 2907161 2383355 2227574 2132612 2368431 2302795 2289196 2365491 2736200 1992868 2470275
14529 2470275 2538064 2524151 2509714 2576545 3141623 2448473 2653995 2507173 2593649 2902172
14519 2902172 2850113 2320881 2874914 2647510 3210191 3125645 2975574 2585716 2901707 3018442
14509 3018442 3013763 3128715 3292089 3020231 2829017 2923431 3091789 3428140 3210194 3226931
14499 3226931 3435444 3406240 3203084 3365765 3367994 3550483 3904929 3781385 3645585 3686241
14489 3686241 3723406 3593713 4064998 4181277 3755342 3563898 4022144 3930405 4220384 3856385
14479 3856385 4403088 4024847 4300920 4232194 4493626 4542302 4256361 4501516 4344895 4619601
14469 4619601 4167665 4636883 4823873 4842278 5062818 4680964 4937098 5096873 5088265 4666737
14459 4666737 4883462 5036935 5442298 5513887 5336750 5172566 5638367 5487099 5334541 5639666
14449 5639666 6029125 5758437 5889218 5883255 6256197 6178646 6224949 6177744 6089548 6364090
14439 6364090 6418997 6455376 6571304 6603275 6923602 6817921 6960510 7240343 7198845 7115006
14429 7115006 7562809 7384420 7519512 7441809 7423035 8242047 7941113 8213533 8261488 8220067
14419 8220067 8487750 8317085 8672380 8711932 9288762 9098848 8886763 8980530 9419059 9627003
14409 9627003 9589082 10176644 10205849 10043318 10293938 10023031 10535510 10772037 11148041 11005820
14399 11005820 11548717 11413000 11661601 12004940 11922745 12105799 12106401 12964567 12478505 12918608
14389 12918608 13276808 13490318 13514928 13939146 14223501 14255974 14857728 14979977 14877107 15305667
14379 15305667 15664147 15786305 16307122 16785685 16867141 16897050 17513206 17899090 18163763 18533948
14369 18533948 19076850 19016129 19759001 20049102 20486403 20988788 21120901 21744590 22444246
14360 22444246 22942297 22986815 23954425 24137586 24430110 25737315 26019805 26625986 27042664
14351 27042664 27340442 28416046 29224838 29711691 30393778 31113581 31789586 32843440 33809732
14342 33809732 34769169 35248340 36152847 37244806 38240839 39208837 40553899 41717031 42773038
14333 42773038 43695827 45068603 46589941 47867567 49734761 51081333 52687613 54185504
14325 54185504 56101908 58183747 59828235 61903343 63727114 66043374 68278662 70704403
14317 70704403 73076417 75913692 78655602 81624004 84827667 87753349 91409953 94708332
14309 94708332 98452196 102557103 106687613 110919060 115740110 120634864 126107567 131464548
14301 131464548 136946340 143277589 149809537 156925005 163927750 171516682 179639276 188389181
14293 188389181 197261164 206466720 216738923 227162919 238190234 249481234 261594403
14286 261594403 274159028 286656927 300097681 313408375 327136831 340887734 354818026
14279 354818026 368501851 381808987 394233262 406154586 416665647 425689046 432504356
14272 432504356 435891277 436760930 437544414 435921353 430777668 428542671 424237553 416199455
14264 416199455 406863324 396320470 384757624 372963025 360787853 347432085 333744911
14257 333744911 319800180 306396266 293066104 279702644 266386983 253388789 240677464
14250 240677464 228883591 217713721 206847579 196808822 187034600 178021804 169925662
14243 169925662 161969791 154460273 147198248 140497811 133907816 128312182 123023482 117240709
14235 117240709 112493771 107532177 103218196 99000764 95425958 91683020 87762720 84569799
14227 84569799 81163063 78281514 75319179 72364960 69964683 67278070 64868907 63154854
14219 63154854 60725014 58874191 56871918 54723825 53371898 51576648 50471120 48859723
14211 48859723 46971294 45757891 44167973 43263733 42174533 41148817 39983322 38672557
14203 38672557 37519025 36458301 35389785 34938165 33758613 32994545 31887028 31172840
14195 31172840 30248742 29917243 29301893 28543451 27505670 26881414 26180081 25509796 24889520
14186 24889520 24125508 24151883 23534348 22685382 22483153 21781888 21513304 20940564 20383513
14177 20383513 19782956 19755470 19276301 18884597 18503853 18086100 17849901 17652658 17318498
14168 17318498 16718215 16738992 15834106 15801886 15876640 15445758 14994160 14952502 14103264 14068955
14158 14068955 13941371 13541603 13441583 13504050 12894334 12548651 12264559 12440098 12108943
14149 12108943 12217611 11828644 11910274 11509391 11585020 11084339 11175368 10669824 10494070 10489690
14139 10489690 10227178 10259396 10046312 9767045 9948934 9654094 9545301 9342668 9086917
14130 9086917 8863881 8991847 8971426 8618993 8596562 8224702 8515989 8066812 8139486 7862951
14120 7862951 7525126 7827496 7356622 7456705 7411544 7190846 7475130 7014818 7377045 7253611
14110 7253611 6834521 6688690 7020243 6190141 6497935 6262745 6562449 6325147 6629023
14101 6629023 6504711 6267648 6226619 6100633 6026795 6076989 5711650 5714976 5414844 5688830
14091 5688830 5519611 5489430 5215861 5094897 5013566 5022089 5147518 5248790 5074382 4827466
14081 4827466 5025289 4849562 4803542 4872852 4908147 4883003 4600918 4737449 4536780 4668126
14071 4668126 4275774 4423277 4654210 4036108 4095431 4299359 4061990 3749548 4369853 4089366
14061 4089366 4118306 4072893 4259391 3783130 4021191 3856328 3971991 3938825 4225152 3632414
14051 3632414 3737236 3757202 3368573 3188347 3475114 3596845 3270755 3537573 3294371 3570181
14041 3570181 3388042 3247537 3193773 3526203 3236687 2981712 3117213 3216382 2908218 3191968
14031 3191968 3089786 3228367 3097495 2995931 2984893 2996226 3078645 2825967 3059564 2808586
14021 2808586 2481005 2815030 2455180 2771252 2711442 2495550 2807187 2345515 2456344 2288875
14011 2288875 2828444 2368953 2442378 2207922 2450311 2436309 2205834 2399492 2336611 2129907
14001 2129907 2248959 2260536 2063274 2546815 2260838 1954777 1769216 1948149 2274530 1986470
13991 1986470 2368362 2974665 3643691 6242141 12461998 28806756 40121102 26626033
13983 26626033 15122639 8807819 6331982 5150713 4447660 3729745 3541664 3239979
13975 3239979 3306150 3035863 2772929 2847838 2561227 2442783 2456021 2294273 2437469 2799812
13965 2799812 2319766 2509471 2113418 2101328 2390818 2482052 2080290 1952260 2110647 2447931
13955 2447931 1746533 2070015 2054841 1707203 1901097 2050958 1846318 1915640 1951324 1884803
13945 1884803 1621448 1929583 1725449 1996741 1782865 1716930 1700489 1723583 1813064 1708420
13935 1708420 1973072 1602581 1667574 1641853 1491304 1878912 1256757 1619785 1367258 1375711
13925 1375711 1638954 1707183 1316311 1731117 1342993 1364661 1362791 1635557 1403641 1143055
13915 1143055 1487081 1147675 1403923 1218204 1545447 1315863 1373074 1646818 1486301 1351913
13905 1351913 1513931 1354075 1453169 1348847 1473420 1296868 1262150 1425882 1679427 1202048
13895 1202048 1305140 1377090 1280859 1503760 1281055 1227474 1200687 1264708 1499324 1099568
13885 1099568 1237943 1278221 1241035 965096 1304913 1258850 1136895 934328 1334616 1326303
13875 1326303 1312303 1285222 1069646 1275238 1017114 1345971 904525 1338089 868032 883020
13865 883020 1455131 1195095 1081380 1107244 1015837 1059007 1470344 1197625 1128242 1082931
13855 1082931 1104965 636220 1201444 1004618 1102415 1008280 851330 1244309 1118371 732762
13845 732762 1072735 817517 1044567 832497 833245 922447 672193 830274 1151104 1049696
13835 1049696 834353 860365 613921 806104 1245513 1106696 903254 922830 882655 710262
13825 710262 1135608 1073015 769325 1113873 1062136 799937 1011871 478007 942328 690552
13815 690552 642057 650645 950644 1189489 854174 844839 713442 573103 697511 756802 957401
13804 957401 599644 755642 927680 919763 726749 633397 587367 1180848 778370 772673 800686
13793 800686 842958 645663 730358 488928 678625 725051 569220 560296 967539 956280 636345
13782 636345 729321 631732 585723 819651 610096 822773 663400 922956 206439 694759
13772 694759 323197 841863 723462 885338 747626 559626 613493 676288 624499 771322
13762 771322 596351 836567 675882 748532 708914 433386 564530 753426 597086 660204
13752 660204 625699 764412 871339 686928 498768 557702 675152 570888 799691 762300
13742 762300 531046 601877 732214 486717 668288 681203 1028304 615935 735677 491558
13732 491558 819741 658976 623277 521848 549748 484426 732989 452604 166972 629160
13722 629160 359035 490773 794213 620120 409266 658368 329801 572495 833260 202284
13711 552210 568357 452744 383151 622057 373737 604834 681250 719458 616949 -85263
13700 731208 322058 498078 370935 231775 466762 871466 637847 484025 396034 591340
13690 591340 492608 672598 550188 349571 688418 756721 668200 485195 559436 246904
13679 424765 224210 367478 464046 281286 -66392 172061 547371 423008 654221 131406
13668 611637 406077 439983 528274 452224 393413 360698 483938 271319 332061 504313 516067
13657 516067 418438 246705 510842 382817 335907 127247 525878 300310 399548 517557
13647 517557 420830 625919 126015 -168316 336110 242714 418258 662978 440328 89158
13636 780453 542328 73559 491562 462721 552113 141355 472135 50306 214184 154268
13626 154268 502387 418766 35649 204037 235670 546370 398541 413678 -50900 299849
13615 230421 491953 535236 712494 303083 304655 551241 333823 257179 292970 292002 308963
13604 308963 274390 399575 300945 398699 504979 514096 731557 119873 323340 457714
13594 457714 197687 297376 373571 176517 472528 177897 506125 478271 -97485 352060
13583 419170 292555 289713 107517 350965 159369 302967 471922 254423 537265 335861
13573 335861 335653 455079 462502 572704 349700 452573 241784 372700 515782 46166 194356
13562 194356 269669 423690 386150 229836 353365 73212 -74707 142192 451959 357471
13552 357471 29438 86538 402939 326761 -65159 321806 334994 546817 151087 165580 276198
13541 276198 172092 143508 313734 186160 228896 -33561 21570 155763 424035 104268
13530 306295 180273 7031 342052 551276 73633 299038 308555 -82683 -141456 311424 234445
13519 234445 414878 709985 319191 272635 631810 427185 287011 190591 107684 479418
13509 479418 258426 258946 631080 239166 319052 383865 167421 239108 372777 417251 157409
13497 414780 431609 264646 279493 452063 331476 139107 278059 317243 566335 434072
13487 434072 420752 148349 151554 390572 263899 223602 268415 128144 419273 656601
13477 656601 327876 253662 37392 246204 190114 522003 316755 172171 -82252 65450
13466 151260 146329 102156 299365 320084 612272 189412 128047 199459 271532 196834 201928
13455 201928 263525 105014 270522 242546 436176 119709 418365 204036 27963 174780
13445 174780 165930 61838 102289 214304 88102 14907 254702 603617 1547 38096 217384
13434 217384 157999 252732 63983 234708 282237 137262 371649 176238 213406 220547 315561
13423 315561 165297 297901 331356 -173299 179860 181928 125307 123250 -22865 -147777 119055
13411 200259 217798 101435 329158 586234 14912 -80098 324829 168745 183322 248004
13401 248004 380994 238708 -85118 74518 102612 265279 194893 209006 -8909 17019 169013
13390 169013 258316 162979 222157 86920 266503 -238057 98228 131773 261201 347436 168625
13378 -48806 262119 473568 34321 173670 3173 37038 110101 469760 215809 236890 326492
13367 326492 253754 106224 207820 366551 193969 36047 -34148 34130 440057 -70259
13356 279689 -87571 210946 384205 305634 303559 461243 169045 -177555 248410 458759
13346 458759 -16251 245089 488948 470156 434671 190170 573605 120231 203467 -12540
13335 371365 339873 318972 91429 112675 195920 -28062 136336 271767 329376 363401 213402
13324 213402 94400 200837 113357 64923 112446 202429 -125867 513822 151559 364531
13314 364531 288382 401744 92989 114342 159192 265876 29180 293839 20016 305805 -141329
13302 85556 115663 101833 -2426 -160975 -13008 340943 2638 274595 -46610 143462 -27948
13290 -32499 91245 575141 193749 138694 350703 208202 287719 -23621 93437 122201 27212
13278 175792 122353 -246421 133078 153185 150956 322683 -255272 181879 -124411 22436
13267 328609 506644 -103750 136436 262953 90869 175714 188188 -231828 43460 112918
13257 112918 108444 168005 -133950 298595 430885 189879 400542 -121105 228334 36401
13246 11536 93144 -15279 35602 79524 234006 247642 229441 34424 245338 219497 -39593
13234 123407 250791 289495 171492 -40088 367894 165084 21778 -52388 -183476 29177
13223 317591 280605 -151435 -64194 115788 121441 233087 76039 -14264 142011 -63545 245136
13211 -139623 8446 -86791 174578 94568 108803 -96371 241959 254232 146522 249176 93303
13199 -57005 -39553 94548 144799 115123 6471 -535 -246502 197005 -169672 128132 1228 194009
13187 194009 56399 -37628 -71094 170169 -62440 -25895 -50024 -69827 193113 -168569 193418
13175 203389 232884 85850 -19618 279121 55506 -24137 57620 246760 163793 18794 -7500
13163 16903 98222 71169 112655 -5287 -220384 113286 247267 276174 247321 -28541 84142
13151 -87232 -301659 -45212 92426 3938 -202383 -36505 -47172 145868 -398379 148282 -417284
13139 88094 -84915 14834 -148937 163961 212001 35459 22671 437574 117405 388149 196666
13128 196666 62847 -170271 524888 2160 -143016 -34829 -260083 58140 231865 262396 150390
13117 150390 9204 347128 319933 404016 209385 89140 -151934 295757 136547 -137603
13106 22588 203771 -72299 167317 175115 -85734 -23050 -306477 -35710 161885 38905 187596
13095 187596 -214052 290585 79352 389925 -76571 -46654 227274 57541 62398 -98263 152035
13083 -274811 -53066 41415 78044 43528 -79581 81076 -138589 10519 263492 -10589 65705
13071 22488 217131 288102 90235 -164222 18661 276842 480607 -141891 184275 254529
13061 254529 208779 206022 115835 458800 213850 282828 202203 348532 306649 -87206 65511
13049 95498 233003 28913 166606 115435 397067 139631 136831 318290 285006 -363279 381932
13037 -199579 -133660 267460 244071 164804 312754 273660 -106792 14634 222033 133870 -61626
13025 -45001 224369 -167982 7401 48294 67183 285646 218332 136595 -39922 337079 -39621
13013 390991 51523 659 175111 448559 -74808 170913 3981 46945 -118843 241528 -221362
13001 -298306 -102831 104885 317205 65014 126431 161105 267707 -259633 171691 32992
12990 -93515 182053 16742 -221193 -114734 -226028 111049 172458 162897 146552 -82611 88103
12978 167037 27722 164265 118509 -12239 -471365 263172 -49217 158568 313418 62336
12967 -350402 -31734 -100469 -45296 -35123 22556 -15913 -35581 -251505 205954 194985 2312
12955 -138909 -182541 234729 -31365 -140678 -72239 -64511 139521 -28003 73813 -208312 -248177
12944 -248177 -202577 -174306 12502 126737 -144811 360425 118348 -75947 -96260 -89602 107386
12932 -24627 209059 203575 -100028 -270492 78396 29861 114800 -276906 46476 168058 198732
12921 198732 -70905 189642 -247094 82460 -180769 155865 237773 220821 94711 231043
12911 231043 42460 -312355 -130356 -99165 231735 -129203 6929 85519 167005 519494 24919
12899 87368 84078 151794 91541 -37034 106296 2911 116043 -82405 -71929 7196 -183577 237500
12886 282662 213057 171293 -19052 291359 -16940 -169603 17756 -72356 -124262 -29066 514660
12874 130358 -55485 17036 -59081 6559 -129789 -108150 157576 71776 -19692 -293611 -303068
12863 -303068 153273 61961 -133459 -390022 148219 199192 7718 19612 -135430 178936
12852 -18557 154145 -115858 -203767 208787 184067 -39507 -64698 -13854 -93206 -155270 252301
12840 555554 -123718 -123554 87735 -228168 -116501 -208602 148483 -408460 -114236 -158526 -50395
12828 -99815 -249206 -173487 -21197 -10108 -140156 439658 4471 -234927 -226935 112835 208806
12817 208806 6031 265803 324299 -189381 162558 50323 -5866 -371453 42462 96799 -226721
12805 13120 -286765 -218991 134035 381257 -100213 133634 212348 66920 -202573 105564
12794 -231123 55131 256273 47183 -8144 43771 -126706 90015 -263844 -131257 8348 -155768
12782 -52229 97218 112395 105275 6085 162699 19706 98518 -373514 119679 321327 -115739
12770 183468 18039 58566 203627 231798 -99894 -98435 -149443 -124000 36423 -161161 -290145
12759 -290145 -331991 283179 -130354 36665 -229966 55000 117279 -377274 212063 221024 -221516
12747 -79230 149836 275546 56596 -26865 176637 210053 -82775 -87681 7375 116136 -232165
12735 -19922 68384 -71276 163555 -306747 -160388 63991 241008 74618 228678 3179 -39130
12723 -90498 136582 -70436 -32148 309981 20320 403029 15363 -162683 226928 28604 88791
12712 88791 -46164 313620 229125 43529 407723 -73837 225991 74047 118059 266267 453688
12701 453688 59744 121110 331324 17791 176812 146168 -11589 191340 -222041 351480
12690 99083 245709 -105946 -75380 -13761 146187 192368 -23526 -168403 -38988 -122789 70629
12678 171986 103747 277117 -90137 266328 265216 99257 63924 52786 7231 -118141 -268408
12667 -268408 139313 186222 152124 285270 -183549 -90783 272577 113227 182849 -16308
12656 -236271 198905 307737 257900 233586 -79822 81925 504682 -264818 148124 -39374
12645 -35007 -213874 484028 -212797 51282 -172364 -117647 85516 211617 -232878 69008
12634 199436 30003 61047 -401302 -45382 -48394 66576 202077 51888 -124827 92894 114106
12623 114106 -50165 67384 -53928 144624 328944 -104368 14136 -183680 -184671 66184 86509
12612 86509 -3117 -267 68352 11214 237163 -150669 342111 219420 -31625 251585 148765
12601 148765 -440070 105369 -222970 413067 53016 129361 -158988 -35901 -115380 34256
12590 -70131 -409509 209402 -53952 13183 -88228 184293 144008 92789 -54665 108789 203824
12579 203824 -115721 170195 -261794 -189074 277527 -179872 373660 125626 -64806 -112839
12569 -112839 -79714 134657 151556 232034 -350840 -209056 162898 89320 -235097 6105 -50954
12557 237912 26039 180750 471019 192117 -120901 -145803 -153228 232195 -168335 7069 70242
12546 70242 -11771 246357 -139417 -172715 -301441 -225228 100239 109390 -42965 221906 122821
12535 122821 388990 -23955 -10033 16169 -154471 51467 264204 -275819 15469 -165396
12524 108010 173351 -297728 150703 143275 286674 19078 88125 -70951 52800 349405 208888
12513 208888 9542 -84715 -235407 37435 -1679 66227 -63107 -100983 -5281 75581 -294309 363468
12500 -91843 231055 5284 -149828 19839 -149418 -26870 -70892 -99991 116178 -222949 -87752
12488 -66597 211763 934 18406 -103701 -25485 -1850 -433052 83270 1811 -106847 -231857
12477 -231857 -43397 207528 -180734 -227798 7061 -90293 -160389 72308 91126 -43645 -128229
12466 -128229 127868 -297571 146870 -180551 146734 142953 -100821 -110993 -80110 218915
12455 165455 -8202 84671 221214 -152267 -429075 52609 -235516 -56392 -49169 130479 -137972
12443 138202 86276 38899 94251 458862 -95652 -185905 343544 211269 -45264 -168001 262607
12431 -36508 -260117 131905 -172092 130393 8097 -331957 350220 -322755 19847 -145844
12420 18821 220287 101362 -75239 -125936 -43274 27913 255794 -374273 80561 310959 128815
12408 -2265 -91008 37171 -59083 188583 -173455 91498 20088 122445 264283 43802 -108429
12396 -60264 -209149 -99278 -168911 -73136 275854 -134280 126757 2195 -49488 -167406 216011
12384 -152421 -11935 -187618 184733 94970 63054 60563 -129967 -64018 55793 315654 -102076
12372 -216201 -217037 -103991 -57869 23651 54425 76713 228442 41391 161393 7999 22652
12361 22652 -131991 41921 115411 170893 89448 149318 -61248 1175 -232284 -202225 -35372
12349 -22471 -96712 -418294 311590 -329584 -197284 163114 -105091 -213027 33417 -31781
12338 114319 -48352 216933 -72863 -5556 -160880 143096 -94468 11196 -140900 -133386 -207612
12327 -207612 -186056 116056 19894 157044 170933 -22693 315070 -119023 -191084 -21606 -236875
12316 -236875 167721 -184200 320082 -207718 89204 -202228 -94457 14748 142852 17147
12305 -29527 70004 -163907 -375076 153040 84709 -6652 171832 -43353 24203 184393 -126187
12293 8807 -66887 -109207 268129 41341 121388 47418 118873 -72340 -328593 -112621 71423
12281 57744 -296112 110863 -112008 154445 266011 63976 156036 280678 222506 74383
12270 362068 199955 201054 321875 221251 44772 -364959 -46955 203031 192299 -62700 137421
12258 -140390 -202275 -31077 378522 -155582 222278 250071 58551 3687 -216320 132375 -192654
12246 337673 189633 179298 167505 386801 267843 309461 411934 64370 371170 95671
12235 158509 -114893 113302 -44980 150116 258708 123866 -6569 277841 164648 342771
12225 342771 179276 204887 313091 256234 538279 182076 52679 453787 195308 157926
12215 157926 -69714 274985 97679 59428 317974 215314 -71898 291910 -119021 88238
12204 293126 235770 168110 127761 266920 287260 286827 313847 -243844 129506 425191 -123518
12192 508006 216260 -15945 323645 28348 -76025 156665 85836 386471 125738 241148
12182 241148 -37519 133478 181856 -314597 81968 398194 127108 153448 -151912 40810
12171 250266 -10501 185350 353564 -110115 -259624 359260 12937 -114781 270114 251411
12161 251411 -15415 34409 66106 26111 -145110 -260020 -180337 460682 206546 -205637
12150 99212 247748 -25974 22581 241936 189149 -200988 -255105 252716 254392 -99006 21905
12138 -5487 103342 139369 -344481 272573 -41767 -99841 -230510 7357 203910 -323377 365383
12126 -40851 -199542 -65214 43975 -26842 -82094 -69900 -66509 -156472 -33879 -77823 44120 250938
12114 250938 -64320 266144 27646 -266 348694 135671 -2721 -166131 193609 354078 146215
12102 -46534 -151698 -112995 -54054 80192 56220 118592 84602 85357 143156 -116152 -82257 -105316
12090 -105316 32870 -39969 -2466 -175766 -331113 234720 34062 -17381 231641 223235 -430093
12078 -27559 -114133 70885 136659 -328198 -140390 32377 128525 201506 -140684 664519 1504154
12067 1504154 1246568 170214 231913 102203 -116107 494495 -240435 206208 167180 -131443
12056 -180794 298021 144143 394736 135249 197100 216314 193044 69072 -81444 -304629
12046 -304629 6768 -71351 -25894 -185059 -112004 95608 -20447 -51217 -129244 3393 -105065
12034 -455 286875 57978 -30173 294441 -23862 141661 43701 -315277 -115189 137817 -79706
12022 -218125 52367 -76398 16617 144113 -307452 292395 -123681 -367834 -52714 234448
12011 -170016 4506 66352 164220 60877 165386 -12050 194280 188504 -9588 48730 -170645
11999 41247 19516 334372 -96147 -226395 -131759 195809 5782 -232625 -160245 3093 117461
11988 117461 -37774 39644 55129 -73695 -261256 -49457 -166234 44378 -189208 598563 -517670
11976 -74029 84894 -125903 -39624 -118352 -2616 -154459 117181 12783 107813 -221406 211983
11964 2042 56149 295146 -286525 -240518 324482 -90261 -337967 -17632 -28970 -18877 -3158
11952 175142 -16122 170640 124667 -319953 274692 78797 -32909 38805 -53700 185409 42451
11940 94035 -345956 -67283 -114488 -153533 -567234 33414 47834 -174809 117964 -42585 -292890
11929 -292890 362179 -145379 62247 11148 188770 102816 205227 44774 23725 -25314 -207473
11918 -207473 -197085 -276967 -200084 -79459 -87334 86288 -191546 36362 -235424 42235 101970
11907 101970 -44403 -51886 7045 -79159 79424 -318324 -27857 47043 7955 -293732 76585 144535
11895 144535 19670 221482 144640 -134753 114902 -12993 283221 83498 209289 -209711
11884 -237245 -102554 -87955 -186048 25928 236285 36602 -306801 203221 -218988 365993
11873 -138199 146391 105376 113604 -154405 -26225 18588 -119398 -25281 -136286 392220 60717
11861 200916 66690 -31591 81951 -68394 -121581 -195520 -82767 -4632 -11759 -75654 -127044 -166873
11849 -166873 -229937 -32032 66886 -381390 -116434 298143 72035 -207973 -90879 -97025 -122194
11838 -122194 -124539 126857 -259999 -187713 -181270 -67861 -103873 -167369 60575 -340687 -158863
11826 -364002 211244 -480720 246501 -5123 389322 1088 16528 -224355 269565 169942 -25086
11814 22521 -39830 110645 -302351 21165 256828 -33383 -138248 65287 -15376 -342238 -113361
11802 148910 -169893 50144 41896 352525 68251 -52434 67224 -98300 -354715 -96198 -115054
11791 -115054 -6037 34230 126505 262545 21492 -259688 -127493 -81989 -215143 -190971 278477
11779 78406 11813 -21642 -133698 39403 190170 -55983 -212164 -185217 24096 -303462 -29719
11767 -207502 171989 153359 -231149 12022 -142975 -252402 219429 486790 -34087 -19751
11757 -19751 -122220 -134839 29469 128824 357076 -289749 -334437 -239606 -123865 18369 -55004
11745 84587 155006 -187182 195322 -323983 109118 -85853 -254345 131966 136130 -83226 382656
11733 -22830 10728 112967 133424 218641 49789 21688 51676 -61190 -79272 -197680 -112862
11722 -112862 88094 110166 -165792 281413 60677 -216666 5437 -311524 1791 -165457 65435
11710 -56542 180345 186173 165474 318492 -7181 -180123 228333 246329 -8526 120127 -387322
11698 -279422 -413466 -1164 52983 90772 224058 -46496 -351858 146848 308551 134463
11687 68516 -128440 94867 -62055 -62777 -5314 -164417 396598 164493 52876 108275 76047
11676 76047 266751 260686 -55662 -175728 104492 78340 26334 239844 94173 -127716 251778
11664 142398 -23903 178132 94766 132497 174720 -266957 51921 -162748 -110777 -129668 -192868
11653 -192868 201404 68184 -152965 157182 214343 3188 -141666 155480 -15564 -104580 27507
11641 104861 126717 -21556 -153842 355243 92305 -193325 -148474 -191509 -6882 417738 -8501
11629 -1926 317919 163739 78858 164363 367759 4684 106724 73230 108814 152232 108421
11618 108421 130802 233855 -5006 -46129 -139955 -16770 92696 150843 346680 -148892 -17774
11606 -65147 190481 -7114 93501 37936 -136212 135043 27155 155458 11911 12331 130356
11595 130356 -113003 140752 -120429 29357 -67180 270415 324952 251867 242538 50835 92529
11584 92529 -176360 179062 356 58277 -359932 219461 -99852 63983 275183 -91028 147293
11572 -92690 223 164106 3056 328863 223995 -40604 -312584 -7007 -236928 -278783 -42431
11560 -147382 105721 -276722 61407 9116 9431 42311 97966 -33933 -125177 177565 261579
11549 261579 195735 9406 59952 170066 200686 -42211 -58444 667665 197553 26435 -93695
11537 254460 -53233 114060 25222 268234 -144185 174851 190000 506719 253937 96755
11526 32894 100784 40112 36800 408817 128950 2862 203977 174647 -144659 87994 106489
11515 106489 -160529 3692 96848 -145934 373546 52623 -157288 214797 178172 -127478
11504 301312 200897 80380 -118270 157771 -43334 -61367 109125 -26322 203671 143449
11494 143449 227248 100474 227961 238900 137773 157527 372142 70649 -142304 2228 -43314
11482 129055 51282 115651 170133 25340 -12776 254458 452760 65032 381922 236652 385487
11471 385487 421382 -15011 198018 99402 -10894 140877 150950 -47222 12600 151149 -100667
11459 -202683 84452 162406 3794 6844 -1359 256012 -136115 140355 6890 260653 122294
11447 -64613 88776 88815 -44366 11885 123185 114604 152995 -8753 312791 306170 -3520 100212
11434 -26132 109595 74457 179338 214922 73328 385056 -88710 97486 26602 315613 34187
11422 94461 155413 97157 117854 -37001 340427 -71225 -211982 -59603 140553 -120075 -309277
11411 -309277 147610 116307 80032 43766 -65611 6893 -173710 131939 -104868 -40371 58064
11399 251449 196542 -129975 25290 -92514 -527218 195356 4651 -93276 78353 261861 79057
11387 134044 13189 -187511 -39865 -239125 -174727 -30715 -61173 22851 -42745 393081 313709
11376 313709 331713 176039 169061 115668 -68580 34162 -70908 -973 -220842 17171 -30595 53610
11363 -88704 -334862 -91796 -132767 26073 -102937 -100536 190552 -208843 -217695 -116007 109626
11351 -118764 -322599 168094 -47448 293436 -8599 -143923 396670 49111 -346168 -93994
11340 -74537 -28499 42846 149396 128676 -94143 21175 19913 61761 -68627 -111683 74382 -8547
11327 -12047 292956 -47229 163508 74977 -113196 -251459 486046 58301 337490 45340
11316 -276495 203174 154026 -5919 -216087 -207799 -234121 41541 -288585 258415 -223533 219320
11304 6351 200440 -135130 -38142 -287738 167493 -203181 -12571 -202963 101183 27996
11293 9590 -200167 -347056 173328 -133478 379154 -144987 -250498 45596 23086 -10878
11282 50706 367820 20201 -205355 196057 215703 -60370 88667 -145084 -341850 -86311 -169533
11271 -169533 -32994 265947 97072 -215821 65087 -42055 235455 -72372 102938 -24736 -12524
11260 -12524 -207039 77528 172940 -126549 -147882 -200242 -87909 41974 -81162 -243245 -58318
11248 -206978 35034 -88147 -24829 182801 -255171 269141 -140805 195536 -53328 107228
11237 171764 -41944 -72752 20003 129781 -181932 -97400 341709 24012 79289 199144 -45475
11225 -26513 91125 10314 -137231 361857 48846 6989 -310329 -192990 201524 -173739 -338879
11214 -338879 -173532 16481 -187871 -74618 14250 25551 -28696 -137823 249228 -222372
11203 41398 194776 196782 41742 47161 -164403 113708 18096 -129445 54029 -69651 89084
11191 50472 -295465 -127057 -107568 -284515 -297008 140297 167782 76618 159360 -19884 -326605
11180 -326605 -64145 172837 -205523 576 -428592 -25898 -74292 -142891 18220 -200471 34942
11168 -261869 -101464 -223588 -70043 97983 -80533 -77662 152712 -14112 -162539 -330011 -208665
11157 -208665 163969 -184107 219804 217137 -187453 222916 -98375 -69694 -304561 347885
11146 -153054 79380 -180601 213672 7284 -148979 259576 -337732 -279291 57428 -65853 128092
11134 49967 79792 -120946 -40707 379010 131256 90571 139588 -162836 146928 -115813
11123 145425 7564 87347 21302 -95843 248217 -64284 -147800 309332 -180255 -128207 -14149
11111 274326 65003 31345 244687 189217 -118802 92849 -13841 293452 147026 317647
11101 317647 197401 231266 274183 54390 2365 301026 189632 67532 77830 96040 357959
11090 357959 -84744 52058 418863 204691 -32123 230693 288182 123686 -186029 186046
11079 187496 106670 68183 322494 531651 258136 582086 238291 150732 328621 349831
11069 349831 331885 79840 110351 340173 566205 545681 538977 640404 328016 696114 536370
11058 536370 466518 561231 614585 1004891 557920 585888 688827 657642 761815 469824
11048 469824 1001556 905596 366581 707741 363199 429918 728587 623539 713868 422155
11038 422155 1087998 850977 526316 752690 738654 631794 298683 776270 585747 932810
11028 932810 825535 797497 765039 688151 630588 739377 849560 514942 660360 839913
11018 839913 433198 443722 294539 514947 489272 707419 760865 382099 805778 636686
11008 636686 651467 524611 519209 559940 591838 571971 716530 465639 761867 644081 429119
10997 429119 520899 656307 544777 975603 875942 721005 775618 932106 755846 788670
10987 788670 668154 754265 876437 1247615 1257250 1626698 992797 1557670 1489481 1561550
10977 1561550 1772272 2084214 2055754 2748236 2744100 2769999 2446912 2408082 2768605 2669841
10967 2669841 2304668 2303836 1919258 1647195 1888972 1954465 1652921 1741680 1906684 1704960
10957 1704960 1791600 1766150 1681594 1440790 1300119 1248670 1170143 833316 643485 996332
10947 996332 103827 38321 320818 130345 -47904 263068 171943 227494 67714 -245911
10936 17209 -47104 427442 431066 349841 -53487 119915 202831 137825 -134253 36438 267525
10925 267525 125589 -168203 179824 -110782 81045 -92152 81113 -127290 55538 -31988
10914 -63108 46114 148261 -102005 80205 168571 -96519 23604 232721 22706 -104881 -260438
10903 -260438 24061 -163287 -11503 110317 -192897 -23254 -145769 -27747 9694 326556 -47355
10891 -314606 -191768 202960 18270 -141427 49873 -82291 -200404 53945 257771 190644
10881 190644 -455354 -46935 -11643 134263 -37396 -106161 -203122 28635 -38197 24518 179888
10870 179888 -149577 -145377 -118342 -30451 -39119 77721 374543 -27024 -411211 -310300 52300
10858 14761 177090 -233256 -209093 65745 -155121 191058 150511 -106562 61015 248132
10848 248132 123908 -691 -86996 -100561 -11494 -211688 90265 333647 200935 -47962 159702
10836 -213477 -88803 392721 -240185 -143477 71493 -76097 -80642 -296037 121973 170539 32501
10824 -54419 162798 179248 -48427 -64864 -288773 -68448 -138521 21018 39967 23066 -29765
10812 -141701 -38859 -103929 126159 134730 -21256 -366164 -91542 154759 -15010 -314596 -65827
10800 -6549 217978 217973 135454 -237719 -141126 -283033 -33235 -258211 -3467 -257841 328060 32380
10787 -33379 23447 -69491 -67298 -210317 -129045 -102638 -211460 -36246 -217522 -81158 -28581
10775 374900 -73607 -86038 147894 72475 -168980 -66045 268181 -46522 201538 -6066 -121263
10764 -121263 -143400 291813 5731 -262881 -1584 -347251 -212289 96046 -124421 310254 33061
10752 -113179 102189 -119886 -56010 104331 -20084 -52477 305594 -442515 197179 34779
10741 -172241 93910 324468 -288263 91947 -278571 144870 -240864 273339 -32879 27993
10730 -118237 217948 206867 -18829 110598 -60958 -82400 -83027 -137186 61555 -264709 60379
10718 -163314 111650 -32191 -85974 -191262 38447 -296895 -100947 -235222 151539 -209855
10707 -49066 -310707 15789 174340 193458 -329247 -118449 -51061 -139010 106551 -208649
10696 61483 86574 159155 116029 -105248 28318 55470 -145896 -324221 -219145 -120697 192900
10684 -132410 40591 6287 -217018 -212653 -157435 -178773 -232414 -185067 -307778 192393 120064
10673 120064 156781 155198 -32297 24597 55695 -164506 10991 -31485 -143507 66071 280542
10662 280542 105368 -146909 -98283 -154161 -149999 22192 66385 532 18903 -59152 -53977 -368452
10650 -368452 -24879 -80047 -45959 -10656 289377 -93360 -72451 79795 5504 -39621 154570
10638 -359911 -93843 -192308 139815 72569 43866 -182003 -262384 -143330 123287 -81844 -39542
10626 -278605 -139854 66665 245079 -85565 115652 278244 60292 -91331 -48782 -35815 -190589
10615 -190589 -32523 -120179 233269 -148829 -259264 -111321 -49037 336643 -124375 50471
10604 50926 -21085 169822 13223 -22051 -175333 202296 -2589 163106 207276 22021 -20535
10592 -125266 -365315 -252906 156550 141889 -20552 -3668 -117279 304023 -400823 97104
10581 -103182 -47487 -50390 -7097 -78028 -236086 124568 -145131 47176 172783 -73448 -62720
10570 -62720 -175897 -130225 27964 6612 172757 -72374 -75406 -107188 -387115 -199883 -73161
10558 -408009 159749 -133427 360439 138202 -268718 77057 51492 225454 -395323 -85807
10547 19242 -131979 305546 119784 -239988 -73940 53824 -189513 -215667 83397 116283 -196882
10535 102816 122416 -23182 23529 -295887 78037 -140625 245160 -53280 -368487 145140
10524 381630 277769 -244593 -338229 -392463 -122581 -151336 168617 -287637 48609 223982
10514 223982 -40364 47247 63091 149905 106906 -89999 113304 -175595 -34618 -179290 -320224
10503 -320224 3956 -6408 3968 163968 -276464 40016 -348847 -103731 -81342 334218 39149
10491 -172457 -370857 34322 89530 -416818 228582 19471 327075 17254 328714 337328 379258
10480 379258 534664 -90952 149506 256420 37181 86737 -301659 40789 285070 11657
10469 186924 298849 289724 -158 -86670 -54396 214303 97368 29570 -317116 199073 149150
10458 149150 -244709 46982 96516 -63968 -100909 -162401 228653 -116065 9111 -253254 -2627
10446 -107018 63807 -79099 -16371 164290 123015 49037 39243 80661 -176711 -453732 23456
10434 3184 -91797 -4039 -18666 -282375 268407 169345 69132 -190809 425013 -200419 275732
10422 -130486 -5689 -237286 113357 -127640 -64771 -150077 -120711 -123601 191890 -49859 -159458
10411 -159458 -175763 -75485 56890 -277805 265876 116435 -7547 -365 34559 -42722 -84984
10400 -84984 -100495 -240716 281498 -226958 -118348 3257 141146 77498 116105 85994 114511
10389 114511 88142 -9764 240897 249946 53872 379838 252291 119634 219934 -3327 298084
10377 -162830 426211 252432 284004 105980 379280 283396 371325 495014 414455 380957
10367 380957 536278 339130 222527 172522 232811 251406 435475 218805 316910 392870
10357 392870 289881 11053 159846 54254 102452 302086 386639 546829 765231 207921
10346 129392 487871 144530 230514 399104 259018 201781 13833 96931 254721 93600
10335 362464 107544 263923 -218213 180400 -48852 92418 -166613 194613 129649 217749
10325 217749 -56379 372118 -31973 21550 373017 4321 130690 3118 196258 49019 110915
10314 110915 303700 289103 276320 277421 -245607 -416935 -56735 52616 -311798 -125771 111443
10302 68285 -30286 -268263 17438 -192764 161714 -19335 11726 177680 326413 -201433
10291 5867 -97812 92323 94037 124861 -466381 3101 -3753 -86934 4377 275315 -74160 93070
10278 -99010 280167 41243 347081 -105426 38390 -230264 115305 105926 -62423 154973 -251555
10266 37066 -49456 -136153 -289883 273934 320792 541698 362042 563580 99157 394726
10256 394726 292454 343401 191058 -154049 -194890 108785 307116 152510 -232237 -219931
10246 -219931 120114 -87830 -203702 -131364 83921 -145415 249833 -29414 19676 261863
10236 261863 154978 172383 -11423 -56867 -70221 -377773 76465 -202380 -226539 -171647 148483
10224 -178312 -280868 -45151 -102634 -42472 -238852 72515 149818 5048 -180209 -84264 -111891
10213 -111891 -218651 -130027 2777 39189 -27250 -70790 107997 43020 31773 -260424 -50517
10201 85996 -144399 63126 137978 -183462 -187759 -131485 7167 33384 -113469 -294267 11886
10189 -185887 269453 -231224 -130980 -955 -117923 -172418 -168999 -335074 -159188 -205865 184665
10177 8544 114936 59637 -275669 -14791 -29427 80765 -24824 97242 318715 -364659 226264
10165 77703 284375 -208186 192891 -163928 155358 -19132 -132091 33771 201066 -149910
10154 -105170 29903 186320 142592 -205516 -14514 40211 -305774 2820 -72111 -335457 -159531
10142 275540 -274279 -124085 -72727 -50459 -349021 356396 200363 -284385 -125903 -6997
10131 -389829 201152 17030 90823 -175825 -14209 -90896 26296 151790 178116 11278 -327347
10119 -127251 -280079 -197067 -6369 1900 -306992 188253 -7824 46738 -230474 -302187 25584
10107 167709 64939 324044 51852 -46262 92406 -5803 -125516 21541 -73977 110561 56328
10096 56328 -13393 -124641 216595 -14256 223176 157385 -69648 -159543 -143136 -242887 226272
10084 12722 273357 -155833 -196926 -66670 -204502 -160323 157206 44850 -115446 -176454 -223233
10073 -223233 6384 -15378 -37165 -323584 49684 -94452 -205831 -61537 6326 41899 48209 -183967
10060 -82258 79217 -14236 247105 161856 -19677 -181332 -258029 174263 302185 -129657 -213539
10049 -213539 -8301 -22042 -233936 162555 -30671 -183183 -196603 89044 197194 -27501 -151172
10038 -151172 14342 100592 -203041 255820 254645 85672 -101606 149119 -52983 -266712 -381148
10027 -381148 -231456 316553 -189822 -290827 -26981 -171289 96345 60959 59163 -338548
10016 -93409 192530 -68296 -246578 27270 -78817 -112906 -61414 -84981 243907 -138664 -380654
10005 -380654 -259527 204436 -21603 -79844 204349 -292015 -157034 -41237 -154370 -368512
9995 -368512 -141053 -151469 -9998 -219533 -7802 28594 -184934 11923 -68625 51558 -50198
9983 135702 -123643 220812 -228891 -170161 43909 -97955 -137935 3855 162017 -16856 -146527
9972 -146527 -167253 49901 -21027 58312 -122378 104708 115135 -74221 -182867 -206590 34069
9960 -110870 205054 -188558 25114 -137230 -103380 -119539 -121204 -309105 -217882 4077 69132
9949 69132 53005 217116 298258 -182609 121956 -363141 -256513 -86890 132044 150350 -166306
9937 -200785 -17911 -98203 55381 -123950 -144695 -321184 -118140 -472204 -5048 -235095 -73027
9925 -243922 6566 332 19481 -145314 -383208 -139885 -55659 229745 510 329834 -49496 -192542
9913 -192542 61180 -131019 -294869 196709 -319008 -266252 -103097 -54421 306556 -211527
9902 -92522 -108331 -16158 -153231 -114848 -153998 -292430 -182871 25792 -318187 27225 -159155
9890 147828 -56164 146338 61248 -211188 49466 -184960 -74486 -69345 -108027 123661 11476
9878 -4231 -238999 -398664 -129002 -179985 412910 59821 115554 -358296 -32634 141970 -143776
9866 -234415 -98354 -290118 112089 2493 -104270 145993 -277625 -213538 19257 65640 -580998
9854 11740 -321155 -163649 84986 -59562 49262 180 -80041 -99445 -322179 326695 -136575
9842 -217467 -188496 7836 -10974 -131722 -132580 -247411 58405 -302276 114697 -282147 39450
9830 34951 -169422 -337444 -222516 190837 283700 -228261 -139861 -40685 -148992 12157 18613
9819 18613 18523 189346 -400617 -120058 22739 -82695 -352701 -111047 -290176 43359 -291155
9807 11520 41149 121425 -143570 -41555 -237567 -370182 30921 -3593 81934 -82757 -83045 -78459
9795 -78459 -11174 -195231 -162486 -23338 204741 54941 37528 19856 -234200 -126837 -206
9783 -108052 -4317 -153467 -164471 -64598 -27339 97085 12131 -287560 -88151 161700 -92683
9771 -68005 354340 -145124 314734 131047 12168 54716 -433922 -124463 -66301 -136373 -153337
9760 -153337 -310903 90133 -219382 -296624 -87996 55573 88722 -63901 -367930 -130210 -75947
9749 -75947 208506 100565 -158108 -16676 -98497 -245154 -82275 246244 -20217 8813 -119184
9737 31109 -175170 125887 7190 153279 -173994 -291771 -342121 125434 -129095 -308226
9727 -308226 79755 -112038 -174207 54269 167573 -278432 -52554 -478612 19793 45999 -161308
9715 -364318 117378 -266007 -34196 266706 -137785 -92157 -152967 -31439 160684 -59440 45335
9703 -49165 -108137 -163159 71668 7496 -120037 102006 -231574 -289129 122364 -88390 -126165
9692 -126165 37863 -69702 -337503 -3413 -114037 -190023 318511 103626 166540 -277979 53601
9680 -129205 -125105 -122628 11664 -339394 -337930 12975 30564 -227303 -90650 -273093 53168 -131279
9667 216906 263472 79635 -17394 -55152 -347110 -26758 5506 -32780 35281 162132 116718
9656 116718 -126755 -50814 65097 -315870 -161282 -11894 -275347 34825 -82113 47067 -80471
9644 20742 -177294 -451280 78687 116101 -21420 -87422 -224182 110859 -181084 -165604 -46218
9632 -172233 89680 -245924 129518 -70945 200984 -131481 -38485 5998 133806 113332 -513422
9620 64907 435701 -180934 -282818 -151180 162487 29945 -295074 44731 -203213 -171235
9610 -171235 -182176 -183849 -34260 -16576 50811 -89475 -80166 195252 -207621 -200864 -141122 40530
9597 33973 -430301 -197868 207169 -28323 -199182 -163706 219338 -219434 9809 -317463 129756
9585 51900 83499 -103502 -168814 -67809 -27274 168790 -451241 57602 -122318 -292701 -166148
9574 -166148 192811 164774 102055 -23534 10044 -144859 -92685 -48661 -117891 -219509 -32029
9562 -67357 -325426 2693 203922 108805 351687 -149527 -1723 -52996 -70806 35166 -285178
9550 125291 25096 -221023 -362174 -148698 -249146 44376 -144983 25088 -167615 -199192
9540 -199192 -142744 -53262 176642 -106525 24829 208584 3340 93604 -116383 70807 123451
9529 123451 -219462 -71075 45009 56751 -11514 140695 -352346 -76960 -97644 -107633 -208831
9518 -208831 -168288 113257 -127114 -430205 -92898 -260396 129935 -329483 166172 161552
9508 161552 -287812 -445965 -187385 -214688 112336 -87765 138735 -164377 196711 -330923
9497 -213741 -439556 -244627 -144886 239559 -9550 183373 -156918 -95557 31860 -349980 -160960
9485 -39356 -71755 6419 -242039 -79284 192193 66662 -120657 -140808 193211 70436 -278335
9473 -247419 19400 -75003 -116676 55396 40179 23076 -241180 233704 -89593 -258234 157874
9461 -109029 -228588 -246314 98828 -134151 -33833 -115652 -50964 -176402 67821 -101613 163039
9449 -258540 -19606 -134293 -107018 -53831 278336 -235999 -85035 323557 -21521 250497 6422
9437 182109 110953 -238657 -86735 5104 -31272 287103 15878 -48385 122399 244569 -143808
9425 -77604 -241354 -6925 87436 124007 -86893 248300 -190918 107305 -82355 -102033 152587
9413 197149 -84712 -148402 -119734 -126136 -238188 195352 144030 199975 -291817 -14139 -32058
9402 -32058 -112876 214807 -172246 -521170 -157934 71124 120519 -134779 -69286 -330328 -161830
9390 -91800 -207895 167325 377101 -278418 -69604 51901 -188339 -13139 -155607 -187191 -10351
9378 79422 -84661 -128442 119585 97565 514886 -171349 63114 -284088 328243 153600 157063
9367 157063 119425 -51734 -245570 111645 -254891 -107155 109646 102216 -114643 -193790 -172081
9356 -172081 108365 -110704 110459 -167348 -83009 207684 129634 -172544 292787 -141162
9345 -272875 -183099 -110734 116841 -127487 155924 -248156 152677 -135941 -220073 -171867
9335 -171867 -151313 11415 -233813 80386 -58351 41242 -187230 59101 123249 -131469 122665
9323 88604 -1568 -98965 -177764 -109535 37890 78473 -328174 -148575 -223623 -117391 -60574
9312 -60574 8029 145744 -140070 -148752 -78874 -179446 -28393 -34071 262052 236997 34941 29460
9300 29460 189527 -136590 -116955 -124205 -410086 -173586 163085 -373774 -361507 128569 -137374
9288 156429 -265877 -429 -125257 -184960 -11487 -270393 96468 -122153 198615 -205696 176070
9276 -80973 -38415 -73858 -194586 223232 164833 -91003 44953 -482027 286019 -83272 12309
9264 115523 -220011 -266984 -84926 -141624 -231013 -121412 -216465 60794 -303960 -87215 -273405
9253 -273405 -55164 -159245 -191396 -269347 53899 -248744 -293833 139565 30761 -46300 -123484
9242 -123484 90487 -288051 106903 -72533 -39239 -272744 -48353 149108 -230859 -362085
9232 -362085 -180190 -135253 -16952 -40478 -103013 -356723 114560 48368 -257811 -18794 -196375
9221 -196375 142746 -90742 -101568 -116348 138588 87589 228926 -48622 -116065 -51667 -474610
9210 -474610 -366469 -128468 91296 -371602 300629 230866 -23107 -115773 57732 -88681 -194309
9199 -194309 -25629 -65248 -167783 -117527 -251863 -30362 -76378 -47547 -155417 61863 21979
9187 -448005 -193300 -231978 188616 -102378 -216077 80324 199057 84965 58953 9250 124860
9176 124860 -417649 -54773 283170 -224874 -310988 -131247 -290927 22903 72171 -216062
9165 395272 18854 140232 134045 -149986 -111537 186900 -22718 15709 119631 27878 188501
9154 188501 85447 -88275 -247104 181152 -120130 -258678 168556 225651 -94610 -113869 38692
9142 -43639 -115789 -74200 167705 -157036 -275071 -146929 -168287 -268538 -99677 -266184 479819
9130 -47364 -121519 173392 25286 -156854 -95587 232443 13944 -184869 -1200 52578 226744
9119 226744 -31864 -34126 77988 -129813 -141495 160867 -279725 -38189 -13692 -45548 166821
9107 -90209 -27990 20821 -217027 -373951 108711 -197562 -44379 112611 63912 175471 -308067
9095 145125 187509 -252043 85638 -273077 -228850 -126544 55164 -242541 -231050 48774 77453
9084 77453 134279 -467837 -409379 55411 270655 -292816 -65866 45445 69012 -142767 -57912
9072 -334154 187725 -183229 114497 -72176 36048 206874 -145440 72127 -277130 111706
9061 -274049 -282588 42409 -28241 -304118 -172243 109483 104499 -326186 125793 -105588 7961
9049 -311790 -263107 -75330 192783 22160 -10730 -49212 -238804 -71843 50796 -171756 116311
9037 -246951 257048 -187809 -23692 66855 -279616 85561 363639 25908 -43431 54090 -86413
9025 -21944 -24285 104753 -29178 173860 -159810 -147300 -169521 37383 49739 102695 -152639
9013 -286565 4997 182237 224981 -23807 -256581 -198002 56557 -217631 114870 -195245 -70630
9001 -295009 181377 229595 -75967 56725 -78711 44357 -161638 92519 -143504 -160054 -269560
8990 -269560 153072 33762 -373512 -137816 -333752 49576 -129023 170252 -23110 -140021
8980 -140021 -379006 37417 82107 -216821 -190173 -137383 -4171 -54927 -182633 -14433 -67799
8969 -67799 -270012 -37539 -139688 148141 -508607 53871 -59783 171268 -17387 -291412 16522
8957 48249 55707 -168813 268405 -522836 -325290 75038 -249733 -95890 2290 -8645 -133589
8946 -133589 -288833 118823 -291841 -91992 -153772 113378 -104306 -186646 450436 8398 -170562
8934 352922 67097 -71194 291233 -198750 113040 171623 301877 -171625 287514 396598
8924 396598 1464524 3776853 13268618 8561886 3161534 1200569 722607 519735 473013
8915 473013 252357 -14977 186831 358571 355955 162764 319525 330404 39572 -95921 -86340
8904 -86340 -40579 -50795 35686 25036 -185704 -1858 -215761 100053 -209308 263675 -24509
8892 -82564 -120276 -76199 -270908 -79380 70699 195677 300241 175561 53057 84069 -62756
8880 25929 -342932 24565 66779 -166810 -250851 -239066 -100868 -46776 -175206 105882 -154909
8868 -2296 -121339 -333843 -166272 84057 -251064 207629 -190181 35178 -152922 82681 39428
8856 44909 93830 -101325 -37324 -183605 62428 -26227 -58785 -47321 -190347 -240393 -229552
8845 -229552 -256130 -129194 -228300 327892 -266098 -154911 -95409 -399777 -180356 -173122 -70107
8833 58018 -117735 -62841 158576 80245 -1013 -150657 205528 113110 173323 -624916 -190289
8821 -50669 324736 -267646 -262805 -301034 -164503 -22662 -34130 273418 -203016 -274383 157420
8809 -4210 -81993 114118 -78728 -345027 2498 56376 -11265 274163 -263364 -169165 64936
8797 -82499 -123908 -141012 129886 -37107 -211964 -13732 85344 -104294 62231 -100707 305843
8785 -61933 -49789 129467 48406 -325410 -19715 59631 185971 -212414 -60505 -188806 -141317
8774 -141317 29892 14643 -191683 76438 150851 41627 127180 -48996 -298914 209392 -368162
8762 -149526 -155624 215487 178583 -62018 -261357 -33652 31793 -20404 123588 -132713 -215746
8751 -215746 -152969 132317 151592 -156450 -322069 327363 312300 -229834 -246768 -102509
8740 208733 84265 -300137 -16694 200063 -145542 -29295 -72124 243800 -70140 -49338 120363
8728 -232418 -78866 81113 -43048 326901 31996 -107982 -206906 -262703 -133297 -234311 -83957
8716 51531 -26193 -72638 -267547 -32463 -36798 -60144 -92785 -81972 -182278 11547 159866
8705 159866 -84608 -433698 -43445 -75393 -212543 -109647 -112232 -16972 105731 -377077 37104
8693 246936 85638 423332 -194616 -71023 113960 -19751 -283342 104901 -376085 -72790
8682 -70855 35095 -30432 144620 -75621 152741 -144769 -415670 159871 -120151 -351038
8672 -351038 -36306 117653 88512 56576 -206791 -146475 -88123 16964 115849 -92312 -375572
8661 -375572 -124722 31640 -193024 22477 -107035 -70409 -219271 9666 -96732 -71774 275757
8649 -216298 103459 49361 303259 19913 -215791 -1765 -254564 -163418 -187573 -156870 -59628
8637 106781 -70069 42758 104267 -75900 -231387 -171932 -424218 -104873 -192668 45708 -214248
8625 -13016 -258568 -78140 -44855 -254271 -161534 -183636 386293 97838 64416 -226364 185973
8613 -64736 -105041 -158143 -6692 -63315 305748 -52941 -404837 -401020 25966 206683 -544657
8601 98447 -186958 174632 -23717 48344 -188764 19894 -200411 -243849 -213821 53907 -145576
8589 140989 -207491 94827 -172964 11627 102318 93171 44371 192790 9383 406452 12875
8577 -259342 4691 259163 -201922 -35837 244855 -221595 128139 7126 -125312 259273 63259
8565 -51038 -144748 -11456 21805 233655 107484 -160174 126379 -219490 -93409 99146 -105898
8553 -419566 -192669 44663 -204397 -53967 -218451 88871 4166 199073 102850 -193342 -142932
8542 -142932 -172771 -27928 -127562 38171 144530 120635 -50517 -150794 -243991 -150682 -32054
8530 -271510 -89447 95085 209411 -90675 -341166 -398660 -305348 -167683 246158 397174 -136607
8518 -278740 -56059 -48869 -336015 153985 45925 28074 -85999 23981 -59569 -178234 -103295
8507 -103295 109822 -23647 -63094 -18813 250948 -247330 268099 -23478 -177288 -289724
8497 -289724 147695 -230071 101975 -32943 235973 -151865 186549 -181952 -240894 244413
8486 39594 214708 100856 -176737 32257 5965 -80350 138064 -434760 69176 -67044 -238131
8475 -238131 -138681 259618 13388 -79446 207152 -134180 -239302 -224893 -432127 184039
8464 -78753 175267 -99801 34246 96001 -104688 127346 13741 -9816 -92333 52228 -80081
8452 66902 -293890 230928 -77249 134503 277556 12710 -107303 19972 278807 -82877 -22354
8440 -51537 -213492 -163385 -382832 -21087 -139761 -46167 -202641 -187742 40490 15387 -41908
8428 119453 -55985 166598 -68721 300276 -327413 119939 -64487 153036 111875 -107906
8417 37733 -153287 -116136 -339636 50840 -343732 117076 -240941 101936 -121874 89886
8406 -285359 129257 88857 182547 -94038 -332772 -87786 121156 -321779 107709 -220926
8395 -145137 -274988 119091 -207964 -294892 -47905 -47204 47887 -66026 -168096 -139598 9079
8383 115100 -2579 -44995 220918 -217494 -286088 37505 -244898 -194313 -164577 -61022 -63824
8372 -63824 27360 215366 -233095 -2728 -102467 210255 -159518 -325741 -188866 -51648 -94188
8361 -94188 -42051 209403 -28616 215999 -263703 -68057 -617 96281 -265500 47686 140577
8350 140577 266727 -23826 -209885 -81223 -199144 288479 -173710 -122488 156482 16390
8339 -259677 143199 -274205 -10679 217763 71942 -117363 -36094 -246861 145193 -66845
8328 120942 117816 -116346 -97552 5709 -189385 -294595 50606 -72311 166335 -204646 28402
8316 5414 -299512 236536 -222802 -231554 -74604 -102536 74382 58586 -353112 233955 -106384
8304 -343120 180518 -176394 263157 109127 -44254 -37879 -156629 118911 216313 108052
8293 -357640 -178242 111611 70877 -301614 121188 39852 299557 -207753 -138055 -219098
8283 -219098 -45943 201311 -18760 363823 8310 149733 73548 -102381 -81383 -372559 -215691
8272 -215691 -236918 -598855 -192972 -177309 -143440 -75000 -393465 -306795 157994 253209 124931
8260 -88890 -67692 -15706 57224 140628 -184026 -324154 111193 -316986 -144598 24318 -56594
8248 -49411 11572 194264 -49031 162747 -11722 -151427 -143665 -38034 285540 162959 213773
8237 213773 206394 -243472 -86406 -128513 -8651 -242562 126693 182243 -92073 -243141 118117
8225 188538 251783 203350 -112104 54521 -106925 -99104 -616193 -155330 -76799 199426 -253564
8213 -44679 208610 -12545 -140564 180728 147989 -135500 -99100 -211838 142693 58401 176529
8202 176529 127247 -959 -171544 -15422 -125349 129579 202879 -18661 56222 -133953 72801
8190 -178280 -325847 -309121 -121096 -46760 -147236 169738 83685 -116251 11583 -135314
8179 -119604 -92679 -73960 -317927 -203993 -99497 -98100 -106889 34630 -215386 -101731 -101164 -254912
8167 -254912 -90756 75250 -116107 33409 -258928 258349 180875 429142 -210775 -20220 248578
8155 -73478 -244212 -212401 187792 -3641 -137544 10405 -112319 -224492 256318 -26651 -33977
8144 -33977 122425 -6816 4119 38847 48620 -193120 130601 -137222 14008 -251170 226076
8132 15571 -162262 -112329 81222 231734 52908 245563 -394225 88695 307484 -115542 -105874
8121 -105874 178670 182595 28006 109531 -245855 -273390 -12656 -111353 -97910 -93447 -134886 44257
8108 -206591 -5542 -269670 36401 -203637 -87216 25679 -178599 -68043 98712 282606 -64240
8096 41732 -166656 -98473 -46169 -128454 -312994 7304 -25348 -81325 -92150 -433105 -44773
8084 -60131 114778 23580 -121486 70508 209782 -257126 -183063 157198 -304044 -79609 -8238
8072 213090 -257623 -114875 225176 19356 -175272 -234224 -83862 30780 -135260 -321620
8062 -321620 -62740 -35933 -464651 121739 74948 84251 141549 -196233 -55593 -31386 147395
8050 -358002 78578 -82766 -2530 -456785 68500 222005 -83254 83327 -147456 -321655 -137498
8038 -291111 49186 370682 127037 -121050 -121161 -176559 -191458 -78454 6093 261918 -50128
8026 -122831 -89047 197343 -58557 327029 -237180 -128849 -228252 -199590 101635 70342 -31406
8014 -24239 -5550 -16521 -355351 101673 17391 22589 199369 -16069 137650 -201081 146535
8002 22818 -53752 9417 122167 -16824 -451226 -14612 -108658 -299600 -33235 -88469 42820
7990 -30704 335367 19876 31042 -170037 185908 106424 -416688 -198681 189263 -248829
7979 -120978 -189721 56181 464335 150732 178925 248182 -321466 -65049 186754 -119406 -161334
7968 -161334 -226520 -68952 -314709 123813 -4097 -98341 -6433 -42222 -101662 -174635 8086 -298761
7955 88511 -62272 -239271 124390 -126845 4116 -323899 -114767 -64623 -327502 211291 86453
7943 -67571 51449 -300919 5051 92389 -268843 23571 465224 -70292 186867 -202442 -126366
7932 -126366 127753 -54171 -289739 161278 -303722 199925 -8603 35274 38170 73794 -47411
7920 -226894 158069 268511 270473 -237 -91075 128834 -13101 -42977 21287 -46723 -83852 82502
7907 -41988 -329192 -207878 84721 15631 -297284 191470 110961 177797 40026 -77389 -176407
7896 -176407 46116 -185747 -142336 -101467 56816 -300180 282141 4026 105835 -108265 243122
7884 137065 -320874 -57799 -144866 -433162 -273428 -140660 20137 95926 164639 2490 -35060
7872 -155296 -16200 -441017 -263014 -189269 -503637 105867 49459 69840 72910 -86382 -117903
7861 -117903 -128472 -13505 31306 -197164 -325789 -189778 214591 91546 166535 -249466 6687
7849 -72566 -96209 -114234 28584 -71000 25623 -110301 57134 168213 106535 53215 -199164
7837 9363 -84081 77918 24214 -191501 52880 145605 57592 -218452 42145 221698 33315
7825 -274534 84932 -118243 -251724 -61184 -153787 102605 8466 -1340 255481 -127750 362308
7813 169200 -93198 56809 78264 214089 -60992 -215031 -297325 247360 -123862 -83256 -67030
7802 -67030 -53613 -265439 -44473 160743 -155537 88063 -276393 -32093 8400 -238278 -397524
7791 -397524 285063 -246835 -18574 -83148 -15606 -207088 218473 -123280 77692 321051
7781 321051 -147391 12812 -241142 4416 -78258 164277 -133344 -90013 127972 -285703 83956
7769 -55922 254927 -1543 -175444 -167956 -271541 95693 -4815 -133259 171549 -156010 44967
7757 100687 -228972 208956 137154 -183706 -251051 126990 -21959 -183882 -305777 -110448
7746 -278962 -119557 -167939 -68818 -270874 225194 -141795 -60733 -56763 81476 -48011 97024
7734 100936 -180751 31328 -18916 -325335 -269403 -344984 -64063 -25095 28819 -819 -117794
7723 -117794 -120853 -208982 -143920 -159971 -50026 -102636 -114195 70669 196977 75857 -213168
7711 111989 361512 -7880 81051 58457 -48347 18811 -38517 -282813 42971 -175583 -62227
7699 -109998 -192959 156906 -240592 -83087 -4235 -15940 284231 -49780 -111834 153008 115042
7688 115042 -12725 -221411 -81865 -113448 42381 -306667 -91125 -70229 93685 -44488 -159066
7677 -159066 -97024 83009 187941 26515 -214349 77213 130260 -11161 290372 155751 185219
7666 185219 78149 -295418 -600417 -26922 -200772 223263 -116973 364879 -167504 -161790
7656 -161790 245618 360791 -156437 -107671 13899 -59820 -60116 48780 -126861 -4624 195674
7644 -17104 -288616 -94326 247337 -163187 -417307 -14968 -112626 153268 147828 -157486 191944
7632 2608 -77202 231096 -206750 68962 257535 -40767 103656 -17218 77538 -201412 102641
7620 -10842 48199 11064 204333 -148071 -226676 -271687 -82576 56622 -160469 201625 -472482
7608 -135311 -377760 -141559 -315270 526 -292733 -69399 -80523 319820 -58818 -248688 196412
7596 45545 36884 -3260 120117 178004 -314535 186115 -319138 349194 -143345 -79129 292519
7584 -103489 -54989 39478 -66353 50298 -189024 -259111 170789 56923 30590 -112985 -155152
7573 -155152 -61528 278653 20233 114969 -277042 152235 108157 -412713 -372031 -227000 -24786
7561 -56035 -161753 -263617 314352 55185 112194 78155 117284 216489 -142447 124095 -259209
7549 -108226 64477 241721 -75557 216184 53418 177975 2532 -148501 -162620 -74292 153198
7537 170947 -128649 -36367 81607 50571 -2552 333494 -420 30062 43906 117115 -248507 18514
7524 194003 -127675 184813 39716 -328036 -14131 -277197 177297 -155669 -89871 -233636
7514 -233636 189600 8307 -9249 118107 -110803 -51151 -95530 -418321 -1158 249264 -140472
7502 112895 -38826 34271 241312 -119171 84203 52480 -200909 322626 191297 -114183
7491 26445 69451 165087 -190073 397388 -66128 -281246 -20968 -111101 33799 -341474 -69712
7479 -134101 -192803 -7770 86015 -107634 -88825 -113814 94687 -127095 165628 -159170 8176
7467 -242540 -107130 -186149 -131686 11442 -446450 283300 -69309 27198 -146795 160443 96369
7456 96369 -167099 20278 -146888 -162732 -125397 -34336 -69926 -102403 -6107 31634 17209 244013
7444 244013 375 -119752 143480 -94480 -120781 -104001 112053 17107 -198546 71297 -226387
7432 -120477 79437 -33844 118676 -245387 -72190 185611 85524 14970 -180932 279864 3986
7420 68090 1865 -89972 -120207 -210374 75556 -228011 -366286 34165 243139 -159264 8464
7408 108130 14294 -151127 154020 -97926 53180 184458 -275373 -285167 81267 -58288 209471
7396 -94842 162272 420570 -343261 33894 54804 -110289 -215149 -3722 -131943 -133906 136822
7384 -65137 -33453 -229753 63399 43303 127267 59324 -218717 11480 16271 -62245 -44766 -92537
7372 -92537 -58694 19422 -40285 105202 425108 36516 240575 -277190 29616 -9574 55702
7360 84708 56675 239182 -284458 -315984 200113 77198 32918 -222773 -151316 35718 95404
7349 95404 231446 -63525 60431 154442 -304119 44394 199094 -132587 -240358 -182209 -6162
7337 -235645 -120047 -39014 31804 -122225 168912 -134563 230864 -211826 -87649 302185
7326 12506 263599 -217297 207303 -32088 228114 -225026 -36447 99956 -182717 63946 462845
7315 462845 97831 324997 -68353 275532 -317236 356477 214195 134731 224371 -118092
7304 -47111 -101131 -214398 -272031 258529 95658 -265392 24134 -37792 -197332 -252182 -24040
7292 -180960 152578 -283381 -118104 -64201 -230825 175077 -154708 132446 -135880 -148248
7282 -148248 -309455 98014 -229883 8020 296669 -117746 -42307 39132 84392 -362627 -287862
7271 -287862 -101459 -95881 -208753 59712 -36978 61210 -220 157860 -208985 -135459 26892
7259 -208126 -136621 3961 161289 270308 111111 21730 -169900 -310239 -253984 83045 -87351
7247 -247617 3934 22686 -218113 110825 112355 175471 142525 206450 51054 412923 -131095
7235 -91706 -381701 -204294 -188322 258477 -413972 -57014 69326 195324 -132152 -85627 96589
7223 43586 145968 80088 245515 -229694 6024 290368 -180581 -186601 130049 -111967 -139697
7212 -139697 -363038 -300879 -84123 82492 8820 -20517 -15923 -37192 -101734 -202153 -137710 30005
7199 87806 74364 19373 161060 -203350 -335789 -167862 -299020 -9541 49934 253201 7324
7187 202843 95283 -274801 191185 -242232 40627 -128937 -98582 3353 -330910 -41678 -138358
7176 -138358 -99424 182686 38135 50233 -34832 47165 -10960 78821 100945 -232026 94713
7164 177863 -159809 28893 184223 215510 54429 61960 135950 -319850 -74845 143080 -251163
7152 -232883 -141842 -33661 -356085 110377 -271123 -123950 -146018 -370820 103354 25823
7141 170687 4717 -26519 80242 -206245 -297485 -374690 -61321 -52550 -158312 -66574 401445
7129 37890 161711 109667 28688 -19069 -160601 154857 87307 276345 192702 -37903 -135468
7118 -135468 -28240 222827 -169367 -88707 -165621 -109979 -139717 286041 15601 80245 -115503
7106 185407 -266034 -94144 -252168 44480 -75226 292681 170375 48510 260343 190005 -70115
7094 195591 444883 -6987 4298 -179235 158476 14552 12251 -35460 -19780 188101 53764
7082 123191 64564 85422 -244217 -108102 -141390 -425889 -82359 -217361 -23272 20037 -87092
7070 -83236 -6375 17289 123650 4018 167207 -321335 -33174 -209727 -50495 187764 -148048
7058 -57072 -159444 39818 543931 -292503 -240940 188321 91711 63438 -156769 55228 85175
7047 85175 146183 114085 -226856 -222655 102757 -182178 -222315 221487 118064 36726 90989
7036 90989 -94396 58398 -97257 137812 -69072 -1770 -236428 -225400 -116517 255902 201183
7025 201183 -148881 -94174 -166828 106544 -168972 93883 -121074 -101932 -48267 -32098 -168431
7014 -168431 269492 107534 113084 -396190 451061 -93828 -113239 29779 -138852 -152150 65639
7002 -83826 12275 76440 206719 42936 242142 -125267 -441634 -221910 -193126 -111563 245337
6990 14403 -2884 601859 46128 48172 329805 108216 287529 327180 -95572 -424325 -204342
6978 236886 -58094 5970 -82030 92020 -86587 119928 76191 -112580 -203026 292 5609 -129236
6965 -269544 35725 -81052 -131886 -149709 -169559 50611 -195481 60259 16656 -65041 -143081
6954 -143081 5845 -90059 -19672 -79380 -193850 110992 -203237 -112935 -145088 138782 -215396
6942 211822 -33907 198786 -114095 -67625 -146383 164854 241542 -111256 -159288 151298 -208525
6930 -112001 -68027 -7082 -1570 28225 94963 -201291 -240311 -121838 -208121 286992 -105080
6918 -206056 -89072 -276179 -269864 -55945 -92078 -170077 -189560 -373508 -20112 -152033 215762
6906 -103966 -55146 163857 160136 -317655 -313133 -524245 -172940 -149941 -85129 -432765 37891
6894 -419843 -276967 92207 -3747 260134 -99652 -165396 -296402 59180 46319 47593 -47275
6882 170638 -133276 -198575 -47491 27181 -341196 42592 112291 170118 77992 96081 -18273
6870 142114 -348815 220903 -7483 82068 -234336 4834 176266 185606 -18919 328345 -324266
6858 45971 -18766 -11734 -39476 -90651 47483 49180 97998 -96140 -349647 86415 307412 -145603
6845 -141068 212784 504368 164956 12742 -71236 -123278 40134 -270948 119904 2309 15576
6834 15576 69601 193074 412877 84856 -94016 -196368 357187 -107390 -38501 76618 200311
6823 200311 -89264 98030 -190695 17745 -263124 15834 -101907 171002 -292165 -228068 -99992
6811 13588 134548 26553 -197426 314380 101185 -129195 197506 -134746 -372529 33611
6800 24318 -32291 -374407 -146266 -117185 79445 375446 -22118 125364 40182 78291 -156603
6788 -151720 -39609 229923 -76682 199677 -54731 -112837 -235939 -87737 -87883 104364 428488
6777 428488 -29837 65876 -41943 82857 68597 -125618 -201286 300409 -78519 -171716 11276
6765 26952 36089 -138719 -46807 -47424 96282 108503 -244297 -95065 -52022 116862 86674 -58001
6752 -129636 168155 102594 72331 443121 63952 -309372 21022 91875 317761 -50089 -83281
6741 -83281 -602854 -148371 -70804 -175456 -133402 28949 -67198 32447 -140335 -308230 48788
6729 -34987 -52494 127624 -356793 -221307 40767 -130062 72584 -115173 215113 -93481 -195030
6718 -195030 -485069 -202546 219266 134394 -12298 132315 253287 -337872 -254412 -275249
6708 -275249 -263360 52882 -154168 372030 -336976 -168803 -41737 -211786 -172384 180466
6697 -26738 -135878 89155 -49594 98097 -239617 -77033 -166581 -58572 -158671 2866 214884
6686 214884 -133843 -117990 156885 -187350 253932 72556 -43306 -185154 -42003 -318040
6676 -318040 -31422 45197 -330784 234503 345483 54360 -129164 30469 325566 57047 117260
6665 117260 -288337 -70195 4745 934 57811 29543 80947 1598 -61069 -88784 319666 -43456
6652 112081 -273743 141306 66370 -19615 -26450 -149943 -10460 -29379 -17445 95042 -115158
6640 -426054 -215047 -317879 -243811 -107330 -197231 229729 134196 216556 -40667 1300 -268728
6628 -15455 67636 60300 -145399 -379213 167966 -236873 -180348 152671 -11209 61864 103632
6617 103632 -92961 -229428 -200361 -43974 142714 -224196 -6792 -76792 98100 -145527 -12868
6605 -273344 166439 -137677 156237 207027 -81353 249276 12941 24792 -513591 -64309 -137960
6594 -137960 -182313 -78182 206963 -229185 -9086 -104806 115439 48430 101829 -212159 -102081
6582 -66443 300491 -138670 -30469 88709 1867 73191 16497 533076 -236457 31166 -96640
6570 13639 -71706 9218 -187942 95436 -50540 -188060 -82973 134403 55456 86742 -181611
6558 -113905 166028 246432 5334 170755 116466 -278966 -106174 -93933 -154317 145026 -469717
6546 -30653 166246 111680 141420 247777 72859 -98397 737 50842 -146367 50611 -288949
6534 470064 -78754 -67709 -97852 -103594 -46638 131639 -32492 -191739 91050 40763 -298530
6522 -235802 -82723 -34781 258380 -118060 65289 -3863 51258 299736 -211804 -152322 -395549
6511 -395549 -139092 72885 -139177 36120 -443017 93092 343470 -98762 59798 -454534 -179635
6499 147823 -136232 18101 16746 51804 87747 287049 -94053 -439312 62499 241656 113381
6487 121035 -236082 76551 -158420 -76330 150888 89757 49387 -316549 79663 6573 -120955
6475 -200845 -211266 -149531 -20999 -327994 175103 93064 -271015 -70893 129243 200024 221115
6464 221115 -32127 -22976 -156037 13632 126697 263080 39457 -2479 56530 220820 -131310
6452 104235 -96333 323493 -84415 -4903 113575 84995 32104 214153 214401 -460278 -113315
6440 191277 322051 51152 129663 21347 -209973 129299 25884 147435 20650 200462 130281
6429 130281 185377 -3588 -69516 -71342 -202769 57321 -160408 86101 -124412 -166349 -34256
6417 47738 -150863 -48851 37935 8056 37413 -118278 -13776 -112645 57101 352159 -103052
6405 -268955 321861 154470 104540 39313 -239460 -111703 139762 54173 -149404 232099
6394 166673 -42268 10593 -89645 193929 -198077 -80519 112095 -56497 303699 -143186 -9477
6382 125760 -14642 106091 -237860 89031 -6913 -270157 -292205 -172001 -97847 -160838 -228732
6371 -228732 200160 -180650 -41158 -245226 -19676 48220 10610 -45885 43220 -51082 -187407
6360 -187407 64788 75114 -18714 -57050 63489 -87513 -77760 102612 143666 -44239 -28386 194414
6347 138487 1085 -83821 -21713 123118 151679 189258 215274 -20518 239789 228801 61933
6335 45261 17094 -204634 -57502 111453 92853 873 99872 -219820 27280 -78860 167284
6323 16398 149038 -21968 223320 -4870 28614 -65318 -87471 -187059 -101830 150685 60966
6311 133476 -99690 53776 327910 103564 83621 -230122 149724 -113833 344823 -99017
6300 -116499 -88762 -47710 -4623 -26333 182253 257461 131195 -232681 166261 -151297 -91020
6289 -91020 -42313 -210233 151749 241457 -138785 -113010 -115918 -114453 221993 39828 -168993
6277 178289 221047 321092 -385963 -227962 -32252 -34168 71212 -14943 -254903 -110653 -212094
6266 -212094 -114464 -156769 -164932 356212 -278560 -70162 -128163 11224 62086 7233 -90142 189200
6253 -266576 19963 -13061 290518 -387045 136857 -184013 61416 -25434 -172100 -25337 -55456
6242 -55456 -195442 -123037 -312939 -384575 295788 139225 -28068 -232803 87755 1096 449591
6231 449591 -191943 47567 114032 -263106 -356133 -34183 89038 372572 -234522 -133639 -318143
6220 -318143 169734 5052 -57571 5285 189655 -183691 151803 9959 -114935 159342 51851
6208 262425 72834 -182283 -219640 13316 -49755 115788 57657 194164 9053 -2047 -62130
6197 -62130 -38107 -600421 6290 -338162 -62308 -178431 95113 -185794 -308164 183474 -270061
6185 256371 44580 -82909 -362058 15578 209685 172447 -18829 13468 -139385 -116904 -290387
6174 -290387 152038 28151 -270476 364499 216422 74638 -182503 -142186 -498431 -5869 45042
6162 162095 123711 -246800 173747 -28284 -105110 -312313 -145310 -58474 -193697 -379063
6152 -379063 70713 257010 -94737 233930 97585 -196132 -69166 -44097 8319 -195141 199610
6140 368754 -48163 -292262 21565 74873 -89541 60841 32147 117245 209840 185601 68944
6128 138112 145681 -45573 230045 4975 56637 22289 -134178 -123261 111218 3305 -1638 12935
6115 -196485 -227021 285993 -294217 -244704 -294533 203000 -200642 -49985 -149560 -441261 58222
6103 -27715 -498758 304096 23209 125225 -6913 -657503 141840 -44453 -14146 51969 26573
6092 26573 352045 161868 -140674 -40967 -167293 -80510 3027 167632 -340471 154574 -143863
6080 -32857 128466 224337 -171813 -410809 301721 118292 377086 -279975 52389 -50269
6069 -148870 105232 -22043 116223 -264563 -52888 -178123 -26498 -17553 -9925 -95376 32239
6057 -94717 -87762 -21804 -506 -191076 60115 34479 66351 105287 96446 -135372 144170 -150387
6044 -93464 -72787 50260 129844 291094 327122 172927 171511 -88302 -111795 105568 -226696
6032 -118560 -219124 88746 199472 78856 67493 -203519 76630 -299711 -99083 165053 200550
6021 200550 81292 337479 -102862 -180144 83310 388384 -21642 -99008 38827 160428 84034
6010 84034 168698 200723 80217 -260155 -280595 -115189 -352028 -193146 31781 -91091 -185863
5999 -185863 48384 -35785 155844 376924 -126242 114013 -54898 207696 352727 -58943
5988 -1161 362851 150309 -199148 -18322 90988 -49853 -226614 379554 400549 46058 -48309
5976 -6785 175780 -105195 -242816 -142430 200159 150667 -82413 -97324 188003 90676 -73874
5964 -122455 292342 -393886 -70286 197316 -16978 143169 -65670 23059 250108 305859 -193516
5952 278699 65487 155113 -106369 76603 -93767 115265 14568 -84896 -20072 -280571 446393
5940 -6989 -115532 -136659 150781 157493 -78516 -183844 -87844 -39536 -88879 17851 51210 -49549
5927 -436805 -247453 60997 -85978 -96659 130006 -153990 24597 -7926 -61684 -286582 -261522
5916 -261522 -344917 -45280 -179506 -71833 75917 -105525 179098 178843 243394 88338 177002
5905 177002 -288555 -135355 -126498 -138149 -255246 9662 -123916 -16474 70146 -206843 -26749
5893 -143946 -299756 -82498 38817 -122977 -20809 51406 -94157 56805 168922 -68751 -39732
5882 -39732 16037 4123 -252201 104055 -193152 158819 -24977 67174 -130578 37524 73467
5871 73467 54194 8992 338381 63545 52448 37121 -16384 102482 186014 -148033 191386
5859 126085 -8316 -56552 117442 -34646 -125926 -397096 -127996 -176500 -98294 13694 229302
5848 229302 -168228 8493 161263 175708 -10038 -216960 -473993 214491 22795 -27204 -185607
5837 -185607 235065 -287840 -196347 -179945 169496 -227544 31543 -198522 -57346 -3170 17532
5825 75184 288331 -22014 29690 96583 -120369 -38017 -84262 -25666 299187 -44656 -272918
5814 -272918 21446 -24121 -135692 -56309 443664 -331270 -156764 -175537 -199139 -364266 195371
5802 -5703 228852 225451 -107548 145838 79153 507981 10228 -229383 110836 -259569 21619
5790 -96085 -54731 195312 102314 140630 312397 -19073 47761 284392 97718 202043 -79894
5778 -549693 -130227 -217452 -135315 -292148 194253 136015 -179950 63313 -181986 227054
5767 33029 -179823 108328 -18730 114525 -381558 191698 74786 46095 -244000 43480 104510
5756 104510 -49122 -295624 253836 99045 95789 142763 -161376 39204 126243 122431 -55287
5744 -119452 -121737 333929 237454 -59524 87199 -100533 16402 178015 -52035 -69274 -63013
5733 -63013 295828 187095 32699 -193534 59748 89586 -61958 -136080 -185063 68801 -142014
5721 31199 -211279 11250 -7793 231684 -80053 68296 238218 -29888 184915 121107 -386152
5709 -3256 171219 -281430 -221673 40122 125345 -129884 -15545 -50466 407650 21041 -41200
5697 190564 -61960 -308311 -118092 -332374 196450 -96272 -19990 -235908 -14368 111835
5686 -4399 161527 56359 38638 -115236 -217474 -19308 109597 -265351 241496 124379 -84291
5674 -167214 -368514 -215293 165111 135613 166213 -135449 6517 244045 56992 -97035 -116241
5663 -116241 -176329 112360 -297088 106557 264460 92403 -72067 -253082 187168 -112087
5652 216525 148958 -223511 -151423 -192086 -1783 -10148 70363 113315 116103 -235185 31150 111699
5640 111699 62257 -195505 183778 195038 126594 50444 229529 33353 -124744 59970 -55863
5628 95637 87505 78778 -55132 57964 193803 276689 -291634 114119 -109498 -101914 25843 47835
5616 47835 233780 109082 41169 -49718 -160032 127592 -212602 -198382 36955 70229 30465
5604 -161027 139332 -45979 -100243 43876 -95178 -12422 -14985 292888 -102643 121492 76921
5593 76921 -238265 254800 -77240 87416 380104 -211384 -13858 -50674 38737 -229589 167300
5581 335167 14382 179515 237682 -247090 171053 -2815 -354208 388061 23293 61512 111339
5570 111339 122276 96675 -48135 -86312 38645 -107812 -75062 88425 -69923 295491 -162734
5558 -331841 -27234 59245 -159670 -208974 191108 -97044 -104254 -2225 -170250 156043 -116698
5546 96912 19609 100448 93414 102609 286786 183012 32149 -252035 192011 239227 -134054
5534 48793 80933 34711 -152742 -64929 170834 -129912 -37117 -31488 13515 71874 64031 26363
5521 -58733 64034 -200340 -82390 51629 -60325 126106 -282197 -128185 -196759 -6573 195705
5509 -244670 6977 -179550 -30603 -174432 -178578 135172 106146 107614 126974 123613 -88361 -140608
5497 -140608 288358 -181308 -253152 261909 -132620 127717 82634 71606 -33537 -317608
5487 -317608 -449601 240157 -407 -277543 -72472 140983 -39564 9079 -324981 -234379 121158
5475 208206 86606 -77380 -79812 -101113 -109894 -203102 -225212 116182 -95502 187112 254706 -202680
5462 -219438 98389 77060 131393 263280 -148511 -34243 26148 -176243 -16274 -13934 12775
5450 -40453 254929 63759 -104127 220961 -1053 -133798 42297 -142548 184073 926 15182
5439 15182 -21407 11616 -149039 -877 -433029 -41824 -154627 -18930 153158 80916 82675 194105
5427 194105 79177 -103549 -182286 -161078 97645 -190518 -10527 77422 -33328 108402 -11744
5415 -179652 -20819 -84757 -227570 -100863 -70962 -176313 122063 198533 10174 237632 -196124
5403 182551 -121506 110637 102426 5092 74502 -126423 146077 -22806 63032 182795 143666
5392 143666 108487 -69874 -137387 -146554 -587621 37292 -211021 -38477 47384 111433 135739
5381 135739 -209818 35637 15910 -16701 66925 32589 -90625 271077 32065 -297480 82304
5369 -168107 32379 -42860 330967 -212383 -5873 -11198 28183 87525 146657 53597 -226144
5357 113529 -110089 82085 -228156 310407 357946 -124245 -100758 135585 167629 -351125
5346 167321 136947 2964 60216 128196 -271612 -6459 167686 80410 -82325 -11078 -16003 -246650
5334 -246650 144125 56246 -49503 151178 -103523 -68719 -410834 -185706 119614 -15996
5323 188290 10804 -34831 -18011 151803 -53213 43256 325784 281691 31290 -6217 -42891
5312 -42891 114129 305572 -283069 62628 37080 20279 -11190 240353 -418017 -102855 -79664
5301 -79664 -53186 113025 58572 -101612 -182600 61772 -146179 -132931 40385 136455 -126141
5289 105504 -150532 366767 151775 -200197 77369 79115 -126214 119187 -3419 -268245 166442
5277 194999 163831 -340355 259711 -182833 104 -42981 -69227 -221650 60303 -98183 92011
5265 -266958 200478 455022 -10107 -41555 129580 82311 52715 188074 75337 51198 102038
5254 102038 -302471 -30196 -63645 -41965 -989 63105 -69392 -39995 137194 13853 -160493
5242 213886 478824 -80783 -87024 -57957 -220215 156232 63131 -45240 -309342 -42345 105768
5230 196134 88066 -89496 6179 97533 142409 -77608 -508977 -3925 78664 427427 186968
5218 -143228 -79505 279417 96317 -135032 396082 454606 164002 63570 99668 215987 -121648
5206 -163616 151202 -63176 425531 -27571 -177974 -133903 -72155 -143850 -37297 -20124 156387
5194 -76348 -45273 161722 -129156 -134605 -6952 297397 354478 -34541 -196047 -114324 214085
5182 -1566 -111111 -174926 70029 -3855 215280 201943 -48909 97605 121332 -124363 -193816 104265
5169 -84081 193749 397389 57678 112844 282341 -44894 -44299 -108362 -21547 529094 -154288
5157 -3598 -172065 -29639 153030 98059 -64087 -259499 129324 156400 -29277 5286 -23664
5145 -51623 243994 -95552 -319301 -33240 -338483 342034 -47685 -102901 -260007 209963 8515
5133 -221630 -119095 144030 -188603 -158129 130703 -68020 -147154 -88163 117205 -120453
5122 -224846 112021 -31440 162822 168349 -151931 21069 -45758 -252040 -250895 -169188 -119412
5111 -119412 -135478 112534 58628 367693 140570 -469946 -268703 -3490 -53811 52862 148088
5100 148088 82207 307895 36177 234867 109243 18737 19595 76729 17955 -213420 74338
5088 -137614 -50921 139602 -97464 -75623 62271 -34894 -126851 85324 -161137 432279 126187
5076 -151148 106446 157142 -52123 361278 31352 -15780 130572 108954 31007 135338 164408
5065 164408 -31799 -218011 211445 -405020 106688 14949 64704 459995 -226599 -68560
5054 -2512 -51991 150374 2239 -45936 -216878 -48179 -78989 -183892 10554 96687 2854 66061
5042 66061 -27952 191417 133620 79689 -177147 -101581 242620 123299 -135742 -20793 -503400
5031 -503400 232585 186306 -23873 -156036 -325367 9515 369908 -22139 239061 -124477 45674
5019 225297 -160135 387301 6933 106523 -318897 162242 20553 111082 130957 65938 -50180
5007 -16279 -366840 -64010 -254 23106 -211977 67993 -39815 57317 -219010 117589 79660
4996 79660 -133161 154826 145229 -29965 -150070 -18269 -171687 -129733 103689 42191 318305
4985 318305 -222127 127145 -40419 283802 133830 -50566 -141408 193783 -238808 86686
4974 4708 -207173 101284 29905 -51850 93764 -49743 17941 -29226 -201501 -34992 84411
4962 -171885 -64113 -79102 184501 -105535 -58521 -27753 -412154 375874 14712 -209686 88195
4950 -38930 -211158 19977 -152761 -204000 121622 145355 -112711 303267 206514 -376805 27217
4938 115208 272849 170371 40557 178210 161041 -232836 274958 226071 112808 -67099
4927 176666 -63359 -235505 -65841 157 -147780 37502 243452 -117794 -41283 -8988 141708
4915 -234480 -333589 93813 175243 257216 63847 168451 280405 -105710 -106448 179912 -116680
4903 347029 75546 462 -43284 -459742 20760 58948 105238 115646 -187471 215319 106901
4891 -316437 144953 146129 -224620 -81677 167429 130772 268638 -80584 -24740 71981 -346517
4879 -209251 -132429 -126412 15971 -98917 -30135 -152688 -234882 19465 6112 130284 227103 204391
4867 204391 211895 187908 -87803 -36017 -19766 145170 275924 92454 5291 89922 7217 61635
4855 61635 -357318 -7828 -273309 87114 -134980 -36151 209025 91671 -80230 149988 61646
4843 -10339 162440 -255685 256528 164228 39547 -52229 -140848 367638 2808 -118249 96780
4831 -135407 284996 10781 2565 154280 -124753 81587 80549 -245998 -132822 -111302 28288
4819 33995 3150 18576 157638 92850 -252341 41501 277524 -307115 -90673 108595 7198
4807 -126430 271679 155943 165048 215644 124122 8266 -260973 20330 469889 -212294 185860
4795 197272 188384 -110262 7305 -145416 -71945 65244 61472 -47376 248718 11094 110462 303031
4783 303031 -353096 16238 114438 -163281 -269349 -186748 77100 -182151 29509 -161940 -66632
4771 39735 135903 48072 408700 156673 199755 105907 -339137 177061 82267 405971 54843
4759 -128482 7105 -273917 265902 -64484 7149 -318220 -84417 96830 12818 362903 218824
4748 218824 152441 946 -126422 304044 21872 -78059 -467577 39301 114863 268698 173661
4737 173661 -130827 413248 -49123 233219 53186 -21434 36137 -47938 608576 -150572 -40808
4725 -24584 23985 78878 68556 47451 33021 -26454 67873 -106240 -127297 24103 -164579
4713 -401182 -37417 -151116 -80613 -60045 -244790 -25188 -37632 233909 14541 72935 -186752
4701 242384 76499 138234 -123445 -36612 -226786 77767 25848 112182 -62745 -357740 79501
4689 217108 148109 56369 -250977 167773 40186 177717 -265097 -142822 57317 -251112
4678 -143800 47733 112506 -238300 -123726 166568 115004 155057 219919 161001 -46696 332991
4666 85408 -189823 86417 -77299 80648 -29118 -182933 -156202 -39491 54954 -32838 -255989
4655 -255989 145085 -298144 341708 -12681 61499 -171008 193054 79165 119967 213871 171843
4644 171843 30567 252218 40626 288015 -88140 26180 228303 -4303 -18384 116240 303446
4633 303446 72733 33760 -134885 -169400 -262627 -1045 -3214 -48973 -53274 103669 4260 -86888
4620 -270996 200827 -993 228811 -72029 108320 125074 -16803 125026 -248375 146918 200154
4609 200154 -32642 -199432 -11938 -4193 36271 338631 -164627 40096 -222828 -138874 -122951
4598 -122951 -118994 -96890 -58900 -47084 -108230 -191534 189641 47559 -32472 154389 32870
4586 147714 270543 -63752 73438 -74958 240688 218509 -191155 -78478 210308 180313 -306936
4574 96652 -313417 17480 -26767 -81529 170955 9001 123988 85030 52268 -8603 77959 256321
4562 256321 -40561 -71543 -13522 398873 144632 -53227 94405 -163836 -175395 -53965 212271
4550 243551 343284 -171969 -132923 80657 -1692 -47278 -92970 -96375 41117 -31782 60720 67205
4538 67205 -129510 143073 32425 -53789 -235506 -137377 -61432 29915 16156 137255 1335
4526 -61769 -12790 1769 66779 358560 -104103 187061 228603 -26478 -157629 -23544 -27794
4515 -27794 120640 160343 -117090 -30620 552356 -96760 88418 -97531 -88663 288912 78231
4503 -119840 212538 -107821 -104963 -119644 -77693 66327 70623 -118531 138 -23049 -68564 -4049
$$ [...]
##END NTUPLES=NMR SPECTRUM
##END=
