
##TITLE=AC1303_PERAH12115_6641754_p1tBAZZZUx
##JCAMPDX= 6.0         $$ Bruker NMR JCAMP-DX V2.0
##DATA TYPE= NMR SPECTRUM
##DATA CLASS= NTUPLES
##ORIGIN= BRUKER
##OWNER= Administrator
$$ 1.72 TOPSPIN		Version 2.1
$$ 2012-08-10 14:33:50.718 -0500  Administrator@TOPSPIN
$$ Compression mode = diff/dup
##.OBSERVE FREQUENCY= 400.02188249412
##.OBSERVE NUCLEUS= ^1H
##.ACQUISITION MODE= SIMULTANEOUS (DQD)
##.ACQUISITION SCHEME= undefined
##.AVERAGES= 64
##.DIGITISER RES= 22
##SPECTROMETER/DATA SYSTEM= spect
##.PULSE SEQUENCE= noesygpps1d.comp
##.SOLVENT NAME= COFFEE_meoh
##.SHIFT REFERENCE= INTERNAL, COFFEE_meoh, 1, 14.96076
##AUDIT TRAIL= $$ (NUMBER, WHEN, WHO, WHERE, PROCESS, VERSION, WHAT)
$$ ##TITLE= Audit trail, TOPSPIN		Version 2.1
$$ ##JCAMPDX= 5.01
$$ ##ORIGIN= Bruker BioSpin GmbH
$$ ##OWNER= Administrator
$$ $$ C:\Bruker\TOPSPIN/data/COFFEE/nmr/AC1303_PERAH12115_6641754_p1tBAZZZUx/32/pdata/1/auditp.txt
$$ ##AUDIT TRAIL=  $$ (NUMBER, WHEN, WHO, WHERE, PROCESS, VERSION, WHAT)
(   1,<2012-08-10 14:33:42.203 -0500>,<Administrator>,<TOPSPIN>,<go>,<TOPSPIN 2.1>,
      <created by zg
	started at 2012-08-10 14:22:11.796 -0500,
	POWCHK enabled, PULCHK disabled,
       configuration hash MD5:
       6B 1B 68 BB D9 2E 58 E2 7F 35 AD 54 07 DF 0E 41
       data hash MD5: 64K
       48 69 E2 FC 37 E3 EE 0F F7 1E A1 0E 6E 19 94 21>)
(   2,<2012-08-10 14:33:45.203 -0500>,<Administrator>,<TOPSPIN>,<proc1d>,<TOPSPIN 2.1>,
      <Start of raw data processing
       efp LB = 0.3 FT_mod = 6 PKNL = 1 PHC0 = 0 PHC1 = 0 SI = 128K 
       data hash MD5: 128K
       09 FF 92 11 A2 F3 5B 63 29 1D 79 AE 54 CD A6 EC>)
(   3,<2012-08-10 14:33:46.984 -0500>,<Administrator>,<TOPSPIN>,<proc1d>,<TOPSPIN 2.1>,
      <pk PHC0 = 3.977051 PHC1 = 0 
       data hash MD5: 128K
       26 BB EA 89 A0 88 8E 69 70 16 B0 E4 B3 06 38 73>)
(   4,<2012-08-10 14:33:48.109 -0500>,<Administrator>,<TOPSPIN>,<proc1d>,<TOPSPIN 2.1>,
      <abs ABSG = 1 
       data hash MD5: 128K
       F4 39 C3 B4 62 38 B6 B5 07 18 29 0D 66 0D A0 D5>)
(   5,<2012-08-10 14:33:48.593 -0500>,<Administrator>,<TOPSPIN>,<proc1d>,<TOPSPIN 2.1>,
      <abs ABSG = 2 
       data hash MD5: 128K
       26 C0 4B F0 67 72 8C 4C 57 EA 77 59 66 6C F0 DA>)
(   6,<2012-08-10 14:33:49.031 -0500>,<Administrator>,<TOPSPIN>,<proc1d>,<TOPSPIN 2.1>,
      <abs ABSG = 3 
       data hash MD5: 128K
       BA 9C DA 70 80 5D 09 0C 18 E4 4E 47 42 32 E5 50>)
(   7,<2012-08-10 14:33:49.765 -0500>,<Administrator>,<TOPSPIN>,<proc1d>,<TOPSPIN 2.1>,
      <abs ABSG = 4 
       data hash MD5: 128K
       CD C4 3A 21 DC 9E 50 0E 94 B7 51 BA 7C 29 4B 69>)
(   8,<2012-08-10 14:33:50.250 -0500>,<Administrator>,<TOPSPIN>,<proc1d>,<TOPSPIN 2.1>,
      <abs ABSG = 5 
       data hash MD5: 128K
       AA 61 C9 17 99 0F 23 85 9D 32 59 53 03 AA FE E5>)
$$ ##END=
$$ 
$$ $$ hash MD5
$$ $$ 64 A4 3F 16 C5 06 19 B8 3F 81 D1 E2 32 DB 76 F7
##$RELAX= 
##$RELAX= 
##$RELAX= 
##$RELAX= 
##$RELAX= 
##$RELAX= 
##$RELAX= 
##$RELAX= 
$$ Bruker specific parameters
$$ [...]
150 150 150 150 150 150 150 150
##$TP07= 0
##$TPNAME0= <>
##$TPNAME1= <>
##$TPNAME2= <>
##$TPNAME3= <>
##$TPNAME4= <>
##$TPNAME5= <>
##$TPNAME6= <>
##$TPNAME7= <>
##$TPOAL= (0..7)
0.5 0.5 0.5 0.5 0.5 0.5 0.5 0.5
##$TPOFFS= (0..7)
0 0 0 0 0 0 0 0
##$TUNHIN= 0
##$TUNHOUT= 0
##$TUNXOUT= 0
##$USERA1= <user>
##$USERA2= <user>
##$USERA3= <user>
##$USERA4= <user>
##$USERA5= <user>
##$V9= 5
##$VALIST= <valist>
##$VCLIST= <CCCCCCCCCCCCCCC>
##$VD= 0
##$VDLIST= <DDDDDDDDDDDDDDD>
##$VPLIST= <PPPPPPPPPPPPPPP>
##$VTLIST= <TTTTTTTTTTTTTTT>
##$WBST= 1024
##$WBSW= 4
##$XGAIN= (0..3)
0 0 0 0
##$XL= 0
##$YL= 0
##$YMAX_a= 13139348
##$YMIN_a= -9758609
##$ZGOPTNS= <>
##$ZL1= 120
##$ZL2= 120
##$ZL3= 120
##$ZL4= 120
##$ABSF1= 14.96076
##$ABSF2= -5.597422
##$ABSG= 5
##$ABSL= 3
##$ALPHA= 0
##$AQORDER= 0
##$ASSFAC= 0
##$ASSFACI= 0
##$ASSFACX= 0
##$ASSWID= 0
##$AUNMP= <proc_prof1d_extract.lims>
##$AXLEFT= 0
##$AXNAME= <>
##$AXNUC= <1H>
##$AXRIGHT= 0
##$AXTYPE= 0
##$AXUNIT= <>
##$AZFE= 0.1
##$AZFW= 0.1
##$BCFW= 0
##$BC_mod= 0
##$BYTORDP= 0
##$COROFFS= 0
##$CY= 15
##$DATMOD= 1
##$DC= 0
##$DFILT= <>
##$DTYPP= 0
##$F1P= 0
##$F2P= 0
##$FCOR= 0.5
##$FTSIZE= 131072
##$FT_mod= 6
##$GAMMA= 0
##$GB= 0
##$INTBC= 1
##$INTSCL= 1
##$ISEN= 128
##$LB= 0.3
##$LEV0= 0
##$LPBIN= 0
##$MAXI= 10000
##$MC2= 0
##$MEAN= 0
##$ME_mod= 0
##$MI= 0
##$NCOEF= 0
##$NC_proc= -2
##$NLEV= 6
##$NOISF1= 0
##$NOISF2= 0
##$NSP= 0
##$NTH_PI= 0
##$NZP= 0
##$OFFSET= 14.96076
##$PC= 1
##$PHC0= 3.977051
##$PHC1= 0
##$PH_mod= 1
##$PKNL= yes
##$PPARMOD= 0
##$PPDIAG= 0
##$PPIPTYP= 0
##$PPMPNUM= 2147483647
##$PPRESOL= 1
##$PSCAL= 4
##$PSIGN= 0
##$PYNMP= <proc.py>
##$REVERSE= no
##$SF= 400.020009731827
##$SI= 131072
##$SIGF1= 0
##$SIGF2= 0
##$SINO= 400
##$SIOLD= 131072
##$SPECTYP= <>
##$SREGLST= <1H.CDCl3>
##$SSB= 0
##$STSI= 131072
##$STSR= 0
##$SW_p= 8223.68421052631
##$SYMM= 0
##$S_DEV= 0
##$TDeff= 65536
##$TDoff= 0
##$TI= <>
##$TILT= no
##$TM1= 0
##$TM2= 0
##$TOPLEV= 0
##$USERP1= <user>
##$USERP2= <user>
##$USERP3= <user>
##$USERP4= <user>
##$USERP5= <user>
##$WDW= 1
##$XDIM= 131072
##$YMAX_p= 385080298
##$YMIN_p= -10906
##$CURPLOT= <Network HP LaserJet P1505>
##$CURPRIN= <$Network HP LaserJet P1505>
##$DFORMAT= <normdp>
##$LAYOUT= <+/1D_H.xwp>
##$LFORMAT= <normlp>
##$PFORMAT= <normpl>
##$SURQMSG= 1
$$ End of Bruker specific parameters
$$ ---------------------------------
##NTUPLES= NMR SPECTRUM
##VAR_NAME=  FREQUENCY,     SPECTRUM/REAL,   SPECTRUM/IMAG
##SYMBOL=    X,             R,               I
##VAR_TYPE=  INDEPENDENT,   DEPENDENT,       DEPENDENT
##VAR_FORM=  AFFN,          ASDF,            ASDF
##VAR_DIM=   131072,        131072,          131072
##UNITS=     HZ,            ARBITRARY UNITS, ARBITRARY UNITS
##FACTOR=    0.0627417313425164, 1,          1
##FIRST=     8223.62146879497, -1241,        -62092
##LAST=      0,             -325,            -63577
##MIN=       0,             -10906,          0
##MAX=       8223.62146879497, 385080298,    0
$$ Real data points
##PAGE= N=1
##DATA TABLE= (X++(R..R)), XYDATA
$$ [...]
$$ plain form
61536 311385 313587 315382 316483 317123 317836 319039 320686 322307 323431 323920 323901 323513 322821 321878 320762 319565
61520 319565 318431 317621 317426 317913 318718 319187 318835 317717 316359 315307 314787 314697 314837 315070 315399 315863 316279 316071
61502 316071 314582 311708 308164 304985 302814 301716 301495 301959 302879 303913 304739 305185 305260 305081 304813 304594 304489
61485 304489 304526 304788 305428 306527 307915 309197 310039 310445 310685 310929 311068 311065 311321 312462 314685 317525 320245
61468 320245 322287 323310 323204 322327 321493 321406 322076 322992 323769 324412 325002 325468 325794 326241 327057 327975 328222 327307
61450 327307 325774 324918 325544 327170 328690 329631 330342 331082 331606 331890 332633 334469 336987 339106 340289 340917
61434 340917 341587 342556 343976 346102 349053 352602 356329 359823 362693 364713 366058 367159 368253 369289 370291
61419 370291 371485 372940 374399 375657 376836 378123 379453 380647 381669 382538 383196 383667 384202 384941 385502 385234
$$ packed form
61536C11385K202J795J101O40P13J203J647J621J124M89j9l88o92r43j116j197
61520C19565j134q10j95M87Q05M69l52j118j358j052n20r0J40K33L29M64M16k08
61502C16071j489k874l544l179k171j098k21M64R20J034Q26M46P5j79k68k19j05
61485C04489L7K62O40J099J388J282Q42M06K40K44J39lK56J141K223K840K720
61468C20245K042J023j06q77q34q7O70R16P77O43N90M66L26M47Q16R18K47r15
61450C27307j533q56O26J626J520R41P11P40N24K84P43J836K518K119J183O28
61434C40917O70R69J420K126K951L549L727L494K870K020J345J101J094J036J002
61419C70291J194J455J459J258J179J287J330J194J022Q69O58M71N35P39N61k68
$$ plain form
61403 385234 383912 381970 379967 378029 375962 373792 371921 370640 369670 368448 366899 365640 365246 365580 366172
61388 366172 367082 368843 371453 373916 375147 375087 374627 374538 374861 375299 375869 376879 378408 380034 381187 381713 381959
61371 381959 382324 382884 383497 384099 384750 385542 386611 388095 389853 391395 392360 392944 393571 394324 395111 396226 398155
61354 398155 400790 403488 406094 409288 413618 418720 423973 429458 435764 443134 451313 459907 468321 475551
61340 475551 480751 484132 486844 489899 493475 497187 500563 503256 505185 506587 507664 508209 507880 506775 505356
61325 505356 503875 502376 501217 500917 501303 501373 500369 498661 497276 496931 497735 499458 501721 504245 507320 511743
61309 511743 517915 525261 532968 541056 550218 560737 572165 584090 596647 610062 624023 637729
61297 637729 650235 660566 667820 671558 672156 670640 668109 665164 661609 656614 649427 640196 630075 620403
$$ packed form
61403C85234j322j942k003j938k067k170j871j281r70j222j549j259l94L34N92
61388C66172R10J761K610K463J231o0m60q9L23M38N70J010J529J626J153N26K46
61371C81959L65N60O13O02O51P92J069J484J758J542R65N84O27P53P87J115J929
61354C98155K635K698K606L194M330N102N253N485O306P370Q179Q594Q414P230
61340D75551N200L381K712L055L576L712L376K693J929J402J077N45l29j105j419
61325E05356j481j499j159l00L86P0j004j708j385l45Q04J723K263K524L075M423
61309E11743O172P346P707Q088R162J0519J1428J1925J2557J3415J3961J3706
61297F37729J2506J0331P254L738N98j516k531k945l555m995p187r231j0121r672
$$ plain form
61283 620403 611784 603973 596492 589185 582231 575832 570003 564704 560167 556987 555706 556177 557418 558250 558225
61268 558225 557982 558639 560711 563515 565731 566608 566581 566662 567518 569405 572671 577645 583955 590618 597204 604382
61252 604382 612674 621086 627754 631872 634217 635698 636275 635698 634471 633301 632028 629917 626818 623259 619483
61237 619483 615285 610966 607585 605774 604880 603857 602608 601933 602484 604335 607308 611032 614844 618382 622352
61222 622352 627987 635529 643857 651887 659714 667941 676512 684908 693127 701663 710555 719160 726967 734073
61208 734073 740695 746715 751966 756542 760540 763871 766627 769329 772456 775909 779338 782867 787140 792821
61194 792821 800392 810340 822944 837668 853164 868196 882418 896052 908992 920476 929637 936144
61182 936144 940254 942430 943028 942318 940633 938371 935749 932613 928573 923404 917271 910561 903494 895964 887773
$$ packed form
61283F20403q619p811p481p307o954o399n829n299m537l180j281M71J241Q32k5
61268E58225k43O57K072K804K216Q77k7Q1Q56J887L266M974O310O663O586P178
61252F04382Q292Q412O668M118K345J481N77n77j227j170j273k111l099l559l776
61237F19483m198m319l381j811q94j023j249o75N51J851K973L724L812L538L970
61222F22352N635P542Q328Q030P827Q227Q571Q396Q219Q536Q892Q605P807P106
61208G34073O622O020N251M576L998L331K756K702L127L453L429L529M273N681
61194G92821P571R948J2604J4724J5496J5032J4222J3634J2940J1484R161O507
61182I36144M110K176N98p10j685k262k622l136m040n169o133o710p067p530q191
$$ plain form
61167 887773 878920 869507 859354 847957 835041 821045 806804 792776 778895 765111 751645 738517
61155 738517 725342 712012 699252 687942 678111 669197 661259 655224 651700 650072 649092 647954 646528
61142 646528 644921 643227 641402 638952 635002 629170 622273 615709 610152 605276 600777 597165 595333 595681
61128 595681 597936 601601 606343 612090 618993 627252 636846 647541 659322 672784 688821 707872 729541
61115 729541 753005 777675 803423 830220 857742 885387 912668 939537 966254 992857 1018801
61104 1018801 1043231 1065680 1086392 1105790 1123686 1139133 1151043 1158768 1162145 1161360 1156937 1149514
61092 1149514 1139260 1125642 1108100 1086906 1063196 1038216 1012832 987502 962277 936853 911024
61081 911024 885166 859985 835878 812965 791677 772653 755907 740618 726046 712176 699272
$$ packed form
61167H87773q853r413j0153j1397j2916j3996j4241j4028j3881j3784j3466j3128
61155G38517j3175j3330j2760j1310r831q914p938o035l524j628r80j138j426
61142F46528j607j694j825k450l950n832o897o564n557m876m499l612j832L48
61128E95681K255L665M742N747O903Q259R594J0695J1781J3462J6037J9051K1669
61115G29541K3464K4670K5748K6797K7522K7645K7281K6869K6717K6603K5944
61104A018801K4430K2449K0712J9398J7896J5447J1910P725L377p85m423p423
61092A149514j0254j3618j7542k1194k3710k4980k5384k5330k5225k5424k5829
61081I11024k5858k5181k4107k2913k1288j9024j6746j5289j4572j3870j2904
$$ plain form
61070 699272 687364 676646 667836 661446 656922 653079 649323 646029 643846 643067 643626 645237 647435 649791
61056 649791 652238 655073 658692 663377 669231 676201 684355 694147 706126 720212 735639 751792 768758
61043 768758 786801 805869 825986 847632 871169 896248 922399 949864 979155 1010017 1041595
61032 1041595 1073605 1106682 1141569 1178506 1217520 1258770 1302379 1348108 1395153 1442219 1488221
61021 1488221 1533328 1579129 1627552 1680082 1738220 1803706 1877543 1959509 2049517 2148762 2258764
61010 2258764 2380538 2516408 2672014 2855114 3073510 3336270 3656052 4047546 4524634
61001 4524634 5102999 5805685 6662428 7704741 8968227 10495824 12312857 14366226 16478380
60992 16478380 18383582 19844688 20762302 21192238 21281712 21203957 21133966 21227280 21557469 22046169
$$ packed form
61070F99272j1908j0718q810o390m524l843l756l294k183p79N59J611K198K356
61056F49791K447K835L619M685N854O970Q154R792J1979J4086J5427J6153J6966
61043G68758J8043J9068K0117K1646K3537K5079K6151K7465K9291L0862L1578
61032A041595L2010L3077L4887L6937L9014M1250M3609M5729M7045M7066M6002
61021A488221M5107M5801M8423N2530N8138O5486P3837Q1966R0008R9245J10002
61010B258764J21774J35870J55606J83100K18396K62760L19782L91494M77088
61001D524634N78365P02686Q56743J042313J263486J527597J817033K053369K112154
60992A6478380J905202J461106R17614M29936Q9474p7755o9991R3314L30189M88700
$$ plain form
60982 22046169 22469200 22563547 22158307 21231796 19876502 18232054 16441841 14635036 12912379
60973 12912379 11334308 9924343 8685459 7612692 6695277 5916865 5259736 4708202 4247315
60964 4247315 3861102 3534208 3254236 3011652 2798989 2611178 2445233 2298226 2166327
60955 2166327 2046488 1937903 1840773 1754459 1677701 1609711 1549825 1496516 1447767 1402205 1359210
60944 1359210 1318182 1278407 1239546 1201762 1165427 1130887 1098288 1067436 1038059 1010203 983979
60933 983979 958972 934576 910979 889055 869047 850139 831745 814456 799147 785681 773153
60922 773153 760999 749364 738567 728667 719426 710531 702040 694605 688824 684385 680389 676538 673283
60909 673283 670781 668610 666859 666513 668134 670895 673633 676220 679238 682826 686643 690666 695339 701080
$$ packed form
60982B2046169M23031R4347m05240r26511j355294j644448j790213j806805j722657
60973A2912379j578071j409965j238884j072767r17415p78412o57129n51534m60887
60964D247315l86213l26894k79972k42584k12663j87811j65945j47007j31899
60955B166327j19839j08585r7130q6314p6758o7990n9886n3309m8749m5562m2995
60944A359210m1028l9775l8861l7784l6335l4540l2599l0852k9377k7856k6224
60933I83979k5007k4396k3597k1924k0008j8908j8394j7289j5309j3466j2528
60922G73153j2154j1635j0797r900r241q895q491p435n781m439l996l851l255
60909F73283k502k171j751l46J621K761K738K587L018L588L817M023M673N741
$$ plain form
60895 701080 708046 716054 724386 732102 738956 745545 752220 758515 764189 770075 777095 784983 792920 800990
60881 800990 809943 819750 829451 838552 847666 857568 868261 879195 889871 900071 909874 919565 929192
60868 929192 938222 945986 952435 958034 962962 966832 969289 970553 971236 971772 971979 971002 967832 962096 954256
60853 954256 944945 934408 922769 910466 898084 886005 874499 863687 853059 841474 828171 813539
60841 813539 798491 783460 768441 753545 738794 723705 707820 691479 675471 660073 645125
60830 645125 630817 617687 605914 595251 585564 576817 568634 560609 553032 546578 541278 536442 531663
60817 531663 527188 523217 519439 515513 511527 507895 505094 503389 502395 501164 499219 497222 495954 495056 493702
60802 493702 492225 491879 492984 494482 495471 496020 496229 495761 494772 494141 494078 493540 491824 489779 488516 487735 486327
$$ packed form
60895G01080O966Q008Q332P716O854O589O675O295N674N886P020P888P937Q070
60881H00990Q953R807R701R101R114R902J0693J0934J0676J0200R803R691R627
60868I29192R030P764O449N599M928L870K457J264O83N36K07r77l170n736p840
60853I54256r311j0537j1639j2303j2382j2079j1506j0812j0628j1585j3303j4632
60841H13539j5048j5031j5019j4896j4751j5089j5885j6341j6008j5398j4948
60830F45125j4308j3130j1773j0663r687q747q183q025p577o454n300m836m779
60817E31663m475l971l778l926l986l632k801j705r94j231j945j997j268q98j354
60802D93702j477l46J105J498R89N49K09m68r89o31o3n38j716k045j263p81j408
$$ plain form
60785 486327 484032 481489 479123 476983 475354 474531 474099 473267 471795 469880 467373 463887 459618 455266 451148
60770 451148 447091 443158 439759 436954 434319 431716 429565 428215 427509 427197 427267 427602 427680 426895 425055 422469
60754 422469 419766 417620 416335 415632 415107 414870 415403 416781 418498 420196 422131 424683 427689 430571 432907
60739 432907 434616 435704 436102 435728 434568 432694 430282 427613 424971 422498 420125 417648 414974 412325 410077
60724 410077 408260 406381 403956 401192 398926 397812 397665 397537 396337 393505 389407 385124 381640 379065 376743
60709 376743 374113 371326 368926 367115 365550 363872 362229 361105 360643 360365 359703 358653 357633 356763 355689
60694 355689 354238 352886 352240 352285 352438 352230 351666 351033 350722 351207 352808 355379 358430 361635 365032 368729
60678 368729 372637 376571 380379 383919 387121 390193 393570 397503 401788 405975 409742 412987 415761 418194
$$ packed form
60785D86327k295k543k366k140j629q23m32q32j472j915k507l486m269m352m118
60770D51148m057l933l399k805k635k603k151j350p06l12P0L35P8p85j840k586
60754D22469k703k146j285p03n25k37N33J378J717J698J935K552L006K882K336
60739D32907J709J088L98l74j160j874k412k669k642k473k373k477k674k649k248
60724D10077j817j879k425k764k266j114j47j28j200k832m098m283l484k575k322
60709C76743k630k787k400j811j565j678j643j124m62k78o62j050j020q70j074
60694C55689j451j352o46M5J53k08n64o33l11M85J601K571L051L205L397L697
60678C68729L908L934L808L540L202L072L377L933M285M187L767L245K774K433
$$ plain form
60664 418194 420353 421978 422540 421867 420686 420237 421141 422807 424096 424504 424489 424782 425672 427060 428882 431147
60648 431147 433695 436221 438559 440678 442397 443343 443310 442436 440931 438812 435997 432473 428245 423363 418183
60633 418183 413380 409433 406215 403324 400670 398462 396743 395324 394183 393539 393419 393444 393230 392824 392536 392426
60617 392426 392167 391440 390350 389368 388852 388720 388681 388703 389038 389739 390434 390800 391079 391788 392953 393983 394382 394363 394567
60598 394567 395303 396140 396303 395445 394130 393437 393990 395433 396971 398240 399392 400468 401175 401403 401530 401954 402584
60581 402584 403066 403321 403537 403827 404225 404948 406273 408090 409956 411789 414314 418576 425026 433192 442207 451576
60565 451576 461487 472510 485005 498683 512586 525490 536454 545092 551334 554897 555161 551785 545484
60552 545484 537943 530733 524417 518855 514218 511270 510517 511443 512957 514618 517142 521677 528754 538083 549155
$$ packed form
60664D18194K159J625N62o73j181m49R04J666J289M08j5K93Q90J388J822K265
60648D31147K548K526K338K119J719R46l3q74j505k119k815l524m228m882n180
60633D18183m803l947l218k891k654k208j719j419j141o44j20K5k14m06k88j10
60617C92426k59p27j090r82n16j32l9K2L35P01O95L66K79P09J165J030L99j9K04
60598C94567P36Q37J63q58j315o93N53J443J538J269J152J076P07K28J27M24O30
60581D02584M82K55K16K90L98P23J325J817J866J833K525M262O450Q166R015R369
60565D51576R911J1023J2495J3678J3903J2904J0964Q638O242L563K64l376o301
60552E45484p541p210o316n562m637k948p53R26J514J661K524M535P077R329J1072
$$ plain form
60537 549155 561837 576291 592482 609801 627083 642960 656342 666731 674133 678636 680153 678695
60525 678695 674839 669652 664021 658162 651875 645119 638154 631307 624939 619594 615810 613587 612278 611188
60511 611188 610193 609651 609914 611131 613351 616506 620346 624678 629785 636492 645809 658563 675252 695997
60497 695997 720712 749493 782769 820799 863064 908439 955868 1004497 1053098 1099810 1142633
60486 1142633 1179832 1209686 1230312 1240160 1238504 1225215 1200506 1165407 1122327 1074508 1024692 974443
60474 974443 924621 876078 829846 786957 748194 713763 683168 655625 630721 608524 589147
60463 589147 572434 558070 545710 534926 525286 516602 508871 501904 495237 488552 481985 475903 470489
60450 470489 465674 461302 457198 453194 449278 445713 442870 440868 439393 437886 435957 433686 431557 430071
$$ packed form
60537E49155J2682J4454J6191J7319J7282J5877J3382J0389P402M503J517j458
60525F78695l856n187n631n859o287o756o965o847o368n345l784k223j309j090
60511F11188r95n42K63J217K220L155L840M332N107O707R317J2754J6689K0745
60497F95997K4715K8781L3276L8030M2265M5375M7429M8629M8601M6712M2823
60486A142633L7199K9854K0626R848j656j3289k4709l5099m3080m7819m9816n0249
60474I74443m9822m8543m6232m2889l8763l4431l0595k7543k4904k2197j9377
60463E89147j6713j4364j2360j0784r640q684p731o967o667o685o567o082n414
60450D70489m815m372m104m004l916l565k843k002j475j507j929k271k129j486
$$ plain form
60436 430071 429406 429373 429592 429717 429600 429291 428783 427815 426165 424165 422553 421629 420880 419719 418279 417189 416792
60419 416792 416979 417545 418295 418934 419338 419798 420606 421496 422005 422283 423003 424444 426170 427623 428615 429224 429735 430691
60401 430691 432466 434650 436409 437475 438277 439072 439681 440213 441304 443275 445668 447915 449913 451641 452966
60386 452966 454254 456469 460033 464137 467784 470933 473978 476681 478466 479479 480499 481970 483837 486154
60372 486154 489142 492743 496662 500656 504255 506522 506983 506631 507126 508959 511184 512960 514439 515934 517201
60357 517201 518018 518726 519619 520296 520287 520006 520564 522744 526524 531461 537167 543425 550079 556892 563464 569340
60341 569340 574214 577946 580481 581817 581923 580550 577364 572603 567340 562646 558581 554443 549898 545293
60327 545293 540976 536965 533380 530512 528198 525729 522710 519529 516621 513773 510601 507297 504433 502310
$$ packed form
60436D30071o65l3K19J25j17l09n08r68j650k000j612r24p49j161j440j090l97
60419D16792J87N66P50O39M04M60Q08Q90N09K78P20J441J726J453R92O09N11R56
60401D30691J775K184J759J066Q02P95O09N32J091J971K393K247J998J728J325
60386D52966J288K215L564M104L647L149L045K703J785J013J020J471J867K317
60372D86154K988L601L919L994L599K267M61l52M95J833K225J776J479J495J267
60357E17201Q17P08Q93O77rk81N58K180L780M937N706O258O654O813O572N876
60341E69340M874L732K535J336J06j373l186m761n263m694m065m138m545m605
60327E45293m317m011l585k868k314k469l019l181k908k848l172l304k864k123
$$ plain form
60313 502310 500980 500686 501752 504128 507494 511837 517571 525080 534444 545769 559543 576419 596492
60300 596492 618754 641343 662478 681080 696406 707415 713012 712927 707800 698242 684393 666781 647149
60287 647149 627804 610214 594597 580738 568747 558954 551332 545258 539822 534503 529584 525763 523243
60274 523243 521335 519003 515633 511257 506413 501950 498591 496263 494049 491091 487432 483784 480753 478618
60260 478618 477549 477457 477693 477408 476348 474960 473674 472454 471146 469928 469173 469002 469208 469548 470027 470878 472216
60243 472216 473734 474896 475506 475875 476193 476081 475173 473987 473573 474231 475159 475614 475880 476670 478020 479436 480913
60226 480913 483043 485953 488781 490651 491851 493536 496329 499649 502483 504515 506351 508898 512709 517713
60212 517713 523310 528790 533940 539329 545810 553686 562398 571002 578778 585442 591130 596396 602001 608377
$$ packed form
60313E02310j330k94J066K376L366M343N734P509R364J1325J3774J6876K0073
60300E96492K2262K2589K1135J8602J5326J1009N597q5n127r558j3849j7612j9632
60287F47149j9345j7590j5617j3859j1991r793p622o074n436n319m919l821k520
60274E23243j908k332l370m376m844m463l359k328k214k958l659l648l031k135
60260D78618j069r2K36k85j060j388j286j220j308j218p55j71K06L40M79Q51J338
60243D72216J518J162O10L69L18j12r08j186m14O58R28M55K66P90J350J416J477
60226D80913K130K910K828J870J200J685K793L320K834K032J836K547L811N004
60212E17713N597N480N150N389O481P876Q712Q604P776O664N688N266N605O376
$$ plain form
60198 608377 615242 621938 628118 633857 639067 643189 645793 647320 648758 650434 651524 651045 649074 646587
60184 646587 644249 641812 638732 634847 630234 624919 619152 613646 609003 605035 601090 596993 593166 589821
60170 589821 586552 582988 579441 576598 574691 573233 571518 569246 566674 564230 562011 559754 557406 555536
60156 555536 554892 555546 556751 557697 558189 558575 559250 560350 561743 563193 564625 566200 568008 569850 571619 573766
60140 573766 576863 580674 584197 586858 589254 592435 596867 602392 608792 615807 622788 628842 633394 636346
60126 636346 637789 637913 637252 636666 636889 638115 639972 641869 643492 645106 647241 649995 652838 655321 657688
60111 657688 660452 663538 666288 668259 669592 670504 670881 670572 669693 668289 665969 662293 657478 652345 647547
60096 647547 643180 639258 636142 634208 633343 633207 633885 635793 638885 642416 645717 648769 651732 654367 656486
$$ packed form
60198F08377O865O696O180N739N210M122K604J527J438J676J090m79j971k487
60184F46587k338k437l080l885m613n315n767n506m643l968l945m097l827l345
60170E89821l269l564l547k843j907j458j715k272k572k444k219k257k348j870
60156E55536o44O54J205R46M92L86O75J100J393J450J432J575J808J842J769K147
60140E73766L097L811L523K661K396L181M432N525O400P015O981O054M552K952
60126F36346J443J24o61n86K23J226J857J897J623J614K135K754K843K483K367
60111F57688K764L086K750J971J333R12L77l09q79j404k320l676m815n133m798
60096F47547m367l922l116j934q65j36O78J908L092L531L301L052K963K635K119
$$ plain form
60081 656486 658611 661420 664534 666553 666554 665054 663197 661356 658928 655203 650052 643864 637107 630004 622518
60066 622518 614611 606404 597978 589173 579944 570897 562985 556464 550515 544186 537500 531354 526497 522788
60052 522788 519432 515807 512128 509259 507778 507406 507635 508648 511009 514545 518332 521965 526036 530976 536252
60037 536252 541340 546773 553276 560289 566349 570828 574319 577222 578874 578488 576341 573534 570844 568145
60023 568145 564732 559927 553497 545781 537513 529459 522098 515504 509445 503692 498337 493650 489612 485851
60009 485851 482192 478943 476407 474400 472560 470840 469331 467859 466225 464713 463849 463726 464006 464502 465332
59994 465332 466493 467759 469012 470297 471498 472416 473260 474674 477076 480252 483673 486958 489950 492644 495209
59979 495209 497864 500588 503000 504586 505014 504323 502934 501326 499566 497359 494724 492271 490397 488520 485686
$$ packed form
60081F56486K125K809L114K019Jj500j857j841k428l725n151o188o757p103p486
60066F22518p907q207q426q805r229r047p912o521n949o329o686o146m857l709
60052E22788l356l625l679k869j481l72K29J013K361L536L787L633M071M940N276
60037E36252N088N433O503P013O060M479L491K903J652l86k147k807k690k699
60023E68145l413m805o430p716q268q054p361o594o059n753n355m687m038l761
60009D85851l659l249k536k007j840j720j509j472j634j512q64j23K80M96Q30
59994D65332J161J266J253J285J201R18Q44J414K402L176L421L285K992K694K565
59979D95209K655K724K412J586M28o91j389j608j760k207k635k453j874j877k834
$$ plain form
59964 485686 481944 478628 477227 478231 480956 484056 486339 487660 489046 491514 494782 497646 499516 500924
59950 500924 502464 504016 505305 506511 507851 509077 509936 510829 512472 515023 517882 520260 521694 522141 521767
59935 521767 520589 518324 514832 510707 507006 504248 502034 499831 497697 495948 494571 493457 492935 493487 495016
59920 495016 496790 498228 499397 500705 502388 504502 507261 511095 516127 521729 526957 531633 536642 542739
59906 542739 549322 554937 558927 561899 564510 566507 567363 567265 566958 566932 567156 567370 567268 566637 565710 565175 565569
59889 565569 566817 568636 571036 574066 577353 580390 583157 586045 589262 592660 596099 599647 603438 607561
59875 607561 611979 616346 620102 622981 625163 626661 626878 625316 622427 619112 615488 610865 605035 598901
59861 598901 593528 589110 585189 581463 578001 575057 573081 572604 573633 575357 576971 578723 581673 586432
$$ packed form
59964D85686l742l316j401J004K725L100K283J321J386K468L268K864J870J408
59950E00924J540J552J289J206J340J226Q59Q93J643K551K859K378J434M47l74
59935E21767j178k265l492m125l701k758k214k203k134j749j377j114n22N52J529
59920D95016J774J438J169J308J683K114K759L834N032N602N228M676N009O097
59906E42739O583N615L990K972K611J997Q56r8l07k6K24K14j02o31r27n35L94
59889E65569J248J819K400L030L287L037K767K888L217L398L439L548L791M123
59875F07561M418M367L756K879K182J498K17j562k889l315l624m623n830o134
59861E98901n373m418l921l726l462k944j976m77J029J724J614J752K950M759
$$ plain form
59847 586432 592712 600206 609180 619618 630188 638871 644703 648317 650612 651528 650640 648526 646803 646711 648077
59832 648077 649724 650470 649577 646679 641759 635230 627862 620501 613701 607482 601411 595080 588486 581932 575693
59817 575693 569989 565106 561172 557852 554662 551609 549197 547690 546705 545675 544406 543147 542363 542457 543307
59802 543307 543993 543465 541686 539708 538391 537518 536405 534863 533137 531309 529295 527152 524923 522412 519570
59787 519570 516873 514815 513199 511419 509300 507166 505177 503209 501409 500279 499973 499886 499218 497829 496346
59772 496346 495508 495362 495080 493776 491592 489722 489083 489322 489555 489750 490707 492818 495541 498224 500765 503292
59756 503292 505782 508351 511449 515377 519936 524863 530279 536309 542546 548340 553521 558495 563592 568576
59742 568576 572872 576191 578921 581854 585373 588916 591516 592927 593893 595221 596977 598887 601059 603762
$$ packed form
59847E86432O280P494Q974J0438J0570Q683N832L614K295R16q88k114j723r2J366
59832F48077J647P46q93k898m920o529p368p361o800o219o071o331o594o554o239
59817E75693n704m883l934l320l190l053k412j507r85j030j269j259p84R4Q50
59802E43307O86n28j779j978j317q73j113j542j726j828k014k143k229k511k842
59787E19570k697k058j616j780k119k134j989j968j800j130l06q7o68j389j483
59772D96346q38j46k82j304k184j870o39K39K33J95R57K111K723K683K541K527
59756E03292K490K569L098L928M559M927N416O030O237N794N181M974N097M984
59742E68576M296L319K730K933L519L543K600J411R66J328J756J910K172K703
$$ plain form
59728 603762 606647 608795 609657 609566 609245 609160 609491 610334 611617 612959 613884 614113 613580 612324 610611 609033 608150
59711 608150 607984 608048 607969 607899 608246 609104 610115 610822 611065 611009 610947 611141 611830 613263 615543 618448 621481 624220
59693 624220 626513 628299 629465 630122 630809 631982 633292 633848 633394 632776 632902 633631 634123 634000 633494 632528 630388
59676 630388 626673 622130 618077 615052 612299 608623 603607 597974 592803 588523 584754 580962 576935 572552
59662 572552 567651 562551 558349 556059 555512 555587 555505 555463 556079 557782 560778 564971 569698 574009 577432 580111
59646 580111 582106 583090 582932 582072 580990 579676 577850 575348 572074 568030 563595 559336 555390 551509 547882
59631 547882 545197 543607 542380 541033 540016 539600 538861 536775 533802 531337 529796 528296 526162 523749 521593
59616 521593 519626 517567 515456 513420 511341 509079 506851 505212 504713 505431 506678 507486 507714 508318 510042
$$ packed form
59728F03762K885K148Q62r1l21q5L31Q43J283J342R25K29n33j256j713j578q83
59711F08150j66O4p9p0L47Q58J011P07K43n6o2J94O89J433K280K905L033K739
59693F24220K293J786J166O57O87J173J310N56m54o18J26P29M92j23n06r66k140
59676F30388l715m543m053l025k753l676n016n633n171m280l769l792m027m383
59662E72552m901n100m202k290n47P5q2m2O16J703K996M193M727M311L423K679
59646E80111J995R84j58q60j082j314j826k502l274m044m435m259l946l881l627
59631E47882k685j590j227j347j017m16p39k086k973k465j541j500k134k413k156
59616E21593j967k059k111k036k079k262k228j639m99P18J247Q08K28O04J724
$$ plain form
59601 510042 512262 513798 514504 515175 516048 516438 515922 514944 513941 512781 511434 510448 510268 510661 511255 512081 513107
59584 513107 513741 513391 512154 510472 508447 505996 503474 501558 500489 499776 498662 496722 494050 491077 488203
59569 488203 485635 483636 482654 482778 483153 482550 480716 478690 477602 477637 478403 479666 481262 482770 483894 484946
59553 484946 486374 487966 489041 489416 489715 490676 492514 494952 497565 500014 502277 504837 508548 514149 521827
59538 521827 531280 542323 555519 571906 591508 611969 629241 640151 644287 643356 639207 632989 625791
59525 625791 619091 614143 611287 610198 610603 612521 615889 620260 624873 628897 631660 632830 632497 630900 627958
59510 627958 623188 616296 607781 598693 589817 581335 573226 565543 558179 550882 543825 537688 532717 528110
59496 528110 522956 517477 512703 509126 506432 504463 503547 503719 504397 505112 505970 507121 508403 509826 511791
$$ packed form
59601E10042K220J536P06O71Q73L90n16r78j003j160j347r86j80L93N94Q26J026
59584E13107O34l50j237j682k025k451k522j916j069p13j114j940k672k973k874
59569D88203k568j999r82J24L75o03j834k026j088L5P66J263J596J508J124J052
59553D84946J428J592J075L75K99R61J838K438K613K449K263K560L711N601P678
59538E21827R453J1043J3196J6387J9602K0461J7272J0910M136r31m149o218p198
59525F25791o700m948k856j089M05J918L368M371M613M024K763J170l33j597k942
59510F27958m770o892q515r088q876q482q109p683p364p297p057o137m971m607
59496E28110n154n479m774l577k694j969r16J72O78P15Q58J151J282J423J965
$$ plain form
59481 511791 514389 517007 519087 520791 522492 524094 525435 526953 529326 532619 536320 540055 543727 547122
59467 547122 549914 552101 554007 555846 557633 559495 561716 564429 567504 570757 574100 577555 581339 585861
59453 585861 591416 597916 605113 612958 621511 630547 639475 647656 654702 660510 665054 668059 668864 666864
59439 666864 662192 655734 648324 640188 631364 622354 614024 606937 601036 595876 591068 586667 583283 581637
59425 581637 581857 583380 585653 588654 592698 598130 605336 614668 626055 639061 653580 669999 688448
59412 688448 708532 730216 754182 780230 805547 825562 836804 838630 832577 821032 806634 791887
59400 791887 778586 767835 760781 758668 761488 766713 770003 767594 758223 743044 724095 703090 681440
59387 681440 660736 642391 626711 612909 600382 589602 581365 575727 572227 570747 571289 572978 574190
$$ packed form
59481E11791K598K618K080J704J701J602J341J518K373L293L701L735L672L395
59467E47122K792K187J906J839J787J862K221K713L075L253L343L455L784M522
59453E85861N555O500P197P845Q553R036Q928Q181P046N808M544L005Q05k000
59439F66864m672o458p410q136q824r010q330p087n901n160m808m401l384j646
59425E81637K20J523K273L001M044N432P206R332J1387J3006J4519J6419J8449
59412F88448K0084K1684K3966K6048K5317K0015J1242J826o053j1545j4398j4747
59400G91887j3301j0751p054k113K820N225L290k409r371j5179j8949k1005k1650
59387F81440k0704j8345j5680j3802j2527j0780q237n638l500j480N42J689J212
$$ plain form
59374 574190 573999 573065 572891 574519 577974 582440 586832 590612 594274 598679 603869 608985 613453 617699 622455
59359 622455 627880 633789 640248 647409 655026 662716 670658 679588 690071 702084 715333 729628 744897
59346 744897 761108 778263 796251 814595 832562 849684 866025 881746 896507 909489 919971
59335 919971 927683 932557 934388 932943 928289 920832 911059 899328 885864 870824 854468 837436 820681
59322 820681 804904 790176 776384 763824 752838 743038 733574 724323 716092 709305 703188 696817 690478
59309 690478 685274 681755 679677 678848 679388 681169 683813 687455 692847 700427 709835 720662 733107 747267
59295 747267 761891 774320 781828 783056 778415 769407 757623 744189 729946 715860 702999 692020
59283 692020 682831 674887 667859 662019 657950 655861 655237 655349 656059 657934 661572 667155 674670 684091 695023
$$ packed form
59374E74190j91r34j74J628L455M466M392L780L662M405N190N116M468M246M756
59359F22455N425N909O459P161P617P690P942Q930J0483J2013J3249J4295J5269
59346G44897J6211J7155J7988J8344J7967J7122J6341J5721J4761J2982J0482
59335I19971P712M874J831j445m654p457r773j1731j3464j5040j6356j7032j6755
59322H20681j5777j4728j3792j2560j0986r800r464r251q231o787o117o371o339
59309F90478n204l519k078q29N40J781K644L642N392P580R408J0827J2445J4160
59295G47267J4624J2429P508J228m641r008j1784j3434j4243j4086j2861j0979
59283F92020r189p944p028n840m069k089o24J12P10J875L638N583P515R421J0932
$$ plain form
59268 695023 706547 717873 728982 740211 751398 761783 770568 777264 781668 783937 784480 783285 779531
59255 779531 772450 762552 751439 740355 729422 718360 707389 697166 688224 680724 674528 669328 664904
59242 664904 661330 658703 656751 655059 653749 653570 655190 658644 663516 669303 675508 681676 687479 692614
59228 692614 696682 699382 700747 700839 699305 695737 690423 684289 677985 671494 664698 657861 651335 645215 639467
59213 639467 634139 629323 625231 622301 620806 620328 620089 619847 619987 620686 621638 622721 624181 625895 627195 627933
59197 627933 628969 630902 632928 633781 633495 633368 634340 636173 638205 640145 641942 643498 644826 646154 647675
59182 647675 649385 651200 652975 654370 655078 655266 655527 656321 657650 659318 661250 663471 666071 669270 673334
59167 673334 678307 684071 690745 698731 708081 718021 727393 735602 742915 749841 756434 762249 766797 769894
$$ packed form
59268F95023J1524J1326J1109J1229J1187J0385Q785O696M404K269N43j195l754
59255G79531p081r898j1113j1084j0933j1062j0971j0223q942p500o196n200m424
59242F64904l574k627j952j692j310j79J620L454M872N787O205O168N803N135
59228F92614M068K700J365R2j534l568n314o134o304o491o796o837o526o120n748
59213F39467n328m816m092k930j495m78k39k42J40O99R52J083J460J714J300P38
59197F27933J036J933K026Q53k86j27R72J833K032J940J797J556J328J328J521
59182F47675J710J815J775J395P08J88K61P94J329J668J932K221K600L199M064
59167F73334M973N764O674P986R350R940R372Q209P313O926O593N815M548L097
$$ plain form
59153 769894 771638 772186 771535 769456 765677 760239 753612 746384 738834 730950 722807 714673 706694 698737 690696
59138 690696 682794 675434 668841 662964 657591 652517 647725 643418 639610 635789 631402 626818 623209 621182
59124 621182 620036 618926 618240 619100 621796 625534 629652 634265 639626 645589 651955 658745 665898 673190 680714
59109 680714 688940 697962 707078 715388 722569 728866 734600 739889 744613 748527 751602 754195 756537 758138
59095 758138 758231 756831 754769 752623 750274 747677 745388 743966 743416 743540 744191 744733 743935 741118 736996 732760
59079 732760 728600 723723 717526 710107 701816 692997 684186 676016 668794 662433 656774 651677 646924 642360
59065 642360 638082 634211 630627 627184 624019 621264 618602 615553 612122 608781 605814 603029 600165 597276
59051 597276 594691 592741 591536 590801 590015 588899 587727 586967 586698 586542 586079 585167 584014 583126 583010 583685 584546
$$ packed form
59153G69894J744N48o51k079l779n438o627p228p550p884q143q134p979p957q041
59138F90696p902p360o593n877n373n074m792m307l808l821m387m584l609k027
59124F21182j146j110o86Q60K696L738M118M613N361N963O366O790P153P292P524
59109F80714Q226R022R116Q310P181O297N734N289M724L914L075K593K342J601
59095G58138R3j400k062k146k349k597k289j422n50J24O51N42p98k817m122m236
59079G32760m160m877o197p419q291q819q811q170p222o361n659n097m753m564
59065F42360m278l871l584l443l165k755k662l049l431l341k967k785k864k889
59051E97276k585j950j205p35p86j116j172p60k69j56m63r12j153q88j16O75Q61
$$ plain form
59034 584546 584963 584865 584591 584341 584114 584075 584693 586416 589410 593624 598992 605541 613288 622000 631167 640469
59018 640469 650169 660720 671905 682774 692515 700942 707993 713322 716774 718784 719842 719924 718923 717320
59004 717320 715868 714874 714321 714505 715899 718466 721771 725800 731077 737691 744651 750559 754792 757903 761005
58989 761005 764809 769074 772831 775153 775761 774980 773335 771300 769134 766770 763962 760788 757918 756293 756620
58974 756620 759208 763872 769807 775954 781927 788453 796554 806456 817568 829328 841672 854779 868714
58961 868714 883293 898033 912281 925576 937752 948514 957137 962790 964935 963215 957339 947585 935152
58948 935152 921449 907021 891562 874933 857717 840760 824568 809262 794891 781600 769639
58937 769639 759253 750525 743364 737639 733135 729385 725860 722466 719560 717353 715665 714420 713879 714042
$$ packed form
59034E84546M17r8k74k50k27l9O18J723K994M214N368O549P747Q712R167R302
59018F40469R700J0551J1185J0869R741Q427P051N329L452K010J058Q2j001j603
59004G17320j452r94n53J84J394K567L305M029N277O614O960N908M233L111L102
58989G61005L804M265L757K322O08p81j645k035k166k364k808l174k870j625L27
58974G56620K588M664N935O147N973O526Q101R902J1112J1760J2344J3107J3935
58961H68714J4579J4740J4248J3295J2176J0762Q623N653K145j720n876r754j2433
58948I35152j3703j4428j5459j6629j7216j6957j6192j5306j4371j3291j1961
58937G69639j0386q728p161n725m504l750l525l394k906k207j688j245n41J63
$$ plain form
58923 714042 714278 714007 713415 713064 713144 713556 714335 715373 716047 715795 714928 714255 714002 713691 713080 712623 712935 714242
58905 714242 716504 719735 724121 729965 737464 746486 756830 768760 782745 798345 813945 828157 841030
58892 841030 853334 865338 877142 889758 904714 922654 943157 965750 990069 1015095 1039354
58881 1039354 1062113 1083491 1103190 1120057 1133272 1143038 1149609 1152365 1150446 1143747 1132780 1118090
58869 1118090 1100397 1080976 1061258 1042078 1023634 1006010 989537 974699 961819 950680 940412
58858 940412 930051 919260 908362 897719 887409 877382 867469 857200 846078 834157 822037 810322
58846 810322 799463 789998 782312 776043 770259 764386 758520 752740 746689 740051 732975 725762 718500 711187
58832 711187 703950 696981 690521 684947 680479 676836 673524 670472 667977 666157 664972 664691 665689 667769 670331
$$ packed form
58923G14042K36k71n92l51Q0M12P79J038O74k52q67o73k53l11o11m57L12J307
58905G14242K262L231M386N844P499R022J0344J1930J3985J5600J5600J4212J2873
58892H41030J2304J2004J1804J2616J4956J7940K0503K2593K4319K5026K4259
58881A039354K2759K1378J9699J6867J3215R766O571K756j919o699j0967j4690
58869A118090j7693j9421j9718j9180j8444j7624j6473j4838j2880j1139j0268
58858I40412j0361j0791j0898j0643j0310j0027r913j0269j1122j1921j2120j1715
58846H10322j0859r465p686o269n784n873n866n780o051o638p076p213p262p313
58832G11187p237o969o460n574m468l643l312l052k495j820j185k81R98K080K562
$$ plain form
58817 670331 673250 676923 681326 685813 690046 694480 699599 705281 711120 716736 721562 725042 727381 729404
58803 729404 731256 731897 730373 727037 723017 719005 715061 711117 707058 702615 697633 692246 686531 680401
58789 680401 674087 668252 663303 659132 655905 654437 655158 657194 659123 660372 661323 662462 664085 666557 670083
58774 670083 674176 677858 680379 681472 681073 679258 676337 672708 668685 664619 660870 657288 653107 647877
58760 647877 642342 637822 634799 632547 630197 627728 625854 625259 626025 627648 629512 631418 633582 636119 638730
58745 638730 641034 643053 645263 648280 652484 657707 663305 668816 674572 681239 688706 695973 702332 708105
58731 708105 713892 719636 724929 729895 735114 740823 746689 752306 757538 762424 767057 771582 776076 780508
58717 780508 784959 789787 795351 801652 808392 815316 822399 829732 837238 844391 850272 854176 856117 856507
$$ packed form
58817F70331K919L673M403M487M233M434N119N682N839N616M826L480K339K023
58803G29404J852O41j524l336m020m012l944l944m059m443m982n387n715o130
58789F80401o314n835m949m171l227j468P21K036J929J249R51J139J623K472L526
58774F70083M093L682K521J093l99j815k921l629m023m066l749l582m181n230
58760F47877n535m520l023k252k350k469j874n95P66J623J864J906K164K537K611
58745F38730K304K019K210L017M204N223N598N511N756O667P467P267O359N773
58731G08105N787N744N293M966N219N709N866N617N232M886M633M525M494M432
58717G80508M451M828N564O301O740O924P083P333P506P153N881L904J941L90
$$ plain form
58703 856507 855362 852175 846525 838392 827823 814769 799498 782791 765539 748328 731450 714991
58691 714991 698850 683083 668305 655384 644692 635998 629032 623642 619412 615689 612093 608491 604512
58678 604512 599704 594280 589016 584304 579995 576272 573833 572844 572523 572203 572209 573287 575809 579947 585953 593732
58662 593732 602647 612255 622670 633764 644458 653337 659567 662931 663525 661900 659093 656056 653327 651316
58648 651316 650208 649308 647284 643586 639086 634918 631270 627740 624174 620643 617204 614172 612041 610726
58634 610726 609531 608279 607735 608515 610325 612781 616027 619954 623761 627064 630554 634697 638670 641513 643531
58619 643531 645486 647169 647981 648359 649411 651500 654336 658094 663311 669843 676914 684038 691032 697305 702027
58604 702027 704957 706518 707253 707744 708542 709572 710057 709637 708875 708025 706239 703011 699527 697306 696290 695682
$$ packed form
58703H56507j145l187n650q133j0569j3054j5271j6707j7252j7211j6878j6459
58691G14991j6141j5767j4778j2921j0692q694o966n390m230l723l596l602l979
58678F04512m808n424n264m712m309l723k439r89l21l20OJ078K522M138O006P779
58662E93732Q915R608J0415J1094J0694Q879O230L364N94j625k807l037k729k011
58648F51316j108r00k024l698m500m168l648l530l566l531l439l032k131j315
58634F10726j195j252n44P80J810K456L246L927L807L303L490M143L973K843K018
58619F43531J955J683Q12L78J052K089K836L758N217O532P071P124O994O273M722
58604G02027K930J561P35M91P98J030M85m20p62q50j786l228l484k221j016o08
$$ plain form
58588 695682 695957 698364 702808 708001 713607 720586 729196 738274 746935 755668 765180 775073 784078 790929
58574 790929 794953 796640 797691 799622 802335 804886 807539 811922 819164 828981 840820 854779 871148
58561 871148 889901 910965 934241 959149 984801 1010531 1035510 1058090 1076540 1090400 1100138 1105709
58549 1105709 1106742 1104107 1099857 1095302 1090350 1085023 1080219 1076316 1072189 1066373 1058397 1048331 1035843
58536 1035843 1020519 1002661 983272 963503 944290 925981 908192 890577 873818 859269 847588
58525 847588 838406 831273 826035 822229 819172 816947 816418 817887 820526 823409 826252 828781 830247 830177 829063
58510 829063 827815 826958 826573 826494 826258 825317 823532 821153 818257 814697 810603 806460 802660 799393 796830 794936
58494 794936 793308 791684 790321 789294 788007 786240 785172 786243 789341 793217 797344 802174 807850 814101
$$ packed form
58588F95682K75K407M444N193N606O979Q610R078Q661Q733R512R893R005O851
58574G90929M024J687J051J931K713K551K653M383P242R817J1839J3959J6369
58561H71148J8753K1064K3276K4908K5652K5730K4979K2580J8450J3860R738N571
58549A105709J033k635m250m555m952n327m804l903m127n816p976j0066j2488
58536A035843j5324j7858j9389j9769j9213j8309j7789j7615j6759j4549j1681
58525H47588r182p133n238l806l057k225n29J469K639K883K843K529J466p0j114
58510H29063j248q57l85p9k36r41j785k379k896l560m094m143l800l267k563j894
58494G94936j628j624j363j027j287j767j068J071L098L876M127M830N676O251
$$ plain form
58480 814101 821350 830542 841811 854490 868366 883574 899312 914134 927609 940161 951178 958900
58468 958900 962507 962795 960416 955152 947493 939281 931907 925193 918799 913418 909784 907800 907482 909568 914271
58453 914271 920646 928150 937729 950198 964320 977517 987887 994787 998165 998320 995884 991393 985140
58440 985140 977697 969925 962221 954491 947158 941302 937470 935203 934048 934099 935266 937084 939705 944064 950631
58425 950631 958861 968197 978575 989669 1000781 1011833 1023242 1034364 1043334 1048980 1051755 1052396 1050996
58412 1050996 1047934 1044217 1040092 1034584 1027184 1018782 1010194 1001058 991074 981176 972517 965264 959197 954572
58398 954572 951661 950379 950840 953197 956498 959044 960514 962374 965556 969184 972295 975213 978200 980291
58384 980291 980739 980457 980937 982798 986208 991417 997835 1003868 1008760 1013538 1019337 1026049 1033450 1042114 1052113
$$ packed form
58480H14101P249R192J1269J2679J3876J5208J5738J4822J3475J2552J1017P722
58468I58900L607K88k379n264p659q212p374o714o394n381l634j984l18K086M703
58453I14271O375P504R579J2469J4122J3197J0370O900L378J55k436m491o253
58440I85140p443p772p704p730p333n856l832k267j155N1J167J818K621M359O567
58425I50631Q230R336J0378J1094J1112J1052J1409J1122Q970N646K775O41j400
58412A050996l062l717m125n508p400q402q588r136r984r898q659p253o067m625
58398I54572k911j282M61K357L301K546J470J860L182L628L111K918K987K091
58384I80291M48k82M80J861L410N209O418O033M892M778N799O712P401Q664R999
$$ plain form
58369 1052113 1062244 1071700 1081196 1091393 1101663 1111599 1122278 1134646 1148000 1161406 1175378 1190815
58357 1190815 1207433 1224422 1241390 1257584 1271660 1283474 1294629 1305924 1315823 1322859 1327963 1332778
58345 1332778 1337221 1340531 1343429 1347337 1352538 1358728 1366295 1375453 1385211 1394813 1405115 1417104 1430256
58332 1430256 1443804 1458258 1474136 1490616 1507035 1524227 1542613 1560428 1575734 1588864 1600965
58321 1600965 1611588 1619761 1626157 1632125 1637665 1642321 1646903 1652407 1658406 1664439 1671727 1681582 1693345
58308 1693345 1705937 1720077 1736914 1755646 1774641 1793739 1813477 1833294 1852512 1871783 1891626
58297 1891626 1910955 1929028 1947231 1966805 1986604 2005439 2024842 2046935 2071201 2096037 2121878
58286 2121878 2150032 2179926 2210283 2241509 2274201 2306862 2337931 2368452 2399894 2431089 2460436
$$ packed form
58369A052113J0131R456R496J0197J0270R936J0679J2368J3354J3406J3972J5437
58357A190815J6618J6989J6968J6194J4076J1814J1155J1295R899P036N104M815
58345A332778M443L310K898L908N201O190P567R158R758R602J0302J1989J3152
58332A430256J3548J4454J5878J6480J6419J7192J8386J7815J5306J3130J2101
58321A600965J0623Q173O396N968N540M656M582N504N999O033P288R855J1763
58308A693345J2592J4140J6837J8732J8995J9098J9738J9817J9218J9271J9843
58297A891626J9329J8073J8203J9574J9799J8835J9403K2093K4266K4836K5841
58286B121878K8154K9894L0357L1226L2692L2661L1069L0521L1442L1195K9347
$$ plain form
58275 2460436 2489390 2520458 2553380 2586736 2621794 2661251 2705416 2752957 2803921 2858638 2915172
58264 2915172 2971489 3028800 3089339 3152446 3216346 3281983 3351239 3423137 3495813 3570492 3649385
58253 3649385 3731406 3814277 3899119 3988541 4082020 4177685 4276722 4381174 4489241 4597957 4708809
58242 4708809 4825518 4947994 5073876 5204353 5342901 5489911 5644156 5807853 5984459
58233 5984459 6173286 6372165 6583411 6810989 7054031 7309806 7580793 7871849 8182919
58224 8182919 8512077 8863240 9242866 9651609 10087754 10556292 11065643 11618184 12213769
58215 12213769 12859847 13567837 14342577 15186711 16112776 17139341 18278756 19542081 20953143
58206 20953143 22544131 24341648 26373567 28686845 31342858 34401846 37934511 42048594
$$ packed form
58275B460436K8954L1068L2922L3356L5058L9457M4165M7541N0964N4717N6534
58264B915172N6317N7311O0539O3107O3900O5637O9256P1898P2676P4679P8893
58253C649385Q2021Q2871Q4842Q9422R3479R5665R9037J04452J08067J08716J10852
58242D708809J16709J22476J25882J30477J38548J47010J54245J63697J76606
58233E984459J88827J98879K11246K27578K43042K55775K70987K91056L11070
58224H182919L29158L51163L79626M08743M36145M68538N09351N52541N95585
58215A2213769O46078P07990P74740Q44134R26065J026565J139415J263325J411062
58206B0953143J590988J797517K031919K313278K656013L058988L532665M114083
$$ plain form
58198 42048594 46887663 52615089 59428947 67589081 77403673 89204199 103375693 120399610
58190 120399610 140812589 165121528 193758355 226896496 263830474 302145368 337579365
58183 337579365 365218916 381426371 385080298 377351679 360578439 337302014 309891553
58176 309891553 280460573 250761321 222084175 195278511 170854397 149065650 129961625
58169 129961625 113438665 99289138 87239855 76993673 68272734 60837523 54479838
58162 54479838 49018401 44305807 40226363 36681385 33583125 30860769 28459122 26327993
58154 26327993 24420922 22703679 21153261 19746763 18459631 17274854 16184213 15179067
58146 15179067 14248105 13384643 12587327 11852191 11171652 10542144 9964862 9437494 8952231
$$ packed form
58198D2048594M839069N727426O813858Q160134R814592J1800526J4171494J7023917
58190A20399610K0412979K4308939K8636827L3138141L6933978L8314894L5433997
58183C37579365K7639551J6207455L653927p728619j6773240k3276425k7410461
58176C09891553k9430980k9699252k8677146k6805664k4424114k1788747j9104025
58169A29961625j6522960j4149527j2049283j0246182q720939p435211o357685
58162E4479838n461437m712594m079444l544978l098260k722356k401647k131129
58154B6327993j907071j717243j550418j406498j287132j184777j090641j005146
58146A5179067r30962q63462p97316p35136o80539o29508n77282n27368m85263
$$ plain form
58137 8952231 8502825 8086736 7699507 7334173 6987531 6660543 6351585 6055684 5771429
58128 5771429 5502154 5248929 5008463 4779173 4563366 4361927 4172580 3994877 3831426
58119 3831426 3682637 3545403 3418372 3303322 3199760 3103270 3010898 2923538 2841405 2761870
58109 2761870 2683478 2607723 2535157 2463987 2394071 2328086 2267086 2208877 2152364 2099556 2051672
58098 2051672 2007121 1965032 1926955 1893265 1861361 1829192 1797305 1766017 1733993 1701249 1670183
58087 1670183 1641913 1614670 1587366 1561585 1538391 1516223 1493629 1471288 1449808 1428380 1407134
58076 1407134 1387845 1370694 1353127 1333647 1313987 1295851 1278215 1259706 1241108 1223568 1206591
58065 1206591 1189756 1174355 1161491 1150397 1140201 1131500 1124646 1118334 1111391 1104300 1097603 1090427 1081895
$$ packed form
58137H952231m49406m16089l87229l65334l46642l26988l08958k95901k84255
58128E771429k69275k53225k40466k29290k15807k01439j89347j77703j63451
58119C831426j48789j37234j27031j15050j03562r6490r2372q7360q2133p9535
58109B761870p8392p5755p2566p1170o9916o5985o1000n8209n6513n2808m7884
58098B051672m4551m2089l8077l3690l1904l2169l1887l1288l2024l2744l1066
58087A670183k8270k7243k7304k5781k3194k2168k2594k2341k1480k1428k1246
58076A407134j9289j7151j7567j9480j9660j8136j7636j8509j8598j7540j6977
58065A206591j6835j5401j2864j1094j0196q701o854o312o943p091o697p176q532
$$ plain form
58052 1081895 1072395 1062371 1051555 1040373 1030386 1022252 1014982 1008055 1002403 998319 994346 989363 983980
58039 983980 978843 973418 967451 961736 956386 950195 942770 935447 929045 922599 915397 908343 902076 895620
58025 895620 888149 880350 872846 865036 856773 849469 844218 840387 837157 834831 833446 831888 829681 828023
58011 828023 827743 827824 827235 826607 826794 827285 827393 827521 827914 827625 826092 824365 823481 823020 822549 822970 825094 828224
57993 828224 831593 835747 841001 845833 848506 849264 849489 849640 849395 848791 847860 846065 843362 840919 839551 838389
57977 838389 836289 833598 831314 829476 827615 825907 824671 823561 822428 822163 823567 826134 828916 831778
57963 831778 834852 837675 839905 842071 844639 847159 849172 851016 852889 854125 854312 854091 853964 853398 852024
57948 852024 850601 849787 849130 848348 848506 850673 854366 858430 862569 867059 871966 877708 885287 894870 905169
$$ packed form
58052A081895r500j0024j0816j1182r987q134p270o927n652m084l973m983n383
58039I83980n137n425n967n715n350o191p425p323o402o446p202p054o267o456
58025H95620p471p799p504p810q263p304n251l831l230k326j385j558k207j658
58011H28023k80Q1n89o28J87M91J08J28L93k89j533j727q84m61m71M21K124L130
57993H28224L369M154N254M832K673P58K25J51k45o04r31j795k703k443j368j162
57977H38389k100k691k284j838j861j708j236j110j133k65J404K567K782K862
57963H31778L074K823K230K166K568K520K013J844J873J236J87k21j27n66j374
57948H52024j423q14o57p82J58K167L693M064M139M490M907N742P579R583J0299
$$ plain form
57933 905169 915235 925743 937401 949255 959915 969364 978277 986442 993140 998147 1001213 1001518 998878
57920 998878 994525 989522 983452 975876 967919 960968 954764 948272 941526 935250 929554 924375 920224 917155
57906 917155 914059 910441 907757 907347 908143 908275 907859 908127 908662 907883 905872 904453 904540 905417 906686 908956 912327
57889 912327 915918 919348 923322 928316 933760 938776 942905 946064 948650 951536 955126 958680 961360 963425
57875 963425 965385 966591 965975 963838 961599 959993 958657 957194 955493 953224 950152 946789 943807 941206
57861 941206 938948 937750 938080 939054 939675 940595 943134 947040 950918 954555 959113 965063 971537 977875 984331
57846 984331 991010 997363 1002936 1007600 1011085 1013326 1015120 1017200 1018798 1018416 1015989 1013059 1010805 1009195
57832 1009195 1008071 1007712 1008087 1008719 1009543 1010960 1012936 1014960 1016972 1019412 1022501 1026319 1031339 1037852 1045136
$$ packed form
57933I05169J0066J0508J1658J1854J0660R449Q913Q165O698N007L066L05k640
57920I98878m353n003o070p576p957o951o204o492o746o276n696n179m151l069
57906I17155l096l618k684m10P96J32m16K68N35p79k011j419Q7Q77J269K270L371
57889I12327L591L430L974M994N444N016M129L159K586K886L590L554K680K065
57875I63425J960J206o16k137k239j606j336j463j701k269l072l363k982k601
57861I41206k258j198L30R74O21R20K539L906L878L637M558N950O474O338O456
57846I84331O679O353N573M664L485K241J794K080J598l82k427k930k254j610
57832A009195j124l59L75O32Q24J417J976K024K012K440L089L818N020O513P284
$$ plain form
57817 1045136 1052310 1059672 1067945 1076603 1084398 1091268 1098115 1104739 1109680 1112239 1113050 1112453 1109969 1105812
57803 1105812 1101393 1097719 1094551 1091658 1089536 1088299 1087064 1085191 1083084 1081141 1078890 1075799 1072145 1068524
57789 1068524 1065368 1063314 1063151 1064718 1066624 1067621 1067741 1067795 1068467 1070230 1073392 1077764 1082733 1087943 1093485
57774 1093485 1099457 1105964 1113442 1122192 1131555 1140393 1148375 1156005 1163455 1170373 1176805 1183193 1189287 1194138
57760 1194138 1197427 1199918 1202445 1205318 1208782 1212958 1217187 1220454 1222720 1224863 1227225 1229317 1231083 1233195
57746 1233195 1235803 1238194 1240098 1242228 1245111 1248521 1252469 1257532 1263593 1269321 1273634 1276799 1279611 1282348
57732 1282348 1285038 1287804 1290406 1292294 1293650 1295508 1298438 1301976 1305739 1309947 1314365 1317915 1320160 1322158
57718 1322158 1324957 1328097 1330435 1331771 1332845 1334356 1336740 1340269 1344642 1348929 1352545 1355730 1358686 1361025
$$ packed form
57817A045136P174P362Q273Q658P795O870O847O624M941K559Q11n97k484m157
57803A105812m419l674l168k893k122j237j235j873k107j943k251l091l654l621
57789A068524l156k054j63J567J906R97J20N4O72J763L162M372M969N210N542
57774A093485N972O507P478Q750R363Q838P982P630P450O918O432O388O094M851
57760A194138L289K491K527K873L464M176M229L267K266K143K362K092J766K112
57746A233195K608K391J904K130K883L410L948N063O061N728M313L165K812K737
57732A282348K690K766K602J888J356J858K930L538L763M208M418L550K245J998
57718A322158K799L140K338J336J074J511K384L529M373M287L616L185K956K339
$$ plain form
57704 1361025 1362622 1364234 1366501 1369073 1371436 1373992 1377489 1381896 1386652 1391604 1396943 1402498 1407761 1412403
57690 1412403 1416322 1419476 1422054 1424463 1426821 1428887 1430779 1433314 1437246 1442623 1449153 1456759 1465567 1475955
57676 1475955 1488776 1504835 1523901 1545056 1568418 1595751 1629023 1669174 1716729 1772481 1836359
57665 1836359 1905662 1974739 2036087 2081991 2106636 2108193 2089192 2054814 2011023 1963699 1917677
57654 1917677 1875426 1837173 1802873 1773451 1749755 1731326 1717032 1706273 1698885 1694495 1692664 1693036
57642 1693036 1694752 1696401 1697313 1698332 1700694 1704659 1709726 1715450 1721410 1727112 1732676 1739009 1746603 1754709
57628 1754709 1762235 1768744 1774106 1778115 1781219 1784666 1788955 1792972 1795634 1797611 1800314 1803962 1807899 1812202
57614 1812202 1817533 1823698 1829695 1835124 1840519 1846355 1852638 1859333 1866300 1872996 1879109 1885260 1892227 1899684
$$ packed form
57704A361025J597J612K267K572K363K556L497M407M756M952N339N555N263M642
57690A412403L919L154K578K409K358K066J892K535L932N377O530P606Q808J0388
57676A475955J2821J6059J9066K1155K3362K7333L3272M0151M7555N5752O3878
57665A836359O9303O9077O1348M5904K4645J557j9001l4378m3791m7324m6022
57654A917677m2251l8253l4300k9422k3696j8429j4294j0759p388m390j831L72
57642A693036J716J649R12J019K362L965N067N724N960N702N564O333P594Q106
57628A754709P526O509N362M009L104L447M289M017K662J977K703L648L937M303
57614A812202N331O165N997N429N395N836O283O695O967O696O113O151O967P457
$$ plain form
57600 1899684 1906648 1912966 1919446 1926584 1934075 1941505 1948722 1955524 1961741 1967606 1973347 1978580 1982831 1986451
57586 1986451 1990197 1994082 1997555 2000811 2005006 2011082 2019010 2028197 2037889 2047197 2055538 2063262 2071272 2079933
57572 2079933 2088861 2097715 2106534 2115298 2123830 2132223 2140789 2149432 2157670 2165421 2173346 2182243 2192400 2203524
57558 2203524 2214987 2226156 2236813 2247272 2257879 2268552 2279073 2289552 2300279 2311340 2322723
57547 2322723 2334525 2346675 2358719 2370249 2381260 2391807 2401741 2411188 2420821 2431176 2442096 2453265
57535 2453265 2464725 2476298 2487119 2496523 2504984 2513459 2522278 2531348 2540884 2550961 2560748 2569250 2576640
57522 2576640 2584010 2591992 2600496 2609507 2619213 2629496 2640232 2651973 2665307 2679608 2693412 2706174
57510 2706174 2718788 2732288 2746826 2761979 2777219 2791886 2805484 2818235 2830822 2843507 2855976
$$ packed form
57600A899684O964O318O480P138P491P430P217O802O217N865N741N233M251L620
57586A986451L746L885L473L256M195O076P928R187R692R308Q341P724Q010Q661
57572B079933Q928Q854Q819Q764Q532Q393Q566Q643Q238P751P925Q897J0157J1124
57558B203524J1463J1169J0657J0459J0607J0673J0521J0479J0727J1061J1383
57547B322723J1802J2150J2044J1530J1011J0547R934R447R633J0355J0920J1169
57535B453265J1460J1573J0821R404Q461Q475Q819R070R536J0077R787Q502P390
57522B576640P370P982Q504R011R706J0283J0736J1741J3334J4301J3804J2762
57510B706174J2614J3500J4538J5153J5240J4667J3598J2751J2587J2685J2469
$$ plain form
57499 2855976 2867936 2879214 2889461 2898532 2907135 2916258 2925855 2934842 2942491 2949191 2955851 2963213 2971693
57486 2971693 2981138 2990723 2999778 3008700 3018341 3028668 3038899 3048855 3059105 3069721 3079987 3089615 3099222
57473 3099222 3109219 3119133 3128520 3137688 3146963 3155966 3164204 3171828 3179329 3186997 3195157 3204446 3215317 3227484
57459 3227484 3240246 3253170 3266216 3279499 3293112 3307014 3320993 3334980 3349306 3364244 3379323
57448 3379323 3393592 3406674 3419147 3431858 3445237 3459242 3473523 3487609 3501359 3515172 3529347
57437 3529347 3543469 3557042 3570492 3584787 3600157 3615965 3631890 3648382 3665798 3683797 3701764
57426 3701764 3719200 3735611 3750760 3765194 3779836 3794934 3809996 3824768 3839472 3854036 3867954
57415 3867954 3881159 3894286 3907901 3922234 3937683 3954566 3972113 3988810 4004191 4019401 4035522
$$ packed form
57499B855976J1960J1278J0247R071Q603R123R597Q987P649O700O660P362Q480
57486B971693R445R585R055Q922R641J0327J0231R956J0250J0616J0266R628R607
57473C099222R997R914R387R168R275R003Q238P624P501P668Q160R289J0871J2167
57459C227484J2762J2924J3046J3283J3613J3902J3979J3987J4326J4938J5079
57448C379323J4269J3082J2473J2711J3379J4005J4281J4086J3750J3813J4175
57437C529347J4122J3573J3450J4295J5370J5808J5925J6492J7416J7999J7967
57426C701764J7436J6411J5149J4434J4642J5098J5062J4772J4704J4564J3918
57415C867954J3205J3127J3615J4333J5449J6883J7547J6697J5381J5210J6121
$$ plain form
57404 4035522 4052261 4068820 4085048 4101045 4116512 4131405 4146586 4162951 4180447 4198622 4217534
57393 4217534 4237211 4256760 4275055 4292141 4309079 4326570 4344496 4362710 4381473 4401041 4421384
57382 4421384 4442407 4463900 4485272 4505820 4525378 4544377 4563267 4582221 4601287 4620320 4638688
57371 4638688 4655562 4670766 4685061 4699254 4713268 4726479 4738922 4751663 4765662 4780620 4795433
57360 4795433 4809683 4824007 4838914 4854016 4868842 4883684 4898919 4914058 4928393 4942342 4957177
57349 4957177 4973440 4990459 5007449 5024211 5040622 5056310 5071201 5085738 5100269 5114674 5128798
57338 5128798 5142704 5156374 5169710 5182951 5196486 5210211 5223743 5237348 5251812 5267135 5282267
57327 5282267 5296524 5310554 5325413 5341357 5357909 5374471 5390336 5404827 5418071 5431208 5445253
$$ packed form
57404D035522J6739J6559J6228J5997J5467J4893J5181J6365J7496J8175J8912
57393D217534J9677J9549J8295J7086J6938J7491J7926J8214J8763J9568K0343
57382D421384K1023K1493K1372K0548J9558J8999J8890J8954J9066J9033J8368
57371D638688J6874J5204J4295J4193J4014J3211J2443J2741J3999J4958J4813
57360D795433J4250J4324J4907J5102J4826J4842J5235J5139J4335J3949J4835
57349D957177J6263J7019J6990J6762J6411J5688J4891J4537J4531J4405J4124
57338E128798J3906J3670J3336J3241J3535J3725J3532J3605J4464J5323J5132
57327E282267J4257J4030J4859J5944J6552J6562J5865J4491J3244J3137J4045
$$ plain form
57316 5445253 5460054 5474728 5488676 5501730 5513804 5524985 5535713 5546449 5557329 5568364 5579583
57305 5579583 5590753 5601450 5611706 5622110 5632938 5643662 5653683 5663090 5672313 5681536 5690908 5700881
57293 5700881 5711791 5723343 5734929 5746229 5757250 5768057 5778704 5789164 5799163 5808458 5817373 5826562
57281 5826562 5836112 5845401 5854012 5862126 5869845 5876923 5883560 5890727 5899168 5908714 5919043 5930475 5943405
57268 5943405 5957533 5972334 5987833 6004355 6021879 6040109 6058801 6077536 6095627 6112718 6129013
57257 6129013 6144506 6158520 6170517 6180876 6190336 6199178 6207482 6215604 6223820 6231965 6239999 6248426 6257516
57244 6257516 6266728 6275521 6284126 6292715 6300464 6306496 6311351 6316426 6322106 6327428 6331511 6334387 6336415 6337838
57230 6337838 6339117 6340928 6343506 6346479 6349524 6352771 6356427 6360485 6364973 6370203 6376550 6384091 6392483 6401135
$$ packed form
57316E445253J4801J4674J3948J3054J2074J1181J0728J0736J0880J1035J1219
57305E579583J1170J0697J0256J0404J0828J0724J0021R407R223R223R372R973
57293E700881J0910J1552J1586J1300J1021J0807J0647J0460R999R295Q915R189
57281E826562R550R289Q611Q114P719P078O637P167Q441R546J0329J1432J2930
57268E943405J4128J4801J5499J6522J7524J8230J8692J8735J8091J7091J6295
57257F129013J5493J4014J1997J0359R460Q842Q304Q122Q216Q145Q034Q427R090
57244F257516R212Q793Q605Q589P749O032M855N075N680N322M083K876K028J423
57230F337838J279J811K578K973L045L247L656M058M488N230O347P541Q392Q652
$$ plain form
57216 6401135 6409630 6418011 6426487 6434916 6442989 6450883 6459123 6467615 6475523 6482440 6488919 6495324 6500877 6504572
57202 6504572 6506511 6507618 6508485 6509241 6510134 6511406 6512733 6513470 6513349 6512504 6511085 6509310 6507491 6505431 6502253
57187 6502253 6497423 6491543 6485555 6479671 6473861 6468864 6465694 6464423 6464312 6464891 6466013 6467064 6467125 6465921 6463797
57172 6463797 6460748 6456198 6449717 6441225 6430634 6418055 6404291 6390269 6375969 6360677 6344265 6327354
57160 6327354 6310120 6291823 6271810 6250320 6227938 6204857 6181011 6156580 6132061 6107993 6084607
57149 6084607 6061479 6037531 6011668 5983413 5952816 5920033 5885240 5848570 5809759 5768240 5724030
57138 5724030 5678116 5631540 5584601 5537574 5491615 5448103 5407517 5369804 5335462 5305253 5279074
57127 5279074 5256058 5235624 5217460 5200614 5183643 5165766 5147198 5128522 5110764 5096076 5087404
$$ packed form
57216F401135Q495Q381Q476Q429Q073P894Q240Q492P908O917O479O405N553L695
57202F504572J939J107Q67P56Q93J272J327P37j21q45j419j775j819k060l178
57187F502253m830n880n988n884n810m997l170j271j11N79J122J051O1j204k124
57172F463797l049m550o481q492j0591j2579j3764j4022j4300j5292j6412j6911
57160F327354j7234j8297k0013k1490k2382k3081k3846k4431k4519k4068k3386
57149F084607k3128k3948k5863k8255l0597l2783l4793l6670l8811m1519m4210
57138E724030m5914m6576m6939m7027m5959m3512m0586l7713l4342l0209k6179
57127E279074k3016k0434j8164j6846j6971j7877j8568j8676j7758j4688q672
$$ plain form
57116 5087404 5087248 5097346 5119250 5154087 5201582 5260288 5329161 5408591 5500334 5607700 5736005
57105 5736005 5891911 6081943 6312161 6589117 6920526 7315613 7786557 8350355 9028849
57096 9028849 9847269 10833894 12020876 13443334 15136149 17131094 19455319 22128962
57088 22128962 25160775 28543812 32252512 36240823 40442449 44775216 49147108 53458647
57080 53458647 57602280 61465896 64941774 67930470 70331697 72032291 72911414 72869279
57072 72869279 71862569 69923038 67150591 63690483 59709965 55382440 50877721 46353710
57064 46353710 41947827 37770002 33898888 30381291 27234705 24453352 22016529 19896005
57056 19896005 18060297 16476848 15113946 13942142 12934332 12065277 11311958 10654479
$$ packed form
57116E087404j56J0098K1904L4837M7495N8706O8873P9430R1743J07366J28305
57105E736005J55906J90032K30218K76956L31409L95087M70944N63798O78494
57096I028849Q18420R86625J186982J422458J692815J994945K324225K673643
57088B2128962L031813L383037L708700L988311M201626M332767M371892M311539
57080E3458647M143633L863616L475878K988696K401227J700594Q79123m2135
57072G2869279j006710j939531k772447l460108l980518m327525m504719m524011
57064D6353710m405883m177825l871114l517597l146586k781353k436823k120524
57056A9896005j835708j583449j362902j171804j007810q69055p53319o57479
$$ plain form
57048 10654479 10076239 9563279 9103728 8687581 8306437 7953199 7622019 7308403 7009235
57039 7009235 6722835 6448924 6188086 5940996 5708169 5490159 5287195 5098467 4922517
57030 4922517 4758753 4608064 4471593 4349798 4243457 4154394 4082728 4021983 3957590 3871897
57020 3871897 3752355 3596444 3410382 3204305 2988425 2771814 2562185 2365147 2183560
57011 2183560 2018091 1868464 1734036 1613723 1506133 1409940 1323863 1246535 1176873 1114417
57001 1114417 1058752 1008716 962776 920129 880845 844960 812062 781841 754422 729993 708636
56990 708636 690602 676202 665350 657644 652996 651683 653789 659010 666729 675518 682637 685013 681052
56977 681052 671071 656159 637465 616541 595203 574608 555144 537334 521962 509113 498128 488867
$$ packed form
57048A0654479n78240n12960m59551m16147l81144l53238l31180l13616k99168
57039G009235k86400k73911k60838k47090k32827k18010k02964j88728j75950
57030D922517j63764j50689j36471j21795j06341q9063p1666o0745o4393q5693
57020C871897j19542j55911j86062k06077k15880k16611k09629j97038j81587
57011B183560j65469j49627j34428j20313j07590r6193q6077p7328o9662o2456
57001A114417n5665n0036m5940m2647l9284l5885l2898l0221k7419k4429k1357
56990G08636j8034j4400j0852p706m648j313K106N221P719Q789P119K376l961
56977F81052r981j4912j8694k0924k1338k0595j9464j7810j5372j2849j0985r261
$$ plain form
56965 488867 482064 478055 476270 476545 479867 487019 497405 510118 525289 543195 562316 579246 590409
56952 590409 593501 587914 574785 556543 535673 513803 491986 471329 452785 436790 423599 413618
56940 413618 406951 403099 401687 403195 408447 417687 430611 447016 467012 490757 517996 547163 574598
56927 574598 595464 606251 606240 596474 578303 553589 525324 496660 469335 443730 420111 399004
56915 399004 380617 364754 351340 340456 331913 325237 319975 315698 311971 308694 306125 304271 302783
56902 302783 301853 302554 305542 309998 314655 319524 325725 333950 343944 355330 368038 381963 396987 413446
56888 413446 431921 452501 474675 497725 520491 540749 555562 562617 561111 551676 536040 516656
56876 516656 495925 475406 455910 438204 423211 411666 403961 400319 400793 405239 413704 426798 445349
$$ packed form
56965D88867o803m009j785K75L322P152J0386J2713J5171J7906J9121J6930J1163
56952E90409L092n587j3129j8242k0870k1870k1817k0657j8544j5995j3191r981
56940D13618o667l852j412J508N252R240J2924J6405J9996K3745K7239K9167K7435
56927E74598K0866J0787j1r766j8171k4714k8265k8664k7325k5605k3619k1107
56915C99004j8387j5863j3414j0884q543o676n262m277l727l277k569j854j488
56902C02783r30P01K988M456M657M869O201Q225R994J1386J2708J3925J5024J6459
56888D13446J8475K0580K2174K3050K2766K0258J4813P055j506r435j5636j9384
56876E16656k0731k0519j9496j7706j4993j1545p705l642M74M446Q465J3094J8551
$$ plain form
56863 445349 469851 500565 537962 582504 633665 688949 743523 790858 824682 841387 840987 825955
56851 825955 799648 765832 728638 691827 658025 628955 605920 589559 579594 575628 578116 588120
56839 588120 606468 633719 670644 718129 776785 846974 928323 1017677 1107140 1185091 1240147
56828 1240147 1265078 1258389 1223707 1168014 1099381 1025013 950405 879473 814941 758643 711703
56817 711703 674453 646388 626792 615667 613643 620966 637285 662670 698016 743857 799149 861132
56805 861132 924946 982765 1024878 1043795 1037708 1009835 965377 909977 849636 789522 732266 678457
56793 678457 628919 585483 549512 520879 498713 482385 471650 466608 467690 475090 488284 506741
56781 506741 530731 560215 592739 623236 646146 657389 654979 639359 613491 581452 546202 509083
$$ packed form
56863D45349K4502L0714L7397M4542N1161N5284N4574M7335L3824J6705m00j5032
56851H25955k6307l3816l7194l6811l3802k9070k3035j6361r965l966K488J0004
56839E88120J8348K7251L6925M7485N8656P0189Q1349Q9354Q9463P7951N5056
56828A240147K4931o689l4682n5693o8633p4368p4608p0932o4532n6298m6940
56817G11703l7250k8065j9596j1125k024P323J6319K5385L5346M5841N5292O1983
56805H61132O3814N7819M2113J8917o087k7873m4458n5400o0341o0114n7256n3809
56793F78457m9538m3436l5971k8633k2166j6328j0735n042J082P400J3194J8457
56781E06741K3990K9484L2524L0497K2910J1243k410j5620k5868l2039l5250l7119
$$ plain form
56769 509083 471360 435148 402389 373779 349090 327863 309379 292648 277023 262516 249349
56758 249349 237600 227404 218875 211624 204863 198207 191954 186449 181737 177884 175006 172765 170381 167469
56744 167469 164417 161783 159698 158001 156495 154925 153099 151158 149392 147779 146129 144613 143641 143227 142966
56729 142966 142636 142286 141741 140617 138921 137143 135680 134605 133990 133904 134101 134206 134212 134271 134085 133156 131621 130185
56711 130185 129161 128190 126992 125797 124941 124583 124929 126164 127988 129743 131099 132248 133370 134275 134571 133872
56695 133872 132059 129757 128235 128200 128902 128987 127986 126362 124500 122543 120921 119990 119180 117440 114528 111007
56679 111007 107106 102604 97821 93566 89931 86177 82097 78449 75772 73708 71860 70423 69581 69136 69154
56664 69154 70228 72675 76107 80111 84639 89500 94249 98972 104399 110821 117573 123918 129785 135277
$$ packed form
56769E09083l7723l6212l2759k8610k4689k1227j8484j6731j5625j4507j3167
56758B49349j1749j0196q529p251o761o656o253n505m712l853k878k241k384k912
56744A67469l052k634k085j697j506j570j826j941j766j613j650j516r72m14k61
56729A42966l30l50n45j124j696j778j463j075o15q6J97J05ON9j86r29j535j436
56711A30185j024r71j198j195q56l58L46J235J824J755J356J149J122R05K96o99
56695A33872j813k302j522l5P02Q5j001j624j862j957j622r31q10j740k912l521
56679A11007l901m502m783m255l635l754m080l648k677k064j848j437q42m45J8
56664F9154J074K447L432M004M528M861M749M723N427O422O752O345N867N492
$$ plain form
56650 135277 140176 144392 148282 152061 155393 157985 160188 162662 165797 169581 173605 177189 179998 182603
56636 182603 185825 189561 192902 195350 197148 198486 199306 199920 200850 201888 202279 202011 201917 202295 202445 201872 200897
56619 200897 199725 197931 195353 192505 189671 186527 183111 180133 177799 175295 172014 168283 164273 159334
56605 159334 153242 147215 142683 139731 137577 135903 134809 134022 133130 132302 132039 132451 133321 134538 136012 137505
56589 137505 138999 140869 143324 146063 148696 151034 152789 153658 153897 154167 154588 154736 154742 155429 157014 158661
56573 158661 159811 160953 162553 164241 165744 167683 170664 174409 178562 183555 189910 197430 205889 215863
56559 215863 227986 241959 256877 271916 286060 297968 306964 313632 318754 322382 324587 326226 327996
56546 327996 329390 329584 328826 328042 327525 326863 325730 323976 321318 317727 313764 309892 305862 301279 296230
$$ packed form
56650A35277M899M216L890L779L332K592K203K474L135L784M024L584K809K605
56636A82603L222L736L341K448J798J338Q20O14R30J038L91k68r4L78J50n73r75
56619B00897j172j794k578k848k834l144l416k978k334k504l281l731m010m939
56605A59334o092o027m532k952k154j674j094p87q92q28k63M12Q70J217J474J493
56589A37505J494J870K455K739K633K338J755Q69K39K70M21J48OO87J585J647
56573A58661J150J142J600J688J503J939K981L745M153M993O355P520Q459R974
56559B15863J2123J3973J4918J5039J4144J1908Q996O668N122L628K205J639J770
56546C27996J394J94p58p84n17o62j133j754k658l591l963l872m030m583n049
$$ plain form
56531 296230 290817 284778 278245 272134 266993 262152 256871 251691 247728 245154 243289 241688 240246 238599
56517 238599 236338 233584 230739 228001 225572 223736 222218 220158 217410 215032 213721 212605 210562 207995
56503 207995 206238 205739 205897 206177 206364 206141 205408 204676 204349 204045 203425 203067 203626 204698 205519 206227 207389 208728
56485 208728 209455 209508 209522 209827 210344 211093 212028 212828 213634 215313 218058 220451 221102 220633 220855 222443 224668 226895
56467 226895 229004 230637 231437 231949 233079 234695 235814 236029 235735 235149 234187 233220 232780 232596 231915 230822 230243
56450 230243 230571 231167 231299 230899 230362 230149 230556 231388 232140 232734 233586 234595 234968 234626 234786 236253 238136 239322
56432 239322 240215 241724 243398 244072 243681 243012 242250 241278 240803 241585 242994 243893 244543 246019 248159 249811 250825
56415 250825 252044 253438 254012 253613 253174 253028 252540 251569 250762 250232 249360 248113 247226 246939 246862 247093 248053 249172
$$ packed form
56531B96230n413o039o533o111n141m841n281n180l963k574j865j601j442j647
56517B38599k261k754k845k738k429j836j518k060k748k378j311j116k043k567
56503B07995j757m99J58K80J87k23p33p32l27l04o20l58N59J072Q21P08J162J339
56485B08728P27N3J4L05N17P49R35Q00Q06J679K745K393O51m69K22J588K225K227
56467B26895K109J633Q00N12J130J616J119K15k94n86r62r67m40j84o81j093n79
56450B30243L28N96J32m00n37k13M07Q32P52N94Q52J009L73l42J60J467J883J186
56432B39322Q93J509J674O74l91o69p62r72m75P82J409Q99O50J476K140J652J014
56415B50825J219J394N74l99m39j46m88r71q07n30q72j247q87k87p7K31R60J119
$$ plain form
56397 249172 249228 248219 247482 247721 248296 248651 249051 249653 250166 250720 251830 253278 254305 255021 256354 258431 260429
56380 260429 262147 264280 266869 268885 269735 269795 269206 267608 265465 264219 264548 265725 267110 269035 271782
56365 271782 275043 278852 283777 289594 294986 299161 302674 306148 309290 311750 313921 316336 319082 322201
56351 322201 325802 329504 332635 335112 337224 338667 338937 338571 338600 338813 338088 336578 335858 336549 337462 337540 337014
56334 337014 336140 334524 332456 331317 331640 332159 331723 330928 330996 332226 334400 337542 341230 344162 345404 345397 345085
56317 345085 344870 344914 345499 346475 347201 347561 348153 349136 349970 350720 352429 355675 359793 364043 368408 372735 376302
56300 376302 378893 381277 384075 387144 390452 394389 398769 402753 406226 409994 414211 418066 421540 425877
56286 425877 431540 437230 441930 446580 452635 460156 468329 476854 485874 495434 505841 517584 530217
$$ packed form
56397B49172N6j009p37K39N75L55M00O02N13N54J110J448J027P16J333K077J998
56380B60429J718K133K589K016Q50O0n89j598k143j246L29J177J385J925K747
56365B71782L261L809M925N817N392M175L513L474L142K460K171K415K746L119
56351C22201L601L702L131K477K112J443K70l66K9K13p25j510p20O91R13P8n26
56334C37014q74j616k068j139L23N19m36p95O8J230K174L142L688K932J242pl12
56317C45085k15M4N85R76P26L60N92R83Q34P50J709L246M118M250M365M327L567
56300C76302K591K384K798L069L308L937M380L984L473L768M217L855L474M337
56286D25877N663N690M700M650O055P521Q173Q525R020R560J0407J1743J2633
$$ plain form
56273 530217 542396 553709 565330 578171 591726 605599 620818 638426 657859 677921 698567
56262 698567 720703 744940 771464 800470 831985 865940 903044 944894 992754 1047008 1108058
56251 1108058 1176687 1253182 1337316 1429704 1531928 1644799 1767686 1899890 2041196 2190450
56241 2190450 2345150 2503099 2662931 2822137 2976103 3119998 3250256 3363385 3455138 3522215
56231 3522215 3563630 3579440 3569437 3534144 3475718 3396726 3299275 3186374 3062729 2932830 2799220
56220 2799220 2663629 2528432 2395825 2266715 2141716 2022220 1909450 1803469 1704092 1611746
56210 1611746 1526588 1447964 1375567 1309867 1250564 1196037 1145217 1098599 1056559 1018243 983095
56199 983095 951725 924075 898426 873599 850546 830358 812281 795209 779658 766576 755459
$$ packed form
56273E30217J2179J1313J1621J2841J3555J3873J5219J7608J9433K0062K0646
56262F98567K2136K4237K6524K9006L1515L3955L7104M1850M7860N4254O1050
56251A108058O8629P6495Q4134R2388J02224J12871J22887J32204J41306J49254
56241B190450J54700J57949J59832J59206J53966J43895J30258J13129R1753O7077
56231C522215M1415J5810j0003l5293n8426p8992r7451j12901j23645j29899j33610
56220B799220j35591j35197j32607j29110j24999j19496j12770j05981r9377r2346
56210A611746q5158p8624p2397o5700n9303n4527n0820m6618m2040l8316l5148
56199I83095l1370k7650k5649k4827k3053k0188j8077j7072j5551j3082j1117
$$ plain form
56188 755459 745186 735621 727042 719115 711742 705725 701377 697677 693855 690430 687652 684606 681035 678279
56174 678279 677072 676202 674769 673898 674625 676034 677170 678885 681882 684924 687033 689695 694602 700890 706906
56159 706906 713153 721070 730286 739537 749054 759624 770449 780368 790230 801750 814906 828709 843649
56146 843649 861241 881940 905545 932806 964789 1001579 1043465 1092345 1150125 1216843 1291951
56135 1291951 1375791 1467514 1562888 1656429 1744672 1825662 1897260 1958782 2012966 2063525 2111456
56124 2111456 2155705 2195790 2231037 2258648 2275740 2282788 2282670 2277200 2266838 2252409 2234070 2209297
56112 2209297 2174619 2128916 2073028 2007453 1933209 1853990 1774638 1697929 1624966 1557538 1497463
56101 1497463 1444588 1398044 1358523 1326787 1301088 1278798 1259678 1244941 1234172 1225856 1219844 1216512
$$ packed form
56188G55459j0273r565q579p927p373o017m348l700l822l425k778l046l571k756
56174F78279j207q70j433q71P27J409J136J715K997L042K109K662M907O288O016
56159G06906O247P917R216R251R517J0570J0825R919R862J1520J3156J3803J4940
56146H43649J7592K0699K3605K7261L1983L6790M1886M8880N7780O6718P5108
56135A291951Q3840R1723R5374R3541Q8243Q0990P1598O1522N4184N0559M7931
56124B111456M4249M0085L5247K7611J7092P048j18n470j0362j4429j8339k4773
56112B209297l4678m5703n5888o5575p4244p9219p9352p6709p2963o7428o0075
56101A497463n2875m6544l9521l1736k5699k2290j9120j4737j0769q316o012l332
$$ plain form
56089 1216512 1214574 1212511 1211133 1212021 1214599 1217448 1221197 1227167 1234410 1241078 1247480 1254884 1262748 1270178
56075 1270178 1278569 1289459 1301336 1311982 1322418 1334981 1349118 1362943 1377344 1394402 1413115
56064 1413115 1431017 1448874 1469400 1492292 1514863 1536743 1559563 1582786 1604246 1624326 1645292
56053 1645292 1667023 1687541 1707140 1727871 1749620 1770793 1792048 1815163 1839178 1861980 1884619
56042 1884619 1909498 1935488 1959706 1983008 2008620 2036334 2063340 2089964 2119189 2151176 2183797
56031 2183797 2218038 2257304 2301705 2348413 2397071 2449300 2503497 2555950 2606786 2659141 2713081
56020 2713081 2766161 2819293 2875890 2935849 2996693 3059904 3129543 3205377 3284233 3367316 3458790
56009 3458790 3557701 3658982 3762100 3870809 3984580 4098557 4212235 4329963 4452669 4577418
$$ packed form
56089A216512j938k063j378Q88K578K849L749N970P243O668O402P404P864P430
56075A270178Q391J0890J1877J0646J0436J2563J4137J3825J4401J7058J8713
56064A413115J7902J7857K0526K2892K2571K1880K2820K3223K1460K0080K0966
56053A645292K1731K0518J9599K0731K1749K1173K1255K3115K4015K2802K2639
56042A884619K4879K5990K4218K3302K5612K7714K7006K6624K9225L1987L2621
56031B183797L4241L9266M4401M6708M8658N2229N4197N2453N0836N2355N3940
56020B713081N3080N3132N6597N9959O0844O3211O9639P5834P8856Q3083R1474
56009C458790R8911J01281J03118J08709J13771J13977J13678J17728J22706J24749
$$ plain form
55999 4577418 4705416 4841812 4987201 5138081 5296037 5467360 5653148 5849190 6056048
55990 6056048 6279401 6519813 6772445 7037712 7321865 7626239 7946873 8285644 8650643
55981 8650643 9044721 9465307 9916113 10406599 10939384 11511454 12128446 12803754 13543372
55972 13543372 14347207 15226110 16201114 17285390 18485365 19820993 21325685 23025728
55964 23025728 24942444 27117679 29615361 32498405 35833349 39723657 44313661 49762423
55956 49762423 56251752 64025408 73384020 84643981 98154730 114361027 133784953
55949 133784953 156933338 184253967 216016291 251755485 289367420 324744039 352772391
55942 352772391 369292437 372597326 363528187 344537937 318688536 289027946 258196883
$$ packed form
55999D577418J27998J36396J45389J50880J57956J71323J85788J96042K06858
55990F056048K23353K40412K52632K65267K84153L04374L20634L38771L64999
55981H650643L94078M20586M50806M90486N32785N72070O16992O75308P39618
55972A3543372Q03835Q78903R75004J084276J199975J335628J504692J700043
55964B3025728J916716K175235K497682K883044L334944L890308M590004N448762
55956D9762423O489329P773656R358612J1259961J3510749J6206297J9423926
55949A33784953K3148385K7320629L1762324L5739194L7611935L5376619K8028352
55942C52772391J6520046L304889r069139j8990250k5849401k9660590l0831063
$$ plain form
55935 258196883 228145594 200071513 174592651 151962220 132188671 115111636 100489869
55928 100489869 88057573 77527091 68597508 60996623 54504878 48936987 44128111 39948323
55920 39948323 36306369 33125216 30328082 27852562 25657614 23706745 21959165 20383284
55912 20383284 18962588 17680582 16513545 15443654 14464949 13569745 12741861 11969192 11250856
55903 11250856 10585875 9966005 9385318 8845974 8348618 7886657 7455084 7055543 6687726
55894 6687726 6344773 6021928 5721204 5442849 5180556 4929702 4692529 4470811 4260997
55885 4260997 4060965 3874445 3704461 3548907 3406173 3278181 3164088 3057593 2954382
55876 2954382 2856147 2763956 2674177 2584573 2498034 2416226 2335394 2252302 2168962 2087851 2007812
$$ packed form
55935B58196883l0051289k8074081k5478862k2630431j9773549j7077035j4621767
55928A00489869j2432296j0530482q929583p600885o491745n567891m808876m179788
55920C9948323l641954l181153k797134k475520k194948j950869j747580j575881
55912B0383284j420696j282006j167037j069891r78705q95204q27884p72669p18336
55903A1250856o64981o19870n80687n39344m97356m61961m31573l99541l67817
55894F687726l42953l22845l00724k78355k62293k50854k37173k21718k09814
55885D260997k00032j86520j69984j55554j42734j27992j14093j06495j03211
55876B954382r8235r2191q9779q9604q6539q1808q0832q3092q3340q1111q0039
$$ plain form
55865 2007812 1928282 1852415 1782393 1716427 1653630 1596934 1547895 1503357 1460562 1420911 1385512
55854 1385512 1351667 1317182 1283741 1252652 1221487 1188277 1155090 1124221 1094607 1065020 1036940
55843 1036940 1011292 986059 960154 936017 915434 896380 876892 858477 842666 827652 811434
55832 811434 795118 780136 765313 749512 734222 720796 708028 695054 683560 674477 665516 654731
55820 654731 643637 634100 625016 614839 604622 595733 587182 577913 569302 562673 556763 550176 544001
55807 544001 539459 535418 530769 526896 525254 524825 524561 526024 530878 537771 544300 550119 555665 559826 561508
55792 561508 561758 561896 561145 558305 554072 549531 544159 537504 531128 526573 522843 517893 511093 502481 491426
55777 491426 478004 464069 451062 438393 425543 413897 404731 397424 391413 387687 386400 385230 382393
$$ packed form
55865B007812p9530p5867p0022o5966o2797n6696m9039m4538m2795l9651l5399
55854A385512l3845l4485l3441l1089l1165l3210l3187l0869k9614k9587k8080
55843A036940k5648k5233k5905k4137k0583j9054j9488j8415j5811j5014j6218
55832H11434j6316j4982j4823j5801j5290j3426j2768j2974j1494r083q961j0785
55820F54731j1094r537r084j0177j0217q889q551r269q611o629n910o587o175
55807E44001m542m041m649l873j642m29k64J463M854O893O529N819N546M161J682
55792E61508K50J38p51k840m233m541n372o655o376m555l730m950o800q612j1055
55777D91426j3422j3935j3007j2669j2850j1646r166p307o011l726j287j170k837
$$ plain form
55764 382393 379237 377621 376832 375468 374283 374513 375184 374739 373727 373284 372548 370236 367307 365272 363126 358758
55748 358758 352404 346046 340206 333939 327317 321400 316192 310811 305306 300354 295692 290632 285601 281513
55734 281513 278287 275507 273665 273104 272648 270992 268613 266690 265060 262838 260113 257314 253856 249131 243998
55719 243998 239659 235894 231955 228253 225629 223895 222572 221994 222232 222193 221389 221308 223222 225991 227945 229611
55703 229611 232405 235820 238220 239492 240589 241180 240065 237357 234091 230177 224902 219046 214389 211386
55689 211386 209147 207372 206411 205852 205029 204700 206293 209612 212987 215600 218066 220833 223644 226466 229468
55674 229468 232163 233856 234783 235591 236058 235572 234443 233462 232647 231678 231016 231172 231436 230831 229866 229853 230894 231974
55656 231974 232721 233636 234925 236380 238114 240279 242449 244272 246035 247591 247728 245899 243505 241902 240245
$$ packed form
55764C82393l156j616p89j364j185K30O71m45j012m43p36k312k929k035k146m368
55748C58758o354o358n840o267o622n917n208n381n505m952m662n060n031m088
55734B81513l226k780j842n61m56j656k379j923j630k222k725k799l458m725n133
55719B43998m339l765l939l702k624j734j323n78K38l9q04q1J914K769J954J666
55703B29611K794L415K400J272J097N91j115k708l266l914n275n856m657l003
55689B11386k239j775r61n59q23l29J593L319L375K613K466K767K811K822L002
55674B29468K695J693R27Q08M67m86j129r81q15r69o62J56K64o05r65j3J041J080
55656B31974P47R15J289J455J734K165K170J823J763J556J37j829k394j603j657
$$ plain form
55641 240245 237133 233332 230685 228998 226283 221784 216625 211561 206144 200228 194491 189306 184585 180744
55627 180744 178358 176952 175505 173923 172643 171187 168804 166216 164967 165182 165608 165692 165860 165919 165098 163746
55611 163746 163084 162981 161752 158623 154867 151992 150130 148662 147258 145857 144573 143854 143875 143785 142488 140068
55595 140068 137506 135287 133332 131915 131346 131031 130174 129156 128932 129420 129883 130507 132010 133949 135129 135583
55579 135583 136497 138227 140070 141940 144517 147626 150295 152644 156009 160813 165994 170906 176084 181565
55565 181565 186040 188439 189113 188856 187889 186224 183835 180121 174429 167420 160608 154222 146966 138366 129836
55550 129836 122756 116950 111869 107985 105927 105211 104885 104735 105078 105906 106960 108116 109197 109875 110196 110684
55534 110684 111627 112793 114033 115523 117156 118386 118951 119197 119428 119449 118946 117833 116197 114336 112788 111796
$$ packed form
55641B40245l112l801k647j687k715m499n159n064n417n916n737n185m721l841
55627A80744k386j406j447j582j280j456k383k588j249K15M26Q4J68N9q21j352
55611A63746o62j03j229l129l756k875j862j468j404j401j284p19K1r0j297k420
55595A40068k562k219j955j417n69l15q57j018k24M88M63O24J503J939J180M54
55579A35583R14J730J843J870K577L109K669K349L365M804N181M912N178N481
55565A81565M475K399O74k57r67j665k389l714n692p009o812o386p256q600q530
55550A29836p080n806n081l884k058p16l26j50L43Q28J054J156J081O78L21M88
55534A10684R43J166J240J490J633J230N65K46K31K1n03j113j636j861j548r92
$$ plain form
55518 111796 110924 109769 108744 108465 108616 108286 107138 105394 103004 99887 96810 94911 94361 94385 94472 94653 94867
55501 94867 95075 95789 97347 98891 99202 98335 97294 96341 94969 93333 92238 91680 90791 89303 87791 86447
55485 86447 84887 83190 81824 80489 78401 75729 73473 71973 70893 70549 71617 73531 74920 75785 77470
55470 77470 80224 82626 83877 84895 86479 88084 89089 89686 89802 88703 86525 84710 84075 83787 83081 82570
55454 82570 82873 83325 83167 82907 83401 84398 85006 84853 84071 82904 81912 81709 82017 81875 81154 80761 81010 81122 80879
55435 80879 81322 82994 84857 85882 86466 87285 87955 87881 87409 87086 86723 86183 86109 86831 87473 87167 86371 85979 85915
55416 85915 85593 85022 84520 84028 83595 83837 85012 86349 87111 87619 88378 88967 88702 87740 86647 85539 84451
55399 84451 83898 84198 84845 85260 85535 85758 85416 84284 83137 82766 82915 82971 82969 83175 83393 83480 83797 84429 84694 84201
$$ packed form
55518A11796q72j155j025k79J51l30j148j744k390l117l077j899n50K4Q7J81K14
55501I4867K08P14J558J544L11q67j041r53j372j636j095n58q89j488j512j344
55485H6447j560j697j366j335k088k672k256j500j080l44J068J914J389Q65J685
55470G7470K754K402J251J018J584J605J005N97J16j099k178j815o35k88p06n11
55454H2570L03M52j58k60M94R97O08j53p82j167r92k03L08j42p21l93K49J12k43
55435H0879M43J672J863J025N84Q19O70p4m72l23l63n40p4P22O42l06p96l92o4
55416H5915l22n71n02m92m33K42J175J337P62N08P59N89k65r62j093j108j088
55399H4451n53L00O47M15K75K23l42j132j147l71J49N6kK06K18Q7L17O32K65m93
$$ plain form
55379 84201 83565 83323 83062 82436 82084 82577 83376 83875 84541 85856 86944 86583 84981 83355 82288 81670 81676 82543
55361 82543 83702 84221 83849 82803 81110 79119 78000 78538 79844 80368 79811 78990 78330 77721 77456 78033 79121
55344 79121 79834 79971 80068 80355 80585 80740 81044 81430 81737 82201 83055 83904 84235 84174 84083 83862 83413 83225 83669 84256
55324 84256 84520 85047 86515 88253 88937 88363 87455 86843 86555 86793 87786 89081 90062 90964 92280 93460 93430 92212
55306 92212 90752 89285 87213 84711 83103 83341 85069 87388 89578 90970 91218 90949 91189 91843 91698 90252
55290 90252 88637 88251 89199 90556 91587 92289 93103 94380 95887 96824 96688 96027 95861 96464 97248 97728 97959
55273 97959 98057 97916 97507 96954 96284 95545 95107 95428 96540 98085 99668 100847 101159 100672 100149 100143 100291 100105 99933
55254 99933 100348 100995 100981 100198 99377 98937 98610 98153 97691 97410 97518 98284 99543 100386 100092 99019 97944 96940
$$ packed form
55379H4201o36k42k61o26l52M93P99M99O66J315J088l61j602j626j067o18OQ67
55361H2543J159N19l72j046j693j991j119N38J306N24n57q21o60o09k65N77J088
55344G9121P13J37R7K87K30J55L04L86L07M64Q54Q49L31o1r1k21m49j88M44N87
55324H4256K64N27J468J738O84n74r08o12k88K38R93J295R81R02J316J180l0j218
55306I2212j460j467k072k502j608K38J728K319K190J392K48k69K40O54j45j446
55290I0252j615l86R48J357J031P02Q14J277J507R37j36o61j66O03P84M80K31
55273I7959R8j41m09n53o70p39m38L21J112J545J583J179L12m87n23oJ48j86j72
55254I9933M15O47j4p83q21m40l27m57m62k81J08P66J259Q43k94j073j075j004
$$ plain form
55236 96940 95792 94981 95117 95675 95497 94451 93470 92995 92579 92056 91925 92283 92429 91884 90957 90098 89478 89334
55218 89334 89864 90584 90642 90037 89748 90429 91726 93071 94368 95632 96639 97235 97425 97061 96049 94952 94681
55201 94681 95404 96388 96987 97173 97067 96745 96626 97290 98724 100315 101637 102642 103128 102848 102137 101640 101304 100469
55183 100469 99053 97808 97254 97132 97032 96811 96316 95515 94945 95175 95779 95779 95170 94922 95354 95721 95722 96068 97063
55164 97063 97831 97763 97604 98230 99234 99789 100125 101057 102479 103392 103311 102808 102704 103291 104303 105167 105320 104637 103520
55145 103520 102447 101574 100895 100435 100113 99751 99371 99192 99206 99131 98934 99002 99675 100936 102589 104306 105490 105603
55127 105603 104744 103482 102181 101023 100515 101095 102167 102451 101591 100632 100593 101302 102037 102518 102781 102671 102060 101184
55109 101184 100432 100112 100482 101461 102299 102297 101948 102419 103663 104175 103170 101902 101983 103291 104554 105264 105904 106701
$$ packed form
55236I6940j148q11J36N58j78j046r81m75m16n23j31L58J46n45r27q59o20j44
55218H9334N30P20N8o05k89O81J297J345J297J264J007N96J90l64j012j097k71
55201I4681P23R84N99J86j06l22j19O64J434J591J322J005M86k80p11m97l36q35
55183A00469j416j245n54j22j00k21m95q01n70K30O04%o09k48M32L67JL46R95
55164I7063P68o8j59O26J004N55L36R32J422R13q1n03j04N87J012Q64J53o83j117
55145A03520j073q73o79m60l22l62l80j79J4p5j97O8O73J261J653J717J184J13
55127A05603q59j262j301j158n08N80J072K84q60r59l9P09P35M81K63j10o11q76
55109A01184p52l20L70R79Q38kl49M71J244N12j005j268Q1J308J263P10O40P97
$$ plain form
55091 106701 107323 107696 108208 109030 109908 110643 111259 111748 112085 112451 113014 113666 114358 115476 117385 119717 121591
55074 121591 122489 122486 121773 120424 118710 117219 116413 116181 115944 115218 114149 113466 113816 115211 117176 119205 120782
55057 120782 121285 120407 118585 116466 114111 111383 108974 108037 108658 109569 109731 109368 109032 108580 107721 106841 106457
55040 106457 106387 106224 106176 106648 107295 107307 106534 105667 105332 105521 105890 106156 106208 106125 106044 105836 105129 103887 102741 102373
55020 102373 102803 103538 104182 104605 104759 104750 104938 105723 107251 109413 111820 113689 114195 113278 111774 110494 109550
55003 109550 108836 108686 109490 110943 112191 112735 112809 112902 113146 113229 112849 112252 112165 112943 113963 114348 114165 114296 115102
54984 115102 115933 116126 115730 114978 113816 112427 111578 111857 113059 114702 116607 118470 119572 119628 119466 120088 121376
54967 121376 122406 122781 122945 123365 124025 124689 125186 125504 125960 127009 128485 129361 128797 127214 125802 125199 125152
$$ packed form
55091A06701O22L73N12Q22Q78P35O16M89L37L66N63O52O92J118J909K332J874
55074A21591Q98lp13j349j714j491q06k32k37p26j069o83L50J395J965K029J577
55057A20782N03q78j822k119k355k728k409r37O21R11J62l63l36m52q59q80l84
55040A06457p0j63m8M72O47J2p73q67l35J89L69K66N2q3q1k08p07j242j146l68
55020A02373M30P35O44M23J54rJ88P85J528K162K407J869N06r17j504j280r44
55003A09550p14j50Q04J453J248N44P4R3K44Q3l80n97q7P78J020L85j83J31Q06
54984A15102Q31J93l96p52j162j389q49K79J202J643J905J863J102N6j62O22J288
54967A21376J030L75J64M20O60O64M97L18M56J049J476Q76n64j583j412o03m7
$$ plain form
54950 125152 125278 125485 125642 125430 124703 123733 123033 123019 123681 124420 124485 123867 123440 123916 124949 125690 125917 126155 126806
54931 126806 127611 127944 127393 126175 125178 125338 126731 128556 130177 131764 133740 136174 139215 143526 149583
54916 149583 156834 164202 171217 178000 184342 189443 192556 193374 191855 188270 183473 178604 174319 170499
54902 170499 166666 162444 157695 152587 147579 143189 139735 137261 135550 134176 132939 132260 132713 134022 135095
54887 135095 135270 134922 134504 133787 132625 131780 132117 133462 135108 137130 140248 144516 149052 153177 157107 161412
54871 161412 166422 172244 178731 185138 190235 193015 193192 191067 187245 182415 177094 171517 165901 160675
54857 160675 156187 152352 148864 145583 142496 139529 136724 134355 132562 131044 129417 127663 126024 124816
54843 124816 124478 125272 126530 126782 125251 122794 120847 119828 119251 118940 119248 120229 121405 122370 123056 123434 123455
$$ packed form
54950A25152J26K07J57k12p27r70p00j4O62P39O5o18m27M76J033P41K27K38O51
54931A26806Q05L33n51j218r97J60J393J825J621J587J976K434L041M311O057
54916A49583P251P368P015O783O342N101L113Q18j519l585m797m869m285l820
54902A70499l833m222m749n108n008m390l454k474j711j374j237o79M53J309J073
54887A35095J75l48m18p17j162q45L37J345J646K022L118M268M536M125L930M305
54871A61412N010N822O487O407N097K780J77k125l822m830n321n577n616n226
54857A60675m488l835l488l281l087k967k805k369j793j518j627j754j639j208
54843A24816l38P94J258K52j531k457j947j019n77l11L08R81J176R65O86L78K1
$$ plain form
54826 123455 123225 122851 122235 121409 120738 120386 119959 119256 118874 119360 120107 120000 118937 117860 117439 117604 118241 119368
54808 119368 120530 120960 120618 120357 120836 121861 122954 123935 124726 125129 125038 124553 123838 123202 123199 124113 125412 126283
54790 126283 126577 126677 126643 126222 125630 125425 125611 125689 125722 126459 128133 129949 131137 131807 132420 133060 133675 134505 135766
54771 135766 137321 139017 141041 143655 146909 150836 155564 160970 166511 171691 176521 181426 186834 192764
54757 192764 198505 202832 204954 205173 204151 201797 197553 191724 185651 180359 175708 171127 166498 162006
54743 162006 157723 153788 150537 148096 146190 144618 143522 142938 142544 142099 141754 141642 141577 141424 141421 141840 142626
54726 142626 143605 144792 146286 148117 150386 153301 156989 161489 166887 173068 179332 184743 188964 192336
54712 192336 195070 196899 197592 197192 195522 192111 187062 181517 176758 173045 169671 165913 161603 157020 152625
$$ packed form
54826A23455k30l74o16q26o71l52m27p03l82M86P47j07j063j077m21J65O37J127
54808A19368J162M30l42k61M79J025J093R81P91M03r1m85p15o36lR14J299Q71
54790A26283K94J00l4m21n92k05J86P8L3P37J674J816J188O70O13O40O15Q30J261
54771A35766J555J696K024K614L254L927M728N406N541N180M830M905N408N930
54757A92764N741M327K122K19j022k354m244n829o073n292m651m581m629m492
54743A62006m283l935l251k441j906j572j096n84l94m45l45j12o5j53lM19P86
54726A42626R79J187J494J831K269K915L688M500N398O181O264N411M221L372
54712A92336K734J829O93m00j670l411n049n545m759l713l374l758m310m583m395
$$ plain form
54697 152625 148881 146101 144361 143463 142859 141830 140081 138067 136377 134933 133243 131335 129870 129247 129158
54682 129158 129150 129137 129210 129384 129675 130024 130056 129401 128360 127779 128097 128931 129675 130027 129832 128999 127803 126859 126513 126553
54662 126553 126577 126298 125574 124619 124185 124893 126378 127665 128407 129039 129754 130176 130220 130347 130660 130650 130200 129988 130403
54643 130403 130934 131153 131435 132040 132295 131596 130568 130265 130672 130959 130948 131316 132403 133653 134387 134531 134449 134461 134600
54624 134600 134569 133932 132574 130879 129278 127880 126739 126125 126164 126487 126664 126763 127078 127505 127619 127253 126678 126323
54606 126323 126570 127599 129145 130603 131633 132495 133517 134456 134719 134092 132985 132084 131883 132365 132969 133125 132888
54589 132888 132755 132835 132720 132346 132374 133291 134614 135399 135210 134248 132953 131927 131800 132602 133496 133653 133182 132767
54571 132767 132621 132348 131700 130956 130590 130907 131976 133561 135144 136202 136441 135783 134406 132949 132235 132473 133023
$$ packed form
54697A52625l744k780j740q98o04j029j749k014j690j444j690j908j465o23q9
54682A29158qj3P3J74K91L49L2o55j041n81L18Q34P44L52j95q33j196r44l46M0
54662A26553K4k79p24r55m34P08J485J287P42O32P15M22M4J27L13j0m50k12M15
54643A30403N31K19K82O05K55o99j028l03M07K87j1L68J087J250P34J44q2J2J39
54624A34600l1o37j358j695j601j398j141o14L9L23J77R9L15M27J14l66n75l55
54606A26323K47J029J546J458J030Q62J022R39K63o27j107r01k01M82O04J56k37
54589A32888j33Q0j15l74K8R17J323P85j89r62j295j026j27Q02Q94J57m71m15
54571A32767j46k73o48p44l66L17J069J585J583J058K39o58j377j457p14K38N50
$$ plain form
54554 133023 133242 133286 133762 134858 136135 137002 137210 137069 137325 138512 140272 141707 142448 142917 143433 143757 143783 143949
54536 143949 144525 145202 145956 147585 150644 154359 157361 159076 159688 159203 157544 155324 153572 152623 151976 151149
54520 151149 150088 148824 147430 146302 145825 145765 145535 145095 144966 145315 145615 145369 144718 144132 143815 143577 143128 142514
54502 142514 142306 143089 144593 145716 145759 145231 144985 145012 144766 144321 144361 145132 146208 147267 148366 149391 149976 150160
54484 150160 150508 151330 152245 152718 152595 151931 150753 149209 147667 146387 145351 144462 143681 142959 142349 142224 143044
54467 143044 144791 146884 148759 150341 151900 153622 155344 156547 156708 155868 154825 154523 155239 156419 157249
54452 157249 157248 156534 155723 155424 155667 155926 155787 155342 154876 154551 154496 154751 154895 154283 152957 151775 151269 150964 150331
54433 150331 149735 149712 149843 149245 147886 146598 146023 146302 147481 149309 150772 150751 149284 147507 146419 146311 147188
$$ packed form
54554A33023K19M4M76J096J277Q67K08j41K56J187J760J435P41M69N16L24K6J66
54536A43949N76O77P54J629L059L715L002J715O12m85j659k220j752r49o47q27
54520A51149j061j264j394j128m77o0k30m40j29L49L00k46o51n86l17k38m49o14
54502A42514k08P83J504J123M3n28k46K7k46m45M0P71J076J059J099J025N85J84
54484A50160L48Q22R15M73j23o64j178j544j542j280j036q89p81p22o10j25Q20
54467A43044J747K093J875J582J559J722J722J203J61q40j043l02P16J180Q30
54452A57249jp14q11k99K43K59j39m45m66l25n5K55J44o12j326j182n06l05o33
54433A50331n96k3J31n98j359j288n75K79J179J828J463k1j467j777j088j08Q77
$$ plain form
54416 147188 148830 150492 151511 152322 153995 156534 158506 158672 157270 155369 153706 152580 152252 152816 153924
54401 153924 155064 156027 156953 158079 159432 160636 161185 161213 161677 163257 165336 166705 167040 166951 166815 166519 166272
54384 166272 166577 167232 167399 166966 166804 167212 167164 165809 163855 162600 162223 161903 161199 160404 159787 159322 159121 159480
54366 159480 160405 161625 163073 164886 166878 168417 169035 168973 168965 169538 170597 171731 172864 174371 176345 178026
54350 178026 178453 177647 176651 176341 176754 177726 179543 182459 186015 189408 192379 195223 197995 200230 201566 202226
54334 202226 202542 202182 200324 196784 192656 189438 187604 186363 184779 182595 179921 176822 173595 170855 168863
54319 168863 167248 165853 165215 165495 165627 164571 162986 162529 163634 165165 166172 166757 167034 166562 165343 164324
54303 164324 164245 164722 164949 164590 163565 161837 159987 159173 159780 160749 160899 160315 159752 159312 158641 157940 157787 158145
$$ packed form
54416A47188J642J662J019Q11J673K539J972J66j402j901j663j126l28N64J108
54401A53924J140R63R26J126J353J204N49K8M64J580K079J369L35q9j36k96k47
54384A66272L05O55J67m33j62M08m8j355j954j255l77l20p04p95o17m65k01L59
54366A59480R25J220J448J813J992J539O18o2qN73J059J134J133J507J974J681
54350A78026M27q06r96l10M13R72J817K916L556L393K971K844K772K235J336O60
54334B02226L16l60j858l540m128l218j834j241j584k184k674l099l227k740j992
54319A68863j615j395o38K80J32j056j585m57J105J531J007N85K77m72j219j019
54303A64324p9M77K27l59j025j728j850q14O07R69J50n84n63m40o71p01j53L58
$$ plain form
54285 158145 158433 158500 158763 159345 159754 159599 159117 158850 159159 160177 161859 163892 165717 166808 166943 166266 165127
54268 165127 163861 162684 161827 161603 162067 162772 163260 163749 164858 166569 167919 167954 166670 164930 163791 163922
54252 163922 165212 166790 167811 168343 169092 170273 171289 171557 171069 170061 168796 167825 167699 168105 168000 166954
54236 166954 165702 165053 164941 164921 164844 164583 163860 162883 162444 162777 163068 162689 162137 162057 162117 161811 161572 162024 162720 162874
54216 162874 162874 163718 165161 165810 165123 163955 162959 161717 159999 158732 158940 160400 162047 163272 164220 165178 166230
54199 166230 167325 168301 168936 169190 169242 169165 168794 168046 167124 166210 165239 164136 163109 162489 162347 162431 162421 162213 162031
54180 162031 162271 163128 164314 165210 165300 164545 163451 162735 162700 162897 162681 162129 161998 162606 163208 162974 162131 161597 161646
54161 161646 161618 160955 159934 159173 158874 158830 158916 159158 159358 158985 157645 155705 154194 153899 154620 155576 156365 157154
$$ packed form
54285A58145K88O7K63N82M09j55m82k67L09J018J682K033J825J091J35o77j139
54268A65127j266j177q57k24M64P05M88M89J109J711J350L5j284j740j139J31
54252A63922J290J578J021N32P49J181J016K68m88j008j265r71j26M06j05j046
54236A66954j252o49j12k0p7k61p23r77m39L33K91l79n52q0O0l06k39M52O96J54
54216A62874%Q44J443O49o87j168r96j242j718j267K08J460J647J225R48R58J052
54199A66230J095R76O35K54N2p7l71p48r22r14r71j103j027o20j42Q4j0k08j82
54180A62031K40Q57J186Q96R0p55j094p16l5J97k16n52j31O08O02k34q43n34M9
54161A61646k8o63j021p61k99m4Q6K42K00l73j340j940j511k95P21R56P89P89
$$ plain form
54143 157154 157957 158387 158329 158338 158974 160090 161156 161933 162467 162710 162607 162331 162050 161727 161452 161688 162686 163861 164301
54124 164301 163847 163280 163402 164226 165061 165221 164734 164397 164989 166414 167924 169168 170499 172173 174009 176088
54108 176088 178897 182169 184387 184325 182569 180667 179186 177568 175490 173275 171084 168755 166579 165332 165290
54093 165290 165906 166615 167389 168397 169689 171282 173034 174433 175045 175144 175339 175718 176039 176591 177953 179903 181463
54076 181463 182221 182717 183339 183717 183571 183350 183511 183896 184273 184893 186015 187395 188676 189840 190931 191886 193046
54059 193046 195178 198378 201543 203660 205254 207720 211480 215632 219498 223748 229651 237639 246994 256650
54045 256650 265905 274310 281297 286340 289458 291139 291634 290725 288597 286543 286137 287767 290585 293810 297386
54030 297386 301257 304851 307727 310143 312521 314750 316511 317896 319191 320260 320650 320272 319635 319393 319806
$$ packed form
54143A57154Q03M30n8RO36J116J066P77N34K43j03k76k81l23k75K36R98J175M40
54124A64301m54n67J22Q24Q35J60m87l37N92J425J510J244J331J674J836K079
54108A76088K809L272K218o2j756j902j481j618k078k215k191k329k176j247m2
54093A65290O16P09P74J008J292J593J752J399O12R9J95L79L21N52J362J950J560
54076A81463P58M96O22L78j46k21J61L85L77O20J122J380J281J164J091R55J160
54059A93046K132L200L165K117J594K466L760M152L866M250N903P988R355R656
54045B56650R255Q405O987N043L118J681M95r09k128k054m06J630K818L225L576
54030B97386L871L594K876K416K378K229J761J385J295J069L90l78o37k42M13
$$ plain form
54015 319806 320574 320995 320459 318901 316706 314098 310835 306554 301166 294847 287969 281236 275520 271249 268066
54000 268066 265252 262298 258975 255186 251044 246984 243551 241030 239247 237547 235150 231904 228707 226741
53986 226741 226147 225934 225252 224229 223286 222277 220829 219081 217481 216097 214689 213304 212226 211419 210542 209556
53970 209556 208881 208853 209382 210252 211386 212629 213523 213557 212644 211264 210191 210071 211082 212878 214907 216891 218982
53953 218982 221396 223922 225978 227287 228395 230238 233214 236998 241306 246391 252471 259108 265683 272266
53939 272266 279413 287238 295262 303187 311117 318853 325656 331055 335380 339070 341875 343217 343117 342331 341726
53924 341726 341803 342668 344164 346121 348668 352118 356446 361163 365992 371378 377941 385596 393625 401566 409656
53909 409656 418284 427208 435519 442334 447521 451720 455647 459514 463260 467169 471890 477863 485125 493821
$$ packed form
54015C19806P68M21n36j558k195k608l263m281n388o319o878o733n716m271l183
54000B68066k814k954l323l789m142m060l433k521j783j700k397l246l197j966
53986B26741n94k13o82j023r43j009j448j748j600j384j408j385j078q07q77r86
53970B09556o75k8N29Q70J134J243Q94L4r13j380j073j20J011J796K029J984K091
53953B18982K414K526K056J309J108J843K976L784M308N085O080O637O575O583
53939B72266P147P825Q024P925P930P736O803N399M325L690K805J342j00p86o05
53924C41726P7Q65J496J957K547L450M328M717M829N386O563P655Q029P941Q090
53909D09656Q628Q924Q311O815N187M199L927L867L746L909M721N973P262Q696
$$ plain form
53895 493821 504448 517168 530870 543091 550856 551843 545257 531972 513832 492707 470195 447759
53883 447759 426522 406840 388580 371919 357411 345200 334851 326153 319380 314322 309727 304405
53871 304405 298433 292689 287596 283006 278886 275220 271426 266797 261664 257332 254618 253036 251619 249886
53857 249886 247767 245212 242364 239728 237631 235773 233743 231752 230368 229593 228725 227256 225525 224267 223772
53842 223772 223736 223771 223720 223500 222986 222281 221870 222250 223385 224731 225805 226573 227284 228036 228566 228437 227438 225925
53824 225925 224660 224232 224699 225869 227635 229776 231687 232826 233420 234255 235700 237357 238794 240150 241764
53809 241764 243636 245603 247809 250620 254198 258399 262973 267715 272510 277364 282250 286893 290994 294775
53795 294775 298949 303911 309182 313907 317697 320784 323609 326494 329560 332678 335538 337867 339470 340074
$$ packed form
53895D93821J0627J2720J3702J2221P765R87o586j3285j8140k1125k2512k2436
53883D47759k1237j9682j8260j6661j4508j2211j0349q698o773n058m595n322
53871C04405n972n744n093m590m120l666l794m629n133m332k714j582j417j733
53857B49886k119k555k848k636k097j858k030j991j384p75q68j469j731j258m95
53842B23772l6L5n1k20n14p05m11L80J135J346J074P68P11P52N30j29r99j513
53824B25925j265m28M67J170J766K141J911J139N94Q35J445J657J437J356J614
53809B41764J872J967K206K811L578M201M574M742M795M854M886M643M101L781
53795B94775M174M962N271M725L790L087K825K885L066L118K860K329J603O04
$$ plain form
53781 340074 339440 337701 335215 331983 327604 322009 315831 309740 303867 298167 292919 288355 284140 279771
53767 279771 275282 271057 267066 262885 258440 254305 251113 248922 247207 245340 243156 241116 239746 238843
53753 238843 237648 235905 234238 233152 232253 231017 229768 229104 228752 227931 226722 226073 226364 226851 226845 226659 226951
53736 226951 227681 228229 228173 227591 226857 226414 226470 226680 226394 225484 224623 224508 225091 225919 226996 228860 231797 235267
53718 235267 238251 240110 241088 241962 243155 244322 244963 245341 246438 248916 252372 255728 258164 259615 260695
53703 260695 262291 264947 268347 271523 273783 275396 277192 279612 282393 285144 287949 291226 295118 299190
53689 299190 302832 305812 308255 310106 310895 310239 308422 306217 304189 302377 300649 299071 297858 297102 296705
53674 296705 296441 296029 295256 294126 292888 291846 291126 290614 290110 289588 289280 289413 289835 290082 289850 289199 288171
$$ packed form
53781C40074o34j739k486l232m379n595o178o091n873n700n248m564m215m369
53767B79771m489m225l991m181m445m135l192k191j715j867k184k040j370r03
53753B38843j195j743j667j086q99j236j249o64l52q21j209o49K91M87oj86K92
53736B26951P30N48n6n82p34m43N6K10k86r10q61j15N83Q28J077J864K937L470
53718B35267K984J859R78Q74J193J167O41L78J097K478L456L356K436J451J080
53703B60695J596K656L400L176K260J613J796K420K781K751K805L277L892M072
53689B99190L642K980K443J851P89o56j817k205k028j812j728j578j213p56l97
53674B96705k64m12p73j130j238j042p20n12n04n22l08J33M22K47k32o51j028
$$ plain form
53657 288171 286477 283956 281269 279722 280143 282034 283932 284645 284144 283336 283051 283330 283672 283813 284016 284733 286276
53640 286276 288746 291855 294700 296244 296350 296073 296646 298475 301295 304762 308366 311242 312895 314013 315876
53625 315876 318886 322256 325124 327338 328985 329917 330222 330737 332521 335876 340177 344597 348771 352827 356978
53610 356978 361177 365182 368927 372707 376861 381364 385912 390301 394478 398318 401682 404621 407272 409587
53596 409587 411442 412963 414399 415738 416844 417978 419672 421918 423864 424546 423793 422380 421503 422038 423828
53581 423828 425614 426062 424990 423200 421078 418019 413537 408274 403356 399089 394966 390744 386866 383770
53567 383770 381303 379043 376893 375126 373979 373350 372888 372354 371863 371729 372096 372819 373663 374441 374991 375354 376008
53550 376008 377549 379956 382522 384731 386857 389400 392355 395489 398999 403192 407694 411707 415165 418924
$$ packed form
53657B88171j694k521k687j547M21J891J898P13n01q08k85K79L42J41K03P17J543
53640B86276K470L109K845J544J06k77N73J829K820L467L604K876J653J118J863
53625C15876L010L370K868K214J647R32L05N15J784L355M301M420M174M056M151
53610C56978M199M005L745L780M154M503M548M389M177L840L364K939K651K315
53596D09587J855J521J436J339J106J134J694K246J946O82p53j413q77N35J790
53581D23828J786M48j072j790k122l059m482n263m918m267m123m222l878l096
53567C83770k467k260k150j767j147o29m62n34m91j34L67P23Q44P78N50L63O54
53550C76008J541K407K566K209K126K543K955L134L510M193M502M013L458L759
$$ plain form
53536 418924 423636 429095 435050 441950 450175 458973 467087 474451 482455 492250 503382 514547 525256
53523 525256 536225 548299 561618 575914 591081 607135 623862 640864 658040 675811 694776
53512 694776 715136 736480 758146 779861 802023 825326 850084 875977 902394 928894 955237
53501 955237 981093 1005904 1029207 1051088 1072146 1092885 1113187 1132661 1151457 1170332 1189692
53490 1189692 1208949 1227231 1244506 1261609 1279306 1297826 1317122 1336942 1356606 1375359 1393164
53479 1393164 1410615 1427802 1443850 1457880 1469914 1480383 1489234 1496101 1500981 1504068 1505010 1502921 1497171
53466 1497171 1487930 1476035 1462647 1448864 1435196 1421417 1407073 1392041 1376414 1360186 1343304
53455 1343304 1325756 1307261 1287290 1265859 1243966 1222719 1202248 1182024 1161951 1142473 1123802
$$ packed form
53536D18924M712N459N955O900Q225Q798Q114P364Q004R795J1132J1165J0709
53523E25256J0969J2074J3319J4296J5167J6054J6727J7002J7176J7771J8965
53512F94776K0360K1344K1666K1715K2162K3303K4758K5893K6417K6500K6343
53501I55237K5856K4811K3303K1881K1058K0739K0302J9474J8796J8875J9360
53490A189692J9257J8282J7275J7103J7697J8520J9296J9820J9664J8753J7805
53479A393164J7451J7187J6048J4030J2034J0469Q851O867M880L087R42k089n750
53466A497171r241j1895j3388j3783j3668j3779j4344j5032j5627j6228j6882
53455A343304j7548j8495j9971k1431k1893k1247k0471k0224k0073j9478j8671
$$ plain form
53444 1123802 1105770 1088443 1072248 1057507 1044441 1033539 1025233 1019136 1014258 1010022 1006475 1003591
53432 1003591 1001124 999290 998743 999574 1001062 1002794 1005368 1009637 1015850 1023940 1033985 1045804 1058614 1071755
53418 1071755 1085519 1100769 1117981 1137090 1158058 1181071 1206201 1233184 1261560 1290941 1321360
53407 1321360 1353360 1387424 1423228 1459912 1497236 1535967 1576944 1620352 1666196 1714750 1765876
53396 1765876 1818453 1871262 1924186 1977907 2032730 2088399 2144825 2202059 2259481 2315836 2370347
53385 2370347 2423190 2474642 2524326 2571646 2616450 2658772 2698183 2733943 2765704 2793611 2817678
53374 2817678 2837453 2852511 2862946 2869054 2870645 2867007 2857558 2842108 2820395 2791873 2756442 2715156
53362 2715156 2669713 2621339 2570555 2517874 2464079 2409788 2355340 2301272 2248361 2197013 2147116
$$ packed form
53444A123802j8032j7327j6195j4741j3066j0902q306o097m878m236l547k884
53432A003591k467j834n47Q31J488J732K574M269O213Q090J0045J1819J2810J3141
53418A071755J3764J5250J7212J9109K0968K3013K5130K6983K8376K9381L0419
53407A321360L2000L4064L5804L6684L7324L8731M0977M3408M5844M8554N1126
53396A765876N2577N2809N2924N3721N4823N5669N6426N7234N7422N6355N4511
53385B370347N2843N1452M9684M7320M4804M2322L9411L5760L1761K7907K4067
53374B817678J9775J5058J0435O108J591l638r449j5450k1713k8522l5431m1286
53362B715156m5443m8374n0784n2681n3795n4291n4448n4068n2911n1348m9897
$$ plain form
53351 2147116 2098718 2052232 2007633 1964034 1920576 1877325 1834818 1793120 1751894 1711144 1671275
53340 1671275 1632522 1594847 1558356 1523412 1490378 1459572 1431368 1406008 1383344 1362933 1344208
53329 1344208 1326366 1308530 1290531 1273202 1257343 1242554 1227652 1212111 1196486 1181493 1167348
53318 1167348 1154119 1142106 1131627 1122893 1116240 1111970 1109695 1108312 1107042 1106220 1106756 1109087 1112985 1118200
53304 1118200 1124789 1132859 1142366 1153301 1165868 1180237 1196257 1213599 1232249 1252658 1275228 1299731
53292 1299731 1325438 1351805 1378741 1406183 1433763 1461112 1488130 1514556 1539507 1561924 1581502
53281 1581502 1598818 1614490 1628497 1640308 1649324 1655103 1657465 1656580 1652766 1646109 1636538 1624306 1610115
53268 1610115 1594545 1577570 1558876 1538500 1516795 1493909 1469680 1444188 1418038 1391785 1365242
$$ packed form
53351B147116m8398m6486m4599m3599m3458m3251m2507m1698m1226m0750l9869
53340A671275l8753l7675l6491l4944l3034l0806k8204k5360k2664k0411j8725
53329A344208j7842j7836j7999j7329j5859j4789j4902j5541j5625j4993j4145
53318A167348j3229j2013j0479q734o653m270k275j383j270q22N36K331L898N215
53304A118200O589Q070R507J0935J2567J4369J6020J7342J8650K0409K2570K4503
53292A299731K5707K6367K6936K7442K7580K7349K7018K6426K4951K2417J9578
53281A581502J7316J5672J4007J1811R016N779K362q85l814o657r571j2232j4191
53268A610115j5570j6975j8694k0376k1705k2886k4229k5492k6150k6253k6543
$$ plain form
53257 1365242 1337739 1309077 1279901 1251031 1222746 1194920 1167542 1140734 1114429 1088425 1062745
53246 1062745 1037583 1012892 988371 963859 939410 915036 890828 867340 845266 824507 804190
53235 804190 783983 764872 748089 733613 720307 707270 694477 682287 671005 660957 652261 644264
53223 644264 635667 625574 614177 602243 590193 577910 565143 551720 537525 522663 507767 493842
53211 493842 481585 470844 460899 451258 442097 433903 426897 420881 415513 410439 405223 399405 392754 385410
53197 385410 377768 370258 363109 356191 349238 342436 336501 331871 327996 323927 319509 315461 312312 309847
53183 309847 307703 305840 304198 302482 300621 298949 297630 296363 294988 293827 293089 292429 291558 290811 290541
53168 290541 290383 289627 288044 285896 283466 281070 279166 277909 276892 275835 275176 275382 275968 275850 274515 272374
$$ packed form
53257A365242k7503k8662k9176k8870k8285k7826k7378k6808k6305k6004k5680
53246A062745k5162k4691k4521k4512k4449k4374k4208k3488k2074k0759k0317
53235H04190k0207j9111j6783j4476j3306j3037j2793j2190j1282j0048q696p997
53223F44264q597j0093j1397j1934j2050j2283j2767j3423j4195j4862j4896j3925
53211D93842j2257j0741r945r641r161q194p006o016n368n074n216n818o651p344
53197C85410p642p510p149o918o953o802n935m630l875m069m418m048l149k465
53183C09847k144j863j642j716j861j672j319j267j375j161p38o60q71p47k70
53168B90541j58p56j583k148k430k396j904j257j017j057o59K06N86j18j335k141
$$ plain form
53152 272374 270245 268910 268763 269270 269163 267836 266094 264799 263463 261285 259040 258450 259696 261057 261317
53137 261317 261153 261620 262502 262975 262981 263040 263346 263861 264811 266342 267975 269015 269248 268835 267926 266837 266237 266593
53119 266593 267626 268718 269587 270265 270835 271589 272988 274895 276256 276182 275107 274232 274000 273768 272902 271455 269694
53102 269694 267614 265276 263222 262138 262197 262894 263462 263327 262330 260730 259076 257969 257702 257924 257804 256829 255471
53085 255471 254724 254886 255130 254469 252859 251138 250161 250273 251305 252658 253512 253397 252631 252000 251981 252435 252961 253324
53067 253324 253487 253464 253205 252658 251948 251468 251567 252093 252494 252540 252685 253454 254663 255608 255918 255856 255780 255668 255368 255015
53047 255015 254944 255266 255778 256327 257063 258110 259076 259146 257907 255927 254235 253243 252430 251169 249540 248148 247372
53030 247372 247098 247056 247103 247191 247388 248068 249735 252391 255170 256932 257307 256989 256940 257559 258729 260296 262106 263716
$$ packed form
53152B72374k129j335j47N07j07j327j742j295j336k178k245n90J246J361K60
53137B61317j64M67Q82M73ON9L06N15R50J531J633J040K33m13r09j089o00L56
53119B66593J033J092Q69O78N70P54J399J907J361p4j075q75k32k32q66j447j761
53102B69694k080k338k054j084N9O97N68j35r97j600j654j107k67K22j20r75j358
53085B55471p47J62K44o61j610j721r77J12J032J353Q54j15p66o31j9M54N26L63
53067B53324J63k3k59n47p10m80R9N26M01M6J45P69J209R45L10o2p6j12l00l53
53047B55015p1L22N12N49P36J047R66P0j239j980j692r92q13j261j629j392p76
53030B47372k74m2M7Q8J97O80J667K656K779J762L75l18m9O19J170J567J810J610
$$ plain form
53012 263716 264576 264580 264092 263422 262688 262259 262696 263930 264977 264923 263894 262640 261543 260518 259575 258892 258462 258149
52994 258149 258005 258063 258041 257773 257746 258571 260079 261596 262948 264435 265894 266765 267232 268350 270633 273240 275085
52977 275085 276104 276948 277982 279140 280375 281694 283021 284442 286216 288186 289531 289620 288832 288154 288187 288947
52961 288947 290261 291853 293253 294109 294473 294441 293762 292241 290333 288797 287850 287125 286413 285950 285935 286194 286461
52944 286461 286675 286826 286695 285934 284371 282231 280055 278322 277087 276054 274957 273678 272063 269981 267682
52929 267682 265712 264256 262874 261178 259438 258253 257901 258301 259258 260359 260919 260540 259592 258757 258229 257754
52913 257754 257269 257009 256998 257003 257013 257288 257779 257950 257436 256605 256144 256272 256629 256830 256823 256613 255933 254528 252777 251651
52893 251651 251791 252811 253800 254370 254859 255600 256526 257552 258822 260321 261634 262342 262358 261680 260260 258395 256853
$$ packed form
53012B63716Q60Mm88o70p34m29M37J234J047n4j029j254j097j025r43o83m30l13
52994B58149j44N8k2k68k7Q25J508J517J352J487J459Q71M67J118K283K607J845
52977B75085J019Q44J034J158J235J319J327J421J774J970J345Q9p88o78L3P60
52961B88947J314J592J400Q56L64l2o79j521j908j536r47p25p12m63j5K59K67
52944B86461K14J51j31p61j563k140k176j733j235j033j097j279j615k082k299
52929B67682j970j456j382j696j740j185l52M00R57J101N60l79r48q35n28m75
52913B57754m85k60j1NJ0K75M91J71n14q31m61J28L57K01pk10o80j405j751j126
52893B51651J40J020R89N70M89P41R26J026J270J499J313P08J6o78j420j865j542
$$ plain form
52876 256853 256179 256140 256173 256140 256293 256781 257574 258690 260169 261931 263876 265929 267827 269234 270312 271740 273748
52859 273748 275568 276336 276144 275678 275209 274656 274329 274714 275512 275640 274350 271768 268344 264407 260434 257039
52843 257039 254364 251901 249199 246373 243745 241394 239300 237530 235980 234263 232249 230487 229693 229951 230714
52828 230714 231612 232969 235357 238702 242001 244044 244438 243742 242634 241265 239625 238134 237309 236995 236481 235514
52812 235514 234722 234803 235687 236809 237983 239581 241836 244324 246305 247446 247988 248170 247768 246402 244180 241691
52796 241691 239444 237661 236581 236451 236971 237241 236637 235464 234448 233900 233711 233794 234070 234339 234620 235331 236599
52779 236599 237683 237744 237048 236729 237392 238594 239671 240418 240849 240982 241023 241257 241521 241301 240505 239634 239018 238428
52761 238428 237708 237168 236964 236646 235860 235117 235204 236030 236684 236696 236712 237630 239338 240645 240545 239395 238640 239269 240805
$$ packed form
52876B56853o74l9L3l3J53M88P93J116J479J762J945K053J898J407J078J428K008
52859B73748J820P68j92m66m69n53l27L85P98J28j290k582l424l937l973l395
52843B57039k675k463k702k826k628k351k094j770j550j717k014j762p94K58P63
52828B30714Q98J357K388L345L299K043L94o96j108j369j640j491q25l14n14r67
52812B35514p92Q1Q84J122J174J598K255K488J981J141N42J82m02j366k222k489
52796B41691k247j783j080j30N20K70o04j173j016n48j89Q3K76K69K81P11J268
52779B36599J084O1o96l19O63J202J077P47M31J33M1K34K64k20p96q71o16n90
52761B38428p20n40k04l18p86p43Q7Q26O54J2J6R18J708J307j00j150p55O29J536
$$ plain form
52742 240805 242006 242387 242620 243542 245283 247494 249886 252248 254358 256260 258397 261021 263664 265604 266779
52727 266779 267813 269067 270154 270606 270664 270961 271525 271602 270660 269183 268070 267479 266766 265553 264285 263500 263017
52710 263017 262221 260905 259376 257932 256620 255478 254669 254365 254646 255397 256193 256514 256301 255965 255635 254864 253522
52693 253522 252538 253030 254904 257017 258581 259653 260320 260339 259806 259423 259737 260598 261594 262500 263072 263043 262713 262933
52675 262933 263994 264958 264655 263081 261343 260384 260186 260135 259810 259373 259379 260157 261361 262291 262637 262629 262493 262176 261688
52656 261688 261196 260625 259718 258858 259239 261695 265677 269902 273652 276856 279207 279996 278953 276670 273997 271384
52640 271384 268927 266713 264914 263783 263633 264583 266201 267643 268359 268554 268836 269604 270955 273054 276175 280191
52624 280191 284255 287340 289112 289990 290320 289810 288060 285336 282461 280027 278100 276588 275507 274803 274312
$$ packed form
52742B40805J201L81K33R22J741K211K392K362K110J902K137K624K643J940J175
52727B66779J034J254J087M52N8K97N64P7r42j477j113n91p13j213j268p85m83
52710B63017p96j316j529j444j312j142q09l04K81P51P96L21k13l36l30p71j342
52693B53522r84M92J874K113J564J072O67J9n33l83L14Q61R96R06N72k9l30K20
52675B62933J061R64l03j574j738r59j98n1l25m37OP78J204R30L46qj36l17m88
52656B61688m92n71r07q60L81K456L982M225L750L204K351P89j043k283k673k613
52640B71384k457k214j799j131j50R50J618J442P16J95K82P68J351K099L121M016
52624B80191M064L085J772Q78L30n10j750k724k875k434j927j512j081p04m91
$$ plain form
52609 274312 274004 274040 274450 275009 275463 275692 275625 275249 274746 274375 274228 274365 275008 276157 277070 276804 275478 274468
52591 274468 274975 276793 278778 280143 280865 281195 281322 281460 281835 282461 283075 283350 283178 282883 283115 284275 285967
52574 285967 287308 287840 287814 287572 287153 286621 286225 285900 285125 283734 282433 281951 281943 281366 279808 277945 276641 276093
52556 276093 275936 275809 275668 275692 275966 276186 275805 274616 273050 271700 270715 269914 269331 269300 269993 271138 272250 272980
52538 272980 273254 273201 272984 272675 272351 272229 272456 272745 272528 271676 270826 270745 271539 272613 273226 272973 271988 270882 270277
52519 270277 270238 270341 270276 270041 269582 268878 268574 269766 272664 276129 279181 282363 286720 291892 296349 299377
52503 299377 301677 303802 305078 304629 302665 300103 297414 294513 291473 288759 286785 285658 285239 285147 284796
52488 284796 283840 282568 281562 280972 280418 279653 279003 278944 279454 280085 280645 281465 282830 284380 285459 286004 286686
$$ packed form
52609B74312l08L6M10N59M54K29o7l76n03l71j47J37O43J149R13k66j326j010
52591B74468N07J818J985J365P22L30J27J38L75O26O14K75j72k95K32J160J692
52574B85967J341N32k6k42m19n32l96l25p75j391j301m82qn77j558j863j304n48
52556B76093j57j27j41K4K74K20l81j189j566j350r85q01n83l1O93J145J112P30
52538B72980K74n3k17l09l24j22K27K89k17q52q50q1P94J074O13k53r85j106o05
52519B70277l9J03o5k35m59p04l04J192K898L465L052L182M357N172M457L028
52503B99377K300K125J276m49j964k562k689k901l040k714j974j127m19r2l51
52488B84796r56j272j006n90n54p65o50n9N10O31N60Q20J365J550J079N45O82
$$ plain form
52471 286686 288013 289631 290853 291646 292642 294148 295627 296403 296650 297336 299195 302028 305047 307698 309882
52456 309882 311464 311964 311033 309057 306946 305260 303734 301756 299089 296037 293102 290604 288522 286602 284715
52441 284715 283086 282048 281581 281352 281167 281078 280968 280411 279203 277778 276751 276215 275754 275021 274073 273186 272625
52424 272625 272606 273266 274519 275986 277203 278031 278891 280348 282354 284094 284940 285335 286341 288414 291136 294147
52408 294147 297736 302316 307908 314471 322338 331846 342721 354003 364367 372411 377055 378004 375699 370768
52394 370768 363894 356136 348679 341969 335651 329633 324602 321105 318765 316897 315347 314163 313074 312011
52380 312011 311666 312681 314601 316400 317809 319361 321398 323848 326830 330661 335278 340367 345960 352112
52366 352112 358089 362767 365989 368708 371518 373819 374681 373987 372365 370540 369026 368016 367290 366596 366217
$$ packed form
52471B86686J327J618J222P93R96J506J479P76K47O86J859K833L019K651K184
52456C09882J582N00r31j976k111j686j526j978k667l052k935k498k082j920j887
52441B84715j629j038m67k29j85q9j10n57j208j425j027n36m61p33r48q87n61
52424B72625j9O60J253J467J217Q28Q60J457K006J740Q46L95J006K073K722L011
52408B94147L589M580N592O563P867R508J0875J1282J0364Q044M644R49k305m931
52394C70768o874p758p457o710o318o018n031l497k340j868j550j184j089j063
52380C12011l45J015J920J799J409J552K037K450K982L831M617N089N593O152
52366C52112N977M678L222K719K810K301Q62o94j622j825j514j010p26o94l79
$$ plain form
52351 366217 366741 368167 369725 370783 371473 372317 373654 375582 378016 380582 382882 385038 387556 390595 393940
52336 393940 397827 403169 410525 419341 428628 438056 448017 458962 471085 484380 498579 513199 528019
52323 528019 543418 560006 577969 596949 616367 635726 654743 673382 691668 709510 726855
52312 726855 744029 761565 779541 797362 814354 830314 845443 860054 874524 889153 903791
52301 903791 917845 930904 943110 954715 965513 975029 983065 989713 994889 998207 999401 998647 996338
52288 996338 992587 987170 980035 971788 963454 955749 948831 942814 938111 934973 933071 931972 931783 932832
52274 932832 934957 937763 941541 947254 955407 965436 976388 987842 1000011 1013294 1027785 1042894
52262 1042894 1057429 1070450 1082127 1093385 1104780 1116219 1127711 1139712 1152519 1165889 1179439
$$ packed form
52351C66217N24J426J558J058O90Q44J337J928K434K566K300K156K518L039L345
52336C93940L887N342P356Q816R287R428R961J0945J2123J3295J4199J4620J4820
52323E28019J5399J6588J7963J8980J9418J9359J9017J8639J8286J7842J7345
52312G26855J7174J7536J7976J7821J6992J5960J5129J4611J4470J4629J4638
52301I03791J4054J3059J2206J1605J0798R516Q036O648N176L318J194p54k309
52288I96338l751n417p135q247q334p705o918o017m703l138j902j099j89J049
52274I32832K125K806L778N713Q153J0029J0952J1454J2169J3283J4491J5109
52262A042894J4535J3021J1677J1258J1395J1439J1492J2001J2807J3370J3550
$$ plain form
52251 1179439 1192911 1205854 1217571 1227643 1236045 1242549 1246614 1248036 1247188 1244372 1239594 1233282 1226502
52238 1226502 1219907 1213048 1205255 1196718 1188182 1180068 1172488 1165676 1159754 1154385 1149268 1144654 1140782 1137154
52224 1137154 1133173 1129276 1126640 1125773 1126139 1127176 1128975 1131708 1135062 1138595 1142277 1146397 1151175 1156668
52210 1156668 1162817 1169396 1176130 1182966 1190120 1197684 1205332 1212526 1218984 1224906 1230740 1236714 1242663 1248362
52196 1248362 1253941 1259735 1265774 1271754 1277558 1283453 1289588 1295699 1301555 1307321 1313088 1318311 1322135 1324179
52182 1324179 1324602 1323485 1320550 1315568 1308755 1300667 1291805 1282333 1272177 1261498 1251048 1241752 1233856
52169 1233856 1226793 1220121 1214265 1210037 1207610 1206310 1205269 1204077 1202922 1202389 1203037 1204975 1207849 1211172
52155 1211172 1214420 1216874 1217896 1217657 1217078 1216729 1216219 1215035 1213542 1212553 1212268 1212276 1212373 1212691 1213132 1213310 1213056 1212449
$$ packed form
52251A179439J3472J2943J1717J0072Q402O504M065J422q48k816m778o312o780
52238A226502o595o859p793q537q536q114p580o812n922n369n117m614l872l628
52224A137154l981l897k636q67L66J037J799K733L354L533L682M120M778N493
52210A156668O149O579O734O836P154P564P648P194O458N922N834N974N949N699
52196A248362N579N794O039N980N804N895O135O111N856N766N767N223L824K044
52182A324179M23j117k935m982o813q088q862r472j0156j0679j0450r296p896
52169A233856p063o672n856m228k427j300j041j192j155n33O48J938K874L323
52155A211172L248K454J022k39n79l49n10j184j493r89k85QR7L18M41J78k54o07
$$ plain form
52137 1212449 1211273 1209061 1205820 1202337 1199603 1198252 1198560 1200557 1203938 1208330 1213914 1221631 1232549 1247071
52123 1247071 1264783 1284905 1306862 1330538 1356028 1383151 1411280 1439698 1467929 1495574 1522120
52112 1522120 1547173 1570693 1592763 1613304 1632259 1649749 1665680 1679488 1690734 1699758 1707276 1713518
52100 1713518 1718352 1722069 1725337 1728322 1730561 1731879 1732761 1733436 1733069 1730353 1724704 1716526 1706470 1694804
52086 1694804 1681434 1666354 1650015 1633395 1617652 1603665 1591839 1582206 1574565 1568670 1564538 1562599
52074 1562599 1563372 1566959 1572943 1580738 1589913 1600331 1612079 1625144 1639042 1653075 1667127 1681786
52062 1681786 1697280 1712660 1726585 1738664 1749404 1759051 1767282 1773991 1779540 1783981 1786797 1787728 1787236
52049 1787236 1785727 1782857 1778064 1771303 1762705 1751902 1738358 1722249 1704424 1685516 1665509 1644276
$$ packed form
52137A212449j176k212l241l483k734j351L08J997L381M392N584P717J0918J4522
52123A247071J7712K0122K1957K3676K5490K7123K8129K8418K8231K7645K6546
52112A522120K5053K3520K2070K0541J8955J7490J5931J3808J1246R024P518O242
52100A713518M834L717L268K985K239J318Q82O75l67k716n649q178j0056j1666
52086A694804j3370j5080j6339j6620j5743j3987j1826r633p641n895m132j939
52074A562599P73L587N984P795R175J0418J1748J3065J3898J4033J4052J4659
52062A681786J5494J5380J3925J2079J0740R647Q231O709N549M441K816R31m92
52049A787236j509k870m793o761q598j0803j3544j6109j7825j8908k0007k1233
$$ plain form
52037 1644276 1622162 1599861 1578008 1557128 1537868 1520939 1506555 1494025 1482241 1470765 1460121
52026 1460121 1450750 1441991 1432746 1422954 1413609 1405080 1396206 1385604 1373384 1360956 1349377 1338495 1327628
52013 1327628 1316514 1305425 1294687 1284244 1273599 1262161 1249710 1236392 1222229 1206864 1189988
52002 1189988 1171715 1152183 1131075 1108046 1083569 1058840 1034732 1011335 988662 967349 948217
51991 948217 931353 916009 901387 887240 873706 860865 848618 836861 825533 814415 803020
51980 803020 790860 777894 764582 751337 738016 724139 709562 694719 680168 666214 653166
51969 653166 641653 632266 625017 619500 615586 613599 613804 616144 620603 627274 635727 644732 653117 660660
51955 660660 667602 673499 677243 678234 676872 673725 668860 662345 654878 647425 640515 634371 629487 626630
$$ packed form
52037A644276k2114k2301k1853k0880j9260j6929j4384j2530j1784j1476j0644
52026A460121r371q759r245r792r345q529q874j0602j2220j2428j1579j0882j0867
52013A327628j1114j1089j0738j0443j0645j1438j2451j3318j4163j5365j6876
52002A189988j8273j9532k1108k3029k4477k4729k4108k3397k2673k1313j9132
51991I48217j6864j5344j4622j4147j3534j2841j2247j1757j1328j1118j1395
51980H03020j2160j2966j3312j3245j3321j3877j4577j4843j4551j3954j3048
51969F53166j1513r387p249n517l914j987K05K340M459O671Q453R005Q385P543
51955F60660O942N897L744R91j362l147m865o515p467p453o910o144m884k857
$$ plain form
51941 626630 626336 628676 633428 640176 648411 657838 668505 680349 692788 705010 716468 726637 734479
51928 734479 738710 738780 735188 728708 719607 707805 693541 677619 661048 644578 628541 613086 598481
51915 598481 585094 573049 562090 551911 542494 534003 526587 520519 516360 514636 515393 518316 523198
51902 523198 530017 538605 548652 560066 573040 587621 603356 619380 634566 647526 656622 660329
51890 660329 657797 649299 636210 620383 603348 586039 569150 553386 539229 526828 516395 508460
51878 508460 503390 500929 500627 502498 506778 513153 520699 528584 536411 543940 550936 557346 563163 567934
51864 567934 570680 570466 566930 560411 551907 542833 534393 527047 520826 515949 512705 510862 509842 509636 510922
51849 510922 513950 517774 520957 522765 523284 522653 520649 517035 512023 506228 500226 494225 488236 482498 477501
$$ packed form
51941F26630k94K340M752O748Q235R427J0667J1844J2439J2222J1458J0169P842
51928G34479M231P0l592o480r101j1802j4264j5922j6571j6470j6037j5455j4605
51915E98481j3387j2045j0959j0179r417q491p416o068m159j724P57K923M882
51902E23198O819Q588J0047J1414J2974J4581J5735J6024J5186J2960R096L707
51890F60329k532q498j3089j5827j7035j7309j6889j5764j4157j2401j0433p935
51878E08460n070k461l02J871M280O375P546P885P827P529O996O410N817M771
51864E67934K746k14l536o519q504r074q440p346o221m877l244j843j020k06J286
51849E10922L028L824L183J808N19o31k004l614n012n795o002o001n989n738m997
$$ plain form
51834 477501 473468 470106 467218 465330 465197 466702 468721 470207 471033 471667 472374 472943 472966 472137 470404 467923
51818 467923 464849 461277 457519 454266 452151 451213 451020 451238 451788 452666 453967 455933 458540 461161 463060
51803 463060 464070 464349 463737 462034 459775 457893 456627 455481 454259 453267 452327 450605 447801 444638 441675
51788 441675 438441 434421 430257 427143 425434 424568 424057 423918 424241 424907 425680 426234 426261 425798 425181 424443 423203
51771 423203 421524 420436 421111 423872 428467 434837 442961 452282 462070 472243 483086 494159 504156 511981
51757 511981 517414 520591 521303 519152 514137 506862 498210 488916 479396 469996 461271 453776 447539 442134
51743 442134 437481 434193 432858 433277 434771 436954 439838 443481 448053 454055 461925 471385 481429 490874
51729 490874 498734 504365 507738 509509 510528 511362 512451 514207 516374 517641 516645 513349 508900 504207 499334
$$ packed form
51834D77501m033l362k888j888j33J505K019J486Q26O34P07N69K3q29j733k481
51818D67923l074l572l758l253k115r38j93K18N50Q78J301J966K607K621J899
51803D63060J010K79o12j703k259j882j266j146j222r92r40j722k804l163k963
51788D41675l234m020m164l114j709q66n11j39L23O66P73N54K7m63o17p38j240
51771D23203j679j088O75K761M595O370Q124R321R788J0173J0843J1073R997P825
51757E11981N433L177P12k151n015p275q652r294r520r400q725p495o237n405
51743D42134m653l288j335M19J494K183K884L643M572O002P870R460J0044R445
51729D90874P860N631L373J771J019Q34J089J756K167J267r96l296m449m693m873
$$ plain form
51714 499334 494304 489765 486494 484637 483627 482551 480502 477002 472404 467699 463812 461252 460356 461391
51700 461391 464187 467921 471497 474066 475288 475383 475010 474801 474900 475090 475348 475924 476873 477795 478194 477790 476330
51683 476330 473425 468863 463000 456604 450402 444910 440608 438014 437437 438619 440755 442957 444839 446623
51669 446623 448760 451586 455296 459931 465206 470606 475895 481362 487228 492909 497162 498959 498030 494716
51655 494716 489680 483799 477983 472910 469073 467114 467878 471906 478831 487231 495087 500550 502604 501202
51641 501202 496929 490565 482862 474430 465688 457057 449204 442807 437952 434022 430361 426857 423751 421223
51627 421223 419444 418719 419189 420459 421845 422870 423365 423228 422366 420737 418255 414858 410957 407539 405471
51612 405471 404721 404543 404222 403386 401844 399629 397219 395426 394964 396096 398465 401105 403076 404462 406544
$$ packed form
51714D99334n030m539l271j857j010j076k049l500m598m705l887k560q96J035
51700D61391K796L734L576K569J222R5l73k09R9J90K58N76R49R22L99m04j460
51683D76330k905m562n863o396o202n492m302k594n77J182K136K202J882J784
51669D46623K137K826L710M635N275N400N289N467N866N681M253J797r29l314
51655D94716n036n881n816n073l837j959P64M028O925Q400P856N463K054j402
51641E01202m273o364p703q432q742q631p853o397m855l930l661l504l106k528
51627D21223j779p25M70J270J386J025M95j37q62j629k482l397l901l418k068
51612D05471p50j78l21q36j542k215k410j793m62J132K369K640J971J386K082
$$ plain form
51597 406544 410611 416832 424591 433513 443663 454989 467024 478932 489391 496761 500055 499669 496734
51584 496734 492013 486024 479858 474904 471688 469745 468736 469045 471180 475365 481942 491462 503947 518483
51570 518483 533899 549548 565367 581698 599256 618766 640229 662694 684978 706489 727556
51559 727556 749375 773676 801940 834779 872124 913530 957498 1000673 1038765 1068664 1089187
51548 1089187 1099921 1100438 1091023 1073098 1048096 1016566 979055 937284 893609 849684 806425 765046
51536 765046 727172 693802 664728 639151 616517 596707 579726 565357 553013 541958 531766
51525 531766 522488 514327 507301 501248 495916 490920 485929 480968 476238 471636 466879 462207 458391 455742
51511 455742 453623 451293 448769 446407 444101 441491 438627 435905 433544 431601 430277 429685 429495 429324 429440
$$ packed form
51597D06544M067O221P759Q922J0150J1326J2035J1908J0459P370L294l86k935
51584D96734m721n989o166m954l216j943j009L09K135M185O577R520J2485J4536
51570E18483J5416J5649J5819J6331J7558J9510K1463K2465K2284K1511K1067
51559G27556K1819K4301K8264L2839L7345M1406M3968M3175L8092K9899K0523
51548A089187J0734N17r415j7925k5002l1530l7511m1771m3675m3925m3259m1379
51536G65046l7874l3370k9074k5577k2634j9810j6981j4369j2344j1055j0192
51525E31766r278q161p026o053n332m996m991m961m730m602m757m672l816k649
51511D55742k119k330k524k362k306k610k864k722k361j943j324n92j90j71J16
$$ plain form
51496 429440 430576 433097 436682 440740 444684 447919 449964 450736 450462 449432 448041 446830 446066 445428 444483
51481 444483 443236 441778 439588 435882 430704 425101 420087 415831 411884 407682 402742 396986 391178 386555
51467 386555 383645 381715 379682 377218 374691 372440 370634 369531 369184 368869 367476 364820 362116 360826 361187
51452 361187 362287 363406 364800 367102 370438 374454 379003 384395 390997 398897 408061 418648 431045 445555
51438 445555 461843 478476 493127 503651 509274 510840 510066 508624 507548 506856 505551 502358 496737 489119
51424 489119 480255 470732 461180 452421 445024 438876 433415 428156 422865 417571 412691 408881 406437 404960
51410 404960 403858 403028 402815 403482 405052 407554 411019 415224 419676 423963 427989 431883 435803 439818 443902
51395 443902 448040 452361 457056 462164 467607 473489 480116 487670 496078 505397 516130 528994 544553
$$ packed form
51496D29440J136K521L585M058L944L235K045P72k74j030j391j211p64o38r45
51481D44483j247j458k190l706n178n603n014m256l947m202m940n756n808m623
51467C86555k910j930k033k464k527k251j806j103l47l15j393k656k704j290L61
51452C61187J100J119J394K302L336M016M549N392O602P900R164J0587J2397J4510
51438D45555J6288J6633J4651J0524N623J566p74j442j076o92j305l193n621p618
51424D89119q864r523r552q759p397o148n461n259n291n294m880l810k444j477
51410D04960j102q30k13O67J570K502L465M205M452M287M026L894L920M015M084
51395D43902M138M321M695N108N443N882O627P554Q408R319J0733J2864J5559
$$ plain form
51382 544553 563243 585625 612395 644131 680953 722342 767462 816092 868994 926599 987011
51371 987011 1045959 1099152 1144235 1180141 1205442 1218457 1218785 1207640 1186484 1156062 1117069 1071132
51359 1071132 1020564 967405 913006 858477 805252 755090 709438 668773 632685 600747 573143
51348 573143 550277 531983 517387 505390 495003 485381 475987 466765 457955 449782 442478 436285 431029
51335 431029 425923 420391 415044 411267 409682 409438 409118 407928 405886 403319 400472 397392 393969 390242 386665
51320 386665 383781 381604 379701 377980 376957 377038 377856 378625 378855 378549 377944 377368 377139 377300 377485 377273 376576
51303 376576 375616 374679 374117 374419 375959 378591 381587 384047 385437 385916 386197 386950 388243 389597 390547 390986
51287 390986 390973 390543 389808 389000 388237 387513 387128 387865 390373 394417 398981 403031 405997 407635 407896 407091 405851
$$ packed form
51382E44553J8690K2382K6770L1736L6822M1389M5120M8630N2902N7605O0412
51371I87011N8948N3193M5083L5906K5301J3015L28j1145k1156l0422l8993m5937
51359A071132n0568n3159n4399n4529n3225n0162m5652m0665l6088l1938k7604
51348E73143k2866j8294j4596j1997j0387r622r394r222q810q173p304o193n256
51335D31029n106n532n347l777j585k44l20j190k042k567k847l080l423l727l577
51320C86665k884k177j903j721j023Q1Q18P69K30l06o05n76k29J61J85k12o97
51303C76576r60r37n62L02J540K632K996K460J390M79K81P53J293J354R50M39
51287C90986j3m30p35q08p63p24l85P37K508M044M564M050K966J638K61q05j240
$$ plain form
51270 405851 404653 403428 401845 399943 398353 397860 398864 401257 404606 408256 411340 413067 413239 412380 411160
51255 411160 409741 407873 405607 403561 402303 401630 400763 399239 397397 395870 394739 393417 391452 389231 387687
51240 387687 387302 387620 387848 387694 387404 387164 386847 386424 386225 386571 387311 388029 388649 389545 390939 392419 393270 393180
51222 393180 392455 391533 390497 389152 387494 385935 385079 385288 386362 387575 388119 387692 386656 385572 384756 384411
51206 384411 384955 386768 389570 392494 394950 397204 399878 403105 406415 409361 411968 414548 417174 419440
51192 419440 420864 421553 422275 423578 424969 425402 424621 423453 422627 421848 420471 418621 417040 416065 415350 414526
51176 414526 413562 412424 410895 408907 406741 404756 403198 402292 402164 402518 402694 402304 401689 401631 402726 405063
51160 405063 408265 411683 414685 416959 418650 420230 422208 424726 427259 428829 428846 427694 426271 424951 423353
$$ packed form
51270D05851j198j225j583j902j590m93J004K393L349L650L084J727J72q59j220
51255D11160j419j868k266k046j258o73q67j524j842j527j131j322j965k221j544
51240C87687l85L18K28j54k90k40l17m23j99L46P40P18O20Q96J394J480Q51r0
51222C93180p25r22j036j345j658j559q56K09J074J213N44m27j036j084q16l45
51206C84411N44J813K802K924K456K254K674L227L310K946K607K580K626K266
51192D19440J424O89P22J303J391M33p81j168q26p79j377j850j581r75p15q24
51176D14526r64j138j529j988k166j985j558r06j28L54J76l90o15n8J095K337
51160D05063L202L418L002K274J691J580J978K518K533J570J7j152j423j320j598
$$ plain form
51145 423353 421176 418801 416793 415116 413299 411335 409960 409777 410353 410571 409933 409218 409630 411446 413796 415653
51129 415653 416693 417126 417151 416849 416375 415925 415569 415260 414924 414449 413876 413762 415005 417941 421769 425183 427436
51112 427436 428564 428863 428651 428423 428684 429532 430775 432491 435137 438983 443747 448835 453684 457811 460841
51097 460841 462745 463915 464892 466006 467190 468102 468534 468786 469338 470063 470180 469379 468546 468705 469516 469624 468459
51080 468459 466901 465963 465602 465187 464470 463629 462767 461925 461386 461541 462609 464640 467497 470632 473286 475367
51064 475367 477836 481746 487110 493240 500107 508760 520123 533654 547454 559601 569275 576783 582903
51051 582903 588505 594750 603105 614592 628851 644264 659174 672887 685452 696801 706364 713414
51039 713414 717547 718845 717760 714894 710827 705955 700312 693422 684443 672697 658108 641188 622842
$$ packed form
51145D23353k177k375k008j677j817j964j375j83N76K18o38p15M12J816K350J857
51129D15653J040M33K5l02m74m50l56l09l36m75n73j14J243K936L828L414K253
51112D27436J128K99k12k28K61Q48J243J716K646L846M764N088M849M127L030
51097D60841J904J170R77J114J184R12M32K52N52P25J17q01q33J59Q11J08j165
51080D68459j558r38l61m15p17q41q62q42n39J55J068K031K857L135K654K081
51064D75367K469L910N364O130O867Q653J1363J3531J3800J2147R674P508O120
51051E82903N602O245Q355J1487J4259J5413J4910J3713J2565J1349R563P050
51039G13414M133J298j085k866m067m872n643o890q979j1746j4589j6920j8346
$$ plain form
51026 622842 604351 587188 572335 559841 549393 541226 535926 533324 532243 531682 531820 533509 537087
51013 537087 542034 547587 553334 559322 565843 573065 580697 588159 595206 602247 609961 618750 628703 639788
50999 639788 651841 664490 677353 690286 703269 716123 728466 739981 750689 761002 771392
50988 771392 781778 791282 798912 804582 809254 814022 819347 825199 831606 838810 847096 856607 867105 877848
50974 877848 888022 897530 907131 917694 929682 943549 960206 980633 1005198 1033728 1066183 1102973
50962 1102973 1144632 1191340 1242676 1297659 1355109 1414148 1474298 1535081 1595711 1655271 1712916
50951 1712916 1767776 1818958 1865884 1908455 1946737 1980802 2011057 2038383 2063604 2087088 2109316
50940 2109316 2131543 2155104 2179802 2203436 2223399 2238726 2250401 2259665 2266378 2269242 2267373 2261039
$$ packed form
51026F22842j8491j7163j4853j2494j0448q167n300k602j081n61J38J689L578
51013E37087M947N553N747N988O521P222P632P462P047P041P714Q789R953J1085
50999F39788J2053J2649J2863J2933J2983J2854J2343J1515J0708J0313J0390
50988G71392J0386R504P630N670M672M768N325N852O407P204Q286R511J0498J0743
50974H77848J0174R508R601J0563J1988J3867J6657K0427K4565K8530L2455L6790
50962A102973M1659M6708N1336N4983N7450N9039O0150O0783O0630N9560N7645
50951A712916N4860N1182M6926M2571L8282L4065L0255K7326K5221K3484K2228
50940B109316K2227K3561K4698K3634J9963J5327J1675R264O713K864j869o334
$$ plain form
50928 2261039 2250665 2235753 2215368 2189268 2157633 2119824 2074521 2021523 1962624 1900145 1835191
50917 1835191 1767954 1699210 1630649 1563936 1500053 1439524 1382753 1330128 1282123 1239149 1200976
50906 1200976 1166539 1134771 1105499 1079131 1055668 1034521 1015153 997392 981123 966160 952474
50895 952474 940173 929193 919338 910539 902748 895654 888882 882484 876886 872381 869039 867020 866547 867480
50881 867480 869268 871393 873679 876220 879280 883176 887969 893393 899392 906483 915102 924779 934597 944489
50867 944489 955427 968196 982545 997784 1013726 1030782 1049523 1070487 1094109 1120604 1150134
50856 1150134 1183260 1220906 1263652 1311354 1363765 1421293 1484959 1555754 1634257 1720665 1814890
50845 1814890 1916633 2025505 2141062 2262756 2390032 2522439 2659288 2798968 2938701
$$ packed form
50928B261039j0374j4912k0385k6100l1635l7809m5303n2998n8899o2479o4954
50917A835191o7237o8744o8561o6713o3883o0529n6771n2625m8005m2974l8173
50906A200976l4437l1768k9272k6368k3463k1147j9368j7761j6269j4963j3686
50895I52474j2301j0980r855q799p791p094o772o398n598m505l342k019m73R33
50881H67480J788K125K286K541L060L896M793N424N999P091Q619R677R818R892
50867I44489J0938J2769J4349J5239J5942J7056J8741K0964K3622K6495K9530
50856A150134L3126L7646M2746M7702N2411N7528O3666P0795P8503Q6408R4225
50845A814890J01743J08872J15557J21694J27276J32407J36849J39680J39733
$$ plain form
50836 2938701 3075113 3205014 3325711 3435001 3531255 3613569 3681771 3736292 3778002 3808045
50826 3808045 3827927 3839999 3847723 3855034 3865178 3880285 3901879 3931167 3968386 4012099 4059411 4106655
50814 4106655 4149649 4183740 4204319 4207646 4191185 4153425 4093843 4013080 3912657 3794257 3659498
50803 3659498 3510685 3351562 3186907 3021230 2857932 2699570 2548438 2406495 2274880
50794 2274880 2153961 2044035 1945825 1860060 1786580 1723981 1670255 1623925 1584707 1552944 1528268
50783 1528268 1508899 1492538 1477889 1464976 1453977 1444292 1434888 1425080 1414564 1403089 1390663 1377879
50771 1377879 1365423 1353182 1340258 1325947 1310371 1294065 1277292 1259930 1241788 1222827 1203176
50760 1203176 1183148 1163256 1144137 1126368 1110222 1095653 1082660 1071599 1062897 1056489 1051891 1048930
$$ packed form
50836B938701J36412J29901J20697J09290R6254Q2314O8202N4521M1710L0043
50826C808045J9882J2072P724P311J0144J5107K1594K9288L7219M3713M7312M7244
50814D106655M2994L4091K0579L327j6461l7760n9582q0763j00423j18400j34759
50803C659498j48813j59123j64655j65677j63298j58362j51132j41943j31615
50794B274880j20919j09926r8210q5765p3480o2599n3726m6330l9218l1763k4676
50783A528268j9369j6361j4649j2913j0999r685r404r808j0516j1475j2426j2784
50771A377879j2456j2241j2924j4311j5576j6306j6773j7362j8142j8961j9651
50760A203176k0028j9892j9119j7769j6146j4569j2993j1061q702o408m598k961
$$ plain form
50748 1048930 1048001 1049444 1053162 1059186 1068093 1080352 1095616 1113248 1133304 1156445 1183186 1213893
50736 1213893 1249306 1290189 1336427 1387165 1441922 1500846 1563668 1629184 1696158 1764248 1833634
50725 1833634 1904133 1975052 2045593 2115019 2182682 2248096 2310724 2369414 2422263 2467259 2502929
50714 2502929 2528370 2543139 2547499 2542708 2530862 2514527 2496357 2478687 2463304 2451821 2446174 2448208
50702 2448208 2458556 2476230 2499512 2526851 2556670 2586642 2613479 2633335 2642445 2637913 2618312 2583528
50690 2583528 2534059 2470838 2395745 2311749 2222237 2130377 2039110 1951039 1867952 1790827 1720545
50679 1720545 1658072 1603660 1556570 1516307 1483698 1460035 1445318 1438048 1436664 1440583 1449762 1463781
50667 1463781 1481560 1501581 1522259 1542381 1561400 1579263 1596028 1611734 1626508 1640511 1653825
$$ packed form
50748A048930r29J443L718O024Q907J2259J5264J7632K0056K3141K6741L0707
50736A213893L5413M0883M6238N0738N4757N8924O2822O5516O6974O8090O9386
50725A833634P0499P0919P0541O9426O7663O5414O2628N8690N2849M4996L5670
50714B502929K5441J4769M360m791j1846j6335j8170j7670j5383j1483n647K034
50702B448208J0348J7674K3282K7339K9819K9972K6837J9856R110m532j9601l4784
50690B583528m9469o3221p5093q3996q9512r1860r1267q8071q3087p7125p0282
50679A720545o2473n4412m7090m0263l2609k3663j4717p270j384L919R179J4019
50667A463781J7779K0021K0678K0122J9019J7863J6765J5706J4774J4003J3314
$$ plain form
50656 1653825 1666597 1679283 1692521 1706768 1722122 1738407 1755334 1772725 1790795 1810164 1831540
50645 1831540 1855520 1882706 1913709 1948820 1987903 2030742 2077265 2127257 2180183 2235485 2292705
50634 2292705 2350998 2408905 2465052 2518861 2570198 2618629 2663694 2705851 2746484 2786427 2824296
50623 2824296 2856080 2876382 2880613 2866967 2836900 2794089 2743111 2688765 2635613 2587170 2545458
50612 2545458 2511505 2485987 2468972 2459464 2455860 2456753 2460787 2465938 2469647 2469635 2464069 2451023 2428638
50599 2428638 2396078 2353802 2302650 2243257 2176691 2105137 2031378 1957670 1885234 1814566 1745993
50588 1745993 1680177 1618291 1561542 1510388 1464491 1423541 1387841 1357836 1333282 1313061 1295635
50577 1295635 1279607 1264248 1249798 1237117 1226798 1218728 1212571 1208345 1206251 1206187 1207814 1210969 1215640
$$ packed form
50656A653825J2772J2686J3238J4247J5354J6285J6927J7391J8070J9369K1376
50645A831540K3980K7186L1003L5111L9083M2839M6523M9992N2926N5302N7220
50634B292705N8293N7907N6147N3809N1337M8431M5065M2157M0633L9943L7869
50623B824296L1784K0302M231j3646l0067m2811n0978n4346n3152m8443m1712
50612B545458l3953k5518j7015r508l604Q93M034N151L709j2n566j3046k2385
50599B428638l2560m2276n1152n9393o6566p1554p3759p3708p2436p0668o8573
50588A745993o5816o1886n6749n1154m5897m0950l5700l0005k4554k0221j7426
50577A295635j6028j5359j4450j2681j0319q070o157m226k094o4J627L155M671
$$ plain form
50564 1215640 1221650 1228710 1236927 1246913 1259259 1274030 1290929 1309876 1331238 1355435 1382345 1411175
50552 1411175 1441014 1471454 1502601 1534456 1566414 1597436 1626611 1653561 1678518 1702220 1725680
50541 1725680 1749914 1775787 1804090 1835658 1871332 1911821 1957670 2009341 2067277 2131925 2203723
50530 2203723 2283027 2369974 2464419 2566106 2675000 2791354 2915284 3046139 3182325 3321750
50520 3321750 3462331 3601947 3738140 3868168 3989366 4099263 4195391 4275330 4337048 4378908
50510 4378908 4399345 4397053 4371873 4325157 4259010 4175565 4077462 3968636 3853833 3737265 3622281
50499 3622281 3512322 3411491 3323833 3252330 3198729 3163811 3147456 3148668 3165829 3196789 3238505
50488 3238505 3286710 3336040 3380432 3413609 3429913 3425330 3397885 3347245 3274432 3182073 3074348
$$ packed form
50564A215640O010P060Q217R986J2346J4771J6899J8947K1362K4197K6910K8830
50552A411175K9839L0440L1147L1855L1958L1022K9175K6950K4957K3702K3460
50541A725680K4234K5873K8303L1568L5674M0489M5849N1671N7936O4648P1798
50530B203723P9304Q6947R4445J01687J08894J16354J23930J30855J36186J39425
50520C321750J40581J39616J36193J30028J21198J09897R6128P9939O1718M1860
50510D378908K0437k292k5180m6716o6147q3445r8103j08826j14803j16568j14984
50499C622281j09959j00831q7658p1503n3601l4918j6355J212J7161L0960M1716
50488C238505M8205M9330M4392L3177J6304m583k7445n0640p2813r2359j07725
$$ plain form
50477 3074348 2955896 2830653 2701753 2572111 2444491 2321080 2203446 2092904 1990508
50468 1990508 1896621 1810913 1732983 1662715 1599977 1544309 1495086 1451728 1413567 1379822 1350040
50457 1350040 1324464 1303668 1287818 1276427 1268698 1263890 1261450 1261112 1262999 1267387 1274294 1283467 1294792
50444 1294792 1308396 1324110 1341086 1358298 1375221 1391611 1406691 1419145 1428170 1434125 1437910 1440096
50432 1440096 1441035 1441367 1441747 1442202 1442488 1443157 1445591 1450617 1457649 1465630 1474448 1484932 1497820 1513409 1532127
50417 1532127 1554743 1581854 1613580 1649984 1691341 1737778 1789025 1844781 1904967 1969280 2036763
50406 2036763 2106222 2176831 2247868 2317976 2385273 2448223 2505988 2557871 2602952 2640392 2669508
50395 2669508 2689155 2697499 2692998 2675362 2645138 2602657 2548114 2482750 2409319 2331196 2251306 2172048
$$ packed form
50477C074348j18452j25243j28900j29642j27620j23411j17634j10542j02396
50468A990508r3887q5708p7930p0268o2738n5668m9223m3358l8161l3745k9782
50457A350040k5576k0796j5850j1391p729m808k440l38J887M388O907R173J1325
50444A294792J3604J5714J6976J7212J6923J6390J5080J2454R025N955L785K186
50432A440096R39L32L80M55K86O69K434N026P032P981Q818J0484J2888J5589J8718
50417A532127K2616K7111L1726L6404M1357M6437N1247N5756O0186O4313O7483
50406B036763O9459P0609P1037P0108O7297O2950N7765N1883M5081L7440K9116
50395B669508J9647Q344m501j7636l0224m2481n4543o5364p3431p8123p9890p9258
$$ plain form
50383 2172048 2095698 2024517 1960660 1906100 1862297 1829651 1807547 1795268 1792640 1799443 1814337 1834749
50371 1834749 1857743 1880663 1900952 1915837 1922566 1919014 1904160 1878197 1842293 1798154 1747655 1692717
50359 1692717 1635309 1577286 1520132 1464829 1411876 1361367 1313191 1267300 1223835 1182921 1144481
50348 1144481 1108388 1074764 1044006 1016494 992373 971613 954184 940061 929101 920963 915260 911830
50336 911830 910707 911708 914231 917709 922213 928309 936383 946435 958431 972312 987543 1003322 1019684
50323 1019684 1037849 1058779 1081425 1102891 1120312 1132341 1139160 1141773 1141397 1138951 1134746 1128724 1121036
50310 1121036 1112285 1103346 1095137 1088413 1083385 1079643 1076742 1074773 1073997 1074123 1074491 1074946 1075932 1077701 1080082
50295 1080082 1083281 1088258 1095805 1105580 1116439 1127488 1138597 1150280 1163461 1179165 1198099 1220754
$$ packed form
50383B172048p6350p1181o3857n4560m3803l2646k2104j2279k628O803J4894K0412
50371A834749K2994K2920K0289J4885O729l552j4854k5963l5904m4139n0499n4938
50359A692717n7408n8023n7154n5303n2953n0509m8176m5891m3465m0914l8440
50348A144481l6093l3624l0758k7512k4121k0760j7429j4123j0960q138n703l430
50336I11830j123J001K523L478M504O096Q074J0052J1996J3881J5231J5779J6362
50323A019684J8165K0930K2646K1466J7421J2029O819K613l76k446m205o022p688
50310A121036q751q939q209o724n028l742k901j969p76J26L68M55R86J769K381
50295A080082L199M977P547R775J0859J1049J1109J1683J3181J5704J8934K2655
$$ plain form
50283 1220754 1247994 1280735 1318018 1355399 1386208 1405081 1410458 1404034 1388647 1367048 1341995 1316312
50271 1316312 1292237 1270759 1251792 1234984 1220253 1207669 1197076 1188026 1180011 1172602 1165437 1158335
50259 1158335 1151528 1145512 1140434 1135725 1130651 1125209 1120227 1116443 1113748 1111499 1109429 1107900 1107321 1107709
50245 1107709 1108983 1111419 1115426 1121002 1127775 1135647 1145058 1156510 1170057 1185383 1202128 1219979 1238642
50232 1238642 1257942 1277726 1297503 1316344 1333378 1348256 1361020 1371790 1380842 1388688 1395712 1401843
50220 1401843 1406864 1410730 1413093 1412765 1408303 1399100 1385345 1366991 1343606 1315504 1284385 1252409 1221046
50207 1221046 1191192 1163841 1140037 1120355 1104893 1093522 1085568 1079279 1072194 1062358 1049112 1032837
50195 1032837 1014285 994276 973694 953394 934026 915887 898939 882974 867841 853565 840274
$$ packed form
50283A220754K7240L2741L7283L7381L0809J8873N377o424j5387k1599k5053k5683
50271A316312k4075k1478j8967j6808j4731j2584j0593r050q015p409p165p102
50259A158335o807o016n078m709n074n442m982l784k695k249k070j529n79L88
50245A107709J274K436M007N576O773P872R411J1452J3547J5326J6745J7851J8663
50232A238642J9300J9784J9777J8841J7034J4878J2764J0770R052P846P024O131
50220A401843N021L866K363l28m462r203j3755j8354k3385k8102l1119l1976l1363
50207A221046k9854k7351k3804j9682j5462j1371p954o289p085r836j3246j6275
50195A032837j8552k0009k0582k0300j9368j8139j6948j5965j5133j4276j3291
$$ plain form
50184 840274 828043 816789 806251 796095 786178 776727 768128 760464 753308 746022 738287 730399 723119
50171 723119 717088 712266 708064 704160 700953 698907 697690 696460 694977 693858 693625 694063 694856 696398 699448
50156 699448 704126 709688 715308 720904 727204 735127 744986 756118 767284 777416 785953 792648 797497
50143 797497 800874 803331 804994 805464 804492 802453 799997 797618 795825 795342 796667 799611 803716 809005 815980
50128 815980 824941 835595 847299 859531 872266 886101 901912 920261 941332 965469 993325 1025094
50116 1025094 1059951 1096723 1134936 1174744 1216065 1258221 1300405 1342071 1383027 1423617 1464637
50105 1464637 1506559 1548743 1589745 1628212 1662962 1692397 1714546 1727869 1731545 1725091 1708479 1682905
50093 1682905 1650735 1614222 1574630 1532812 1490034 1447778 1407240 1369517 1335895 1307244 1283364
$$ packed form
50184H40274j2231j1254j0538j0156r917r451q599p664p156p286p735p888p280
50171G23119o031m822m202l904l207k046j217j230j483j119k33M38P93J542L050
50156F99448M678N562N620N596O300P923R859J1132J1166J0132Q537O695M849
50143G97497L377K457J663M70r72k039k456k379j793m83J325K944M105N289O975
50128H15980Q961J0654J1704J2232J2735J3835J5811J8349K1071K4137K7856L1769
50116A025094L4857L6772L8213L9808M1321M2156M2184M1666M0956M0590M1020
50105A464637M1922M2184M1002L8467L4750K9435K2149J3323L676o454j6612k5574
50093A682905l2170l6513l9592m1818m2778m2256m0538l7723l3622k8651k3880
$$ plain form
50082 1283364 1263490 1247333 1235026 1226085 1219050 1212378 1205341 1197962 1190494 1183174 1176174 1169477 1162944
50069 1162944 1156605 1150715 1145280 1139725 1133276 1125628 1117012 1107723 1097834 1087411 1076708 1065927 1054974
50056 1054974 1043685 1032320 1021595 1012120 1003930 996642 990040 984388 980175 977666 976767 977287 979297 983179
50042 983179 989332 997776 1007987 1019057 1030079 1040539 1050515 1060501 1070941 1081865 1092965 1103905
50030 1103905 1114432 1124196 1132664 1139382 1144260 1147551 1149562 1150371 1149801 1147583 1143566 1137784 1130375 1121615
50016 1121615 1112031 1102263 1092596 1082709 1072091 1060592 1048413 1035841 1023412 1012145 1002964 995827
50004 995827 989994 985307 982618 982695 985472 990997 1000588 1016164 1038481 1066564 1098696 1133261 1168600
49991 1168600 1202900 1234695 1263341 1288923 1311965 1333205 1353140 1371522 1387520 1400411 1409781
$$ packed form
50082A283364j9874j6157j2307q941p035o672p037p379p468p320p000o697o533
50069A162944o339n890n435n555o449p648q616r289r889j0423j0703j0781j0953
50056A054974j1289j1365j0725r475q190p288o602n652m213k509q99N20K010L882
50042I83179O153Q444J0211J1070J1022J0460R976R986J0440J0924J1100J0940
50030A103905J0527R764Q468O718M878L291K011Q09n70k218m017n782p409q760
50016A121615r584r768r667r887j0618j1499j2179j2572j2429j1267r181p137
50004I95827n833m687k689P7K777N525R591J5576K2317K8083L2132L4565L5339
49991A168600L4300L1795K8646K5582K3042K1240J9935J8382J5998J2891R370
$$ plain form
49980 1409781 1414960 1414664 1407498 1392611 1369813 1339450 1302586 1261068 1217087 1172584 1129059 1087681
49968 1087681 1049268 1014248 982769 954781 929893 907382 886681 867905 851642 838070 826403
49957 826403 815424 804690 795120 788217 784719 784215 786080 790329 797252 806539 817262 828565 839907
49944 839907 850657 860047 867654 873523 877678 879953 880453 879642 877642 873858 867684 859209 848828 836473
49930 836473 821736 804592 785553 765298 744634 724762 706942 691719 678783 667674 658300 650722
49918 650722 644835 640464 637536 635944 635471 635961 637361 639433 641675 643753 645878 648561 652151 656786 662613
49903 662613 669727 677996 687251 697671 709666 723297 738089 753532 769431 785418 800284 812315
49891 812315 820473 825079 827191 827447 825661 821427 814768 806081 795647 783519 769943 755637 741389
$$ packed form
49980A409781N179k96p166j4887k2798l0363l6864m1518m3981m4503m3525m1378
49968A087681l8413l5020l1479k7988k4888k2511k0701j8776j6263j3572j1667
49957H26403j0979j0734r570o903l498n04J865M249O923R287J0723J1303J1342
49944H39907J0750R390P607N869M155K275N00q11k000l784o174q475j0381j2355
49930H36473j4737j7144j9039k0255k0664j9872j7820j5223j2936j1109r374p578
49918F50722n887m371k928j592m73M90J400K072K242K078K125K683L590M635N827
49903F62613P114Q269R255J0420J1995J3631J4792J5443J5899J5987J4866J2031
49891H12315Q158M606K112K56j786m234o659q687j0434j2128j3576j4306j4248
$$ [...]
##END NTUPLES=NMR SPECTRUM
##END=
