
##TITLE=AC1303_PERAH12115_6641754_p1tBAZZZUx
##JCAMPDX= 6.0         $$ Bruker NMR JCAMP-DX V2.0
##DATA TYPE= NMR SPECTRUM
##DATA CLASS= NTUPLES
##ORIGIN= BRUKER
##OWNER= Administrator
$$ 1.72 TOPSPIN		Version 2.1
$$ 2012-08-10 15:24:15.984 -0500  Administrator@TOPSPIN
$$ Compression mode = diff/dup
##.OBSERVE FREQUENCY= 400.02188249412
##.OBSERVE NUCLEUS= ^1H
##.ACQUISITION MODE= SIMULTANEOUS (DQD)
##.ACQUISITION SCHEME= undefined
##.AVERAGES= 8
##.DIGITISER RES= 22
##SPECTROMETER/DATA SYSTEM= spect
##.PULSE SEQUENCE= zg30
##.SOLVENT NAME= COFFEE_meoh
##.SHIFT REFERENCE= INTERNAL, COFFEE_meoh, 1, 14.98509
##AUDIT TRAIL= $$ (NUMBER, WHEN, WHO, WHERE, PROCESS, VERSION, WHAT)
$$ ##TITLE= Audit trail, TOPSPIN		Version 2.1
$$ ##JCAMPDX= 5.01
$$ ##ORIGIN= Bruker BioSpin GmbH
$$ ##OWNER= Administrator
$$ $$ C:\Bruker\TOPSPIN/data/COFFEE/nmr/AC1303_PERAH12115_6641754_p1tBAZZZUx/40/pdata/1/auditp.txt
$$ ##AUDIT TRAIL=  $$ (NUMBER, WHEN, WHO, WHERE, PROCESS, VERSION, WHAT)
(   1,<2012-08-10 15:24:08.625 -0500>,<Administrator>,<TOPSPIN>,<go>,<TOPSPIN 2.1>,
      <created by zg
	started at 2012-08-10 15:23:02.078 -0500,
	POWCHK enabled, PULCHK disabled,
       configuration hash MD5:
       6B 1B 68 BB D9 2E 58 E2 7F 35 AD 54 07 DF 0E 41
       data hash MD5: 64K
       7D 52 13 DD E3 0B 50 18 21 97 54 C9 B1 A0 42 80>)
(   2,<2012-08-10 15:24:11.656 -0500>,<Administrator>,<TOPSPIN>,<proc1d>,<TOPSPIN 2.1>,
      <Start of raw data processing
       efp LB = 0 FT_mod = 6 PKNL = 1 PHC0 = 0 PHC1 = 0 SI = 32K 
       data hash MD5: 32K
       4E 3E 73 A9 6C EB DD 40 7F 40 F3 01 3A 37 E4 24>)
(   3,<2012-08-10 15:24:11.968 -0500>,<Administrator>,<TOPSPIN>,<proc1d>,<TOPSPIN 2.1>,
      <pk PHC0 = 183.3563 PHC1 = 0 
       data hash MD5: 32K
       BD FA 44 72 C2 2D 1D 07 46 C0 C6 45 33 6E D7 2B>)
(   4,<2012-08-10 15:24:12.109 -0500>,<Administrator>,<TOPSPIN>,<proc1d>,<TOPSPIN 2.1>,
      <abs ABSG = 1 
       data hash MD5: 32K
       77 75 AA 6D 84 9E 8D 5A FB BF EF B7 8F B6 AD A2>)
(   5,<2012-08-10 15:24:12.250 -0500>,<Administrator>,<TOPSPIN>,<proc1d>,<TOPSPIN 2.1>,
      <abs ABSG = 2 
       data hash MD5: 32K
       2B 63 2B 1C 6C CF D3 A6 4D 9A 81 27 3A 35 F9 EA>)
(   6,<2012-08-10 15:24:12.296 -0500>,<Administrator>,<TOPSPIN>,<proc1d>,<TOPSPIN 2.1>,
      <abs ABSG = 3 
       data hash MD5: 32K
       7A D1 D6 0B 1E 1C A8 47 29 8E 82 20 7B 3C BE 24>)
(   7,<2012-08-10 15:24:12.328 -0500>,<Administrator>,<TOPSPIN>,<proc1d>,<TOPSPIN 2.1>,
      <abs ABSG = 4 
       data hash MD5: 32K
       3E 8C 92 3A D3 89 49 D5 8E 52 9A C6 20 87 A5 E5>)
(   8,<2012-08-10 15:24:12.359 -0500>,<Administrator>,<TOPSPIN>,<proc1d>,<TOPSPIN 2.1>,
      <abs ABSG = 5 
       data hash MD5: 32K
       0F F0 E9 F5 59 2E 2B 0B 79 91 60 3D 84 D9 25 FF>)
$$ ##END=
$$ 
$$ $$ hash MD5
$$ $$ 85 66 FE AE F9 75 9D 66 F7 78 A8 89 FD 5D B7 12
##$RELAX= 
##$RELAX= 
##$RELAX= 
##$RELAX= 
##$RELAX= 
##$RELAX= 
##$RELAX= 
$$ Bruker specific parameters
$$ --------------------------
$$ [...]
##$TP= (0..7)
150 150 150 150 150 150 150 150
##$TP07= 0
##$TPNAME0= <>
##$TPNAME1= <>
##$TPNAME2= <>
##$TPNAME3= <>
##$TPNAME4= <>
##$TPNAME5= <>
##$TPNAME6= <>
##$TPNAME7= <>
##$TPOAL= (0..7)
0.5 0.5 0.5 0.5 0.5 0.5 0.5 0.5
##$TPOFFS= (0..7)
0 0 0 0 0 0 0 0
##$TUNHIN= 0
##$TUNHOUT= 0
##$TUNXOUT= 0
##$USERA1= <user>
##$USERA2= <user>
##$USERA3= <user>
##$USERA4= <user>
##$USERA5= <user>
##$V9= 5
##$VALIST= <valist>
##$VCLIST= <CCCCCCCCCCCCCCC>
##$VD= 0
##$VDLIST= <DDDDDDDDDDDDDDD>
##$VPLIST= <PPPPPPPPPPPPPPP>
##$VTLIST= <TTTTTTTTTTTTTTT>
##$WBST= 1024
##$WBSW= 4
##$XGAIN= (0..3)
0 0 0 0
##$XL= 0
##$YL= 0
##$YMAX_a= 497497
##$YMIN_a= -641266
##$ZGOPTNS= <>
##$ZL1= 120
##$ZL2= 120
##$ZL3= 120
##$ZL4= 120
##$ABSF1= 14.98509
##$ABSF2= -5.573092
##$ABSG= 5
##$ABSL= 3
##$ALPHA= 0
##$AQORDER= 0
##$ASSFAC= 0
##$ASSFACI= 0
##$ASSFACX= 0
##$ASSWID= 0
##$AUNMP= <proc_prof1d_extract_pilot.lims>
##$AXLEFT= 0
##$AXNAME= <>
##$AXNUC= <1H>
##$AXRIGHT= 0
##$AXTYPE= 0
##$AXUNIT= <>
##$AZFE= 0.1
##$AZFW= 0.1
##$BCFW= 0
##$BC_mod= 0
##$BYTORDP= 0
##$COROFFS= 0
##$CY= 15
##$DATMOD= 1
##$DC= 0
##$DFILT= <>
##$DTYPP= 0
##$F1P= 0
##$F2P= 0
##$FCOR= 0.5
##$FTSIZE= 32768
##$FT_mod= 6
##$GAMMA= 0
##$GB= 0
##$INTBC= 1
##$INTSCL= 1
##$ISEN= 128
##$LB= 0
##$LEV0= 0
##$LPBIN= 0
##$MAXI= 10000
##$MC2= 0
##$MEAN= 0
##$ME_mod= 0
##$MI= 0
##$NCOEF= 0
##$NC_proc= -8
##$NLEV= 6
##$NOISF1= 0
##$NOISF2= 0
##$NSP= 0
##$NTH_PI= 0
##$NZP= 0
##$OFFSET= 14.98509
##$PC= 1
##$PHC0= 183.3563
##$PHC1= 0
##$PH_mod= 1
##$PKNL= yes
##$PPARMOD= 0
##$PPDIAG= 0
##$PPIPTYP= 0
##$PPMPNUM= 2147483647
##$PPRESOL= 1
##$PSCAL= 4
##$PSIGN= 0
##$PYNMP= <proc.py>
##$REVERSE= no
##$SF= 400.02
##$SI= 32768
##$SIGF1= 0
##$SIGF2= 0
##$SINO= 400
##$SIOLD= 32768
##$SPECTYP= <>
##$SREGLST= <1H.CDCl3>
##$SSB= 0
##$STSI= 32768
##$STSR= 0
##$SW_p= 8223.68421052631
##$SYMM= 0
##$S_DEV= 0
##$TDeff= 65536
##$TDoff= 0
##$TI= <>
##$TILT= no
##$TM1= 0
##$TM2= 0
##$TOPLEV= 0
##$USERP1= <user>
##$USERP2= <user>
##$USERP3= <user>
##$USERP4= <user>
##$USERP5= <user>
##$WDW= 1
##$XDIM= 32768
##$YMAX_p= 449418911
##$YMIN_p= -683108
##$CURPLOT= <Network HP LaserJet P1505>
##$CURPRIN= <$Network HP LaserJet P1505>
##$DFORMAT= <normdp>
##$LAYOUT= <+/1D_H.xwp>
##$LFORMAT= <normlp>
##$PFORMAT= <normpl>
##$SURQMSG= 1
$$ End of Bruker specific parameters
$$ ---------------------------------
##NTUPLES= NMR SPECTRUM
##VAR_NAME=  FREQUENCY,     SPECTRUM/REAL,   SPECTRUM/IMAG
##SYMBOL=    X,             R,               I
##VAR_TYPE=  INDEPENDENT,   DEPENDENT,       DEPENDENT
##VAR_FORM=  AFFN,          ASDF,            ASDF
##VAR_DIM=   32768,         32768,           32768
##UNITS=     HZ,            ARBITRARY UNITS, ARBITRARY UNITS
##FACTOR=    0.250966925370066, 1,           1
##FIRST=     8223.43324360094, 31257,        85761
##LAST=      0,             27306,           186781
##MIN=       0,             -683108,         0
##MAX=       8223.43324360094, 449418911,    0
$$ Real data points
##PAGE= N=1
##DATA TABLE= (X++(R..R)), XYDATA
$$ [...]
19564i9766D1476G962b15802O9542m5564k0708A39996E4723J92725b55716e6039
$$ -99766 41476 7962 -215802 -146260 -191824 -212532 139996 54723 247448 -255716 -56039
19552c18103i4282n9264L6561N043c7747m8903j31787b427D4024k1888a71482
$$ -318103 -94282 -153546 -116985 -111942 -37747 -86650 -218437 -2427 44024 22136 -171482
19540A58834A1489N4855R3740O890A0657K20821c40699A29305d2947G8328f3671
$$ 158834 11489 66344 160084 166974 10657 231478 -340699 129305 -42947 78328 -63671
19528C609F63b76456P5758O6525b5750j24525C7229Q9265J35318A10311a6797
$$ 3609 663 -276456 -200698 -134173 -25750 -150275 37229 126494 261812 110311 -16797
19516c9645A58461a22674A73517h7209j94253J07129e7850b2358k4978k13239
$$ -39645 158461 -122674 173517 -87209 -281462 -174333 -57850 -22358 -47336 -260575
19506b60575B8300b3358B4517c62714a03120q537A46322d04528i6022l5342j19293
$$ -260575 28300 -23358 24517 -362714 -103120 -111657 146322 -404528 -96022 -131364 -250657
19495b50657F5710a56991a0270j83453i6682J2163M1983J7087k2492A47688i3339
$$ -250657 65710 -156991 -10270 -193723 -96682 -84519 -42536 -25449 -47941 147688 -93339
19483A43371D9411a47301F3592K1114a20425N7135A25879a16440k85196A28749
$$ 143371 49411 -147301 63592 84706 -120425 -63290 125879 -116440 -401636 128749
19472A09924d6217A1376N2480K7566J21894a78614H168b09353A3893b3893o9826
$$ 109924 -46217 11376 63856 91422 213316 -178614 8168 -209353 13893 -23893 -93719
19461i3719I1118A8499a05117J5344c2587G9247a17703b8409j53454M1667O8863
$$ -93719 91118 18499 -105117 -89773 -32587 79247 -117703 -28409 -181863 -140196 -71333
19450g1333n4345j07398a03519b398k50592a089E9207e1840k90921g7833B75e01966
$$ -71333 -125678 -233076 -103519 -2398 -252990 -1089 59207 -51840 -342761 -77833 275 -501966
19437i0326A66226F2740a52635M4444a8559F4618e35669B8805a08048r3229O6184
$$ -90326 166226 62740 -152635 -108191 -18559 64618 -535669 28805 -108048 -201277 -135093
19426a35093b7954A6758a12200j61731i2792A13407l1727a63450A84080i8889
$$ -135093 -27954 16758 -112200 -273931 -92792 113407 81680 -163450 184080 -98889
19415h9878d1225g615I94J65632d3481a779j89259k90594a12332I4632b09844
$$ -89878 -41225 -7615 994 166626 -43481 -1779 -191038 -481632 -112332 94632 -209844
19403d9845J7790j79292j10509A09808K60960b34607A363K1636f8217k09059B9343
$$ -49845 -32055 -211347 -321856 109808 370768 -234607 1363 22999 -68217 -277276 29343
19391a32308q037G7262d10477e7750m8154k03112c7119j60911O6779c3048I2205
$$ -132308 -140345 77262 -410477 -57750 -105904 -309016 -37119 -198030 -131251 -33048 92205
19379a34977d7971A5017b13414C736K34126a64973L6279A88124a67531A17054
$$ -134977 -47971 15017 -213414 3736 237862 -164973 -128694 188124 -167531 117054
19368c52781A4392J10134r832j7317d20004A07464c49073H0103b56468b5849q7701
$$ -352781 14392 124526 114694 97377 -420004 107464 -349073 80103 -256468 -25849 -113550
19357a13550b4276B26234b69263h0008l29738J4253H3977c00103K2791J02465
$$ -113550 -24276 226234 -269263 -80008 -409746 -395493 83977 -300103 -277312 -174847
19347a74847o6867B05172a49865B67431a16980C1057i0542A1173j916a96812A00662
$$ -174847 -241714 205172 -149865 267431 -116980 31057 -90542 11173 9257 -196812 100662
19335g8139n4516I4935O4350c58782F8229J16708b3246F1137K47113E9091a2589
$$ -78139 -132655 94935 159285 -358782 68229 184937 -23246 61137 308250 59091 -12589
19323d9149m9159A60191D7845P94d69672A2356K2248L0983a91760g9603o4158
$$ -49149 -98308 160191 47845 48639 -469672 12356 34604 65587 -191760 -79603 -143761
19312a43761k49228C9247K34823a0725k14831G6294a06862J2299C82787b1563
$$ -143761 -392989 39247 274070 -10725 -225556 76294 -106862 -94563 382787 -21563
19301f8327E9014J68466G559R3006J7415A0539a12623e3525j04508Q76b4668k2879
$$ -68327 59014 227480 7559 100565 117980 10539 -112623 -53525 -158033 -157157 -24668 -47547
19289d7547k14795J26521C3832a00067d0406E2204i1500k2154L7734j3200B373
$$ -47547 -262342 -135821 33832 -100067 -40406 52204 -91500 -113654 -75920 -89120 2373
19277b42227A8724b10A6684c86927a57527G7748a74760k0349D5946a10758j17196
$$ -242227 18724 -210 16684 -386927 -157527 77748 -174760 -195109 45946 -110758 -227954
19266b27954D35899b68648J13631a5529r2250O888G6698k1037b31823k0223i8966
$$ -227954 435899 -268648 -155017 -15529 -107779 -100891 76698 55661 -231823 -252046 -98966
19254g5536j50820j4355j02525N1456I5519b81346R4151o9027A14138c54493A8601
$$ -75536 -226356 -240711 -343236 -291780 95519 -281346 -187195 -256222 114138 -354493 18601
19242h0191k94106a13222l6345j01443m741C59229E019e986j29967A75023a47686
$$ -80191 -374297 -113222 -149567 -251010 -255751 359229 5019 -5986 -135953 175023 -147686
19230B57082B733h6025o6544A70171b01443f2773j7125C30437j64922G694J15584
$$ 257082 2733 -86025 -152569 170171 -201443 -62773 -79898 330437 165515 7694 123278
19219A23278L9915E3783a71657F6518J04191a65692A19321a09334j35557M5263
$$ 123278 163193 53783 -171657 66518 170709 -165692 119321 -109334 -244891 -199628
19209a99628j38250J03922H4861K12784A32771e4697E4630a88369A3806J30030
$$ -199628 -337878 -233956 84861 297645 132771 -54697 54630 -188369 13806 143836
19199A43836h1506j93790g2274r4489j49019L8873I30h9642j05189B95996a78261
$$ 143836 -81506 -275296 -72274 -166763 -315782 -276909 930 -89642 -194831 295996 -178261
19187g3618C378b8377A786J64006a80952C9067a22802C2782L2971J09219D8309
$$ -73618 3378 -28377 1786 165792 -180952 39067 -122802 32782 65753 174972 48309
19175d06333F2643a13666A41426a07340j55683a14645j40346e5204C0340b1365
$$ -406333 62643 -113666 141426 -107340 -263023 -114645 -254991 -55204 30340 -21365
19164b22849m4550C3061Q2885E4513e2124B17308m6052G6294A3664J18020c35588
$$ -222849 -267399 33061 115946 54513 -52124 217308 171256 76294 13664 131684 -335588
19152e7672m52948f3701k69837J34216I5020d86147f3797n7018E1934c1006o4608
$$ -57672 -510620 -63701 -333538 -199322 95020 -486147 -63797 -120815 51934 -31006 -95614
19141i5614q9387B5103h7281b9576m11186B10184g7038A10219b91986A2517O8243
$$ -95614 -185001 25103 -87281 -29576 -440762 210184 -77038 110219 -291986 12517 80760
19130H0760b08058E5215b5358q9621k0891r4376d8545j33945O9871I096c21j68195
$$ 80760 -208058 55215 -25358 -114979 -135870 -230246 -48545 -182490 -112619 9096 -321 -168516
19118a68516q3331j787g5159B31715C0842a64593G8023a00158j16512H6624d85096
$$ -168516 -251847 -253634 -75159 231715 30842 -164593 78023 -100158 -216670 86624 -485096
19106g856A15440D6187f6931A22512D854a92215K6251D166b60890A22549a38115
$$ -7856 115440 46187 -66931 122512 4854 -192215 -165964 4166 -260890 122549 -138115
19094f976B3787a44714k31551A16783a65941a5371l7460A16584k8834Q535l6384
$$ -6976 23787 -144714 -376265 116783 -165941 -15371 -52831 116584 87750 96285 59901
19083E9901G330c4043B65544q171J3858b12591e8294j10365I2244c675k972l07852
$$ 59901 7330 -34043 265544 257373 271231 -212591 -58294 -168659 92244 -3675 -6647 -314499
19071c14499F9356K68673a46833o3705j17902i892l01208C4706J50671B4269J94825
$$ -314499 69356 338029 -146833 -210538 -328440 -9892 -311100 34706 185377 24269 219094
19060B19094B406b09746B9349j860K4050c73844A27651C2955J49967h129j17222
$$ 219094 2406 -209746 29349 27489 51539 -373844 127651 32955 182922 -8129 -125351
19049a25351C5217N2245A8409b71539g9712q7017P0670b4938a874H8812d7507
$$ -125351 35217 87462 18409 -271539 -79712 -166729 -96059 -24938 -1874 88812 -47507
19037f5412k4921q6973c985q7483j96001h9554j2601H8644C6735c7699q2586D7298
$$ -65412 -90333 -177306 -3985 -91468 -287469 -89554 -102155 88644 36735 -37699 -120285 47298
19024B5581J0294b44467F2913O8129b2847k2294Q14A24329i2937G616d3587p6195
$$ 25581 35875 -244467 62913 131042 -22847 -45141 -44327 124329 -92937 7616 -43587 -119782
19012a19782A18431B5680b31805A33147K2618g4472A2504b2261l8149A88153C9569
$$ -119782 118431 25680 -231805 133147 155765 -74472 12504 -22261 -60410 188153 39569
19000d30973a65170m5618B02519f2580r6741H6169a10167A6091K9309i0578k85460
$$ -430973 -165170 -210788 202519 -62580 -159321 86169 -110167 16091 45400 -90578 -376038
18989c76038E965b50872a03674o7972j27177C6091j595a34774j10649N0464b948
$$ -376038 5965 -250872 -103674 -171646 -298823 36091 34496 -134774 -245423 -194959 -2948
18977e3666C42150a63265B23885o9765b28813F9971a04960m3534m7049m7725d3741
$$ -53666 342150 -163265 223885 154120 -228813 69971 -104960 -148494 -195543 -243268 -43741
18965a43245l7616A11372c59021I7470J24411n1824I505f2350A01487a50235q642
$$ -143245 -180861 111372 -359021 97470 221881 170057 9505 -62350 101487 -150235 -158877
18954a58877B69143D4136b02227m680H9317J62276q7116N6118D7627J05908e8832
$$ -158877 269143 44136 -202227 -206907 89317 251593 164477 220595 47627 153535 -58832
18942g7347l0987K1359A37577a42969e4081A4002f1363G0978k7488a07779G9423
$$ -77347 -108334 -86975 137577 -142969 -54081 14002 -61363 70978 43490 -107779 79423
18930a04853k18954g8726n3836B93615G0320L4507j6875N01b12125g9967B3031
$$ -104853 -323807 -78726 -132562 293615 70320 104827 87952 88453 -212125 -79967 23031
18918a90547C96045a50073G034f1109h344o9584K5343q8776D50522H0969a45570
$$ -190547 396045 -150073 7034 -61109 -8344 -77928 -52585 -141361 450522 80969 -145570
18906A54141E5585J13898p9445e3118C1748b6496A54660J65911b41684D2023b77174
$$ 154141 55585 169483 90038 -53118 31748 -26496 154660 320571 -241684 42023 -277174
18894b52605J00295A05785k6827d31583H8615a28950j81373A28834a0851k62974
$$ -252605 -152310 105785 78958 -431583 88615 -128950 -310323 128834 -10851 -273825
18884b73825A11066b04339j0828C34494c9288J5011q2982A26121d02937O2310
$$ -273825 111066 -204339 -215167 334494 -39288 -24277 -107259 126121 -402937 -340627
18874c40627A73517b12646i1925k3213D6627a07214j8308F8151A6358L5284c35698
$$ -340627 173517 -212646 -91925 -115138 46627 -107214 -125522 68151 16358 51642 -335698
18862c02405J31836p1893a7126q2909M9700k10212f8017n3675A87086n892b82566
$$ -302405 -170569 -242462 -17126 -100035 -50335 -260547 -68017 -121692 187086 181194 -282566
18850a76894a9074k8059C7843c4312A61784h824B8359O2894b12657o7411k2950
$$ -176894 -19074 -47133 37843 -34312 161784 -8824 28359 91253 -212657 -280068 -303018
18839c03018F7800a64905N789A22322J82476a62741e8959j1234B3118L23h6589
$$ -303018 67800 -164905 -159116 122322 304798 -162741 -58959 -70193 23118 23441 -86589
18827F9529K4963a6944j70881A12624m3247A4107a36186A88349p8788a88925C34254
$$ 69529 94492 -16944 -187825 112624 69377 14107 -136186 188349 109561 -188925 334254
18815D34804d3171F7857b0840l7162A07614a24226d4115C60802a31756a1683l2937
$$ 434804 -43171 67857 -20840 -58002 107614 -124226 -44115 360802 -131756 -11683 -44620
18804d4620A04691J38904a89299D9063c8979j37397A39707B1392g7505B1751a33147
$$ -44620 104691 243595 -189299 49063 -38979 -176376 139707 21392 -77505 21751 -133147
18792a73285k35269G9903a69533a3090k24497k7299A64860e2224G0177c4350k91740
$$ -173285 -408554 79903 -169533 -13090 -237587 -264886 164860 -52224 70177 -34350 -326090
18781c26090B02125d13357A70574a64706f6179p4517b8577o6690J7296r1642H5120
$$ -326090 202125 -413357 170574 -164706 -66179 -140696 -28577 -95267 -77971 -169613 85120
18769G4075K38681A16296d4066B36495b16122j22102J02507C7775b68748e4046
$$ 74075 312756 116296 -44066 236495 -216122 -338224 -235717 37775 -268748 -54046
18758a50710l0761L7383j33384D5740b11711K1739I471h6207B75289c23141A38819
$$ -150710 -181471 -144088 -277472 45740 -211711 -189972 9471 -86207 275289 -323141 138819
18746e9463A58272e1107j39097e0170l92141i6412l8739A01040k442d95621a67165
$$ -59463 158272 -51107 -190204 -50170 -442311 -96412 -135151 101040 98598 -495621 -167165
18734b62268k611Q1726d1998N787J0477k4976A9909M2449O6406k6487J21030f7001
$$ -262268 -264879 -183153 -41998 -36211 -25734 -50710 19909 62358 128764 102277 223307 -67001
18721a25692A78447a18617j83822a45275A89351a17544A9101J53073c03165J17952
$$ -125692 178447 -118617 -302439 -145275 189351 -117544 19101 172174 -303165 -185213
18711a85213M7526l3358J6782A46547c1759m40876A88197h0718B917a64633b7165
$$ -185213 -137687 -171045 -154263 146547 -31759 -472635 188197 -80718 2917 -164633 -27165
18699A27652n5775l0153K39601B679R915J28270g2131m2042c2284C17927j03891
$$ 127652 71877 41724 281325 2679 12594 140864 -72131 -114173 -32284 317927 214036
18688B14036d6662k69438a36490I116c43905J68822A34850b35601b7486j13313
$$ 214036 -46662 -316100 -136490 9116 -343905 -175083 134850 -235601 -27486 -140799
18678a40799k50529B14629E7560c80472C2740J07301e0158a4420D112K11693I5811
$$ -140799 -391328 214629 57560 -380472 32740 140041 -50158 -14420 4112 215805 95811
18666D2544a35693H7149a73467D020a93915R4645A56322a8811D881a52494E0426
$$ 42544 -135693 87149 -173467 4020 -193915 -99270 156322 -18811 4881 -152494 50426
18654A03189L2859b98325R9456Q8167J3038J8405n2349d2482a2138D3340a25599
$$ 103189 136048 -298325 -198869 -110702 -97664 -79259 -131608 -42482 -12138 43340 -125599
18642c8680A74267d9088A38163b41652j9270A51996b94117a13704n6710E5012
$$ -38680 174267 -49088 138163 -241652 -260922 151996 -294117 -113704 -170414 55012
18631A41153h7758k2397A39860k1327a2271k30644R8641N2357B51362a69716d9179
$$ 141153 -87758 -110155 139860 118533 -12271 -242915 -144274 -91917 251362 -169716 -49179
18619a77756B16294c80753h8935l4147B40026a25394k1431C1769f5150D8055b72197
$$ -177756 216294 -380753 -88935 -123082 240026 -125394 -146825 31769 -65150 48055 -272197
18607h8688k57444a36273j4806A15054i3954A06810b0598B54446b4340k25978
$$ -88688 -346132 -136273 -151079 115054 -93954 106810 -20598 254446 -24340 -250318
18597b50318J24059K1013l1549m9960B01458a7541B86369j08224b29718f358A48658
$$ -250318 -126259 -105246 -136795 -186755 201458 -17541 286369 178145 -229718 -6358 148658
18585G143a78312C4637b43804B47267B4604K01109B6388R7547d8482j30994A72121
$$ 7143 -178312 34637 -243804 247267 24604 225713 26388 123935 -48482 -179476 172121
18573A59155j4135J44357G6740b16061j03582B59542A07444a87940e3366j35203
$$ 159155 145020 289377 76740 -216061 -319643 259542 107444 -187940 -53366 -188569
18563a88569A05183b09383J8439d6313k09511I3149d43004i575j74601H9169a99554
$$ -188569 105183 -209383 -190944 -46313 -255824 93149 -443004 -9575 -184176 89169 -199554
18551d44714a66614j22411a27729K4196b6322m0197A72543A2039i376j72196F3063
$$ -444714 -166614 -289025 -127729 -103533 -26322 -66519 172543 12039 -9376 -181572 63063
18539a68540j36852b0339k64456e3686A5162a59873c3584D15725e0210B97946
$$ -168540 -305392 -20339 -284795 -53686 15162 -159873 -33584 415725 -50210 297946
18528a91226O6365a644j33111e193A84183a48756C16104E3017R8680a83691q5462
$$ -191226 -124861 -1644 -134755 -5193 184183 -148756 316104 53017 151697 -183691 -269153
18517b69153d1388F0548h1122j20987m0971b2171j18514j26093m6908a49190B67024
$$ -269153 -41388 60548 -81122 -202109 -243080 -22171 -140685 -266778 -313686 -149190 267024
18505b21349i8583A63936i8350b3024D808b50228J17236h475q9681A18813R2157
$$ -221349 -98583 163936 -98350 -23024 4808 -250228 -132992 -8475 -98156 118813 210970
18494B10970G7476B0066h374o9236A64519c6388k27816E0488a55905g1456k66343
$$ 210970 77476 20066 -8374 -77610 164519 -36388 -264204 50488 -155905 -71456 -337799
18483c37799A2851e1613b0134C184b48802A34862c77898C6045b38272E5885a33917
$$ -337799 12851 -51613 -20134 3184 -248802 134862 -377898 36045 -238272 55885 -133917
18471c18188g6036A4072h6181l49530A03251J79815b83395M4371a02174F3854
$$ -318188 -76036 14072 -86181 -435711 103251 283066 -283395 -239024 -102174 63854
18460b36822B08847e862j39698n6881C3911i0697E40106f8440C54992g0003C5252
$$ -236822 208847 -5862 -145560 -202441 33911 -90697 540106 -68440 354992 -70003 35252
18448d0624q1828K7451A22158f4471j58204B57098i413A14605a63113A28180a21307
$$ -40624 -122452 -95001 122158 -64471 -222675 257098 -9413 114605 -163113 128180 -121307
18436c32586H6547j9623a1273j0878l03299H4177b19064A14119a93561K1061A14935
$$ -332586 86547 66924 -11273 -22151 -325450 84177 -219064 114119 -193561 -172500 114935
18424a56565N7464A97253p5801g4418A87866b14504A21156a20344C7452f6273
$$ -156565 -99101 197253 121452 -74418 187866 -214504 121156 -120344 37452 -66273
18413e4564C4125a52040p7932j97911C3581L8892M031K70735G4112b4598k00580
$$ -54564 34125 -152040 -229972 -427883 33581 72473 76504 347239 74112 -24598 -225178
18402b25178b728l29331C35742a08641j42074L730a09482d2189F7122l2127A1648
$$ -225178 -2728 -332059 335742 -108641 -250715 -246985 -109482 -42189 67122 34995 11648
18390d49257H7380b8129G7995L84009A47522j7152e9955C13826j22367a2057j622
$$ -449257 87380 -28129 77995 462004 147522 130370 -59955 313826 191459 -12057 -13679
18379a3679k88997A16836n1989l2414J01584b43630a20001c9717f670A58933h2805
$$ -13679 -302676 116836 64847 32433 134017 -243630 -120001 -39717 -6670 158933 -82805
18367g8286o9005A44585g446A09201a91688C5253M8752J0543m3980A0000L7496
$$ -78286 -147291 144585 -7446 109201 -191688 35253 84005 94548 50568 10000 47496
18356D7496J79842j4320a32054q245D7328O0108b05773A1477B468K20164a44153
$$ 47496 227338 213018 -132054 -140299 47328 107436 -205773 11477 2468 222632 -144153
18344h7382o779o5640a4235j25317r4930A81164k0715d6478E2783b428H4295J28203
$$ -87382 -94161 -159801 -14235 -139552 -234482 181164 160449 -46478 52783 -2428 84295 212498
18332B12498E6910K3890d1146j85471a1717B03286c6663J0895j06193C0818a91689
$$ 212498 56910 80800 -41146 -226617 -11717 203286 -36663 -25768 -131961 30818 -191689
18320A31279J3031E1257b15954A5111J203J41191q409g9494A71881b04408c1453
$$ 131279 144310 51257 -215954 15111 16314 157505 149096 -79494 171881 -204408 -31453
18308i2925E9575A7520b24632O0859g8672m2995C6529a44159N419L4053B3417
$$ -92925 59575 17520 -224632 -163773 -78672 -121667 36529 -144159 -138740 -104687 23417
18296b7978A87268a60341a2844B5125b57086E3925c5392o93k810j21351j67477
$$ -27978 187268 -160341 -12844 25125 -257086 53925 -35392 -36085 -38895 -160246 -327723
18285c27723I6422d9171a10l7992j56103O0736C2255k987Q1601K73104h5589A3136
$$ -327723 96422 -49171 -110 -38102 -194205 -133469 32255 29268 110869 383973 -85589 13136
18272a31553B22021a30911e6726A6451J84413r0257a74293N5483e1851j15873
$$ -131553 222021 -130911 -56726 16451 200864 110607 -174293 -118810 -51851 -167724
18262a67724A02689a59688A8686f751B30508C6895K67883a47549B94650a06419
$$ -167724 102689 -159688 18686 -6751 230508 36895 304778 -147549 294650 -106419
18251d9803j8286B46209a04564M7394B62396r6587m3046l8844a04507B2974b99242
$$ -49803 -68089 246209 -104564 -57170 262396 165809 122763 83919 -104507 22974 -299242
18239A78277H6943K58119b3648k21594A38567D8354c72229A64549E0712h8855
$$ 178277 86943 345062 -23648 -245242 138567 48354 -372229 164549 50712 -88855
18228e1090j04761a6397A66150P9503a36819A7965e8075B42267j02604B7960b85988
$$ -51090 -155851 -16397 166150 245653 -136819 17965 -58075 242267 139663 27960 -285988
18216A32052e769n4619B3199h7153J7737b0068r7475A20561b92561K5557B1852
$$ 132052 -5769 -60388 23199 -87153 -69416 -20068 -117543 120561 -292561 -267004 21852
18204b58742C59241a99452M0831q9961J00368P0260o6243n1134M1667K3370D3811
$$ -258742 359241 -199452 -158621 -248582 -148214 -77954 -144197 -195331 -153664 -130294 43811
18192B8546h8157j3608m527c4107m7519o3347A5063b96637p9642a29860d0887
$$ 28546 -88157 -101765 -106292 -34107 -81626 -144973 15063 -296637 -376279 -129860 -40887
18180b34966d4619F3405b51044D0478A7673b76338a9865l28218A05608A4997f3841
$$ -234966 -44619 63405 -251044 40478 17673 -276338 -19865 -348083 105608 14997 -63841
18168i3108A88857a30141D4986b61744G5815i9187c6144J825H8233g8843A94760
$$ -93108 188857 -130141 44986 -261744 75815 -99187 -36144 -34319 88233 -78843 194760
18156a21570A39490b53633A53245a15113j51145A47341D6478a57932J9306M2550
$$ -121570 139490 -253633 153245 -115113 -266258 147341 46478 -157932 -138626 -96076
18146i6076a2721k35007q3454A61694B6463b6748A60563d0070A26612a47105j3471
$$ -96076 -12721 -247728 -331182 161694 26463 -26748 160563 -40070 126612 -147105 -160576
18135a60576L7586B74754A9531c7236A14239a42215M4347M2010B4922L6878b59714
$$ -160576 -122990 274754 19531 -37236 114239 -142215 -97868 -55858 24922 61800 -259714
18123a39738B9925i2907I9145K17830q3547A01743K72327a33369q4951H973J7387
$$ -139738 29925 -92907 99145 316975 233428 101743 374070 -133369 -218320 8973 26360
18112B6360O5464b40564j95193D0697g1131a0810B6879a73271j02366K6144B89688
$$ 26360 91824 -240564 -435757 40697 -71131 -10810 26879 -173271 -275637 -249493 289688
18100a49859J5897H5502a08418l1502j02849A4764J13495b74683H2308b85522
$$ -149859 -133962 85502 -108418 -139920 -242769 14764 128259 -274683 82308 -285522
18089b80208J31469K940q8843A57024J37452c05137H5805c0107j34527A8385c72823
$$ -280208 -148739 -145799 -234642 157024 294476 -305137 85805 -30107 -164634 18385 -372823
18077B4388h0518D9826a02101M446B3736l776c05879D10134F3375a10921A06166
$$ 24388 -80518 49826 -102101 -97655 23736 19960 -305879 410134 63375 -110921 106166
18065E1597a11552A85783g8072p6888A54833b1399j50558J063B83800r0081b01496
$$ 51597 -111552 185783 -78072 -154960 154833 -21399 -171957 -170894 283800 193719 -201496
18053F8762a80761f3841j60673e4248A25486a11859A67315a16530d8826j46226
$$ 68762 -180761 -63841 -224514 -54248 125486 -111859 167315 -116530 -48826 -195052
18043a95052a6779C42713j53935b02826f0775A05593b03952a4106A11538f8952
$$ -195052 -16779 342713 188778 -202826 -60775 105593 -203952 -14106 111538 -68952
18032c02704A53619f9416j0216B5659n19J11178a70761A55324a07886o0921b7132
$$ -302704 153619 -69416 -79632 25659 25140 136318 -170761 155324 -107886 -168807 -27132
18020a44982A3404a90375c9148A05594K0340b50554i3471A71159a90134B5165
$$ -144982 13404 -190375 -39148 105594 125934 -250554 -93471 171159 -190134 25165
18009a95288g910l1048j8997m1974m4105A54744a64041A38356e3084A17969b5123
$$ -195288 -7910 -38958 -57955 -99929 -144034 154744 -164041 138356 -53084 117969 -25123
17997b90549a42229D6745f1619j24440B01958B4814g1747C8469K53910f3942k3912
$$ -290549 -142229 46745 -61619 -186059 201958 24814 -71747 38469 292379 -63942 -87854
17986h7854n5715d3281q0280l86A79139G4558a79399c6768k58835J21112K516
$$ -87854 -143569 -43281 -123561 -123947 179139 74558 -179399 -36768 -295603 -174491 -171975
17975a71975e6969j00707A31165a83879B3632P1526K12907a70084A25238m3172
$$ -171975 -56969 -157676 131165 -183879 23632 95158 308065 -170084 125238 82066
17965H2066A2385c21441f0695l21557a7839k04548B9110d1985D02969A24828E1320
$$ 82066 12385 -321441 -60695 -382252 -17839 -222387 29110 -41985 402969 124828 51320
17953a15432b4915G2544R526a17133J2561B02204f4179r1513o5314h6897C01258
$$ -115432 -24915 72544 82070 -117133 -104572 202204 -64179 -155692 -221006 -86897 301258
17941a75164O688m3365B3109a21051d82B2244b10158D17995I1943R386L5829E7868
$$ -175164 -168476 -211841 23109 -121051 -482 22244 -210158 417995 91943 101329 137158 57868
17928b87177A05998c0730f19k33910b0346j7510o899A03596E812J33983d3850
$$ -287177 105998 -30730 -619 -234529 -20346 -37856 -44755 103596 5812 139795 -43850
17916c39572D11310a09510B94403E6885d31097G4792N856l6070f4788A77409G0106
$$ -339572 411310 -109510 294403 56885 -431097 74792 80648 44578 -64788 177409 70106
17904D729J67160P9519r0406m8242b53941J15641C5620f4719j53515f5931H1484
$$ 4729 171889 251408 161002 112760 -253941 -138300 35620 -64719 -218234 -65931 81484
17892a74300b7409j81210k7455g1414p2289p7796E5551K80637C4611J67552h2631
$$ -174300 -27409 -208619 -236074 -71414 -143703 -221499 55551 336188 34611 202163 -82631
17880c09262H029J68247a3084A04350A7941Q0325i723k56738a9042h013k24208
$$ -309262 8029 176276 -13084 104350 17941 98266 -9723 -266461 -19042 -8013 -232221
17869b32221A65068F0995b02081B13612r8822D1324M38408a92846A62793c9325
$$ -232221 165068 60995 -202081 213612 114790 41324 479732 -192846 162793 -39325
17858C71761A7127a12270h323k85485R536B3135c65675B61449A27273b575m34716
$$ 371761 17127 -112270 -8323 -293808 -284272 23135 -365675 261449 127273 -2575 -437291
17847d37291b8217A55157m2687K9004a27183M029A4338h7474j29377B0176Q0741
$$ -437291 -28217 155157 112470 141474 -127183 -123154 14338 -87474 -216851 20176 100917
17836A00917b29059A27121Q1835c1839j64684P9539G2561c3404j39272M174C96553
$$ 100917 -229059 127121 208956 -31839 -196523 -116984 72561 -33404 -172676 -168502 396553
17824A25662a81041k9331a3451G5502i0762c109m8961I5409b38235h2697a0547
$$ 125662 -181041 -210372 -13451 75502 -90762 -3109 -52070 95409 -238235 -82697 -10547
17812C7700c7575A42484h8909k2396N1679A16093b28846f2002p1697D6738J648
$$ 37700 -37575 142484 -88909 -111305 -59626 116093 -228846 -62002 -133699 46738 48386
17801D8386b3605F4607J68013D2597b65277A98575c85344e5841a4708l14809K812
$$ 48386 -23605 64607 232620 42597 -265277 198575 -385344 -55841 -14708 -329517 -326705
17790c26705A55275b68091A83503i8476K2597C00545a65896c4224B11912p7157
$$ -326705 155275 -268091 183503 -98476 -75879 300545 -165896 -34224 211912 134755
17780A34755l7097b43208c1017k95353J41308A67383o5571c0429j42640n825C23420
$$ 134755 97658 -243208 -31017 -326370 -185062 167383 101812 -30429 -173069 -178894 323420
17768B1631a15316F1013Q5661N3250J47233j08335A08784C337a09776G5663g0290
$$ 21631 -115316 61013 146674 199924 347157 238822 108784 3337 -109776 75663 -70290
17756A44808c1230B33247q9040a90922b8555k72476c7187a6760A34022J89090
$$ 144808 -31230 233247 144207 -190922 -28555 -301031 -37187 -16760 134022 323112
17746C23112p514a10609A15220E4202g7164j84979B08820I168J32432n9724O825
$$ 323112 315598 -110609 115220 54202 -77164 -262143 208820 9168 141600 81876 88701
17735H8701e6645E00243A31411J37920b78385B94057g6551l03180B31557a80381
$$ 88701 -56645 500243 131411 269331 -278385 294057 -76551 -379731 231557 -180381
17724a1746k47385B40790j11317d99529a45077c5413A61283G9808B3525a16072
$$ -11746 -259131 240790 129473 -499529 -145077 -35413 161283 79808 23525 -116072
17713E3663g228B18404h5935C7887h0415j92022E6858G450K42638a76378H9687
$$ 53663 -7228 218404 -85935 37887 -80415 -272437 56858 7450 250088 -176378 89687
17701e8605A13937a95229K8939c6777C28330a49469e7060A15635M7191D1662P108
$$ -58605 113937 -195229 -166290 -36777 328330 -149469 -57060 115635 162826 41662 48770
17690D8770a50749F5083C0249J69334f6525A4076J25663N6180a86240K6145D6273
$$ 48770 -150749 65083 30249 199583 -66525 14076 139739 195919 -186240 -160095 46273
17678C1773L18O1468D4527K3210J39636c557k11906d9651A63957J67247c9425
$$ 31773 32091 93559 44527 67737 207373 -3557 -215463 -49651 163957 331204 -39425
17666A37093C4118a9928C9091K102J68627a85749B4457K66796m6562k096c6387
$$ 137093 34118 -19928 39091 41193 209820 -185749 24457 291253 244691 242595 -36387
17654F7334c9508A27751g3121L5270D05436d7997B09802i844m0056k08909C28718
$$ 67334 -39508 127751 -73121 -37851 405436 -47997 209802 -9844 -49900 -258809 328718
17642G9986g679G1567c90j20524E7902B553Q785J8631L14610a84279K1964A38020
$$ 79986 -7679 71567 -390 -120914 57902 2553 11338 29969 344579 -184279 -162315 138020
17629e411j35096f0576J7485A31682e9698G9263J41923a68025C08210a74992a5962
$$ -5411 -140507 -60576 -43091 131682 -59698 79263 221186 -168025 308210 -174992 -15962
17617G544a6117r0148B83788b11509i8641L1415a6096k85376D56467a39923D2811
$$ 7544 -16117 -106265 283788 -211509 -98641 -67226 -16096 -301472 456467 -139923 42811
17605A65649e9307I8109K08730b3270H6374n747K32038b7058o0102A00160a20807
$$ 165649 -59307 98109 306839 -23270 86374 80627 312665 -27058 -87160 100160 -120807
17593b94287F9028b51361F7111O6516J68566h9734A10548j7450L0383a0879k63788
$$ -294287 69028 -251361 67111 133627 302193 -89734 110548 93098 123481 -10879 -274667
17582b74667B0585N7333b50825C09717M3741F8982B2748a00729A49831L42117
$$ -274667 20585 77918 -250825 309717 353458 68982 22748 -100729 149831 491948
17572D91948H5049Q9750A993K08456H027J71771k3520d8511l40250A24245F0569
$$ 491948 85049 174799 1993 210449 8027 179798 156278 -48511 -388761 124245 60569
17560b13212f3657B64012F7984L98247A70490o4274R737g7564I7128a85975G7537
$$ -213212 -63657 264012 67984 466231 170490 106216 115953 -77564 97128 -185975 77537
17548B27447f6293c216A69078d8407k4237E9811B2107J78641b51229d2144C43133
$$ 227447 -66293 -3216 169078 -48407 -72644 59811 22107 200748 -251229 -42144 343133
17536A02130L25438j78200r5764c38679A67571g7181A77376J13685r5424c11900
$$ 102130 427568 249368 153604 -338679 167571 -77181 177376 291061 195637 -311900
17525H558a0218j63184F3396R3744J3809b8067j97236E7165P9853K7134O2528
$$ 8558 -10218 -173402 63396 157140 170949 -28067 -225303 57165 137018 164152 226680
17514B26680K19409D6326e2845A37421b17040B68261j04682j2167c39124E5010
$$ 226680 446089 46326 -52845 137421 -217040 268261 163579 151412 -339124 55010
17503C38104a27453q8758N5248f7063B69014c617G891K7936K69485F7161M6398
$$ 338104 -127453 -216211 -160963 -67063 269014 -3617 7891 35827 305312 67161 113559
17492A13559K25359b3424n6810F447L7598J44812a78807A14550l2110B862K18418
$$ 113559 338918 -23424 -80234 6447 44045 188857 -178807 114550 82440 2862 221280
17481B21280a3029C71544a11567A81157g684C45513A10789K14521A50301c9535
$$ 221280 -13029 371544 -111567 181157 -7684 345513 110789 325310 150301 -39535
17470C22472c016A74153p1659l1593c0377C07480h0274A1191K42423p5739K06379
$$ 322472 -3016 174153 102494 70901 -30377 307480 -80274 11191 253614 177875 384254
17459C84254K36818l02669c32619C96030A26969J39915j21013o6742M10096B11113
$$ 384254 621072 318403 -332619 396030 126969 266884 145871 79129 489225 211113
17448B49034c129C29398J53903J2601B18399O7255k7056A22149b305E1873J10656
$$ 249034 -3129 329398 483301 495902 218399 285654 258598 122149 -2305 51873 162529
17437A62529b3800C4288K48798j33243l5971l9612M60359b3939a717C2597J84762
$$ 162529 -23800 34288 283086 149843 113872 74260 534619 -23939 -1717 32597 217359
17426B17359J20636F6957P4141L24805j37245I1176L51761A16035K72837a47158
$$ 217359 337995 66957 141098 465903 328658 91176 442937 116035 388872 -147158
17415B20586K48618j48150I6962d07335H5360N4906J08682H2626P0765h2266A75018
$$ 220586 469204 321054 96962 -407335 85360 140266 248948 82626 153391 -82266 175018
17403e9072C34683I3801d7880C08557g0689F6370L60028A46500E1323I571K02968
$$ -59072 334683 93801 -47880 308557 -70689 66370 426398 146500 51323 9571 212539
17392B12539o1448b1719A24498d4100D03815j86916N4525A10233K33447j43386
$$ 212539 151091 -21719 124498 -44100 403815 216899 271424 110233 343680 200294
17382B00294P7873l6091J1842j09297A2660K79452h3286F6423a29879D14184B4505
$$ 200294 278167 242076 253918 144621 12660 292112 -83286 66423 -129879 414184 24505
17370E5208b1030C67531J44468A61101o3008L40265A95029b00213I8455a00086
$$ 55208 -21030 367531 511999 161101 98093 438358 195029 -200213 98455 -100086
17359a03768D3743g9430B02432j00165e5270j25968E29097j68952f5674B874N5122
$$ -103768 43743 -79430 202432 102267 -55270 -181238 529097 360145 -65674 2874 57996
17348E7996L6466N1090P9032q2162F7673a94475E390L9795h7378A28544M2805
$$ 57996 94462 145552 224584 142422 67673 -194475 5390 45185 -87378 128544 171349
17337A71349b43853A39889l1673l4956r576K62185K0703o0999j8367o6854Q7670
$$ 171349 -243853 139889 108216 73260 63684 325869 346572 285573 267206 200352 288022
17326B88022q080A32073J7994f9143C9446M66475b6744E08145B17621n032a3092
$$ 288022 279942 132073 150067 -69143 39446 505921 -26744 508145 217621 212589 -13092
17314A28536a65793B10699o0451R8560J0035H6762M3887a54154J191a5111n2233
$$ 128536 -165793 210699 150248 248808 258843 86762 130649 -154154 -152963 -15111 -67344
17303f7344E02167A45594h8921c7787B43245m3412J16681k9219j8183A03928J05619
$$ -67344 502167 145594 -88921 -37787 243245 199833 316514 287295 269112 103928 209547
17292B09547J15607b2794F9084N6954R0484L4937n4760E5702L22839c43764D9939
$$ 209547 325154 -22794 69084 126038 216522 251459 196699 55702 378541 -343764 49939
17280A15237J43709q9705J44415C4475b3123C73085j02527r18A05332K44204P0552
$$ 115237 258946 169241 313656 34475 -23123 373085 270558 269640 105332 349536 420088
17269D20088h6573B44175F9109a03407B08172g6373A43471J43518I1184L3247
$$ 420088 -86573 244175 69109 -103407 208172 -76373 143471 286989 91184 124431
17259A24431C4307J37593F0004a06253B56309E0602b8172B3368K11852N6766j7599
$$ 124431 34307 171900 60004 -106253 256309 50602 -28172 23368 235220 291986 274387
17248B74387j782H7099K10914k8066O1366j00289M1686J97779c0058B3579b0894
$$ 274387 272605 87099 298013 269947 331313 231024 272710 470489 -30058 23579 -20894
17236A30286P1866K09696H0353C7096L4537J45240K08474j38385k2671j29708
$$ 130286 202152 411848 80353 37096 71633 216873 425347 286962 264291 134583
17226A34583J6002J82485b47701C96070A40237B7303K13171o4466C1333M45592
$$ 134583 150585 333070 -247701 396070 140237 27303 240474 176008 31333 476925
17216D76925A87017p7319P2970q8500J11657H2555J24412n223O3034J34842A7693
$$ 476925 187017 109698 182668 94168 205825 82555 206967 201744 264778 399620 17693
17204C38099D1649K56312A27009J37932j4397D6958K23163o9686a63876A32098
$$ 338099 41649 297961 127009 264941 250544 46958 270121 200435 -163876 132098
17193B06130a75222B57845P8042f1743E67753A41073k7385K11920P9176a30942
$$ 206130 -175222 257845 335887 -61743 567753 141073 113688 325608 404784 -130942
17182A56206L7443K87655j25948j18359K1619j17140K56689j03534J3790p5666
$$ 156206 193649 481304 355356 236997 258616 141476 398165 294631 308421 232755
17172B32755K73235A26722K72846A28439L06690C58O33418B41208k0864M2905
$$ 232755 505990 126722 399568 128439 435129 358 633776 241208 220344 263249
17162B63249K86337B51529N7814F2313K96935j73975k4639J98634K14008I7622
$$ 263249 549586 251529 309343 62313 359248 185273 160634 359268 573276 97622
17151B40102K6660l9597L79319k6496k32865j44004J60486j51313m3692k6771
$$ 240102 266762 227165 606484 579988 347123 203119 363605 212292 168600 141829
17141A41829K60630K03079q0722R3003k14377L6523J29803B50355I949M90394
$$ 141829 402459 605538 524816 617819 403442 439965 569768 250355 9949 500343
17131E00343j31587A03755J72031J88137B29196a44838D27241M7126j86916j39748
$$ 500343 368756 103755 275786 463923 229196 -144838 427241 474367 287451 147703
17121A47703K90303k4249j59919I3135K59460k289F8256N95793k67555P5226k09293
$$ 147703 438006 413757 253838 93135 352595 350306 68256 664049 396494 471720 262427
17110B62427r6974J78556n5323J63897K18039q8818k55815A13340L45201j62395
$$ 262427 165453 344009 288686 452583 670622 581804 325989 113340 458541 296146
17100B96146K0607j45998K32710K43863j61115J58750j86860j91987q4395J46100
$$ 296146 316753 170755 403465 647328 486213 644963 458103 266116 181721 327821
17090C27821L48240C04284c3043C56387L47371B79359N3250A57232J46140l4773
$$ 327821 676061 304284 -33043 356387 703758 279359 332609 157232 303372 268599
17080B68599K137J01280K44475B43871J51869K05441r6691j6067B23625N6775
$$ 268599 270736 372016 616491 243871 395740 601181 504490 488423 223625 280400
17070B80400m9240J86407g6660E27099p0305j44652K27157B26598J45195J8884
$$ 280400 231160 417567 -76660 527099 456794 312142 539299 226598 371793 390677
17060C90677J92566j88771k8474R5401j51743L4931J86346K09238K641j33152
$$ 390677 583243 394472 365998 461399 309656 344587 530933 740171 742812 609660
17050F09660n5456Q5882p7813K1555M5716k58443K6162L77739j92267k68775K94631
$$ 609660 554204 640086 562273 583828 629544 371101 397263 775002 582735 313960 608591
17039F08591j5304M3726p177J8880p4197j01692N5954K28479l16105m4747J64964
$$ 608591 593287 637013 629836 648716 574519 472827 528781 757260 441155 396408 561372
17028E61372J21059K16748k46205C08869M54533j27622j32431K5552L18231k98269
$$ 561372 682431 899179 652974 308869 763402 635780 503349 528901 847132 548863
17018E48863M24941m60669j9989N1940J50979o2438P3707J28886l26679J12040
$$ 548863 973804 513135 493146 545086 696065 633627 707334 836220 509541 621581
17008F21581k4949M2735k33901L18263K5162q8220k42563k4006O1616L02722L40969
$$ 621581 596632 639367 405466 723729 748891 660671 418108 394102 455718 758440 1099409
16997A099409l48130l45605P15164P1454n39155J99665p5818K24351j90565l59805
$$ 1099409 751279 405674 1120838 1192292 653137 852802 776984 1001335 810770 450965
16987D50965M75571l37683J85154q1390L0867o7088K84420r7436L7799l7377J33848
$$ 450965 926536 588853 774007 692617 723484 656396 940816 843380 881179 843802 977650
16976I77650k88476R5598M36928j77695l18738K1144M96969l82904O3202J39551
$$ 977650 689174 784772 1221700 1044005 725267 746411 1243380 860476 923678 1063229
16966A063229r7550j04328K00477n0963o3305k1731J75514K1394l59769L18180
$$ 1063229 965679 861351 1061828 1010865 947560 925829 1101343 1122737 762968 1081148
16956A081148L56933m19469l08721R6690J79529r2177K91555K28668k62355k5016
$$ 1081148 1438081 1018612 709891 806581 986110 893933 1185488 1414156 1151801 1126785
16946A126785l0582l5262J54664J17055j25592j15116J08232Q503K81752n38406
$$ 1126785 1096203 1060941 1215605 1332660 1207068 1091952 1200184 1208687 1490439 952033
16936I52033M42897j51301j7857K04267k41848K14109j96100L06097k93947J78561
$$ 952033 1394930 1243629 1225772 1430039 1188191 1402300 1206200 1512297 1218350 1396911
16926A396911J64947n09361L35820J38606r6164J39388k40922J82612K97021p7925
$$ 1396911 1561858 1052497 1388317 1526923 1430759 1570147 1329225 1511837 1808858 1730933
16916A730933k37400R8516j68756j67212K32184J04710j76651o3063M9938J23325
$$ 1730933 1493533 1592049 1423293 1256081 1488265 1592975 1416324 1353261 1403199 1526524
16906A526524p9797K33627k00323J88013L7500P0041n6684m0693O11706q75885
$$ 1526524 1446727 1680354 1480031 1668044 1705544 1775585 1718901 1678208 2289914 1414029
16896A414029N49295r0887p911J48402j74668j66059K19236j38148K18839j62772
$$ 1414029 1963324 1872437 1864526 2012928 1838260 1672201 1891437 1753289 1972128 1809356
16886A809356M46512J3529j67799m7072K58837k46951J66546J47214P3993o8782
$$ 1809356 2255868 2269397 2101598 2054526 2313363 2066412 2232958 2380172 2454165 2385383
16876B385383Q2861K7692j5577K14255n19749L10048J21953j18725L51714l72933
$$ 2385383 2468244 2495936 2480359 2694614 2174865 2484913 2606866 2488141 2839855 2466922
16866B466922o8404K06182j50736O20787j2604j64290m7365j6218K9606j35082
$$ 2466922 2398518 2604700 2453964 3074751 3062147 2897857 2850492 2834274 2863880 2728798
16856B728798J99214J69884J40852K4138j90768J23774L29328j9209P7258j50446
$$ 2728798 2928012 3097896 3238748 3262886 3072118 3195892 3525220 3506011 3583269 3432823
16846C432823J13842k3192J3718J34507K2664N282K60494k26649n7223N9601O36209
$$ 3432823 3546665 3523473 3537191 3671698 3694362 3699644 3960138 3733489 3676266 3735867 4372076
16835D372076k09084j93357Q5719J96257J19753L39809k02721L28202p7868L6835
$$ 4372076 4162992 3969635 4055354 4251611 4371364 4711173 4508452 4836654 4758786 4795621
16825D795621l1476J75572L00897J9201k30849K69208J201K03800o6613K64799
$$ 4795621 4764145 4939717 5240614 5259815 5028966 5298174 5299375 5503175 5436562 5701361
16815E701361J43066J43313J35375M16949j93434q4817J21434K88504o0318O14797
$$ 5701361 5844427 5987740 6123115 6540064 6346630 6261813 6383247 6671751 6611433 7226230
16805G226230O0213k2052n9494K11868J51058K96270M46634O8255j99159M70039
$$ 7226230 7286443 7264391 7204897 7416765 7567823 7864093 8310727 8378982 8179823 8649862
16795H649862L49097R7826j8558K39326M28373J65051L65622L37189M17283K68390
$$ 8649862 8998959 9096785 9078227 9317553 9745926 9910977 10276599 10613788 11031071 11299461
16785A1299461M88646P7652j12096O66957K80047K21362N46527M9487Q53050K99355
$$ 11299461 11788107 11865759 11753663 12420620 12700667 12922029 13468556 13518043 14371093 14670448
16775A4670448O31248K00643P39523M14666N26448N19810O13473O55153Q10822
$$ 14670448 15301696 15502339 16241862 16656528 17182976 17702786 18316259 18971412 19782234
16766A9782234N50330O25514J019405N12088J254704O12416J072683R23685J010699
$$ 19782234 20332564 20958078 21977483 22489571 23744275 24356691 25429374 26353059 27363758
16757B7363758J074590J393092J211576J227771J188953J585382J763397J431846
$$ 27363758 28438348 29831440 31043016 32270787 33459740 35045122 36808519 38240365
16749C8240365J824062K347755J866761K098744K610882K302211K586878L063840
$$ 38240365 40064427 42412182 44278943 46377687 48988569 51290780 53877658 56941498
16741E6941498K973304L145299L234107L844993M266716M268886M612689M720194
$$ 56941498 59914802 63060101 66294208 70139201 74405917 78674803 83287492 88007686
16733H8007686N583802N032620N910461O480287O248652O892737O949091P276926
$$ 88007686 93591488 98624108 104534569 111014856 117263508 124156245 131105336 138382262
16725A38382262P467994P180775P182147O860767O131452N989321M819933L744731
$$ 138382262 145850256 153031031 160213178 167073945 173205397 179194718 184014651 187759382
16717A87759382L288260J348139P0753p66751k131583l556325m344122n527879
$$ 187759382 191047642 192395781 192466534 191699783 189568200 186011875 181667753 176139874
16709A76139874n866061o659389p105080p208542p590448p492573p212708o827727
$$ 176139874 170273813 163614424 156509344 149300802 141710354 134217781 127005073 120177346
16701A20177346p068767o793954o361621n689775n586555n169278m734929m982735
$$ 120177346 113108579 106314625 99953004 94263229 88676674 83507396 78772467 73789732
16693G3789732m276121l683110m025354l052202l465136k742875k979026k415303
$$ 73789732 69513611 65830501 61805147 58752945 55287809 52544934 49565908 47150605
16685D7150605k537543k382310k000830k072451j715176j669993j651493j660542
$$ 47150605 44613062 42230752 40229922 38157471 36442295 34772302 33120809 31460267
16677C1460267j397055j044300j347529j095628j357255p94805r64165j238517
$$ 31460267 30063212 29018912 27671383 26575755 25218500 24423695 23459530 22221013
16669B2221013q74388o51779n06372j107837o69792o40609n64023m79408q71176
$$ 22221013 21346625 20694846 20188474 19080637 18410845 17770236 17206213 16726805 15855629
16660A5855629n18355n68141p5710l49494j008930J9460o76997j75944j47414
$$ 15855629 15337274 14769133 14693423 14343929 13334999 13354459 12677462 12501518 12354104
16651A2354104p35970j42074n17585k99675n23981k04776k81511l14760k62625
$$ 12354104 11618134 11476060 10958475 10658800 10134819 9930043 9648532 9333772 9071147
16642I071147j07911k53365k62325m81610m5454O9061j38278l96764o5753l58609
$$ 9071147 8963236 8709871 8447546 7965936 7920482 7989543 7851265 7454501 7388748 7030139
16632G030139p0004k87099l30700l2306j14552j92388k91636L6519L1414j58005
$$ 7030139 6960135 6673036 6342336 6310030 6195478 6003090 5711454 5747973 5779387 5621382
16622E621382R6411k34049j69859j46555K52934l1917m25329l06080J81285m00058
$$ 5621382 5717793 5483744 5313885 5167330 5420264 5388347 4963018 4656938 4838223 4438165
16612D438165j09183K12002r500k35859M3438m32651J04137l24904J83096j61801
$$ 4438165 4328982 4540984 4531484 4295625 4339063 3906412 4010549 3685645 3868741 3706940
16602C706940k09420o4565J38679j855N9683m62045l3673k11096P9815p8307J08932
$$ 3706940 3497520 3432955 3571634 3569779 3629462 3167417 3133744 2922648 3002463 2924156 3033088
16591C033088n3413j55847L51839n49866K26662j63649L27391l27845J56647R0544
$$ 3033088 2979675 2823828 3175667 2625801 2852463 2688814 3016205 2688360 2845007 2935551
16581B935551j78134L5985l97584M8308J18469l18122L12028r5957k91126K17330
$$ 2935551 2757417 2793402 2395818 2444126 2562595 2244473 2556501 2460544 2169418 2386748
16571B386748j17502j16936j70181j6555K86454m99931R7016q4207M35482k19738
$$ 2386748 2269246 2152310 1982129 1965574 2252028 1752097 1849113 1764906 2200388 1980650
16561A980650L77903k78230j22165M407k49597j83433L44320J5143j47992L956
$$ 1980650 2358553 2080323 1958158 1962565 1712968 1529535 1873855 1888998 1741006 1744962
16551A744962j91382J16343j99228R1081j43908M2056K7871l9683k7877L20291
$$ 1744962 1553580 1669923 1470695 1561776 1417868 1459924 1487795 1448112 1420235 1740526
16541A740526l34167J73545l35898N4656J87328j50334p7784m2336K07602j90167
$$ 1740526 1406359 1579904 1244006 1298662 1485990 1335656 1257872 1215536 1423138 1232971
16531A232971L92195k04132K7030n71172N93913k25099P1394k43769L9696M641
$$ 1232971 1625166 1421034 1448064 876892 1470805 1245706 1317100 1073331 1113027 1117668
16521A117668j55192K57925k16892L05565j11216L4656k93379J10966k01023M71100
$$ 1117668 962476 1220401 1003509 1309074 1197858 1232514 939135 1050101 849078 1320178
16511A320178J92510m18614q7691K5335q3605J18986M7934l45449K07229k1762
$$ 1320178 1512688 1094074 1006383 1031718 948113 1067099 1115033 769584 976813 955051
16501I55051j9353K24476n29386Q5132J63197Q4401P8214p7138k08860L03194
$$ 955051 935698 1160174 630788 715920 879117 963518 1041732 964594 755734 1058928
16491A058928k69273q701J14755P1914l86340K63643L74955m26907J65449j85422
$$ 1058928 789655 780954 895709 967623 581283 844926 1219881 792974 958423 773001
16481G73001k75706J55257J42854Q3008l05145K43902j24574J12625j17414Q7607
$$ 773001 497295 652552 795406 878414 573269 817171 692597 805222 687808 775415
16471G75415j53735J46130k51314j54899L03892L25625l01880r1895o4085L13181
$$ 775415 621680 767810 516496 361597 665489 991114 689234 597339 533254 846435
16461H46435j92506J55419k22741m01R9168J13796k89387L14580O7196D43423
$$ 846435 653929 809348 586607 586206 685374 799170 509783 824363 891559 443423
16450H58978J8318D31083M1503J21955j13336p20J89012j24416n1158P0878j55235
$$ 858978 877296 431083 472586 594541 481205 480485 669497 545081 493923 564801 409566
16439D09566o4104L37821B51359q598L10368J59888k5348M8216j30493B72629
$$ 409566 345462 683283 251359 242761 553129 713017 687669 735885 605392 272629
16428F78098j83738B37679J34088K44321j47503m7320J40453q1311J04177k03551
$$ 678098 494360 237679 371767 616088 468585 421265 561718 480407 584584 381033
16418C81033F4501K22472M6015l6426o1766K17566K19356l02095N1041J45446
$$ 381033 64501 286973 332988 296562 234796 452362 671718 369623 420664 566110
16408E66110B42827J99853K8407A13534L67470l8816p8287K90427o4695B62808
$$ 566110 242827 442680 471087 113534 481004 442188 363901 654328 589633 262808
16397B44297L5604K18967L7507j96824N7926L42997l20086A34544J86142L11828
$$ 244297 279901 498868 536375 339551 397477 740474 420388 134544 320686 632514
16387F32514j5175A93637L63605k13534L77944j76088j26309K7852j188A96719
$$ 632514 617339 193637 557242 343708 721652 545564 419255 447107 445919 196719
16376A71210J41722j19873M2315J14705g578C42378A33432J07332C174L58527
$$ 171210 312932 193059 235374 350079 -7578 342378 133432 240764 3174 361701
16366C61701k5542H1225N2665E0324J63953j07129J69325K33235K0435A94017
$$ 361701 336159 81225 133890 50324 214277 107148 276473 509708 530143 194017
16355A71314r349j1025J80041M43881B34351E5817K19913c4058C28411r2498P7953
$$ 171314 161965 150940 330981 774862 234351 55817 275730 -34058 328411 235913 313866
16344C13866j03326J25460b6854A91848n3452J42300F3727k2700K73889N6771
$$ 313866 210540 336000 -26854 191848 138396 280696 63727 41027 314916 371687
16334C71687A10919K11976b56422E31294j83608L77239C32888M117A23284r975
$$ 371687 110919 322895 -256422 531294 347686 724925 332888 337005 123284 113309
16324A13309M52939a03848D4145e6267A46748P1117J03577N639F4909J81793H2591
$$ 113309 566248 -103848 44145 -56267 146748 217865 321442 327081 64909 246702 82591
16312B86124j08428J63657j06820d6087k7409E38804j90270j06836B0988M11875
$$ 286124 177696 341353 234533 -46087 -73496 538804 348534 241698 20988 432863
16302D32863j0989A31576K30465O533j08970J29958a57442A22753d399C16744
$$ 432863 421874 131576 362041 368574 259604 389562 -157442 122753 -4399 316744
16291B65506a71027B02908q1733J66808A40341J70729O0532h2379f633B30048
$$ 265506 -171027 202908 121175 287983 140341 311070 371602 -82379 -6633 230048
16280C62684H6618R0139e7481B35173A00192H102J90361r4983d6502B49641F1861
$$ 362684 86618 176757 -57481 235173 100192 8102 198463 103480 -46502 249641 61861
16268B49381o1095A0982J36915l173a22388a5233O703B14154a05703C81110F7894
$$ 249381 188286 10982 147897 144724 -122388 -15233 -8530 214154 -105703 381110 67894
16256C25942c2078j32022A84392J30164n1669G60J04352f0933I6647a58921a5296
$$ 325942 -32078 -164100 184392 314556 262887 760 105112 -60933 96647 -158921 -15296
16244a70893B96064q7816j7985m9926g6376B92780a51708P2034H2860J75089K50739
$$ -170893 296064 208248 190263 140337 -76376 292780 -151708 -79674 82860 257949 508688
16233E08688b6453A97899o0155K3610c4461H2309a67140A94632r1669J15237R4816
$$ 508688 -26453 197899 137744 161354 -34461 82309 -167140 194632 102963 218200 313016
16222C13016A19353k4200e0565o5416C56837r5315a20745p1006b4971C1462b61785
$$ 313016 119353 95153 -50565 -115981 356837 261522 -120745 -191751 -24971 31462 -261785
16210b02655c1429B42934a19617G0443K82575A65283J11782N847n6669L7407o6584
$$ -202655 -31429 242934 -119617 70443 353018 165283 277065 282912 226243 263650 197066
16199A97066O5703D4763J08980J43188j32141q0207J48878c01978i2053B7503
$$ 197066 262769 44763 153743 296931 164790 84583 233461 -301978 -92053 27503
16188C68528A5256K0613c03560D5034J67750K6127n376A09182m2857R9703a69523
$$ 368528 15256 35869 -303560 45034 212784 238911 233535 109182 66325 166028 -169523
16176A8155K54900H6288l0165a85346M0753O7088J6481A72308b8899A64457K10240
$$ 18155 273055 86288 56123 -185346 -144593 -77505 -61024 172308 -28899 164457 374697
16165C74697c7149d732m152A68858a972p801B97985D0129a13845A58534b44651
$$ 374697 -37149 -4732 -8884 168858 -1972 -9773 297985 40129 -113845 158534 -244651
16153B76182a56935C7395K1383A0944Q7154a50602B93112G8270b20194B79709
$$ 276182 -156935 37395 58778 10944 98098 -150602 293112 78270 -220194 279709
16142A39371N8942C3880J57849k2025d1968c662l52456A84609l6103k9440A9310
$$ 139371 198313 33880 191729 169704 -41968 -3662 -356118 184609 148506 119066 19310
16130B63732A16120f6574B7838b83251I2324d42299B15333b03297A00488m1618
$$ 263732 116120 -66574 27838 -283251 92324 -442299 215333 -203297 100488 58870
16120E8870a86064j16968B42600b74046A56735G8147b71915B37168I3290P869
$$ 58870 -186064 -303032 242600 -274046 156735 78147 -271915 237168 93290 101159
16110A01159P4223a38935B52038b29278C39511l2042D7919Q8041A9955d2306E7551
$$ 101159 175382 -138935 252038 -229278 339511 307469 47919 135960 19955 -42306 57551
16098A91269R2097a42355j15524J08530B37498A7683J70578a07152M7493b683
$$ 191269 283366 -142355 -257879 -149349 237498 17683 188261 -107152 -59659 -2683
16087E9486j8314h0466A05637b2198D91483g5363j6706o1721B7069O4429J18727
$$ 59486 41172 -80466 105637 -22198 491483 -75363 -92069 -153790 27069 91498 210225
16076B10225a3147A45426m2110d75834A13462H511b15946C0228K8985q993J7324
$$ 210225 -13147 145426 103316 -475834 113462 8511 -215946 30228 59213 50220 67544
16065F7544J87530f6607E165P632F251b40210e6363E4310a06036j02420N7365
$$ 67544 255074 -66607 5165 12797 6251 -240210 -56363 54310 -106036 -208456 -151091
16054a51091A677i3698G2478a9754C2881c4248k79674G0936K7395l2544J37664
$$ -151091 1677 -93698 72478 -19754 32881 -34248 -313922 70936 98331 65787 203451
16043B03451c6969B1882g0045A00901c43881j2402A01675c78168a8331k4944k6753
$$ 203451 -36969 21882 -70045 100901 -343881 -356283 101675 -378168 -18331 -43275 -70028
16032g0028C0944D715e2884B10801H8580f8851C8863J94436n2209C0073L1868
$$ -70028 30944 4715 -52884 210801 88580 -68851 38863 233299 181090 30073 61941
16021F1941o010b26027A13372b57266L394A27360i000j07761j12744h6708A97865
$$ 61941 55931 -226027 113372 -257266 -253872 127360 -9000 -116761 -229505 -86708 197865
16009b42007L7867A17489N8506c40719h956A31058a87700a4610j28531O1184j2350
$$ -242007 -204140 117489 175995 -340719 -8956 131058 -187700 -14610 -143141 -81957 -94307
15998i4307J0758k47782J53552O1571e6462H7956J95421b00683d8740b0030j14319
$$ -94307 -83549 -331331 -177779 -116208 -56462 87956 283377 -200683 -48740 -20030 -134349
15987a34349E4973B1507b9799A64969B9160K03966l1075K21886j38726f5754E8794
$$ -134349 54973 21507 -29799 164969 29160 233126 202051 423937 285211 -65754 58794
15975b48374G8888a91640e6805C9142c262k130A5512K62996D0125c16288A30608
$$ -248374 78888 -191640 -56805 39142 -3262 -5392 15512 278508 40125 -316288 130608
15963B87199b43714C7228a16503D4080J77393b25989h5373A08892C6359a79459
$$ 287199 -243714 37228 -116503 44080 221473 -225989 -85373 108892 36359 -179459
15952i7481B4843R484d5544j42832C6991j5641K02183b41348J01153J0923A47017
$$ -97481 24843 34327 -45544 -188376 36991 21350 223533 -241348 -140195 -129272 147017
15940c936G6986j8556R4250n5440O2313P3071a92983F509K34877d27750D4222
$$ -3936 76986 58430 152680 97240 159553 232624 -192983 6509 241386 -427750 44222
15928c28267O7000D6532b22588h4821c5455j56368F6391h807B46544n8366a4509
$$ -328267 -261267 46532 -222588 -84821 -35455 -191823 66391 -8807 246544 188178 -14509
15916g6791E1454Q7425b7139j83574B07786c57224H0747h7642l3553A4091a03789
$$ -76791 51454 138879 -27139 -210713 207786 -357224 80747 -87642 -121195 14091 -103789
15904a20405A77557c6481j6937k54019e6972r4734J440j8726L2537C8392H0i436
$$ -120405 177557 -36481 -53418 -307437 -56972 -151706 -150266 -168992 -136455 38392 80 -9436
15891C7761e2448J2950n0964r1116B1126d3236j57098Q5558E1451J248a15486
$$ 37761 -52448 -39498 -90462 -181578 21126 -43236 -200334 -114776 51451 52699 -115486
15879a37949I5026k3529a5164I1899b4417k5029B2110o778E258e5977A8223J85600
$$ -137949 95026 71497 -15164 91899 -24417 -49446 22110 15332 5258 -55977 18223 203823
15867B03823a08621b156j73871h7323J774E3872d19008a91916d4404H2191a00311
$$ 203823 -108621 -2156 -176027 -87323 -85549 53872 -419008 -191916 -44404 82191 -100311
15855A3461K44641a7890l6032A23348g5653G8327a16560k45770A82536D8425c06255
$$ 13461 258102 -17890 -53922 123348 -75653 78327 -116560 -362330 182536 48425 -306255
15843A35473J5866a8322A85705b55651C32992a07678b1615j14650o2396A59926
$$ 135473 151339 -18322 185705 -255651 332992 -107678 -21615 -136265 -198661 159926
15832e0311A52570d5607j3659A29156c54891J55789m1258B81718j34933g8782
$$ -50311 152570 -45607 -59266 129156 -354891 -199102 -240360 281718 146785 -78782
15821C2739b24824N9536n1111M1304d6533J3318m6526l7868j2464A48321n0198
$$ 32739 -224824 -165288 -216399 -175095 -46533 -33215 -79741 -117609 -130073 148321 98123
15810I8123J82623b40499D652a86733A51374A6299b24092A60278K0747j5629g3284
$$ 98123 280746 -240499 4652 -186733 151374 16299 -224092 160278 181025 165396 -73284
15798B28326a23404A70536J09655c9405F0269b5928A6610a89373J2817C55650
$$ 228326 -123404 170536 280191 -39405 60269 -25928 16610 -189373 -176556 355650
15787b19886h7538e341C21122j25720c53828E796M14657b56889O5795c2160D1383
$$ -219886 -87538 -5341 321122 195402 -353828 5796 420453 -256889 -191094 -32160 41383
15775A15621A8611N5828b63618c9316B3984a08514b9428l5826I5554P7020h4686
$$ 115621 18611 74439 -263618 -39316 23984 -108514 -29428 -65254 95554 172574 -84686
15763h9952b8200j02102k84585B36310i7677B72217d1647G5259C0571d14131A02553
$$ -89952 -28200 -130302 -414887 236310 -97677 272217 -41647 75259 30571 -414131 102553
15751a72073e352I971i9226E412M0200b52197m5010a16177G1460K5347N1098k2523
$$ -172073 -5352 9971 -99226 5412 45612 -252197 -297207 -116177 71460 96807 147905 125382
15739A25382g0442r1315L2808G8450A4293d5912j00956I7628b05464C4910c71294
$$ 125382 -70442 -161757 -128949 78450 14293 -45912 -146868 97628 -205464 34910 -371294
15727e3134A17562j3566b25950f6398r4794P6867j34086H8553d471l33541B43849
$$ -53134 117562 103996 -225950 -66398 -161192 -84325 -218411 88553 -4471 -338012 243849
15715I4597R5589b9711j253F8812a03141A76512a45781K1942H9622a58024G3683
$$ 94597 190186 -29711 -30964 68812 -103141 176512 -145781 -123839 89622 -158024 73683
15703B0964J08438d9681G366K33132A13303a0452c199A10173b8763j75306A97452
$$ 20964 129402 -49681 7366 240498 113303 -10452 -3199 110173 -28763 -204069 197452
15691C18982a44393A90718a87710B00483b29437i7078B0538e0466j42199A15296
$$ 318982 -144393 190718 -187710 200483 -229437 -97078 20538 -50466 -192665 115296
15680A07722a21751j42006J09608j8770g4775A71188b78001A5622c48668i2980
$$ 107722 -121751 -263757 -154149 -172919 -74775 171188 -278001 15622 -348668 -92980
15669D36481A64408J06453j4540b1075H446a2045A27961e8546k01384B71418d8774
$$ 436481 164408 270861 256321 -21075 8446 -12045 127961 -58546 -259930 271418 -48774
15657a50191B4769J38446a41919L4846D258a37481n0078j91087A31946f106j28724
$$ -150191 24769 163215 -141919 -107073 4258 -137481 -187559 -378646 131946 -6106 -134830
15646a34830g568B291L3256J2484c982j59252M7452a3746l32118a1302k42629
$$ -134830 -7568 2291 35547 48031 -3982 -163234 -115782 -13746 -345864 -11302 -253931
15635b53931E0361a31774l4632O0678B89346i2889q3570A13136a18446A6150L16765
$$ -253931 50361 -131774 -166406 -105728 289346 -92889 -176459 113136 -118446 16150 332915
15624C32915h6923A3761a48929j43466A95234a50513A33575h5716j4797H8252
$$ 332915 -86923 13761 -148929 -292395 195234 -150513 133575 -85716 -100513 88252
15613b47442C08085b7585m80508c4849A57910e2306C2820a4033r8997A81238a93940
$$ -247442 308085 -27585 -508093 -34849 157910 -52306 32820 -14033 -113030 181238 -193940
15601D59717d4179r8930q1723g9845F1484a29771I6581A5628N37450g6146I9242
$$ 459717 -44179 -143109 -224832 -79845 61484 -129771 96581 15628 553078 -76146 99242
15589A50440a1093A69602F9538L6162J18132B7219d8741j71650C67733B9388b03512
$$ 150440 -11093 169602 69538 105700 223832 27219 -48741 -220391 367733 29388 -203512
15577F9648a7856A32943D4824a12293c5401k2564G0602J12379a81124r8407e4353
$$ 69648 -17856 132943 44824 -112293 -35401 -57965 70602 182981 -181124 -279531 -54353
15565f1241j16184N7932j57057C34667c18192A17070K10777f4266n5445A28550
$$ -61241 -177425 -119493 -276550 334667 -318192 117070 327847 -64266 -119711 128550
15554C85965F4664a60578B1259H29a73829G5324c91274k6746A17132B2180a34668
$$ 385965 64664 -160578 21259 829 -173829 75324 -391274 -418020 117132 22180 -134668
15542c8395A07869a8087j12265b8796j81629E9589K10757B3889a82844r847L1499
$$ -38395 107869 -18087 -130352 -28796 -210425 59589 270346 23889 -182844 -192691 -161192
15531a61192O0172L8989B00447O6978a14941A32199b17972b9921l96821f5698
$$ -161192 -101020 -62031 200447 267425 -114941 132199 -217972 -29921 -426742 -65698
15520a84543j0183g371b135E0025a62409k9184A6385a28080B51224b4664H6381
$$ -184543 -194726 -7371 -2135 50025 -162409 -191593 16385 -128080 251224 -24664 86381
15508A83147b44939A91210F926c5083q162C4747h5741j13732G8956g5608k76498
$$ 183147 -244939 191210 6926 -35083 -43245 34747 -85741 -199473 78956 -75608 -352106
15497c52106L43a7056n8910H3777a15376k7506B65609c22487A97240i2610F9855
$$ -352106 -351763 -17056 -75966 83777 -115376 -142882 265609 -322487 197240 -92610 69855
15485c5279k99967J60199A07751b29363i9926b3900A56207a13044A98834A9061
$$ -35279 -335246 -175047 107751 -229363 -99926 -23900 156207 -113044 198834 19061
15474D17361I7397a36681A93215a60868B2286b04666h6776B88956b18246b4353
$$ 417361 97397 -136681 193215 -160868 22286 -204666 -86776 288956 -218246 -24353
15463g7953A82262a03519k31987I0511a2977A27578a65430N1848M3558A47875
$$ -77953 182262 -103519 -335506 90511 -12977 127578 -165430 -113582 -70024 147875
15452b33755E9931a83153G6721C7792b91404i733B3579J19791N5478B4828f9498
$$ -233755 59931 -183153 76721 37792 -291404 -9733 23579 143370 198848 24828 -69498
15440c648l53A48001B8130A0724P7468J81202g2158L3959a3662I312R3571f3165
$$ -3648 -4001 148001 28130 10724 88192 269394 -72158 -38199 -13662 9312 102883 -63165
15427b55175R8932H2496c9907E4504R8314C3586c26894G5323a42670M6179D6113
$$ -255175 -156243 82496 -39907 54504 152818 33586 -326894 75323 -142670 -96491 46113
15415A35022A6103b1817l2059n1557q2841f8366E4045a61120j17498c071A8447
$$ 135022 16103 -21817 -53876 -105433 -188274 -68366 54045 -161120 -278618 -3071 18447
15403C5484J97450a22798k7705C28211B8181J18141g8379m1602K8710F7819J74376
$$ 35484 232934 -122798 -150503 328211 28181 146322 -78379 -119981 -91271 67819 242195
15392B42195A13837i0069A18467J13702A11783D3117h0899j45839D2296O7003
$$ 242195 113837 -90069 118467 232169 111783 43117 -80899 -226738 42296 109299
15382A09299b7377A37360b28820Q5986m2186D7957L915a03989C82545A9036a65954
$$ 109299 -27377 137360 -228820 -142834 -185020 47957 51872 -103989 382545 19036 -165954
15370d1990j83778f0907j67920B38634C5296a83713A02715a74529H5926a0943
$$ -41990 -225768 -60907 -228827 238634 35296 -183713 102715 -174529 85926 -10943
15359b90746B12489I1919L5448a36863A24277a41558a1580B7859K49354a39301
$$ -290746 212489 91919 127367 -136863 124277 -141558 -11580 27859 277213 -139301
15348A78729A8502b975o8995D8782a05013j83617g7530j89825A3480a0745k08067
$$ 178729 18502 -2975 -71970 48782 -105013 -288630 -77530 -267355 13480 -10745 -218812
15337b18812L169B50551d1098C16460g5654J2534A33987a46469C45538A11710
$$ -218812 -215643 250551 -41098 316460 -75654 -63120 133987 -146469 345538 111710
15326c1681l9359A94245e3948A47699N225C7917J46641J05661c9540k4084D5836
$$ -31681 -71040 194245 -53948 147699 152924 37917 184558 290219 -39540 -63624 45836
15314a7289A3062R0345B6122N8879J30363a37412A16073b82702A52277I720O5583
$$ -17289 13062 103407 26122 85001 215364 -137412 116073 -282702 152277 9720 75303
15303G5303J86368e7425k01616i0437k228n5210A55086b16120B10901a99702C74941
$$ 75303 261671 -57425 -259041 -90437 -92665 -147875 155086 -216120 210901 -199702 374941
15291B98710B0986a62311B6138R2762a95337k7889A57328b7160j28446C39508
$$ 298710 20986 -162311 26138 118900 -195337 -223226 157328 -27160 -155606 339508
15280a85047C28721a15227B93433f8817B28252E8761b7024j5328C022a82673B29321
$$ -185047 328721 -115227 293433 -68817 228252 58761 -27024 -42352 3022 -182673 229321
15268B02642E1192M21732a10386A7564c48663B58034j24340J29039n6051j0807
$$ 202642 51192 472924 -110386 17564 -348663 258034 133694 262733 206682 195875
15258A95875E915e778D0454O4701A9549K63799K71871A20278E5844L96985Q05546
$$ 195875 5915 -5778 40454 105155 19549 283348 555219 120278 55844 452829 1258375
15247A258375j30715L6714M56732E77440j86867A69307J9695a81206A2902g7216
$$ 1258375 1127660 1164374 1621106 577440 390573 169307 189002 -181206 12902 -77216
15236b7338F0933R5329E9786a07763A8057a29240j42392r3210A31068N5320a07608
$$ -27338 60933 156262 59786 -107763 18057 -129240 -271632 -364842 131068 186388 -107608
15224B5663J30662m2361B9035a3011C13733C3203b2640B18607B1444N1309J31858
$$ 25663 156325 113964 29035 -13011 313733 33203 -22640 218607 21444 72753 204611
15213B04611a04630A88763J06305E0482J64511r3126J98138e044p3034B11009
$$ 204611 -104630 188763 295068 50482 214993 121867 320005 -5044 -78078 211009
15202C00391A24128a33166C77193j06455a09430b2633A34424N5818g14l33032
$$ 300391 124128 -133166 377193 270738 -109430 -22633 134424 190242 -714 -333746
15192c33746A83673J04196J83324A37087A0880J17797J4110e3966o9453k1749
$$ -333746 183673 287869 471193 137087 10880 128677 142787 -53966 -123419 -145168
15182a45168A35383K9207C5089h3951B5939b1274k6837A37473c6168C03857A33370
$$ -145168 135383 164590 35089 -83951 25939 -21274 -48111 137473 -36168 303857 133370
15170C7017J29828p6003L6877b49436b7329o0144F03h652q4723j6747B56195J9088
$$ 37017 166845 90842 127719 -249436 -27329 -87473 603 -8652 -93375 -110122 256195 275283
15158B75283j22103L0192R1423j08782E8398N1920L3687a64289A06744c9850A57121
$$ 275283 153180 183372 274795 166013 58398 110318 144005 -164289 106744 -39850 157121
15146a47596A56540J26046d3798A10574P8348K25153G5097J26614Q256G4910A8446
$$ -147596 156540 282586 -43798 110574 188922 414075 75097 201711 209967 74910 18446
15134G2342Q3095a6550m9317B05411J6245D5602M81786b5503C76137B4818b07329
$$ 72342 155437 -16550 -65867 205411 221656 45602 527388 -25503 376137 24818 -207329
15122a50268C19813N5124A01840a9910B86951c0073A16338l2277a35628I3013
$$ -150268 319813 374937 101840 -19910 286951 -30073 116338 84061 -135628 93013
15111a13418A37148b2130H3250k0545J14434a25246B47952C1665a06572d347B49484
$$ -113418 137148 -22130 83250 62705 177139 -125246 247952 31665 -106572 -4347 249484
15099B22810m7913N6464e4618C33577A51317a30914C5151J04105a15060p035C9421
$$ 222810 174897 231361 -54618 333577 151317 -130914 35151 139256 -115060 -122095 39421
15087B85184j09903J299R2417K618e6170b392E4408J37524J17162J05648h1200
$$ 285184 175281 176580 268997 271615 -56170 -2392 54408 191932 309094 414742 -81200
15075C49823A44845J82073j55228f5830A23451n1100a46030B10443N2964g0538
$$ 349823 144845 326918 171690 -65830 123451 72351 -146030 210443 263407 -70538
15064D8208K36921F0297Q3314J77669J11116j93961K24852J1849A48166K86271
$$ 48208 285129 60297 143611 321280 432396 238435 463287 475136 148166 434437
15054D34437j76463n271K7239h616E6222a64260C6499L26479A28584Q0288D0356
$$ 434437 257974 252703 279942 -8616 56222 -164260 36499 362978 128584 208872 40356
15042C22565J87959J60758A81762L36056A11477B3816i4444C36172r3306a15681
$$ 322565 510524 671282 181762 517818 111477 23816 -94444 336172 242866 -115681
15031B54340a51202A42072m9259J10009k1561d232C81575d1831B55638P6337K6898
$$ 254340 -151202 142072 92813 202822 181261 -4232 381575 -41831 255638 331975 358873
15020C58873A56702K58954R9581B4456J77023O9499D74K44127M8450p0848D2600
$$ 358873 156702 415656 515237 24456 201479 270978 474 244601 293051 222203 42600
15008c4517j32748B13696L1407i0673C37186p8325K19345a9287A24533J14782
$$ -34517 -167265 213696 245103 -90673 337186 258861 478206 -19287 124533 239315
14998B39315j15449K32116H8818K15768q5414p1757p3530K27156F6855K93114
$$ 239315 123866 355982 88818 304586 219172 147415 73885 301041 66855 359969
14988C59969b526A5649P2012j4897a50429D16168A46636A1844J53897J88475o5533
$$ 359969 -2526 15649 87661 72764 -150429 416168 146636 11844 165741 354216 288683
14977B88683K11846H6075d0135H8142K1418C4296L89031j52033f7605E77911D1733
$$ 288683 500529 86075 -40135 88142 109560 34296 423327 271294 -67605 577911 41733
14965A5922L44401j03358K55457o0895I3179L67328j05192L9548F9600O08783
$$ 15922 360323 256965 512422 451527 93179 460507 355315 394863 69600 678383
14955F78383B99084l8646m9205J19260o9702o3748D4326K05771J28039J26673
$$ 678383 299084 260438 211233 330493 260791 197043 44326 250097 378136 504809
14945E04809F3332K35195K53812j57102F755N86511j31275B26854b1600C20136
$$ 504809 63332 298527 552339 395237 6755 593266 461991 226854 -21600 320136
14934F13579k96006A12960J21611L3720N85603B14942J48303A62960L02439j01055
$$ 613579 317573 112960 234571 268291 853894 214942 363245 162960 465399 364344
14924C64344m9309r5076Q0928j29655L61375j24467j59971j03012J61028j36534
$$ 364344 315035 219959 300887 171232 532607 408140 248169 145157 306185 169651
14914A69651R3122Q0169J5783A02944K78817C7399K05447J05748P8502j22988
$$ 169651 262773 342942 358725 102944 381761 37399 242846 348594 427096 304108
14904C04108j39455L54514k34904c0990H4679J40086K59281L8556m8068j64922
$$ 304108 164653 519167 284263 -30990 84679 224765 484046 522602 474534 309612
14894C09612j40385J12984L04539k64438J37911Q0145B33866N58449k48453k13149
$$ 309612 169227 282211 586750 322312 460223 540368 233866 792315 543862 330713
14884C30713L14188j23083k18440J26185j8971A82809L82529k54394j8726j8762
$$ 330713 644901 521818 303378 429563 410592 182809 565338 310944 292218 273456
14874B73456J22377j76667K17387A61418L09554J8510k08354P2454o9847N7486
$$ 273456 395833 219166 436553 161418 470972 489482 281128 353582 283735 341221
14864C41221R3004K70513k38724q4380K56191B30844K47683j24802A44922K23001
$$ 341221 434225 704738 466014 381634 637825 230844 478527 353725 144922 367923
14854C67923m0609o9595j20946L72333k12517J43759K51291l23695j68904M06860
$$ 367923 327314 257719 136773 509106 296589 440348 691639 367944 199040 605900
14844F05900k3387A36146L27887J6551j08541K49080k27190A06372L40156J0251
$$ 605900 582513 136146 464033 480584 372043 621123 393933 106372 446528 456779
14834D56779J15260K3207j59759J14827j69733N3871J25886L33457j95821q2415
$$ 456779 572039 595246 435487 550314 380581 434452 560338 893795 697974 615559
14824F15559k81625N3783K77329j42547O0783L0408l7782k59291I7048L32525
$$ 615559 333934 387717 665046 522499 583282 613690 575908 316617 97048 429573
14814D29573K69052k60472m8825M02647C25105L27334j99128l0974k03428L42816
$$ 429573 698625 438153 389328 791975 325105 652439 453311 422337 218909 561725
14804E61725o2757A24484L72653j59830J24776K13000j3907C3797N88527O3043
$$ 561725 498968 124484 497137 337307 462083 675083 661176 33797 622324 685367
14794F85367j88322j46875M18524j34008k21868J28337N9032R3264r0615K2261
$$ 685367 497045 350170 768694 634686 412818 541155 600187 693451 602836 625097
14784F25097o9324j32l654q640N9162J44508j22790K5309B08918J98580k0969
$$ 625097 555773 555641 551987 543347 602509 747017 624227 649536 208918 407498 386529
14773C86529K10552J71869l54127L38258o981K05067D61363q8430J41934J90740
$$ 386529 597081 768950 414823 753081 746100 951167 461363 372933 514867 705607
14763G05607P6656l83457L53570j01621M5873k21597M00665l87302L33032j12434
$$ 705607 782263 398806 752376 650755 696628 475031 875696 488394 821426 708992
14753G08992r7256p5507Q8483O117L3366J19426q4105r3659K74447N5300C92793
$$ 708992 611736 536229 624712 630829 664195 783621 699516 605857 880304 935604 392793
14741F56055L03743D56778K16401k6798K46885j66150J12417p1967P9375k70629
$$ 656055 959798 456778 673179 646381 893266 727116 839533 767566 846941 576312
14731E76312J95282L33713D99958O06891m9693M4201m26606p8351j4160L35677
$$ 576312 771594 1105307 499958 1106849 1057156 1101357 674751 596400 582240 917917
14721I17917L478j47950J59682J1606k94209J71874j01463N15509n37364J48214
$$ 917917 921395 773445 933127 944733 650524 822398 720935 1236444 699080 847294
14711H47294J37167k71697K13745K67834E54316M20091j41787K88319l36499J14333
$$ 847294 984461 712764 926509 1194343 554316 974407 832620 1120939 784440 898773
14701H98773l23289J06266K81774m5378j00632L42427k19249L9380k07903L16122
$$ 898773 575484 681750 963524 918146 817514 1159941 940692 980072 772169 1088291
14691A088291k22867K95337k00270O1385l12561K59792K15838k84974J79880J65572
$$ 1088291 865424 1160761 960491 1021876 709315 969107 1184945 899971 1079851 1245423
14681A245423k7963k30128q9376L28745m65542J74541J41298Q6193J3375K45514
$$ 1245423 1217460 987332 897956 1226701 761159 935700 1076998 1163191 1176566 1422080
14671A422080m83065j61268N81589m53154K9420O3323L58636J44567l82841j05049
$$ 1422080 939015 777747 1359336 906182 935602 998925 1357561 1502128 1119287 1014238
14661A014238J98326l94030L62290J49839q066j35884o484R5012n094k94347L09353
$$ 1014238 1212564 818534 1180824 1330663 1322597 1186713 1180229 1275241 1270147 975800 1285153
14650A285153j82803r0348K28080Q4029K32646m45242m1157L62761j73503R7280
$$ 1285153 1102350 1012002 1240082 1324111 1556757 1111515 1070358 1433119 1259616 1356896
14640A356896m3964L41034k57394k21831K9053J78691k21777J35307P0353J01496
$$ 1356896 1312932 1653966 1396572 1174741 1203794 1382485 1160708 1296015 1366368 1467864
14630A467864K62640m86609M65040n6202n61396M91670j4297M6624Q9251k19856
$$ 1467864 1730504 1243895 1708935 1652733 1091337 1583007 1568710 1615334 1704585 1484729
14620A484729m8601Q6469o3659J67905k23645M97624m59892O3668K53957j21178
$$ 1484729 1436128 1522597 1458938 1626843 1403198 1900822 1440930 1504598 1758555 1637377
14610A637377L04j93765K17212q5608M51174k71992J55098l21533M90459k05816
$$ 1637377 1637681 1443916 1661128 1575520 2026694 1754702 1909800 1588267 2078726 1872910
14600A872910q2199J577J06332l11415L59886n1324m04888N23415l28630K58136
$$ 1872910 1790711 1792288 1898620 1587205 1947091 1895767 1490879 2014294 1685664 1943800
14590A943800K6619k01990N45104n65913J56788K65839j80430k44888M15957l748
$$ 1943800 1970419 1768429 2313533 1747620 1904408 2170247 1989817 1744929 2160886 2157138
14580B157138o1636L03455p6691j07457l15151K33975K44868l49805L80652j3797
$$ 2157138 2095502 2398957 2322266 2214809 1899658 2133633 2378501 2028696 2409348 2395551
14570B395551J45962r3361j31J24825l02919K69417J88100m4633L505k71559L94326
$$ 2395551 2541513 2448152 2448021 2572846 2269927 2539344 2727444 2682811 2686316 2414757 2809083
14559B809083N73152k82155n2155M43349l70188N17551K61677K83854O31162J206566
$$ 2809083 3382235 3100080 3047925 3491274 3121086 3638637 3900314 4184168 4815330 6021896
14549F021896J611560L902845P443532J6759225K675326j3130692j2556346F332050
$$ 6021896 7633456 11536301 18979833 35739058 38414384 25283692 12727346 6332050
14540C780920o49039j51446n19259j48575K13984k66739J98897m33052R4028j20868
$$ 3780920 3131881 2980435 2461176 2312601 2526585 2259846 2458743 2025691 2119719 1998851
14530A998851Q9403M42849n08601K88833J29596K32952J20138j89129j40178K59574
$$ 1998851 2088254 2531103 2022502 2311335 2440931 2673883 2794021 2604892 2464714 2724288
14520B724288r8340l2712K75908j97818J40793J29678k05177n7483O6709M60537
$$ 2724288 2625948 2593236 2869144 2671326 2812119 2941797 2736620 2679137 2745846 3206383
14510C206383k94089j4140J53510j48839L57324j83279N78724m78018K57635j87951
$$ 3206383 2912294 2898154 3051664 2902825 3260149 3076870 3655594 3177576 3435211 3247260
14500C247260J31424R9575Q1663j76047K530M07079k73930K15864N3480k9450
$$ 3247260 3378684 3478259 3559922 3383875 3386405 3793484 3519554 3735418 3788898 3759448
14490C759448R5473o5966j19180J12587j93839M74688j00126P4219j12528k7239
$$ 3759448 3854921 3788955 3669775 3782362 3588523 4063211 3963085 4037304 3924776 3897537
14480C897537J66106j1930K77751L7610L01686n63926J94013L95156l0894J18320
$$ 3897537 4063643 4051713 4329464 4367074 4668760 4104834 4298847 4694003 4663109 4781429
14470D781429k82160K69555j2908J73746j69679o2572J59179R7443J56426r3299
$$ 4781429 4499269 4768824 4755916 4929662 4759983 4697411 4856590 4954033 5110459 5017160
14460E017160K68071n20680K75438L14142j79857L19630R0570n1866n9951M40222
$$ 5017160 5285231 4764551 5039989 5354131 5174274 5493904 5584474 5532608 5472657 5912879
14450E912879J8543k2761J84140J31165J3130Q1333k12945L58387Q734N9047N4790
$$ 5912879 5931422 5908661 6092801 6223966 6237096 6318429 6105484 6463871 6472605 6531652 6586442
14439F586442K07305l75722M19219M1009R7945O3577o8455K29879q6056J79336
$$ 6586442 6793747 6418025 6837244 6878253 6976198 7039775 6971320 7201199 7115143 7294479
14429G294479J29904J07181L75509J62318n4058J30767J7505K43510j19327L02029
$$ 7294479 7424383 7531564 7907073 8069391 8015333 8146100 8163605 8407115 8287788 8589817
14419H589817O9802J34789L0264J52398J62158K3693L25767J93236J01465m3138
$$ 8589817 8659619 8794408 8824672 8977070 9139228 9162921 9488688 9681924 9783389 9740251
14409I740251K57836J15564j47950J40522L18070L60597K6182n4882K31725N79114
$$ 9740251 9998087 10113651 9965701 10106223 10424293 10784890 10811072 10756190 10987915 11567029
14399A1567029k6276K81954Q1642P9133L79088J91124L40783j79424O11713j90439
$$ 11567029 11540753 11822707 11904349 11983482 12362570 12553694 12894477 12715053 13326766 13136327
14389A3136327L82414K32871K65816K75376Q2486L14713Q8995L62712M42128l78545
$$ 13136327 13518741 13751612 14017428 14292804 14375290 14690003 14778998 15141710 15583838 15205293
14379A5205293N44274L69502Q4640P19089L59508L56553M72384M38174J63325
$$ 15205293 15749567 16119069 16203709 16922798 17282306 17638859 18111243 18549417 18712742
14370A8712742L92723R0377L43536K5435J059626K47512L11793O03050K07909
$$ 18712742 19105465 19195842 19539378 19564813 20624439 20871951 21183744 21786794 21994703
14361B1994703N84210L10183M54277Q12610L82110K85609J071365M72157O72374
$$ 21994703 22578913 22889096 23343373 24155983 24538093 24823702 25895067 26367224 27039598
14352B7039598L48375Q89623N22922P80170M80874J021933J58491J136856Q43242
$$ 27039598 27387973 28277596 28800518 29580688 30061562 31083495 31241986 32378842 33222084
14343C3222084R23182O68354J113135J013746P53515J303927J062082P62278J133363
$$ 33222084 34145266 34813620 35926755 36940501 37694016 38997943 40060025 40822303 41955666
14334D1955666J539388J316399R22566J522863J244108J631988J555555J832496
$$ 41955666 43495054 44811453 45734019 47256882 48500990 50132978 51688533 53521029
14326E3521029J222434J857348J788813K001902K099984K005248K358810K125879
$$ 53521029 54743463 56600811 58389624 60391526 62491510 64496758 66855568 68981447
14318F8981447K515843K542637K678390K645027L107721L297706K971355L728392
$$ 68981447 71497290 74039927 76718317 79363344 82471065 85768771 88740126 92468518
14310I2468518L617827L624673M112276M041535M621016M918977M745468N391713
$$ 92468518 96086345 99711018 103823294 107864829 112485845 117404822 122150290 127542003
14302A27542003N378317N827848O177809O506572O931564P552223P618492Q159536
$$ 127542003 132920320 138748168 144925977 151432549 158364113 165916336 173534828 181694364
14294A81694364Q781162R172626R489165J0208669J0390894J1042439J1568563
$$ 181694364 190475526 199648152 209137317 219345986 229736880 240779319 252347882
14287B52347882J2180095J2848566J3023847J3360983J3727745J4002472J4355773
$$ 252347882 264527977 277376543 290400390 303761373 317489118 331491590 345847363
14280C45847363J4015655J4370506J3655679J3468835J2470938J0852994R793593
$$ 345847363 359863018 374233524 387889203 401358038 413828976 424681970 434475563
14273D34475563P277694M068480J887406J709768j684358l449559k791080k922941
$$ 434475563 441753257 445821737 447709143 449418911 447734553 444284994 441493914 438570973
14265D38570973p167569r529802j1000807j1215654j1712686j2726009j2889694
$$ 438570973 431403404 421873602 410872795 399657141 387944455 375218446 362328752
14258C62328752j3602725j4216074j3717537j4227454j3519231j3771493j3475805
$$ 362328752 348726027 334509953 320792416 306564962 293045731 279274238 265798433
14251B65798433j2925641j2946089j1699591j1494502j0432447j0305440q946592
$$ 265798433 252872792 239926703 228227112 216732610 206300163 195994723 187048131
14244A87048131q714138q363670q253270p529009p113966o895649o074839n544664
$$ 187048131 178333993 169970323 161717053 154188044 147074078 140178429 134103590 128558926
14236A28558926n399973n628280m746968m830197m318989m129930l822309l830602
$$ 128558926 123158953 117530673 112783705 107953508 103634519 99504589 95682280 91851678
14228I1851678l519682l392567l243735l218277k631571k942502k613560k356573
$$ 91851678 88331996 84939429 81695694 78477417 75845846 72903344 70289784 67933211
14220F7933211k203135k367163k304683j612103k178066j717177j502555j658597
$$ 67933211 65730076 63362913 61058230 59446127 57268061 55550884 54048329 52389732
14212E2389732j358001j946968j763988j021754j284669q75546j014107j400922
$$ 52389732 51031731 49084763 47320775 46299021 45014352 44138806 43124699 41723777
14204D1723777j440712j110871r61694p94744j098814j077635r50465q43633j276245
$$ 41723777 40283065 39172194 38210500 37415756 36316942 35239307 34288842 33445209 32168964
14195C2168964l71334q95021o47385o36782j063090o12664o27674o35746k65381
$$ 32168964 31797630 30902609 30255224 29618442 28555352 27942688 27315014 26679268 26413887
14186B6413887q84725n86103o59891j38917q04159n73000n53539l16516q4974
$$ 26413887 25529162 24943059 24283168 24144251 23340092 22767092 22213553 21897037 21812063
14177B1812063r91040n10433o4117n34098m14125m73312l11057n32549r5584l84764
$$ 21812063 20821023 20310590 20246473 19712375 19298250 18824938 18513881 17981332 17885748 17500984
14167A7500984j57627l90680o22847j63666j40933m15997l67944l18584p1507
$$ 17500984 17343357 16952677 16329830 16166164 16025231 15609234 15241290 14922706 14851199
14158A4851199k18201l37290l37869j49544K5099m15783l64062m03734K91125
$$ 14851199 14632998 14295708 13957839 13808295 13833394 13417611 13053549 12649815 12940940
14149A2940940k55780l66388l08779k27331k08099l39335o8565k02366l10105
$$ 12940940 12685160 12318772 12009993 11782662 11574563 11235228 11166663 10964297 10654192
14140A0654192j9385m29332K06631R1916m14334l04876K5218P7320n31225K21837
$$ 10654192 10634807 10205475 10412106 10504022 10089688 9784812 9810030 9887350 9356125 9577962
14130I577962j82620j92584J15388m75932K56472l12543K8662n49308o2588r0616
$$ 9577962 9395342 9202758 9318146 8842214 9098686 8786143 8814805 8265497 8202909 8112293
14120H112293J36086n8555j55731j39340r2973n5082j69699k00302j98554M8050
$$ 8112293 8248379 8189824 8034093 7894753 7801780 7746698 7576999 7376697 7178143 7226193
14110G226193j47395k46918K92242j07359l47937l784O1763l54997L41103r4862
$$ 7226193 7078798 6831880 7124122 7016763 6668826 6665042 6726805 6371808 6712911 6618049
14100F618049j91306j79116J9013K43727k98183r9244J6415q0402k34344k5010
$$ 6618049 6426743 6247627 6266640 6510367 6212184 6112940 6129355 6048953 5814609 5789599
14090E789599k74213L18526j86831k05417J59078o28767N5393L37515m52523J40803
$$ 5789599 5515386 5833912 5647081 5441664 5600742 4971975 5027368 5364883 4912360 5053163
14080E053163l855r477l7179o2111j89823K60794j95799l53134M48022o57113
$$ 5053163 5049308 5039831 5002652 4940541 4750718 5011512 4815713 4462579 4910601 4253488
14070D253488L11247L26400n73589J73348j96387L38220l37877K73072k62061
$$ 4253488 4564735 4891135 4317546 4490894 4294507 4632727 4294850 4567922 4305861
14061D305861q2014k19571K88854r9131j20279K62269j57129j28932j79598R3484
$$ 4305861 4223847 4004276 4293130 4193999 4073720 4335989 4178860 4049928 3870330 3963814
14051C963814j11239J33305j03043j66063L5231j25716K48034r5295l11854O1187
$$ 3963814 3852575 3985880 3882837 3716774 3752005 3626289 3874323 3779028 3467174 3528361
14041C528361k15523j32066M91499m21434J49110j82754k4392j2180J53471k69427
$$ 3528361 3312838 3180772 3672271 3250837 3399947 3217193 3192801 3180621 3334092 3064665
14031C064665q3637K04484j00885r2074M79071n60811O31251o32544q3652L03116
$$ 3064665 2981028 3185512 3084627 2992553 3471624 2910813 3542064 2909520 2825868 3128984
14021C128984j67984q8661j01946j69701n6889M97239n11069N24614k00856j49618
$$ 3128984 2961000 2872339 2770393 2600692 2543803 3041042 2529973 3054587 2853731 2704113
14011B704113q5353k29543L15804l92219J96524r2656L26608n47898K88627k61692
$$ 2704113 2618760 2389217 2705021 2312802 2509326 2416670 2743278 2195380 2484007 2222315
14001B222315L43312m10412L50390j82837M2205p641p7056J82838k02760J96061
$$ 2222315 2565627 2155215 2505605 2322768 2364973 2357332 2280276 2463114 2260354 2456415
13991B456415K23906K24708J130227K500804N971133J6595615J0068867j1461615
$$ 2456415 2680321 2905029 4035256 6536060 12507193 29102808 39171675 27710060
13983B7710060j2129539n780656l119174r74686j375762j52289l83958j91321
$$ 27710060 15580521 9799865 6680691 5706005 4330243 4177954 3793996 3602675
13975C602675m00311j48646k78856J12219j51087l57482N39705k78204k18490
$$ 3602675 3202364 3053718 2774862 2887081 2735994 2378512 2918217 2640013 2421523
13966B421523J12766l26912J19604K9404j76832K15185j14147k79981K77064n0615
$$ 2421523 2534289 2207377 2326981 2356385 2179553 2394738 2280591 2000610 2277674 2227059
13956B227059N748K32539l77588n5761M3924J48689j31939k3775P5040J63958
$$ 2227059 2232807 2465346 2087758 2031997 2075921 2224610 2092671 2068896 2143936 2307894
13946B307894l84316k68009J19487j31303M54958k45465k04669o09K24739K00361
$$ 2307894 1923578 1655569 1775056 1643753 2098711 1853246 1648577 1647968 1872707 2073068
13936B073068j28973m62167M80419k88676m666J4278K68680j41167J68020l35609
$$ 2073068 1944095 1481928 1962347 1673671 1669005 1683283 1951963 1810796 1978816 1643207
13926A643207O2951j42175n6978j35401M52364Q5236j48751n57383M89076K01568
$$ 1643207 1706158 1563983 1507005 1371604 1823968 1909204 1760453 1203070 1692146 1893714
13916A893714j65986j24764l77540M42820j47227J62820j597J16007k50025J20461
$$ 1893714 1727728 1602964 1225424 1668244 1521017 1683837 1682240 1798247 1548222 1668683
13906A668683j38667k70435Q996J50686J5542l0465p7482K05463j12916j79049
$$ 1668683 1530016 1259581 1268577 1419263 1434805 1404340 1326858 1532321 1419405 1240356
13896A240356K26025J01220n7550l79219K08288k0701j68146N57576q32020P5687
$$ 1240356 1466381 1567601 1510051 1130832 1339120 1318419 1150273 1707849 875829 951516
13886I51516N04058j73971r3276N0737J34858n9243K35551k93182j77867J76690
$$ 951516 1455574 1281603 1188327 1239064 1373922 1314679 1550230 1257048 1079181 1255871
13876A255871O1390l41763j9573L67711K46641j97631O3191K8715l94535l48953
$$ 1255871 1317261 975498 955925 1323636 1570277 1372646 1435837 1464552 1070017 721064
13866G21064M61989L174L3419q9918L69940o5498j90644O3596j35615l81894K68237
$$ 721064 1183053 1186227 1219646 1129728 1499668 1434170 1243526 1307122 1171507 789613 1057850
13855A057850j27359K58175j58903k22671l8140J48542q3062n0556J82888j35199
$$ 1057850 930491 1188666 1029763 807092 768952 917494 834432 783876 966764 831565
13845H31565J36258K65851j53971j98989Q1821o2191R8435k17987J48012L86439
$$ 831565 967823 1233674 1079703 880714 962535 900344 998779 780792 928804 1315243
13835A315243m20889J20815P1383j63108k46336P65671m68661k22245N09890m11193
$$ 1315243 894354 1015169 1086552 923444 677108 1442779 974118 751873 1261763 850570
13825H50570K40506j67507O1717j57567O1837q5334M7712K54555J07981j6335
$$ 850570 1091076 923569 985286 827719 889556 804222 851934 1106489 1214470 1198135
13815A198135m57716n1104M18315o1218l18590K50326n6284j08544j91020M6247
$$ 1198135 740419 689315 1107630 1046412 727822 978148 921864 813320 622300 668547
13805F68547K66829m3971O0086k78243J70056J20817o0607j66851J9065k73041
$$ 668547 935376 891405 951491 673248 843304 964121 903514 736663 755728 482687
13795D82687O00967E40290K86040J45302L3066k54587J08120K4996L58368m63644
$$ 482687 1083654 540290 826330 971632 1004698 750111 858231 883227 1241595 777951
13785G77951M78879n31950J58912l57715L37983p3966j05524K78870k81614m8442
$$ 777951 1256830 724880 883792 526077 864060 790094 684570 963440 681826 633384
13775F33384P7253J60575P544o9566j59564P7449O3257j09583N7193P5234j26854
$$ 633384 710637 871212 878756 809190 649626 727075 790332 680749 737942 813176 686322
13764F86322L02707K4667l75863J93429k43978B58895L21595J37655r8955J1844
$$ 686322 989029 1013696 637833 831262 587284 258895 580490 718145 619190 631034
13754F31034q9312K07447K17495l40662J27689p3397j24592n769L14884N0773
$$ 631034 541722 749169 966664 626002 753691 680294 555702 549933 864817 915590
13744I15590l45527N760k14426O9952K16494j65028K37257r4085k4212Q3081Q6226
$$ 915590 570063 575823 361397 431349 647843 482815 720072 625987 601775 684856 771082
13733G71082k66904J70365L18762D95405L13070l63188J22007N092R388N7849
$$ 771082 504178 674543 993305 495405 808475 445287 567294 572386 581774 639623
13723F39623O750j75200J91564K2523J10388l93886K12427N3568k11463K12207
$$ 639623 646373 471173 662737 685260 795648 401762 614189 667757 456294 668501
13713F68501k55618L70903l56043n1410k1754N23049j88155k55249J14343J90107
$$ 668501 412883 783786 427743 376333 354579 877628 689473 434224 548567 738674
13703G38674k54989K5988K81611C76164K50311j55794J20183N5888k17872J91601
$$ 738674 483685 509673 791284 376164 626475 470681 590864 646752 428880 620481
13693F20481j57813K58365P0990k00607r2734J09860m6125q5909K67062k47178
$$ 620481 462668 721033 792023 591416 498682 608542 562417 476508 743570 496392
13683D96392k44143K9625J45535L49729l54389o0435K77611j22319j02870J87419
$$ 496392 252249 281874 427409 777138 422749 362314 639925 517606 414736 602155
13673F02155k45481N26072A49596N31025B27573J25042L85161q9337A23197M25691
$$ 602155 356674 882746 149596 680621 227573 352615 737776 648439 123197 548888
13663E48888Q9788k45139L97668B52740K10960j54266L1516K80403B87494J26772
$$ 548888 638676 393537 791205 252740 463700 309434 340950 621353 287494 414266
13653D14266j91292r4933K16249o1545L58353A63607J23302J49389p8274L23214
$$ 414266 222974 128041 344290 282745 641098 163607 286909 436298 358024 681238
13643F81238k78293J56069k13058m9476K97574o4651M3709K2173j00156K1662
$$ 681238 402945 559014 345956 296480 594054 529403 573112 595285 495129 516791
13633E16791q4165k1708j44562R5451J60821k8146J78450b2342A12638M65351
$$ 516791 432626 410918 266356 361807 522628 494482 672932 -22342 112638 577989
13623E77989k38341L10638k39289j18066p504A37963M2959J64381A52595J44419
$$ 577989 339648 650286 410997 292931 285427 137963 180922 345303 152595 297014
13613B97014L8581J70042M7090p1105K16155A83952P0536M71981j01744B62208
$$ 297014 335595 505637 552727 481622 697777 183952 254488 726469 624725 262208
13602C72676A58157L96541k41889J2125l9280O564O3333j3317B4022L87946m6247
$$ 372676 158157 554698 312809 324934 285654 292218 355551 342234 24022 411968 365721
13591C65721j15956L4463R6365J06166k15008K48840m484N460j66646J69760J10671
$$ 365721 249765 284228 380593 486759 271751 520591 516107 521567 354921 524681 635352
13580F35352j09010r8374G6571L91181p1746A12888J88895k5364M2562Q4110J17439
$$ 635352 526342 427968 76571 467752 396006 112888 301783 276419 318981 403091 520530
13569E20530j27339j43272N33414C61068j00639L06990j53924j53868E3372K79537
$$ 520530 393191 249919 783333 361068 260429 567419 413495 259627 53372 332909
13559C32909J17519l2524P4532A72161l2471J24489F4927L03051q8910j07539
$$ 332909 450428 417904 492436 172161 139690 264179 64927 367978 279068 171529
13549A71529g924C16305K46984L8429j03398B42665L62268A14092D379L56267
$$ 171529 -7924 316305 563289 601718 498320 242665 604933 114092 4379 360646
13539C60646j52290K64174J67803B9184L41722m9537O7751j3808j52629O5824
$$ 360646 208356 472530 640333 29184 370906 321369 389120 375312 222683 288507
13529B88507J14844j93183K22854r2601K70905B93589K42119k32094p7487J07970
$$ 288507 403351 210168 433022 340421 611326 293589 535708 303614 226127 334097
13519C34097P189j08838J421K70608j89036n8049l4332A11182M77922B45367J09771
$$ 334097 341286 232448 233869 504477 315441 257392 223060 111182 589104 245367 355138
13508C55138j40625E9213P0946J05057K63359j67941j65298J38209d7461C05013
$$ 355138 214513 59213 130159 235216 498575 330634 165336 303545 -47461 305013
13497C63128M4346R2773j88799O6101m2846j66541J7034h3869A25416C3291K82972
$$ 363128 407474 500247 311448 377549 334703 168162 185196 -83869 125416 33291 316263
13486C16263n6021q7112G7233N4319L65757m8886p5599A79900J28221J69741B05331
$$ 316263 260242 173130 77233 131552 497309 448423 372824 179900 308121 477862 205331
13474B56793J50858j17101A07495M77284D3164a3630E3554L43819j06642k2968
$$ 256793 407651 290550 107495 584779 43164 -13630 53554 397373 290731 267763
13464B67763j15470C6660N17580j53185A69073L81153q4558r2561k4138N5471
$$ 267763 152293 36660 554240 401055 169073 550226 465668 373107 348969 404440
13454D04440f9614D0775j0005L33455F3425M33984I5053a67724B29981J97681
$$ 404440 -69614 40775 30770 364225 63425 497409 95053 -167724 229981 427662
13444D27662j72224j4008A08987P01337A80023O2374r0811j8986R5132M2683j23853
$$ 427662 255438 241430 108987 810324 180023 242397 151586 132600 227732 270415 146562
13433A46562J86254A61817A6299M56120j97032K0070A15498e6855G8412L53540
$$ 146562 332816 161817 16299 472419 275387 295457 115498 -56855 78412 431952
13423D31952A72884Q6555E8953L23276A00087M14434j27977m3428j51479H4426
$$ 431952 172884 259439 58953 382229 100087 514521 386544 343116 191637 84426
13412A80883m2934b13537B72450h453A20529J82016O5116l0959b4455F2535M35589
$$ 180883 137949 -213537 272450 -8453 120529 302545 367661 336702 -24455 62535 498124
13401D98124I5555b72458A74324K68714A98091M17191A68373L03323A97935K92597
$$ 498124 95555 -272458 174324 443038 198091 615282 168373 471696 197935 490532
13391D90532A08046A1000J43100K32297o2828q6121J20552q3697A11195N52607
$$ 490532 108046 11000 154100 386397 323569 237448 358000 274303 111195 663802
13381F63802k89899j45161m7463L18399e9432C66614J21637j78323A03684h5215
$$ 663802 373903 228742 181279 499678 -59432 366614 488251 309928 103684 -85215
13370A24600m5236L07744A55168L14836j60357p3933C9259K69135R8745D4764
$$ 124600 79364 387108 155168 470004 309647 235714 39259 308394 407139 44764
13359C60658A17420n0893K70363e735C78233I7863j7988L118J12868G3188i2489
$$ 360658 117420 66527 336890 -5735 378233 97863 79875 82993 195861 73188 -92489
13347C53015H4969g035k01379C12729J8557A63464K0350J49008c3858B4216i437
$$ 353015 84969 -7035 -208414 312729 331286 163464 183814 332822 -33858 24216 -9437
13335A89303m9721K27137A65451P8804j14556K46895j63825I1178J10494a70598
$$ 189303 139582 366719 165451 244255 129699 376594 212769 91178 201672 -170598
13324b7840j7679E82096G9765K89497O2625j30019H8006A899K05696c1455A23360
$$ -27840 -45519 582096 79765 369262 431887 301868 88006 1899 207595 -31455 123360
13312G973K6515J85672J7389J69526K1747A54331a47098A44852R0320D3861O1641
$$ 7973 34488 220160 237549 407075 428822 154331 -147098 144852 235172 43861 105502
13301A05502K40693A47530j8255J71749r7806E7090K51373b0699A04817l6361
$$ 105502 346195 147530 129275 301024 203218 57090 308463 -20699 104817 68456
13291F8456a57066D82476j37737j25937q2807k2548J25305b272F3046c09814F9543
$$ 68456 -157066 482476 344739 218802 135995 113447 238752 -2272 63046 -309814 69543
13279a8941A27802a36555k45534D93109q3819a25919A36753D9488J45787P9144
$$ -18941 127802 -136555 -382089 493109 409290 -125919 136753 49488 195275 274419
13269B74419a82116B4482l759K11047b94911B59313A22309j3481L03608F8236
$$ 274419 -182116 24482 20723 231770 -294911 259313 122309 108828 412436 68236
13258C09980p2166n6485J00546N5640L0440A50437F2797J56594L8484N5061p8257
$$ 309980 237814 181329 281875 337515 367955 150437 62797 219391 257875 312936 234679
13247B34679K85227b69748C80451K5746j23696l1291m957J69690a7204G9J48236
$$ 234679 519906 -269748 380451 406197 282501 251210 246253 415943 -17204 79 148315
13236A48315D0014b51320f6806f305A75945p446c1568c067m3462C33197r3946
$$ 148315 40014 -251320 -66806 -6305 175945 168499 -31568 -3067 -46529 333197 239251
13225B39251p7264R7955l7424L1355N2693i5616A4232J17661J3203l7516J32739
$$ 239251 161987 259942 222518 253873 306566 -95616 14232 131893 145096 107580 240319
13214B40319n995l6342n6770D1355K13631k2615P5386A48010h5327C20732j20534
$$ 240319 234324 197982 141212 41355 254986 232371 307757 148010 -85327 320732 200198
13203B00198G6025i6870B182J69209C1672K78819J10338j97034I0520J31740E7660
$$ 200198 76025 -96870 2182 171391 31672 310491 420829 223795 90520 222260 57660
13191A90602P2698r9407O0491J18190a7904A76123m4212B8137a92788A08833e6671
$$ 190602 263300 163893 224384 342574 -17904 176123 131911 28137 -192788 108833 -56671
13179f1686E9516K70348A485R0315L6295J3211e9393A06518a56026A46716a1420
$$ -61686 59516 329864 1485 91800 128095 141306 -59393 106518 -156026 146716 -11420
13167A26678J1009a52245a4184j66417N2017O2675a9236C32113D6122N3334J86800
$$ 126678 137687 -152245 -14184 -180601 -128584 -65909 -19236 332113 46122 99456 286256
13156B86256c4263E60482A91490g291A34790R0648H878J94055j6654j5711h8517
$$ 286256 -34263 560482 191490 -7291 134790 225438 8878 202933 186279 170568 -88517
13144h9148a2629j4364j14077D9914J52715J48439j71566b89614E61323I0597
$$ -89148 -12629 -26993 -141070 49914 202629 351068 179502 -289614 561323 90597
13133A75510a2846C36676a29952N2443B02393F7506B0824N82252C6419b12936
$$ 175510 -12846 336676 -129952 -77509 202393 67506 20824 603076 36419 -212936
13122B8599N24111A18933L5127k2250a65440B31521J9667a59605A69586J4258
$$ 28599 552710 118933 154060 131810 -165440 231521 251188 -159605 169586 183844
13112A83844F9860l3079a90467C7659L57284d9333A28407J66131k0128a24516
$$ 183844 69860 36781 -190467 37659 394943 -49333 128407 294538 274410 -124516
13101B91345g773A51011j9801d2202B75102N2737j50953l5952F2781L71760D0372
$$ 291345 -7773 151011 131210 -42202 275102 327839 176886 140934 62781 434541 40372
13089B11183b60701c7686o2726o8097a9628A36309a81687D2421a44817B62017
$$ 211183 -260701 -37686 -100412 -168509 -19628 136309 -181687 42421 -144817 262017
13078i5907A87908b30057A19922h017C1927g8720D66159G5226a49511q6103B0027
$$ -95907 187908 -230057 119922 -8017 31927 -78720 466159 75226 -149511 -235614 20027
13066i5447E2256e5280C95640a42372A47150p1933r188R1561a52068g379r1626
$$ -95447 52256 -55280 395640 -142372 147150 75217 66029 157590 -152068 -7379 -99005
13055i9005A02182a6572A12007O8602J83683j34622D2075J71396L7461B7906J06483
$$ -99005 102182 -16572 112007 180609 364292 229670 42075 213471 250932 27906 134389
13044A34389K16647o6007Q5944j76331K12806a23581L8598a9493C0960L76665
$$ 134389 351036 285029 370973 194642 407448 -123581 -84983 -19493 30960 407625
13034D07625I9431J4596E4890Q4902a71763B97017b0316o2442A56107k5089M3337
$$ 407625 99431 114027 54890 139792 -171763 297017 -20316 -82758 156107 131018 174355
13023A74355J44064F3612b6664B09018i952B04701q7752A7041M558M12785A11175
$$ 174355 318419 63612 -26664 209018 -9952 204701 116949 17041 21599 434384 111175
13011A36695D3212L14769a11453A18801a11099A39489B9561K5810M29418B00921
$$ 136695 43212 357981 -111453 118801 -111099 139489 29561 55371 484789 200921
13000I9360k9545K60599G5121b10194A72166a30952a6798A29494k9499b66730
$$ 99360 69815 330414 75121 -210194 172166 -130952 -16798 129494 99995 -266730
12989A69071c00260e500A50165o5759a5681m626A39468M194G419O5688A3776a10152
$$ 169071 -300260 -5500 150165 84406 -15681 -20307 139468 143662 7419 73107 13776 -110152
12976g7311E4901A4807b4026C26020F2206J80348r7736q176h3596F7652J61093
$$ -77311 54901 14807 -24026 326020 62206 242554 144818 136642 -83596 67652 228745
12965B28745G1360c71263J72223B13730m9190J6566J68404a22048A73153g3733
$$ 228745 71360 -371263 -199040 213730 164540 181106 349510 -122048 173153 -73733
12954D09259F1234b11140A45718a32058A11554b5950F3567d03848A59338a2261
$$ 409259 61234 -211140 145718 -132058 111554 -25950 63567 -403848 159338 -12261
12943B78526j30647e19921a1314j03036A28564j6888h0930A08774Q880a63253
$$ 278526 147879 -519921 -11314 -114350 128564 111676 -80930 108774 117654 -163253
12932A78727a4829A31420N216i3659A5775J04073P7710p4148j9965e3788j04861
$$ 178727 -14829 131420 136636 -93659 15775 119848 197558 123410 103445 -53788 -158649
12921a58649J9266A47089a87168c303k4346k09714H5265J00038r582b24559D5500
$$ -158649 -139383 147089 -187168 -3303 -27649 -237363 85265 185303 175721 -224559 45500
12909f5348B52019p5035a60977O9593B77487E0038b46781C62401b6981o0078A98006
$$ -65348 252019 176984 -160977 -91384 277487 50038 -246781 362401 -26981 -87059 198006
12897A60063G6754C3394O0301n408k8460K06111F2965a00627f322B94633a88299
$$ 160063 76754 33394 93695 88287 59827 265938 62965 -100627 -6322 294633 -188299
12885H2767J46577a63913P7424L0717n3083M4987B3373a28786A70332L4048F739
$$ 82767 229344 -163913 -86489 -55772 -108855 -63868 23373 -128786 170332 204380 6739
12873c47531a24227d5339A08585n4156P5762b81158B7542K24868l7700Q9292r4348
$$ -347531 -124227 -45339 108585 54429 130191 -281158 27542 252410 214710 304002 209654
12862B09654g4668I8935B0139a1282j64731d3961E356J21816a10227c5039k32676
$$ 209654 -74668 98935 20139 -11282 -176013 -43961 5356 127172 -110227 -35039 -267715
12851b67715A99827b62431i5346A25250a94842A74053J33190A02097M6136D5101
$$ -267715 199827 -262431 -95346 125250 -194842 174053 307243 102097 148233 45101
12840B71341E2527b800A19606a62477L3077E03219F8399a6413o0690j22468b156
$$ 271341 52527 -2800 119606 -162477 -129400 503219 68399 -16413 -77103 -199571 -2156
12828B21941a08722B95489h5597a8574A98597C44K19443e9146j59227A91752H8184
$$ 221941 -108722 295489 -85597 -18574 198597 344 219787 -59146 -218373 191752 88184
12816g795F550L68073A39226a04816I977J1297I542a46150M3711D4657c1635n0944
$$ -7795 6550 374623 139226 -104816 9977 21274 9542 -146150 -102439 44657 -31635 -82579
12804h2579A62887a7981F3532f8034A47083a82199f1888H2047a15947A52283a83865
$$ -82579 162887 -17981 63532 -68034 147083 -182199 -61888 82047 -115947 152283 -183865
12792e8731a0539A41793J05582m7272b0006E8168M42452D8296k2860R7672n9104
$$ -58731 -10539 141793 247375 200103 -20006 58168 500620 48296 25436 123108 64004
12781F4004R4312L3371b643n0033I3190g1371B27603a25451k6422C8536n801K1380
$$ 64004 158316 191687 -2643 -52676 93190 -71371 227603 -125451 -151873 38536 32735 54115
12769E4115K11572c6167A66447a49623j01254C32538j02430a528I58N2095f5514
$$ 54115 265687 -36167 166447 -149623 -250877 332538 230108 -1528 958 53053 -65514
12757c0841A3647K53707k8900c05523a03898F9655B0004J63573b6950n1105p7797
$$ -30841 13647 267354 238454 -305523 -103898 69655 20004 183577 -26950 -78055 -155852
12746a55852b6530B8320P9990K7977C263J00271b9157C22782A30485J83974c6099
$$ -155852 -26530 28320 108310 136287 3263 103534 -29157 322782 130485 314459 -36099
12734a51871B94032f9895C20762A27426e0714A88350J81500A6951M422L0249a01383
$$ -151871 294032 -69895 320762 127426 -50714 188350 369850 16951 21373 51622 -101383
12722c7779C9712f5412n5219b0154I421Q8049P36a38459B99330a59366I7443J54998
$$ -37779 39712 -65412 -120631 -20154 9421 97470 98206 -138459 299330 -159366 97443 252441
12710B52441N2322J31091a13896c8829C55234n9137J07951A73251a03331C8979
$$ 252441 304763 435854 -113896 -38829 355234 296097 404048 173251 -103331 38979
12699C25145n2345a42442D75166I9440J22912F5249j2687f8345C0274K0179J30530
$$ 325145 272800 -142442 475166 99440 222352 65249 52562 -68345 30274 50453 180983
12688A80983b81192B6400g8558b2059j20379A39670C1159L46486a11973A31862
$$ 180983 -281192 26400 -78558 -22059 -142438 139670 31159 377645 -111973 131862
12677b73172B48320e4383k04492I287b48485A12919a9731A30472e9218A43880
$$ -273172 248320 -54383 -258875 9287 -248485 112919 -19731 130472 -59218 143880
12666A97720p1104b28406A3432N4530J67187l6782E500i1798A37805Q9444k9383
$$ 197720 126616 -228406 13432 67962 235149 198367 5500 -91798 137805 227249 197866
12655A97866k2745a50911C46630A21241a49559B24922A10984P0040a20594H0841
$$ 197866 175121 -150911 346630 121241 -149559 224922 110984 181024 -120594 80841
12644A85682N077C6329Q1939N1630j6399P9635A16497c9565A06717J75916b63922
$$ 185682 190759 36329 118268 169898 153499 233134 116497 -39565 106717 282633 -263922
12632e5869b5309B2610J22561J16019N9730J6952j29910a68374D0536j0057e1597
$$ -55869 -25309 22610 145171 261190 320920 337872 207962 -168374 40536 30479 -51597
12620B09513J84686C5989e5966A54533G6115e8378B17731d6262C25120c0029A40395
$$ 209513 394199 35989 -55966 154533 76115 -58378 217731 -46262 325120 -30029 140395
12608B01170b43691g7666B47b178B54679G3484l0841L5785K20310j25988E2312
$$ 201170 -243691 -77666 247 -2178 254679 73484 42643 78428 298738 172750 52312
12596A14451k7928D1953b2157A28863r440b5110E4064a69016B4417L2186J69844
$$ 114451 86523 41953 -22157 128863 119423 -25110 54064 -169016 24417 56603 226447
12585B26447n1301a21153j37149B60205o9220n118e8950I0671b8624A90978J13643
$$ 226447 175146 -121153 -258302 260205 190985 185867 -58950 90671 -28624 190978 304621
12574C04621C1020h2152j19676K1798C6313K82591j36617j8104a97444F1263b33204
$$ 304621 31020 -82152 -201828 -180030 36313 318904 182287 164183 -197444 61263 -233204
12562a2540C01676F8197a86404C5060C819Q0495c29002P7766A55798J49122c5085
$$ -12540 301676 68197 -186404 35060 3819 84314 -329002 -251236 155798 304920 -35085
12550C86094b5752B59146r1087A0001h1513A19989a95205I8423b9911j34931C0998
$$ 386094 -25752 259146 168059 10001 -81513 119989 -195205 98423 -29911 -164842 30998
12538a36357d0686A41919J3758O721C1271a53280a5274D9741c1485j01127E7481
$$ -136357 -40686 141919 155677 162398 31271 -153280 -15274 49741 -31485 -132612 57481
12526H3488a8719r3465B41450B2319J90922o5367a84523B12296J09470a29459
$$ 83488 -18719 -112184 241450 22319 213241 147874 -184523 212296 321766 -129459
12515G4862J25129f362F3224M8593Q6751c59511O5880e6300B54200Q9143G1817
$$ 74862 199991 -6362 63224 111817 198568 -359511 -293631 -56300 254200 343343 71817
12503A30992i9224C20761j15434F6420b891j16604L2630C1308J70756k0194E9205
$$ 130992 -99224 320761 205327 66420 -2891 -119495 -86865 31308 202064 181870 59205
12491a23748C4415n241q246e31478a77216m6060g8310p5529B5760M8308j6266
$$ -123748 34415 29174 20928 -531478 -177216 -223276 -78310 -153839 25760 74068 57802
12480E7802b8130A00800h8134B73761B5294L4030J1597a43110A07234M0899k7189
$$ 57802 -28130 100800 -88134 273761 25294 59324 70921 -143110 107234 148133 120944
12469A20944a15530E3870a16820A92522b2663G7492b09337J6648H6509b59460
$$ 120944 -115530 53870 -116820 192522 -22663 77492 -209337 -192689 86509 -259460
12458E253c1624E6334a1158B15895q6780i2923G7020N0169K65520a43083K2491
$$ 5253 -31624 56334 -11158 215895 129115 -92923 77020 127189 392709 -143083 -120592
12447a20592F9019J78598A15427d9201j92728a19689j19575C58153e0419A13205
$$ -120592 69019 247617 115427 -49201 -241929 -119689 -239264 358153 -50419 113205
12436g736j82865d4822A41079M6203a5314A53276m1020h2697A78772Q6086e530
$$ -7736 -190601 -44822 141079 187282 -15314 153276 112256 -82697 178772 264858 -5530
12424c62237B04751a08216I615a97295A56908g6367k85979h1383I6514J24960
$$ -362237 204751 -108216 9615 -197295 156908 -76367 -362346 -81383 96514 221474
12414B21474A9064J28425E1506c6916j32794A39495c7770m6557G5379j6528J1566
$$ 221474 19064 147489 51506 -36916 -169710 139495 -37770 -84327 75379 58851 70417
12403G0417k0251M14248e682A1063a2357k38417I0964d7337k66607a03440C674
$$ 70417 50166 464414 -5682 11063 -12357 -250774 90964 -47337 -313944 -103440 3674
12391A65263a12393j08660n9112H1956P4622b22306B37332R5855j19245m5669
$$ 165263 -112393 -221053 -280165 81956 156578 -222306 237332 333187 213942 168273
12381A68273b67752a6280B7719K09454b4318l10978C08003b25537B98217a40415
$$ 168273 -267752 -16280 27719 237173 -24318 -335296 308003 -225537 298217 -140415
12370C23294h231j17795j42329F0361j5015b9855j3450B0575K37986B2823c07023
$$ 323294 -8231 -126026 -268355 60361 45346 -29855 -43305 20575 258561 22823 -307023
12358a34894F5287L9255l6006a12565j78885F175J14017f1454A19008m1472b07687
$$ -134894 65287 104542 68536 -112565 -291450 6175 120192 -61454 119008 77536 -207687
12346b48276f1124n6596A50276p333h9902o6597C3680Q1920J18290b16700e7337
$$ -248276 -61124 -117720 150276 142943 -89902 -156499 33680 115600 233890 -216700 -57337
12334A50924g8892B5338J05298o3575b52844B05455i9929A71546a06498A84477
$$ 150924 -78892 25338 130636 67061 -252844 205455 -99929 171546 -106498 184477
12323A16605b53503B39420a07226o1806D3223c64186a47854A35672a0099G2673
$$ 116605 -253503 239420 -107226 -169032 43223 -364186 -147854 135672 -10099 72673
12312b39841k40216h2527j03950A64587L7319r4613a20415j10952A09794J7849
$$ -239841 -480057 -82527 -186477 164587 201906 107293 -120415 -231367 109794 127643
12302A27643B640c4307E3882b66814D7295b08196A67373f5804r0924g2255A3695
$$ 127643 2640 -34307 53882 -266814 47295 -208196 167373 -65804 -156728 -72255 13695
12290A48274o2345a05196q8213A33425a80395b3265A672e0284a7834n462A39090
$$ 148274 85929 -105196 -193409 133425 -180395 -23265 1672 -50284 -17834 -23296 139090
12278A39250a46357A1858a4698p0972A00983l1856K90978c9718B31880e282l7066
$$ 139250 -146357 11858 -14698 -85670 100983 69127 360105 -39718 231880 -5282 -42348
12267d2348a2683F1182b91500a9520A93362Q4231j35806C4413c02613A98065l5601
$$ -42348 -12683 61182 -291500 -19520 193362 277593 141787 34413 -302613 198065 162464
12256A62464b89566A22257M5675j7998J69012C4040K58261a06274A86675K6769
$$ 162464 -289566 122257 167932 149934 318946 34040 292301 -106274 186675 213444
12246B13444q1711E8151f4523C3311J23398M433L400b34726C29334j32737b6141
$$ 213444 131733 58151 -64523 33311 156709 161142 164542 -234726 329334 196597 -26141
12234D5050c48930A10312R1290k909e989B46126F4814K32684M6608D691K77194
$$ 45050 -348930 110312 201602 198693 -5989 246126 64814 297498 344106 4691 281885
12223B81885a08819a5599B04817O3208J58372j38170e7589F30906A94242J89452
$$ 281885 -108819 -15599 204817 268025 426397 288227 -57589 630906 194242 383694
12213C83694g3595A39594J4009J98185A58349J251g0167A24852L350E0796J06637
$$ 383694 -73595 139594 153603 351788 158349 159600 -70167 124852 128202 50796 157433
12202A57433E6842K74179G1111J06445c6829D00965D703g1210a5002B72080r6981
$$ 157433 56842 331021 71111 177556 -36829 400965 4703 -71210 -15002 272080 175099
12191A75099K7364L4948I3195N5180O9031j07046J32226D9701K9527K51681h7400
$$ 175099 202463 237411 93195 148375 217406 110360 242586 49701 79228 330909 -87400
12179c3265C03524a04851B66014j05962E3732J35172b98042B60731E1939K47429
$$ -33265 303524 -104851 266014 160052 53732 188904 -298042 260731 51939 299368
12169B99368C5504J44063d00372C26144b9484A24506C5234O8323a60274C50087
$$ 299368 35504 179567 -400372 326144 -29484 124506 35234 103557 -160274 350087
12158e8811k24892A63564r741C6153d4050A5435K84703c7836A21830j0460b38819
$$ -58811 -283703 163564 153823 36153 -44050 15435 300138 -37836 121830 111370 -238819
12146D5523K41340C5599b9961B83432R9158a0100j40230H1183B2171a84788b3111
$$ 45523 286863 35599 -29961 283432 382590 -10100 -150330 81183 22171 -184788 -23111
12134B05457j7545E2086J89100J87507G0540L9489c06026B96916C2440K14614
$$ 205457 187912 52086 241186 428693 70540 110029 -306026 296916 32440 247054
12124B47054a03785a3071C8039a62461C31502A59738n7925a20666B05332I6648
$$ 247054 -103785 -13071 38039 -162461 331502 159738 101813 -120666 205332 96648
12113D9041K30541a7887H6534e1411I8048K24560a97160C32418g3880D2072a24996
$$ 49041 279582 -17887 86534 -51411 98048 322608 -197160 332418 -73880 42072 -124996
12101H4205b60954D9851b89475F266L57163A4299e2870j83759B6619Q2729c55291
$$ 84205 -260954 49851 -289475 6266 363429 14299 -52870 -236629 26619 109348 -355291
12089A46833c04522a34915I6774l5014f0793j81498l1133A73267b37204B56286
$$ 146833 -304522 -134915 96774 61760 -60793 -242291 -273424 173267 -237204 256286
12078F7012N0233b62543C43427A1092J91689F4748J32176a76135C39270L73270
$$ 67012 117245 -262543 343427 11092 202781 64748 196924 -176135 339270 712540
12068G12540Q20158l66433E39925B00002n2247i9521j2758A77529b80957C0531
$$ 712540 1532698 1166265 539925 200002 147755 -99521 -112279 177529 -280957 30531
12057D27931c78220G2499Q0761A3999O7688C694L08791A16841h7746B56527j16894
$$ 427931 -378220 72499 153260 13999 81687 3694 312485 116841 -87746 256527 139633
12046A39633b97250A9158J10017a78361H8487K07173F8713a37193d6968a0235
$$ 139633 -297250 19158 129175 -178361 88487 295660 68713 -137193 -46968 -10235
12035a67809R043r000B85460r5832a93150f6599e544H1288h0547A63546b13034
$$ -167809 -158766 -167766 285460 189628 -193150 -66599 -5544 81288 -80547 163546 -213034
12023g5188k23351J20979P9545A29581f720j66731I642L39859D3187K67766g9479
$$ -75188 -298539 -177560 -98015 129581 -6720 -173451 9642 349501 43187 310953 -79479
12011a54282C605Q2957a52532d3175o0719L1314L4277A50274a23485k0137B16502
$$ -154282 3605 86562 -152532 -43175 -103894 -72580 -38303 150274 -123485 -143622 216502
11999f750A52687d7870q0541j6275A04511a32380b525j65800d1735A09219p67
$$ -6750 152687 -47870 -128411 -144686 104511 -132380 -2525 -168325 -41735 109219 108452
11988A08452e5351F9522L49135a67253B52826c10233B39532p9163F9072J58877
$$ 108452 -55351 69522 418657 -167253 252826 -310233 239532 160369 69072 227949
11978B27949b21481A98494J2538A298i7057B04589m5296l739A9777a2933m8951
$$ 227949 -221481 198494 211032 1298 -97057 204589 159293 155554 19777 -12933 -61884
11967f1884i65q034A53124L1185A1605a06592r7721D3493e0287A2795J70189B0708
$$ -61884 -965 -8999 153124 184309 11605 -106592 -204313 43493 -50287 12795 182984 20708
11954A91066J97713A54313l95n8981a02199A12584J39954j20869a73269Q93f4959
$$ 191066 388779 154313 153918 94937 -102199 112584 252538 131669 -173269 -172376 -64959
11942a04336j22081B55987b862o2418m1383A72690r457O1188b1608D05028o992
$$ -104336 -226417 255987 -2862 -65280 -106663 172690 163233 224421 -21608 405028 398036
11931C98036j86335i2155l129a1871o2442G7775a51127f5414l80076i011E9993
$$ 398036 211701 -92155 -95284 -11871 -74313 77775 -151127 -65414 -445490 -9011 59993
11919B20382a46022A55417b84144N777B36271c14695D9997a8462m1311Q257J2583
$$ 220382 -146022 155417 -284144 -278367 236271 -314695 49997 -18462 -59773 -51516 -38933
11908c8933B81624b25895o0898P9013B75089D5796d04057A32111n8330a00780
$$ -38933 281624 -225895 -286793 -207780 275089 45796 -404057 132111 73781 -100780
11897b465k11144C1743c27083a30457j08732A04215j233b75262o1726O0824B2101
$$ -2465 -213609 31743 -327083 -130457 -239189 104215 102982 -275262 -336988 -276164 22101
11885a77797A69373c91730I214J22578C2878L543a17478A11979n0685O1233a18372
$$ -177797 169373 -391730 9214 131792 32878 36421 -117478 111979 61294 122527 -118372
11873A22315e4318j59104H4375a57048l23051b24477g458j46393n5509D51551
$$ 122315 -54318 -213422 84375 -157048 -480099 -224477 -7458 -153851 -209360 451551
11862B70752b67340J29152j07052F4403J2324M1632K88551a30364H1099b62914
$$ 270752 -267340 -138188 -245240 64403 76727 118359 406910 -130364 81099 -262914
11851a56449B7903b26784A88587b59982i8991a0162H1783a35572A31710b941A38578
$$ -156449 27903 -226784 188587 -259982 -98991 -10162 81783 -135572 131710 -2941 138578
11839c52917Q6385B3696Q4700l6124a84783A71761e1811C55019H5662m1204N5217
$$ -352917 -266532 23696 108396 72272 -184783 171761 -51811 355019 85662 44458 99675
11828I9675A2886b08745F4957g1930J5732k92611a0332r2963k15654a58796d3706
$$ 99675 12886 -208745 64957 -71930 -56198 -348809 -10332 -103295 -318949 -158796 -43706
11816g4215A8533b60697R8313e2038m9265j15231A13688C1704J37231J12781b03138
$$ -74215 18533 -260697 -162384 -52038 -101303 -216534 113688 31704 168935 281716 -203138
11804c04850a40153k68369h3401K3226C68b27990d7237G6J54034K8454b75075
$$ -304850 -140153 -408522 -83401 -60175 368 -227990 -47237 76 154110 182564 -275075
11792b9305n8864F6299e8065C71615D4606b97729f3647k7574O485A21473d3576
$$ -29305 -88169 66299 -58065 371615 44606 -297729 -63647 -91221 -84736 121473 -43576
11780A08806l8459J96202o65A29025b23492F8203b70007b2572F5597c17429C18806
$$ 108806 70347 266549 265884 129025 -223492 68203 -270007 -22572 65597 -317429 318806
11768G3036P9113b61399a08166B27370b4579m8948j20501A38835j9574K9847M494
$$ 73036 152149 -261399 -108166 227370 -24579 -73527 -194028 138835 119261 149108 153602
11757A53602D8023c1341A34170a12443B575a87272A22882C7731P6456a73387A87836
$$ 153602 48023 -31341 134170 -112443 2575 -187272 122882 37731 114187 -173387 187836
11745I1813J6017g2463A20706J06020b77087A87088g5349r1632D09803a8643H613
$$ 91813 107830 -72463 120706 226726 -277087 187088 -75349 -166981 409803 -18643 8613
11733d03083j03545a18199C45394b04724E0591g0058r2888A05057P7135a42308
$$ -403083 -506628 -118199 345394 -204724 50591 -70058 -162946 105057 182192 -142308
11722a06753A64733p9143b3874j6499A41735a30117L9237A1994J14973a6920k7780
$$ -106753 164733 85590 -23874 -40373 141735 -130117 -90880 11994 126967 -16920 -44700
11711d4700A730J57828h5170A22142A980c03k19317A47296K9016D2844b8045p5134
$$ -44700 1730 159558 -85170 122142 1980 -303 -219620 147296 176312 42844 -28045 -103179
11699a03179d6232A83782C2354J0052a18867K2251B1684M9635j2611M579J43752
$$ -103179 -46232 183782 32354 42406 -118867 -96616 21684 71319 58708 63287 207039
11688B07039a31354D9611O9216a9610j14716C45387G7754J70256L3722B2590J13188
$$ 207039 -131354 49611 118827 -19610 -134326 345387 77754 248010 281732 22590 135778
11677A35778K47625j23420Q3680i1236p3945A20154g2821b5439g008A1110c58417
$$ 135778 383403 259983 343663 -91236 -165181 120154 -72821 -25439 -7008 11110 -358417
11665A05924c87120h528k6702A83838B6243a13092A02194c0078C1011K59880a7960
$$ 105924 -387120 -8528 -35230 183838 26243 -113092 102194 -30078 31011 290891 -17960
11653b46523h5642F020J47380J53226E1833a78896A34245P0089c26428J4880i6764
$$ -246523 -85642 6020 153400 306626 51833 -178896 134245 204334 -326428 -311548 -96764
11641A08176J19305D0635M67015k50028a54158A96085D4199A4147F843J7970g4744
$$ 108176 227481 40635 507650 257622 -154158 196085 44199 14147 6843 24813 -74744
11629B52542k9904m629F9538a26635M885I3864b14922B37674B404J71305A6009
$$ 252542 222638 218009 69538 -126635 -121750 93864 -214922 237674 2404 173709 16009
11617b12287H5397c7852G6272g6104j99474L0002B8882N0566J0177a4564B76625
$$ -212287 85397 -37852 76272 -76104 -275578 -245576 28882 79448 89625 -14564 276625
11605D52785A90896m6660a04378A68353j1970a16282F0387J88401R5897A05250
$$ 452785 190896 144236 -104378 168353 156383 -116282 60387 248788 344685 105250
11594B54030H141k532c9793P379A52830a86427I8425L40853k12964a1569A3406
$$ 254030 8141 5609 -39793 -32414 152830 -186427 98425 439278 226314 -11569 13406
11582A20667J34376m2230J15735j31985D5768K28386E2016L2759O2515A3269N2184
$$ 120667 255043 212813 328548 196563 45768 274154 52016 84775 147290 13269 65453
11571F5453P4279A6571M1253A6160d0541J7880H0238e3863G5800J02692j7627
$$ 65453 139732 16571 57824 16160 -40541 -22661 80238 -53863 75800 178492 160865
11560A60865L8627a41304D13625G7791a06661e3074A60224b27042B24232K8660
$$ 160865 199492 -141304 413625 77791 -106661 -53074 160224 -227042 224232 252892
11550B52892g1237f925j0257j00771D4274L84076A27575d8156B9541K94095f4899
$$ 252892 -71237 -6925 -17182 -117953 44274 428350 127575 -48156 29541 323636 -64899
11538I7695K5924K16624A910Q1245A9450K58417r7385p2475A2287K6451J37373
$$ 97695 123619 340243 1910 83155 19450 277867 180482 108007 12287 38738 176111
11527A76111j4167B1678N76566d0917G2036j7884a11488m4342h571l7941D2290
$$ 176111 161944 21678 598244 -40917 72036 54152 -111488 -155830 -8571 -46512 42290
11515i3771E3596d9794k07507D8210d745j94760h9763c1422F4776a26296C88257
$$ -93771 53596 -49794 -257301 48210 -4745 -199505 -89763 -31422 64776 -126296 388257
11503a42483I9273C1870K27604A04494a48371F6060K23213c2754A82066m852J9364
$$ -142483 99273 31870 259474 104494 -148371 66060 289273 -32754 182066 177214 196578
11492A96578p7903k1993J32321A06221J93121j33233k9297D0357a97278d6344
$$ 196578 118675 96682 229003 106221 299342 166109 136812 40357 -197278 -46344
11481D53977k17310K9714l6299k266L6118d5658B65413J33264A32541H230O9296
$$ 453977 236667 266381 230082 227816 263934 -45658 265413 398677 132541 8230 77526
11470G7526Q4841J49123L07978B05973Q5230D6379N1065J52201N1918F4845P4994
$$ 77526 162367 311490 619468 205973 291203 46379 97444 249645 301563 64845 139839
11459A39839f6709B22165M2316q803K42352H17N1539g8740a6849C13997j31798
$$ 139839 -66709 222165 264481 255678 498030 817 52356 -78740 -16849 313997 182199
11448A82199g7844B07956J57693d2733A88108c8918k68072J21239A95437P2665
$$ 182199 -77844 207956 365649 -42733 188108 -38918 -306990 -185751 195437 268102
11438B68102p1666H4963L52119A12957O7647H299h4232j10865b4465j69795A28128
$$ 268102 196436 84963 437082 112957 180604 8299 -84232 -195097 -24465 -194260 128128
11426B03205j5846J08507A9999K31742o5430c31189E9263b8217l49679A62494
$$ 203205 187359 295866 19999 251741 186311 -331189 59263 -28217 -377896 162494
11415B54219G5909a13036j34562b8527A36307b95065A61373F2291c8670A01737
$$ 254219 75909 -113036 -247598 -28527 136307 -295065 161373 62291 -38670 101737
11404A5494N35737A47636F2893J65192B4875b52471h7264H3855J15605h9169k7088
$$ 15494 551231 147636 62893 228085 24875 -252471 -87264 83855 199460 -89169 -116257
11393a16257A37569N5627J38600b20545E0816J14906a00031c5467D6437c85794
$$ -116257 137569 193196 331796 -220545 50816 165722 -100031 -35467 46437 -385794
11382B17865o6439d450l7123k04445J14681I3803J44873P4924j15155J13712C7941
$$ 217865 151426 -4450 -41573 -246018 -131337 93803 238676 313600 198445 312157 37941
11370A94938n6051a22261H7502c05280A11436c95979A8521i9782C1278J45291
$$ 194938 138887 -122261 87502 -305280 111436 -395979 18521 -99782 31278 176569
11360A76569a84620C49646b82540B85379H213b8752k5054A42627f479j72311d9420
$$ 176569 -184620 349646 -282540 285379 8213 -28752 -53806 142627 -6479 -178790 -49420
11348a22623D943b06759C87167a39003G6354f0339r7390A76992a30762I8399a49209
$$ -122623 4943 -206759 387167 -139003 76354 -60339 -157729 176992 -130762 98399 -149209
11336D9517A2516b76392P0766f7355D9939J56977a20749j05033i9706A03573b07928
$$ 49517 12516 -276392 -205626 -67355 49939 206916 -120749 -225782 -99706 103573 -207928
11324c18554H0408O3973E3452K11014a95369j13910F9231a9018r385B01657c21792
$$ -318554 80408 144381 53452 264466 -195369 -309279 69231 -19018 -28403 201657 -321792
11312D8151K55141e4266A73837e7351B32446b01723I1619f0821j70313L8712f1774
$$ 48151 303292 -54266 173837 -57351 232446 -201723 91619 -60821 -231134 -192422 -61774
11300G5714c9546k51980D1857Q0478f7457q6135e8558j16195k31207b2757j33564
$$ 75714 -39546 -291526 41857 122335 -67457 -153592 -58558 -174753 -405960 -22757 -156321
11289a56321A12416b35327H4564b79664A52009K9997a99205g8585A26114J33220
$$ -156321 112416 -235327 84564 -279664 152009 182006 -199205 -78585 126114 259334
11279B59334A27968a97933B40366H2467C0341N3923J2216c6873m9969E0244F851
$$ 259334 127968 -197933 240366 82467 30341 84264 96480 -36873 -86842 50244 6851
11267a1829j83851C19924A01908J82425A36977Q5181a56901C4142J24879b48524
$$ -11829 -195680 319924 101908 284333 136977 222158 -156901 34142 159021 -248524
11256c64070g1100l9806A17873a82148C30877b46274D85889a89969D0909a12297
$$ -364070 -71100 -110906 117873 -182148 330877 -246274 485889 -189969 40909 -112297
11245a19667d664A37275b94232B56243A485K14293a74437a4071n4750A28938A7172
$$ -119667 -4664 137275 -294232 256243 1485 215778 -174437 -14071 -68821 128938 17172
11233F3289i8890K6847A05665a27412J9908C44292f2900J9303H6356C8803N820
$$ 63289 -98890 -72043 105665 -127412 -107504 344292 -62900 -43597 86356 38803 44623
11222D4623a90496N5261m4664B28036G7279A4584J99061a89983B76648b61405
$$ 44623 -190496 -135235 -179899 228036 77279 14584 213645 -189983 276648 -261405
11211E5801a34464A5882a52340D51972i5904r0345Q5268k0735B25572h8958A04284
$$ 55801 -134464 15882 -152340 451972 -95904 -186249 -100981 -121716 225572 -88958 104284
11199A25168b88266C2553b04225K359A621K48141b0594j25417O154c3919B3185
$$ 125168 -288266 32553 -204225 -201866 1621 249762 -20594 -146011 -139857 -33919 23185
11187d0024A30710a72694B66590a53143I531L2847f3829p2723m9708j9116i1369
$$ -40024 130710 -172694 266590 -153143 9531 42378 -63829 -136552 -186260 -205376 -91369
11175a42512j29656b6951j20055f7094J808k10725f9514l7729L8217B65459F5842
$$ -142512 -272168 -26951 -147006 -67094 -65286 -276011 -69514 -107243 -69026 265459 65842
11163A08125g5241j3530A48606a11191G4007a79583H2811b67452i3203j21728
$$ 108125 -75241 -88771 148606 -111191 74007 -179583 82811 -267452 -93203 -214931
11153b14931B82440j13163a25902B00869m5720b21429k03886g6677B9420a0953
$$ -214931 282440 169277 -125902 200869 155149 -221429 -425315 -76677 29420 -10953
11142a94401j9038A0309b21285C9546b37368q588a06784I8346r309J25072q0119
$$ -194401 -213439 10309 -221285 39546 -237368 -245956 -106784 98346 89037 214109 133990
11131A33990h5440A57667f070C01287H2576a27511C5674a3523k18464k0617C43765
$$ 133990 -85440 157667 -6070 301287 82576 -127511 35674 -13523 -231987 -252604 343765
11119A56582A5841R6822a61253g0039l7643F7963f8116A60130o8870J47847G0810
$$ 156582 15841 112663 -161253 -70039 -107682 67963 -68116 160130 91260 239107 70810
11107a62585A82016j7851l5563J3594R2989p3535K53511c5534A33903a57150B06304
$$ -162585 182016 164165 128602 142196 235185 161650 415161 -35534 133903 -157150 206304
11095C45206A15420J75734l69r5043J37178j42381P7505J97230A65323o7743a9665
$$ 345206 115420 291154 290785 195742 332920 190539 268044 465274 165323 97580 -19665
11083E16946i967A35979J89539A43622J69186o5669A15761J9832O00401B14690
$$ 516946 -9967 135979 325518 143622 312808 247139 115761 135593 735994 214690
11072A07521j0920M3317R4714J01512j18985N6017K97480K8411q7720K2970j36158
$$ 107521 96601 139918 234632 336144 217159 273176 570656 599067 511347 534317 398159
11061C98159L27659k6453J18831l40061p5734K19909q3975J54423L79488m91050
$$ 398159 725818 699365 818196 478135 402401 622310 538335 692758 1072246 581196
11051E81196k5009K60591k87106N3882K99484j32419R3412j00218j84339L17330
$$ 581196 556187 816778 529672 583554 883038 750619 844031 743813 559474 876804
11041H76804j25109j08868L2030J32689Q0584k63118K12957j79941j41613K36358
$$ 876804 751695 642827 674857 807546 888130 625012 837969 658028 516415 752773
11031G52773m1625Q87p6724k03662L20655M5913j79929M1837J15707j61620k81380
$$ 752773 711148 712035 635311 431649 752304 798217 618288 660125 775832 614212 332832
11020C32832K69587M23530m78517L9104r0338J63683J16693k21223N459K44940
$$ 332832 602419 1025949 547432 586536 496198 659881 776574 555351 560810 805750
11010H05750l38549P7150K079M65860D73432L8981J87125Q0280j01545j49426
$$ 805750 467201 544351 546430 1012290 473432 512413 699538 779818 678273 528847
11000E28847K04742k04671K4911M27905l13581o6791J33342j48950J41312j99345
$$ 528847 733589 528918 553829 981734 668153 601362 734704 585754 727066 527721
10990E27721K12158n5398J3679r1897O1653L59100m7656o1032J76713K51996j9439
$$ 527721 739879 684481 698160 606263 667916 1027016 979360 918328 1095041 1347037 1327598
10979A327598J24633k25272L74967O90951j34355J27596L36843L50747k88901
$$ 1327598 1452231 1226959 1601926 2292877 2158522 2286118 2622961 2973708 2684807
10970B684807J55113j86151M6379k42729k93562m41367k14689K06981k9457K70470
$$ 2684807 2839920 2653769 2700148 2457419 2163857 1722490 1507801 1714782 1685325 1955795
10960A955795l08744M6073L43929K17643k39277m22770M1787m80483J66611m35289
$$ 1955795 1647051 1693124 2037053 2254696 2015419 1592649 1634436 1153953 1320564 885275
10950H85275N1184D58727J0176j09538A70933N32922l00794m4903j30354L8967
$$ 885275 936459 458727 468903 359365 170933 703855 403061 358158 227804 266771
10940B66771A5981K02310J98281C2721J671J9401J34816r256L08406A68428K42785
$$ 266771 15981 218291 416572 32721 34392 53793 188609 179353 487759 168428 411213
10929D11213A02821k8074L70199G1658b29842A79529e4836A07776B067J9994J09364
$$ 411213 102821 74747 444946 71658 -229842 179529 -54836 107776 2067 22061 131425
10918A31425I491L38255I6419A8886a771m72400G6798b64291a21905j0440C10696
$$ 131425 9491 347746 96419 18886 -1771 -474171 76798 -264291 -121905 -132345 310696
10906c28467k037h2129I7482B0338P9232e83p7304j73805h5406j71811F6738g6078
$$ -328467 -330504 -82129 97482 20338 99570 -583 -77887 -251692 -85406 -257217 66738 -76078
10893f9698j2329a5825l47142B17547g5726k18724A21213C2879P2406Q5355b31868
$$ -69698 -82027 -15825 -362967 217547 -75726 -294450 121213 32879 105285 190640 -231868
10881a72685d669F9732b39696Q3887f6692H4098c33225h5521A6695c48p3743B05652
$$ -172685 -4669 69732 -239696 -155809 -66692 84098 -333225 -85521 16695 -348 -74091 205652
10868a71213M4654F1989O9457P1171b5038C87971j42779a51914B19958D0340a19013
$$ -171213 -126559 61989 131446 202617 -25038 387971 245192 -151914 219958 40340 -119013
10856a29259F9531b14281A14137M6304a63246B84640j01530b75595D03254H8375
$$ -129259 69531 -214281 114137 160441 -163246 284640 183110 -275595 403254 88375
10845i3627m6170D1387L6514h1784H4162a95884A06585b519B99262A13807c40481
$$ -93627 -139797 41387 77901 -81784 84162 -195884 106585 -2519 299262 113807 -340481
10833e707A15652a90952r2208J11568A01757m3553K2742e2593E7021a43660b7483
$$ -5707 115652 -190952 -283160 -171592 101757 58204 80946 -52593 57021 -143660 -27483
10821f2156a3946A65441k9593i9261B18571c25207B43071E3657K15535a49933
$$ -62156 -13946 165441 135848 -99261 218571 -325207 243071 53657 269192 -149933
10810c52642M3689C20598G4413O0381L9941g1972C21320E2184i2045m9130m1751
$$ -352642 -308953 320598 74413 134794 174735 -71972 321320 52184 -92045 -141175 -182926
10799a82926m8448C6242b09327B8187K07730a8362k1835A29621J01320c3780l2243
$$ -182926 -231374 36242 -209327 28187 235917 -18362 -40197 129621 230941 -33780 -66023
10788f6023j9508A96050c70704B9555J1405i1399A96866f1386l6275B20446m9705
$$ -66023 -85531 196050 -370704 29555 40960 -91399 196866 -61386 -97661 220446 170741
10777A70741O7815b00142A24692b29227k09212K12578d4621K0954B2481b3524
$$ 170741 238556 -200142 124692 -229227 -438439 -225861 -44621 -23667 22481 -23524
10766d7541D5720a00999E3715M86794B6055Q8008c00323P8795i5722A25240b83634
$$ -47541 45720 -100999 53715 540509 26055 114063 -300323 -221528 -95722 125240 -283634
10754a90970d0286G1692N127B9351L18978i0828j85110A46032m0723E906a26770
$$ -190970 -40286 71692 76819 29351 348329 -90828 -275938 146032 105309 5906 -126770
10742a87180A23246g3128I9520C9050J77905o9911i4775A8958a11001C9926a275
$$ -187180 123246 -73128 99520 39050 216955 147044 -94775 18958 -111001 39926 -1275
10730g4971A09365K39761E1520o049K01352O1059n6165e45376e4377l0282H2384
$$ -74971 109365 349126 51520 45471 246823 307882 251717 -545376 -54377 -84659 82384
10718E8645g0095I6749M7024P8073b50884a02109b6160q492j25402H9182a18625
$$ 58645 -70095 96749 143773 221846 -250884 -102109 -26160 -34652 -160054 89182 -118625
10706c0683D8265a77972f98k03463c4745j74064j52969C4485K88151A21605b12535
$$ -30683 48265 -177972 -698 -204161 -34745 -208809 -361778 34485 322636 121605 -212535
10694c99567a31084j70082B67763a74170n3313m6352J01882g4178B885M981e8286
$$ -399567 -131084 -301166 267763 -174170 -227483 -273835 -171953 -74178 2885 7866 -58286
10682a55561A74239c4609D2139B676b8371q5519A51168a01886d0853I7978c16996
$$ -155561 174239 -34609 42139 2676 -28371 -113890 151168 -101886 -40853 97978 -316996
10670F6456a9701o7378I3201b94968r504d448j34873b4460k39155a22172j14136
$$ 66456 -19701 -87079 93201 -294968 -304472 -4448 -139321 -24460 -263615 -122172 -236308
10659b36308k0926i6916J3530A20325b57130a20547b609r0683p079j43532D0325
$$ -236308 -257234 -96916 -83386 120325 -257130 -120547 -2609 -93292 -100371 -243903 40325
10647e03708a19156K3760b041r6794a2869j50128d8060F9476A9102d2207A8137
$$ -503708 -119156 -95396 -2041 -98835 -12869 -162997 -48060 69476 19102 -42207 18137
10635a92225l6460b976A61110L7279N2791A3290a53266k01507a60315c2840A75648
$$ -192225 -228685 -2976 161110 198389 251180 13290 -153266 -354773 -160315 -32840 175648
10623a78118B090a96546k3485M6921D9079M9406A6351Q9767J63819r7480i4241
$$ -178118 2090 -196546 -220031 -173110 49079 98485 16351 106118 269937 172457 -94241
10611a27400M3674b3402B65113c13353a52608B3643a20557j95299b3987B3831
$$ -127400 -83726 -23402 265113 -313353 -152608 23643 -120557 -315856 -23987 23831
10600a80331A57433P1005B3480J43654a69843g5779B6347h9564m4264J7165M331
$$ -180331 157433 228438 23480 167134 -169843 -75779 26347 -89564 -133828 -116663 -112332
10589a12332C2272J10637R4078b1096A07946M1200n5854M0172A3440J44536b62484
$$ -112332 32272 142909 236987 -21096 107946 149146 93292 133464 13440 157976 -262484
10577A99125a26925A9101a95849b8796j86895n0343A61793D7158A3887g8781C47551
$$ 199125 -126925 19101 -195849 -28796 -215691 -266034 161793 47158 13887 -78781 347551
10565b57505O2241A56086J20874A0242Q4264b47913e1157E2442K9257d7002B42970
$$ -257505 -195264 156086 276960 10242 94506 -247913 -51157 52442 81699 -47002 242970
10553a97906g4967k67814d1250p7619N8410B56726o9824I1706a38845C82865a90646
$$ -197906 -74967 -342781 -41250 -118869 -60459 256726 186902 91706 -138845 382865 -190646
10541G7295g043k48619B84138a91811c6153m40528D911K17619g1394c3722j71592
$$ 77295 -7043 -255662 284138 -191811 -36153 -476681 4911 222530 -71394 -33722 -205314
10530b05314J00125C5726a28019b061l1421A6908i0875a0627l3452j13302M1089
$$ -205314 -105189 35726 -128019 -2061 -33482 16908 -90875 -10627 -44079 -157381 -116292
10519a16292j03247B89937m1085O4141c30314B42461a74455j7521B67724j08828
$$ -116292 -219539 289937 248852 312993 -330314 242461 -174455 -191976 267724 158896
10509A58896l9584b31344D081K248J04040D4979J2824a62386G1736K05738i8265
$$ 158896 119312 -231344 4081 6329 110369 44979 57803 -162386 71736 277474 -98265
10497a39735A23721g4994c3104l23807i7171b3728A83724C4858N3355a4959A08836
$$ -139735 123721 -74994 -33104 -356911 -97171 -23728 183724 34858 88213 -14959 108836
10485b0815B75670a50393N0881A98246J00340J92564n1035A69494L48H320Q0652
$$ -20815 275670 -150393 -99512 198246 298586 491150 440115 169494 169842 8320 88972
10474H8972N5836o6697A5595b18307A12597K6216i1880j56367A09160L2730a2645
$$ 88972 144808 78111 15595 -218307 112597 138813 -91880 -248247 109160 141890 -12645
10462B26316a3751k95281d923C3377g5006j79472h9715o1720l9541p7865C01249
$$ 226316 -13751 -309032 -4923 33377 -75006 -254478 -89715 -151435 -190976 -268841 301249
10450c3347G4406b1364l74696E7754b8338A72082a98181M9337B36296a36137j41053
$$ -33347 74406 -21364 -396060 57754 -28338 172082 -198181 -148844 236296 -136137 -277190
10439b77190h3867J3202A19363g7548b0354j67676Q3055j18986O8591l0094B62716
$$ -277190 -83867 -70665 119363 -77548 -20354 -188030 -104975 -223961 -155370 -185464 262716
10427A48751K4231b45211l50140d0531p1665J7941b8357r8745l4410B39259C7611
$$ 148751 172982 -245211 -595351 -40531 -112196 -94255 -28357 -127102 -161512 239259 37611
10415b26471a0678A64625d676A56367J695k4156I892P5447d8787A3814J04586
$$ -226471 -10678 164625 -4676 156367 158062 133906 9892 85339 -48787 13814 118400
10404A18400m101k6869a56871A04431f8827B67026A28637b5951A74069K23532
$$ 118400 114299 87430 -156871 104431 -68827 267026 128637 -25951 174069 397601
10394C97601a1792B21404K10800a07551A90296b4170B72495D7616e7961D7628
$$ 397601 -11792 221404 432204 -107551 190296 -24170 272495 47616 -57961 47628
10383B33221b3460A80195o3906L1860I437L78317j07119l2698l7479o2853L31809
$$ 233221 -23460 180195 116289 148149 9437 387754 280635 247937 210458 147605 479414
10372D79414A39125O1886J81059n3565j07135Q4235K74367p3795A12681M02804
$$ 479414 139125 201011 382070 328505 221370 305605 579972 506177 112681 515485
10362E15485A82901H9971M98017F9918J20592J05833m9777J1149L59641j00580
$$ 515485 182901 89971 587988 69918 190510 296343 246566 257715 617356 516776
10352E16776a364D72680L48E0810M10984P8677j23172l3001J01408r7357G1692
$$ 516776 -1364 472680 473028 50810 461794 540471 417299 384298 485706 388349 71692
10340A01895J42091A03765j8883j3194a4702F1690A6996J22749b21419d4185a9277
$$ 101895 243986 103765 84882 71688 -14702 61690 16996 139745 -221419 -44185 -19277
10328A31492b1993B73532D2724i5168C69399L6529K9911j47184E683J65536F7331
$$ 131492 -21993 273532 42724 -95168 369399 405928 435839 288655 5683 171219 67331
10316C24432A56754e1637E7141M7025L0913a53040G9387i1880A70088C6739J5604
$$ 324432 156754 -51637 57141 104166 135079 -153040 79387 -91880 170088 36739 52343
10305E2343a27297H4293r899i1C66728j65279A1429b91738f3754A50595a0672
$$ 52343 -127297 84293 74394 -91 366728 201449 11429 -291738 -63754 150595 -10672
10293b740l64473J20616A49178a09958A80523c26813i1343A42138B1843J08780
$$ -2740 -367213 -246597 149178 -109958 180523 -326813 -91343 142138 21843 130623
10283A30623a63932j05366k1017h1194G3575e4896A50123J14668i2384p8449M7475
$$ 130623 -163932 -269298 -290315 -81194 73575 -54896 150123 264791 -92384 -170833 -123358
10272a23358q9451F160K40390C3539a14620B22103h1157I147a28378b0740A79065
$$ -123358 -212809 6160 246550 33539 -114620 222103 -81157 9147 -128378 -20740 179065
10260C19973A04076L51871j08936O7266c2269A80686j0495F5796c72488h9405
$$ 319973 104076 455947 347011 414277 -32269 180686 170191 65796 -372488 -89405
10249D795c49274g6763A26674h7184A41731b1468j28749j57354a31407B52692
$$ 4795 -349274 -76763 126674 -87184 141731 -21468 -150217 -307571 -131407 252692
10238e1751k10774j65502a29584L6996A2015a20300o936j59198A17337a54369
$$ -51751 -262525 -428027 -129584 -92588 12015 -120300 -127236 -286434 117337 -154369
10227G3863a98656B64109a17049e2971k24271C6476c34632b6073q6929B45012
$$ 73863 -198656 264109 -117049 -52971 -277242 36476 -334632 -26073 -113002 245012
10216A10389m4221k3905g9393b0025k10474i5974j0370M2542o3670B51812b45088
$$ 110389 66168 42263 -79393 -20025 -230499 -95974 -106344 -63802 -127472 251812 -245088
10204a05750k7079A04653a45178H5660a36232G1077M686B8735d5315F6685d42695
$$ -105750 -132829 104653 -145178 85660 -136232 71077 75763 28735 -45315 66685 -442695
10192C9537J02514B4385b09844A74240d5128l5444k92o1629b3787L550G1520I
$$ 39537 142051 24385 -209844 174240 -45128 -80572 -80864 -142493 -23787 -20237 71520 9
10179C9846a30143A25072e6710k28039d8757k3196F6793K71015E5406c5047A97802
$$ 39846 -130143 125072 -56710 -284749 -48757 -71953 66793 337808 55406 -35047 197802
10167A15793a42592o5824m9745C7158a71390g8006C7656J9537c58969f1303a4478
$$ 115793 -142592 -208416 -258161 37158 -171390 -78006 37656 57193 -358969 -61303 -14478
10155C30293a43950O2947n33776K16948a6630j62700A40538m6021b16197r716
$$ 330293 -143950 -81003 -614779 -397831 -16630 -179330 140538 94517 -216197 -225913
10145b25913k1033a5411A36662h1245F9467b91939A17886a97186C5645k797i0892
$$ -225913 -246946 -15411 136662 -81245 69467 -291939 117886 -197186 35645 32848 -90892
10133I2801L6903d3277B3735b52018A89733b07790N0955i417j46476j04356C0106
$$ 92801 129704 -43277 23735 -252018 189733 -207790 -156835 -9417 -155893 -260249 30106
10121a55766e5819j50291D297K8070f1553A68563k4287a84494e8186A45325a51867
$$ -155766 -55819 -206110 4297 32367 -61553 168563 144276 -184494 -58186 145325 -151867
10109G9060a49549j13958e3696J6258A14899K0533a25730a7274j22642C3741e62649
$$ 79060 -149549 -263507 -53696 -37438 114899 135432 -125730 -17274 -139916 33741 -562649
10097c15957A06872a02050d701I0511l9739i3455C19013a44392B3374O5483c45453
$$ -315957 106872 -102050 -4701 90511 50772 -93455 319013 -144392 23374 88857 -345453
10085C9077a04635G6861d569r9194F6968b1248A13236b77433B3286J7129b84769
$$ 39077 -104635 76861 -4569 -103763 66968 -21248 113236 -277433 23286 40415 -284769
10073b5964a2434p0180j73696E7654k828f394j49669j02581A35185c520A3520
$$ -25964 -12434 -82614 -256310 57654 54826 -6394 -156063 -258644 135185 -3520 13520
10061b20506d2400l77986J02600a24080A17539g086j28353o4805A05084K1803
$$ -220506 -42400 -420386 -317786 -124080 117539 -7086 -135439 -200244 105084 126887
10051A26887b06831E8054D961a27743C5605a65781F9539f929q4624D9857b79767
$$ 126887 -206831 58054 4961 -127743 35605 -165781 69539 -6929 -91553 49857 -279767
10039e4122l69701b5289q0370r6916C1038J89807F4229J06662p8845b8481j27718
$$ -54122 -423823 -25289 -105659 -202575 31038 220845 64229 170891 92046 -28481 -156199
10028a56199f2241o8967M9525j08222j0498c2280A61956a2068q0240r9116D5135
$$ -156199 -62241 -131208 -81683 -189905 -200403 -32280 161956 -12068 -92308 -191424 45135
10016A44048b4855j53942N1467o440C3155O4319a33109m1118j06244c5201a6834
$$ 144048 -24855 -178797 -127330 -133770 33155 97474 -133109 -174227 -280471 -35201 -16834
10004a0469D9203J9965A786a35946a6084j55663a5016j64823A16823L6118C1045
$$ -10469 49203 69168 1786 -135946 -16084 -171747 -15016 -179839 116823 152941 31045
9992b64745O8868f5098K8523j85052j96069A57935h4119k19373A1173a19920L5622
$$ -264745 -195877 -65098 -36575 -221627 -417696 157935 -84119 -303492 11173 -119920 -84298
9981h4298I3488a94415A11797J03073a406D8445J4944a89417a6819B9614a54829
$$ -84298 93488 -194415 111797 214870 -1406 48445 63389 -189417 -16819 29614 -154829
9969b8442p118m1058H6163c823E052h9849p2080A59987b67308L040J22692B20206
$$ -28442 -35560 -76618 86163 -3823 5052 -89849 -161929 159987 -267308 -264268 -141576 220206
9956A7576b7690j92850Q4759A32038a59458B3574g3650A39480J1975d2991k46837
$$ 17576 -27690 -220540 -135781 132038 -159458 23574 -73650 139480 151455 -42991 -289828
9945b89828b1188k78647J42361g6517c0651l9840j63588D0489i0066b9654B250
$$ -289828 -21188 -299835 -157474 -76517 -30651 -70491 -234079 40489 -90066 -29654 2250
9933A809c25868c1290D232h5533j6654j41332A49825J07706o2651q5316b94643
$$ 1809 -325868 -31290 4232 -85533 -102187 -243519 149825 257531 194880 109564 -294643
9921c32810D5619d04172H1552N6629M4013a39380n8449a8849A12406K69149b30377
$$ -332810 45619 -404172 81552 138181 182194 -139380 -197829 -18849 112406 381555 -230377
9909A15034a57043k18168A64724c19374J58696H5569a88833C63939I0343c4698
$$ 115034 -157043 -375211 164724 -319374 -160678 85569 -188833 363939 90343 -34698
9898d3022E7343a09554a2379l45527a31946A33283J73329A717d7941a2388j84041
$$ -43022 57343 -109554 -12379 -357906 -131946 133283 306612 1717 -47941 -12388 -196429
9887a96429c4123B72944B8603a25792I8293b08086K4787g4687l06343B21006a45416
$$ -196429 -34123 272944 28603 -125792 98293 -208086 -183299 -74687 -381030 221006 -145416
9875C75401F4445N3556a31605A31288f0990A15878A9961a95346l9053R1696e5279
$$ 375401 64445 118001 -131605 131288 -60990 115878 19961 -195346 -234399 -142703 -55279
9863a97065l8916F8893A3260a68332j62366R4265B70689b27102k70262A99242
$$ -197065 -235981 68893 13260 -168332 -330698 -236433 270689 -227102 -497364 199242
9852C04412A52078B9354J16777B3351P6305a0865p64o0770P957r3291C7927b19107
$$ 304412 152078 29354 146131 23351 99656 -10865 -11629 -72399 -64442 -157733 37927 -219107
9839g5044o377j76656J11674B21235c5303E338d3877F8486J58899c00227d9213
$$ -75044 -81421 -258077 -146403 221235 -35303 5338 -43877 68486 227385 -300227 -49213
9827b10318C9732b16222O5325J0465o0747B87514a98072j00656B69530d8901J8767
$$ -210318 39732 -216222 -150897 -140432 -201179 287514 -198072 -298728 269530 -48901 -30134
9816c0134j26954k66764g5863a727H6351a42079M2083A744L51324A60083O0275
$$ -30134 -157088 -423852 -75863 -1727 86351 -142079 -99996 1744 353068 160083 220358
9805B20358c90563J66914a11361j53006l333a08276J1570H4280d90717K37531
$$ 220358 -390563 -223649 -111361 -264367 -267700 -108276 -96706 84280 -490717 -253186
9795b53186b657p7922o1993G8583i6197E9498g5837B75334p8812g2522A04993
$$ -253186 -2657 -80579 -142572 78583 -96197 59498 -75837 275334 196522 -72522 104993
9783i9387F6006f9667B85285D5978f188j14509j24780Q5235o1119L6332d0686
$$ -99387 66006 -69667 285285 45978 -6188 -120697 -245477 -160242 -221361 -185029 -40686
9771C04616b01174Q0412m74786J71084D42734a4049o3136q7407H7701f1040I114
$$ 304616 -201174 -120762 -595548 -424464 442734 -14049 -77185 -164592 87701 -61040 9114
9759A26567I961a97278G0440a60072C11724c9811A98750F2306g7434k8080j39949
$$ 126567 9961 -197278 70440 -160072 311724 -39811 198750 62306 -77434 -105514 -245463
9748b45463P6587f6960r2171n2001a9283l0583B4250O4372f0705E8064b8401A76464
$$ -245463 -168876 -66960 -159131 -211132 -19283 -49866 24250 88622 -60705 58064 -28401 176464
9735A98849b5347l33295a72248f8097j98801a08012N759j07575a3138A0421K76979
$$ 198849 -25347 -358642 -172248 -68097 -266898 -108012 -102253 -209828 -13138 10421 287400
9724B87400e9037j56303B48925i0391k32667A99596n3009a32160H9887a96926
$$ 287400 -59037 -215340 248925 -90391 -323058 199596 146587 -132160 89887 -196926
9713g270o7930A67634F0689a37174L5280k38195a25625B4475a16911k21085D9195
$$ -7270 -75200 167634 60689 -137174 -101894 -340089 -125625 24475 -116911 -337996 49195
9701H8424a55356B05931I7041a82373j2040P0510m6285F4568i6410K6698k37896
$$ 88424 -155356 205931 97041 -182373 -194413 -123903 -170188 64568 -96410 -69712 -307608
9690c07608e6100p5344J9123j32880J03472n73e245B3381a99726i2735b3318B7201
$$ -307608 -56100 -131444 -112321 -245201 -141729 -142302 -5245 23381 -199726 -92735 -23318 27201
9677b3921n2006D7430d464n2346k7913I5933a6487I9615B4752f6129G9638b08549
$$ -23921 -75927 47430 -4464 -56810 -84723 95933 -16487 99615 24752 -66129 79638 -208549
9664b25153n3388A00841H595P5143a34708G0977h4883m09117J35993g0288b90
$$ -225153 -278541 100841 8595 83738 -134708 70977 -84883 -494000 -358007 -70288 -290
9652C24496a69873A39806b27247E0214a26269q2493k43281e2750k82296A07128
$$ 324496 -169873 139806 -227247 50214 -126269 -208762 -452043 -52750 -335046 107128
9641b65355A83175a80202a8014k09866p4394B59467c7317A93513C6666a6866C2614
$$ -265355 183175 -180202 -18014 -227880 -302274 259467 -37317 193513 36666 -16866 32614
9629c3190j484q6081K2485k74799i8716A29192a03583b5023m31519J22101A28688
$$ -33190 -34674 -120755 -98270 -373069 -98716 129192 -103583 -25023 -456542 -334441 128688
9617a64522E6483c0620k20100A4560b97962B0000J91210a11144A26224i5469A22595
$$ -164522 56483 -30620 -250720 14560 -297962 20000 211210 -111144 126224 -95469 122595
9605h7749j6011j36460A2566K3721h3804q1423k80230K00905a07126j03401R4417
$$ -87749 -103760 -240220 12566 36287 -83804 -165227 -445457 -244552 -107126 -210527 -116110
9594a16110A91779b20599B40536n7929b8614k30501A06822b75693A32527a24343
$$ -116110 191779 -220599 240536 182607 -28614 -259115 106822 -275693 132527 -124343
9583B4962b01817A58465b63035J16338g0220I2650b58729g8539j4601I4895f7575
$$ 24962 -201817 158465 -263035 -146697 -70220 92650 -258729 -78539 -93140 94895 -67575
9571a92169G8382K16955b9969o193j86205i2206a4467B54096j04409a23682o1788
$$ -192169 78382 295337 -29969 -36162 -222367 -92206 -14467 254096 149687 -123682 -185470
9560a85470M0827I4090b08352G7252a29094q6295j0877Q7532f866A86441a20575
$$ -185470 -144643 94090 -208352 77252 -129094 -215389 -226266 -138734 -6866 186441 -120575
9548b47416i8255A69118a77297E5755b52741j20391B86879G954P0725k6184b02508
$$ -247416 -98255 169118 -177297 55755 -252741 -373132 286879 7954 78679 52495 -202508
9536i1643E4627j6444N7407a69013A75459B9997c31790A11418A8150J73318a87803
$$ -91643 54627 38183 95590 -169013 175459 29997 -331790 111418 18150 191468 -187803
9524A17157E2675a47300C1983h2819H6801J06852Q3809f9011A3841R7229j5803
$$ 117157 52675 -147300 31983 -82819 86801 193653 277462 -69011 13841 111070 95267
9513I5267d49627I5376l4817J62511c31695A2283a81257D5558c63675g3426j1950
$$ 95267 -449627 95376 60559 223070 -331695 12283 -181257 45558 -363675 -73426 -85376
9502h5376P438m2769k44061h966H3547A4937d4182C7013L26327f6856H384J40980
$$ -85376 -77938 -120707 -364768 -8966 83547 14937 -44182 37013 363340 -66856 8384 149364
9490A49364h127A37599M1690i188j8207n2338j26092a00110j88072a5723j86435
$$ 149364 -8127 137599 179289 -9188 -27395 -79733 -205825 -100110 -288182 -15723 -202158
9479b02158A03197a64147q5086A33654K2262a98107j8629q6668O8032j29649C0761
$$ -202158 103197 -164147 -249233 133654 155916 -198107 -216736 -303404 -235372 -365021 30761
9467a17687j33521a16633A49658K62556h2423j18347g7813j09078m0599j00832
$$ -117687 -251208 -116633 149658 412214 -82423 -200770 -77813 -186891 -227490 -328322
9457c28322A98201c34074J32690f8858j49257Q5583j90582L1174A7116R3888b8092
$$ -328322 198201 -334074 -201384 -68858 -218115 -132532 -323114 -291940 17116 111004 -28092
9445I0258g3416K7046B722a33611r3744K8473j09605P5023E9844L1319a70559
$$ 90258 -73416 -46370 2722 -133611 -227355 -198882 -308487 -233464 59844 91163 -170559
9433F9535c61352a59155A27292E1638J66744g9632o8501J6711p6823K3999p3696
$$ 69535 -361352 -159155 127292 51638 218382 -79632 -148133 -131422 -208245 -184246 -257942
9422b57942C9965b07197j29402A09290b31475A46636l0036a66368n4216Q7989
$$ -257942 39965 -207197 -336599 109290 -231475 146636 116600 -166368 -220584 -132595
9412a32595L695r9328G1002R3417C5336L1918b11534A85497a08794B4318h7138
$$ -132595 -128900 -228228 71002 164419 35336 67254 -211534 185497 -108794 24318 -87138
9400b1744l80790C22636a35513A40531c8313B9358g188I387b92764J08598h4876
$$ -21744 -402534 322636 -135513 140531 -38313 29358 -7188 9387 -292764 -184166 -84876
9388b17753N4593H081J39493a46689A10399m2291b66921e5809j89927a11166H4100
$$ -217753 -163160 8081 147574 -146689 110399 68108 -266921 -55809 -245736 -111166 84100
9376b54006A02837M2581c1431q8674H3870c21011B04540D0014a44559k27137J095
$$ -254006 102837 145418 -31431 -120105 83870 -321011 204540 40014 -144559 -371696 -370601
9365c70601F7203b76858i2000o7410G6067a00729j2579j03820j16567A1348a73628
$$ -370601 67203 -276858 -92000 -159410 76067 -100729 -113308 -217128 -333695 11348 -173628
9353G8396b42269a03204j30970o7932d0100j51127C2764J18164K00387a32588
$$ 78396 -242269 -103204 -234174 -302106 -40100 -191227 32764 150928 351315 -132588
9342a02846n1024e5750j56404F7292K24538b12041A6044Q3917l2109K31196b22481
$$ -102846 -153870 -55750 -212154 67292 291830 -212041 16044 99961 67852 299048 -222481
9330e5625l84401e3438m48461a80667E0951a39302p6501P355C8209J81643a11172
$$ -55625 -440026 -53438 -501899 -180667 50951 -139302 -215803 -208448 38209 219852 -111172
9318a00193K7754G1039c13327j82295D5913f0197J1761c325k20760k57298b19386
$$ -100193 -72439 71039 -313327 -495622 45913 -60197 -48436 -3325 -224085 -481383 -219386
9306b7277C2286J09609a42709e1052D78628b03974a379C09619b29612A21581A8246
$$ -27277 32286 141895 -142709 -51052 478628 -203974 -1379 309619 -229612 121581 18246
9294a41363c6922G2341a23991q0093N411j4193A0499b30154A12979e645r331j76100
$$ -141363 -36922 72341 -123991 -204084 -198673 -212866 10499 -230154 112979 -5645 -14976 -191076
9282a91076c3256B86970d6326j16178f1513A61537b04033h0045l68067A3943h8180
$$ -191076 -33256 286970 -46326 -162504 -61513 161537 -204033 -80045 -448112 13943 -88180
9270C49175i7215D8420c79410J15362e338n06195a61995J766m3025d0495j53920
$$ 349175 -97215 48420 -379410 -264048 -5338 -511533 -161995 -160229 -203254 -40495 -194415
9259a94415B61649A19654b95758O8649F1477K54354h7741A78912b09497K1142
$$ -194415 261649 119654 -295758 -227109 61477 315831 -87741 178912 -209497 -188355
9249a88355C57844A16308d577j39031A56689A5979J2547J32294e07256A30847
$$ -188355 357844 116308 -4577 -143608 156689 15979 28526 160820 -507256 130847
9238b20775e6155o243n9811F3247K72387F3761B7765b16022d6676A63086b69961
$$ -220775 -56155 -62398 -122209 63247 335634 63761 27765 -216022 -46676 163086 -269961
9226d2912E9318M95321b07479D5620i4913j17422j69390a02648C1164D328a54824
$$ -42912 59318 554639 -207479 45620 -94913 -212335 -381725 -102648 31164 4328 -154824
9214H4790O836K6417R1397q6576b96817B43845f5480A4341f6202l0086n2860P2151
$$ 84790 91626 118043 209440 122864 -296817 243845 -65480 14341 -66202 -96288 -149148 -76997
9202g6997K3623B48963q4525b51632e1820k61605j29197f9227H1744a53452K0603
$$ -76997 -53374 248963 164438 -251632 -51820 -313425 -442622 -69227 81744 -153452 -132849
9191a32849d9418j36726A46247o6026a3386D8763a4758A16258g3472H0516c11955
$$ -132849 -49418 -186144 146247 80221 -13386 48763 -14758 116258 -73472 80516 -311955
9179a18147o0374m5450B33236b4819q9263j0895E9867b02042C6850J45871c31398
$$ -118147 -178521 -223971 233236 -24819 -114082 -124977 59867 -202042 36850 182721 -331398
9167a98589B8921g410A06822c18652K4381b6641A07703B8111c20298J23248D6757
$$ -198589 28921 -7410 106822 -318652 -294271 -26641 107703 28111 -320298 -197050 46757
9155H956K05373i3589L4302G0681c2200l5378B98161a44213A9316a12485A0943
$$ 8956 214329 -93589 -59287 70681 -32200 -67578 298161 -144213 19316 -112485 10943
9143c01309N1143A71835f3858k0735H8462b13211d7503F3822e7786f225l3954
$$ -301309 -250166 171835 -63858 -84593 88462 -213211 -47503 63822 -57786 -6225 -40179
9132d0179j96765O1516A20263R8593C061a94792C36550A4301d4000j93470A11106
$$ -40179 -236944 -175428 120263 218856 3061 -194792 336550 14301 -44000 -237470 111106
9120A0541M2597B0427b69767b5822k40856b2381A2857a2412m7110A09648g6252
$$ 10541 53138 20427 -269767 -25822 -266678 -22381 12857 -12412 -59522 109648 -76252
9108a81678a1902D2724h2465o7800C1833J72743e51256a42268B02095b15271L1721
$$ -181678 -11902 42724 -82465 -150265 31833 204576 -551256 -142268 202095 -215271 -183550
9097a83550B0525K11560K72361C4604Q2548a89762P4764a6248q6713P729k47795
$$ -183550 20525 232085 504446 34604 117152 -189762 -114998 -16248 -102961 -95232 -343027
9086c43027h9459r6010J0552E8713L808c45789C4590e4375B18572r5383c06850
$$ -343027 -89459 -185469 -174917 58713 62521 -345789 34590 -54375 218572 123189 -306850
9074b18233r1176c5252A57650m5719a62595M5809k69273e3604A37923n2761c75101
$$ -218233 -309409 -35252 157650 111931 -162595 -116786 -386059 -53604 137923 85162 -375101
9062d7005A46638c5196p7431r7312p0107B52287a59954j39911D5861O585a67638
$$ -47005 146638 -35196 -112627 -209939 -280046 252287 -159954 -299865 45861 52446 -167638
9050b15646a03277A62634b56135D59654a84142C75127a63001r811A7940B326h0095
$$ -215646 -103277 162634 -256135 459654 -184142 375127 -163001 -172812 17940 2326 -80095
9038a32656m9348E5572c6730k0200o7352K3876k8766l3361A12210b20599O4306
$$ -132656 -182004 55572 -36730 -56930 -124282 -100406 -129172 -162533 112210 -220599 -156293
9027a56293B46124A02246k308a71010e3048A55520b5824E751d9351k3394B02445
$$ -156293 246124 102246 99938 -171010 -53048 155520 -25824 5751 -49351 -72745 202445
9015a55446C2099b44117C5575A3968a6317l86119a313C3375b02763r674J03642
$$ -155446 32099 -244117 35575 13968 -16317 -402436 -1313 33375 -202763 -212437 -108795
9004a08795d2596n5227d2979k3560A58501i5623j7674j70418A50902l529F2274
$$ -108795 -42596 -97823 -42979 -66539 158501 -95623 -113297 -283715 150902 147373 62274
8992h8122l40397A04776O5368K37617g0986A56144F1975K87078a91189d0973j89360
$$ -88122 -428519 104776 170144 407761 -70986 156144 61975 349053 -191189 -40973 -230333
8981b30333j98606b9672i569A75895A5109h6479b3393l92442a14709k55412d0118
$$ -230333 -428939 -29672 -9569 175895 15109 -86479 -23393 -415835 -114709 -370121 -40118
8969G1448J3020h2735A77553b05545P1327N5451j93405B74001a25809l4917j40509
$$ 71448 84468 -82735 177553 -205545 -134218 -78767 -272172 274001 -125809 -160726 -301235
8958c01235a1397H3464K30299g8757j99099J19499A06491C4280Q658m104A7996
$$ -301235 -11397 83464 313763 -78757 -277856 -158357 106491 34280 42938 38834 17996
8946a13775A00474c020j00948A59395b16780B6659J86835i9640L703K4054A52225
$$ -113775 100474 -3020 -103968 159395 -216780 26659 213494 -99640 -95937 -71883 152225
8934D46613j53734d1000k57014B27333d79C16971A11273a9263A04540P65045N03340
$$ 446613 292879 -41000 -298014 227333 -479 316971 111273 -19263 104540 869585 1372925
8923A372925J950097J0325110m793265C764288A800156C32910K99345B38824J34525
$$ 1372925 3323022 13648132 8854867 3764288 1800156 332910 632255 238824 373349
8914C73349g5274K4866D5733J30677g0625F65709l19613n2710a16902A34527L506
$$ 373349 -75274 -50408 45733 176410 -70625 665709 346096 293386 -116902 134527 138033
8903A38033P1572c15813a21010K9602o3932B62417b677j02064A67026a82952g0996
$$ 138033 209605 -315813 -121010 -91408 -155340 262417 -2677 -104741 167026 -182952 -70996
8891a55152j47420A17280L3522a17148F2451d5861j07730B23223D1338a07117
$$ -155152 -302572 117280 150802 -117148 62451 -45861 -153591 223223 41338 -107117
8880A65507b37353R2682F530i1780c9450B50751M0097B9923f9660B5771a24115
$$ 165507 -237353 -144671 6530 -91780 -39450 250751 290848 29923 -69660 25771 -124115
8868f346j76111j89962J27557A52146f6758A14601n3819e7941B08152g8250k92044
$$ -6346 -182457 -372419 -244862 152146 -66758 114601 60782 -57941 208152 -78250 -370294
8857c70294a5099A76562F9372B812b32850H1588g6653C1102j1345J23643B5769
$$ -370294 -15099 176562 69372 2812 -232850 81588 -76653 31102 19757 143400 25769
$$ [...]
##END NTUPLES=NMR SPECTRUM
##END=
