
##TITLE=AC1303_PERAH12115_6641754_p1tBAZZZUx
##JCAMPDX= 6.0         $$ Bruker NMR JCAMP-DX V2.0
##DATA TYPE= NMR SPECTRUM
##DATA CLASS= NTUPLES
##ORIGIN= BRUKER
##OWNER= Administrator
$$ 1.72 TOPSPIN		Version 2.1
$$ 2012-08-10 15:37:17.609 -0500  Administrator@TOPSPIN
$$ Compression mode = diff/dup
##.OBSERVE FREQUENCY= 400.02188249412
##.OBSERVE NUCLEUS= ^1H
##.ACQUISITION MODE= SIMULTANEOUS (DQD)
##.ACQUISITION SCHEME= undefined
##.AVERAGES= 64
##.DIGITISER RES= 22
##SPECTROMETER/DATA SYSTEM= spect
##.PULSE SEQUENCE= noesygpps1d.comp
##.SOLVENT NAME= COFFEE_meoh
##.SHIFT REFERENCE= INTERNAL, COFFEE_meoh, 1, 14.96072
##AUDIT TRAIL= $$ (NUMBER, WHEN, WHO, WHERE, PROCESS, VERSION, WHAT)
$$ ##TITLE= Audit trail, TOPSPIN		Version 2.1
$$ ##JCAMPDX= 5.01
$$ ##ORIGIN= Bruker BioSpin GmbH
$$ ##OWNER= Administrator
$$ $$ C:\Bruker\TOPSPIN/data/COFFEE/nmr/AC1303_PERAH12115_6641754_p1tBAZZZUx/42/pdata/1/auditp.txt
$$ ##AUDIT TRAIL=  $$ (NUMBER, WHEN, WHO, WHERE, PROCESS, VERSION, WHAT)
(   1,<2012-08-10 15:37:12.453 -0500>,<Administrator>,<TOPSPIN>,<go>,<TOPSPIN 2.1>,
      <created by zg
	started at 2012-08-10 15:25:42.234 -0500,
	POWCHK enabled, PULCHK disabled,
       configuration hash MD5:
       6B 1B 68 BB D9 2E 58 E2 7F 35 AD 54 07 DF 0E 41
       data hash MD5: 64K
       92 E1 BF 3D A1 2F 59 27 B5 4E AF 66 09 CA C2 AF>)
(   2,<2012-08-10 15:37:15.593 -0500>,<Administrator>,<TOPSPIN>,<proc1d>,<TOPSPIN 2.1>,
      <Start of raw data processing
       efp LB = 0.3 FT_mod = 6 PKNL = 1 PHC0 = 0 PHC1 = 0 SI = 128K 
       data hash MD5: 128K
       9C 5E ED 7F 2D D5 70 32 6A F5 89 9A 72 21 AC 0E>)
(   3,<2012-08-10 15:37:16.812 -0500>,<Administrator>,<TOPSPIN>,<proc1d>,<TOPSPIN 2.1>,
      <pk PHC0 = 5.509644 PHC1 = 0 
       data hash MD5: 128K
       BC 2D B7 8F 20 D8 4D 0E 07 F9 4F C3 A9 E7 20 89>)
(   4,<2012-08-10 15:37:17.265 -0500>,<Administrator>,<TOPSPIN>,<proc1d>,<TOPSPIN 2.1>,
      <abs ABSG = 1 
       data hash MD5: 128K
       94 9D 02 6D AD 91 26 D0 96 A2 1D 49 9C 71 F5 7F>)
(   5,<2012-08-10 15:37:17.359 -0500>,<Administrator>,<TOPSPIN>,<proc1d>,<TOPSPIN 2.1>,
      <abs ABSG = 2 
       data hash MD5: 128K
       6D EE D9 5E 71 CF 37 A8 6E 6B 35 CA 73 50 6F 0D>)
(   6,<2012-08-10 15:37:17.406 -0500>,<Administrator>,<TOPSPIN>,<proc1d>,<TOPSPIN 2.1>,
      <abs ABSG = 3 
       data hash MD5: 128K
       04 D3 59 66 71 91 B1 5F 40 0E 73 A1 AB F9 5E F7>)
(   7,<2012-08-10 15:37:17.468 -0500>,<Administrator>,<TOPSPIN>,<proc1d>,<TOPSPIN 2.1>,
      <abs ABSG = 4 
       data hash MD5: 128K
       3A 48 04 1A F2 30 18 26 60 4F E7 04 5A D5 81 F3>)
(   8,<2012-08-10 15:37:17.515 -0500>,<Administrator>,<TOPSPIN>,<proc1d>,<TOPSPIN 2.1>,
      <abs ABSG = 5 
       data hash MD5: 128K
       2E 4A 01 E4 67 98 37 37 EF 8B 8E BB 21 38 45 90>)
$$ ##END=
$$ 
$$ $$ hash MD5
$$ $$ 83 0E 17 17 B2 51 47 C0 2F 6C A4 C4 4C 98 14 DC
##$RELAX= 
##$RELAX= 
##$RELAX= 
##$RELAX= 
##$RELAX= 
##$RELAX= 
##$RELAX= 
##$RELAX= 
$$ Bruker specific parameters
$$ [...]
150 150 150 150 150 150 150 150
##$TP07= 0
##$TPNAME0= <>
##$TPNAME1= <>
##$TPNAME2= <>
##$TPNAME3= <>
##$TPNAME4= <>
##$TPNAME5= <>
##$TPNAME6= <>
##$TPNAME7= <>
##$TPOAL= (0..7)
0.5 0.5 0.5 0.5 0.5 0.5 0.5 0.5
##$TPOFFS= (0..7)
0 0 0 0 0 0 0 0
##$TUNHIN= 0
##$TUNHOUT= 0
##$TUNXOUT= 0
##$USERA1= <user>
##$USERA2= <user>
##$USERA3= <user>
##$USERA4= <user>
##$USERA5= <user>
##$V9= 5
##$VALIST= <valist>
##$VCLIST= <CCCCCCCCCCCCCCC>
##$VD= 0
##$VDLIST= <DDDDDDDDDDDDDDD>
##$VPLIST= <PPPPPPPPPPPPPPP>
##$VTLIST= <TTTTTTTTTTTTTTT>
##$WBST= 1024
##$WBSW= 4
##$XGAIN= (0..3)
0 0 0 0
##$XL= 0
##$YL= 0
##$YMAX_a= 13123748
##$YMIN_a= -9511331
##$ZGOPTNS= <>
##$ZL1= 120
##$ZL2= 120
##$ZL3= 120
##$ZL4= 120
##$ABSF1= 14.96072
##$ABSF2= -5.597462
##$ABSG= 5
##$ABSL= 3
##$ALPHA= 0
##$AQORDER= 0
##$ASSFAC= 0
##$ASSFACI= 0
##$ASSFACX= 0
##$ASSWID= 0
##$AUNMP= <proc_prof1d_extract.lims>
##$AXLEFT= 0
##$AXNAME= <>
##$AXNUC= <1H>
##$AXRIGHT= 0
##$AXTYPE= 0
##$AXUNIT= <>
##$AZFE= 0.1
##$AZFW= 0.1
##$BCFW= 0
##$BC_mod= 0
##$BYTORDP= 0
##$COROFFS= 0
##$CY= 15
##$DATMOD= 1
##$DC= 0
##$DFILT= <>
##$DTYPP= 0
##$F1P= 0
##$F2P= 0
##$FCOR= 0.5
##$FTSIZE= 131072
##$FT_mod= 6
##$GAMMA= 0
##$GB= 0
##$INTBC= 1
##$INTSCL= 1
##$ISEN= 128
##$LB= 0.3
##$LEV0= 0
##$LPBIN= 0
##$MAXI= 10000
##$MC2= 0
##$MEAN= 0
##$ME_mod= 0
##$MI= 0
##$NCOEF= 0
##$NC_proc= -2
##$NLEV= 6
##$NOISF1= 0
##$NOISF2= 0
##$NSP= 0
##$NTH_PI= 0
##$NZP= 0
##$OFFSET= 14.96072
##$PC= 1
##$PHC0= 5.509644
##$PHC1= 0
##$PH_mod= 1
##$PKNL= yes
##$PPARMOD= 0
##$PPDIAG= 0
##$PPIPTYP= 0
##$PPMPNUM= 2147483647
##$PPRESOL= 1
##$PSCAL= 4
##$PSIGN= 0
##$PYNMP= <proc.py>
##$REVERSE= no
##$SF= 400.020009747022
##$SI= 131072
##$SIGF1= 0
##$SIGF2= 0
##$SINO= 400
##$SIOLD= 131072
##$SPECTYP= <>
##$SREGLST= <1H.CDCl3>
##$SSB= 0
##$STSI= 131072
##$STSR= 0
##$SW_p= 8223.68421052631
##$SYMM= 0
##$S_DEV= 0
##$TDeff= 65536
##$TDoff= 0
##$TI= <>
##$TILT= no
##$TM1= 0
##$TM2= 0
##$TOPLEV= 0
##$USERP1= <user>
##$USERP2= <user>
##$USERP3= <user>
##$USERP4= <user>
##$USERP5= <user>
##$WDW= 1
##$XDIM= 131072
##$YMAX_p= 392517593
##$YMIN_p= -11391
##$CURPLOT= <Network HP LaserJet P1505>
##$CURPRIN= <$Network HP LaserJet P1505>
##$DFORMAT= <normdp>
##$LAYOUT= <+/1D_H.xwp>
##$LFORMAT= <normlp>
##$PFORMAT= <normpl>
##$SURQMSG= 1
$$ End of Bruker specific parameters
$$ ---------------------------------
##NTUPLES= NMR SPECTRUM
##VAR_NAME=  FREQUENCY,     SPECTRUM/REAL,   SPECTRUM/IMAG
##SYMBOL=    X,             R,               I
##VAR_TYPE=  INDEPENDENT,   DEPENDENT,       DEPENDENT
##VAR_FORM=  AFFN,          ASDF,            ASDF
##VAR_DIM=   131072,        131072,          131072
##UNITS=     HZ,            ARBITRARY UNITS, ARBITRARY UNITS
##FACTOR=    0.0627417313425164, 1,          1
##FIRST=     8223.62146879497, 3601,         -65832
##LAST=      0,             5356,            -65635
##MIN=       0,             -11391,          0
##MAX=       8223.62146879497, 392517593,    0
$$ Real data points
##PAGE= N=1
##DATA TABLE= (X++(R..R)), XYDATA
$$ [...]
67817 191317 193074 194546 195757 196365 196001 195064 194578 195009 195605 195171 193291 190544 187693 185060 182713 180888
67801 180888 179855 179452 179098 178432 177680 177169 176746 176012 174968 173974 173129 172211 171309 170976 171493 172400 173068 173421
67783 173421 173758 174153 174398 174371 174113 173658 173105 172736 172786 173203 173825 174707 176052 177920 180109 182108 183093 182442
67765 182442 180630 179192 179298 180587 181887 182798 183934 185787 188076 190240 191910 192764 192551 191486 190174
67750 190174 188990 187994 187518 188137 189733 191234 191783 191738 191975 192643 193231 193552 193884 194189 193916 192861 191671
67733 191671 191154 191299 191325 190555 189031 187286 185761 184486 183230 181864 180491 179264 178189 177232 176585 176644
67717 176644 177628 179210 180594 181047 180441 179303 178351 177902 177768 177647 177521 177602 177960 178286 178154 177513 176844 176744
67699 176744 177370 178395 179434 180304 180830 180757 180119 179545 179781 180824 181785 181790 180924 180191 180555 182069 183976 185570
67681 185570 186815 187983 188945 189248 188926 188722 189189 189986 190467 190614 190862 191244 191419 191498 192120 193515 195090 196216
67663 196216 196997 197926 199217 200814 202712 204755 206356 206909 206537 206081 206236 206835 207113 206547 205359 204160
67647 204160 203250 202526 202090 202525 204100 205978 206830 206281 205243 204717 204822 205160 205497 205721 205599 205135 204860 205311
67629 205311 206365 207457 208313 209100 210032 211135 212291 213247 213685 213580 213350 213477 214153 215400 217157 219019
67613 219019 220287 220721 220888 221405 222186 222913 223809 225224 226779 227715 228008 228309 228767 228776 228103 227433 227351 227408 226729
67594 226729 225144 223239 221568 220247 219148 218124 217088 216103 215330 214783 214246 213520 212619 211724 211154 211293
67578 211293 212206 213276 213727 213617 213822 214836 216093 216860 217311 218160 219538 220829 221484 221492 221126 220718 220664 221170
67560 221170 221909 222303 222263 222255 222573 222898 222794 222286 221688 221103 220454 219846 219573 219695 219892 219862 219758 220010 220701 221231
67540 221231 220795 219238 217355 216177 215993 216175 216015 215538 215355 215829 216656 217363 217948 218743 219753 220452 220407 219850
67522 219850 219434 219543 220036 220560 220877 220905 220716 220511 220448 220462 220409 220355 220487 220769 220964 221004 221040 221038 220643 219681 218580
67501 218580 218053 218500 219841 221658 223291 224105 224070 224016 224936 226995 229393 231133 231670 231007 229589 228151 227321
67484 227321 227196 227500 228169 229429 231206 232811 233544 233413 233008 232846 233117 233909 235239 236807 238052 238671 238936
67467 238936 239312 239876 240226 239952 239056 237958 237185 237085 237711 238841 240079 241040 241532 241664 241753 242075 242630 243123
67449 243123 243190 242699 241925 241464 241853 243142 244809 246170 246937 247371 247917 248771 249772 250565 250832 250550 250138 250193
67431 250193 250891 251788 252401 252879 253728 254950 255848 255826 255055 254121 253292 252429 251431 250465 249779 249504 249557 249609 249333
67412 249333 248870 248849 249585 250441 250395 249220 247731 246907 247181 248553 250749 253063 254609 255143 255320 255828 256580
67395 256580 257152 257578 258099 258382 257725 256113 254459 253558 253291 253163 253145 253571 254449 255364 256021 256469 256789 256876 256670
67376 256670 256372 256285 256523 256995 257524 257939 258138 258143 258014 257649 256817 255549 254352 253834 254140 254929 255871 256886 257891
67357 257891 258588 258716 258383 257947 257705 257798 258295 259162 260206 261205 262014 262480 262517 262441 262957 264387 266069 266977 266887
67338 266887 266455 266150 265754 265120 264833 265579 267300 269439 271746 274268 276699 278434 279356 280044 280994 282069
67322 282069 282913 283514 284023 284313 284099 283405 282592 281916 281334 280736 280159 279746 279718 280414 282082 284411 286431 287170
67304 287170 286459 284958 283436 282234 281454 281325 282080 283523 285040 286117 286699 286999 287148 287130 286936 286611 286152
67287 286152 285482 284517 283252 281814 280498 279654 279472 279858 280597 281593 282891 284442 285883 286630 286266 284947
67271 284947 283413 282557 282855 284127 285748 287101 287969 288620 289411 290305 290917 291151 291489 292350 293335 293563 292788
67254 292788 291697 291017 290715 290323 289668 288964 288448 288318 288880 290300 292164 293606 293976 293330 292259 291367 290891
67237 290891 290683 290516 290357 290221 289860 288881 287356 286023 285628 286205 287187 288045 288565 288771 288842 289098 289713 290517
67219 290517 291302 292171 293255 294187 294273 293291 291864 290941 291025 291845 292591 292546 291754 290976 290769 290768 290283 289457 289231 290051
67199 290051 291205 291759 291719 291858 292603 293521 293877 293445 292723 292442 292806 293153 292548 290820 288889 287926 288280 289349
67181 289349 290333 290948 291453 292200 293276 294570 296033 297618 298928 299291 298541 297543 297452 298466 299705 300324 300260
67164 300260 299806 299010 297861 296674 295876 295583 295648 295921 296228 296314 296078 295663 295160 294449 293569 292918 292763 292883 293037
67145 293037 293470 294402 295319 295381 294550 293725 293669 294286 295120 296113 297556 299528 301642 303312 304198 304485 304692 305153
67127 305153 305779 306414 307139 307934 308272 307595 306161 304966 304732 305343 306309 307328 308256 308985 309545 310074 310573 311007
67109 311007 311671 312935 314516 315596 315958 316385 317495 318754 319300 319312 319713 320706 321466 321414 321008 320954 321199 321196 320860
67090 320860 320783 321525 322922 324133 324341 323552 322721 322916 324313 326158 327706 328912 330131 331524 333021 334623
67074 334623 336318 337792 338554 338499 338208 338550 339964 342087 344063 345263 345798 346316 347340 348866 350571 352185
67058 352185 353569 354614 355305 355821 356428 357223 358126 359046 359955 360729 361083 360759 359811 358677 357938 357962 358760 360153
67040 360153 361987 364104 366241 368167 369980 372048 374571 377343 380034 382505 384697 386466 387784 388984
67026 388984 390449 392075 393288 393687 393515 393482 394301 396338 399389 402631 405065 406303 406882 407697 409105 410685
67010 410685 411832 412455 413130 414599 417132 420365 423700 426793 429619 432231 434698 437266 440305 443938 447809
66995 447809 451272 453860 455633 457262 459702 463439 467942 472087 475280 477964 480894 484211 487508 490601
66981 490601 493750 497188 500880 504813 509173 513975 518780 523075 526877 530779 535377 540777 546590 552313
66967 552313 557662 562639 567376 572034 576883 582368 588834 596168 603800 611152 617962 624172 629800 635111
66953 635111 640735 647255 654664 662495 670490 678845 687728 696959 706473 716729 728185 740448 752472
66940 752472 763689 774564 785914 798082 810931 824205 837526 850402 862754 875270 888815
66929 888815 903589 919192 935277 951693 968194 984616 1001315 1018807 1036919 1054972 1072921
66918 1072921 1091614 1111597 1132419 1153565 1175397 1198532 1222775 1247487 1272602 1298483 1324950
66907 1324950 1351331 1377497 1404051 1431328 1458923 1486518 1514590 1543905 1574664 1606443 1638690
66896 1638690 1671044 1703464 1736226 1769536 1803043 1836098 1868690 1901674 1935733 1970419 2004617
66885 2004617 2037736 2069994 2101696 2132705 2162691 2191529 2219255 2245788 2270838 2294105 2315501
66874 2315501 2335209 2353466 2370240 2385153 2397739 2407805 2415548 2421374 2425554 2428001 2428385 2426424 2421933
66861 2421933 2414586 2403995 2390274 2374292 2356967 2338445 2318335 2296637 2273886 2250333 2225521
66850 2225521 2198872 2170294 2140028 2108329 2075579 2042361 2009052 1975513 1941422 1906744 1871770
66839 1871770 1836866 1802302 1768033 1733580 1698510 1663205 1628656 1595239 1562117 1528262 1493660
66828 1493660 1459113 1425293 1392565 1361361 1331929 1303740 1275778 1247558 1219448 1191959 1165179
66817 1165179 1138989 1113471 1088895 1065533 1043487 1022482 1001872 981167 960510 940352 920738
66806 920738 901265 881762 862597 844211 826617 809457 792341 775080 757824 740976 724795
66795 724795 709120 693673 678449 663579 649044 634984 622031 610716 600560 590395 579677
66784 579677 568900 558550 548322 537686 526707 515881 505519 495667 486370 477662 469501 461892
66772 461892 454819 447970 440939 433944 427771 422636 417584 411586 404856 398428 392690 387041 380899 374309
66758 374309 367473 360382 353236 346686 341221 336547 331980 327268 322738 318628 314649 310366 305843 301653
66744 301653 298169 295102 291950 288681 285580 282490 278814 274475 270351 267249 264851 262238 259192 256300
66730 256300 253846 251332 248298 244984 241855 238931 235944 232869 229935 227313 225018 222909 220582 217513
66716 217513 213642 209658 206393 204078 202424 201227 200460 199821 198693 196755 194377 192209 190508 189012 187375
66701 187375 185581 183884 182407 180889 178974 176769 174866 173668 172869 171890 170660 169576 168685 167412 165345
66686 165345 162899 160851 159386 157965 156051 153617 150991 148514 146439 144814 143340 141561 139443 137587
66672 137587 136627 136480 136383 135690 134451 133207 132418 132150 132192 132280 132225 131919 131270 130203 128790 127408 126584 126452
66654 126452 126415 125580 123720 121610 120259 119904 120015 120137 120316 120662 120972 121063 121123 121338 121425 120976 120155 119542 119280
66635 119280 118881 117980 116803 115646 114410 112996 111789 111201 110930 110169 108590 106777 105638 105636 106555 107671
66619 107671 108116 107443 106014 104625 103645 102735 101538 100370 99896 100203 100548 100187 99286 98723 98982 99491 99285
66602 99285 98135 96707 95639 94894 94173 93561 93427 93890 94725 95643 96348 96476 95846 94780 93870 93421 93366 93592
66584 93592 93961 94114 93629 92460 90882 89117 87441 86594 87379 89572 91750 92624 92202 91343 90606 89978 89436
66567 89436 89118 88999 88815 88375 87638 86498 84873 83046 81607 80893 80652 80358 79707 78798 77934 77351 76994 76589
66549 76589 76021 75642 76005 77197 78551 79181 78831 78154 78043 78707 79487 79631 79109 78543 78481 78988 79888 81033
66531 81033 82238 83242 83932 84400 84667 84572 84013 83051 81643 79633 77212 75078 73797 73248 72986 72874 72968
66514 72968 73066 72925 72777 73070 73733 74225 74381 74608 75151 75682 75899 75999 76196 76182 75577 74680 74237 74537 75130 75457
66494 75457 75397 75084 74528 73618 72384 71106 70183 69914 70332 71128 71822 72078 71914 71580 71263 71023 71021 71584 72775
66475 72775 73954 74162 73150 71813 71265 71606 71918 71435 70333 69315 68793 68674 68638 68329 67403 65729 63602
66458 63602 61641 60439 60296 61123 62549 64180 65852 67519 68914 69644 69789 70107 71265 72997 74390 74967
66442 74967 75096 75278 75475 75390 74999 74382 73205 71007 68144 66001 65804 67320 69102 70059 70427 71053 72105
66425 72105 72925 73010 72635 72343 72241 72064 71706 71352 71155 71093 71038 70749 69902 68466 67045 66449 66826 67508 67835
66406 67835 67758 67500 67033 66266 65416 64742 64082 63155 62227 61991 62720 64023 65471 66959 68305 69060 69055 68669 68176
66387 68176 67276 65866 64846 65371 67372 69514 70713 71008 70874 70421 69727 69321 69640 70283 70412 69810 69082
66370 69082 68858 69219 69929 70749 71435 71766 71827 71974 72340 72547 72153 71267 70475 70161 70116 69905 69440 69029 68946 69149
66350 69149 69454 69778 70076 70171 69863 69164 68267 67325 66416 65690 65341 65450 66026 67111 68547 69736 70052 69560
66332 69560 68919 68455 67836 66882 66163 66287 67002 67538 67612 67518 67400 67099 66726 66740 67291 67952 68348 68626 69096 69728
66312 69728 70268 70585 70681 70579 70346 70017 69378 68176 66745 66062 66800 68518 70103 70901 71112 71269 71691 72425
66294 72425 73281 73820 73622 72768 71922 71795 72568 73814 74871 75232 74806 73971 73303 73079 73032 72692 72004 71496 71708
66275 71708 72527 73203 73052 72052 70732 69671 69206 69430 70202 71141 71848 72201 72323 72280 72020 71673 71648 72217 73103
66256 73103 73644 73393 72476 71430 70763 70620 70753 70831 70804 70950 71551 72614 73934 75321 76621 77590 77906 77411
66238 77411 76312 75113 74324 74215 74798 75941 77397 78700 79255 78785 77726 76915 76775 76910 76656 75857 74931
66221 74931 74257 73794 73328 72867 72567 72441 72349 72206 72043 71870 71772 72158 73563 75954 78495 80381 81723 83142
66203 83142 84576 85117 84244 82714 81735 81665 81992 82349 82884 83631 84119 83876 82997 82017 81404 81329 81673 82077 82141
66184 82141 81790 81441 81692 82855 84683 86482 87534 87607 87074 86441 85876 85365 85101 85354 85963 86374 86315 86115
66166 86115 86207 86556 86731 86414 85701 85063 85015 85678 86680 87651 88676 89909 90901 90863 89759 88531 87940 87657
66148 87657 86903 85584 84293 83475 83106 83055 83232 83398 83276 82884 82425 81824 80778 79408 78525 78914 80473 82262
66130 82262 83425 84003 84740 86129 87754 88721 88690 88214 88027 88278 88614 88777 88884 89211 89899 90777 91453 91781
66112 91781 92270 93616 95615 96958 96588 94989 93644 93355 93667 93857 93827 93774 93500 92540 90819 88909 87610
66095 87610 87382 88118 89321 90490 91411 92159 92972 94117 95671 97324 98572 99286 99862 100625 101297 101416 101042
66078 101042 100670 100528 100454 100415 100634 101048 101152 100663 100043 100024 100817 101998 103043 103705 103994 104075 104236 104759 105702
66059 105702 106779 107538 107733 107557 107393 107324 107077 106546 106079 105951 105792 104994 103649 102622 102628 103574 104889 106037
66041 106037 106609 106396 105688 105185 105256 105524 105475 105272 105580 106700 108204 109397 109830 109417 108361 107127 106338 106538
66023 106538 107994 110546 113552 116137 117756 118522 118901 119176 119395 119742 120599 122093 123785 124996 125454 125507
66007 125507 125716 126319 127162 128108 129344 131158 133484 135905 138162 140497 143339 146762 150412 153936 157329
65992 157329 160870 164810 169117 173405 177119 179884 181745 183043 184063 184803 185012 184362 182686 180214 177613
65977 177613 175590 174287 173139 171432 168970 166066 163001 159775 156465 153477 151130 149162 146985 144415
65963 144415 141808 139462 137289 135186 133357 132009 131076 130505 130542 131344 132545 133608 134452 135342 136330 137317
65947 137317 138557 140490 143010 145451 147475 149482 151888 154502 156963 159322 161766 164044 165690 166687
65933 166687 167521 168617 169997 171436 172641 173359 173638 173991 175048 176975 179424 182033 184790 187868 191285
65918 191285 194806 198167 201384 204782 208561 212371 215609 218265 221085 224628 228450 231638 233922 235747
65904 235747 237309 238178 238096 237669 237856 238960 240425 241566 242226 242696 243201 243538 243202 241837 239564 236852 234074
65887 234074 231187 227858 223886 219492 215115 210862 206241 200699 194443 188429 183446 179493 176229 173576
65873 173576 171478 169409 166803 163878 161413 159679 158270 157049 156499 156723 156816 155919 154434 153432 153105 152614
65857 152614 151469 150232 149674 149845 150349 150981 151664 152130 152168 152005 152069 152504 153246 154392 156026 157762 158976
65840 158976 159631 160443 161992 163911 165228 165330 164402 163107 162116 161905 162608 163933 165355 166586 167901 169939
65824 169939 173181 177622 182873 188487 194104 199367 203958 207872 211514 215295 219147 222606 225291 227062
65810 227062 227777 227302 225908 224243 222628 220664 217865 214465 211185 208386 205893 203610 201794 200612 199791
65795 199791 198891 197608 195732 193182 190302 187802 186133 185148 184654 184946 186376 188540 190448 191660 192969
65780 192969 195739 200715 207494 214981 222245 229090 236055 243864 252779 262327 271585 279686 286086 290417
65766 290417 292175 290782 286160 279149 271018 262456 253316 243566 234110 226256 220497 216330 213252 211384
65752 211384 210964 211811 213745 217109 222278 228879 236235 244576 255057 268207 282967 297746 312006
65739 312006 326109 339955 352608 363354 372255 379316 383775 384823 382587 377753 370447 360222 347181
65726 347181 332487 317512 302899 288709 275128 262589 251277 240826 230610 220294 210123
65715 210123 200713 192548 185617 179498 173681 167863 162158 157201 153773 151981 150938 149615 147918 146570
65701 146570 145960 145685 145346 145241 145875 147096 148176 148590 148397 147961 147605 147510 147696 148077 148652 149597 151024 152710
65683 152710 154203 155210 155848 156638 158305 161343 165597 170435 175472 180947 187230 194238 201701 209872 219510
65668 219510 231078 244268 258466 273441 289384 306392 324131 342029 359657 376772 392976
65657 392976 407526 419675 429217 436530 442085 446085 448600 449765 449759 448833 447554 446770 447032 448165 449602
65642 449602 450997 452266 453157 453122 451647 448442 443213 435438 424543 410395 393693 375817 358030 340696
65628 340696 323405 305931 288812 272785 257962 243930 230562 218362 207947 199403 192157 185372
65616 185372 178583 172148 166966 163468 160975 158310 155004 151617 148895 146950 145386 143907 142548 141432
65602 141432 140512 139610 138683 137936 137592 137597 137738 138018 138643 139511 140094 140050 139682 139531 139757 140278 141241 142938 145381
65583 145381 148381 151924 156008 160215 164013 167508 171447 176433 182568 189928 198832 209442 221531 234847
65569 234847 249350 264886 281031 297460 314061 330412 345512 358389 368749 376707 382143 384659
65557 384659 384007 380270 373745 364893 354208 341885 327801 312140 295857 280143 265509 251747
65545 251747 238696 226594 215667 205821 196967 189266 182764 177063 171794 167320 164475 163482 163488 163476 163362
65530 163362 163754 164810 165899 166483 166744 166998 166895 165676 163045 159334 155066 150759 147008 144184 142001
65515 142001 139817 137390 134959 132742 130894 129897 130273 131703 133129 134028 134989 136642 138619 140098 140895
65500 140895 141320 141283 140287 138323 136186 134864 134904 136251 138236 139828 140412 140414 140803 142032 143895 146374 149958
65483 149958 154860 160427 165694 170205 173884 176436 177501 177356 176908 176752 176572 175692 173957 171769 169461
65468 169461 167023 164382 161467 158004 153770 149299 145804 143904 142786 141165 138861 136803 135641 135116
65454 135116 134880 135118 135964 136904 137312 137181 136936 136845 136993 137423 137845 137559 136311 135036 135148 137047 139781 142138
65436 142138 143658 144602 145474 146747 148699 151318 154484 158184 162249 165952 168325 169007 168454 167219 165412
65421 165412 163086 160798 159311 158811 158676 158095 156781 155055 153422 152176 151422 151212 151465 151786 151690 151127 150586
65404 150586 150456 150535 150401 150131 150276 151139 152442 153740 154934 156326 158385 161504 165675 170235 174082 176406
65388 176406 177229 177224 177009 176702 176087 175120 174145 173471 172832 171532 169313 166877 165351 165264 166225 167476 168544 169406
65370 169406 170260 171212 172137 172912 173781 175267 177522 179966 181875 183217 184638 186688 189449 192927 197385
65355 197385 203041 209659 216684 223812 231330 239765 249075 258219 265728 270904 274243 276616 278257 278784
65341 278784 277901 275683 272348 268234 263898 259781 255717 251236 246326 241446 236641 231230 224677 217395
65327 217395 210358 204148 198738 193988 189951 186737 184359 182693 181445 180164 178505 176489 174421 172519
65313 172519 170703 168734 166521 164253 162233 160599 159222 157932 156729 155704 154833 154035 153399 153186 153590
65298 153590 154568 155849 157022 157760 158156 158782 160164 162205 164246 165694 166430 166773 167215 168063 169039 169374 168624
65281 168624 167294 166269 165742 165146 164150 163099 162351 161798 161330 161228 161560 161626 160637 158864 157539 157541 158533 159503
65263 159503 159843 159734 159716 160103 160809 161515 161868 161618 160794 159884 159688 160687 162550 164393 165438 165337 164112 162236
65245 162236 160636 160036 160073 159539 157731 155250 153194 151950 151106 150228 149235 148211 147301 146828 147135 148241 149858
65228 149858 151730 153679 155346 156192 155961 154960 153720 152453 151004 149366 147987 147354 147292 147021 146109 145100
65212 145100 144850 145449 146213 146664 146973 147379 147720 147834 147945 148321 148792 148981 148782 148332 147696 146829 145677 144150
65194 144150 142244 140390 139356 139487 140304 141171 142089 143465 145413 147712 150183 152576 154294 154900 154873 155294
65178 155294 156611 158177 159149 159392 159365 159533 160135 161205 162444 163207 162915 161585 159902 158790 158811 159813 161179
65161 161179 162456 163688 165099 166722 168536 170659 173011 174989 175982 176211 176617 177906 180123 183176 187232
65146 187232 192432 198637 205713 213699 222536 232012 242171 253328 265341 277277 288287 298539 308858
65133 308858 319563 330084 339694 348216 356022 363635 371304 378614 384483 387863 388585 387398 385178 382332
65119 382332 378939 375066 370693 365491 358988 351024 341999 332674 323624 314813 305680 295776 285277 274794
65105 274794 264717 254980 245458 236331 227940 220506 214139 208921 204682 200842 196741 192229 187723 183720
65091 183720 180366 177513 174986 172737 170847 169427 168420 167611 166978 166919 167795 169268 170456 170804 170442 169634
65075 169634 168452 167277 166976 167961 169436 170274 170448 170834 171681 172134 171473 170097 168909 168332 168355 168970 169970
65058 169970 170696 170593 169940 169511 169671 170175 170757 171425 172167 172843 173429 174014 174417 174101 172686 170460 168287 166971
65040 166971 166641 166666 166227 165065 163602 162338 161286 160096 158496 156527 154545 153130 152717 153097 153486 153247
65024 153247 152334 150942 149197 147466 146494 146668 147440 147960 148066 148174 148458 148795 149279 150190 151472 152837 154369
65007 154369 156406 158845 161141 163040 164776 166559 168447 170706 173549 176484 178697 180251 182107 184663
64993 184663 187048 188263 188258 187511 186349 185284 185207 186430 188096 189373 190727 193080 196178 198844 200697 202526
64977 202526 204911 207457 209605 211273 212309 212092 210207 207035 203223 198998 194412 189890 186001 182888
64963 182888 180301 178028 175951 173858 171605 169404 167619 166300 165193 164197 163527 163348 163502 163753 164131 164814
64947 164814 165750 166577 166975 166975 166799 166477 165770 164517 162890 161299 160090 159362 158981 158756 158729 159295 160809 162958
64929 162958 164805 165655 165705 165603 165618 165577 165421 165313 165146 164471 163177 161871 161267 161387 161655 161652 161469 161361 161372 161450
64909 161450 161745 162638 164420 166923 169491 171459 172810 174259 176489 179376 182250 185050 188866 194949 203260
64894 203260 212349 220732 228080 234880 241358 247168 252075 256475 261074 266253 271855 277418 282543 287153
64880 287153 291427 295373 298467 299911 299281 296739 292686 287516 281690 275630 269397 262863 256423 251095
64866 251095 247594 245619 244409 243550 242826 241744 239959 237962 236506 235357 233402 230139 226263 222500 218566
64851 218566 213826 208398 203017 198164 193858 190003 186385 182633 178804 175800 174553 174777 175175 174871 174077
64836 174077 173365 173003 173166 174046 175317 176072 175839 175199 174899 174778 174210 173266 172616 172452 172404 172635 174128 177362
64818 177362 181292 184265 185697 186462 187867 190648 194741 199527 204273 208692 213158 218306 224493 231738
64804 231738 239883 248476 256704 263881 269898 274877 278523 280251 279863 277608 273688 268251 261966 255912
64790 255912 250575 245428 239902 234367 229729 226313 223631 221140 218810 216922 215604 214708 214085 213904 214627
64775 214627 216469 218991 221493 223824 226406 229436 232601 235815 239693 244831 251016 257626 264421 271401
64761 271401 278202 284355 290004 295721 301600 307118 311906 316074 319742 322896 325846 329178 332999 336756
64747 336756 340102 343393 346984 350511 353272 354862 354913 352634 347432 339953 331886 324492 317619 310302 302070
64732 302070 293495 285563 278715 272613 266831 261654 257890 255901 255118 254612 253854 252746 251326 249865 249043
64717 249043 249559 251499 254391 257801 261631 265886 270513 275431 280395 284825 288122 290258 291700 292618 292501
64702 292501 290701 287168 282422 277053 271486 266094 261190 256862 252901 248957 244717 240050 235061 229989
64688 229989 225054 220507 216784 214307 212965 212095 211237 210774 211473 213454 215994 218382 220621 223169 226342
64673 226342 230226 234937 240614 247227 254608 262617 271078 279630 287809 295193 301222 305058 306076 304565
64659 304565 301574 297876 293398 287825 281419 274867 268598 262734 257616 253814 251443 249845 248249 246614
64645 246614 245604 245860 247451 249951 252872 255963 259267 263001 267432 272830 279424 287282 296303 306417
64631 306417 317773 330480 344107 357615 369945 380588 389491 396490 401047 402569 400846 396141 388984
64618 388984 380009 369874 359089 347853 336166 324184 312380 301232 290923 281531 273370 266787
64606 266787 261558 256886 252198 247717 244035 241405 239689 238694 238093 237234 235647 233779 232674 232758 233360 233683
64590 233683 233894 234923 237441 241349 246090 251099 256019 260814 265766 271279 277686 285211 293860 303233
64576 303233 312659 321760 330737 339878 348906 357112 363969 369315 372997 374719 374359 372138 368340 362978
64562 362978 355846 346821 336129 324465 312783 301746 291384 281471 272206 264212 257826 252742 248530
64549 248530 245159 242741 241038 239597 238234 237001 235810 234585 233765 234095 235648 237539 238975 240242 242114
64534 242114 244498 246284 246515 245151 242605 239193 235390 232060 229811 228333 226912 225440 224419 224092 224137
64519 224137 224254 224474 224730 224715 224493 224748 225973 227665 228840 229188 229306 229842 230856 232126 233721 236006 239190
64502 239190 243023 247023 250991 255323 260709 267481 275364 283885 292836 302137 311357 319567 325719 329133
64488 329133 329786 328290 325484 321880 317541 312620 307859 304245 302203 301324 300875 300385 299742 299019 298295 297498
64472 297498 296311 294351 291499 287998 284249 280627 277468 275029 273363 272335 271864 272090 273279 275641 279173
64457 279173 283493 287729 290772 291947 291564 290738 290496 290903 291069 290147 288376 287018 287202 288933 291357 293784
64441 293784 296236 299111 302707 307148 312469 318546 325123 332152 340134 349907 362002 376241 392058
64428 392058 409255 428355 450212 475439 504380 537558 575816 620005 670870 729465 797371
64417 797371 875977 965311 1063497 1167150 1272400 1376129 1476806 1574114 1667458 1754864 1833418
64406 1833418 1900377 1953460 1990573 2010308 2012954 2000324 1974187 1935210 1883491 1819485 1744008
64395 1744008 1658080 1563483 1463271 1361021 1259530 1160571 1065674 976501 894329 819644 752468
64384 752468 692760 640329 594683 555286 521909 494456 472397 454479 439120 425202 412506
64373 412506 401413 392162 384433 377528 370768 363705 356179 348292 340270 332245 324278 316515 309110 301952
64359 301952 294817 287878 281702 276481 271671 266798 262365 259444 258441 258788 259824 261439 263732 266533
64345 266533 269609 273046 277014 281214 284784 286804 286918 285560 283613 281666 279562 276798 273395 270081
64331 270081 267536 265730 264248 263073 262656 263181 264056 264355 263751 262917 262887 264051 265824 267311 268147 268564 268859
64314 268859 269099 269343 269819 270741 272112 273719 275114 275554 274328 271450 267806 264302 260918 256893 251737
64299 251737 245827 239975 234701 230025 225817 222179 219480 217976 217412 217145 216816 216779 217666 219582 221963 224211
64283 224211 226176 227972 229671 231380 233400 236000 239180 242886 247396 253133 260031 267371 274378 280867
64269 280867 287113 293265 299068 304051 307767 309921 310531 310048 309104 308003 306617 304922 303465 303007 303709
64254 303709 304867 305531 305215 303967 301953 299153 295396 290565 284769 278315 271505 264478 257418 250901 245729
64239 245729 242194 239679 237278 234771 232741 231790 231981 233036 234622 236266 237383 237814 238106 238833 239689 239690
64223 239690 238328 236168 234201 232998 232629 233006 233896 234854 235574 236226 237078 237810 237625 236161 233915 231599
64207 231599 229426 227300 225458 224468 224565 225304 226026 226481 226840 227208 227322 226876 226093 225786 226737 229029 232156
64190 232156 235694 239674 244360 250038 257158 266294 277562 290245 303268 315905 327706 337968 345848
64177 345848 351051 353894 354572 352845 348684 342671 335324 326530 316236 305444 295686 287482 279930 272033
64163 272033 263846 256086 249202 243346 238793 235681 233508 231542 229769 228823 228880 229211 229206 229285 230286 232256
64147 232256 234491 236648 239204 242665 246847 251182 255409 259579 263617 267174 269855 271372 271535 270328
64133 270328 268068 265341 262729 260558 258833 257374 256109 255270 255122 255458 255629 255329 255173 256181 258702 262084
64117 262084 265401 268360 271537 275904 282041 289568 297387 304693 311739 319421 328165 337487 346555 354799
64103 354799 361908 367649 371983 375212 377844 380462 383758 388384 394541 401816 409496 416925 423609 429304
64089 429304 434143 438328 441505 442732 441351 437613 432172 425287 416980 407746 398576 390138 382281 374422
64075 374422 366230 357919 350070 343180 337223 331680 326120 320688 315877 312011 309160 307313 306302 305699
64061 305699 305245 305274 306292 308155 310134 311868 313696 315901 318167 320125 322110 324858 328633 333042 337688
64046 337688 342703 348577 355657 363963 373400 384056 396131 409512 423533 437346 450405 462394
64034 462394 472800 480931 486406 489331 489971 488532 485280 480485 474174 466368 457717 449481 442612 437193
64020 437193 432975 430000 428235 426996 425287 422631 419172 415120 410478 405231 399418 393095 386605 380701
64006 380701 375980 372191 368529 364589 360596 356771 353055 349632 347140 345928 345425 344680 343454 342414 342321
63991 342321 343272 344873 346883 349480 352823 356540 359867 362445 364810 367969 372537 378361 384856 391519
63977 391519 398243 405298 412989 421208 429508 437745 446441 456189 466906 478034 489308 500898 512922
63964 512922 525363 538495 552837 568537 585363 603527 623991 647563 674072 702882 733972
63953 733972 768077 806082 848853 897634 954053 1019535 1095033 1181503 1280425 1393504 1521855
63942 1521855 1665595 1824246 1997392 2184706 2385292 2597212 2817854 3044612 3274840
63933 3274840 3505051 3730428 3945247 4143786 4321049 4473137 4597254 4691234 4753010 4780749
63923 4780749 4773562 4731775 4656490 4549297 4412712 4250561 4067635 3869066 3660102 3445844
63913 3445844 3230518 3017058 2807738 2605110 2411905 2230170 2060984 1905011 1762853
63904 1762853 1634692 1520004 1417897 1327555 1248252 1179160 1119357 1067921 1023826 985776 952293
63893 952293 922087 894395 868996 845800 824429 804323 785277 767634 751772 737618 724904
63882 724904 713725 704621 698177 694777 694530 697055 701350 706305 711535 717597 725352 735263 747219 760822
63868 760822 775862 792739 812385 835477 861691 889918 919144 948904 978986 1009116 1038969
63857 1038969 1068111 1095754 1120889 1142825 1161333 1176170 1186868 1193266 1195922 1195559 1192149 1184856
63845 1184856 1172917 1156379 1135967 1112408 1085912 1056281 1023521 988336 951927 915253 878537
63834 878537 841587 804438 767584 731632 696920 663553 631731 601911 574512 549502 526429
63823 526429 504935 485105 467152 450883 435691 421056 406970 393920 382571 373293 365757 359033
63811 359033 352265 345219 338091 331045 324182 317748 311971 306815 302247 298521 295720 293240 290387 287401
63797 287401 285068 283282 280897 277373 273636 270736 268434 265917 263268 261192 259622 257714 255218 252897
63783 252897 251334 250141 248687 246985 245456 244294 243490 243039 242703 241866 240157 238097 236685 236371 236742 237149
63767 237149 237282 237082 236498 235610 234759 234267 234028 233638 232975 232394 232218 232239 231985 231341 230601 229953 229274 228546 228084
63748 228084 228148 228555 229014 229643 230880 232925 235509 238136 240413 242244 243912 245876 248304 250904 253340
63733 253340 255620 257896 260153 262391 264884 267856 271060 274140 277278 280899 284748 287930 290138 292270
63719 292270 295445 299736 304311 308521 312347 315851 318736 320624 321500 321642 321251 320315 318797 316776 314367
63704 314367 311720 309229 307492 306678 305938 304080 301098 298606 298197 299691 301589 303099 304879 307727 311358
63689 311358 314933 318195 321513 325142 328991 332897 336637 339728 341679 342386 342010 340654 338577 336583 335661
63674 335661 336117 337401 338832 340137 341268 342205 343190 344740 347016 349410 351137 352082 352686 353031 352503 350508
63658 350508 347215 343338 339376 335280 330825 326039 321265 316919 313226 310063 307037 303857 300677 297989
63644 297989 296159 295167 294811 295001 295772 297211 299457 302544 306030 309070 311198 312968 315424 318938 322984
63629 322984 327064 331401 336442 342106 347914 353698 359794 366621 374415 383356 393589 405042 417482
63616 417482 430852 445347 461050 477760 495389 514386 535513 559183 585228 613309 643313
63605 643313 675208 708600 742538 775668 806456 833400 855315 871567 882064 887123 887537 884697
63593 884697 880322 875778 871613 867629 863190 857426 849522 839057 825917 809801 790170 767070 741736
63580 741736 715893 690519 665675 641448 618539 597836 579832 564565 551765 540940 531749 524436
63568 524436 519586 517288 517002 518369 521630 526859 533263 539842 546450 553644 561625 569943 578259 586868
63554 586868 596326 607023 619317 633705 650557 669836 691362 715351 742630 774345 811357 853518
63542 853518 899081 944701 986234 1020020 1043930 1057605 1061953 1058616 1049870 1038537 1027204 1017152
63530 1017152 1008242 999940 992058 984225 975142 963080 947045 926991 902994 874948 843304 809560
63518 809560 775508 742106 709361 677127 645719 615819 588062 562750 539843 519133 500469
63507 500469 483826 469169 456303 444930 434874 426248 419261 413703 408647 402960 396298 389413 383264
63494 383264 378058 373471 369586 367074 366364 367049 368244 369238 369666 369458 368925 368657 369048 370050 371564 373835
63478 373835 377136 381173 385202 388767 391979 394960 397262 398211 397807 396962 396591 396524 395549 392630 387886 382335
63462 382335 376965 372323 368671 365971 363727 361330 358791 356763 355671 355161 354715 354490 355180 357177 360202
63447 360202 363759 367690 372256 377860 384684 392526 401022 410179 420570 432827 447033 462816 480084
63434 480084 499560 522601 550454 583279 619476 655990 689652 718438 741630 759162 771365
63423 771365 779296 784709 789345 794472 801268 811244 825771 845308 869474 897881 930387 966255 1003371
63410 1003371 1038754 1069905 1095515 1114980 1127738 1133498 1132969 1127896 1120113 1110712 1100248 1089421
63398 1089421 1078998 1068906 1057730 1043498 1025013 1002279 975823 946007 913234 878467 843131
63387 843131 808432 775022 743322 713783 686631 661630 638413 616998 597825 581395 568091
63376 568091 558159 551507 547520 545392 544680 545275 546965 549486 553122 558732 566852 577175 589267 603437
63362 603437 620309 639748 660845 683106 707143 734005 764142 797224 832592 869512 907108
63351 907108 944408 980463 1014224 1044350 1069437 1088589 1101720 1109235 1111569 1109169 1102847 1093929
63339 1093929 1083869 1073663 1063568 1053169 1041573 1027636 1010347 989229 964379 936178 905139
63328 905139 872074 838163 804584 772142 741412 713124 688136 667029 650048 637515 629921 627082
63316 627082 627078 626418 621760 611797 597508 580701 562546 543518 524179 505377 487689 471206 456028
63303 456028 442475 430606 420009 410542 402807 397321 393459 389859 385795 381560 377512 373483 369302
63290 369302 365253 361652 358455 355627 353422 351808 350032 347352 344041 341156 339361 338426 337715 336730 335255
63275 335255 333534 332338 332306 333045 333437 333065 332812 333624 335138 336190 336467 336894 338294 340324 342103 343384
63259 343384 344601 346055 347682 349615 352313 355845 359513 362595 365217 368087 371563 375429 379537 384133
63245 384133 389409 395129 400936 406752 412781 419431 427354 437155 448740 461307 474331 488222 503622
63232 503622 520365 537708 555380 573718 592763 611923 630792 649708 669197 689261 709565
63221 709565 730047 750956 772418 794250 816106 837690 858947 880034 900785 920169 936718
63210 936718 949661 959221 965571 968117 966281 960402 951109 938186 920960 899797 876407 852580 829309
63197 829309 807210 786913 768616 751919 736695 723764 714289 708817 707292 709598 715571 724774 736790
63184 736790 751574 769069 788680 809628 831720 855179 879761 904593 929081 953484 978402
63173 978402 1004053 1030256 1056780 1083314 1109233 1133664 1155862 1175459 1192370 1206387 1216772
63162 1216772 1222274 1221661 1214257 1199894 1178599 1150722 1117323 1080034 1040345 999201 957284 915355
63150 915355 874192 834487 796953 762235 730541 701582 675088 651184 630075 611573 595179
63139 595179 580456 567168 555281 545075 537000 531038 526346 521880 517338 513174 509791 507140 505128
63126 505128 503992 503960 504835 506184 507860 510079 512977 516281 519487 522246 524543 526584 528688 531223 534424
63111 534424 538072 541507 544261 546672 549596 553374 557377 560771 563473 566085 569006 571926 574179 575362
63097 575362 575577 575269 574884 574631 574559 574826 575662 576955 578104 578515 578149 577426 576800 576628 577158 578237 579191 579503
63079 579503 579585 580448 582656 586027 590307 595473 601178 606548 611082 615450 620968 628426 637648 647935 658550
63064 658550 668998 679391 690567 703495 718428 734883 752507 771734 793480 818313 846066
63053 846066 876164 908211 942242 978533 1017340 1058874 1103275 1150293 1199032 1248265 1297106
63042 1297106 1345225 1392555 1439231 1485899 1533561 1582806 1633393 1684760 1736573 1788488 1839732
63031 1839732 1889337 1936470 1980111 2018665 2050374 2074043 2089003 2094631 2090474 2076642 2053493 2021069
63019 2021069 1979642 1930840 1877422 1821675 1764732 1707680 1652506 1601319 1555214 1514592 1480159
63008 1480159 1452849 1432991 1420226 1414174 1414637 1421356 1434198 1453511 1479548 1511506 1547740 1587106
62996 1587106 1629423 1674503 1721456 1769370 1818041 1867429 1916907 1965735 2014030 2062471 2111045
62985 2111045 2158564 2203365 2243901 2278554 2305519 2323164 2330309 2326065 2309832 2281653 2242138 2191859
62973 2191859 2131248 2061462 1984932 1904538 1822457 1740171 1659206 1581063 1506461 1435383 1368133
62962 1368133 1305757 1249132 1198063 1151656 1109165 1070050 1033669 999576 967998 939330 913069
62951 913069 887846 862777 838342 815577 794707 775022 755913 737513 720216 703982 688431
62940 688431 673427 659205 645867 633068 620451 608303 597503 588734 581845 576022 570447 564736
62928 564736 558964 553485 548689 544723 541437 538618 536203 534192 532417 530551 528275 525373 521846 518094
62914 518094 514824 512447 510640 508720 506425 504053 501844 499545 496672 493009 488875 485099 482632 481782
62900 481782 481810 481697 481345 481465 482174 482468 481560 480142 479567 480124 480886 481151 481194 481463 481829 481951 481853 481692 481374
62881 481374 480825 480378 480465 481080 481870 482617 483342 484025 484547 484840 484827 484280 483020 481272 479504 477880 476144 474136
62863 474136 472180 470770 470053 469744 469461 468945 468084 466993 466113 465987 466735 467786 468338 468103 467580 467572 468488 470044
62845 470044 471473 472031 471527 470524 469896 470006 470380 470270 469392 467955 466235 464480 463113 462509 462478 462365 461836
62828 461836 461231 460963 460961 460998 461177 461732 462609 463733 465431 468042 471172 473911 475944 477956 480710 484094 487379
62811 487379 490168 492824 496097 500538 506146 512351 518364 523683 528339 532714 537260 542415 548604 556134
62797 556134 565085 575199 585852 596355 606608 617354 629410 642725 656729 671656 688851 709442
62785 709442 733296 759844 789432 823200 861893 905500 953908 1007190 1065240 1127852 1195195
62774 1195195 1267444 1343665 1421705 1499539 1576097 1650350 1720164 1782743 1835899 1878336 1909026
62763 1909026 1927052 1932027 1924116 1903615 1871076 1827909 1776324 1718411 1655529 1588690 1519161 1448507
62751 1448507 1378273 1309766 1243918 1181171 1121630 1065400 1012666 963516 917937 876027 837891
62740 837891 803334 771978 743747 718885 697347 678500 661561 646017 631542 618037 605973
62729 605973 596161 588759 582910 577853 573919 571850 571488 571943 572858 574646 577533 581275 586012 592455 600744
62714 600744 609925 619256 629508 642235 658067 676511 697215 720629 747349 777563 811429 849505
62702 849505 892409 940373 993398 1051618 1115179 1183958 1257684 1336351 1420208 1509253 1602750
62691 1602750 1699207 1796643 1892777 1985072 2070840 2147529 2213001 2265431 2302962 2323671 2326127
62680 2326127 2310124 2276880 2228532 2167368 2095329 2014084 1925580 1832419 1737484 1643069 1550566
62669 1550566 1461028 1375708 1295697 1221293 1152117 1087782 1028107 972792 921410 873898 830742
62658 830742 792482 759178 730382 705336 683122 662932 644402 627538 612239 598045 584385
62647 584385 570871 557372 544106 531691 520777 511482 503463 496583 491014 486553 482439 478268 474659
62634 474659 472472 471626 471199 470491 469483 468342 467069 465602 463840 461508 458425 454969 451861 449484 447716
62619 447716 446431 445700 445487 445655 446394 448124 450794 453758 456640 459861 463966 468845 474096 479803 486391
62604 486391 493823 501506 509100 517064 526321 537617 551263 567258 585569 606386 630099 656892
62592 656892 686426 718125 751704 787171 824239 861966 899052 934346 966956 995994 1020385
62581 1020385 1038967 1050779 1055288 1052426 1042551 1026489 1005522 981056 954077 924988 894060 861937
62569 861937 829558 797674 766607 736454 707431 680040 654959 632630 612842 594839 577964
62558 577964 562157 547743 534988 524081 515259 508482 503046 497958 492844 488148 484288 480956 477485
62545 477485 473641 469769 466354 463797 462528 462922 464901 467787 470807 473740 476907 480456 483810 486126
62531 486126 487343 488518 490841 494511 498924 503889 510127 518436 528788 540627 553787 568759 586156
62518 586156 606329 629501 655926 685855 719470 756909 798156 842910 890726 941260 994141
62507 994141 1048629 1103612 1157925 1210337 1259176 1302379 1338180 1365585 1384085 1393344 1393523 1385574
62495 1385574 1370683 1349558 1322760 1291743 1258970 1226784 1196509 1168808 1144374 1123900 1107740
62484 1107740 1096165 1089829 1089456 1094985 1105509 1120239 1139217 1162802 1190438 1220055 1248641 1273451
62472 1273451 1293001 1307170 1316479 1321185 1320853 1314452 1300697 1278588 1248131 1210694 1168398 1122993
62460 1122993 1075354 1025995 975756 925864 877556 831798 789225 750217 715156 684579 658822
62449 658822 637395 619039 602719 588425 576712 567636 560494 554579 549853 546712 545290 545226 546136 548190
62435 548190 552010 557735 564223 569506 572235 572552 571464 569616 566849 562656 556743 549287 540979 532636
62421 532636 524465 515823 506094 495707 485853 477235 469555 462276 455409 449342 444247 439939 436104 432468
62407 432468 428928 425625 422753 420220 417769 415513 414037 413766 414428 415379 416218 416918 417592 418424 419724 421744
62391 421744 424418 427413 430397 433160 435601 437771 439873 442085 444381 446629 448884 451604 455615 461673
62377 461673 469793 478991 487970 496170 503975 511968 520349 529150 538569 548803 559852 571751 584768
62364 584768 599186 615162 633031 653429 676837 703301 732896 766108 803412 844825 890338
62353 890338 940344 994880 1052570 1110998 1168114 1222679 1273381 1318349 1355927 1385477 1407153
62342 1407153 1421255 1428057 1427842 1420769 1406899 1386518 1360192 1328452 1291800 1251254 1208524 1165452
62330 1165452 1123482 1083716 1046886 1012910 980921 950263 921271 894734 870850 849127 829016
62319 829016 810080 791640 772864 753334 733192 712670 691868 671041 650700 631279 612993
62308 612993 596113 581008 567653 555407 543656 532569 522933 515307 509588 505323 502049 499233 496296
62295 496296 493076 490190 488523 488325 489002 489909 491043 492839 495499 498790 502275 505486 508059 510146 512582
62280 512582 516177 520756 525317 529253 532966 537121 541775 546595 551466 556429 561361 566308 571997 579379
62266 579379 588645 599144 610397 622819 637388 654985 676142 701036 729547 761651 797932 839345
62254 839345 886221 937765 992834 1050908 1111860 1174793 1237463 1296871 1350244 1395611 1431991
62243 1431991 1459348 1478186 1488849 1491186 1484977 1470515 1448477 1419184 1382368 1337951 1286966 1231408
62231 1231408 1173240 1113836 1054504 997051 943405 894645 850709 811033 775201 742973 714065
62220 714065 688226 665473 645987 629687 615941 603763 592301 581264 570940 561887 554496 548664
62208 548664 543726 538834 533620 528519 524293 521243 519195 518214 518839 521340 525132 529436 534299 540451 548291
62193 548291 557562 567996 579611 592215 605189 618152 631439 645558 660484 675794 691136 706217
62181 706217 720554 733704 745592 756219 765189 771968 776591 779718 781976 783599 784779 786089 788493
62168 788493 793190 801452 814268 831964 854381 881445 913290 949666 989494 1031211 1073387 1114821
62156 1114821 1154134 1189560 1219292 1242192 1258243 1268254 1272909 1272121 1265432 1252878 1235036 1212293
62144 1212293 1184671 1152674 1117813 1081836 1045700 1009763 974723 941755 911747 884978 861607
62133 861607 841908 825763 812460 801372 792508 785960 781088 776774 772418 768281 764890 762545 761460
62120 761460 761932 764169 768197 774095 781964 791411 801270 810113 816947 821351 823221 822748 820494 817166 813327
62105 813327 809498 806204 803444 800187 795011 787443 778389 769192 760696 753368 747752 744307 743032 743617
62091 743617 745772 749128 753128 757551 762932 769892 778102 786508 794746 803780 814812 827915 842076
62078 842076 856397 870998 886851 904924 925358 947346 969917 992838 1016551 1041144 1065855
62067 1065855 1089805 1112868 1135493 1157980 1180514 1203743 1228677 1255850 1284891 1314957 1345042
62056 1345042 1373702 1399050 1419684 1435556 1447577 1456365 1461657 1462853 1459714 1452277 1440335 1423339
62044 1423339 1400831 1372790 1339541 1301568 1259663 1215169 1169735 1124633 1080339 1036859 994316
62033 994316 953079 913532 876049 841151 809357 780790 755151 732150 711642 693246 676217
62022 676217 660059 644970 631304 618737 606511 594495 583459 574018 565660 557201 548028 538649
62010 538649 530094 522997 517172 511862 506477 501282 497269 495138 494468 494225 494037 494550 496383 499115 501698
61995 501698 503623 505253 507018 508726 509865 510272 510180 509690 508515 506326 503173 499361 495024 489993 484136
61980 484136 477675 471003 464297 457516 450868 444997 440462 437074 434011 430632 427017 423608 420529 417453
61966 417453 414082 410587 407548 405533 404689 404682 405039 405601 406594 408201 410251 412493 415077 418456 422746 427389
61950 427389 431639 435254 438637 442423 447107 452953 460003 468022 476533 485080 493626 502730 513214 525476
61936 525476 539121 553343 567569 581512 594776 606887 617879 628379 638779 648668 657472 665300
61924 665300 672645 679411 684908 688741 691022 691651 690136 686431 681339 675663 669595 663431 658320 655491
61910 655491 655086 656568 660102 666604 676323 688192 700887 713849 726909 739519 750845 760215 767063
61897 767063 770840 771475 769634 765998 760531 752995 743938 734461 724926 714584 702806 690204 678155
61884 678155 667454 657845 648702 639759 631068 622577 614054 605338 596400 587065 576964 566062 555167
61871 555167 545515 537654 530988 524601 518362 512969 509099 506820 505746 505441 505656 506430 508096 511012 515287
61856 515287 520884 527955 536874 547932 561170 576533 593967 613273 634013 655684 677984 700925
61844 700925 724669 749109 773480 796521 817192 835071 849952 861406 869136 873449 874776 872831
61832 872831 867066 858139 848227 839485 832746 828061 825790 826409 829701 835119 842878 853769 867571 882289
61818 882289 895397 905470 912305 915843 915582 911036 902370 890339 875685 858749 839681 818906 797186
61805 797186 775226 753513 732707 713782 697251 682351 667612 652451 637796 624820 613461
61794 613461 602627 591610 580786 570985 562722 556119 551092 547190 543562 539562 535407 531864 529212
61781 529212 526805 523871 520493 517513 515504 514138 512631 510594 508294 506208 504506 502947 501162 498943
61767 498943 496406 493965 492196 491573 492105 493248 494378 495514 497381 500505 504368 507803 510196 511941 513712
61752 513712 515659 517503 518988 519972 520350 520203 519799 519184 517957 515794 512932 509848 506694 503506 500715
61737 500715 498819 497635 496482 495156 494119 493616 493270 492834 492721 493295 494125 494505 494475 494770 495928 497912 500456
61720 500456 503270 505975 508382 510878 514065 517866 521401 523874 525209 525635 525143 523799 522262 521364 521101
61705 521101 520436 518330 514831 511003 507903 505757 504064 502332 500558 498991 497540 495675 493016 489911
61691 489911 487178 485278 483931 482560 480878 478906 476682 474321 472250 470964 470370 469651 468021 465498 462808
61676 462808 460661 459254 458305 457296 455810 453822 451683 449689 447813 446018 444614 443895 443489 442527 440573
61661 440573 438055 435645 433604 431926 430778 430423 430834 431680 432622 433436 434005 434393 434875 435627 436433 436944 437198
61644 437198 437670 438767 440478 442509 444597 446587 448405 450111 451925 454036 456278 458056 458695 457948 456067
61629 456067 453376 449967 446083 442533 440237 439156 438141 436116 433170 430210 427826 425892 424113 422447
61615 422447 420929 419480 417979 416329 414404 412135 409674 407232 404685 401613 397780 393407 388889 384421
61601 384421 379995 375587 371307 367406 364107 361205 357996 353988 349709 346394 344672 343887 342934 341398 339578
61586 339578 337736 335847 333996 332438 331134 329611 327532 325185 323196 321872 320981 320057 318797 317267 315909
61571 315909 315211 315160 315058 314125 312351 310569 309647 309812 310727 311930 312991 313575 313688 313712 313897 313948 313552 313105
61553 313105 313375 314402 315380 315848 316362 317561 319126 320301 321065 322046 323352 324269 324206 323427 322682 322608 323577 325606
61535 325606 328058 329849 330339 329887 329399 329568 330611 332300 333924 334600 334050 332991 332453 332796 333550 333978 333513
61518 333513 331952 329652 327484 326198 325751 325503 325010 324333 323615 322799 321950 321507 321865 322771 323399 323131 322132
61501 322132 321039 320164 319220 317951 316727 316183 316327 316438 316001 315369 315237 315765 316554 317265 317834 318180 318179 317980
61483 317980 317959 318205 318373 318197 317941 318144 319040 320397 321827 323073 324070 324877 325599 326338 327162 328087 329051 329928
61465 329928 330602 331024 331185 331089 330822 330549 330389 330344 330465 330958 331979 333377 334823 336152 337411 338596 339575
61448 339575 340342 341165 342334 343833 345340 346511 347197 347468 347498 347475 347617 348208 349489 351425 353659 355817 357825
61431 357825 359836 361915 363919 365630 366935 367930 368932 370288 372002 373631 374728 375318 375723 376054 376220
61416 376220 376464 377483 379769 382971 386129 388395 389489 389622 389289 389067 389282 389707 389638 388430 386086 383305
61400 383305 380928 379340 378453 378077 378062 378029 377435 376252 375326 375590 376942 378321 378939 378987 378989 378945 378478 377581 376760
61381 376760 376464 376672 377143 377886 379272 381625 384762 388031 390925 393544 396237 398876 400906 402178 403266
61366 403266 404658 405961 406388 405860 405149 404964 405350 406184 407790 410636 414485 418271 421046 422899 424727 427205
61350 427205 430386 434351 439702 446876 455214 463327 470404 476599 482162 486933 490976 494902 498977 502533
61336 502533 504998 507028 509733 513036 515830 517668 519253 520966 521975 521409 519726 518175 517338 516873 516362
61321 516362 515686 514705 513333 512043 511746 512851 514798 516761 518696 521450 525899 532085 539238 546585 554042
61306 554042 562104 571241 581637 593397 606569 620808 635319 649311 662175 673137 681243 686177
61294 686177 688693 689675 689011 686008 680735 674241 667405 660300 652886 645567 638626 631695 624324 616734 609488
61279 609488 602698 596131 589895 584480 580166 576907 574749 573825 573859 574242 574773 575800 577365 578745 579333 579597
61263 579597 580552 582448 584585 586470 588581 591754 596260 601789 608019 614780 621790 628586 634731 639910
61249 639910 643921 646797 648889 650540 651727 652297 652463 652639 652684 651728 649122 645301 641448 638410 636220 634468
61233 634468 632781 630968 629091 627521 626723 626891 627923 629780 632645 636686 641830 647897 654831 662706 671536
61218 671536 681102 690953 700657 710114 719515 728900 737939 746340 754220 761725 768436 773728 777707 781254
61204 781254 784918 788270 790715 792512 794569 797509 801363 805996 811384 817602 824975 834169 845717 859419
61190 859419 874453 889976 905279 919492 931733 941670 949556 955596 959719 962105 963440 964291 964515
61177 964515 963661 961664 958781 955029 950175 944283 937831 931096 923678 914853 904362 892711 880759 869070
61163 869070 857651 846151 834172 821432 807773 793268 778338 763641 749726 736761 724576
61152 724576 712956 701941 691959 683633 677434 673476 671626 671565 672540 673277 672562 670042 666190 661479 655898
61137 655898 649469 642764 636560 631161 626435 622377 619237 617189 616320 617011 619812 624771 631298 639053 648577
61122 648577 660526 674495 689255 704289 720542 739360 761070 784974 810323 836670 863431
61111 863431 889897 916003 942567 970284 998615 1026053 1051425 1074689 1096535 1117471 1137327
61100 1137327 1155380 1170793 1182932 1191352 1195615 1195349 1190568 1181758 1169519 1154193 1135983 1115239
61088 1115239 1092484 1068242 1043013 1017312 991596 966195 941368 917271 893818 870794 848291
61077 848291 826854 807069 789217 773395 759612 747510 736384 725868 716388 708551 702347 697303
61065 697303 693176 690075 688129 687456 688254 690485 693673 697429 701849 706996 712454 718025 724422 732388 741494
61050 741494 750748 760140 770540 782294 795124 809364 825943 844943 865440 887077 910518 936003
61038 936003 962782 990532 1019955 1051238 1083320 1115665 1149477 1185984 1224645 1264383 1305630
61027 1305630 1349651 1396520 1445128 1494656 1544708 1594567 1643851 1693754 1746553 1804122 1867898
61016 1867898 1939593 2020579 2110897 2210133 2318927 2438733 2571262 2720014 2891772 3094953
61006 3094953 3337365 3627499 3977004 4399587 4909095 5522238 6262674 7160191 8250368
60997 8250368 9581024 11206587 13139956 15277667 17376501 19141312 20374997 21064968
60989 21064968 21341668 21377152 21331475 21358225 21587114 22042727 22576148 22911865 22798629 22139050
60979 22139050 20998335 19518617 17838252 16069617 14308884 12636021 11103096 9731819
60971 9731819 8524262 7473410 6567151 5790852 5130898 4575258 4110864 3722808 3396687
60962 3396687 3120269 2883008 2676086 2493632 2332423 2189789 2062680 1948737 1846789
60953 1846789 1755875 1674822 1602913 1539685 1483675 1432477 1384388 1339063 1296293 1255279 1215512
60942 1215512 1177319 1140986 1106238 1073082 1042251 1014178 988199 963336 939282 916123 893736
60931 893736 872038 851367 832052 813953 796771 780446 765011 750528 737368 726043 716405 707603
60919 707603 699050 690857 683038 675103 666995 659701 654183 650175 646811 644034 642545 642566 643517 644973 647167
60904 647167 650323 654075 657953 662126 667293 673900 681628 689642 697227 704196 710831 717527 724528 731927
60890 731927 739813 748404 757964 768444 779222 789443 798727 807293 815344 822761 829708 837069 845785
60877 845785 855953 866999 878433 889896 900756 910431 919069 927335 935515 943339 950552 957001 962251
60864 962251 965856 968049 969489 970333 970246 969281 967816 965546 961539 955598 948603 941044 932192 921332 909001
60849 909001 896250 883382 870225 857044 844278 831640 818336 804083 789328 774567 759956
60838 759956 745444 730842 715852 700378 684667 668952 653315 638140 624163 611642 599977
60827 599977 588680 578212 569173 561145 553151 545078 537805 531950 527188 522845 518637 514685 511284 508652
60813 508652 506576 504393 501711 498991 496989 495760 494730 493618 492708 492223 491982 491750 491437 490871 489863 488565
60797 488565 487427 486716 486387 486383 486688 487046 487001 486262 484846 482960 481030 479600 478752 477817 476234 474563 473913
60780 473913 474339 474547 473435 471228 468626 465484 461052 455364 449698 445437 442736 440463 437447 433746 430599
60765 430599 429079 428915 428906 428372 427787 427809 428126 427655 425794 423075 420486 418432 416597 414648 412754 411316 410543
60748 410543 410555 411632 413897 416826 419577 421940 424475 427559 430742 433268 434830 435428 434961 433404 431152
60733 431152 428693 426142 423405 420588 417888 415371 413268 412104 411945 411724 410017 406501 402158 398106 394703
60718 394703 391742 389005 386450 384195 382300 380372 377723 374334 371318 369683 368850 367225 364245 360981
60704 360981 358580 356976 355509 354052 352935 352241 351760 351403 351212 351102 350885 350459 349910 349598 350128 351783 353877
60687 353877 355182 355237 354838 355011 355906 357092 358520 360698 363991 368115 372366 376212 379714 383366 387429
60672 387429 391582 395450 399278 403549 407982 411586 413898 415551 417314 419156 420624 421632 422368 422834 423069
60657 423069 423517 424650 426355 428138 429685 430824 431229 430786 430135 430254 431455 433293 435411 437889 440581
60642 440581 442656 443162 441837 439137 435693 431888 427778 423221 418217 413257 409191 406529 404925 403507
60628 403507 401670 399463 397298 395515 394243 393431 392882 392377 391965 392077 393132 394984 396824 397710 397173 395455
60612 395455 393366 391843 391340 391560 391927 392329 393050 394004 394543 394333 393937 394088 394678 394947 394479 393596 392938 393082
60594 393082 394329 396353 398226 399307 399987 401038 402437 403510 404091 404690 405509 406185 406719 407745 409506 411340
60578 411340 412749 414234 416390 418739 420300 421094 422339 425214 429982 436287 443731 452050 461141 471146
60564 471146 482378 494938 508341 521455 532940 542022 548833 553761 556577 556599 553724 548772 542734
60551 542734 536238 529945 524751 521133 518762 517242 516872 518199 521207 525496 530990 537972 546645 557152
60537 557152 569832 584840 601533 618687 635299 650866 664920 676717 685454 690596 692027 690108
60525 690108 685625 679554 672883 666457 660599 654811 648323 641163 634237 628223 623026 618665 615984 615693
60511 615693 617101 618602 619255 619357 619699 620929 623527 627754 633614 641329 651761 665897 684060 706103
60497 706103 732132 762439 796925 835285 877638 924167 973987 1025041 1075149 1122615 1165678
60486 1165678 1202158 1230030 1247993 1255365 1251827 1237457 1212705 1178361 1135931 1087938 1037209 985688
60474 985688 934391 884431 837333 794133 754832 719077 686837 658186 633005 611225 592854
60463 592854 577363 563618 550896 539533 530134 522478 515707 509174 502603 495734 488572 481868 476648
60450 476648 473071 470193 467016 463433 459991 457060 454517 452074 449596 447068 444508 442095 440294 439513
60436 439513 439542 439524 438692 437029 435042 433126 431420 430073 429205 428612 427952 427233 426740 426470 426136 425775 425791 426125
60418 426125 426035 425165 424433 425161 427480 430192 432224 433631 434962 436157 436611 436186 435640 435841 436860 438087
60402 438087 439116 440169 441694 443795 446214 448594 450675 452406 453985 455574 456974 457923 458789 460439 463175
60387 463175 466316 469213 472135 475538 478967 481563 483373 485288 487705 490139 492214 494159 496176 498126
60373 498126 500177 502930 506434 509687 511669 512447 512843 513475 514525 516043 517919 519821 521501 522960 524083
60358 524083 524554 524509 524839 526312 528684 531148 533429 535968 539229 543371 548487 554631 561455 568175 574111
60343 574111 579160 583678 587885 591376 593264 592964 590775 587469 583534 579213 575091 571815 569093 565761
60329 565761 561319 556759 553289 550779 548140 544855 541336 537923 534301 530041 525273 520637 516813 514099
60315 514099 512239 510750 509521 508979 509562 511307 514153 518198 523409 529494 536590 545737 558232 574611
60301 574611 594480 616889 640389 663162 683721 701242 714758 722473 722754 715700 703092 686955
60289 686955 668793 649974 631885 615424 600879 588333 577708 568558 560542 554020 549419 546016
60277 546016 542276 537625 533025 529408 526379 522925 518788 514515 510611 507226 504372 501973 499842 497870
60263 497870 496034 494142 491999 489940 488605 487970 487255 486155 485394 485452 485464 484310 482334 480942 480674 480711 480351
60246 480351 480022 480482 481768 483350 484773 485730 485981 485700 485571 486039 486680 486775 486344 486114 486496 487136 487648 488327
60228 488327 489795 492152 494857 497341 499424 501178 502723 504297 506213 508568 511165 513926 517169 521244
60214 521244 526021 531134 536615 542863 549868 556827 562820 567717 572267 577400 583565 590534 597652 604313
60200 604313 610391 616207 622094 628067 633924 639408 644181 647937 650770 653258 655781 657853 658517 657494
60186 657494 655600 653859 652436 650724 648241 645047 641288 636770 631276 625099 618956 613365 608367 603894
60172 603894 600084 597064 594624 592387 590228 588258 586364 584036 580819 576860 572910 569800 567882 566846
60158 566846 566057 565156 564385 564238 564779 565456 565669 565432 565339 565954 567385 569435 571938 574740 577477 579659 581219
60141 581219 582825 585404 589316 594181 599532 605315 611527 617665 622953 627139 630737 634343 637912 640878
60127 640878 642901 644275 645584 646986 647989 648051 647417 647177 648269 650466 652578 653736 654365 655864 659342
60112 659342 664653 670502 675428 678778 680875 682390 683670 684637 685036 684630 683227 680810 677622 673991 670081
60097 670081 665923 661595 657189 652751 648528 645209 643558 643697 645061 647163 650055 653852 658104 662050
60083 662050 665406 668576 672019 675622 678757 680807 681543 681168 680083 678558 676481 673414 668964 663151 656378
60068 656378 648974 640878 631878 622144 612295 602915 594146 585857 578031 570723 563803 556976 550151 543591
60054 543591 537752 533062 529748 527632 526117 524656 523305 522630 523029 524417 526594 529581 533381 537648 541919
60039 541919 546059 550281 554789 559610 564662 569734 574380 578133 580930 583117 584901 585938 585640 583787
60025 583787 580651 576572 571619 565723 558930 551460 543647 535924 528691 522036 515721 509629 504048 499262
60011 499262 495080 491178 487796 485538 484399 483576 482468 481365 480738 480323 479431 477901 476187 474714 473707
59996 473707 473527 474526 476444 478480 480129 481559 483061 484582 485997 487440 489115 491107 493539 496622 500229
59981 500229 503705 506412 508344 509920 511310 512181 512096 510936 508916 506309 503267 499942 496750 494262 492629
59966 492629 491303 489676 487923 486853 486965 488053 489751 491870 494087 495902 497308 499054 501762 505121
59952 505121 508389 511408 514513 517632 520089 521361 521630 521531 521755 522840 524862 527109 528502 528555 527737 526697
59936 526697 525446 523501 520631 517159 513645 510530 508093 506485 505642 505202 504614 503500 502005 500829 500718
59921 500718 501849 503755 505911 508265 511080 514364 517714 520817 523935 527768 532847 539143 546190 553447
59907 553447 560521 567148 573069 577939 581414 583396 584160 584109 583417 582102 580496 579339 579172 579686 579935 579269
59891 579269 578002 577223 577966 580448 583898 587180 589720 591837 594165 596951 600051 603331 606749 610193 613626
59876 613626 617328 621601 626205 630448 633858 636382 637877 637875 636123 632987 629026 624450 619297 613863 608595
59861 608595 603653 598937 594529 590814 588151 586575 585879 585840 586382 587598 589624 592491 596215 601060 607508
59846 607508 615804 625562 635870 645640 653812 659546 662589 663475 663202 662708 662660 663481 665163 667079 668240
59831 668240 667901 665835 662078 656679 649889 642421 635199 628698 622638 616449 609968 603521 597342 591243
59817 591243 585000 578850 573283 568448 564119 560231 557104 555017 553812 553142 552904 553249 554226 555569 556819
59802 556819 557606 557838 557593 556844 555449 553531 551601 549995 548330 545969 542952 539946 537198 534161 530495
59787 530495 526928 524583 523639 523150 522102 520302 518250 516492 515174 514021 512586 510553 507900 504919 502201
59772 502201 500521 500360 501392 502642 503308 503351 503241 503394 503973 504958 506213 507620 509251 511241 513454 515588
59756 515588 517736 520472 524108 528182 532072 535926 540587 546585 553469 560145 565765 570333 574541 579002
59742 579002 583681 588211 592605 597248 602169 606807 610653 613696 616034 617549 618353 619034 620012 620990 621555
59727 621555 621957 622718 623706 624272 624233 624142 624499 625208 625877 626257 626254 625861 625192 624471 623941 623940 624821 626490 628175 629058
59707 629058 629125 629058 629325 629688 629675 629286 629173 630204 632669 635780 638224 639464 640290 641767 643933 645970 647350
59690 647350 648269 649097 649975 650882 651592 651592 650577 649021 647827 647446 647756 648602 649699 650080 648525 644842 640091
59673 640091 635213 630093 624350 618403 613089 608587 604359 600042 595860 592132 588804 585635 582701 580511
59659 580511 579559 579752 580379 580823 581180 582005 583529 585476 587570 589848 592353 594878 597118 598834 599782 599786 598962
59642 598962 597627 595870 593559 590790 587952 585187 582155 578564 574653 570952 567802 565249 563168 561267
59628 561267 559260 557269 555796 555067 554585 553525 551425 548405 544970 541780 539335 537587 535976 534059 531948
59613 531948 529967 528130 526224 524325 522878 522212 522149 522189 522064 522083 522852 524522 526449 527812 528536 529282 530448
59596 530448 531554 531792 530926 529399 527796 526532 525909 526096 526882 527656 527788 527092 525903 524724 523825 523181 522702
59579 522702 522320 521785 520627 518551 515778 512857 510197 507926 506041 504447 502944 501434 500072 499035 498291
59564 498291 497802 497754 498239 498892 499217 499217 499319 499775 500471 501246 501987 502512 502798 503265 504379 505985 507476 508644
59546 508644 509961 512045 515241 519626 524989 530833 536871 543417 551018 560182 572007 588256 609211
59533 609211 631507 649664 660365 664274 663551 659320 652429 644921 638907 634608 631082 628513 628319 631041
59519 631041 635518 640307 644817 648717 651283 651925 650722 647956 643558 637412 629850 621446 612566 603382
59505 603382 594157 585255 576956 569366 562433 556026 550016 544308 538768 533321 528251 524232 521776 520720
59491 520720 520427 520359 520311 520211 520005 519700 519373 519277 519996 522204 525915 530158 533736 536308 538500 541081 544252
59474 544252 547707 551132 554593 558477 562965 567612 571691 574980 577859 580570 582852 584519 585909 587386
59460 587386 588810 590002 591411 593753 597173 601308 606073 611838 618785 626605 635002 644143 654314 665197
59446 665197 675666 684498 691299 696530 700423 702184 700774 696310 689975 682503 673648 663445 653096
59433 653096 643902 635921 628391 621051 614384 608972 605302 603824 604490 606512 609226 612983 618525 625859
59419 625859 634468 644382 656181 670028 685406 701795 719103 737733 758804 783640 811673 838884
59407 838884 859506 869818 869900 862148 849317 834028 818649 804767 793464 786385 785361 790002 796341
59394 796341 798964 794596 783441 767674 749374 729742 709486 689537 671213 655483 642117 630081
59382 630081 618928 609378 602339 597855 595288 594038 593630 593486 593189 592882 593093 594193 596207 598941 602119
59367 602119 605545 609343 613890 619368 625492 631753 637785 643481 648978 654584 660569 667038 674167 682334
59353 682334 691692 701825 712364 723791 736958 751835 767466 783338 800021 818074 836941 855423
59341 855423 872788 888997 904191 918382 931404 942760 951688 957584 960230 959522 955374 947988 937851
59328 937851 925363 910916 895431 880101 865234 849913 833277 815754 798680 783156 769666
59317 769666 758271 748507 739493 730769 722879 716705 712418 709523 707567 706233 705035 703672 702692 703218
59303 703218 705867 710302 715918 722690 731338 742817 757418 773961 789827 802087 808733 809075 803515
59290 803515 793319 780266 765912 751244 737162 724825 714968 707097 700047 693318 687394 682872 679898
59277 679898 678488 678762 680591 683474 687106 691823 698242 706621 716772 728376 741078 754247 766851
59264 766851 777815 786700 794000 800539 806416 810621 811789 809237 803288 794904 785208 774995 764328
59251 764328 752770 740299 727892 716816 707477 699306 691686 684663 678739 674321 671475 670017 669724
59238 669724 670535 672511 675506 679065 682785 686639 690762 695141 699684 704309 708657 712051 714166 715427
59224 715427 716121 715379 711878 705685 698589 692267 686722 680947 674564 668192 662561 657948 654368 651704 649565
59209 649565 647536 645712 644645 644596 645165 645857 646661 647765 648969 649794 650076 650082 650026 649866 649696 649949 650988 652756
59191 652756 655032 657777 660907 663996 666597 668734 670710 672532 673948 674998 676067 677314 678481 679392
59177 679392 680245 681248 682334 683422 684676 686291 688312 690812 693981 697829 702139 706901 712562 719615
59163 719615 728178 738079 748936 759881 769684 777622 783986 789360 793656 796279 796931 795725 792687 787822
59149 787822 781644 775075 768636 762115 755127 747646 739916 732278 725213 719125 713783 708317 702064 695261
59135 695261 688624 682498 676750 671370 666631 662482 658256 653404 648438 644661 642853 642535 642798 643527 645416
59120 645416 648914 653657 658942 664352 669749 675135 680849 687640 696129 706212 717106 727836 737581
59107 737581 745825 752501 757957 762593 766585 770061 773345 776723 780003 782549 783821 783844 783142 782247 781186
59092 781186 779489 776816 773524 770401 767874 765786 763943 762434 761239 759927 758100 755878 753568 750988
59078 750988 747462 742427 735872 728282 720333 712527 704947 697442 690148 683666 678541 674754 671804 669088
59064 669088 666094 662550 658680 655063 651952 648936 645574 642139 639273 637034 634706 631684 628289 625520
59050 625520 624058 623549 622935 621503 619573 617965 616963 616180 615390 614938 615069 615330 615047 614089 612801 611444
59034 611444 610144 609195 608966 609548 610760 612488 614830 618015 622256 627495 633213 638889 644828 652122 661404
59019 661404 671988 682665 693008 703405 714029 724402 733903 742130 748667 752921 754451 753425 750718
59006 750718 747590 745038 743310 742168 741611 742039 743646 746249 749981 755553 763267 772139 780562 787625 793343
58991 793343 798001 801904 805568 809443 813365 816681 818798 819349 818135 815480 812347 809513 806823 803816
58977 803816 800879 799007 798568 799166 800771 804142 809863 817633 826877 837471 849484 862585 876191 890001
58963 890001 904077 918418 932620 945930 957652 967599 976092 983397 989255 993060 994299 992648 987903
58950 987903 980105 969515 956318 940725 923619 906531 890398 874763 858849 843085 828783 816573
58938 816573 806032 796778 789016 782846 777825 773507 769845 766860 764414 762503 761275 760569 759835 758643
58924 758643 756937 754797 752439 750464 749509 749475 749505 748885 747637 746206 745032 744422 744357 744336 743850 743158 743199 744662
58906 744662 747459 751100 755274 760115 766228 774332 784465 795780 807512 819820 833094 846861 860257
58893 860257 873341 886891 901087 915530 930617 947651 967198 988451 1010702 1034373 1059791
58882 1059791 1085790 1110365 1132239 1151082 1166706 1178802 1187235 1192030 1193189 1190818 1185093 1175810
58870 1175810 1162436 1145108 1125259 1104834 1085159 1066844 1050258 1035451 1021861 1008757 996038
58859 996038 984215 973588 963666 953508 942524 930905 919221 907642 895813 883672 871926 861189
58847 861189 850979 840344 829351 819126 810312 802274 794088 785616 777299 769561 762737 756969 751766
58834 751766 746140 739634 732809 726491 720943 716029 711677 707853 704491 701780 700163 699853 700646 702312 704824
58819 704824 708130 712116 716762 721892 726903 731376 735799 740890 746289 750916 754589 758166 761929 765054
58805 765054 767067 768592 770096 770972 770541 768941 766335 762281 756708 750570 744648 738575 731951 725540 720296
58790 720296 715921 711464 706745 702178 697793 693648 690668 689849 690860 692509 694296 696517 699133 701746
58776 701746 704584 708340 712909 717177 720168 721654 721675 720266 717710 714368 710224 705247 700048 695432 691303
58761 691303 686813 681622 676376 671842 668225 665418 663342 661890 661012 660926 661860 663650 665944 668673 671893
58746 671893 675348 678687 681976 685528 689429 693706 698730 704796 711484 718010 724115 730088 736070 741946
58732 741946 747796 753888 760250 766680 773065 779270 784982 790140 795194 800417 805278 809207 812624 816433
58718 816433 820736 824941 829042 833868 839975 847069 854644 862543 870650 878562 885756 891723 895963 898208
58704 898208 898631 897467 894582 889675 882610 873114 860625 845133 827866 810359 793084 775762 758709
58691 758709 742849 728452 714901 701936 690246 680531 672641 665966 660104 654878 650154 645860 641873
58678 641873 637886 633747 629871 626795 624412 622177 620049 618663 618526 619508 621132 622961 624830 627224 631322
58663 631322 638064 647191 657672 668767 679985 690150 697502 701005 701050 698808 695371 691413 687029 681836
58649 681836 675776 669804 665187 662207 660154 658471 657117 655871 654173 651908 649692 648144 647381 647395 648287
58634 648287 649967 652149 654790 658098 661990 665986 669652 672724 674876 675950 676375 676829 677491 678189 679148
58619 679148 680925 683633 686903 690651 695165 700389 705821 711262 717053 723421 730098 736632 742546 747210
58605 747210 750194 751842 752938 753827 754388 754762 755313 755859 755652 754306 752156 749688 747213 745154 743997 743802
58589 743802 744235 745087 746333 747935 750210 754120 760437 768784 778243 788623 800159 812241 823647 834008
58575 834008 843884 853238 861119 867194 872481 878090 884196 890792 898529 908237 920263 934772 952058
58562 952058 972085 994282 1018146 1043564 1070237 1097287 1123627 1148215 1169885 1187531 1200626
58551 1200626 1209069 1212657 1211518 1207002 1201128 1194933 1188219 1180965 1173920 1167486 1161063 1153957 1145968 1136591
58537 1136591 1124567 1109003 1090426 1070192 1049327 1028315 1007503 987316 968423 951803 938160
58526 938160 927200 918112 910760 905727 903165 902424 902889 904323 906290 908189 910034 912297 914806 916651
58512 916651 917379 917349 916739 915239 912967 910633 908471 905971 902971 900014 897321 894505 891631 889426 887983
58497 887983 886400 884215 882088 880512 878949 876930 874948 873556 872566 871928 872471 874960 879109 884222 890090
58482 890090 896738 904116 912689 923447 936600 951043 965750 980978 997364 1014526 1031254 1046493
58470 1046493 1059469 1069406 1075698 1078059 1076385 1071057 1063513 1055536 1047720 1039521 1030997 1023427 1017964 1014828
58456 1014828 1014180 1016451 1021248 1027289 1034172 1043008 1054444 1067165 1079115 1089114 1096516 1100464 1100581 1097574
58442 1097574 1092315 1085138 1076690 1068403 1061219 1054691 1048125 1041751 1036143 1031570 1028572 1028057 1029932 1032750
58428 1032750 1035615 1039408 1045303 1053202 1062543 1073480 1086061 1099152 1111309 1121984 1131057 1138077 1142838
58415 1142838 1145786 1147061 1146068 1142746 1138186 1133199 1127453 1120835 1114320 1108444 1102224 1094759 1086828 1079814
58401 1079814 1074157 1069860 1067273 1066243 1065701 1065256 1065975 1068540 1072067 1075929 1081125 1088292 1095869 1102034 1107254
58386 1107254 1113116 1119747 1126226 1132571 1139473 1146735 1153689 1160469 1167485 1174318 1180513 1186544 1192719 1198194
58372 1198194 1202448 1206609 1211818 1217528 1223091 1229704 1238831 1249775 1260828 1271911 1284113 1297478 1311236
58359 1311236 1325483 1340675 1356120 1370810 1385069 1399555 1413340 1424797 1433659 1440527 1445216 1447547
58347 1447547 1449024 1451719 1456043 1461291 1467562 1475307 1483830 1492246 1501190 1511711 1523299 1534902 1547060
58334 1547060 1560959 1576250 1591874 1608183 1626051 1644725 1662818 1680675 1699394 1718140 1734841
58323 1734841 1749068 1761971 1773826 1783878 1792239 1799768 1806394 1811602 1816178 1821574 1828054 1835266 1843908
58310 1843908 1854864 1867433 1880316 1893519 1907501 1921636 1935625 1951122 1969623 1989871 2009759
58299 2009759 2029531 2050671 2072988 2095489 2118803 2143845 2169358 2193702 2217811 2243445 2269870
58288 2269870 2295501 2321431 2349879 2380355 2410961 2442282 2476309 2512549 2549027 2586190 2625951
58277 2625951 2667786 2709736 2752442 2798129 2846383 2894989 2944213 2996152 3050648 3106093 3163484
58266 3163484 3225189 3290429 3356562 3424145 3495973 3571705 3648476 3726357 3808105 3893709 3980322
58255 3980322 4067502 4157313 4249235 4340192 4429764 4520351 4612229 4703743 4796406 4894340 4998552
58244 4998552 5107031 5220357 5341599 5470869 5605883 5747800 5900413 6063641 6234141
58235 6234141 6412299 6602139 6804484 7017065 7241343 7482047 7739881 8011995 8299711
58226 8299711 8608152 8938397 9288122 9660063 10061381 10494719 10958758 11457568 11999977
58217 11999977 12589832 13226988 13917988 14675287 15506252 16414433 17411622 18516616 19742765
58208 19742765 21100502 22612350 24311658 26228070 28391128 30848313 33662864 36896732
58200 36896732 40618685 44931813 49974897 55903495 62900803 71209182 81124928 92971372
58192 92971372 107120294 124041276 144296997 168508359 197320742 231128751 269259435
58185 269259435 308984158 345481214 373423707 389282119 392517593 384866502 368739261
58178 368739261 346256408 319296405 289794361 259648204 230371628 202921257 177793639
58171 177793639 155200998 135190870 117709098 102625311 89735194 78776992 69477595
58164 69477595 61590148 54895532 49194385 44315574 40122905 36503014 33354379 30593224
58156 30593224 28158008 25999023 24070410 22335797 20770630 19352150 18054926 16860428
58148 16860428 15761737 14753464 13824936 12967252 12178145 11454581 10788079 10171986 9605957
58139 9605957 9088452 8611417 8166779 7751781 7363913 6997105 6647457 6316966 6007408
58130 6007408 5715784 5439457 5180220 4939358 4713754 4500690 4301717 4118119 3947090
58121 3947090 3785884 3635346 3495973 3364797 3239577 3122129 3014283 2914308 2820311 2733373
58111 2733373 2654249 2580533 2509997 2443453 2381782 2323556 2268062 2217061 2170934 2126624 2082044
58100 2082044 2039115 1999767 1962362 1924926 1888659 1855189 1823235 1791046 1759644 1730838 1704204
58089 1704204 1678506 1653923 1630659 1607566 1584257 1562396 1542936 1524278 1504880 1485266 1465746
58078 1465746 1444830 1421934 1399176 1378440 1358931 1339531 1321075 1304305 1287977 1271069 1254679
58067 1254679 1239816 1225568 1211297 1198362 1187695 1177940 1167865 1158366 1150225 1142271 1133711 1125791
58055 1125791 1119007 1111146 1100573 1089225 1079801 1071990 1064017 1056018 1049183 1043127 1036739 1030340 1024670
58042 1024670 1018997 1012435 1005937 1000831 996549 991844 987075 983266 979935 975779 970583 964790 958260 951018
58028 951018 944033 937705 930886 922972 915494 909931 905357 900094 894341 889265 884800 880339 876450 873850
58014 873850 871651 868542 864925 862090 860146 858408 856968 856244 855853 855457 855858 857779 860545 863365 866787
57999 866787 871313 875778 878875 881266 884488 888688 893120 897778 902742 906860 908996 909880 910993 912318
57985 912318 912818 912311 911182 909034 905377 901036 897223 893855 890287 886883 884261 881867 879102 876972 876712
57970 876712 877460 877358 876406 876226 877395 879059 880944 883691 887113 889972 891763 893217 894856 896429 897904
57955 897904 899696 901700 903186 903791 903782 903449 903095 903362 904643 906398 907902 909355 911488 914648 919044 925183
57939 925183 932981 941141 948585 955944 964485 974277 984611 995579 1007796 1021025 1034300 1046976 1058525
57926 1058525 1067831 1073984 1077285 1078439 1077421 1074290 1070104 1065559 1059593 1051076 1041178 1032180 1024460 1016606
57912 1016606 1008211 1000532 994381 989317 985087 982116 980206 978309 976034 974116 973090 972662 972542 972727 972796
57897 972796 972087 970794 969905 969955 970800 972580 975795 980428 985939 992124 998971 1005887 1012113 1017793 1023546
57882 1023546 1029248 1034404 1039468 1045404 1051992 1057938 1062642 1066489 1069384 1070456 1069480 1067371 1065024 1062757
57868 1062757 1060935 1059844 1058769 1056522 1053211 1050315 1048723 1047904 1047339 1047467 1048723 1050811 1053561 1057506 1062916
57853 1062916 1069061 1075036 1080724 1086463 1092305 1098001 1103249 1107766 1111539 1115051 1118745 1122319 1125211 1127605
57839 1127605 1130131 1132671 1134473 1135429 1136296 1137483 1138614 1139492 1140533 1141912 1143166 1144101 1145374 1147740 1151210
57824 1151210 1155279 1159595 1164220 1169603 1176261 1184023 1191706 1198106 1203239 1208146 1213662 1220000 1227155 1234781
57810 1234781 1241753 1246684 1249024 1249203 1247961 1246155 1244820 1244496 1244706 1244860 1245297 1246494 1247702 1247634 1246290 1244865
57794 1244865 1243937 1242994 1241737 1240612 1239883 1239381 1239312 1240231 1241987 1243745 1245223 1246964 1249338 1252319 1256240 1261594
57778 1261594 1267953 1274234 1280190 1286604 1293957 1302094 1311191 1321555 1332292 1341741 1349657 1357424 1365545
57765 1365545 1372494 1376907 1379552 1382040 1384784 1387285 1389425 1391237 1392147 1391641 1390307 1389272 1388960 1389163 1389956
57750 1389956 1391734 1394514 1397847 1401317 1404786 1408381 1412461 1417345 1422862 1428472 1433790 1438526 1442053 1443912
57736 1443912 1444830 1446377 1449324 1453062 1456782 1460316 1463558 1466133 1468193 1470678 1474228 1478531 1483161 1488222
57722 1488222 1493655 1498782 1503301 1508058 1514095 1521328 1528714 1535265 1540479 1544362 1547577 1551130 1555398 1559853
57708 1559853 1564048 1568232 1572598 1576580 1579562 1581839 1584353 1587764 1592158 1597316 1602874 1608483 1614086 1619761
57694 1619761 1625264 1630170 1634566 1639009 1643680 1648104 1651878 1655091 1658025 1661134 1665281 1671151 1678293 1685609
57680 1685609 1692966 1701386 1711501 1722922 1735417 1749633 1766183 1785213 1807494 1834873 1868863 1909717
57668 1909717 1957712 2014315 2080585 2154196 2228280 2293020 2338968 2360801 2359426 2340263 2309010
57657 2309010 2269454 2224965 2180031 2138780 2102914 2072302 2046876 2026745 2011106 1998500 1988072
57646 1988072 1979708 1973272 1968615 1966037 1965802 1967418 1970158 1973969 1979048 1984872 1990612 1996298 2002681 2010007
57632 2010007 2017735 2025395 2032947 2040288 2047135 2053503 2059769 2066169 2072559 2078617 2084015 2088677 2093176 2098511
57618 2098511 2104984 2111625 2117229 2121730 2126067 2130972 2136367 2141741 2146584 2150614 2154075 2157763 2162507 2168663
57604 2168663 2176147 2184510 2192921 2200608 2207680 2215025 2223165 2231737 2240316 2249019 2257921 2266642 2274981 2283241
57590 2283241 2291445 2298987 2305642 2312166 2319218 2326548 2333929 2342049 2351515 2361705 2371637 2381314 2391134 2400536
57576 2400536 2408494 2415056 2421340 2428166 2435671 2443894 2452709 2461343 2469050 2476206 2483857 2492378 2501415 2510867
57562 2510867 2520863 2530972 2540574 2549968 2559997 2570544 2580555 2589711 2598986 2609246 2620303 2631816
57550 2631816 2644123 2657588 2671781 2685904 2699561 2712696 2725219 2737141 2748740 2760214 2771394
57539 2771394 2782130 2792776 2804067 2816535 2830064 2843949 2857423 2870267 2882792 2895108 2906720
57528 2906720 2917156 2926774 2936574 2947372 2959399 2972394 2985638 2998169 3009488 3020009 3030494 3041260
57516 3041260 3052328 3063963 3076437 3089387 3102034 3114161 3126484 3139946 3154840 3170519 3185865
57505 3185865 3200260 3214225 3228831 3244396 3260291 3276072 3292044 3308296 3324012 3338429 3351823
57494 3351823 3364827 3377400 3389334 3401203 3413813 3426976 3439785 3451861 3463492 3474831 3485862
57483 3485862 3496987 3508748 3521051 3533541 3546616 3561166 3577330 3594322 3611489 3628720 3645824
57472 3645824 3662345 3678105 3693304 3708037 3722294 3736364 3750568 3764621 3777913 3790416 3802726
57461 3802726 3815339 3828479 3842411 3857148 3872057 3886469 3900581 3915013 3929793 3944613 3959712
57450 3959712 3975414 3991008 4005412 4018993 4033400 4049287 4065410 4080447 4094642 4109053 4124040
57439 4124040 4139208 4154184 4168833 4183164 4197481 4212223 4227382 4242600 4258078 4274742 4293060
57428 4293060 4312215 4330880 4348462 4365243 4381723 4398227 4414941 4431940 4449141 4466310 4483067
57417 4483067 4499087 4514462 4529730 4545281 4561054 4577103 4593963 4611907 4630339 4648615 4666950
57406 4666950 4685661 4703981 4720811 4736430 4752209 4768675 4785056 4800940 4817119 4834409 4852650
57395 4852650 4871278 4890000 4908515 4926498 4944187 4962176 4980300 4997660 5014192 5031164 5049540
57384 5049540 5068748 5087740 5106423 5125212 5143845 5161551 5178155 5194314 5210817 5227993 5245544
57373 5245544 5262684 5278771 5294052 5309357 5324950 5340265 5354950 5369519 5384587 5400092 5415721
57362 5415721 5431551 5447845 5464651 5481950 5499764 5517809 5535546 5552872 5570246 5587867 5605292
57351 5605292 5622147 5638655 5655128 5671588 5688214 5705496 5723420 5741074 5757578 5773000 5787964
57340 5787964 5802827 5817690 5832708 5847906 5863026 5877945 5892850 5907814 5922667 5937555 5952978
57329 5952978 5968930 5984592 5999279 6013135 6026527 6039479 6052230 6065665 6080390 6095799 6110670
57318 6110670 6124391 6137078 6148965 6160368 6171963 6184333 6197223 6209702 6221091 6231529 6241815
57307 6241815 6252885 6265150 6278086 6290723 6302666 6314333 6326130 6337908 6349455 6360981 6372766
57296 6372766 6384745 6396709 6408524 6420001 6431049 6442162 6454180 6467324 6481052 6495030 6509572
57285 6509572 6524886 6540708 6557103 6574757 6593904 6613664 6633056 6652013 6670728 6688693 6705198
57274 6705198 6720398 6735036 6749402 6763149 6775929 6787720 6798814 6809810 6821219 6832719 6843377
57263 6843377 6853005 6862551 6872551 6881901 6889078 6894096 6898433 6903337 6908958 6914802 6920229 6924660 6928029 6930997
57249 6930997 6934237 6937730 6941234 6945066 6949780 6955299 6961010 6966591 6972160 6977708 6982857 6987136 6990179 6991860
57235 6991860 6992487 6992573 6992126 6990552 6987542 6983599 6979377 6975077 6970910 6967452 6964874 6962381 6959160 6955490 6952194
57220 6952194 6949387 6946438 6942879 6938733 6934293 6930128 6926904 6924571 6922127 6918885 6915595 6913612 6913367 6914343
57206 6914343 6916132 6918633 6921481 6924176 6926725 6929510 6932659 6936064 6939764 6943676 6947234 6949933 6952012 6954079
57192 6954079 6956400 6959109 6962641 6967192 6972104 6976562 6980595 6984669 6988714 6992345 6995665 6998998 7002125 7004685
57178 7004685 7007059 7009927 7013209 7016386 7019546 7023084 7026458 7028323 7027904 7025330 7020604 7013283 7003281 6991094
57164 6991094 6977033 6960921 6942575 6921851 6898216 6871140 6840995 6808843 6775287 6740242 6703762
57153 6703762 6666191 6627364 6586617 6543855 6499915 6455640 6411248 6366878 6323188 6281045 6241009
57142 6241009 6203206 6167435 6133460 6101545 6072453 6046425 6022431 5998918 5974925 5949749 5922015
57131 5922015 5890032 5852896 5810372 5761951 5707089 5646249 5580676 5511331 5439225 5366821 5297770
57120 5297770 5234765 5178406 5128152 5083329 5043064 5006529 4973920 4946437 4924934 4909268 4899173
57109 4899173 4894850 4896332 4903201 4915670 4935694 4966934 5014232 5083192 5179598 5309011 5477367
57098 5477367 5691895 5961003 6293857 6701245 7196636 7795128 8511178 9358047 10348411
57089 10348411 11492775 12795815 14254107 15855134 17573771 19366826 21171854 22911974
57081 22911974 24500516 25843353 26848798 27453884 27656342 27526187 27180584 26733038 26247210
57072 26247210 25721461 25108508 24352679 23420592 22311665 21051513 19679563 18239329 16773509
57063 16773509 15322493 13923718 12609718 11405048 10324426 9373268 8549158 7843130
57055 7843130 7241803 6730756 6296787 5927545 5610643 5334765 5091577 4875714 4683063
57046 4683063 4509688 4352038 4207205 4072735 3946520 3826683 3711332 3598818 3488593
57037 3488593 3381288 3277413 3176497 3078040 2982680 2891580 2805166 2723234 2645932 2573973 2508655
57026 2508655 2452634 2409540 2380263 2358624 2332034 2287906 2220047 2129704 2022179 1903445 1779017
57015 1779017 1654042 1533070 1419286 1314023 1217220 1128575 1048247 976470 912810 856207
57005 856207 805724 760936 721527 686773 655550 626881 600428 576453 555200 536361 519392
56994 519392 504184 491075 480121 470798 462586 455448 449620 445328 442971 443165 446206 451632 458265 464385
56980 464385 467950 467458 462920 455449 445720 433515 419090 403986 389727 376317 362878 349341 336754
56967 336754 326234 318363 313300 310715 309800 310069 312091 316954 325259 337129 352624 371101 390250
56954 390250 406699 417796 422431 420497 412574 400253 385725 370574 355322 340282 326189 313815
56942 313815 303525 295510 289945 286698 285420 286218 289796 296583 306221 318328 333391 352219 374419
56929 374419 397683 418622 434181 442532 443127 436375 423309 405402 384395 362096 340223 320242
56917 320242 303053 288702 276574 266025 256730 248440 240762 233505 227006 221775 217896 215062 213064
56904 213064 211889 211416 211420 211944 213335 215721 218681 221648 224612 228286 233571 240897 250084 260761 272789
56889 272789 286300 301542 318882 338684 360670 383264 403872 420067 430518 435019 434120 428944
56877 428944 420918 411321 401034 390709 380914 372029 364357 358521 355509 356102 360426 368251 379625 395138
56863 395138 415689 442042 474508 512984 557054 605258 653694 695919 725523 739360 738105 724194
56851 724194 700380 670170 637911 607139 579282 554609 533884 518421 509111 506264 510087 520658
56839 520658 537745 561412 592661 632942 683266 744149 815491 894840 975266 1045960 1096180
56828 1096180 1119590 1115841 1089080 1045242 990033 928430 865020 803954 748186 699044 656833
56817 656833 621669 593625 572616 558744 552681 555259 566678 586464 614311 650686 696151 749382
56805 749382 805290 855365 890854 906468 901498 878254 840511 793172 741633 690048 640335 593235
56793 593235 549843 511594 479374 453267 432842 417369 406270 399885 399284 404897 415992 431968
56781 431968 453224 479612 508364 534487 553205 561698 559201 546619 525999 499595 469249 436855
56769 436855 404755 374889 347756 322968 300523 280849 263914 249100 235911 224157 213619
56758 213619 204257 196540 190885 186768 183043 179064 174995 171212 167940 165311 163232 161315 159388 157736
56744 157736 156370 154561 151807 148817 146673 145324 143799 141741 139794 138542 137891 137575 137531 137745 138256 139206
56728 139206 140371 140905 140242 138992 138257 138292 138611 139147 140353 142195 143950 145089 145722 146146 146509 146861 147021
56711 147021 146676 146133 146437 148046 149922 150944 151637 153290 155800 157839 159006 160290 162239 164186 165617
56696 165617 166990 168613 169917 170474 170788 171396 171950 171817 170967 169812 168716 168067 168241 169083 169862 169990 169410
56679 169410 168177 166284 164000 161748 159419 156402 152437 147952 143533 139604 136588 134661 133316 131843
56665 131843 130265 129169 128756 128830 129553 131221 133359 135143 136778 139361 143122 146989 150239 153535 157738
56650 157738 162619 167251 170988 173586 175054 175786 176283 176453 175778 174283 172650 171322 170251 169562 169441 169276
56634 169276 168021 165730 163669 162548 161704 160414 158880 157320 155218 152278 149233 146879 144989 142859
56620 142859 140338 137747 135425 133875 133715 134924 136732 138654 141046 144243 147920 151733 155819 160179
56606 160179 164231 167431 169723 171103 171554 171680 172408 173588 173954 172973 171720 171313 171552 171890 172599 173969
56590 173969 175283 175729 175675 175974 176532 176623 176227 176081 176635 177790 179410 181379 183326 184872 185993 186781 187220
56573 187220 187502 188097 189113 190111 190856 191641 192624 193678 195307 198717 204345 211151 218130 225775 235289 247012
56557 247012 260300 274182 287340 298160 305802 310894 314533 317182 319110 321106 323802 326854 329582
56544 329582 331929 333991 335272 335312 334583 333837 332897 330957 327810 324073 320435 317222 314395 311444 307645
56529 307645 302873 297806 293117 289021 285725 283403 281393 278474 274448 270343 266565 262118 256425 250550
56515 250550 245474 240498 234695 228822 224286 221099 218382 216150 214947 214258 212885 210617 208156 205739
56501 205739 203218 201153 200327 200333 200025 199275 198975 199341 199486 198775 197569 196591 196448 197599 199808 201753 202146
56484 202146 201126 199749 198466 197093 195888 195484 195870 196526 197405 198842 200720 202654 204696 206846 208273
56469 208273 208219 207411 207424 208844 211115 213880 217179 220559 223280 225303 226971 227978 227948 227702 228447 229829
56453 229829 230268 229261 227827 226569 224951 222900 221617 222113 224051 226507 228829 230350 230398 229283 228344
56438 228344 228441 229032 229155 228594 227744 226978 226566 226614 226757 226331 225037 223170 221187 219495 218403 217842 217405 217121
56420 217121 217679 219207 220539 220665 220254 220537 221312 221479 221160 221692 223628 226320 229480 233522 238195 242411
56404 242411 245810 249115 252592 255523 257570 259333 261001 261733 261022 259660 258744 258577 258980 259723 260231 259773
56388 259773 258434 257163 256545 256335 256354 256914 258043 259272 260520 262329 264844 267425 269533 271201 272367
56373 272367 272643 272043 271192 270568 270260 270535 271720 273377 274548 275001 275354 275882 276184 276240 276755 278141 279988
56356 279988 281764 283314 284678 286193 288618 292154 295589 297584 298658 300457 303229 305604 306988 308400
56342 308400 310497 312490 313723 314831 316463 318061 318809 318850 318831 319099 319873 321328 323094 324558 325974 328274
56326 328274 331553 334908 338115 342148 347549 353449 358759 363147 366338 367696 367213 365896 364570 363230
56312 363230 361969 361386 361586 361929 362287 363428 365614 367971 369802 371376 372934 374132 375109 376878 380004
56297 380004 383907 388012 392456 397178 401613 405853 410796 416535 421915 426355 430793 436105 441955 447943
56283 447943 454498 461787 469077 476040 483363 491276 498880 505901 513669 523294 534245 545819 558565
56270 558565 572973 588113 603014 618306 635142 653475 672747 693333 715953 740467 766539
56259 766539 794771 826100 860901 899678 943646 993473 1048462 1108292 1174627 1249641 1333725
56248 1333725 1426126 1527187 1638403 1760500 1892602 2032983 2179587 2330151 2482671 2635468
56238 2635468 2786122 2930859 3065565 3186743 3290970 3374443 3434116 3468676 3477859 3461707
56228 3461707 3421330 3359459 3279274 3183268 3073867 2954221 2827591 2696719 2564302 2432979
56218 2432979 2304235 2178468 2056779 1941357 1833382 1731989 1636350 1547268 1465656 1390894
56208 1390894 1322000 1259010 1201827 1149045 1099470 1053667 1012577 975730 942237 912320 886238
56197 886238 862769 840505 819715 801305 784884 769542 755696 744296 734801 725706 716631 708309
56185 708309 700873 693719 686804 680733 675784 671894 669197 667526 665841 663220 660054 657454 655950 655458
56171 655458 655795 656518 657091 657835 659771 662942 666104 668704 671747 675956 680675 685519 691347 698506 705973
56156 705973 713552 723027 735471 749188 762142 774752 788470 803279 818650 835480 854949 876830
56144 876830 900983 929144 963164 1002840 1047633 1099108 1159314 1227962 1303521 1385671 1473896
56133 1473896 1564506 1651755 1731639 1802816 1865035 1919194 1968216 2015232 2060850 2103619 2142054
56122 2142054 2174390 2197763 2210325 2213629 2210922 2203912 2192891 2178372 2159802 2133707 2095954 2045584
56110 2045584 1984550 1914964 1839094 1760895 1684619 1612255 1544424 1482728 1428766 1381872 1340466
56099 1340466 1304778 1275806 1252669 1233689 1219024 1209485 1203678 1199170 1195602 1193932 1193595 1193227 1193210 1194587
56085 1194587 1196506 1197684 1199290 1203242 1208723 1213670 1218612 1225609 1234313 1242666 1250700 1260085 1270623 1280832
56071 1280832 1291303 1303797 1317594 1330485 1342910 1357370 1374100 1391089 1408012 1426472 1446636
56060 1446636 1467270 1488678 1511956 1535846 1558131 1579597 1602661 1626670 1648757 1668926 1689912
56049 1689912 1712213 1733653 1753859 1774807 1796847 1818422 1839928 1863665 1889834 1916568 1943923
56038 1943923 1973760 2005825 2038148 2071087 2106772 2144912 2183584 2223731 2268086 2315980 2364091
56027 2364091 2412078 2462570 2515929 2570176 2625681 2684582 2745829 2806398 2867150 2931833 3000591
56016 3000591 3070378 3141503 3217386 3297925 3379664 3462631 3550299 3642484 3735252 3828323 3925665
56005 3925665 4028248 4133283 4241108 4355519 4476683 4601338 4730570 4869592 5019117
55996 5019117 5175143 5337983 5512874 5700638 5896670 6100561 6317703 6549971 6794163
55987 6794163 7051248 7327552 7625076 7940394 8274810 8635504 9025170 9441256 9887058
55978 9887058 10372216 10900747 11470674 12087134 12763072 13505447 14314771 15200247 16180659
55969 16180659 17268666 18470748 19805272 21303655 22992272 24893545 27048691 29519615
55961 29519615 32367322 35654351 39474288 43955733 49237992 55477637 62886361 71730695
55953 71730695 82295671 94896838 109937989 127916721 149384663 174934387 205026191
55946 205026191 239301145 275577789 309553541 336038502 351129886 353673047 345025107
55939 345025107 327749480 304524488 277775141 249632079 221815317 195503141 171359142
55932 171359142 149670346 130472803 113653807 99048929 86488976 75781481 66696072
55925 66696072 58996515 52472693 46934766 42204796 38134051 34613298 31553501 28870286
55917 28870286 26495323 24385018 22505292 20819281 19297125 17923165 16683206 15555453
55909 15555453 14521408 13574218 12708446 11911826 11173926 10492734 9865629 9283072 8737688
55900 8737688 8230631 7762703 7327518 6919328 6539379 6188521 5861125 5552180 5263263
55891 5263263 4995955 4746073 4509796 4289186 4086454 3898629 3722718 3560537 3413874
55882 3413874 3280015 3155934 3041502 2934885 2830433 2725173 2622215 2524251 2429102 2335238
55872 2335238 2245918 2163618 2085430 2008180 1933398 1863396 1797058 1733295 1674175 1620827 1570537
55861 1570537 1521485 1476090 1436149 1398982 1362038 1327115 1296292 1267694 1239079 1211894 1188028
55850 1188028 1166020 1143977 1122829 1103295 1083047 1060326 1037040 1015015 992525 967929 943348
55839 943348 921194 900227 878633 857945 840211 824028 807099 790302 775691 762761 749981
55828 749981 737868 727326 717142 706178 695921 687761 679831 669665 658052 647280 637422 627217
55816 627217 616759 606445 595104 582076 569516 559829 552301 544831 537415 531381 526741 522906 520595
55803 520595 520535 521599 522535 524218 528016 533298 538613 543826 549066 553165 555235 556315 557430 557550 555400
55788 555400 551617 547189 541658 535037 529580 527099 525985 523149 517449 509138 497756 483199 467471
55775 467471 452826 439225 425809 413536 404088 397364 392307 389001 387694 386932 384965 382107 379610
55762 379610 377326 374521 371884 370475 369610 367836 365179 362519 359769 356548 353498 350971 347563 341940
55748 341940 335008 328292 321410 313378 305225 298887 294325 289981 285361 281005 276695 271955 267688 265142
55734 265142 263739 261898 259448 257354 255732 254093 252907 252862 253076 251939 249325 246165 242440 237471 231698
55719 231698 226392 221967 218258 215856 215410 216117 216612 216885 217747 219099 220434 222351 225673 229620 232734
55704 232734 235099 237828 240764 242541 242563 241215 238529 234378 229661 225531 221690 216990 211425 206042 201278
55689 201278 196889 193099 190354 188452 187284 187698 190049 192713 193874 194165 195691 199043 203125 207348 211931
55674 211931 216370 219683 221968 223909 225034 224341 222332 220477 218931 216771 214224 212574 211853 210747 208972
55659 208972 207847 208253 209778 211968 214669 217073 218294 219107 221294 224931 228100 229723 230889 232848 235264
55644 235264 237073 237667 236665 233818 229680 225291 220792 215430 209156 203011 197644 192625 187552 182667
55630 182667 178042 173298 168576 164789 162428 160921 159458 157768 155966 154377 153580 153913 154863 155516 155451 154687
55614 154687 153219 151338 149859 149045 147905 145582 142788 140702 139118 137092 134825 133319 132589 131834 131065
55599 131065 130965 131370 131475 131377 131838 132651 132851 132377 131909 131244 129620 127614 126841 127568 128352 128283 127908 127665 127131
55580 127131 126275 125915 126460 127535 129145 131728 134754 136717 137023 136690 136954 138451 141802 147337 153909 159467
55564 159467 163288 166309 169115 171123 172002 172151 171371 168759 164564 160484 157386 154197 149768 144400 138852
55549 138852 133289 128015 123828 120793 117903 114784 112495 111862 112247 112828 113907 115993 118645 121101 123231
55534 123231 125119 126631 128049 130119 132792 134902 135735 135880 135870 135166 133317 131095 129511 128517 127494 126222
55518 126222 124580 122129 118778 115211 112009 109031 106108 103517 101272 98946 96710 95477 95367 95162 94127
55503 94127 93291 93901 95548 96905 97567 98049 98507 98559 98055 97180 95970 94384 92663 91185 90218 90014 90646
55486 90646 91546 91787 91120 90088 88995 87572 85891 84625 84086 83805 83439 83137 82741 81707 80263 79498 79754
55469 79754 80044 79675 79280 79511 79821 79470 78739 78178 77558 76596 75957 76507 78093 79946 81758 83551 84999
55452 84999 85700 85724 85284 84368 83157 82214 81736 81280 80732 80754 81660 82665 82886 82387 81560 80288 78491 76807
55434 76807 75970 76045 76797 78073 79301 79545 78827 78557 79797 81823 83223 83679 83812 83983 84162 84451 84880 85157
55416 85157 85283 85878 87319 89162 90961 92865 94770 95813 95466 94339 93178 91912 90445 89345 88813
55401 88813 87962 86182 84339 83523 83469 83408 83600 84694 86264 87384 88105 89032 89919 90018 89427 88754 87886 86412
55383 86412 84947 84600 85284 85841 85840 86029 86991 88430 89845 91001 91723 92030 92356 92866 92774 91208 88474 85623
55365 85623 83076 80631 78445 76944 75959 74998 74220 74118 74457 74579 74574 75038 75826 76190 76125 76412 77267 78031 78357
55346 78357 78703 79422 80261 80963 81651 82451 83363 84437 85461 85671 84590 82966 81980 81733 81435 80906 80694 80778
55328 80778 80410 79467 78842 79126 79825 80242 80288 80127 79801 79535 79686 80117 80262 80051 80042 80423 80607 80116 79277 78694
55308 78694 78558 78666 78714 78426 77875 77689 78456 79878 81095 81770 82273 82858 83424 84083 85160 86496 87508 88113
55290 88113 88870 89973 90841 90991 90682 90334 89895 89164 88330 87775 87562 87348 86718 85576 84364 83748 83833 83964
55272 83964 83667 83408 83869 84818 85414 85382 85172 85093 85114 85363 86015 86675 86699 86187 85883 86088 86364 86382 86308 86263 86201 86405
55250 86405 87303 88555 89092 88317 86682 84934 83495 82762 83228 84885 86988 88775 90034 90882 91411 91684
55234 91684 91668 91134 90028 88877 88314 88259 88129 87677 87040 86198 85147 84429 84586 85187 85318 84998 85058 85655 86049
55215 86049 86091 86669 88162 89526 89612 88587 87419 86719 86689 87518 89050 90494 91160 91229 91365 91871 92571 93224
55197 93224 93705 93982 94098 93937 93071 91306 89335 88183 87994 88019 87829 87687 87631 87174 86327 86012 86895 88485
55179 88485 89906 90939 91824 92665 93536 94619 95728 96314 96411 96983 98680 100737 101769 101329 100110 98948
55163 98948 98150 97616 97116 96579 96303 96681 97576 98338 98546 98316 97783 96927 96061 95780 96078 96197 95759 95343 95511
55144 95511 95948 96129 96183 96435 96706 96727 96758 97049 97186 96664 95759 95093 94665 94034 93245 92830 93042 93719 94746 96053
55124 96053 97234 97759 97551 96947 96220 95458 94733 93978 92946 91751 91132 91670 92980 94224 95122 95851 96225
55107 96225 95825 94955 94699 95745 97706 99762 101474 102760 103561 103943 104271 104918 105866 106782 107424 107816 108093
55090 108093 108271 108271 108098 107905 107824 107846 107974 108370 109128 110016 110711 111201 111633 111840 111421 110364 109131 108046 106996
55071 106996 105882 104928 104323 103936 103648 103630 104067 104838 105683 106442 107073 107718 108689 109947 110674 110007 108337 107088
55053 107088 106993 107294 107024 106209 105251 104013 102383 101202 101553 103370 105585 107439 108809 109421 108814 107235
55037 107235 105769 105210 105357 105654 105955 106310 106444 105999 105064 104104 103327 102497 101440 100557 100526 101428 102354 102174
55019 102174 100726 99065 98459 99293 100923 102333 102905 102832 102899 103645 104670 105078 104616 104053 104274 105425 107071
55002 107071 108783 110207 110955 110863 110248 109619 109226 109066 109168 109683 110802 112583 114671 116232 116563 115820 114805
54985 114805 114007 113319 112724 112569 112952 113459 113848 114338 114813 114502 113140 111879 112141 113830 115564 116547 117437
54968 117437 119190 121738 124130 125618 126285 126715 127230 127502 126959 125565 124004 123021 122794 123019 123317 123356 122887
54951 122887 121928 120777 119703 118789 118110 117724 117461 117119 116941 117388 118283 118731 118257 117496 117387 118074 119021 119825
54933 119825 120478 121109 121871 122860 123913 124758 125509 126613 128171 129886 131848 134648 138337 142060 145309 148809
54917 148809 153435 158879 164217 169283 174499 179707 184111 187237 189018 189026 186627 182078 176681 171507 166448
54902 166448 160809 154507 148424 143671 140566 138328 135941 133339 131346 130398 129939 129339 128718 128356 127967 127304
54886 127304 126959 127734 129566 131806 134211 136854 139406 141434 143229 145441 148026 150400 152615 155509 159661
54871 159661 164970 171258 178399 185560 191116 193779 193498 191085 187371 182821 177644 172088 166693 162040
54857 162040 158038 153877 149099 144317 140346 137113 134108 131465 129637 128329 126758 124893 123457 122690
54843 122690 122031 121134 120297 119755 119305 118792 118269 117639 116847 116411 116905 117896 118270 117789 117393 117776 118552 119095 119344
54824 119344 119441 119313 118995 118666 118147 117121 116047 115973 117121 118480 119183 119457 119801 120112 120154 120084 119915 119256 118143
54805 118143 117403 117541 118010 118258 118717 119912 121246 121662 121067 120154 119263 118365 117920 118630 120295 121835 122622
54788 122622 123066 123659 124105 123801 122751 121647 121209 121604 122405 123033 123245 123205 123177 123414 124359 126518 129790 133247
54770 133247 135961 137960 140067 142932 146562 150632 154930 159414 164077 168857 173705 178793 184501 190839
54756 190839 196857 201012 202388 201323 198723 195077 190446 185050 179453 174176 169370 164836 160353 156060
54742 156060 152501 150029 148216 146255 144008 142144 141069 140247 138952 137291 135972 135367 135300 135585 136252 137264
54726 137264 138467 139962 142211 145569 149857 154517 159149 163764 168501 173248 177783 182158 186555 190561
54712 190561 193081 193408 192077 190127 187795 184561 180306 175671 171236 167084 163280 160075 157422 154919
54698 154919 152450 150328 148645 147160 145957 145398 145142 144123 141996 139775 138401 137508 136360 135249 134905
54683 134905 135043 134647 133458 132126 130907 129274 127039 124985 123957 123880 124031 123916 123542 123129 122815 122506 121937
54666 121937 121008 120075 119697 119996 120415 120193 119068 117544 116495 116424 117040 117684 118086 118538 119361 120582 122144
54649 122144 123951 125569 126387 126369 126205 126433 126832 127034 127259 127929 128955 129897 130526 130726 130230 129085 128095 128066
54631 128066 128745 129204 129246 129664 130992 132642 133576 133401 132554 131742 131432 131611 131859 131782 131476 131348 131507 131600 131326
54612 131326 130876 130713 131074 131780 132464 132875 133016 133001 132881 132721 132726 133007 133198 132718 131564 130499 130183 130457 130776
54593 130776 130974 131178 131298 131119 130782 130615 130576 130276 129582 128756 128007 127254 126388 125480 124684 124153 123979 123973 123669 122888
54573 122888 122202 122429 123717 125470 127113 128503 129634 130381 130698 130690 130356 129582 128524 127690 127476 127843 128586
54556 128586 129686 131175 132807 134131 134909 135326 135728 136187 136446 136374 136374 137109 138763 140780 142425 143391 143767
54539 143767 143715 143410 143135 143154 143618 144692 146495 148681 150342 150709 149931 148884 148279 148155 148108 147768 147040 146041
54521 146041 144839 143297 141364 139502 138449 138415 138881 139350 139863 140522 140991 140864 140194 139194 137817 136122
54505 136122 134759 134489 135330 136563 137410 137353 136162 134186 132360 131387 131057 130876 131011 131964 133587 135168 136330
54488 136330 137089 137171 136219 134713 133832 134177 135301 136575 137716 138289 137646 135909 134328 134118 135353 137308
54472 137308 139367 141200 142645 143923 145594 147786 149836 151073 151541 151568 151123 150222 149566 149960 151212 152247
54456 152247 152329 151616 150549 149284 147934 146849 146334 146312 146478 146611 146601 146337 145810 145314 145335 146108 147243 147857
54438 147857 147271 145645 143895 142956 143153 144159 145318 145949 145666 144721 143881 143723 144041 144183 143914 143690 143993
54421 143993 144732 145471 146039 146628 147350 148031 148518 148892 149223 149382 149337 149401 149859 150460 150691 150530 150477 150776 151053 150940
54401 150940 150668 150771 151468 152594 153933 155366 156930 158849 161170 163219 163946 163200 162162 161975 162340 162158
54385 162158 161205 160345 160234 160647 161208 161897 162576 162762 162315 161818 161788 161892 161459 160495 159686 159521 159847 160286 160761
54366 160761 161468 162519 163748 164851 165672 166269 166661 166638 166013 165063 164520 165015 166556 168517 170112 170946 171263
54349 171263 171626 172323 173237 174324 175905 178234 181018 183736 186312 189082 192136 195111 197675 199870 201812
54334 201812 203252 203642 202631 200409 197510 194220 190303 185595 180757 176947 174570 172844 170916 168882
54320 168882 167321 166318 165539 164829 164098 162956 161253 159749 159459 160363 161494 162155 162367 162196 161511 160492
54304 160492 159621 159045 158624 158594 159361 160548 161181 161057 161013 161466 161644 160840 159610 158968 158982 158919 158442 157974 158076
54285 158076 158958 160410 161847 162599 162422 161544 160160 158372 156743 156144 156651 157252 157146 156726 156700 156882 156668
54268 156668 156200 156141 156512 156693 156519 156559 157218 158250 159257 160062 160459 160177 159374 158776 159030 160188 161914 163863
54250 163863 165674 166898 167249 166895 166327 165948 165823 165762 165537 164994 164000 162562 161129 160564 161347 162777 163392
54233 163392 162432 160611 159260 159043 159641 160321 160447 159747 158508 157445 157072 157264 157553 157687 157726 157817 158071 158538
54215 158538 159118 159680 160381 161529 162981 164002 163949 162855 161168 159307 157740 157068 157561 158786 160051 161022
54199 161022 161735 162319 163043 164242 165745 166659 166182 164492 162519 161081 160557 160985 161877 162216 161315 159706 158601
54182 158601 158498 158763 158577 157782 156741 155829 155252 155075 155238 155655 156231 156650 156352 155099 153416 152148 151679
54165 151679 151870 152570 153708 154958 155823 156207 156517 157126 157982 158770 159194 159091 158537 157914 157612 157628 157590 157215 156580
54146 156580 156016 155893 156367 157142 157617 157480 157068 156976 157489 158556 159994 161396 162133 161866 160933 159959 159335 159335 160280
54127 160280 162013 163592 164151 163888 163544 163227 162570 161908 162253 163854 165695 166804 167369 168092 169032 169643 169585
54110 169585 169022 168346 167938 168011 168420 168833 169228 169914 170880 171601 171750 171700 171938 172321 172386 172138 172094 172669 173888 175531
54090 175531 177133 177974 177603 176452 175512 175270 175298 175051 174695 174838 175635 176575 177168 177490 177911 178557 179363 180496
54072 180496 182285 184607 186691 187807 187982 187810 187758 187938 188399 189221 190335 191551 192900 194640 196826 199173
54056 199173 201468 203908 206833 210297 214163 218594 224219 231701 241120 251750 262396 271913 279471 284530
54042 284530 286888 286903 285489 283621 281852 280392 279501 279509 280424 281792 283147 284563 286640 289872 294113 298716
54026 298716 303183 307472 311560 314960 317060 317862 317980 317879 317550 316991 316482 316083 315283 313553 310985 308015
54010 308015 304766 301047 296782 292057 286896 281347 275652 270060 264669 259677 255441 251956 248601 244960
53996 244960 241539 239151 237784 236713 235509 234237 232833 231074 229190 227709 226527 224897 222627 220552
53982 220552 219440 219028 218625 218136 217903 217841 217363 216109 214319 212466 210864 209645 208900 208648 208702 208657 208141 207228
53964 207228 206538 206723 207850 209406 210823 211886 212673 213387 214197 215131 216153 217454 219414 222109 225104 228029
53948 228029 231089 234676 238772 243224 248271 254226 260848 267721 275084 283506 292722 301566 309180 315601
53934 315601 321049 325405 328702 331397 333789 335726 337185 338601 340235 341780 342982 344176 345826 347958
53920 347958 350418 353273 356572 360162 364062 368640 374093 380220 386988 394751 403483 412358 420659 428569
53906 428569 436453 443880 450072 455017 459423 463784 468242 473181 479265 486966 496604 508554 522437 535936
53892 535936 545273 547456 541941 530173 514097 495311 475081 454458 434254 415067 397324 381225
53880 381225 366697 353489 341396 330505 321130 313329 306497 299805 293118 287117 282328 278449 274901
53867 274901 271589 268649 265806 262593 259064 255723 252818 250123 247392 244655 242071 239849 238169 236830
53853 236830 235092 232373 229015 225935 223570 221637 219837 218264 217135 216636 217034 218336 219767 220290 219831
53838 219831 219379 219562 219859 219674 219513 220293 221835 222932 222917 222438 222504 223309 224305 225042 225572 226146 226847 227554 228116
53819 228116 228536 229008 229755 230837 232157 233643 235298 237054 238760 240467 242541 245249 248279 251012 253345
53804 253345 255914 259282 263196 267006 270643 274691 279488 284657 289713 294644 299544 304062 307747 310793
53790 310793 313901 317319 320454 322627 323940 325133 326750 328604 329963 330104 328772 326323 323390 320275
53776 320275 316641 311938 306209 300294 295092 290687 286396 281624 276445 271317 266542 262230 258574 255752
53762 255752 253562 251415 248841 245873 242945 240481 238583 236930 235012 232623 230150 228234 227154 226630
53748 226630 226216 225720 225264 225080 225202 225255 224687 223397 221985 221099 220704 220301 219759 219472 219718 220268 220680 220714 220506
53729 220506 220636 221846 224162 226430 227388 227192 227189 228132 229439 230449 231472 233054 234974 236713 238350 240226
53713 240226 242120 243571 244781 246493 249030 252035 255003 257555 259396 260637 262060 264396 267352 269908
53699 269908 271616 273049 274942 277453 280406 283731 287395 291193 294769 297657 299380 299915 300037 300731 302141
53684 302141 303427 303782 303196 302135 300873 299396 297668 295736 293719 291858 290456 289648 289271 288993 288500 287663
53668 287663 286678 286021 286078 286788 287769 288671 289252 289249 288445 286877 284862 282911 281627 281410 282031 282776 283302 284023
53650 284023 285317 286761 287697 288176 288642 288888 288199 286609 285188 284840 285456 286522 287852 289338 290594 291437
53634 291437 292375 294079 296542 299198 301668 304004 306329 308639 310906 313095 315108 316941 318854 321200
53620 321200 324098 327377 330783 334090 337128 339882 342506 345115 347634 349987 352301 354765 357405 360179
53606 360179 363277 367029 371422 375900 379856 383246 386539 390025 393450 396430 398967 401209 402918 403705
53592 403705 403884 404487 406064 407897 408895 409033 409378 410844 413402 416436 419307 421438 422314 421695 419687 416521
53576 416521 412403 407578 402343 397022 392155 388533 386608 385857 385062 383403 381052 378795 377340 376943 377247
53561 377247 377398 376761 375692 375301 376225 377880 379062 379088 378273 377486 377397 377983 378694 379189 379844 381343 383892 387148
53543 387148 390779 394670 398600 402267 405765 409642 414304 419652 425440 431594 438080 444760 451577 458631
53529 458631 466087 474334 484166 496189 509893 523898 537378 550724 564480 578331 591713 604964
53517 604964 619116 634683 651299 668544 686561 705731 726107 747405 769440 792441 816880
53506 816880 842855 869608 895946 921259 945863 970200 994079 1017056 1039188 1060900 1082231
53495 1082231 1102702 1122003 1140416 1158512 1176723 1195291 1214312 1233580 1252526 1270525 1287341
53484 1287341 1303329 1319268 1335914 1353539 1371780 1389947 1407475 1424097 1439615 1453624 1465543
53473 1465543 1474951 1481801 1486203 1488071 1487227 1483864 1478487 1471218 1461632 1449694 1436496 1423411 1410663
53460 1410663 1397428 1383269 1368653 1353930 1338621 1322149 1304588 1286206 1266821 1246290 1225246
53449 1225246 1204674 1184912 1165546 1146165 1126764 1107612 1089216 1072325 1057505 1044708 1033568
53438 1033568 1024038 1016346 1010409 1005692 1001636 997961 994620 991816 990075 989942 991542 994625 998977 1004574
53424 1004574 1011436 1019606 1029205 1040238 1052422 1065532 1079844 1095921 1113999 1133891 1155364 1178223
53412 1178223 1202053 1226489 1251930 1279564 1310245 1343522 1378103 1413225 1449311 1487275 1527439
53401 1527439 1569348 1612598 1657494 1704692 1754278 1805522 1857579 1910131 1963254 2016978 2071274
53390 2071274 2126157 2181465 2236645 2291142 2344896 2398107 2450488 2501107 2549090 2594249 2636875
53379 2636875 2677062 2714290 2747595 2776146 2799717 2818627 2833193 2843335 2848725 2849090 2844156 2833449
53367 2833449 2816468 2793099 2763683 2728686 2688510 2643681 2595118 2544102 2491899 2439245 2386187
53356 2386187 2332554 2278612 2225144 2172945 2122530 2074344 2028751 1985552 1943819 1902530 1861205
53345 1861205 1819726 1777945 1735853 1693896 1652685 1612551 1573730 1536772 1502282 1470393 1440875
53334 1440875 1413579 1388388 1364947 1343025 1322952 1305079 1288868 1273175 1257447 1241921 1226590
53323 1226590 1210867 1194609 1178745 1164340 1151530 1139888 1129295 1119833 1111219 1103135 1095973 1090620
53311 1090620 1087512 1086483 1087467 1090636 1095678 1101591 1107646 1114211 1122222 1132071 1143376 1155743 1169330
53298 1169330 1184587 1201745 1220701 1241278 1263438 1287237 1312682 1339629 1367787 1396657 1425445
53287 1425445 1453150 1479054 1503236 1526389 1548909 1570234 1589297 1605497 1618920 1629625 1637159
53276 1637159 1640975 1641059 1637919 1632170 1624362 1614941 1603995 1591141 1575942 1558392 1538826 1517588 1495107
53263 1495107 1472079 1449037 1425780 1401624 1376234 1349797 1322534 1294576 1266305 1238185 1210166
53252 1210166 1181923 1153861 1127043 1101762 1076958 1051660 1026305 1001837 978041 953793 928786
53241 928786 903974 880197 857196 834345 811701 789948 769660 750978 733800 718018 703610
53230 703610 690610 678897 668083 657747 647745 638117 628776 619503 610154 600552 590247 578715
53218 578715 565865 552168 538276 524665 511554 498896 486504 474415 463106 453105 444408 436470
53206 436470 428712 420882 413067 405596 398793 392545 386210 379197 371569 363901 356739 350389 344890 339838
53192 339838 334524 328742 323174 318496 314387 310075 305623 301836 298995 296508 293948 291639 289956 288773
53178 288773 287889 287327 286841 285826 284216 282930 282845 283737 284707 285295 285516 285148 283692 281118 278157 275741 274396
53161 274396 274089 274349 274491 273982 272762 271194 269784 268916 268642 268580 268199 267318 266165 264901 263403 261679 260191
53144 260191 259403 259191 259024 258647 258315 258373 258818 259326 259632 259846 260331 261182 261945 262100 261790 261674 262002 262247 261825
53125 261825 260836 259822 259120 258738 258600 258574 258417 258009 257566 257372 257500 257993 259090 260920 263071 264833 265819
53108 265819 266136 266041 265762 265571 265631 265648 264980 263292 260999 258894 257387 256270 255254 254549 254619 255379 256010 255887
53090 255887 255411 255433 255972 256091 255180 253782 252862 252702 252866 252900 252669 252234 251814 251672 251696 251302 250146 248778 248126
53071 248126 248403 248934 249078 248889 248782 248876 248938 248766 248422 248043 247567 246742 245539 244414 243953 244274 244989 245764 246542
53052 246542 247121 247050 246240 245314 244954 245207 245820 246886 248558 250409 251768 252664 253732 255029 255651 254857 253093
53035 253093 251447 250401 249562 248460 247117 245787 244556 243434 242721 242958 244409 246687 249035 250996 252667
53020 252667 254343 256099 257769 259087 259758 259649 259099 258808 259154 259786 260084 259759 258762 256995 254602 252348
53004 252348 251098 250911 251133 251390 251885 252617 252951 252378 251269 250501 250625 251734 253751 256322 258605 259783
52988 259783 259895 259804 260193 260859 261108 260645 259907 259642 260293 261719 263410 264943 266247 267419 268463 269344 270294
52971 270294 271744 273842 276164 278120 279521 280543 281271 281663 282018 283029 284975 287125 288396 288563 288324
52956 288324 288144 287576 286050 283826 281705 280007 278438 276843 275493 274483 273449 272190 271194 271056 271544
52941 271544 271687 270823 269245 267741 266750 266084 265275 264036 262521 261286 260882 261281 261678 261066 259174 256841
52925 256841 255363 255329 256021 256017 254575 252432 251075 251113 251696 251794 251629 252242 253759 254956 254837 253912 253309 253188
52907 253188 252854 252168 251901 252572 253688 254388 254270 253337 251706 249766 248213 247475 247291 247155 246952 246932 247320 248197
52889 248197 249497 250877 251911 252630 253566 254937 256190 256741 256830 257149 257846 258421 258457 257947 256994 255718 254441
52872 254441 253501 252849 252226 251757 251960 253158 255217 257874 260883 263834 266340 268538 270976 273788 276361
52857 276361 278007 278608 278435 277673 276404 274784 272949 270919 268714 266324 263469 259767 255410 251305 248184
52842 248184 245852 243671 241527 239817 238609 237449 236016 234530 233329 232440 231792 231485 231560 231722 231638 231377
52826 231377 231263 231395 231625 231992 232796 234105 235419 236083 235919 235297 234640 234106 233703 233551 233876 234794 236126 237465
52808 237465 238510 239367 240448 241973 243701 245223 246356 247069 247203 246547 245151 243257 240992 238452 236127
52793 236127 234827 234916 235855 236679 236792 236150 234958 233461 231971 230857 230434 230860 232015 233456 234624 235208
52777 235208 235269 235098 235168 236094 238176 240835 242850 243394 242637 241279 239872 238772 238270 238299 238306 237823 237008 236302
52759 236302 235773 235180 234525 234106 234123 234526 235197 235984 236713 237448 238513 239915 241008 241222 240994 241414 243007 245276
52741 245276 247434 249101 250310 251278 252301 253500 254662 255642 256795 258494 260300 261258 261178 261062 261992 264022
52725 264022 266406 268500 270090 271188 271821 271903 271187 269532 267272 265059 263224 261604 260035 258677 257706
52710 257706 257037 256508 256004 255244 253817 251704 249485 247849 247114 247289 248199 249402 250359 250965 251579 252394 253173
52693 253173 253804 254611 255812 257127 258309 259514 260711 261223 260588 259513 259231 260015 261038 261643 262009 262528
52677 262528 263229 264033 265013 266050 266614 266202 264737 262423 259585 256795 254751 253718 253352 253338 253842 255002
52661 255002 256284 256929 256950 257153 258057 259264 260142 260826 262126 264529 267655 270754 273409 275578 277114 277652
52645 277652 277031 275665 274333 273606 273478 273471 273052 272043 270718 269535 268790 268514 268605 268977 269614 270639 272278
52628 272278 274606 277341 280102 282849 285814 288881 291296 292254 291573 289594 286606 282750 278472 274659 272125
52613 272125 271058 271061 271524 271867 271656 270839 269891 269468 269816 270571 271195 271479 271542 271466 271131 270448 269588 268894 268568 268506
52593 268506 268449 268295 268292 268858 270197 272106 274195 276207 278005 279400 280246 280643 280800 280638 279825 278325 276667
52576 276667 275533 275246 275722 276603 277251 277011 275852 274619 274259 274834 275557 275684 275062 273923 272491 270904 269357
52559 269357 268232 268064 269134 270950 272386 272610 271717 270326 268937 267932 267699 268139 268461 268182 268074 269254
52543 269254 271429 272993 272989 272088 271306 270664 269641 268271 267143 266721 267175 268448 269991 270820 270379 269118 267831
52526 267831 266732 265675 264846 264600 264825 265089 265317 265745 266268 266446 266219 266134 266698 267881 269372 271007 272848
52509 272848 275094 278010 281704 285803 289518 292155 293547 294022 293978 293487 292280 290281 288073 286484 285593
52494 285593 284556 282676 280254 277978 275902 273662 271461 270034 269591 269489 269238 269243 270140 271802 273489 274777
52478 274777 275864 277022 278167 279176 280312 281988 284112 285970 286942 287224 287561 288368 289475 290788 292688
52463 292688 295477 298736 301711 304190 306522 308834 310705 311725 311970 311656 310637 308544 305363 301652 298161
52448 298161 295291 292896 290540 287944 285211 282639 280389 278391 276549 274898 273538 272455 271513 270663 270098
52433 270098 270065 270469 270865 270990 271128 271645 272385 272900 273204 273819 275012 276479 277881 279164 280184 280627 280655 281060
52415 281060 282234 283483 284092 284684 286723 290709 295625 300267 304544 309383 315890 324697 335472 346748
52401 346748 356609 363942 368793 371448 371684 369264 364766 359360 353793 347951 341471 334524 327901 322453
52387 322453 318518 315844 313981 312665 311857 311578 311839 312647 313882 315239 316483 317756 319469 321863 324859
52372 324859 328327 332334 337012 342335 348043 353724 358956 363429 366985 369508 370863 371055 370370 369236 367961
52357 367961 366691 365500 364401 363339 362343 361661 361612 362302 363594 365313 367394 369855 372676 375671 378491
52342 378491 380841 382707 384312 385902 387771 390372 394080 398850 404457 411082 419194 428827 439498 450993
52328 450993 463619 477396 491633 505826 520435 536191 553126 570899 589604 609466 629974
52317 629974 650137 669474 688079 705924 722907 739441 756152 772917 789051 804506 820032
52306 820032 835957 851676 866704 881441 896361 911055 924676 936938 948176 958664 968288 976738
52294 976738 983686 988872 992167 993458 992571 989617 985355 980708 975852 970281 963816 956931 949975 942807
52280 942807 935601 929369 925169 923219 923159 924749 927756 931634 936041 941496 948916 958521 969629 981468
52266 981468 993730 1006339 1019116 1031861 1044530 1057202 1069949 1082798 1095782 1108930 1122136
52255 1122136 1135087 1147514 1159609 1171874 1184290 1195940 1205924 1214364 1221927 1228532 1233307 1235734
52243 1235734 1235955 1233912 1229179 1221999 1213606 1205006 1196265 1187451 1179321 1172308 1165675 1158665 1151893 1146506
52229 1146506 1142394 1138360 1133944 1129974 1127248 1125596 1124440 1123455 1122491 1121556 1121093 1121711 1123369 1125334 1127174
52214 1127174 1129361 1132629 1137129 1142438 1148094 1153881 1159826 1166120 1172960 1180398 1188428 1196967 1205542 1213245
52200 1213245 1219469 1224604 1229549 1234591 1239311 1243569 1247975 1253143 1258985 1265025 1271097 1277408 1284105 1290946
52186 1290946 1297338 1302636 1306544 1309173 1310543 1310200 1307658 1303122 1297321 1290604 1282702 1273525 1263735 1254274
52172 1254274 1245586 1237489 1229594 1221697 1214020 1207245 1202077 1198604 1196290 1194645 1193697 1193699 1194673 1196415 1198773
52157 1198773 1201696 1205047 1208430 1211164 1212562 1212487 1211551 1210542 1209648 1208554 1207167 1205817 1204779 1204041 1203680
52142 1203680 1203877 1204347 1204223 1202958 1201004 1199209 1197798 1196383 1194791 1193412 1192762 1193128 1194722 1197857 1202800
52127 1202800 1209622 1218393 1229423 1243163 1259804 1279102 1300664 1324349 1350098 1377283 1404586 1430964
52115 1430964 1456601 1482401 1508548 1534067 1557963 1580201 1601093 1620151 1636244 1648893 1658926
52104 1658926 1667627 1675533 1682256 1687378 1691237 1694768 1698636 1702650 1706093 1708476 1709805 1710189 1709446 1707157
52090 1707157 1702864 1696135 1686671 1674594 1660520 1645221 1629309 1613302 1597813 1583487 1570861 1560392
52078 1560392 1552494 1547340 1544703 1544118 1545228 1547914 1552246 1558416 1566624 1576857 1588833 1602215 1616724
52065 1616724 1631928 1647118 1661628 1675288 1688374 1701121 1713347 1724510 1734091 1742001 1748665 1754555
52053 1754555 1759549 1763025 1764687 1765030 1764541 1762637 1757952 1749796 1738901 1726465 1712801 1697285 1679450
52040 1679450 1659664 1638719 1617199 1595525 1574345 1554454 1536272 1519619 1504056 1489328 1475419
52029 1475419 1462437 1450592 1440038 1430503 1421210 1411478 1401368 1391477 1382154 1373197 1364306 1355420 1346470
52016 1346470 1337177 1327314 1317005 1306507 1295938 1285348 1274768 1263952 1252299 1239364 1225274 1210336
52004 1210336 1194432 1177158 1158389 1138295 1116902 1094190 1070668 1047292 1024611 1002382 980305
51993 980305 958829 938898 921146 905512 891443 878208 865257 852482 840044 827827 815401
51982 815401 802760 790632 779541 768841 757246 744245 730393 716336 702227 688238 674925
51971 674925 662690 651398 640970 631926 624881 619860 616595 615240 616186 619321 623948 629400 635300 641319
51957 641319 647247 653281 659624 665623 669828 671180 669791 666443 661746 656014 649477 642275 634621 627315
51943 627315 621699 618727 618356 620248 624618 631779 641162 651557 662339 673716 685598 696913 706410
51930 706410 713688 719004 722328 722993 720217 713755 704133 692463 679835 666653 652629 637583 622078
51917 622078 607047 592926 579458 566342 553751 542112 531661 522460 514726 508891 505266 503719
51905 503719 503749 504945 507436 511987 519546 530504 544301 559824 576243 593360 611010 628130 642537
51892 642537 651772 654319 650259 640920 627896 612301 594873 576643 559158 543830 531170 520930
51880 520930 512846 506942 503137 501037 500355 501313 504379 509721 517004 525549 534491 542953 550239 555852 559306
51865 559306 560201 558579 554988 550059 544214 537828 531300 524710 517829 510900 505132 501859 501215 502047 503129
51850 503129 504132 505446 507405 509737 511519 511716 510033 507176 503947 500217 495234 488893 482156 476090
51836 476090 470934 466360 462208 458662 455998 454419 453996 454528 455676 457351 459690 462506 465062 466714 467488
51821 467488 467644 466916 464694 460992 456794 453231 450628 448553 446594 444890 443884 443810 444554 445930 447882
51806 447882 450318 452945 455389 457393 458693 458835 457482 454992 452422 450727 450022 449684 449074 447980 446453
51791 446453 444385 441442 437443 432809 428442 425043 422652 420967 419924 419686 420141 420778 421128 421072 420665 419955
51775 419955 419109 418433 418054 417751 417331 417110 417915 420610 425632 432771 441297 450416 459752 469355 479273 489179
51759 489179 498412 506202 511844 514848 515049 512478 507224 499638 490683 481709 473633 466445 459567 452583
51745 452583 445561 438934 433239 428881 425993 424572 424719 426542 429872 434369 439990 447072 455752 465504
51731 465504 475428 484768 492981 499495 503765 505666 505824 505577 506377 508746 511658 513264 512489 509732 505927
51716 505927 501324 495631 489063 482715 477716 474226 471335 467884 463496 458900 455146 452530 450557 449037
51702 449037 448717 450450 454007 458180 461858 464581 466195 466585 465914 464719 463595 463035 463544 465436 468229
51687 468229 470580 471251 470114 467960 465371 462059 457398 451418 445056 439436 435063 431864 429843 429412 430894
51672 430894 433899 437443 440704 443542 446323 449464 453274 458099 464295 471808 479859 487265 493202 497444
51658 497444 499802 499638 496426 490719 484129 478220 473706 470777 469732 470978 474565 479941 485983 491173
51644 491173 494146 494424 492471 488834 483503 476405 468180 459946 452369 445434 439073 433493 428763 424546
51630 424546 420587 417209 414987 414016 413731 413449 412887 412113 411208 410216 409363 408969 409025 409068 408760 408359 408207 407842
51612 407842 406239 403062 399233 396004 393873 392657 392162 392295 392845 393692 395101 397389 400419 403824 407618
51597 407618 412156 417619 423959 431351 440195 450563 461913 473365 483894 492244 497120 497829 494791
51584 494791 489432 483597 478708 475046 471877 468618 465807 464673 466015 469978 476776 486821 499931 515005
51570 515005 530885 547170 563983 581456 599807 619454 640414 661731 682132 701404 720852
51559 720852 742392 767448 796725 830506 868605 909860 951915 991746 1026576 1054361 1073720
51548 1073720 1083813 1084448 1075991 1058929 1033786 1001730 964892 925505 884771 843086 801317 761210
51536 761210 724383 691497 662637 637846 616778 598333 581313 565344 550746 537722 526194
51525 526194 516227 507938 500954 494464 488020 481863 476322 471280 466472 461911 457728 453840 450142 446822
51511 446822 444158 442063 440168 438256 436291 434095 431464 428664 426373 424917 423936 423084 422608 422817 423372
51496 423372 423785 424454 426414 429925 433986 437467 440118 442167 443611 444494 445277 446233 446791 446211 444614 442637
51480 442637 440274 437011 432996 429038 425232 420637 414807 408717 403472 398815 393788 388387 383509 379511
51466 379511 375827 372138 369008 367030 366040 365532 365359 365483 365441 364595 362839 360685 358763 357536 357440 358878
51450 358878 361861 365777 369683 372948 375808 379428 385189 393639 404236 416330 430136 446118 463364
51437 463364 479240 491192 498607 502582 504326 504489 503748 502953 502250 500672 497141 491547 484481 476309 467121
51422 467121 457381 447984 439548 432082 425428 419669 414948 411156 408008 405322 403143 401725 401367 402073 403358
51407 403358 404554 405391 406167 407377 409289 411883 414993 418487 422398 426894 431972 437256 442266 446924 451688
51392 451688 457171 463724 471281 479492 488081 497196 507326 518839 531850 546768 564686 586797 613564
51379 613564 644758 680215 720116 764613 813706 867373 925069 984676 1042355 1093915 1136436
51368 1136436 1168699 1190523 1201966 1202851 1192762 1171582 1140248 1100775 1055393 1005734 952971 898510
51356 898510 844324 792569 744876 701837 663109 628137 596800 569324 545712 525652 508837
51345 508837 495014 483593 473661 464553 456186 448682 441944 435752 429988 424637 419818 415898 413206 411488
51331 411488 409934 407936 405504 402823 399812 396366 392671 388966 385320 381914 379215 377518 376529 375715 374834
51316 374834 373862 372710 371416 370346 369842 369829 370101 370711 371692 372631 373010 372824 372442 372058 371729 371863 373027 375146
51298 375146 377349 378780 379288 379267 379181 379398 380175 381520 383121 384555 385556 386117 386437 386729 386983 386969 386586 386121
51280 386121 386113 387066 389273 392585 396118 398530 398973 397721 395697 393649 392019 391233 391529 392611 393933 395273
51264 395273 396656 397916 398891 399964 401723 403988 405724 406191 405703 405035 404474 403754 402572 400880 398893 397037
51248 397037 395629 394431 392830 390645 388447 386816 385586 384241 382794 381784 381467 381485 381426 381378 381719 382521
51232 382521 383327 383474 382628 381105 379733 379247 379662 380225 380054 378892 377298 376119 375820 376234 376880 377404 377743
51215 377743 377959 378085 378147 378268 378648 379427 380590 382056 383826 385922 388191 390332 392219 394084 396246 398764
51199 398764 401518 404491 407701 410932 413820 416154 417832 418656 418610 418280 418447 419138 419610 419363 418587 417406
51183 417406 415480 412869 410612 409612 409418 408871 407658 406342 405150 403740 402235 401420 401569 401822 401192 399639
51167 399639 397871 396607 396328 397176 398653 399910 400772 402070 404554 407875 411190 414354 417816 421469 424323
51152 424323 425529 425265 424367 423345 422016 420066 417696 415531 413823 412008 409361 406028 403016 401087 400104
51137 400104 399607 399538 400016 400726 401055 400773 400206 399805 399834 400408 401467 402644 403407 403448 402901 402226 401938 402322 403247
51118 403247 404351 405496 406864 408594 410593 412843 415499 418351 420604 421732 422312 423420 425284 427176
51104 427176 428652 430164 432223 434613 436950 439475 442686 446410 449917 452898 455771 458836 461614 463274
51090 463274 463479 462536 461014 459460 458384 458057 458239 458272 457634 456364 454881 453483 452148 450760 449406 448390
51074 448390 448016 448459 449813 452119 455206 458577 461683 464438 467264 470513 474007 477476 481378 486852 494715
51059 494715 504800 516404 528940 541772 553759 563608 570874 576378 581647 588176 596995 608295 621180
51046 621180 634204 646540 658541 670907 683452 694888 703679 708906 710499 709056 705600 701222 696601
51033 696601 691621 685356 676584 664600 649778 633370 616701 600601 585513 571886 560211 550766
51021 550766 543506 538236 534830 533287 533625 535677 538958 542848 547017 551579 556743 562348 567913 573150
51007 573150 578357 584232 591304 599548 608550 618024 628081 638902 650329 661986 673762 685850 698228
50994 698228 710459 722212 733647 744914 755542 764872 773051 781020 789294 797252 803939 809267 814058
50981 814058 819298 825838 834500 845582 858062 869981 880124 888997 897891 907453 917765 929412 943658
50968 943658 961423 982699 1007198 1035169 1067336 1104268 1145968 1191803 1240857 1292662 1347554
50957 1347554 1405839 1466527 1527508 1587222 1645536 1702598 1757500 1808694 1855266 1897121 1934329
50946 1934329 1967093 1996178 2022573 2046828 2069452 2091804 2115516 2140700 2165469 2187603 2206185
50935 2206185 2221420 2233601 2242734 2248695 2251186 2249781 2244271 2234651 2220484 2200705 2174447 2141718
50923 2141718 2102946 2058159 2007075 1949832 1887292 1820833 1752125 1682890 1614540 1548099 1484482
50912 1484482 1424522 1368549 1316375 1267974 1223811 1184223 1148982 1117802 1090704 1067244 1045866
50901 1045866 1024891 1004021 984267 966543 951011 937605 926315 916720 907980 899577 891664 884468
50889 884468 877876 871883 866963 863650 861966 861458 861544 861722 861811 862241 863816 866920 871157 875954 881242 887308
50873 887308 894209 901678 909608 918303 928206 939434 951659 964499 978085 993128 1010244 1029350
50861 1029350 1050002 1072268 1096872 1124469 1155271 1189572 1228137 1271691 1320371 1374128 1433474
50850 1433474 1499306 1572134 1651939 1738802 1833117 1934969 2043711 2158504 2279034 2405332
50840 2405332 2536895 2672153 2808753 2944127 3075751 3201086 3317578 3422968 3515749 3595332
50830 3595332 3661679 3714789 3754832 3782961 3801791 3814736 3824828 3834417 3845810 3861540 3883602
50819 3883602 3912722 3948617 3990488 4036520 4082992 4124625 4156235 4173917 4174799 4156457 4117136 4056337
50807 4056337 3974754 3873729 3755013 3620872 3474083 3317813 3155630 2991474 2829251 2672314
50797 2672314 2523215 2383683 2254670 2136626 2029930 1934926 1851437 1778571 1715319 1661087
50787 1661087 1615371 1577227 1545513 1519458 1498473 1481474 1466996 1454016 1442248 1431479 1421098
50776 1421098 1410498 1399627 1388817 1378192 1367384 1355742 1342733 1328241 1312545 1295942 1278506
50765 1278506 1260349 1241964 1223962 1206525 1189342 1172067 1154561 1136868 1119387 1102994 1088528
50754 1088528 1076079 1065261 1056197 1049632 1045888 1044329 1044262 1045905 1050031 1056982 1066534 1078478 1092879
50741 1092879 1109933 1129944 1153365 1180552 1211686 1247177 1287793 1333944 1385062 1440240 1499237
50730 1499237 1562195 1628466 1696545 1765352 1834891 1905313 1975941 2045708 2114049 2180758 2245217
50719 2245217 2306374 2363293 2415045 2459971 2495705 2520316 2533280 2535366 2528081 2513613 2494921 2475258
50707 2475258 2457422 2443512 2435168 2433569 2439063 2451113 2468813 2491280 2517373 2545184 2572054 2595136
50695 2595136 2611807 2619570 2615802 2597918 2564156 2514460 2450736 2376094 2293746 2206496 2116996 2028014
50683 2028014 1942071 1860921 1785609 1716942 1655634 1602025 1556007 1517483 1486706 1463941 1448837
50672 1448837 1440418 1437805 1440752 1449289 1462899 1480265 1499847 1520446 1541155 1561157 1579903 1597297
50660 1597297 1613343 1627808 1640765 1653282 1666850 1681843 1697170 1711796 1726055 1740993 1756968
50649 1756968 1773683 1791302 1810702 1832656 1857487 1885594 1917580 1953585 1993122 2035877 2082190
50638 2082190 2132398 2186065 2242246 2300085 2358653 2416481 2471867 2523762 2572111 2617367 2660099
50627 2660099 2701137 2741592 2781904 2820254 2851844 2870404 2871296 2853914 2821445 2778697 2730205 2679684
50615 2679684 2630097 2583649 2542044 2507013 2480228 2462400 2452779 2449788 2451797 2456904 2462476 2465653
50603 2465653 2464352 2457296 2443082 2419840 2386169 2342135 2289089 2228655 2162107 2090692 2016248 1941237
50591 1941237 1867969 1797794 1731049 1667751 1608204 1553010 1502783 1457915 1418450 1384046 1354234
50580 1354234 1328757 1307415 1289555 1274093 1260251 1247934 1237197 1227707 1219169 1211891 1206426 1202860
50568 1202860 1200996 1201068 1203558 1208248 1214088 1220360 1227581 1237016 1249597 1265486 1284267 1305293 1328072
50555 1328072 1352629 1379296 1408052 1438375 1469879 1502600 1536187 1569230 1600079 1628297 1654721
50544 1654721 1680125 1704505 1727938 1751524 1776953 1805438 1837555 1873902 1915356 1962634 2016011
50533 2016011 2075605 2141574 2214008 2292991 2378958 2472630 2574364 2683836 2800567 2924351
50523 2924351 3054674 3189927 3327751 3466028 3603013 3736510 3863589 3981389 4087743
50514 4087743 4180735 4258102 4317437 4356753 4374562 4369835 4342537 4294151 4227213 4144285 4047706
50503 4047706 3940341 3826121 3709582 3595092 3486639 3388044 3302871 3233808 3182177 3148174
50493 3148174 3131634 3132392 3149678 3181247 3223292 3271019 3318923 3360730 3390021 3401713 3392866 3362051
50481 3362051 3308690 3233702 3140320 3033186 2916364 2792715 2664990 2536502 2410298 2288282
50471 2288282 2171667 2061781 1959888 1866532 1781616 1705013 1636640 1576004 1522161 1474182 1431430
50460 1431430 1393466 1360029 1331210 1307313 1288349 1273789 1262841 1254832 1249311 1246074 1245241 1247185
50448 1247185 1252105 1259675 1269233 1280387 1293311 1308351 1325345 1343400 1361270 1377796 1392052 1403374
50436 1403374 1411603 1417233 1421085 1423733 1425444 1426607 1427922 1429959 1432706 1435781 1439045 1442923 1448180 1455521
50422 1455521 1465352 1477735 1492576 1509948 1530252 1554044 1581761 1613687 1650113 1691346 1737519
50411 1737519 1788497 1844009 1903779 1967420 2034198 2103019 2172669 2242008 2309872 2374893 2435670
50400 2435670 2491208 2541063 2584867 2621773 2650460 2669517 2677593 2673292 2655435 2623754 2579248 2523658
50388 2523658 2458769 2386391 2308873 2229206 2150413 2074921 2004617 1941336 1887009 1843122 1810146
50377 1810146 1787700 1775317 1772797 1779610 1794128 1813752 1835736 1857571 1876575 1889668 1894061 1888171
50365 1888171 1871725 1845172 1809364 1765738 1716370 1663452 1608663 1553041 1497438 1442951 1390793
50354 1390793 1341590 1294946 1249951 1206270 1164570 1125807 1090396 1058269 1029400 1003787 981035
50343 981035 960504 942053 926267 913697 904195 897236 892693 890935 892244 896379 902710 910547 919333
50330 919333 928762 938843 949830 962060 975891 991718 1009869 1030270 1052127 1073859 1093423 1108970
50318 1108970 1119467 1124909 1125991 1123682 1119040 1113148 1106834 1100445 1094027 1087750 1081947 1076745 1071954 1067470
50304 1067470 1063575 1060692 1059024 1058681 1059859 1062475 1065706 1068483 1070696 1073507 1078166 1084840 1092949 1102303
50290 1102303 1113269 1125847 1139339 1153208 1167925 1184748 1205183 1230803 1262604 1299186 1335460
50279 1335460 1364251 1380234 1382609 1374233 1358728 1338674 1315801 1291787 1268408 1247132 1228776 1213477
50267 1213477 1200904 1190462 1181355 1172711 1164080 1155893 1149055 1143766 1139047 1133800 1128057 1122709 1118231
50254 1118231 1114316 1110690 1107510 1104764 1101963 1098901 1096218 1094705 1094407 1094918 1096330 1099274 1104144 1110771
50240 1110771 1118908 1128575 1139885 1152926 1167893 1184955 1203814 1223696 1243840 1263766 1283041 1301102
50228 1301102 1317490 1332002 1344550 1355143 1364175 1372400 1380387 1388055 1394766 1399553 1401209 1398608 1391316
50215 1391316 1379709 1364210 1344659 1320786 1293125 1263076 1232156 1201593 1172549 1146226 1123528
50204 1123528 1104823 1090149 1079301 1071511 1065216 1058417 1049340 1036886 1020780 1001648 980809 959695
50192 959695 939204 919624 901080 883917 868541 854964 842676 831050 819790 808935 798488
50181 798488 788270 778186 768425 759237 750578 742171 733939 726243 719674 714622 710984 708161 705358 702044
50167 702044 698225 694367 691114 689035 688368 688778 689468 689871 690289 691597 694238 697794 701701 706093 711590
50152 711590 718394 726045 734131 742758 752054 761436 769839 776597 781789 785702 788312 789471 789307 788211
50138 788211 786602 784964 783941 784056 785410 787925 791808 797433 804729 813097 822094 831902 842924 855169
50124 855169 868303 882218 897308 914327 934118 957418 984657 1015896 1050880 1089017 1129314
50113 1129314 1170614 1212094 1253457 1294619 1335460 1376013 1416590 1457445 1498503 1539552 1580278
50102 1580278 1619650 1655444 1684977 1706331 1718600 1721240 1713889 1696906 1671511 1639063 1600707 1558007
50090 1558007 1513409 1469441 1427590 1388295 1351954 1319459 1291680 1268798 1250320 1235589 1224080
50079 1224080 1215237 1208216 1201968 1195684 1189131 1182482 1175827 1168973 1161743 1154319 1147137 1140477 1134204 1127860
50065 1127860 1121003 1113503 1105543 1097238 1088301 1078232 1066914 1054871 1042850 1031247 1020061 1009324
50053 1009324 999409 990846 983875 978226 973467 969641 967462 967644 970054 973739 977940 982839 989144 997108
50039 997108 1006210 1015797 1025733 1036239 1047265 1058250 1068634 1078416 1088031 1097649 1106854 1115040 1121901
50026 1121901 1127380 1131378 1133765 1134500 1133409 1130083 1124497 1117642 1110938 1104842 1098533 1091183 1082965 1074412
50012 1074412 1065314 1055013 1043582 1032000 1021094 1010860 1001061 992044 984683 979775 977738 978722 982823
49999 982823 990315 1001833 1018159 1039600 1065583 1094903 1126224 1158253 1189702 1219470 1247002 1272346
49987 1272346 1295794 1317590 1337953 1357112 1374982 1390714 1402693 1409085 1408431 1399784 1382570 1356725
49975 1356725 1323132 1283738 1240974 1196927 1153002 1110201 1069452 1031585 997089 966027 938146
49964 938146 913074 890495 870274 852430 836892 823325 811299 800700 791880 785251 780796 778153
49952 778153 777249 778644 783024 790384 799865 810344 821003 831310 840711 848670 854997 859945 863762 866221
49938 866221 866801 865445 862916 860051 856569 850931 841574 828165 811567 792944 773361 753970 735855
49925 735855 719371 704055 689507 676093 664518 654941 646927 640166 634872 631448 629988 630162 631388
49912 631388 633113 635087 637470 640550 644330 648483 652704 657059 661922 667671 674510 682621 692446 704579
49898 704579 719155 735355 751796 767436 781894 794899 805837 814105 819566 822308 822244 819389 814307
49885 814307 807718 799652 789451 776785 762293 747080 731883 716825 701731 686549 671701 658100
49873 658100 646520 636816 628091 619808 612409 606650 602636 599846 597832 596494 595867 596072 597452 600345
49859 600345 604669 609981 616034 623060 631467 641409 652649 664711 677158 689899 703091 716589 729548
49846 729548 740895 750207 757853 764275 769364 772575 773415 771719 767676 761655 753870 744253 732892 720565
49832 720565 708457 697283 686964 677274 668409 660795 654754 650591 648584 648488 649436 650818 653059 657062
49818 657062 663116 670842 680025 690810 703050 716134 729674 743801 758426 772629 785233 795789
49806 795789 804666 812307 818664 823252 825559 825467 823427 820057 815551 809662 802336 794030 785173 775631 765023
49791 765023 753386 741187 728869 716736 705178 694656 685423 677509 670941 665690 661380 657388 653353
49778 653353 649420 645932 643057 640793 639170 638338 638481 639702 641970 645250 649662 655399 662388 670203 678427
49763 678427 686906 695449 703478 710399 716249 721632 726898 731689 735405 737821 738969 738536 735671 729604
49749 729604 720388 708939 696310 683174 670190 658572 649585 643273 638213 632939 627314 622161 617938
49736 617938 614402 611368 609125 608035 608198 609536 611772 614319 616670 618956 621678 624842 627887 630596
49722 630596 633614 637894 644070 652447 663026 675221 688058 701029 714416 728334 741712 752579
49710 752579 759271 761377 759885 756608 752977 748965 743457 735898 727195 718746 711156 704375 698574 694011
49696 694011 690244 686252 681489 676239 670805 664970 658605 652463 647961 646137 646949 649583 653362 658236
49682 658236 664379 671556 679239 687304 696172 706206 717532 730680 746748 766256 788009 809527
49670 809527 828397 842962 852284 856399 856589 854735 852150 849296 846564 844801 845098 848382 854986 863891
49656 863891 872278 876515 874120 864746 849584 830381 809022 787194 765867 745291 725746 708010
49644 708010 692913 680739 671250 664007 658542 654509 651953 651155 652033 653917 655998 657713 658615 658268 656567
49629 656567 653813 650247 645761 640341 634443 628601 622888 617127 611427 606163 601506 597313 593418 589830
49615 589830 586740 584542 583674 584068 584842 584882 583864 582520 581893 582520 584303 586858 589761 592616 595088 596976
49599 596976 598277 599117 599623 599809 599659 599337 599298 600111 602084 604907 607683 609513 610262 610673 611565 613040 614691
49582 614691 616382 618352 620633 622822 624603 626082 627387 628373 629053 630058 632242 635922 640724 646087 651763
49567 651763 658025 665655 675432 687253 699852 711715 722214 731561 739888 746819 751890 754829 755312
49554 755312 752999 748145 741848 735315 729083 723142 717612 712864 709146 706504 705100 705186 706659 708936 711498
49539 711498 714276 717291 720136 722230 723469 724315 725283 726733 729180 733289 739287 746742 755276 765260 777438
49524 777438 792094 808996 827969 848882 870868 892047 910381 924764 935287 942763 948115 951933
49512 951933 954389 955717 956845 959355 964539 972515 982182 991816 999655 1004308 1004980 1001356 993312 981000
49498 981000 965279 947682 929618 911778 894430 877949 862665 848491 835241 823266 813263
49487 813263 805394 799049 793642 789258 786214 784307 782904 781678 780886 780820 781270 781678 781683 781336 780854 780447 780378
49470 780378 780974 782380 784383 786655 789106 791875 795044 798535 802238 805971 809317 811788 813334 814514
49456 814514 815940 817566 818582 817989 815321 811024 806150 801514 797093 792357 787135 781815 776720 771750
49442 771750 766955 762938 760152 758088 755822 753385 751897 752199 753967 756509 759850 764404 769963 775835
49428 775835 781933 789026 797755 808138 820316 835003 852582 872458 894240 918949 947394 977013
49416 977013 1001812 1016660 1021226 1019085 1013806 1007016 999588 992846 988073 985885 986693 990987 998640 1008648
49402 1008648 1020267 1033957 1050553 1069756 1090074 1109984 1128659 1145760 1161174 1175060 1187649
49391 1187649 1198800 1207972 1214634 1218553 1219739 1218310 1214400 1208036 1199189 1188060 1175171 1161045 1145987
49378 1145987 1130414 1115177 1101303 1089470 1079899 1072473 1066688 1061780 1057412 1054219 1053278 1054969 1058513
49365 1058513 1062538 1065845 1067768 1068237 1067635 1066375 1064520 1061857 1058229 1053607 1048017 1041636 1034844 1027906
49351 1027906 1020701 1013095 1005516 998768 993265 988765 984938 981858 979772 978590 977824 976988 975985 975072 974395
49336 974395 973565 971829 968768 964652 960044 955243 950325 945464 940907 936775 933159 930316 928482 927565 927227
49321 927227 927225 927491 928082 929236 931253 934085 937297 940703 944677 949425 954322 958552 962136 965727 969576
49306 969576 973495 977764 983211 990137 997836 1005467 1012836 1020089 1027247 1034512 1042602 1052350 1064161 1077962
49292 1077962 1093319 1109417 1125433 1141217 1157212 1173346 1188345 1200335 1207817 1209971 1206711 1198954
49280 1198954 1188371 1176363 1163598 1150884 1139799 1131693 1126409 1122819 1120445 1119729 1120750 1122582 1124159
49267 1124159 1125097 1125345 1124664 1122986 1120885 1119164 1118029 1116997 1115590 1113899 1112625 1112837 1115731 1122330 1133138
49252 1133138 1148007 1166361 1187658 1211595 1237534 1263552 1286223 1301897 1308571 1306533 1297363 1282647
49240 1282647 1263766 1242393 1220384 1198869 1177814 1156830 1136384 1117914 1102846 1091781 1084660
49229 1084660 1081194 1080769 1082255 1084504 1087107 1090326 1094326 1098881 1103904 1109684 1116310 1123223 1129757 1135942
49215 1135942 1142382 1149482 1157127 1165036 1173093 1181221 1189206 1196780 1203842 1210692 1218172 1227462 1239428 1253980
49201 1253980 1270172 1286982 1303993 1321358 1339237 1357362 1375112 1391948 1407615 1422019 1435150
49190 1435150 1447267 1458807 1469761 1479322 1486750 1492560 1498283 1504886 1512044 1519232 1526928 1536240 1547846
49177 1547846 1561907 1578683 1598547 1621644 1648280 1679557 1716880 1760684 1810127 1863773 1919544
49166 1919544 1973575 2020207 2054329 2074073 2081167 2079058 2071105 2060172 2048803 2039024 2031832 2027181
49154 2027181 2024622 2023973 2025283 2028208 2031757 2034896 2037303 2039309 2041313 2043614 2046748 2051469 2058232 2066970
49140 2066970 2077440 2089438 2102583 2116343 2130521 2145418 2161288 2177903 2194872 2212052 2229417
49129 2229417 2246889 2264657 2283345 2303406 2324464 2345626 2366323 2386536 2406465 2426410 2446881
49118 2446881 2468384 2491069 2514924 2540124 2566820 2594808 2624084 2655832 2692220 2735126 2785769
49107 2785769 2846070 2919605 3009760 3115839 3230763 3343669 3447029 3543109 3642816 3755075
49097 3755075 3874645 3980603 4049171 4070244 4052662 4014402 3968060 3914399 3847043 3761372 3659365
49086 3659365 3548040 3434932 3325225 3222030 3127758 3044288 2972155 2910513 2858200 2814441
49076 2814441 2778453 2748994 2724700 2704470 2687200 2671584 2656698 2642543 2629520 2617517 2606008
49065 2606008 2594885 2584536 2575012 2565688 2556082 2546643 2538357 2531727 2526410 2521770 2517538 2513915 2511215
49052 2511215 2509479 2508377 2507445 2506413 2505380 2504720 2504768 2505439 2506110 2506101 2505492 2505376 2507092 2511264 2517714 2526138 2536511
49035 2536511 2548799 2562589 2576990 2590684 2602144 2610316 2615322 2618214 2619812 2620002 2618288 2614664 2609570
49022 2609570 2603259 2595702 2587135 2578327 2570170 2563222 2557713 2553767 2551398 2550352 2550180 2550608 2551807 2554237
49008 2554237 2558165 2563383 2569410 2575811 2582220 2588259 2593777 2599086 2604599 2610124 2614871 2618276 2620527 2622073
48994 2622073 2622962 2622915 2621763 2619456 2615880 2611078 2605531 2599810 2593985 2587755 2581128 2574620 2568757 2563707 2559463
48979 2559463 2556025 2553324 2551243 2549850 2549303 2549460 2549875 2550316 2551044 2552411 2554440 2556963 2559860 2562938 2565839
48964 2565839 2568418 2571118 2574659 2579344 2584819 2590465 2595917 2601330 2607317 2614520 2623054 2632391 2641976 2651895
48950 2651895 2662837 2675567 2690592 2708214 2728536 2751318 2776038 2802130 2829088 2856460 2884000
48939 2884000 2911883 2940570 2970496 3002077 3035891 3072443 3111606 3152732 3195627 3241098 3290169
48928 3290169 3342885 3398231 3455165 3513347 3572890 3633821 3696001 3759272 3823510 3888673 3954885
48917 3954885 4022136 4089632 4155661 4218555 4277796 4333953 4387579 4438557 4486591 4531864 4574823
$$ [...]
##END NTUPLES=NMR SPECTRUM
##END=
