
##TITLE=AC1303_PERAH12115_6641754_p1tBAZZZUx
##JCAMPDX= 6.0         $$ Bruker NMR JCAMP-DX V2.0
##DATA TYPE= NMR SPECTRUM
##DATA CLASS= NTUPLES
##ORIGIN= BRUKER
##OWNER= Administrator
$$ 1.72 TOPSPIN		Version 2.1
$$ 2012-08-13 15:54:44.593 -0500  Administrator@TOPSPIN
$$ Compression mode = diff/dup
##.OBSERVE FREQUENCY= 400.02188249412
##.OBSERVE NUCLEUS= ^1H
##.ACQUISITION MODE= SIMULTANEOUS (DQD)
##.ACQUISITION SCHEME= undefined
##.AVERAGES= 64
##.DIGITISER RES= 22
##SPECTROMETER/DATA SYSTEM= spect
##.PULSE SEQUENCE= noesygpps1d.comp
##.SOLVENT NAME= COFFEE_meoh
##.SHIFT REFERENCE= INTERNAL, COFFEE_meoh, 1, 14.96062
##AUDIT TRAIL= $$ (NUMBER, WHEN, WHO, WHERE, PROCESS, VERSION, WHAT)
$$ ##TITLE= Audit trail, TOPSPIN		Version 2.1
$$ ##JCAMPDX= 5.01
$$ ##ORIGIN= Bruker BioSpin GmbH
$$ ##OWNER= Administrator
$$ $$ C:\Bruker\TOPSPIN/data/COFFEE/nmr/AC1303_PERAH12115_6641754_p1tBAZZZUx/52/pdata/1/auditp.txt
$$ ##AUDIT TRAIL=  $$ (NUMBER, WHEN, WHO, WHERE, PROCESS, VERSION, WHAT)
(   1,<2012-08-13 15:54:37.593 -0500>,<Administrator>,<TOPSPIN>,<go>,<TOPSPIN 2.1>,
      <created by zg
	started at 2012-08-13 15:43:06.937 -0500,
	POWCHK enabled, PULCHK disabled,
       configuration hash MD5:
       6B 1B 68 BB D9 2E 58 E2 7F 35 AD 54 07 DF 0E 41
       data hash MD5: 64K
       47 96 50 4F FC D2 E1 F1 70 A0 72 57 E1 D7 0A 7C>)
(   2,<2012-08-13 15:54:42.109 -0500>,<Administrator>,<TOPSPIN>,<proc1d>,<TOPSPIN 2.1>,
      <Start of raw data processing
       efp LB = 0.3 FT_mod = 6 PKNL = 1 PHC0 = 0 PHC1 = 0 SI = 128K 
       data hash MD5: 128K
       32 18 98 D5 50 1E F5 E9 FE 27 EB 48 36 97 95 6D>)
(   3,<2012-08-13 15:54:43.640 -0500>,<Administrator>,<TOPSPIN>,<proc1d>,<TOPSPIN 2.1>,
      <pk PHC0 = -2.460938 PHC1 = 0 
       data hash MD5: 128K
       CE BA 48 BD B7 0D 67 FA 8A 5F 5D DD E6 0A 58 20>)
(   4,<2012-08-13 15:54:44.125 -0500>,<Administrator>,<TOPSPIN>,<proc1d>,<TOPSPIN 2.1>,
      <abs ABSG = 1 
       data hash MD5: 128K
       CB DC 51 25 0A B0 16 BA 1D E0 BA E1 5A 10 6A E3>)
(   5,<2012-08-13 15:54:44.218 -0500>,<Administrator>,<TOPSPIN>,<proc1d>,<TOPSPIN 2.1>,
      <abs ABSG = 2 
       data hash MD5: 128K
       D6 44 0D EE 85 44 8D 37 68 1F C3 17 7A 06 86 83>)
(   6,<2012-08-13 15:54:44.281 -0500>,<Administrator>,<TOPSPIN>,<proc1d>,<TOPSPIN 2.1>,
      <abs ABSG = 3 
       data hash MD5: 128K
       6F EB B5 7D 90 EB 5D 34 36 48 09 C6 11 8C 2D 7F>)
(   7,<2012-08-13 15:54:44.343 -0500>,<Administrator>,<TOPSPIN>,<proc1d>,<TOPSPIN 2.1>,
      <abs ABSG = 4 
       data hash MD5: 128K
       34 07 F9 F6 FE 31 A9 8A 3F 0C 42 CC 16 90 39 F2>)
(   8,<2012-08-13 15:54:44.406 -0500>,<Administrator>,<TOPSPIN>,<proc1d>,<TOPSPIN 2.1>,
      <abs ABSG = 5 
       data hash MD5: 128K
       43 51 55 0A E1 01 D6 D1 7B 96 F4 98 60 90 FF 10>)
$$ ##END=
$$ 
$$ $$ hash MD5
$$ $$ 5C C0 2A B8 7D B1 54 AE 31 E3 18 37 EA F8 D1 53
##$RELAX= 
##$RELAX= 
##$RELAX= 
##$RELAX= 
##$RELAX= 
##$RELAX= 
##$RELAX= 
##$RELAX= 
$$ Bruker specific parameters
$$ [...]
##$TP07= 0
##$TPNAME0= <>
##$TPNAME1= <>
##$TPNAME2= <>
##$TPNAME3= <>
##$TPNAME4= <>
##$TPNAME5= <>
##$TPNAME6= <>
##$TPNAME7= <>
##$TPOAL= (0..7)
0.5 0.5 0.5 0.5 0.5 0.5 0.5 0.5
##$TPOFFS= (0..7)
0 0 0 0 0 0 0 0
##$TUNHIN= 0
##$TUNHOUT= 0
##$TUNXOUT= 0
##$USERA1= <user>
##$USERA2= <user>
##$USERA3= <user>
##$USERA4= <user>
##$USERA5= <user>
##$V9= 5
##$VALIST= <valist>
##$VCLIST= <CCCCCCCCCCCCCCC>
##$VD= 0
##$VDLIST= <DDDDDDDDDDDDDDD>
##$VPLIST= <PPPPPPPPPPPPPPP>
##$VTLIST= <TTTTTTTTTTTTTTT>
##$WBST= 1024
##$WBSW= 4
##$XGAIN= (0..3)
0 0 0 0
##$XL= 0
##$YL= 0
##$YMAX_a= 11333913
##$YMIN_a= -9254747
##$ZGOPTNS= <>
##$ZL1= 120
##$ZL2= 120
##$ZL3= 120
##$ZL4= 120
##$ABSF1= 14.96062
##$ABSF2= -5.597562
##$ABSG= 5
##$ABSL= 3
##$ALPHA= 0
##$AQORDER= 0
##$ASSFAC= 0
##$ASSFACI= 0
##$ASSFACX= 0
##$ASSWID= 0
##$AUNMP= <proc_prof1d_extract.lims>
##$AXLEFT= 0
##$AXNAME= <>
##$AXNUC= <1H>
##$AXRIGHT= 0
##$AXTYPE= 0
##$AXUNIT= <>
##$AZFE= 0.1
##$AZFW= 0.1
##$BCFW= 0
##$BC_mod= 0
##$BYTORDP= 0
##$COROFFS= 0
##$CY= 15
##$DATMOD= 1
##$DC= 0
##$DFILT= <>
##$DTYPP= 0
##$F1P= 0
##$F2P= 0
##$FCOR= 0.5
##$FTSIZE= 131072
##$FT_mod= 6
##$GAMMA= 0
##$GB= 0
##$INTBC= 1
##$INTSCL= 1
##$ISEN= 128
##$LB= 0.3
##$LEV0= 0
##$LPBIN= 0
##$MAXI= 10000
##$MC2= 0
##$MEAN= 0
##$ME_mod= 0
##$MI= 0
##$NCOEF= 0
##$NC_proc= -2
##$NLEV= 6
##$NOISF1= 0
##$NOISF2= 0
##$NSP= 0
##$NTH_PI= 0
##$NZP= 0
##$OFFSET= 14.96062
##$PC= 1
##$PHC0= -2.460938
##$PHC1= 0
##$PH_mod= 1
##$PKNL= yes
##$PPARMOD= 0
##$PPDIAG= 0
##$PPIPTYP= 0
##$PPMPNUM= 2147483647
##$PPRESOL= 1
##$PSCAL= 4
##$PSIGN= 0
##$PYNMP= <proc.py>
##$REVERSE= no
##$SF= 400.020009789667
##$SI= 131072
##$SIGF1= 0
##$SIGF2= 0
##$SINO= 400
##$SIOLD= 131072
##$SPECTYP= <>
##$SREGLST= <1H.CDCl3>
##$SSB= 0
##$STSI= 131072
##$STSR= 0
##$SW_p= 8223.68421052631
##$SYMM= 0
##$S_DEV= 0
##$TDeff= 65536
##$TDoff= 0
##$TI= <>
##$TILT= no
##$TM1= 0
##$TM2= 0
##$TOPLEV= 0
##$USERP1= <user>
##$USERP2= <user>
##$USERP3= <user>
##$USERP4= <user>
##$USERP5= <user>
##$WDW= 1
##$XDIM= 131072
##$YMAX_p= 315801734
##$YMIN_p= -11999
##$CURPLOT= <Network HP LaserJet P1505>
##$CURPRIN= <$Network HP LaserJet P1505>
##$DFORMAT= <normdp>
##$LAYOUT= <+/1D_H.xwp>
##$LFORMAT= <normlp>
##$PFORMAT= <normpl>
##$SURQMSG= 1
$$ End of Bruker specific parameters
$$ ---------------------------------
##NTUPLES= NMR SPECTRUM
##VAR_NAME=  FREQUENCY,     SPECTRUM/REAL,   SPECTRUM/IMAG
##SYMBOL=    X,             R,               I
##VAR_TYPE=  INDEPENDENT,   DEPENDENT,       DEPENDENT
##VAR_FORM=  AFFN,          ASDF,            ASDF
##VAR_DIM=   131072,        131072,          131072
##UNITS=     HZ,            ARBITRARY UNITS, ARBITRARY UNITS
##FACTOR=    0.0627417313425164, 1,          1
##FIRST=     8223.62146879497, 2340,         -64612
##LAST=      0,             4675,            -65381
##MIN=       0,             -11999,          0
##MAX=       8223.62146879497, 315801734,    0
$$ Real data points
##PAGE= N=1
##DATA TABLE= (X++(R..R)), XYDATA
$$ [...]
$$ plain form
63950 792893 838268 889137 946373 1011841 1086974 1172220 1267983 1375237 1494817 1626622 1769824
63939 1769824 1923407 2086192 2256767 2433711 2615521 2799958 2983676 3162740 3333297
63930 3333297 3491694 3634565 3759246 3863813 3946371 4004702 4037036 4042826 4022292 3975674 3903696
63919 3903696 3808572 3693741 3562504 3417446 3261112 3096427 2926202 2752909 2579316 2408752
63909 2408752 2244162 2087193 1938604 1799239 1670085 1551603 1443619 1345876 1258191 1179974
63899 1179974 1110122 1047711 992477 944331 902565 865891 833188 803887 777636 754026 732791
63888 732791 713961 697483 682908 669781 658232 648768 641487 635912 631635 628786 627706 628538 631321
63875 631321 636116 642786 650946 660429 671559 684643 699483 715696 733229 752131 772026 792361
$$ packed form
63950G92893M5375N0869N7236O5468P5133Q5246R5763J07254J19580J31805J43202
63939A769824J53583J62785J70575J76944J81810J84437J83718J79064J70557
63930C333297J58397J42871J24681J04567Q2558N8331L2334N790k0534m6618p1978
63919C903696r5124j14831j31237j45058j56334j64685j70225j73293j73593j70564
63909B408752j64590j56969j48589j39365j29154j18482j07984r7743q7685p8217
63899A179974o9852o2411n5234m8146m1766l6674l2703k9301k6251k3610k1235
63888G32791j8830j6478j4575j3127j1549r464p281n575m277k849j080Q32K783
63875F31321M795O670Q160R483J1130J3084J4840J6213J7533J8902J9895K0335
$$ plain form
63863 792361 813159 835085 858706 883912 909925 935558 959581 981283 1000626 1017581 1031476
63852 1031476 1041505 1047734 1051034 1052012 1050497 1046081 1038522 1027470 1012419 993283 970743 945843 919481
63839 919481 892247 864296 835297 805030 774084 743424 713191 682692 651812 621645 593250
63828 593250 566492 540754 516197 493505 472751 453313 434773 417248 400867 385524 371152
63817 371152 357781 345344 333790 323300 314061 305953 298824 292840 288073 283963 279712 275144 270686
63804 270686 266680 263245 260593 258766 257076 254606 251449 248738 247160 246071 244396 241775 238461 234681
63790 234681 230737 227316 224999 223486 221904 219905 218069 217155 217251 217785 218063 217704 216724 215396 214032 212841
63774 212841 211918 211252 210641 209701 208150 206147 204210 202727 201599 200483 199336 198547 198429 198780 199136 199328
$$ packed form
63863G92361K0798K1926K3621K5206K6013K5633K4023K1702J9343J6955J3895
63852A031476J0029O229L300R78j515m416p559j1052j5051j9136k2540k4900k6362
63839I19481k7234k7951k8999l0267l0946l0660l0233l0499l0880l0167k8395
63828E93250k6758k5738k4557k2692k0754j9438j8540j7525j6381j5343j4372
63817C71152j3371j2437j1554j0490r239q108p129n984m767m110m251m568m458
63804B70686m006l435k652j827j690k470l157k711j578j089j675k621l314l780
63790B34681l944l421k317j513j582j999j836r14R6N34K78l59r80j328j364j191
63774B12841r23o66o11r40j551k003j937j483j128j116j147p89j18L51L56J92
$$ plain form
63758 199328 199488 199596 199428 199083 199172 200197 201995 204043 206002 207745 209138 210218 211356 212800 214196 215002
63742 215002 215232 215307 215363 215295 215419 216388 218272 220333 221955 223261 224586 225916 227262 229102 231889 235458
63726 235458 239372 243526 247900 252004 255279 257974 261043 265028 269540 273917 277902 281416 284130 285680
63712 285680 286136 285934 285461 284946 284569 284331 283811 282462 280302 278055 276425 275409 274581 273874 273729 274456 275766
63695 275766 277046 277856 278083 277949 278074 279264 281896 285551 289410 292863 295596 297387 298274 298784 299544 300638
63679 300638 301692 302636 303938 305938 308288 310315 311714 312664 313401 313903 314001 313700 313291 313125 313301 313685 314257
63662 314257 315117 316020 316288 315530 314167 312782 311201 308821 305645 302260 298820 294886 290529 286730 284228
63647 284228 282581 280943 279227 277874 276892 275859 274713 273838 273411 273218 273211 273764 275244 277632 280638 284001
$$ packed form
63758A99328J60J08j68l45Q9J025J798K048J959J743J393J080J138J444J396Q06
63742B15002K30P5N6o8J24R69J884K061J622J306J325J330J346J840K787L569
63726B35458L914M154M374M104L275K695L069L985M512M377L985L514K714J550
63712B85680M56k02m73n15l77k38n20j349k160k247j630j016q28p07j45P27J310
63695B75766J280Q10K27j34J25J190K632L655L859L453K733J791Q87N10P60J094
63679C00638J054R44J302K000K350K027J399R50P37N02R8l01m09j66J76L84N72
63662C14257Q60R03K68p58j363j385j581k380l176l385l440l934m357l799k502
63647B84228j647j638j716j353r82j033j146q75m27j93pN53J480K388L006L363
$$ plain form
63631 284001 287614 291533 295808 300247 304545 308873 314043 320690 328456 336409 344156 352079 360570 369622
63617 369622 379320 390217 402866 417310 433302 450741 469486 488948 508393 527845 548403 571282
63605 571282 596591 623220 649872 675841 700606 723147 742193 757112 768148 775818 780603 783214
63593 783214 784521 784867 783863 781145 776862 771071 763209 752656 739512 724291 707255 688661 669335
63580 669335 650256 631663 613199 594889 577282 560671 544867 529905 516333 504571 494496
63569 494496 485925 479088 474411 472096 471987 473479 475594 477718 480363 484713 491266 499403 508358 517972
63555 517972 528275 539070 550394 562815 576806 592311 609415 628901 651485 676912 704548
63544 704548 734483 767047 801130 833773 861838 883802 899917 911211 918687 923124 925110 925093 923442
$$ packed form
63631B84001L613L919M275M439M298M328N170O647P766P953P747P923Q491R052
63617C69622R698J0897J2649J4444J5992J7439J8745J9462J9445J9452K0558K2879
63605E71282K5309K6629K6652K5969K4765K2541J9046J4919J1036P670M785K611
63593G83214J307L46j004k718m283n791p862j0553j3144j5221j7036j8594j9326
63580F69335j9079j8593j8464j8310j7607j6611j5804j4962j3572j1762j0075
63569D94496q571o837m677k315j09J492K115K124K645M350O553Q137Q955R614
63555E17972J0303J0795J1324J2421J3991J5505J7104J9486K2584K5427K7636
63544G04548K9935L2564L4083L2643K8065K1964J6115J1294P476M437J986j7j651
$$ plain form
63531 923442 920485 916507 911664 905701 897750 886810 872702 856273 838281 818298 795248 768986
63519 768986 740789 712215 683901 655669 627412 599539 572749 547607 524329 502835 483068
63508 483068 465152 449078 434325 420207 406747 394813 385099 377210 370145 363533 357914 353725 350433
63495 350433 347062 343394 340244 338406 337618 336793 335143 332790 330362 328341 326880 325945 325397 325165 325496 326853
63479 326853 329292 332217 335072 338088 341889 346349 350348 352812 353660 353584 353225 352821 352327 351553 350288 348598
63463 348598 346891 345435 343883 341568 338347 334939 332297 330746 329830 328941 327963 327238 326986 327041 327371 328683
63447 328683 332030 337642 344473 351239 357693 364528 372280 380902 390407 401254 413763 427742 443221
63434 443221 461218 482925 508046 534495 560020 583699 605615 625567 642801 656948 668665
$$ packed form
63531I23442k957l978m843n963p951j0940j4108j6429j7992j9983k3050k6262
63519G68986k8197k8574k8314k8232k8257k7873k6790k5142k3278k1494j9767
63508D83068j7916j6074j4753j4118j3460j1934r714p889p065o612n619m189l292
63495C50433l371l668l150j838p88q25j650k353k428k021j461r35n48k32L31J357
63479C26853K439K925K855L016L801M460L999K464Q48p6l59m04m94p74j265j690
63463C48598j707j456j552k315l221l408k642j551r16q89r78p25k52N5L30J312
63447C28683L347N612O831O766O454O835P752Q622R505J0847J2509J3979J5479
63434D43221J7997K1707K5121K6449K5525K3679K1916J9952J7234J4147J1717
$$ plain form
63423 668665 679162 689343 699605 710232 721714 734702 749822 767590 788365 812219 838644
63412 838644 866370 893641 918888 941209 960198 975532 986968 994670 999283 1001620 1002379 1001986 1000319
63399 1000319 996551 989726 979752 967508 953687 937761 918496 895412 869408 841991 814174 786139
63387 786139 757701 728933 700439 673037 647217 623072 600837 581171 564484 550159 536945
63376 536945 524280 512864 503858 497850 494743 494193 495792 499081 503757 509875 517624 526983 537812 550118
63362 550118 564033 579628 597025 616582 638627 662971 689010 716406 745361 776027 807804
63351 807804 839384 869376 896718 920694 940904 957299 970074 979368 985173 987629 987264 984758 980477
63338 980477 974427 966604 957115 945735 931633 913964 892781 869105 844033 818026 791157 763697
$$ packed form
63423F68665J0497J0181J0262J0627J1482J2988J5120J7768K0775K3854K6425
63412H38644K7726K7271K5247K2321J8989J5334J1436P702M613K337P59l93j667
63399A000319l768o825r974j2244j3821j5926j9265k3084k6004k7417k7817k8035
63387G86139k8438k8768k8494k7402k5820k4145k2235j9666j6687j4325j3214
63376E36945j2665j1416r006o008l107n50J599L289M676O118P749R359J0829J2306
63362E50118J3915J5595J7397J9557K2045K4344K6039K7396K8955L0666L1777
63351H07804L1580K9992K7342K3976K0210J6395J2775R294N805K456l65k506m281
63338I80477o050p823r489j1380j4102j7669k1183k3676k5072k6007k6869k7460
$$ plain form
63326 763697 736205 709264 683488 659611 638215 619390 603027 589385 578932 571401 565263 558382
63314 558382 549157 537077 522660 507092 491625 476821 462329 447655 433112 419705 408101 398011
63302 398011 388722 379966 372025 365130 359079 353511 348314 343578 339240 335057 331030 327634 325331 323924
63288 323924 322605 320724 318283 315690 313362 311649 310753 310372 309679 308123 306167 304823 304453 304446 304090 303338
63272 303338 302533 301860 301383 301338 301968 303132 304399 305513 306586 307844 309316 310809 312102 313173 314273 315722
63256 315722 317615 319865 322502 325655 329184 332634 335823 339179 343171 347647 352115 356596 361735 368055
63242 368055 375489 383780 392960 403207 414417 426203 438258 450623 463647 477711 492836 508521
63230 508521 524139 539571 555359 572128 589990 608545 627273 645804 664047 682339 701365
$$ packed form
63326G63697k7492k6941k5776k3877k1396j8825j6363j3642j0453p531o138o881
63314E58382r225j2080j4417j5568j5467j4804j4492j4674j4543j3407j1604j0090
63302C98011r289q756p941o895o051n568n197m736m338m183m027l396k303j407
63288C23924j319j881k441k593k328j713q96l81o93j556j956j344l70pl56p52
63272C03338q05o73m77m5O30J164J267J114J073J258J472J493J293J071J100J449
63256C15722J893K250K637L153L529L450L189L356L992M476M468M481N139O320
63242C68055P434Q291R180J0247J1210J1786J2055J2365J3024J4064J5125J5685
63230E08521J5618J5432J5788J6769J7862J8555J8728J8531J8243J8292J9026
$$ plain form
63219 701365 721601 742733 763862 784392 804471 824349 843481 860692 875215 887159 896733 903427
63207 903427 906385 905376 900878 893262 882495 868796 853021 836058 818250 799761 781110 762947
63195 762947 745654 729621 715614 704319 695757 689630 686081 685493 687713 692122 698443 706852 717405
63182 717405 730112 745578 764603 786785 810372 833965 857711 882298 907478 932338 956555
63171 956555 980558 1004672 1028712 1052182 1074216 1093490 1108944 1120582 1128903 1133519 1132961 1126069
63159 1126069 1113054 1094953 1072502 1045890 1015410 982006 947196 912444 878465 845075 811805
63148 811805 778667 746239 715170 685819 658306 632674 609033 587679 568890 552378 537193
63137 537193 522563 508733 496665 486983 479600 474196 470497 468024 466073 464160 462246 460507 459199
$$ packed form
63219G01365K0236K1132K1129K0530K0079J9878J9132J7211J4523J1944R574O694
63207I03427K958j009m498p616j0767j3699j5775j6963j7808j8489j8651j8163
63195G62947j7293j6033j4007j1295q562o127l549n88K220M409O321Q409J0553
63182G17405J2707J5466J9025K2182K3587K3593K3746K4587K5180K4860K4217
63171I56555K4003K4114K4040K3470K2034J9274J5454J1638Q321M616n58o892
63159A126069j3015j8101k2451k6612l0480l3404l4810l4752l3979l3390l3270
63148H11805l3138l2428l1069k9351k7513k5632k3641k1354j8789j6512j5185
63137E37193j4630j3830j2068r682p383n404l699k473j951j913j914j739j308
$$ plain form
63124 459199 458752 459508 461209 463109 464733 466255 468064 470342 473176 476609 480348 483766 486529 489021 491927
63109 491927 495560 499682 503731 507098 509486 511180 512750 514372 515738 516690 517542 518570 519649 520673 521914
63094 521914 523520 525008 525774 525992 526491 527777 529534 531063 531917 532082 531796 531336 530908 530786 531465 533382 536319
63077 536319 539443 542250 545279 549533 555308 561906 568419 574560 580834 588137 597043 607195 617557 627503
63063 627503 637538 648659 661261 675072 689955 706287 724599 745348 768971 795608 824652
63052 824652 855059 886373 919162 954296 992048 1031963 1073264 1115321 1158043 1201908 1247285
63041 1247285 1293699 1340169 1386372 1432925 1480338 1528286 1576272 1624419 1672865 1720701 1766236
63030 1766236 1808304 1846643 1880913 1909936 1932227 1946826 1953291 1951219 1940333 1921062 1894664 1862579
$$ packed form
63124D59199m47P56J701J900J624J522J809K278K834L433L739L418K763K492K906
63109D91927L633M122M049L367K388J694J570J622J366R52Q52J028J079J024J241
63094E21914J606J488P66K18M99J286J757J529Q54J65k86m60m28j22O79J917K937
63077E36319L124K807L029M254N775O598O513O141O274P303Q906J0152J0362R946
63063F27503J0035J1121J2602J3811J4883J6332J8312K0749K3623K6637K9044
63052H24652L0407L1314L2789L5134L7752L9915M1301M2057M2722M3865M5377
63041A247285M6414M6470M6203M6553M7413M7948M7986M8147M8446M7836M5535
63030A766236M2068L8339L4270K9023K2291J4599O465k072j0886j9271k6398l2085
$$ plain form
63018 1862579 1825777 1784856 1740725 1694979 1649432 1605296 1562952 1522573 1484859 1451011 1422084
63007 1422084 1398595 1380823 1369265 1364548 1366874 1375717 1390196 1409701 1434039 1462994 1495880 1531657
62995 1531657 1569466 1609018 1650535 1694325 1740269 1787561 1835065 1882006 1928193 1973299 2016111
62984 2016111 2054869 2088362 2116243 2138126 2152808 2158736 2154957 2141222 2117465 2083790 2040971 1990369
62972 1990369 1933139 1869973 1801954 1731264 1660405 1590704 1521969 1453794 1386909 1323002 1263416
62961 1263416 1208300 1157036 1109116 1064356 1022500 983111 946022 911602 880256 851767 825438
62950 825438 800856 778138 757337 737941 719249 701024 683454 666576 650117 633996 618608
62939 618608 604430 591511 579543 568264 557632 547749 538868 531392 525522 520785 516190 511007 505308
$$ packed form
63018A862579l6802m0921m4131m5746m5547m4136m2344m0379l7714l3848k8927
63007A422084k3489j7772j1558m717K326Q843J4479J9505K4338K8955L2886L5777
62995A531657L7809L9552M1517M3790M5944M7292M7504M6941M6187M5106M2812
62984B016111L8758L3493K7881K1883J4682N928l779j3735k3757l3675m2819n0602
62972A990369n7230o3166o8019p0690p0859o9701o8735o8175o6885o3907n9586
62961A263416n5116n1264m7920m4760m1856l9389l7089l4420l1346k8489k6329
62950H25438k4582k2718k0801j9396j8692j8225j7570j6878j6459j6121j5388
62939F18608j4178j2919j1968j1279j0632r883q881p476n870m737m595n183n699
$$ plain form
62926 505308 499678 494608 490395 487363 485723 485057 484308 482577 479886 476971 474414 472171 469875 467340 464622
62911 464622 461841 459114 456608 454462 452682 451194 449948 448846 447609 445937 443903 441993 440589 439501
62897 439501 438175 436419 434742 433898 434119 434903 435548 435825 436060 436582 437192 437309 436634 435523 434599 434062 433563
62880 433563 432823 432222 432514 433882 435488 436185 435666 434662 433984 433717 433522 433353 433406 433529 433280 432602 431911 431332
62862 431332 430370 428702 426878 425788 425696 426225 427038 427985 428739 428877 428380 427669 427149 427071 427662 428819 429739 429586
62844 429586 428635 428078 428459 428999 428790 427926 426915 425665 423895 422116 421282 421526 421983 421897 421291 420508 419706 418993
62826 418993 418563 418537 418983 420128 422128 424575 426713 428321 429950 432173 435004 438229 441840 445848 450059
62811 450059 454335 458805 463577 468517 473503 478575 483590 488163 492283 496598 501673 507294 513016 519098
$$ packed form
62926E05308n630n070m213l032j640o66p49j731k691k915k557k243k296k535k718
62911D64622k781k727k506k146j780j488j246j102j237j672k034j910j404j088
62897D39501j326j756j677q44K21P84O45K77K35N22O10J17o75j111r24n37m99
62880D33563p40o01K92J368J606O97n19j004o78k67j95j69N3J23k49o78o91n79
62862D31332r62j668j824j090r2N29Q13R47P54J38m97p11n20p8N91J157R20j53
62844D29586r51n57L81N40k09q64j011j250j770j779q34K44M57q6o06p83q02p13
62826D18993m30k6M46J145K000K447K138J608J629K223K831L225L611M008M211
62811D50059M276M470M772M940M986N072N015M573M120M315N075N621N722O082
$$ plain form
62797 519098 526254 534683 544020 554169 565447 577759 590381 603006 616518 632293 651027 672623
62785 672623 696839 723594 752848 784784 820161 860079 905216 955429 1010051 1068358 1129805
62774 1129805 1194105 1261050 1329959 1399215 1466652 1530472 1589556 1642919 1689268 1727317 1756202
62763 1756202 1775325 1784096 1782194 1769935 1748111 1717581 1679241 1634146 1583327 1527621 1468022 1406017
62751 1406017 1343204 1280711 1219382 1160190 1103751 1049568 996756 945771 898550 856393 818433
62740 818433 782844 749018 717776 689873 665234 643510 624493 607846 593179 580543 570268
62729 570268 562109 555160 548876 543727 540486 539258 539480 540544 542108 544108 546812 550709 556050 562579
62715 562579 569938 578230 588037 599977 614254 630513 648098 666782 687328 711167 739352 771976
$$ packed form
62797E19098P156Q429R337J0149J1278J2312J2622J2625J3512J5775J8734K1596
62785F72623K4216K6755K9254L1936L5377L9918M5137N0213N4622N8307O1447
62774A129805O4300O6945O8909O9256O7437O3820N9084N3363M6349L8049K8885
62763A756202J9123Q771j902j2259k1824l0530l8340m5095n0819n5706n9599o2005
62751A406017o2813o2493o1329n9192n6439n4183n2812n0985m7221m2157l7960
62740H18433l5589l3826l1242k7903k4639k1724j9017j6647j4667j2636j0275
62729E70268q159o949o284n149l241j228K22J064J564K000K704L897N341O529
62715E62579P359Q292R807J1940J4277J6259J7585J8684K0546K3839K8185L2624
$$ plain form
62703 771976 808599 848948 893168 941754 995409 1054648 1119314 1188731 1262434 1340426 1422513
62692 1422513 1507680 1594251 1680264 1763504 1841739 1913454 1978012 2034602 2081253 2115411 2135444
62681 2135444 2141230 2133450 2112784 2079827 2035330 1980424 1916701 1845988 1769883 1689687 1606955 1523700
62669 1523700 1441710 1361878 1284642 1210723 1140878 1075209 1013479 955994 903418 855641 811638
62658 811638 770723 733236 699649 669582 642222 617322 595211 576005 559193 543943 529587
62647 529587 515935 503256 491816 481414 471673 462816 455609 450305 446148 442278 438635 435491 432587
62634 432587 429488 426515 424458 423313 422127 420308 418380 417027 415993 414531 412600 410957 410117 409812 409572
62619 409572 409332 409214 409069 408668 408269 408611 410283 413294 417281 421874 426763 431701 436685 442038 448067 454721
$$ packed form
62703G71976L6623M0349M4220M8586N3655N9239O4666O9417P3703P7992Q2087
62692A422513Q5167Q6571Q6013Q3240P8235P1715O4558N6590M6651L4158K0033
62681B135444N786p780k0666l2957m4497n4906o3723p0713p6105q0196q2732q3255
62669A523700q1990p9832p7236p3919o9845o5669o1730n7485n2576m7777m4003
62658H11638m0915l7487l3587l0067k7360k4900k2111j9206j6812j5250j4356
62647E29587j3652j2679j1440j0402r741q857p207n304m157l870l643l144k904
62634D32587l099k973k057j145j186j819j928j353j034j462j931j643q40l05k40
62619D09572k40j18j45m01l99L42J672L011L987M593M889M938M984N353O029O654
$$ plain form
62603 454721 461823 469560 478442 488753 500355 513176 527677 544636 564510 587120 611875 638261
62591 638261 666183 695855 727274 759825 792544 824641 855453 883923 908666 928828 944488
62580 944488 955822 962214 962767 957534 947620 933968 916615 895469 871347 845740 819642 792988
62568 792988 765310 736669 707896 680098 654068 630010 607648 586541 566415 547390 529961
62557 529961 514681 501711 490613 480694 471621 463649 457170 452088 447774 443691 439913 436936 434990
62544 434990 433714 432578 431510 430984 431440 432771 434448 436062 437604 439178 440630 441701 442583 444096 447100
62529 447100 451718 457348 463382 469735 476648 484367 493262 504013 517245 533002 550908 570840 593095
62516 593095 617867 645019 674680 707738 745254 787342 832844 880140 928111 976293 1024293
$$ packed form
62603D54721P102P737Q882J0311J1602J2821J4501J6959J9874K2610K4755K6386
62591F38261K7922K9672L1419L2551L2719L2097L0812K8470K4743K0162J5660
62580I44488J1334O392N53n233r914j3652j7353k1146k4122k5607k6098k6654
62568G92988k7678k8641k8773k7798k6030k4058k2362k1107k0126j9025j7429
62557E29961j5280j2970j1098r919r073p972o479n082m314m083l778k977j946
62544D34990j276j136j068n26M56J331J677J614J542J574J452J071Q82J513L004
62529D47100M618N630O034O353O913P719Q895J0751J3232J5757J7906J9932K2255
62516E93095K4772K7152K9661L3058L7516M2088M5502M7296M7971M8182M8000
$$ plain form
62505 1024293 1071233 1115776 1156655 1193072 1224474 1249983 1268368 1278774 1281422 1277397 1267734 1252906
62493 1252906 1233193 1209381 1182933 1155538 1128594 1103126 1079964 1059730 1042577 1028202 1016413
62482 1016413 1007655 1002815 1002560 1007015 1015880 1028387 1043083 1058169 1072394 1085455 1097386 1107841
62470 1107841 1116140 1121554 1123150 1119724 1110505 1095820 1076600 1053319 1025939 994834 961075 925685
62458 925685 889207 852263 815842 780510 745832 711300 677688 646779 619720 596155 575153
62447 575153 556475 540585 527682 517190 508302 500790 495167 491999 491093 491451 492119 493051 494948 498204
62433 498204 502174 505631 507790 508719 508889 508550 507561 505561 502149 497112 490674 483513 476327 469377 462486
62418 462486 455471 448465 441873 436112 431326 427173 422960 418232 413242 408624 404596 400799 397022 393660
$$ packed form
62505A024293M6940M4543M0879L6417L1402K5509J8385J0406K648m025r663j4828
62493A252906j9713k3812k6448k7395k6944k5468k3162k0234j7153j4375j1789
62482A016413q758m840k55M455Q865J2507J4696J5086J4225J3061J1931J0455
62470A107841Q299N414J596l426r219j4685j9220k3281k7380l1105l3759l5390
62458I25685l6478l6944l6421l5332l4678l4532l3612l0909k7059k3565k1002
62447E75153j8678j5890j2903j0492q888p512n623l168r06L58O68R32J897L256
62433D98204L970L457K159R29J70l39r89k000l412n037o438p161p186o950o891
62418D62486p015p006o592n761m786m153m213m728m990m618m028l797l777l362
$$ plain form
62404 393660 391161 389327 387587 385805 384355 383460 382952 382769 383223 384482 386101 387364 387986 388283 388787 389902
62388 389902 391817 394545 397939 401732 405487 408632 410836 412543 414884 418796 424243 430448 436772 443177
62374 443177 449959 457327 465254 473510 481820 490134 498855 508612 519705 531832 544510 557823 572689
62361 572689 590227 610793 633796 658700 686106 717494 753811 794583 838486 884354 931305
62350 931305 978359 1024572 1069399 1112309 1151972 1186484 1214674 1236746 1253346 1264381 1269193 1267554
62338 1267554 1259974 1247076 1229144 1206411 1179506 1149475 1117501 1084577 1051281 1017828 984540
62327 984540 952237 921904 893854 867463 841945 817250 793958 772346 751836 731468 710791
62316 710791 690128 670078 650893 632366 614154 596134 578528 561843 546628 533172 521304
$$ packed form
62404C93660k499j834j740j782j450q95n08j83M54J259J619J263O22K97N04J115
62388C89902J915K728L394L793L755L145K204J707K341L912N447O205O324O405
62374D43177O782P368P927Q256Q310Q314Q721R757J1093J2127J2678J3313J4866
62361E72689J7538K0566K3003K4904K7406L1388L6317M0772M3903M5868M6951
62350I31305M7054M6213M4827M2910L9663L4512K8190K2072J6600J1035M812j639
62338A267554p580j2898j7932k2733k6905l0031l1974l2924l3296l3453l3288
62327I84540l2303l0333k8050k6391k5518k4695k3292k1612k0510k0368k0677
62316G10791k0663k0050j9185j8527j8212j8020j7606j6685j5215j3456j1868
$$ plain form
62305 521304 510533 500362 490588 481417 473304 466501 460604 454844 449085 444334 441724 441049 440914 440464
62291 440464 440297 441243 442863 443970 444341 445099 447320 450970 455304 459634 463405 466157 467968 469622 471943
62276 471943 475191 479313 484354 490126 495873 500957 505822 511667 519133 527793 537041 546986 558230 571089
62262 571089 585368 600870 618020 638023 662219 691047 723703 759128 797230 838764 884058
62251 884058 932362 982468 1033324 1083740 1132006 1176323 1215426 1248557 1275218 1295332 1309279
62240 1309279 1317239 1318656 1312832 1299830 1280267 1254388 1222103 1184064 1142039 1097917 1052737 1006927
62228 1006927 961031 915800 871888 829905 790619 754656 721983 692010 664283 638855 615964
62217 615964 595537 577228 560850 546590 534640 524680 515899 507629 499812 492745 486554 481182 476737
$$ packed form
62305E21304j0771j0171r774r171q113o803n897n760n759m751k610o75j35m50
62291D40464j67R46J620J107L71P58K221L650M334M330L771K752J811J654K321
62276D71943L248M122N041N772N747N084M865N845P466Q660R248R945J1244J2859
62262E71089J4279J5502J7150K0003K4196K8828L2656L5425L8102M1534M5294
62251H84058M8304N0106N0856N0416M8266M4317L9103L3131K6661K0114J3947
62240A309279P960J417n824j3002j9563k5879l2285l8039m2025m4122m5180m5810
62228A006927m5896m5231m3912m1983l9286l5963l2673k9973k7727k5428k2891
62217F15964k0427j8309j6378j4260j1950r960q781q270p817p067o191n372m445
$$ plain form
62204 476737 473491 471485 470485 470393 471311 473072 475062 476800 478489 480840 484556 490085 497462 506077 514932
62189 514932 523619 532931 544149 557787 573279 589648 606015 621671 636250 649967 663239 675987
62177 675987 687628 697815 706746 714658 721473 727154 732098 736997 742600 749751 759266 771495 786276
62164 786276 803541 823651 846937 873306 902521 934331 967775 1000715 1030799 1056929 1079367
62153 1079367 1098505 1114112 1125739 1133191 1136301 1134715 1128276 1117370 1102597 1084232 1062266 1036947
62141 1036947 1009137 980208 951534 923957 897655 872633 849246 827994 808897 791488 775590
62130 775590 761737 750571 742025 735336 729635 724369 719399 715040 711967 710790 711627 714116 717692 721784
62116 721784 725954 730056 734131 737962 740963 742759 743652 744144 744167 743291 741616 739842 738180 735656 731040
$$ packed form
62204D76737l246k006j000r2R18J761J990J738J689K351L716N529P377Q615Q855
62189E14932Q687R312J1218J3638J5492J6369J6367J5656J4579J3717J3272J2748
62177F75987J1641J0187Q931P912O815N681M944M899N603P151R515J2229J4781
62164G86276J7265K0110K3286K6369K9215L1810L3444L2940L0084K6130K2438
62153A079367J9138J5607J1627P452L110j586o439j0906j4773j8365k1966k5319
62141A036947k7810k8929k8674k7577k6302k5022k3387k1252j9097j7409j5898
62130G75590j3853j1166q546o689n701n266m970m359l073j177Q37K489L576M092
62116G21784M170M102M075L831L001J796Q93M92K3q76j675j774j662k524m616
$$ plain form
62101 731040 724341 716985 710467 705169 700625 696607 693519 691700 690802 690275 690325 691918 695647 700953 706712
62086 706712 712372 718269 725053 733138 742519 752759 763265 773975 785700 799362 814949 831673
62074 831673 849074 867337 886390 905485 924167 943068 963087 984056 1004970 1025421 1046190
62063 1046190 1068300 1091975 1116690 1141785 1166767 1191318 1215205 1238036 1258989 1277078 1291841
62052 1291841 1303503 1312235 1317553 1318780 1315944 1309723 1300418 1287329 1269372 1246178 1218417 1187241
62040 1187241 1153681 1118550 1082533 1046086 1009291 972038 934470 897221 861188 827048 794955
62029 794955 764665 736003 709267 685074 663696 644659 627188 610951 596056 582348 569189
62018 569189 556191 543740 532372 521859 511445 500939 491018 482379 475032 468649 463103 458302 453832
$$ packed form
62101G31040o699p356o518n298m544m018l088j819q98n27N0J593L729N306N759
62086G06712N660N897O784Q085R381J0240J0506J0710J1725J3662J5587J6724
62074H31673J7401J8263J9053J9095J8682J8901K0019K0969K0914K0451K0769
62063A046190K2110K3675K4715K5095K4982K4551K3887K2831K0953J8089J4763
62052A291841J1662Q732N318J227k836o221r305j3089j7957k3194k7761l1176
62040A187241l3560l5131l6017l6447l6795l7253l7568l7249l6033l4140l2093
62029G94955l0290k8662k6736k4193k1378j9037j7471j6237j4895j3708j3159
62018E69189j2998j2451j1368j0513j0414j0506r921q639p347o383n546m801m470
$$ plain form
62005 453832 449316 445040 441800 440024 439336 439120 439250 440091 441879 444311 446806 449099 451444 454099 456679
61990 456679 458318 458600 458041 457350 456427 454555 451511 447870 444065 439705 434275 428115 422109 416648 411452
61975 411452 406344 401537 397138 393026 389421 386876 385259 383364 380242 376552 373840 372606 371892 370792
61961 370792 369552 368906 369083 369947 371532 373778 376036 377529 378250 378999 380571 383294 387156 391889 396959
61946 396959 401981 407222 413291 420353 428082 436427 445785 456228 467123 477894 488691 499909 511461
61933 511461 523017 534613 546434 558213 569484 580261 590811 600823 609573 616998 623753 629779
61921 629779 633649 634081 631712 628563 625918 623489 620656 617702 615465 614316 613981 614108 614671 615960 618495
61906 618495 622837 629188 637183 646215 655929 666182 676525 685953 693272 697764 699514 699140 697174 693675
$$ packed form
62005D53832m516m276l240j776o88k16J30Q41J788K432K495K293K345K655K580
61990D56679J639K82n59o91r23j872l044l641l805m360n430o160o006n461n196
61975D11452n108m807m399m112l605k545j617j895l122l690k712j234p14j100
61961C70792j240o46J77Q64J585K246K258J493P21P49J572K723L862M733N070
61946C96959N022N241O069P062P729Q345R358J0443J0895J0771J0797J1218J1552
61933E11461J1556J1596J1821J1779J1271J0777J0550J0012Q750P425O755O026
61921F29779L870M32k369l149k645k429k833k954k237j149l35J27N63J289K535
61906F18495M342O351P995R032R714J0253J0343R428P319M492J750l74j966l499
$$ plain form
61892 693675 688524 681983 674705 667143 659178 650535 641311 631862 622357 612759 603148 593750 584667 575783
61878 575783 566917 557880 548551 539164 530361 522542 515271 507793 500151 493216 487536 482718 478266 474424
61864 474424 471719 470089 469058 468623 469349 471606 475156 479590 484817 491063 498679 507983 519057 531628
61850 531628 545416 560664 578024 597760 619194 641074 662470 683272 703849 724190 743370
61839 743370 759979 773173 783149 790453 795122 796887 796091 793891 791389 788874 786081 782999 780206 778520
61825 778520 778484 780169 783351 787823 793455 800033 807179 814471 821359 826866 829742 829284 825751 819639 810892
61810 810892 799382 785909 771878 757850 743142 727111 710153 693036 675883 658427 640921
61799 640921 624127 608598 594468 581847 570847 561195 552244 543482 534841 526564 519050 512736 507733
$$ packed form
61892F93675n151o541p278p562p965q643r224r449r505r598r611r398r083q884
61878E75783q866r037r329r387q803p819p271p478p642o935n680m818m452l842
61864D74424k705j630j031m35P26K257L550M434N227O246P616R304J1074J2571
61850E31628J3788J5248J7360J9736K1434K1880K1396K0802K0577K0341J9180
61839G43370J6609J3194R976P304M669J765p96k200k502k515k793l082k793j686
61825G78520l6J685L182M472N632O578P146P292O888N507K876m58l533o112q747
61810H10892j1510j3473j4031j4028j4708j6031j6958j7117j7153j7456j7506
61799F40921j6794j5529j4130j2621j1000r652q951q762q641q277p514o314n003
$$ plain form
61786 507733 503499 499135 494105 488537 482855 477418 472503 468328 464890 461936 459236 456807 454764 453000
61772 453000 451087 448567 445422 442277 440010 439080 439261 440021 440994 442035 443142 444514 446390 448564 450291
61757 450291 451116 451618 452880 455229 457884 459893 461004 461557 461969 462480 463092 463525 463441 462837 461990 460971 459582
61740 459582 457918 456537 455754 455098 453899 452152 450364 448753 447154 445658 444749 444650 445008 445479 446245 447610
61724 447610 449357 450902 451963 452759 453576 454475 455407 456356 457220 457782 457935 457827 457737 457862 458258 458867 459522 460017
61706 460017 460245 460213 459937 459471 458997 458638 458063 456574 453789 450123 446409 443225 440731 438915 437588 436279
61690 436279 434546 432432 430308 428304 426310 424518 423446 423147 422819 421535 419130 416136 413153 410604 408785
61675 408785 407641 406595 405110 403426 402270 401669 400564 398023 394596 391970 391133 391239 390572 388515 386231
$$ packed form
61786E07733m234m364n030n568n682n437m915m175l438k954k700k429k043j764
61772D53000j913k520l145l145k267r30J81P60R73J041J107J372J876K174J727
61757D50291Q25N02J262K349K655K009J111N53M12N11O12M33q4o04q47j019j389
61740D59582j664j381p83o56j199j747j788j611j599j496r09r9L58M71P66J365
61724D47610J747J545J061P96Q17Q99R32R49Q64N62J53j08r0J25L96O09O55M95
61706D60017K28l2k76m66m74l59n75j489k785l666l714l184k494j816j327j309
61690D36279j733k114k124k004j994j792j072k99l28j284k405k994k983k549j819
61675D08785j144j046j485j684j156o01j105k541l427k626q37J06o67k057k284
$$ plain form
61660 386231 385287 385878 386697 386401 384894 383137 382037 381766 382015 382615 383719 385388 387171 388475 389387 390727
61644 390727 392904 395093 396168 396222 396425 397371 398446 399089 399735 400920 402194 402738 402619 402579 402832 402850 402215 400912
61626 400912 398875 396032 392882 390247 388235 386055 383093 379701 376657 374293 372380 370572 368749 367126
61612 367126 366000 365146 363652 360885 357458 354514 352071 348996 344858 340845 338227 336646 334721 331849
61598 331849 328586 325480 322414 319198 316133 313683 311858 310135 307903 305053 302148 299894 298349 296868
61584 296868 294944 292792 290976 289786 289251 289312 289610 289440 288393 286810 285217 283594 281730 280003 279108 279016
61568 279016 278890 278150 277135 276469 276211 275906 275170 273995 272681 271670 271315 271623 272249 272770 272973 272999 273346 274562
61550 274562 276629 278701 279756 279536 278706 278141 278287 279129 280386 281671 282701 283508 284347 285420 286797 288444
$$ packed form
61660C86231r44N91Q19k96j507j757j100k71K49O00J104J669J783J304R12J340
61644C90727K177K189J075N4K03R46J075O43O46J185J274N44j19m0K53J8o35j303
61626D00912k037k843l150k635k012k180k962l392l044k364j913j808j823j623
61612C67126j126q54j494k767l427k944k443l075m138m013k618j581j925k872
61598C31849l263l106l066l216l065k450j825j723k232k850k905k254j545j481
61584B96868j924k152j816j190n35O1K98j70j047j583j593j623j864j727q95r2
61568B79016j26p40j015o66k58l05p36j175j314j011l55L08O26N21K03K6L47J216
61550B74562K067K072J055k20q30n65J46Q42J257J285J030Q07Q39J073J377J647
$$ plain form
61534 288444 290081 291131 291235 290787 290626 291150 292048 292924 293759 294605 295206 295200 294480 293181 291508 289731 288197
61517 288197 287100 286329 285626 284853 284123 283795 284230 285277 286046 285611 284118 282851 282955 284328 285955 287024
61501 287024 287333 286881 285610 283742 281997 281091 281026 281031 280373 279133 278034 277516 277212 276508 275440 274755 275140 276569
61483 276569 278403 279980 281109 282164 283592 285257 286452 286803 286888 287566 288938 290439 291748 292951 293847
61468 293847 293917 293192 292478 292423 292927 293737 294914 296247 296897 296284 294926 293753 292995 292404 292145 292603 293525 294215
61450 294215 294628 295423 296847 298269 299036 299215 299280 299651 300688 302499 304486 305648 305759 305754 306563 308074 309737
61433 309737 311695 314543 318135 321411 323560 324847 326049 327497 328961 330233 331412 332633 333804 334730
61419 334730 335366 335772 335929 335825 335747 336194 337353 338902 340582 342614 345171 347547 348464 347334 344905 342524
$$ packed form
61534B88444J637J050J04m48j61N24Q98Q76Q35Q46O01op20j299j673j777j534
61517B88197j097p71p03p73p30l28M35J047P69m35j493j267J04J373J627J069
61501B87024L09m52j271j868j745r06o5No58j240j099n18l04p04j068o85L85J429
61483B76569J834J577J129J055J428J665J195L51Q5O78J372J501J309J203Q96
61468B93847P0p25p14n5N04Q10J177J333O50o13j358j173p58n91k59M58R22O90
61450B94215M13P95J424J422P67J79O5L71J037J811J987J162J11nQ09J511J663
61433C09737J958K848L592L276K149J287J202J448J464J272J179J221J171R26
61419C34730O36M06J57j04p8M47J159J549J680K032K557K376R17j130k429k381
$$ plain form
61403 342524 341066 340591 340621 340621 340483 340621 341222 341535 340555 338570 337183 337371 338301 338756 338945 339848 341235 341691
61385 341691 340676 339421 339328 340422 341888 343364 345026 346944 349035 351353 353787 355682 356422 356315 356403 357333
61369 357333 358805 360092 360741 360801 360769 361333 362809 364716 366223 367100 367956 369441 371496 373514 375053 376233
61353 376233 377617 379799 382982 386845 390906 395002 399282 403797 408423 413257 418660 424636 430479 435455
61339 435455 439695 444013 448835 453696 457840 460994 463391 465337 467028 468603 470038 471015 471186 470659 470018
61324 470018 469714 469599 469180 468226 466936 465603 464400 463564 463508 464500 466338 468570 471082 474253 478539 484073
61308 484073 490693 498144 506154 514550 523533 533661 545214 557594 569614 580399 589750 597673 603975
61295 603975 608628 612147 615125 617433 618310 617337 614951 611819 607999 603011 596581 589060 581170 573608 566818
$$ packed form
61403C42524j458m75L0%j38J38O01L13r80j985j387J88R30M55J89R03J387M56
61385C41691j015j255r3J094J466J476J662J918K091K318K434J895P40j07Q8R30
61369C57333J472J287O49O0l2N64J476J907J507Q77Q56J485K055K018J539J180
61353C76233J384K182L183L863M061M096M280M515M626M834N403N976N843M976
61339D35455M240M318M822M861M144L154K397J946J691J575J435R77J71n27o41
61324D70018l04j15m19r54j290j333j203q36n6R92J838K232K512L171M286N534
61308D84073O620P451Q010Q396Q983J0128J1553J2380J2020J0785R351P923O302
61295F03975M653L519K978K308Q77r73k386l132l820m988o430p521p890p562o790
$$ plain form
61280 566818 560909 555688 550902 546493 542493 538745 534952 531047 527297 524021 521396 519597 518824 518992 519637
61265 519637 520373 521296 522718 524636 526768 529060 531833 535418 539870 545080 550861 556844 562538 567662 572282
61250 572282 576503 580208 583244 585657 587534 588767 589197 588917 588188 587132 585710 583964 581999 579753 577062
61235 577062 574046 571132 568610 566432 564663 563813 564347 566047 568226 570576 573429 577209 581935 587339 593058
61220 593058 598651 603889 609279 615834 623864 632346 640034 646986 654359 662758 671426 679221 685793 691485
61206 691485 696587 701126 705169 708877 712382 715799 719231 722620 725857 729281 733759 739919 747519 755870
61192 755870 764673 774041 783926 794016 804123 814133 823525 831495 837821 843228 848571 853788 857900
61179 857900 860008 860068 858718 856543 853707 850303 846687 843056 838857 833229 826174 818687 811425 803875 795374
$$ packed form
61280E66818n909n221m786m409m000l748l793l905l750l276k625j799p73J68O45
61265E19637P36R23J422J918K132K292K773L585M452N210N781N983N694N124M620
61250E72282M221L705L036K413J877J233M30k80p29j056j422j746j965k246k691
61235E77062l016k914k522k178j769q50N34J700K179K350K853L780M726N404N719
61220E93058N593N238N390O555Q030Q482P688O952P373Q399Q668P795O572N692
61206F91485N102M539M043L708L505L417L432L389L237L424M478O160P600Q351
61192G55870Q803R368R885J0090J0107J0010R392P970O326N407N343N217M112
61179H57900K108O0j350k175k836l404l616l631m199n628p055p487p262p550q501
$$ plain form
61164 795374 786263 777177 767655 756574 743916 731050 719058 707725 696423 685127 674079 663303
61152 663303 653006 643862 636284 629891 624179 619248 615348 612205 609345 606632 603906 600531 596005 590781
61138 590781 585854 581745 578409 575767 573639 571427 568673 565896 564191 564057 565225 567482 570905 575286
61124 575286 580160 585620 592479 601360 612162 624546 638392 653574 669942 687816 707979 730764
61112 730764 755550 781390 807701 834000 859501 883585 906467 928848 950929 972127 991696
61101 991696 1009303 1024939 1038630 1050347 1060020 1067416 1071998 1073054 1070164 1063550 1053882 1041761 1027605
61088 1027605 1011975 995575 978642 960761 941655 921837 902010 882147 861827 841258 821274
61077 821274 802345 784350 767296 751496 736875 722937 709778 698386 689497 682772 677550 673739
$$ packed form
61164G95374r111r086r522j1081j2658j2866j1992j1333j1302j1296j1048j0776
61152F63303j0297r144p578o393n712m931l900l143k860k713k726l375m526n224
61138E90781m927m109l336k642k128k212k754k777j705j34J168K257L423M381
61124E75286M874N460O859Q881J0802J2384J3846J5182J6368J7874K0163K2785
61112G30764K4786K5840K6311K6299K5501K4084K2882K2381K2081K1198J9569
61101I91696J7607J5636J3691J1717R673P396M582J056k890o614r668j2121j4156
61088A027605j5630j6400j6933j7881j9106j9818j9827j9863k0320k0569j9984
61077H21274j8929j7995j7054j5800j4621j3938j3159j1392q889o725n222l811
$$ plain form
61065 673739 671347 669727 668118 666735 666573 668165 671110 674767 678893 683569 688987 695458 703337 712732
61051 712732 723390 734916 747098 760114 774447 790399 807642 825549 844116 864238 886820
61040 886820 911866 938637 966477 995282 1025485 1057849 1093075 1131272 1171966 1214680 1259228
61029 1259228 1305325 1352451 1400407 1449571 1500225 1552044 1604697 1658559 1714483 1773318 1836169
61018 1836169 1904553 1979511 2060848 2147936 2241113 2341898 2452462 2575912 2716864 2881001
61008 2881001 3074594 3305726 3585913 3929530 4352086 4870261 5502486 6266253 7174001
60999 7174001 8233558 9450136 10816090 12285242 13755989 15094325 16193330 17023825
60991 17023825 17634146 18106503 18515178 18914113 19336346 19777363 20171105 20397021 20333131
$$ packed form
61065F73739k392j620j609j383j62J592K945L657M126M676N418O471P879R395
61051G12732J0658J1526J2182J3016J4333J5952J7243J7907J8567K0122K2582
61040H86820K5046K6771K7840K8805L0203L2364L5226L8197M0694M2714M4548
61029A259228M6097M7126M7956M9164N0654N1819N2653N3862N5924N8835O2851
61018A836169O8384P4958Q1337Q7088R3177J00785J10564J23450J40952J64137
61008B881001J93593K31132K80187L43617M22556N18175O32225P63767R07748
60999G174001J059557J216578J365954J469152J470747J338336J099005Q30495
60991A7023825O10321M72357M08675L98935M22233M41017L93742K25916o3890
$$ plain form
60982 20333131 19919320 19180430 18197697 17062185 15846875 14603523 13368345 12165294
60974 12165294 11008449 9906658 8867943 7900480 7011221 6204841 5483523 4846644 4290475
60965 4290475 3808656 3393452 3037019 2732124 2472197 2251018 2062571 1901398 1763091
60956 1763091 1644361 1542611 1455485 1380656 1315825 1258944 1208476 1163361 1122561 1084822 1049069
60945 1049069 1015024 983201 954293 928533 905517 884488 864880 846734 830449 815946 802255
60934 802255 788236 773581 758851 744619 730993 718012 706020 695286 685512 676035 666517 657161
60922 657161 648265 639823 631682 623889 616726 610396 604808 599677 594828 590450 587092 585260 584847 584997 584742
60907 584742 583846 582861 582359 582408 582942 584299 587039 591350 596968 603579 610898 618414 625517 632030 638275 644528
$$ packed form
60982B0333131m13811p38890r82733j135512j215310j243352j235178j203051
60974A2165294j156845j101791j038715r67463q89259q06380p21318o36879n56169
60965D290475m81819m15204l56433l04895k59927k21179j88447j61173j38307
60956A763091j18730j01750q7126p4829o4831n6881n0468m5115m0800l7739l5753
60945A049069l4045l1823k8908k5760k3016k1029j9608j8146j6285j4503j3691
60934H02255j4019j4655j4730j4232j3626j2981j1992j0734r774r477r518r356
60922F57161q896q442q141p793p163o330n588n131m849m378l358j832m13J50k55
60907E84742q96r85n02M9N34J357K740M311N618O611P319P516P103O513O245O253
$$ plain form
60891 644528 650745 657031 663893 671638 679793 687605 695034 702721 710957 719156 726590 733339 740143 747501
60877 747501 755308 763405 772019 781328 790792 799351 806405 812350 818040 823963 830056 836020 841540 846347
60863 846347 850337 853515 855669 856354 855498 853740 851672 848893 844437 838073 830564 822519 813713 803916 793721
60848 793721 783983 774719 765115 754461 742693 730199 717490 704924 692372 679258 665259 650850
60836 650850 636804 623334 610129 597127 584673 572882 561374 549868 538713 528528 519523 511362
60824 511362 503558 495881 488501 481864 476311 471684 467379 462896 458305 454112 450746 448231 446293 444727
60810 444727 443571 442895 442487 441938 441093 440223 439616 439129 438378 437290 436280 435880 436336 437515 438998 440246 440812
60793 440812 440445 439051 436755 434116 431976 430768 430051 429027 427497 426011 425099 424631 423997 422641 420384
$$ packed form
60891F44528O217O286O862P745Q155P812P429P687Q236Q199P434O749O804P358
60877G47501P807Q097Q614R309R464Q559P054N945N690N923O093N964N520M807
60863H46347L990L178K154O85q56j758k068k779m456o364p509q045q806r797j0195
60848G93721r738r264r604j0654j1768j2494j2709j2566j2552j3114j3999j4409
60836F50850j4046j3470j3205j3002j2454j1791j1508j1506j1155j0185r005q161
60824E11362p804p677p380o637n553m627m305m483m591m193l366k515j938j566
60810D44727j156o76m08n49q45q70o07m87p51j088j010m00M56J179J483J248N66
60793D40812l67j394k296k639k140j208p17j024j530j486r12m68o34j356k257
$$ plain form
60778 420384 417455 414303 411178 407913 404291 400611 397577 395560 394216 392900 391137 388695 385581 382207
60764 382207 379191 376732 374420 371966 369840 368836 369115 370034 370804 370982 370466 369444 368442 367990 368042 368027 367635
60747 367635 367279 367542 368453 369676 371195 373309 375874 378045 379053 378908 378050 376634 374711 372918 372235 372709
60731 372709 372988 371654 368802 365854 363958 363074 362539 361915 361036 359725 357875 355635 353213 350647 347903
60716 347903 345047 342111 339032 335975 333506 332066 331353 330603 329471 328287 327391 326579 325428 323861 322136
60701 322136 320441 318831 317500 316767 316611 316408 315369 313299 310865 309050 308374 308645 309340 310105 310836 311495
60685 311495 312075 312745 313862 315716 318328 321518 325066 328757 332390 335875 339199 342189 344497 346083 347667
60670 347667 350277 354214 358712 362817 366326 369571 372512 374604 375599 376039 376675 377669 378650 379357 379952 380711
$$ packed form
60778D20384k929l152l125l265l622l680l034k017j344j316j763k442l114l374
60764C82207l016k459k312k454k126j004K79R19P70J78n16j022j002m52N2j5l92
60747C67635l56K63R11J223J519K114K565K171J008j45q58j416j923j793o83M74
60731C72709K79j334k852k948j896q84n35o24q79j311j850k240k422k566k744
60716C47903k856k936l079l057k469j440p13p50j132j184q96q12j151j567j725
60701C22136j695j610j331p33j56k03j039k070k434j815o76K71O95P65P31O59
60685C11495N80O70J117J854K612L190L548L691L633L485L324K990K308J586J584
60670C47667K610L937M498M105L509L245K941K092R95M40O36R94R81P07N95P59
$$ plain form
60654 380711 381724 382939 384288 385634 386729 387422 387967 388927 390564 392304 393068 392350 390794 389406 388367
60639 388367 387024 385037 382846 380783 378351 374973 371054 367550 364654 361652 358153 354721 352001 349813
60625 349813 347579 345283 343538 342824 342997 343442 343560 343230 342942 343269 344093 344691 344752 344868 345651 346726 347198 346887
60607 346887 346507 346643 347146 347673 348227 348939 349686 350231 350491 350490 350260 349968 349871 350024 350272 350659 351475 352717 353874
60588 353874 354582 355157 356113 357388 358536 359494 360629 362082 363601 365076 366694 368423 369862 370927 372318
60573 372318 374882 378781 383620 389172 395511 402560 410012 417848 426538 436444 447190 457837 467547 475891
60559 475891 482627 487479 490264 491118 490499 488934 486772 484118 480957 477427 473988 471210 469308 468068 467449
60544 467449 468117 470945 475931 482073 488650 496201 505717 517142 529343 541521 553899 566704 579092
$$ packed form
60654C80711J013J215J349J346J095O93N45R60J637J740P64p18j556j388j039
60639C88367j343j987k191k063k432l378l919l504k896l002l499l432k720k188
60625C49813k234k296j745p14J73M45J18l30k88L27Q24N98O1J16P83J075M72l11
60607C46887l80J36N03N27N54P12P47N45K60jk30k92r7J53K48L87Q16J242J157
60588C53874P08N75R56J275J148R58J135J453J519J475J618J729J439J065J391
60573C72318K564L899M839N552O339P049P452P836Q690R906J0746J0647R710Q344
60559D75891O736M852K785Q54o19j565k162k654l161l530l439k778j902j240o19
60544D67449O68K828M986O142O577P551R516J1425J2201J2178J2378J2805J2388
$$ plain form
60531 579092 589645 597595 603104 606601 608374 608752 608166 606889 604953 602282 598756 594300 589171 584005
60517 584005 579194 574438 569385 564556 560985 558939 557676 556671 556391 557484 559783 562715 566351 571452
60503 571452 578679 588281 600421 615266 632768 652802 675579 701576 731036 763845 799751 838182
60491 838182 877749 916473 952793 986009 1015606 1040562 1059661 1072026 1076944 1073570 1061560 1042005
60479 1042005 1017075 988472 956589 921333 883333 843998 804724 766499 730107 696235 665230
60468 665230 637007 611277 587711 565964 545813 527358 510860 496318 483392 471744 461248
60457 461248 451856 443568 436547 430875 426124 421621 417306 413812 411323 408937 405739 402109 399211 397417
60443 397417 395988 394314 392613 391269 390175 389116 388218 387627 387167 386610 385953 385188 384233 383311 382907 383050 383139
$$ packed form
60531E79092J0553P950N509L497J773L78n86j277j936k671l526m456n129n166
60517E84005m811m756n053m829l571k046j263j005k80J093K299K932L636N101
60503E71452P227R602J2140J4845J7502K0034K2777K5997K9460L2809L5906L8431
60491H38182L9567L8724L6320L3216K9597K4956J9099J2365M918l374j2010j9555
60479A042005k4930k8603l1883l5256l8000l9335l9274l8225l6392l3872l1005
60468F65230k8223k5730k3566k1747k0151j8455j6498j4542j2926j1648j0496
60457D61248r392q288p021n672m751m503m315l494k489k386l198l630k898j794
60443C97417j429j674j701j344j094j059q98n91m60n57o57p65r55r22m04J43Q9
$$ plain form
60426 383139 382903 382962 383864 384997 385215 384338 383288 382751 382359 381349 379563 377590 376262 376152 377242 378930
60410 378930 380516 381723 382706 383683 384762 385982 387233 388205 388703 388999 389651 390997 392936 395056 396851 398058
60394 398058 399009 400363 402322 404408 406256 408105 410071 411614 412498 413808 416944 421664 426130 428934 430257
60379 430257 430961 431606 432663 434680 437631 440710 443317 445668 448039 450113 451663 453216 455287 457409 458709
60364 458709 459120 459252 459292 458885 458072 457627 458269 459993 462325 464830 467274 469570 471734 473812 475968 478770
60348 478770 483002 488823 495336 501379 506582 511208 515232 518227 520077 521089 521237 519917 516800 512541
60334 512541 508303 504805 502002 499489 496940 494294 491660 489027 486118 482691 478920 475201 471603 467876
60320 467876 464024 460468 457493 454948 452736 451276 451055 451908 453121 454244 455567 457848 461819 467972 476528
$$ packed form
60426C83139k36N9R02J133K18q77j050n37l92j010j786j973j328j10J090J688
60410C78930J586J207R83R77J079J220J251R72M98K96O52J346J939K120J795J207
60394C98058R51J354J959K086J848J849J966J543Q84J310L136M720M466K804J323
60379D30257P04O45J057K017K951L079K607K351K371K074J550J553K071K122J300
60364D58709M11J32M0m07q13m45O42J724K332K505K444K296K164K078K156K802
60348D78770M232N821O513O043N203M626M024K995J850J012J48j320l117m259
60334E12541m238l498k803k513k549k646k634k633k909l427l771l719l598l727
60320D67876l852l556k975k545k212j460k21Q53J213J123J323K281L971O153Q556
$$ plain form
60305 476528 487423 500341 514861 530606 547245 564282 580802 595530 607317 615675 620736 622720
60293 622720 621628 617468 610571 601521 590910 579316 567325 555364 543531 531766 520210 509265
60281 509265 499382 490826 483569 477288 471571 466396 462331 459996 459254 459137 458596 457103 454566 451104 447189
60266 447189 443648 441076 439296 437662 435782 433673 431413 429081 427021 425632 424783 423885 422683 421571 420949
60251 420949 420750 420852 421457 422616 423774 424316 424317 424325 424671 425490 427016 429184 431193 432269 432753 433565 434555 434372
60233 434372 432269 429208 426780 425794 426390 428639 432159 435691 438013 439165 440103 441411 443036 445076 447914
60218 447914 451479 455050 458101 460850 463829 467303 471237 475447 479613 483517 487446 492041 497579 503639
60204 503639 509656 515577 521768 528402 535155 541457 546967 551802 556301 560543 564243 567184 569544 571644
$$ packed form
60305D76528J0895J2918J4520J5745J6639J7037J6520J4728J1787Q358N061J984
60293F22720j092m160o897r050j0611j1594j1991j1961j1833j1765j1556j0945
60281E09265r883q556p257o281n717n175m065k335p42j17n41j493k537l462l915
60266D47189l541k572j780j634j880k109k260k332k060j389q49q98j202j112o22
60251D20949j99J02O05J159J158N42JQL46Q19J526K168K009J076M84Q12R90j83
60233D34372k103l061k428r86N96K249L520L532K322J152R38J308J625K040K838
60218D47914L565L571L051K749K979L474L934M210M166L904L929M595N538O060
60204E03639O017N921O191O634O753O302N510M835M499M242L700K941K360K100
$$ plain form
60190 571644 573551 575191 576642 577976 578879 578799 577426 574830 571255 567140 563190 559912 557050 553872 550105
60175 550105 546200 542672 539605 536890 534513 532377 530247 528108 526233 524693 523093 521074 518749 516423
60161 516423 514159 511974 510140 508887 507920 506712 505301 504448 504851 506346 508032 509078 509327 509157 508939 508790
60145 508790 508853 509521 511146 513639 516679 520184 524243 528627 532856 536864 541117 545805 550355 554101 557071
60130 557071 559675 561906 563429 564362 565322 566579 567701 568322 568880 570144 572182 574256 575786 577097 578960
60115 578960 581584 584331 586427 587718 588677 589889 591665 593909 596085 597422 597537 596864 596164 595569 594463
60100 594463 592457 590112 588359 587409 586563 585057 582861 580648 579226 579000 579759 580852 581691 582165 582602 583342
60084 583342 584407 585544 586515 587362 588428 590067 592237 594331 595490 595149 593365 590652 587478 583825 579254
$$ packed form
60190E71644J907J640J451J334R03q0j373k596l575m115l950l278k862l178l767
60175E50105l905l528l067k715k377k136k130k139j875j540j600k019k325k326
60161E16423k264k185j834j253r67j208j411q53M03J495J686J046K49j70k18j49
60145E08790O3O68J625K493L040L505M059M384M229M008M253M688M550L746K970
60130E57071K604K231J523R33R60J257J122O21N58J264K038K074J530J311J863
60115E78960K624K747K096J291R59J212J776K244K176J337J15o73p00n95j106
60100E94463k006k345j753r50q46j506k196k213j422k26P59J093Q39M74M37P40
60084E83342J065J137R71Q47J066J639K170K094J159l41j784k713l174l653m571
$$ plain form
60069 579254 573416 566517 559229 552205 545682 539447 533051 526171 518956 512006 505791 500121 494417 488493
60055 488493 482784 477716 473207 469046 465499 463165 462321 462663 463663 464874 465926 466579 467031 467960 469985
60040 469985 473087 476684 480251 483647 486848 489699 492155 494577 497389 500466 503209 505265 506793 507825
60026 507825 507816 506209 503159 499284 494904 489934 484411 478585 472514 466084 459481 453216 447588 442546 438178
60011 438178 434843 432605 430920 429149 427048 424633 422001 419535 417836 417058 416609 415895 415057 414573 414445 414292
59995 414292 414095 414308 415201 416500 417728 418605 419109 419436 420002 421228 423209 425649 428143 430455 432642 434989
59979 434989 437742 440717 443236 444558 444365 442869 440677 438574 437127 436301 435674 435062 434636 434345 433763 432757
59963 432757 431795 431221 430756 430248 430374 431864 434358 436856 439028 441215 443250 444355 444399 444342 445070 446518 448320
$$ packed form
60069E79254n838o899p288p024o523o235o396o880p215o950o215n670n704n924
60055D88493n709n068m509m161l547k334q44L42J000J211J052O53M52R29K025
60040D69985L102L597L567L396L201K851K456K422K812L077K743K056J528J032
60026E07825rj607l050l875m380m970n523n826o071o430o603o265n628n042m368
60011D38178l335k238j685j771k101k415k632k466j699p78m49p14q38m84j28j53
59995D14292j97K13Q93J299J228Q77N04L27N66J226J981K440K494K312K187K347
59979D34989K753K975K519J322j93j496k192k103j447q26o27o12m26k91n82j006
59963D32757r62n74m65n08J26J490K494K498K172K187K035J105M4n7P28J448J802
$$ plain form
59946 448320 450537 453184 455716 457660 459327 461147 462631 462750 461304 459283 457754 456854 455992 454699 453112
59931 453112 451707 450676 449575 447804 445482 443543 442742 442840 443121 443398 444027 445087 446120 446818 447515 448845
59915 448845 451216 454656 458827 463065 466781 470070 473628 477879 482401 486443 489808 492915 496215 499817
59901 499817 503510 506763 508824 509309 508783 508348 508468 508581 508095 507378 507356 508349 509818 511201 512511 514026 515835
59884 515835 517914 520302 522945 525580 528097 530794 533964 537380 540517 543189 545648 548029 550061 551386
59870 551386 551859 551383 549706 546682 542745 538906 536132 534612 533626 532194 529882 526912 523622 520215 517187
59855 517187 515497 515796 517622 519938 522473 525967 530985 537057 543281 549298 555225 560919 565839 569587
59841 569587 572163 573742 574535 574966 575649 576956 578640 579922 579953 578257 574904 570359 565193 559944 555115
$$ packed form
59946D48320K217K647K532J944J667J820J484J19j446k021j529r00q62j293j587
59931D53112j405j031j101j771k322j939q01R8K81K77O29J060J033O98O97J330
59915D48845K371L440M171M238L716L289L558M251M522M042L365L107L300L602
59901D99817L693L253K061M85n26m35J20J13m86p17k2R93J469J383J310J515J809
59884E15835K079K388K643K635K517K697L170L416L137K672K459K381K032J325
59870E51386M73m76j677l024l937l839k774j520r86j432k312k970l290l407l028
59855E17187j690K99J826K316K535L494N018O072O224O017N927N694M920L748
59841E69587K576J579P93M31O83J307J684J282L1j696l353m545n166n249m829
$$ plain form
59826 555115 551032 547588 544283 540626 536406 531562 526056 520075 514173 508934 504536 500772 497380 494227
59812 494227 491331 488934 487399 486789 486632 486329 485730 485068 484452 483742 482876 482018 481320 480766 480224 479433 478034
59795 478034 475903 473421 471074 468885 466586 464296 462449 461037 459554 457898 456653 456063 455366 453811 451873
59780 451873 450661 450319 449817 448334 446138 443959 442167 440832 439978 439408 438691 437681 436694 435854 434733 433121
59764 433121 431828 432069 434078 436828 439210 441118 443257 446189 449780 453435 456732 459790 463058 466778
59750 466778 470829 475085 479605 484319 488863 493060 497303 502019 506947 511437 515338 518992 522417 525173
59736 525173 527240 529374 532198 535442 538468 541067 543236 544657 545154 545466 546721 548998 551060 551824 551622
59721 551622 551627 552405 553505 554321 554841 555387 555890 555797 554735 553078 551645 550843 550317 549535 548505 547702 547426 547529
$$ packed form
59826E55115m083l444l305l657m220m844n506n981n902n239m398l764l392l153
59812D94227k896k397j535o10j57l03n99o62o16p10q66q58o98n54n42p91j399
59795D78034k131k482k347k189k299k290j847j412j483j656j245n90o97j555j938
59780D51873j212l42n02j483k196k179j792j335q54n70p17j010r87q40j121j612
59764D33121j293K41K009K750K382J908K139K932L591L655L297L058L268L720
59750D66778M051M256M520M714M544M197M243M716M928M490L901L654L425K756
59736E25173K067K134K824L244L026K599K169J421M97L12J255K277K062P64k02
59721E51622NP78J100Q16N20N46N03r3j062j657j433q02n26p82j030q03k76J03
$$ plain form
59703 547529 547744 547981 548286 548758 549598 550969 552693 554329 555765 557490 559960 562786 564923 565752 565733 565802 566266
59686 566266 566560 566095 565090 564366 564337 564443 563762 562101 560259 559080 558390 557167 554768 551665 548695 545856
59670 545856 542321 537684 532698 528490 525409 523019 520935 519099 517328 515231 512732 510214 507967 505923
59656 505923 504156 503154 503232 504037 505082 506472 508551 511044 513129 514399 515237 516145 517125 517858 518100 517677
59640 517677 516403 514281 511657 508994 506521 504125 501460 498167 494246 490325 487337 485757 485233 485009 484534
59625 484534 483609 482188 480291 478082 475858 473891 472270 470899 469640 468475 467419 466240 464427 461679
59611 461679 458354 455301 453223 452363 452634 453789 455471 457354 459274 461009 462062 461998 461025 459823 458672
59596 458672 457084 454566 451530 449211 448744 450302 452925 455128 455917 455369 454158 452714 451172 449982 449774
$$ packed form
59703E47529K15K37L05M72Q40J371J724J636J436J725K470K826K137Q29j9O9M64
59686E66266K94m65j005p24k9J06o81j661j842j179o90j223k399l103k970k839
59670E45856l535m637m986m208l081k390k084j836j771k097k499k518k247k044
59656E05923j767j002P8Q05J045J390K079K493K085J270Q38R08R80P33K42m23
59640E17677j274k122k624k663k473k396k665l293l921l921k988j580n24k24m75
59625D84534r25j421j897k209k224j967j621j371j259j165j056j179j813k748
59611D61679l325l053k078q60K71J155J682J883J920J735J053o4r73j202j151
59596D58672j588k518l036k319m67J558K623K203P89n48j211j444j542j190k08
$$ plain form
59581 449774 450353 450493 449283 447304 445863 445321 444811 443512 441545 439503 437646 435845 434017 432349 431136
59566 431136 430503 430223 429911 429518 429478 430148 431249 432150 432644 433089 433815 434759 435696 436514 437222 438009 439279 441265
59548 441265 443560 445520 447221 449501 452791 456450 459725 462963 467298 473434 481360 491073 502696 515617
59534 515617 528162 538606 546233 551164 553591 553753 552421 550726 549343 548217 547262 546936 547838 549878 552206
59519 552206 553899 554570 554434 554078 554160 554935 555897 556085 554930 552606 549356 544776 538276 530193 521885 514401
59503 514401 507450 500086 492194 484748 478611 473584 468896 464273 460234 457458 456112 455658 455107 453616 451138
59488 451138 448514 446715 446002 445975 446340 447309 449215 451989 455154 458155 460648 462651 464496 466509 468674
59473 468674 470737 472589 474319 475908 477218 478421 480129 482837 486412 490274 493860 496784 498930 500721
$$ packed form
59581D49774N79J40j210j979j441n42n10j299j967k042j857j801j828j668j213
59566D31136o33k80l12l93m0O70J101R01M94M45P26R44R37Q18P08P87J270J986
59548D41265K295J960J701K280L290L659L275L238M335O136P926R713J1623J2921
59534E15617J2545J0444P627M931K427J62j332j695j383j126r55l26R02K040K328
59519E52206J693O71j36l56Q2P75R62J88j155k324l250m580o500q083q308p484
59503E14401o951p364p892p446o137n027m688m623m039k776j346m54n51j491k478
59488D51138k624j799p13k7L65R69J906K774L165L001K493K003J845K013K165
59473D68674K063J852J730J589J310J203J708K708L575L862L586K924K146J791
$$ plain form
59459 500721 503015 506307 510169 513805 517047 520421 524406 529070 534390 540418 547035 553944 560992 568114
59445 568114 574844 580287 583808 585450 585515 584088 581280 577599 573593 569225 564031 557979 551861 546641 542533
59430 542533 538963 535385 531940 529152 527156 525573 524165 523269 523417 524900 528029 533461 541691 552300
59416 552300 564290 577229 591585 607892 626149 646126 667484 688947 707769 720868 726803 726617
59404 726617 722875 718094 713855 710791 709038 708601 709326 710577 711055 709119 703417 693547 680317 665282
59390 665282 649729 634101 618558 603749 590485 578703 567485 556345 545967 537333 530650 525523
59378 525523 521684 518931 516754 514731 513219 512970 514041 515596 516982 518534 521042 524705 528940 533154
59364 533154 537405 542103 547175 551875 555684 559138 563301 568499 574186 580131 586957 595083 603794 612085
$$ packed form
59459E00721K294L292L862L636L242L374L985M664N320O028O617O909P048P122
59445E68114O730N443L521J642O5j427k808l681m006m368n194o052o118n220m108
59430E42533l570l578l445k788j996j583j408q96J48J483L129N432Q230J0609
59416E52300J1990J2939J4356J6307J8257J9977K1358K1463J8822J3099N935j86
59404G26617l742m781m239l064j753m37P25J251M78j936n702r870j3230j5035
59390F65282j5553j5628j5543j4809j3264j1782j1218j1140j0378q634o683n127
59378E25523l839k753k177k023j512k49J071J555J386J552K508L663M235M214
59364E33154M251M698N072M700L809L454M163N198N687N945O826Q126Q711Q291
$$ plain form
59350 612085 620045 628694 638712 650045 662603 676485 691377 706399 720803 734469 747629 760488
59338 760488 773090 785075 795513 803448 808726 811815 812863 811512 807763 802312 795747 787962 778731
59325 778731 768393 757544 746460 735198 723925 712761 701636 690671 680333 670825 661707 652655
59313 652655 644249 637338 631831 626857 622045 617919 614955 613001 611900 612067 614015 617839 623603 631761
59299 631761 642437 654389 665331 673392 677939 679096 677122 672534 666291 659362 652194 644849 637394
59286 637394 629866 622096 614058 606289 599518 593891 588997 584655 581179 578761 577220 576657 577784 581116
59272 581116 586221 592338 599382 607689 616975 626356 635424 644532 653796 662499 669840 675670 680021 682422
59258 682422 682404 680428 677572 674279 669988 664152 657105 649658 642230 634753 627230 620053 613730 608455 603956
$$ packed form
59350F12085P960Q649J0018J1333J2558J3882J4892J5022J4404J3666J3160J2859
59338G60488J2602J1985J0438P935N278L089J048j351l749n451o565p785r231
59325G78731j0338j0849j1084j1262j1273j1164j1125j0965j0338r508r118r052
59313F52655q406o911n507m974m812m126k964j954j101J67J948L824N764Q158
59299F31761J0676J1952J0942Q061M547J157j974m588o243o929p168p345p455
59286F37394p528p770q038p769o771n627m894m342l476k418j541n63J127L332
59272E81116N105O117P044Q307R286R381R068R108R264Q703P341N830M351K401
59258F82422j8j976k856l293m291n836p047p447p428p477p523p177o323n275m499
$$ plain form
59243 603956 599715 595459 591513 588562 586965 586444 586594 587452 589206 591507 593592 595221 596975 599323 601786
59228 601786 603472 604188 604478 604687 604479 603368 601273 598473 595391 592505 589996 587323 583576 578578 573302
59213 573302 568998 566129 564329 562968 561481 559561 557424 555620 554315 553185 552339 552710 554854 557795 559910
59198 559910 560767 561214 561745 561829 561110 560328 560481 561653 563201 564604 565625 566043 565862 565673 566268 567846 569892
59181 569892 571733 572996 573660 574010 574537 575610 577201 579079 581197 583769 587034 591069 595710 600531 605083
59166 605083 609422 614295 620500 628079 636342 644644 652783 660608 667609 673220 677353 680290 682107 682503
59152 682503 681311 678880 675804 672396 668640 664491 659939 654883 649287 643464 637828 632311 626386 619846
59138 619846 613199 607022 601202 595112 588283 580678 572621 564865 558452 553989 551015 548470 545711 542874
$$ packed form
59243F03956m241m256l946k951j597n21J50Q58J754K301K085J629J754K348K463
59228F01786J686P16K90K09k08j111k095k800l082k886k509k673l747m998n276
59213E73302m304k869j800j361j487j920k137j804j305j130q46L71K144K941K115
59198E59910Q57M47N31Q4p19p82J53J172J548J403J021M18j81j89N95J578K046
59181E69892J841J263O64L50N27J073J591J878K118K572L265M035M641M821M552
59166F05083M339M873O205P579Q263Q302Q139P825P001N611M133K937J817L96
59152F82503j192k431l076l408l756m149m552n056n596n823n636n517n925o540
59138F19846o647o177n820o090o829p605q057p756o413m463k974k545k759k837
$$ plain form
59124 542874 540434 538825 538390 539255 541233 544132 548001 552805 558097 563487 569224 575733 582790 589824 596897
59109 596897 604554 612690 620438 627400 634097 640857 647123 652420 657249 662289 667202 671003 673257 674286
59095 674286 674459 674007 673302 672636 671762 670282 668500 667268 666848 666403 664862 661984 658462 655169 652428 649818
59079 649818 646608 642425 637466 631987 625862 618945 611665 604861 598969 593705 588528 583177 577692 572268
59065 572268 567213 562908 559607 557262 555566 554096 552471 550485 548104 545343 542279 539188 536468 534259
59051 534259 532294 530267 528201 526334 524826 523799 523437 523732 524205 524252 523775 523244 523067 523098 522830 521982 520802
59034 520802 519840 519418 519350 519266 519193 519600 520844 522879 525683 529634 535033 541403 547715 553449 559160 565836
59018 565836 573877 582797 591791 600408 608625 616394 623293 628769 632664 635357 637407 639198 640875 642393
$$ packed form
59124E42874k440j609m35Q65J978K899L869M804N292N390N737O509P057P034P073
59109E96897P657Q136P748O962O697O760O266N297M829N040M913L801K254J029
59095F74286J73m52p05o66q74j480j782j232m20m45j541k878l522l293k741k610
59079F49818l210m183m959n479o125o917p280o804n892n264n177n351n485n424
59065E72268n055m305l301k345j696j470j625j986k381k761l064l091k720k209
59051E34259j965k027k066j867j508j027l62K95M73M7m77n31j77L1k68q48j180
59034E20802r62m22o8q4p3M07J244K035K804L951N399O370O312N734N711O676
59018E65836Q041Q920Q994Q617Q217P769O899N476L895K693K050J791J677J518
$$ plain form
59004 642393 643574 644360 645072 646181 647768 649534 651477 654177 658129 663091 668376 673572 678623 683404 687669
58989 687669 691320 694317 696359 697067 696658 696025 695896 696044 695605 694219 692658 692111 692900 694194 695234 696563
58973 696563 699511 704487 710376 715951 721405 727990 736436 746263 756529 766761 777052 787699 798906
58960 798906 810561 822099 832697 841792 849388 855832 861279 865311 867006 865493 860646 853325 844848
58947 844848 836140 827220 817428 806181 793681 780898 768747 757335 746100 734586 722872 711402
58935 711402 700789 691680 684366 678456 673303 668802 665331 662880 660833 658821 657205 656338 655853 655138 654137
58920 654137 653170 652233 650944 649089 646879 644789 643348 642869 643143 643619 644042 644628 645509 646481 647587 649473
58904 649473 652787 657589 663654 670895 679109 687831 696885 706600 717070 727771 738482 749902 762590
$$ packed form
59004F42393J181P86P12J109J587J766J943K700L952M962N285N196N051M781M265
58989F87669L651K997K042P08m09o33j29J48m39j386j561n47P89J294J040J329
58973F96563K948M976N889N575N454O585Q446R827J0266J0232J0291J0647J1207
58960G98906J1655J1538J0598R095P596O444N447M032J695j513m847p321q477
58947H44848q708q920r792j1247j2500j2783j2151j1412j1235j1514j1714j1470
58935G11402j0613r109p314n910n153m501l471k451k047k012j616q67m85p15j001
58920F54137r67r37j289j855k210k090j441m79K74M76M23N86Q81R72J106J886
58904F49473L314M802O065P241Q214Q722R054R715J0470J0701J0711J1420J2688
$$ plain form
58891 762590 775842 788569 800966 814393 829791 847029 865468 884270 902330 918926 934432
58880 934432 949544 963921 976434 986602 994692 1000435 1002863 1001676 997745 991901 984207 974761 964267
58867 964267 953226 941419 928747 915951 903954 893004 882837 873019 862754 851130 838154 825035
58855 825035 812859 801466 790080 778484 766997 755773 744736 733905 723350 713113 703498 695000
58843 695000 687597 680622 673756 667501 662141 656856 650636 643560 636413 629432 622362 615507 609697 605123
58829 605123 601007 596668 592371 588912 586808 586028 586124 586507 586914 587653 589150 591256 593334 595070 596830 599167
58813 599167 602259 605903 609815 613793 617812 622022 626494 630840 634183 635640 634950 632742 630144 627953
58799 627953 626123 624123 621706 619001 615927 611991 606886 600928 594673 588466 582589 577473 573380 570109
$$ packed form
58891G62590J3252J2727J2397J3427J5398J7238J8439J8802J8060J6596J5506
58880I34432J5112J4377J2513J0168Q090N743K428j187l931n844p694r446j0494
58867I64267j1041j1807j2672j2796j1997j0950j0167r818j0265j1624j2976j3119
58855H25035j2176j1393j1386j1596j1487j1224j1037j0831j0555j0237r615q498
58843F95000p403o975o866o255n360n285o220p076p147o981p070o855n810m574
58829F05123m116m339m297l459k104p80R6L83M07P39J497K106K078J736J760K337
58813E99167L092L644L912L978M019M210M472M346L343J457o90k208k598k191
58799F27953j830k000k417k705l074l936n105n958o255o207n877n116m093l271
$$ plain form
58785 570109 567352 565092 563391 562108 561194 560940 561495 562410 563198 564070 565588 567665 569485 570309 569868 568090
58769 568090 565126 561689 558693 556269 553669 550371 546835 543841 541500 539358 537154 535008 533009 531034
58755 531034 529031 527181 525788 525161 525589 527149 529479 531964 534248 536460 538867 541481 544161 546944 550028
58740 550028 553476 557212 561331 566118 571618 577413 583042 588392 593511 598306 602808 607485 612800 618524
58726 618524 623942 628740 633163 637215 640383 642464 644228 646755 650381 654667 659210 664076 669504 675577
58712 675577 682204 689140 695952 702123 707287 711380 714622 717276 719239 719893 718574 715252 710412 704222
58698 704222 696166 685727 673173 659436 645419 631583 617952 604301 590554 577236 565282 555138
58686 555138 546312 538015 530011 522519 515594 509119 503246 498357 494529 491378 488533 486011 484018 482542
$$ packed form
58785E70109k757k260j701j283r14k54N55R15P88Q72J518K077J820Q24m41j778
58769E68090k964l437k996k424k600l298l536k994k341k142k204k146j999j975
58755E31034k003j850j393o27M28J560K330K485K284K212K407K614K680K783L084
58740E50028L448L736M119M787N500N795N629N350N119M795M502M677N315N724
58726F18524N418M798M423M052L168K081J764K527L626M286M543M866N428O073
58712F75577O627O936O812O171N164M093L242K654J963O54j319l322m840o190
58698G04222q056j0439j2554j3737j4017j3836j3631j3651j3747j3318j1954j0144
58686E55138q826q297q004p492o925o475n873m889l828l151k845k522j993j476
$$ plain form
58672 482542 481258 479829 478389 477696 478612 481257 484847 488541 492326 496845 502505 508943 515272 520689 524906
58657 524906 528127 530578 532039 532073 530744 528746 526667 524397 521517 517977 514121 510265 506534 502835 498731
58642 498731 493730 488118 483177 479993 478216 476595 474622 473032 472617 473194 474010 474665 475259 475968 476881 478115
58626 478115 479727 481491 482960 483847 484279 484637 485224 486171 487582 489621 492322 495508 499206 504057 510865
58611 510865 519528 528765 537225 544675 551750 558649 564520 568238 569592 569577 569555 570112 570683 570327 568782 566586
58595 566586 564288 562012 559895 558401 557752 557347 556349 554811 553771 554215 556256 559413 563302 567922 573430
58580 573430 579806 586687 593533 600022 606270 612604 619218 626126 633302 640619 647821 654810 662040 670404
58566 670404 680654 692945 706933 722179 738465 755759 773948 792750 812026 831990 852741
$$ packed form
58672D82542j284j429j440o93R16K645L590L694L785M519N660O438O329N417M217
58657E24906L221K451J461L4j329j998k079k270k880l540l856l856l731l699m104
58642D98731n001n612m941l184j777j621j973j590m15N77Q16O55N94P09R13J234
58626D78115J612J764J469Q87M32L58N87R47J411K039K701L186L698M851O808
58611E10865Q663R237Q460P450P075O899N871L718J354j5k2N57N71l56j545k196
58595E66586k298k276k117j494o49m05r98j538j040M44K041L157L889M620N508
58580E73430O376O881O846O489O248O334O614O908P176P317P202O989P230Q364
58566F70404J0250J2291J3988J5246J6286J7294J8189J8802J9276J9964K0751
$$ plain form
58555 852741 873489 892600 908695 921495 931422 938657 942969 944417 943789 942173 940163 937553 933786
58542 933786 928613 922307 915308 907855 899970 891536 882126 871014 857776 842851 827147 811195 795081
58529 795081 779175 764354 751320 740029 729939 720550 711735 703938 698062 694707 693455 693250 693414
58516 693414 693775 693923 693237 691807 690518 689850 689233 687928 685824 682991 679222 674572 669760 665466 661792
58501 661792 658850 657086 656298 655078 652202 648221 644776 642684 641507 640721 640320 640318 640505 640837 641464 642410 643751
58484 643751 646003 649698 654620 660047 665787 672403 680382 689520 699231 709088 719096 729659 741095
58471 741095 752817 763248 771017 776020 778928 779920 778578 774902 769828 764672 760437 757544 755776 754498
58457 754498 753315 752540 752810 754470 757562 762134 768116 775091 782521 789932 796634 801698 804678 806031 806378
$$ packed form
58555H52741K0748J9111J6095J2800R927P235M312J448o28j616k010k610l767
58542I33786n173o306o999p453p885q434r410j1112j3238j4925j5704j5952j6114
58529G95081j5906j4821j3034j1291j0090r389q815p797n876l355j252k05J64
58516F93414L61J48o86j430j289o68o17j305k104k833l769m650m812m294l674
58501F61792k942j764p88j220k876l981l445k092j177p86m01kJ87L32O27R46J341
58484F43751K252L695M922N427N740O616P979R138R711R857J0008J0563J1436
58471G41095J1722J0431P769N003K908R92j342l676n074n156m235k893j768j278
58457G54498j183p75K70J660L092M572N982O975P430P411O702N064K980J353L47
$$ plain form
58442 806378 805723 803784 800658 796669 791996 786996 782461 778933 776198 773923 772297 771476 771087 771021 772065
58427 772065 774808 778522 782208 786210 791614 798432 805651 812827 820250 827534 833422 837257 839559 840935
58413 840935 841387 840960 840049 838712 836529 833467 830133 826823 823029 818197 812419 806174 799964 794395 790048
58398 790048 787041 785117 784135 784092 784815 786190 788541 792111 796361 800446 804220 808028 811785 815156 818467
58383 818467 822411 826854 830849 833892 836269 838181 839501 840546 842165 844886 848695 853694 860125 867634
58369 867634 875338 882814 890332 898200 906662 916334 927731 940299 952849 965058 977666 991134 1005052
58356 1005052 1019020 1033136 1047392 1061361 1074639 1086931 1097763 1106950 1115292 1123898 1132823 1141174
58344 1141174 1148470 1155000 1161012 1166616 1172367 1178944 1186347 1194428 1203881 1215424 1228232 1240663 1252519
$$ packed form
58442H06378o55j939l126l989m673n000m535l528k735k275j626q21l89o6J044
58427G72065K743L714L686M002N404O818P219P176P423P284N888L835K302J376
58413H40935M52m27r11j337k183l062l334l310l794m832n778o245o210n569m347
58398G90048l007j924r82m3P23J375K351L570M250M085L774L808L757L371L311
58383H18467L944M443L995L043K377J912J320J045J619K721L809M999O431P509
58369H67634P704P476P518P868Q462R672J1397J2568J2550J2209J2608J3468J3918
58356A005052J3968J4116J4256J3969J3278J2292J0832R187Q342Q606Q925Q351
58344A141174P296O530O012N604N751O577P403Q081R453J1543J2808J2431J1856
$$ plain form
58331 1252519 1265183 1279486 1294916 1310941 1327489 1343890 1358984 1372830 1386870 1401872 1416874
58320 1416874 1430535 1442362 1452491 1461590 1471192 1482620 1495219 1507061 1517731 1529033 1542630 1558434
58308 1558434 1575621 1593656 1611933 1629964 1648362 1668157 1688839 1708707 1727532 1747045 1768343
58297 1768343 1790691 1813508 1837602 1863558 1890735 1918779 1948437 1979958 2012278 2044719 2077915
58286 2077915 2112258 2147133 2182548 2219700 2258859 2298500 2337751 2378125 2421579 2468274 2517306
58275 2517306 2568178 2620404 2673156 2726470 2781668 2839709 2900347 2963420 3029330 3097638 3167116
58264 3167116 3237957 3312066 3390310 3471437 3554490 3640135 3728635 3818872 3910620 4005518 4104443
58253 4104443 4206043 4309240 4415036 4524444 4636902 4752266 4872328 4998799 5131751
$$ packed form
58331A252519J2664J4303J5430J6025J6548J6401J5094J3846J4040J5002J5002
58320A416874J3661J1827J0129R099R602J1428J2599J1842J0670J1302J3597J5804
58308A558434J7187J8035J8277J8031J8398J9795K0682J9868J8825J9513K1298
58297A768343K2348K2817K4094K5956K7177K8044K9658L1521L2320L2441L3196
58286B077915L4343L4875L5415L7152L9159L9641L9251M0374M3454M6695M9032
58275B517306N0872N2226N2752N3314N5198N8041O0638O3073O5910O8308O9478
58264C167116P0841P4109P8244Q1127Q3053Q5645Q8500R0237R1748R4898R8925
58253D104443J01600J03197J05796J09408J12458J15364J20062J26471J32952
$$ plain form
58244 5131751 5271266 5418482 5573756 5736183 5906228 6086406 6278106 6480403 6693294
58235 6693294 6919085 7159075 7412014 7677633 7958648 8257493 8574289 8909809 9266904
58226 9266904 9646945 10048492 10471702 10920378 11397392 11902241 12435714 13002898 13608738
58217 13608738 14254923 14944130 15682934 16477552 17331658 18251967 19251172 20342052 21534327
58208 21534327 22841481 24285222 25889551 27677404 29678873 31937705 34507376 37451905
58200 37451905 40860879 44860778 49610370 55298141 62154636 70459936 80529676 92691840
58192 92691840 107257536 124467555 144431124 167097662 192207506 219084038 246309838
58185 246309838 271655094 292595558 307213556 314811226 315801734 311133417 301822443 288834322
$$ packed form
58244E131751J39515J47216J55274J62427J70045J80178J91700K02297K12891
58235F693294K25791K39990K52939K65619K81015K98845L16796L35520L57095
58226I266904L80041M01547M23210M48676M77014N04849N33473N67184O05840
58217A3608738O46185O89207P38804P94618Q54106R20309R99205J090880J192275
58208B1534327J307154J443741J604329J787853K001469K258832K569671K944529
58200C7451905L408974L999899M749592N687771O856495Q305300J0069740J2162164
58192I2691840J4565696J7210019J9963569K2666538K5109844K6876532K7225800
58185B46309838K5345256K0940464J4617998P597670R90508m668317r310974j2988121
$$ plain form
58177 288834322 273113127 255538184 236837451 217574552 198204502 179118578 160656079
58170 160656079 143107887 126713511 111643533 97988243 85771455 74970911 65523519
58163 65523519 57328226 50263839 44208007 39039179 34632876 30869921 27648082 24881402
58155 24881402 22493672 20419672 18609053 17022403 15625280 14389251 13293733 12320939
58147 12320939 11451591 10669340 9965211 9332855 8762631 8244553 7773286 7345285 6953883
58138 6953883 6591814 6256049 5945687 5657469 5387592 5135684 4902562 4685780 4481369
58129 4481369 4288404 4108001 3939184 3779361 3627694 3484667 3349390 3220452 3098396
58120 3098396 2984428 2877674 2776366 2680576 2591107 2506733 2425246 2346327 2270983 2199069 2129722
$$ packed form
58177B88834322j5721195j7574943j8700733j9262899j9370050j9085924j8462499
58170A60656079j7548192j6394376j5069978j3655290j2216788j0800544r447392
58163F5523519q195293p064387o055832n168828m406303l762955l221839k766680
58155B4881402k387730k074000j810619j586650j397123j236029j095518r72794
58147A2320939q69348p82251p04129o32356n70224n18078m71267m28001l91402
58138F953883l62069l35765l10362k88218k69877k51908k33122k16782k04411
58129D481369j92965j80403j68817j59823j51667j43027j35277j28938j22056
58120C098396j13968j06754j01308r5790q9469q4374q1487p8919p5344p1914o9347
$$ plain form
58109 2129722 2063304 2000585 1940887 1883177 1828118 1776898 1728899 1682555 1637684 1595043 1554466
58098 1554466 1515382 1478270 1443683 1410651 1377862 1345686 1315364 1287104 1260522 1235870 1213103
58087 1213103 1190854 1168167 1146221 1126569 1108756 1091467 1074902 1059954 1046005 1031616 1016680
58076 1016680 1001965 987323 972258 957510 944059 931173 917339 902541 887784 873038 857631
58065 857631 842150 827925 814982 802440 790557 780400 771675 762850 753445 744430 736266 728197 719680
58052 719680 711063 702680 694507 686781 679832 673313 666607 659766 653020 645769 637320 628333 620200 613158
58038 613158 606289 599169 592245 585643 578877 571817 564810 557787 550205 541894 533198 524381 515595 507145
58024 507145 499029 490599 481536 472723 465256 459063 453402 448186 443765 439896 436088 432638 430229 428808
$$ packed form
58109B129722o6418o2719n9698n7710n5059n1220m7999m6344m4871m2641m0577
58098A554466l9084l7112l4587l3032l2789l2176l0322k8260k6582k4652k2767
58087A213103k2249k2687k1946j9652j7813j7289j6565j4948j3949j4389j4936
58076A016680j4715j4642j5065j4748j3451j2886j3834j4798j4757j4746j5407
58065H57631j5481j4225j2943j2542j1883j0157q725q825r405r015q164q069q517
58052G19680q617q383q173p726o949o519o706o841o746p251q449q987q133p042
58038F13158o869p120o924o602o766p060p007p023p582q311q696q817q786q450
58024E07145q116q430r063q813p467o193n661n216m421l869l808l450k409j421
$$ plain form
58010 428808 427818 427101 426626 425811 424237 422601 421814 421635 421320 421137 421925 423538 425073 426364 427955 429732
57994 429732 430866 431018 430430 428993 426384 423072 419987 417200 413897 409585 404407 398498 392091 386085 381477
57979 381477 378253 375679 373340 371051 368284 364858 361766 360020 359009 357233 354411 351590 349557 348518
57965 348518 348948 351088 353666 354796 354331 353930 354667 356000 357235 358487 359842 360925 361706 362511 363034 362581
57949 362581 361542 361221 361828 362026 360996 359650 359246 360030 361859 364880 368781 372517 375719 379481 384906
57934 384906 391631 398637 405733 413330 421313 429017 435966 441881 446270 448739 449578 449527 448988 447791 445547
57919 445547 441965 436975 430815 424014 417218 410978 405459 400162 394298 387777 381477 376102 371285 366486
57905 366486 362206 359343 357599 355644 352772 349429 346132 342958 340239 338652 338273 338372 338462 338776 339449 340025
$$ packed form
58010D28808r90p17m75q15j574j636p87j79l15j83P88J613J535J291J591J777
57994D29732J134J52n88j437k609l312l085k787l303m312n178n909o407o006m608
57979C81477l224k574k339k289k767l426l092j746j011j776k822k821k033j039
57965C48518M30K140K578J130m65m01P37J333J235J252J355J083P81Q05N23m53
57949C62581j039l21O07J98j030j346m04P84J829L021L901L736L202L762N425
57934C84906O725P006P096P597P983P704O949N915M389K469Q39n1n39j197k244
57919D45547l582m990o160o801o796o240n519n297n864o521o300n375m817m799
57905C66486m280k863j744j955k872l343l297l174k719j587l79R9R0L14O73N76
$$ plain form
57889 340025 340103 339867 339738 340050 341096 342852 344601 345573 346026 346923 348491 349937 350646 350769 350479 349599 348190
57872 348190 346650 344905 342382 339046 335712 332990 330654 328297 325888 323481 321096 319054 317677 316559
57858 316559 315002 313209 312122 311996 312245 312837 314540 317356 320023 321676 322879 324273 325358 325519 325327
57843 325327 325794 326968 328108 328691 328539 327549 325983 324497 323282 321742 319620 317710 316761 316344 315565 314365
57827 314365 313322 312693 312389 312501 313153 314253 315906 318565 322176 325810 328863 332013 336109 340672 344390
57812 344390 346701 347947 348304 347569 345870 343693 341206 338317 335299 332592 330019 326960 323410 320189 317950
57797 317950 316439 314900 312844 310359 307901 305839 304048 302134 300161 298769 298256 297986 297135 295642 293906
57782 293906 291992 289841 287960 287137 287527 288689 290442 292981 296189 299543 302841 306341 309909 312630 313735
$$ packed form
57889C40025P8k36j29L12J046J756J749R72M53Q97J568J446P09J23k90q80j409
57872C48190j540j745k523l336l334k722k336k357k409k407k385k042j377j118
57858C16559j557j793j087j26K49N92J703K816K667J653J203J394J085J61j92
57843C25327M67J174J140N83j52r90j566j486j215j540k122j910r49m17p79j200
57827C14365j043o29l04J12O52J100J653K659L611L634L053L150M096M563L718
57812C44390K311J246L57p35j699k177k487k889l018k707k573l059l550l221k239
57797C17950j511j539k056k485k458k062j791j914j973j392n13k70q51j493j736
57782B93906j914k151j881q23L90J162J753K539L208L354L298L500L568K721J105
$$ plain form
57767 313735 313580 313315 313707 314568 315250 315407 315175 314787 314202 313236 311971 310852 310357 310724 312005 314157 316991
57750 316991 320261 323951 328284 333293 338542 343394 347454 350606 352708 353502 352919 351459 350066 349300 348634
57735 348634 346962 344025 340846 338411 336445 334123 331512 329468 328353 327763 327408 327312 327181 326568 325803 325759
57719 325759 326454 326901 326661 326552 327366 328790 330105 330987 331101 329860 327352 324586 322082 319072 314988 310859
57703 310859 308085 306444 304499 301563 298166 294917 292070 290102 289526 289968 290288 289789 288663 287291 285803
57688 285803 284405 283438 282962 282801 282988 283676 284651 285538 286528 288343 291471 295910 301741 309478 319792 333315
57672 333315 350703 372421 398395 428307 462215 500352 541910 584081 622435 652389 670868
57661 670868 677227 672946 660507 642480 621185 598292 574293 548851 522074 495167 469559 445883
$$ packed form
57767C13735j55k65L92Q61O82J57k32l88n85r66j265j119m95L67J281K152K834
57750C16991L270L690M333N009N249M852M060L152K102P94n83j460j393p66o66
57735C48634j672k937l179k435j966k322k611k044j115n90l55r6j31o13p65m4
57719C25759O95M47k40j09Q14J424J315Q82J14j241k508k766k504l010m084m129
57703C10859k774j641j945k936l397l249k847j968n76M42L20m99j126j372j488
57688B85803j398r67m76j61J87O88R75Q87R90J815L128M439N831P737J0314J3523
57672C33315J7388K1718K5974K9912L3908L8137M1558M2171L8354K9954J8479
57661F70868O359m281j2439j8027k1295k2893k3999k5442k6777k6907k5608k3676
$$ plain form
57649 445883 424195 404566 386915 370762 355825 342527 331317 321967 314185 308426 305173 303723
57637 303723 302668 301445 300519 300135 299853 299429 299238 299546 300031 300297 300322 300206 299897 299319 298384 296885 294835 292760
57619 292760 291142 289666 287722 285566 284157 283701 283194 281798 280020 279014 279164 279785 280019 279677 279294 279536
57603 279536 280478 281469 281883 281803 281667 281422 280562 279017 277419 276298 275391 273979 271700 268920 266441 264817
57587 264817 263814 262688 261154 259796 259214 259151 258965 258647 258711 259221 259664 259745 259689 259731 259884 260164 260415 259953 258160
57568 258160 255514 253283 252006 250992 249539 247937 246845 246330 246031 245845 245944 246379 247102 248136 249434 250745
57552 250745 251918 253148 254739 256741 258921 260872 262079 262167 261287 260147 259534 259844 260925 262224 263250
57537 263250 264183 265748 268172 270589 272068 272980 274554 277155 279848 281818 283330 284966 286695 288240 289748
$$ packed form
57649D45883k1688j9629j7651j6153j4937j3298j1210r350p782n759l253j450
57637C03723j055j223r26l84k82m24j91L08M85K66K5j16l09n78r35j499k050k075
57619B92760j618j476j944k156j409m56n07j396j778j006J50O21K34l42l83K42
57603B79536R42R91M14q0j36k45q60j545j598j121r07j412k279k780k479j624
57587B64817j003j126j534j358n82o3j86l18O4N10M43Q1n6M2J53K80K51m62j793
57568B58160k646k231j277j014j453j602j092n15k99j86R9M35P23J034J298J311
57552B50745J173J230J591K002K180J951J207Q8q80j140o13L10J081J299J026
57537B63250R33J565K424K417J479R12J574K601K693J970J512J636J729J545J508
$$ plain form
57522 289748 291494 293339 295057 296916 299417 302551 305763 308564 310934 313166 315554 318080 320254 321355
57508 321355 320973 319242 316588 313468 310372 307675 305292 302687 299385 295381 291086 287106 284043 282092
57494 282092 280765 279380 277935 277198 277795 279523 281632 283492 284854 285864 287008 288812 291456 294856 299108
57479 299108 304463 310780 317386 323655 329461 335030 340684 346809 353671 361044 368337 375220 381877 388582
57465 388582 395329 402008 408615 415177 421742 428480 435492 442536 449273 455782 462413 469135 475447 480969
57451 480969 485672 489579 492843 496213 500698 506418 512307 517257 521253 525114 529529 534602 540033 545436
57437 545436 550657 555898 561309 566585 571320 575627 579899 584048 587669 590929 594552 598833 603427 608283
57423 608283 613885 620336 627055 633826 641284 649810 658710 667110 675002 682712 690072 696913 703854 711696
$$ packed form
57522B89748J746J845J718J859K501L134L212K801K370K232K388K526K174J101
57508C21355l82j731k654l120l096k697k383k605l302m004m295l980l063j951
57494B82092j327j385j445p37N97J728K109J860J362J010J144J804K644L400M252
57479B99108N355O317O606O269N806N569N654O125O862P373P293O883O657O705
57465C88582O747O679O607O562O565O738P012P044O737O509O631O722O312N522
57451D80969M703L907L264L370M485N720N889M950L996L861M415N073N431N403
57437E45436N221N241N411N276M735M307M272M149L621L260L623M281M594M856
57423F08283N602O451O719O771P458Q526Q900Q400P892P710P360O841O941P842
$$ plain form
57409 711696 720350 729127 737818 746721 755768 764426 772450 780167 788010 796197 804795 813702 822632 831419
57395 831419 840288 849625 859682 870620 882477 894945 907635 920840 935432 951676 968724 985765
57383 985765 1002965 1020673 1038288 1054745 1069607 1082985 1094913 1105682 1116322 1127719 1139531
57372 1139531 1150892 1161874 1173201 1184770 1195723 1206052 1216904 1228978 1241699 1254431 1267542
57361 1267542 1281697 1296788 1312190 1327595 1343054 1358620 1374409 1390668 1407427 1424351 1441266
57350 1441266 1458522 1476559 1495383 1514735 1534504 1554740 1575451 1596611 1618150 1639846 1661521
57339 1661521 1683472 1706337 1730336 1754981 1779831 1805198 1831688 1859123 1886364 1912345 1937177
57328 1937177 1962083 1988236 2015735 2043838 2072124 2101091 2131487 2163427 2196556 2230749 2266115
$$ packed form
57409G11696Q654Q777Q691Q903R047Q658Q024P717P843Q187Q598Q907Q930Q787
57395H31419Q869R337J0057J0938J1857J2468J2690J3205J4592J6244J7048J7041
57383I85765J7200J7708J7615J6457J4862J3378J1928J0769J0640J1397J1812
57372A139531J1361J0982J1327J1569J0953J0329J0852J2074J2721J2732J3111
57361A267542J4155J5091J5402J5405J5459J5566J5789J6259J6759J6924J6915
57350A441266J7256J8037J8824J9352J9769K0236K0711K1160K1539K1696K1675
57339A661521K1951K2865K3999K4645K4850K5367K6490K7435K7241K5981K4832
57328A937177K4906K6153K7499K8103K8286K8967L0396L1940L3129L4193L5366
$$ plain form
57317 2266115 2302378 2338855 2375118 2411213 2447175 2482827 2518184 2553615 2589369 2625358 2661643
57306 2661643 2698772 2737307 2777274 2818317 2860187 2902791 2945963 2989471 3033149 3076825 3120195
57295 3120195 3162996 3205242 3247141 3288746 3329784 3369881 3409004 3447697 3486766 3526643 3567244
57284 3567244 3608682 3651915 3698280 3748379 3801760 3857644 3915493 3974740 4034501 4093908 4152388
57273 4152388 4209303 4263736 4315209 4364562 4413574 4463555 4514594 4566124 4617740 4669283 4720672
57262 4720672 4772223 4824869 4879430 4935540 4991845 5047525 5103161 5159750 5217270 5274757 5331452
57251 5331452 5387159 5441628 5494483 5545992 5597163 5648589 5699785 5750108 5799794 5849512 5899342
57240 5899342 5948882 5998014 6046772 6094656 6140950 6185809 6230238 6274843 6319283 6363245 6407205
$$ packed form
57317B266115L6263L6477L6263L6095L5962L5652L5357L5431L5754L5989L6285
57306B661643L7129L8535L9967M1043M1870M2604M3172M3508M3678M3676M3370
57295C120195M2801M2246M1899M1605M1038M0097L9123L8693L9069L9877M0601
57284C567244M1438M3233M6365N0099N3381N5884N7849N9247N9761N9407N8480
57273D152388N6915N4433N1473M9353M9012M9981N1039N1530N1616N1543N1389
57262D720672N1551N2646N4561N6110N6305N5680N5636N6589N7520N7487N6695
57251E331452N5707N4469N2855N1509N1171N1426N1196N0323M9686M9718M9830
57240E899342M9540M9132M8758M7884M6294M4859M4429M4605M4440M3962M3960
$$ plain form
57229 6407205 6451725 6496519 6540893 6584893 6629384 6674933 6721139 6767227 6812961 6858727 6904936
57218 6904936 6951676 6998929 7046797 7095321 7144246 7193210 7242076 7290882 7339603 7388233 7437030
57207 7437030 7486205 7535312 7583421 7630055 7675563 7720323 7764011 7805918 7845512 7882270 7915433
57196 7915433 7944531 7969932 7992343 8011914 8028310 8041432 8051544 8058877 8063707 8066725 8068629 8069356
57184 8069356 8068246 8065015 8059956 8053121 8043923 8031791 8016729 7999007 7978720 7955884 7930593 7902945
57172 7902945 7873119 7841624 7809165 7776248 7743405 7711841 7683243 7658735 7638542 7622930 7612722
57161 7612722 7608288 7608474 7611215 7615055 7619367 7623166 7624299 7620157 7608813 7589395 7561700 7526014 7483385
57148 7483385 7435872 7386187 7336960 7290160 7246953 7207749 7172211 7139384 7107955 7076411 7043044
$$ packed form
57229F407205M4520M4794M4374M4000M4491M5549M6206M6088M5734M5766M6209
57218F904936M6740M7253M7868M8524M8925M8964M8866M8806M8721M8630M8797
57207G437030M9175M9107M8109M6634M5508M4760M3688M1907L9594L6758L3163
57196G915433K9098K5401K2411J9571J6396J3122J0112P333M830L018J904P27
57184H069356j110l231n059o835r198j2132j5062j7722k0287k2836k5291k7648
57172G902945k9826l1495l2459l2917l2843l1564k8598k4508k0193j5612j0208
57161G612722m434J86K741L840M312L799J133m142j1344j9418k7695l5686m2629
57148G483385m7513m9685m9227m6800m3207l9204l5538l2827l1429l1544l3367
$$ plain form
57137 7043044 7006292 6965521 6921436 6875581 6829601 6785118 6743821 6706880 6674102 6643985 6614726
57126 6614726 6585062 6554467 6523123 6491901 6461912 6433823 6407540 6382442 6357631 6332206 6305851
57115 6305851 6279360 6254283 6232088 6213961 6201379 6196386 6201177 6217795 6248309 6295037 6360623 6448522
57103 6448522 6563732 6713005 6904536 7148153 7456282 7844706 8332624 8942533 9700186
57094 9700186 10633762 11771851 13140817 14761922 16647995 18800040 21205338 23837853
57086 23837853 26660327 29627221 32688112 35790408 38879354 41894735 44766772 47415324
57078 47415324 49755281 51707975 53214662 54245475 54799112 54894772 54562678 53837434 52753227
57069 52753227 51338824 49614256 47592879 45288987 42726615 39944890 36998184 33951901
$$ packed form
57137G043044l6752m0771m4085m5855m5980m4483m1297l6941l2778l0117k9259
57126F614726k9664l0595l1344l1222k9989k8089k6283k5098k4811k5425k6355
57115F305851k6491k5077k2195j8127j2582m993M791J6618L0514M6728O5586Q7899
57103F448522J15210J49273J91531K43617L08129L88424M87918O09909P57653
57094I700186R33576J138089J368966J621105J886073K152045K405298K632515
57086B3837853K822474K966894L060891L102296L088946L015381K872037K648552
57078D7415324K339957J952694J506687J030813N53637R5660l32094p25244j084207
57069E2753227j414403j724568k021377k303892k562372k781725k946706l046283
$$ plain form
57061 33951901 30876002 27838662 24901846 22118725 19531740 17170541 15050564 13173447
57053 13173447 11529662 10102255 8870116 7810106 6898768 6114248 5437818 4854023 4349826
57044 4349826 3913888 3536261 3208039 2921196 2669154 2447342 2252514 2081458 1930910
57035 1930910 1798745 1684379 1587653 1507824 1443880 1395153 1361228 1341790 1336623 1344596 1361543
57024 1361543 1379591 1389853 1386488 1368431 1337911 1297923 1250703 1197554 1139475 1077840 1014363
57013 1014363 950469 887082 825179 766037 710575 658899 610920 566978 527329 491388 458175
57002 458175 427345 399180 373699 350427 329072 309850 292940 277996 264343 251539 239727
56991 239727 229535 221523 215615 211339 208714 208483 211107 215884 221526 227308 233103 238519 242637 244621
$$ packed form
57061C3951901l075899l037340k936816k783121k586985k361199k119977j877117
57053A3173447j643785j427407j232139j060010r11338p84520o76430n83795n04197
57044D349826m35938l77627l28222k86843k52042k21812j94828j71056j50548
57035A930910j32165j14366r6726p9829o3944m8727l3925j9438n167P973J6947
57024A361543J8048J0262l365j8057l0520l9988m7220n3149n8079o1635o3477
57013A014363o3894o3387o1903n9142n5462n1676m7979m3942l9649l5941l3213
57002D58175l0830k8165k5481k3272k1355j9222j6910j4944j3653j2804j1812
56991B39727j0192q012n908m276k625k31K624M777N642N782N795N416M118J984
$$ plain form
56977 244621 244208 241674 237722 233330 229148 224992 220316 215192 210446 206769 204097 202061 200764 200918 203258
56962 203258 207955 214652 223146 233887 247445 263415 280124 295553 308209 317133 321775 322360 319898
56949 319898 315306 308760 300292 290503 280156 269506 258713 248563 239990 233104 227502 223471 222112
56936 222112 224233 229847 238749 250847 265705 282360 299717 316525 330875 340540 344340 342817 337397
56923 337397 329244 319095 307569 295131 281914 267868 252937 237149 220863 205015 190664 178113
56911 178113 166858 156540 147538 140385 135009 130873 127596 125067 123174 121753 120765 120326 120618 121795
56897 121795 123901 126841 130586 135396 141670 149563 158976 169882 182467 196951 213428 231638 250488
56884 250488 267882 281649 290884 296158 298468 298423 296439 292999 288274 281939 273837 264681 255780 248248
$$ packed form
56977B44621m13k534l952m392m182m156m676n124m746l677k672k036j297J54K340
56962B03258M697O697Q494J0741J3558J5970J6709J5429J2656Q924M642N85k462
56949C19898m592o546q468r789j0347j0650j0793j0150q573o886n602m031j359
56936B22112K121N614Q902J2098J4858J6655J7357J6808J4350R665L800j523n420
56923C37397q153j0149j1526j2438j3217j4046j4931j5788j6286j5848j4351j2551
56911A78113j1255j0318r002p153n376m136l277k529j893j421r88m39K92J177
56897A21795K106K940L745M810O274P893R413J0906J2585J4484J6477J8210J8850
56884B50488J7394J3767R235N274K310m5j984l440m725o335q102r156q901p532
$$ plain form
56870 248248 242773 239965 240504 244900 253341 265921 282944 304926 332180 364271 399839 436905 473178
56857 473178 505984 532381 550130 558841 559973 555590 547282 536167 523303 509613 495600 481426
56845 481426 467381 454316 443843 438195 439571 449211 467042 492351 524907 565379 614535 671785
56833 671785 734191 796739 853601 899504 930726 945763 945541 932745 910498 881476 847864 811359
56821 811359 772877 732814 692147 652965 617492 586990 562144 544070 534082 532654 539445 554370
56809 554370 577808 609488 647505 688264 726893 758078 777800 784933 780846 767441 746139 718556
56797 718556 686955 653333 618634 583339 548313 514607 482877 453522 427172 404758 387306
56786 387306 375746 370536 371339 377404 388252 403302 420729 437478 450835 459477 462831 460358 452072
$$ packed form
56870B48248n475k808N39M396Q441J2580J7023K1982K7254L2091L5568L7066L6273
56857D73178L2806K6397J7749Q711J132m383q308j1115j2864j3690j4013j4174
56845D81426j4045j3065j0473n648J376R640J7831K5309L2556M0472M9156N7250
56833F71785O2406O2548N6862M5903L1222J5037k22j2796k2247k9022l3612l6505
56821H11359l8482m0063m0667l9182l5473l0502k4846j8074r988j428O791J4925
56809E54370K3438L1680L8017M0759L8629L1185J9722P133m087j3405k1302k7583
56797G18556l1601l3622l4699l5295l5026l3706l1730k9355k6350k2414j7452
56786C87306j1560n210Q03O065J0848J5050J7427J6749J3357Q642L354k473q286
$$ plain form
56773 452072 439042 422558 403135 380975 356951 332449 308467 285418 263476 242540 222148
56762 222148 202132 183213 166388 151875 139126 127686 117462 108278 99830 92109 85423 79978
56750 79978 75758 72700 70634 69103 67607 66006 64508 63443 63204 64002 65307 65954 65313 64034 63066 62295
56734 62295 60873 58698 56724 55705 55373 55141 55093 55953 58246 61594 64738 66437 66633 66570 67440 69199 71089
56717 71089 72902 74971 77155 78805 79759 80553 81397 81829 81725 81889 83080 85004 86828 88263 89589 90924
56701 90924 92127 93279 94687 96357 97848 98712 98833 98329 97439 96527 95981 95929 96134 96244 96110 95809 95406 94785
56683 94785 93869 92983 92726 93297 94122 94414 93973 93105 91930 90238 88061 85837 83864 82032 80369 79363
56667 79363 79289 79550 79216 78109 76890 76154 75872 75803 75941 76329 76725 76815 76632 76566 76989 77994 79424 81012 82560
$$ packed form
56773D52072j3030j6484j9423k2160k4024k4502k3982k3049k1942k0936k0392
56762B22148k0016j8919j6825j4513j2749j1440j0224r184q448p721o686n445
56750G9978m220l058k066j531j496j601j498j065k39P98J305O47o41j279r68p71
56734F2295j422k175j974j019l32k32m8Q60K293L348L144J699J96o3Q70J759J890
56717G1089J813K069K184J650R54P94Q44M32j04J64J191J924J824J435J326J335
56701I0924J203J152J408J670J491Q64J21n04q90r12n46n2K05J10j34l01m03o21
56683I4785r16q86k57N71Q25K92m41q68j175j692k177k224j973j832j663j006
56667G9363p4K61l34j107j219p36k82o9J38L88L96R0j83o6M23J005J430J588J548
$$ plain form
56648 82560 84109 85927 88170 90580 92660 94179 95381 96662 98184 99922 101971 104630 108106 112203
56634 112203 116302 119733 122262 124259 126263 128351 130022 130766 130568 129739 128479 126838 125001 123289 121790
56619 121790 120261 118560 117129 116948 118851 122689 127110 130407 131894 132378 133181 134840 136937 138917 140596
56604 140596 141969 142962 143461 143300 142266 140386 138168 136177 134447 132669 130817 129071 127240 124998 122779
56589 122779 121647 121963 122888 123622 124446 125927 127657 128586 128396 127837 127768 128439 129708 131447 133610 136141 138864
56572 138864 141360 143155 144285 145472 147452 150303 153665 157370 161504 166137 171418 177761 185455 194200
56558 194200 203391 212774 222348 231753 240253 247345 253020 257442 260781 263377 265663 267834 269823 271590
56544 271590 273137 274270 274690 274267 272970 270657 267370 263745 260633 258174 255666 252432 248437 243968 239160
$$ packed form
56648H2560J549J818K243K410K080J519J202J281J522J738K049K659L476M097
56634A12203M099L431K529J997K004K088J671P44j98q29j260j641j837j712j499
56619A21790j529j701j431j81J903L838M421L297J487M84Q03J659K097J980J679
56604A40596J373R93M99j61j034j880k218j991j730j778j852j746j831k242k219
56589A22779j132L16R25P34Q24J481J730R29j90n59o9O71J269J739K163K531K723
56572A38864K496J795J130J187J980K851L362L705M134M633N281O343P694Q745
56558A94200R191R383R574R405Q500P092N675M422L339K596K286K171J989J767
56544B71590J547J133M20m23j297k313l287l625l112k459k508l234l995m469m808
$$ plain form
56529 239160 234129 229216 224751 220658 216545 212143 207563 203229 199594 196834 194686 192632 190293 187669
56515 187669 185067 182792 180764 178457 175426 172031 169387 168321 168477 168703 168138 166749 164985 163257 161767
56500 161767 160569 159716 159364 159601 160105 160230 159606 158443 157133 155920 155128 155174 155874 156184 155285 153709 152756
56483 152756 152956 153721 154379 154801 154988 154828 154515 154634 155483 156712 157823 158710 159505 160316 161360 162951 165074
56466 165074 167192 168711 169442 169463 168813 167605 166269 165365 165122 165282 165488 165768 166522 167882 169200 169548 168883
56449 168883 168275 168652 169691 170399 170491 170597 171273 172509 174187 176374 178890 181091 182340 182498 181838 180772
56433 180772 179736 179013 178564 178152 177575 176594 174904 172561 170244 168616 167566 166592 165742 165468 165614 165345 164287
56416 164287 163050 162311 161973 161520 160698 159468 157765 155676 153584 151778 150171 148646 147457 147105 147944 149885
$$ packed form
56529B39160n031m913m465m093m113m402m580m334l635k760k148k054k339k624
56515A87669k602k275k028k307l031l395k644j066J56K26n65j389j764j728j490
56500A61767j198q53l52K37N04J25o24j163j310j213p92M6P00L10q99j576r53
56483A52756K00P65O58M22J87j60l13J19Q49J229J111Q87P95Q11J044J591K123
56466A65074K118J519P31K1o50j208j336r04k43J60K06K80P54J360J318L48o65
56449A68883o08L77J039P08R2J06O76J236J678K187K516K201J249J58o60j066
56433A80772j036p23m49m12n77r81j690k343k317j628j050r74q50k74J46k69j058
56416A64287j237p39l38m53q22j230j703k089k092j806j607j525j189l52Q39J941
$$ plain form
56400 149885 152219 153808 153946 153115 152487 152659 153389 154460 156018 157814 159019 159320 159561 160631 162179 163126
56384 163126 163157 163002 163349 164098 164793 165346 166115 167474 169460 171900 174874 178933 184559 191373 198173 203879
56368 203879 208273 211816 215071 218358 221570 224174 225736 226563 227434 228546 229225 228917 228068 227609 227939 228826
56352 228826 230038 231565 233263 234722 235567 235726 235371 234739 234050 233508 233306 233497 233786 233704 233166 232718 232993 234076
56334 234076 235730 237944 240756 243698 246124 248101 250384 253420 257003 261021 265805 271340 276678 280684
56320 280684 283111 284594 285811 286920 287721 288170 288688 289849 291623 293219 294023 294394 295048 296052 297146 298737
56304 298737 301526 305190 308494 310949 313393 316682 320747 325254 330232 335563 340758 345776 351226 357221
56290 357221 362911 367759 372474 377902 383814 389566 395237 401181 407123 412700 418499 425565 434110 443485
$$ packed form
56400A49885K334J589J38q31o28J72P30J071J558J796J205L01K41J070J548R47
56384A63126L1j55L47P49O95N53P69J359J986K440K974M059N626O814O800N706
56368B03879M394L543L255L287L212K604J562Q27Q71J112O79l08q49m59L30Q87
56352B28826J212J527J698J459Q45J59l55o32o89n42k02J91K89q2n38m48K75J083
56334B34076J654K214K812K942K426J977K283L036L583M018M784N535N338M006
56320B80684K427J483J217J109Q01M49N18J161J774J596Q04L71O54J004J094J591
56304B98737K789L664L304K455K444L289M065M507M978N331N195N018N450N995
56290C57221N690M848M715N428N912N752N671N944N942N577N799P066Q545R375
$$ plain form
56276 443485 453187 463102 473064 483048 493695 505856 519584 534197 549259 565003 581819 599779
56264 599779 618667 638197 658447 680302 705065 733290 764405 797897 834384 875051 920599
56253 920599 971325 1027745 1090447 1159794 1236449 1321686 1416382 1520020 1631412 1750037 1875829
56242 1875829 2007966 2144681 2284019 2423902 2561577 2693852 2817861 2931036 3030537 3113502
56232 3113502 3177816 3222115 3245414 3247545 3229677 3193501 3139987 3069785 2984705 2887797 2781875
56221 2781875 2668867 2550706 2429850 2308452 2187679 2068328 1951661 1839270 1732424
56212 1732424 1631797 1537545 1449453 1367172 1290458 1219192 1153368 1093187 1038858 990042 945772
56201 945772 905159 867912 833962 803133 775477 751279 730158 710792 692229 674925 659714
$$ packed form
56276D43485R702R915R962R984J0647J2161J3728J4613J5062J5744J6816J7960
56264E99779J8888J9530K0250K1855K4763K8225L1115L3492L6487M0667M5548
56253I20599N0726N6420O2702O9347P6655Q5237R4696J03638J11392J18625J25792
56242A875829J32137J36715J39338J39883J37675J32275J24009J13175R9501Q2965
56232C113502O4314M4299K3299K131j7868l6176n3514p0202q5080r6908j05922
56221B781875j13008j18161j20856j21398j20773j19351j16667j12391j06846
56212A732424j00627r4252q8092q2281p6714p1266o5824o0181n4329m8816m4270
56201I45772m0613l7247l3950l0829k7656k4198k1121j9366j8563j7304j5211
$$ plain form
56190 659714 646319 633851 622298 612445 604452 597603 591428 586167 582049 578854 576234 573824 571118
56177 571118 567921 564832 562655 561490 561044 561481 563132 565630 568308 571300 575303 580319 585598 590847 596504
56162 596504 602727 609044 615159 621283 627559 633946 640770 648605 657467 666901 676956 688314 701356
56149 701356 715850 731641 748948 767935 788858 812762 841242 875201 914400 958314 1006862
56138 1006862 1060346 1119290 1184136 1254150 1326597 1397923 1465976 1530499 1591734 1649669 1704653
56127 1704653 1757404 1807771 1854241 1895113 1929541 1957197 1977808 1991583 1999569 2002987 2002296 1996891
56115 1996891 1985406 1966450 1939523 1905180 1864026 1816055 1761680 1702911 1642503 1582122 1522278
56104 1522278 1463823 1408356 1357106 1310423 1268435 1231305 1198790 1170429 1146208 1126311 1110387
$$ packed form
56190F59714j3395j2468j1553r853p993o849o175n261m118l195k620k410k706
56177E71118l197l089k177j165m46M37J651K498K678K992M003N016N279N249N657
56162E96504O223O317O115O124O276O387O824P835Q862R434J0055J1358J3042
56149G01356J4494J5791J7307J8987K0923K3904K8480L3959L9199M3914M8548
56138A006862N3484N8944O4846P0014P2447P1326O8053O4523O1235N7935N4984
56127A704653N2751N0367M6470M0872L4428K7656K0611J3775P986L418o91n405
56115A996891j1485j8956k6927l4343m1154m7971n4375n8769o0408o0381n9844
56104A522278n8455n5467n1250m6683m1988l7130l2515k8361k4221j9897j5924
$$ plain form
56093 1110387 1097900 1088890 1083378 1080345 1078572 1078247 1080397 1084872 1090360 1096382 1103641 1112173 1120735 1128563
56079 1128563 1136402 1145206 1155025 1165685 1177504 1190734 1205152 1220622 1237244 1254697 1272328 1290128
56067 1290128 1308788 1328660 1349456 1370891 1392686 1414179 1435093 1456514 1479868 1505078 1531019
56056 1531019 1557422 1584749 1612526 1639736 1666831 1695367 1725480 1755684 1785399 1815667 1847011
56045 1847011 1878675 1910608 1944165 1980085 2017537 2055869 2095538 2136698 2178720 2221770 2267013
56034 2267013 2314585 2363257 2412813 2464729 2519742 2576776 2635158 2695810 2759225 2824309 2890341
56023 2890341 2958200 3028612 3101153 3175951 3254225 3336021 3419523 3503887 3590673 3681284 3775181
56012 3775181 3872016 3973293 4080343 4192691 4309970 4433301 4563220 4698334 4837861 4983660
$$ packed form
56093A110387j2487r010n512l033j773l25K150M475N488O022P259Q532Q562P828
56079A128563P839Q804R819J0660J1819J3230J4418J5470J6622J7453J7631J7800
56067A290128J8660J9872K0796K1435K1795K1493K0914K1421K3354K5210K5941
56056A531019K6403K7327K7777K7210K7095K8536L0113L0204K9715L0268L1344
56045A847011L1664L1933L3557L5920L7452L8332L9669M1160M2022M3050M5243
56034B267013M7572M8672M9556N1916N5013N7034N8382O0652O3415O5084O6032
56023B890341O7859P0412P2541P4798P8274Q1796Q3502Q4364Q6786R0611R3897
56012C775181R6835J01277J07050J12348J17279J23331J29919J35114J39527J45799
$$ plain form
56002 4983660 5138102 5301726 5474494 5657362 5851021 6054982 6269378 6495842 6735382
55993 6735382 6987471 7252442 7532475 7829121 8142404 8473419 8824807 9197398 9589706
55984 9589706 10002325 10439445 10904439 11397669 11920536 12477662 13072879 13707247 14383539
55975 14383539 15108514 15888190 16725606 17626352 18601800 19663903 20822324 22090721 23490911
55966 23490911 25047234 26783089 28728573 30927292 33433314 36311158 39648561 43567586
55958 43567586 48222529 53798811 60524086 68675403 78567913 90534084 104893858 121898351
55950 121898351 141663448 164135494 189045560 215720465 242768571 267971716 288738543
55943 288738543 303001119 309940605 310026350 304463568 294573740 281481625 266079781 249075124
$$ packed form
56002D983660J54442J63624J72768J82868J93659K03961K14396K26464K39540
55993F735382K52089K64971K80033K96646L13283L31015L51388L72591L92308
55984I589706M12619M37120M64994M93230N22867N57126N95217O34368O76292
55975A4383539P24975P79676Q37416R00746R75448J062103J158421J268397J400190
55966B3490911J556323J735855J945484K198719K506022K877844L337403L919025
55958D3567586M654943N576282O725275Q151317R892510J1966171J4359774J7004493
55950A21898351J9765097K2472046K4910066K6674905K7048106K5203145K0766827
55943B88738543J4262576O939486Q5745n562782r889828j3092115j5401844j7004657
$$ plain form
55935 249075124 231027827 212395083 193578513 174950677 156859781 139624594 123516559
55928 123516559 108731088 95372085 83464035 72973779 63823228 55900438 49078732
55921 49078732 43232465 38238611 33975090 30327925 27199257 24505814 22174681 20145442
55913 20145442 18372347 16818893 15451929 14243281 13172450 12222528 11375414 10614214
55905 10614214 9927486 9307295 8745085 8232514 7764173 7336114 6943152 6580118 6244147
55896 6244147 5933423 5645271 5377420 5129206 4899579 4685727 4485530 4299332 4127422
55887 4127422 3967828 3818534 3679824 3552291 3434247 3323082 3217463 3116430 3018205 2921948
55877 2921948 2829079 2740944 2656590 2574350 2493871 2414927 2336152 2256950 2179049 2104255 2032252
$$ packed form
55935B49075124j8047297j8632744j8816570j8627836j8090896j7235187j6108035
55928A23516559j4785471j3359003j1908050j0490256r150551p922790o821706
55921D9078732n846267m993854m263521l647165l128668k693443k331133k029239
55913B0145442j773095j553454j366964j208648j070831r49922q47114p61200
55905A0614214o86728o20191n62210n12571m68341m28059l92962l63034l35971
55896F244147l10724k88152k67851k48214k29627k13852k00197j86198j71910
55887D127422j59594j49294j38710j27533j18044j11165j05619j01033r8225r6257
55877B921948r2869q8135q4354q2240q0479p8944p8775p9202p7901p4794p2003
$$ plain form
55866 2032252 1962367 1895768 1833756 1775423 1719137 1665078 1614312 1566631 1521362 1479149 1440851
55855 1440851 1405659 1372256 1340850 1312146 1285212 1258393 1231585 1205715 1180676 1155637 1130842
55844 1130842 1107284 1085017 1063364 1042359 1022518 1003713 985628 968768 953562 939009 923670
55833 923670 907553 891711 876540 861789 847632 834334 821269 807642 793801 780650 768244
55822 768244 756120 744496 733844 723754 713411 702833 692546 682560 672720 663452 654986 646530
55810 646530 637505 628892 621935 616116 609982 603579 598414 595125 592807 590661 588902 587849 587416 587742 589255
55795 589255 591756 594294 596176 597431 598212 598394 597842 596542 594472 591723 588485 584518 578973 571262 561701
55780 561701 550919 539178 526784 514390 502210 489706 476829 464824 454858 446622 439251 432868
$$ packed form
55866B032252o9885o6599o2012n8333n6286n4059n0766m7681m5269m2213l8298
55855A440851l5192l3403l1406k8704k6934k6819k6808k5870k5039k5039k4795
55844A130842k3558k2267k1653k1005j9841j8805j8085j6860j5206j4553j5339
55833I23670j6117j5842j5171j4751j4157j3298j3065j3627j3841j3151j2406
55822G68244j2124j1624j0652j0090j0343j0578j0287r986r840r268q466q456
55810F46530r025q613o957n819o134o403n165l289k318k146j759j053m33L26J513
55795E89255K501K538J882J255P81J82n52j300k070k749l238l967n545p711r561
55780E61701j0782j1741j2394j2394j2180j2504j2877j2005r966q236p371o383
$$ plain form
55768 432868 428021 424244 420528 416795 413654 411072 408513 406148 404653 403975 403481 403118 403282 403616 403088 401224
55752 401224 398223 393937 387845 380153 371962 364219 357210 350883 344829 338200 330641 323233 317477 313404
55738 313404 309673 305416 300959 296723 292594 288635 285428 283298 281892 280758 279726 278600 277063 275058
55724 275058 272759 270186 267261 264080 260684 256854 252753 249325 247300 246117 244682 242881 241458 240738
55710 240738 240486 240813 242110 244093 245909 247188 248157 248842 249065 249076 249197 248889 247189 244064 240417 236883
55694 236883 233626 231087 229606 228303 225658 221480 217195 214037 212164 211663 212938 215527 217887 219131
55680 219131 220046 221718 224107 226693 229570 232974 236360 238853 240280 241098 241619 241806 241577 240934 240030 239241
55664 239241 238810 238365 237335 235910 234913 234613 234427 233970 233627 233777 234326 235327 237181 239717 241888 242978
$$ packed form
55768D32868m847l777l716l733l141k582k559k365j495o78m94l63J64L34n28j864
55752D01224l001m286o092p692q191p743p009o327o054o629p559p408n756m073
55738C13404l731m257m457m236m129l959l207k130j406j134j032j126j537k005
55724B75058k299k573k925l181l396l830m101l428k025j183j435j801j423p20
55710B40738k52L27J297J983J816J279R69O85K23J1J21l08j700l125l647l534
55694B36883l257k539j481j303k645m178m285l158j873n01J275K589K360J244
55680B19131R15J672K389K586K877L404L386K493J427Q18N21J87k29o43r04p89
55664B39241m31m45j030j425r97l00j86m57l43J50N49J001J854K536K171J090
$$ plain form
55648 242978 243476 244172 245009 245388 245031 243905 241821 238777 235307 231937 228582 224971 221275 217847 214684
55633 214684 211546 208281 204711 200645 196366 192568 189357 185878 181505 176901 173277 171005 169610 168736
55619 168736 168289 167852 166814 165155 163535 162468 161834 161216 160326 159057 157457 155772 154241 152809 151178
55604 151178 149186 147006 144920 142903 140395 136723 132048 127750 125302 124641 124197 122769 120845 119768 120103
55589 120103 121345 122769 123929 124532 124477 124106 124016 124537 125599 127016 128599 130035 131004 131542 132100 133220 135207
55572 135207 138060 141605 145681 150204 154955 159369 162779 164953 166246 167100 167555 167299 166057 163869 161153
55557 161153 158542 156533 155275 154717 154728 154789 153882 151317 147705 144557 142778 141989 141396 140678 139779 138447 136591
55540 136591 134791 133877 134058 134778 135395 135766 136218 137082 138258 139177 139357 138975 138687 138842 139154 139126 138489 137186
$$ packed form
55648B42978M98O96Q37L79l57j126k084l044l470l370l355l611l696l428l163
55633B14684l138l265l570m066m279l798l211l479m373m604l624k272j395q74
55619A68736m47m37j038j659j620j067o34o18q90j269j600j685j531j432j631
55604A51178j992k180k086k017k508l672m675m298k448o61m44j428j924j077L35
55589A20103J242J424J160O03n5l71r0N21J062J417J583J436R69N38N58J120J987
55572A35207K853L545M076M523M751M414L410K174J293Q54M55k56j242k188k716
55557A61153k611k009j258n58J1O1r07k565l612l148j779p89n93p18q99j332j856
55540A36591j800r14J81P20O17L71M52Q64J176R19J80l82k88J55L12k8o37j303
$$ plain form
55522 137186 135271 132976 130601 128298 126185 124630 123961 123908 123836 123608 123676 124209 124782 125156 125654 126367 126701 126321
55504 126321 125967 126511 127547 127751 126616 125109 124528 125233 126618 127836 128327 127977 127098 126177 125460 124765 123666
55487 123666 121836 119343 116688 114522 113223 112738 112848 113442 114486 115857 117251 118222 118368 117673 116633 115840
55471 115840 115383 114854 113891 112498 110801 108786 106365 103552 100630 98262 97216 97551 98197 97818 96121 93919
55455 93919 91972 90303 88693 87218 86110 85550 85743 86714 87912 88589 88713 88896 89264 89153 88259 87330 87132
55438 87132 87403 87516 87621 88306 89457 90287 90350 89786 88679 86913 84847 83449 83384 84263 85002 84786 83624 82177
55420 82177 81219 81133 81744 82526 82959 82845 82462 82338 82706 83251 83588 83815 84239 84792 85235 85796 86897 88201 88682
55401 88682 87909 86603 85665 85288 85332 85813 86514 86794 86439 86203 86809 87840 88294 87926 87358 87080 87018 86994 87011 87119
$$ packed form
55522A37186j915k295k375k303k113j555o69n3p2k28O8N33N73L74M98P13L34l80
55504A26321l54N44J036K04j135j507n81P05J385J218M91l50q79r21p17o95j099
55487A23666j830k493k655k166j299m85J10N94J044J371J394R71J46o95j040p93
55471A15840m57n29r63j393j697k015k421k813k922k368j046L35O46l79j697k202
55455I3919j947j669j610j475j108n60J93R71J198O77J24J83L68j11q94r29j98
55438H7132K71J13J05O85J151Q30O3n64j107j766k066j398o5Q79P39k16j162j447
55420H2177r58q6O11P82M33j14l83j24L68N45L37K27M24N53M43N61J101J304M81
55401H8682p73j306r38l77M4M81P01K80l55k36O06J031M54l68n68k78o2k4J7J08
$$ plain form
55381 87119 87421 88142 89319 90535 91315 91620 91648 91373 90645 89521 88214 86913 85891 85443 85410 85194 84636 84401
55363 84401 85071 86313 87426 88241 88889 89243 89313 89746 91076 92800 93948 94303 94209 93591 92216 90748 90347
55346 90347 91035 91512 90846 89498 88350 87603 87057 86776 86878 87141 87236 87050 86496 85412 83983 82867 82575 82960
55328 82960 83596 84363 85358 86464 87315 87661 87607 87498 87610 87941 88351 88875 89696 90693 91422 91809 92435 93626 94619
55309 94619 94304 92696 90982 90107 89880 89575 88856 87954 87282 87079 87171 87070 86456 85465 84342 83142 82101 81774
55291 81774 82238 82577 81958 80904 80642 81411 82348 82913 83353 83726 83611 83056 82779 83098 83580 84087 85097 86535
55273 86535 87408 87352 87512 88937 90919 91975 91905 91717 91877 91913 91676 91856 92879 94115 94635 94325 93871 93915 94477
55254 94477 95053 95140 94673 94022 93574 93500 93816 94397 94826 94632 93873 93118 92659 92112 91111 89976 89264 89022 88964
$$ packed form
55381H7119L02P21J177J216P80L05K8k75p28j124j307j301j022m48l3k16n58k35
55363H4401O70J242J113Q15O48L54P0M33J330J724J148L55r4o18j375j468m01
55346I0347O88M77o66j348j148p47n46k81J02K63R5j86n54j084j429j116k92L85
55328H2960O36P67R95J106Q51L46n4j09J12L31M10N24Q21R97P29L87O26J191R93
55309I4619l15j608j714q75k27l05p19r02o72k03R2j01o14r91j123j200j041l27
55291H1774M64L39o19j054k62P69R37N65M40L73j15n55k77L19M82N07J010J438
55273H6535Q73n6J60J425J982J056p0j88J60L6k37J80J023J236N20l10m54M4N62
55254I4477N76Q7m67o51m48p4L16N81M29j94p59p55m59n47j001j135p12k42n8
$$ plain form
55235 88964 89025 89188 89063 88290 87254 86731 86878 87162 87315 87586 87883 87427 85819 83955 83193 83779 84691 85022
55217 85022 84942 85102 85633 86220 86856 87932 89489 90900 91541 91466 91158 90913 90788 90878 91216 91539 91596 91587 91886 92356
55197 92356 92435 91928 91237 90756 90466 90235 90056 89914 89799 89944 90507 90966 90481 89053 87683 87064 86806 86376 86002
55178 86002 85972 85717 84583 83130 82570 83013 83330 82929 82671 83556 85264 86667 87272 87506 87778 87961 87858 87705
55160 87705 87977 88899 90300 91820 93143 94100 94693 95048 95272 95370 95342 95268 95168 94783 93738 92113 90654 90152
55142 90152 90712 91823 93027 94150 94959 95085 94492 93698 93303 93473 93959 94326 94034 92736 90847 89539 89731
55125 89731 91115 92513 93123 93111 92983 92803 92272 91485 91246 92342 94471 96262 96657 96082 95797 96194 96334 95322
55107 95322 93535 92106 91689 92179 93245 94527 95582 96235 96942 98218 99716 100518 100417 100299 100925 101857 102138
$$ packed form
55235H8964O1J63j25p73j036n23J47K84J53K71K97m56j608j864p62N86R12L31
55217H5022q0J60N31N87O36J076J557J411O41p5l08k45j25R0L38L23N7rK99M70
55197I2356P9n07o91m81k90k31j79j42j15J45N63M59m85j428j370o19k58m30l74
55178H6002l0k55j134j453n60M43L17m01k58Q85J708J403O05K34K72J83j03j53
55160H7705K72R22J401J520J323R57N93L55K24R8k8p4j00l85j045j625j459n02
55142I0152N60J111J204J123Q09J26n93p94l95J70M86L67k92j298j889j308J92
55125H9731J384J398O10j2j28j80n31p87k39J096K129J791L95n75k85L97J40j012
55107I5322j787j429m17M90J066J282J055O53P07J276J498Q02j01j18O26R32K81
$$ plain form
55090 102138 101696 101442 101910 102484 102247 101290 100659 101098 102276 103346 103895 104108 104330 104703 105066 104968 104002 102444
55072 102444 101269 101151 101701 102177 102700 103967 105844 107137 107112 106498 106487 107274 108076 108195 107531 106341 104996
55055 104996 103766 102545 101058 99628 99243 100352 102017 102894 102816 102740 103304 104187 104890 105425 105971 106384 106374 105876
55037 105876 105021 103916 102574 100994 99329 98032 97614 97982 98208 97390 95685 94132 93520 93765 94269 94446
55021 94446 93991 93120 92617 93177 94544 95725 96087 95822 95269 94336 92969 91737 91474 92427 94095 95837 97441
55004 97441 99083 100909 102748 104307 105590 106873 108143 108841 108556 107746 107248 107258 107327 107300 107488 107793 107524 106524
54986 106524 105759 106066 106899 107078 106415 105711 105321 104720 103646 102744 102679 103283 104064 105006 106254 107485 108256 108735
54968 108735 109407 110241 110866 111471 112636 114069 114455 113066 110859 109348 108971 109237 109963 111309 112834 113652
$$ packed form
55090A02138m42k54M68N74k37r57o31M39J178J070N49K13K22L73L63r8r66j558
55072A02444j175j18N50M76N23J267J877J293k5o14j1P87Q02J19o64j190j345
55055A04996j230j221j487j430l85J109J665Q77p8p6N64Q83P03N35N46M13j0m98
55037A05876q55j105j342j580j665j297m18L68K26q18j705j553o12K45N04J77
55021I4446m55q71n03N60J367J181L62k65n53r33j367j232k63R53J668J742J604
55004I7441J642J826J839J559J283J283J270O98k85q10m98J0O9k7J88L05k69j000
54986A06524p65L07Q33J79o63p04l90o01j074r02o5O04P81R42J248J231P71M79
54968A08735O72Q34O25O05J165J433L86j389k207j511l77K66P26J346J525Q18
$$ plain form
54952 113652 113666 113684 114022 113934 112892 111595 111027 111168 111346 111342 111335 111206 110820 110744 111728 113459 114699 114810 114362 114086
54932 114086 113993 113823 113626 113473 113194 112902 113277 114778 116908 118792 120191 121447 122798 124417 126897 130846
54916 130846 135896 140822 144955 148929 153646 158947 163743 167178 169146 169807 169161 167227 164294 160830 157286
54901 157286 153984 150937 147797 144292 140727 137708 135306 132977 130515 128526 127500 126910 125880 124477
54887 124477 123597 123615 123953 124099 124320 125062 126267 127649 129179 130857 132463 133949 135709 138070 140864 143967
54871 143967 147845 152909 158481 163091 165865 167222 168129 169039 169606 169144 167204 163894 159707 155099 150417
54856 150417 146151 142826 140352 137872 134591 130473 125929 121325 117274 114751 114106 114280 113893 112937 112516
54841 112516 112958 113234 112415 110791 109089 107402 105510 103713 102656 102575 103143 103892 104441 104565 104357 104193 104292
$$ packed form
54952A13652J4J8L38q8j042j297n68J41J78mpj29l86p6R84J731J240J11m48k76
54932A14086r3j70j97j53k79k92L75J501K130J884J399J256J351J619K480L949
54916A30846N050M926M133L974M717N301M796L435J968O61o46j934k933l464l544
54901A57286l302l047l140l505l565l019k402k329k462j989j026n90j030j403
54887A24477q80J8L38J46K21P42J205J382J530J678J606J486J760K361K794L103
54871A43967L878N064N572M610K774J357R07R10N67m62j940l310m187m608m682
54856A50417m266l325k474k480l281m118m544m604m051k523o45J74l87r56m21
54841A12516M42K76q19j624j702j687j892j797j057q1N68P49N49J24k08j64R9
$$ plain form
54824 104292 104513 104736 105189 106158 107603 109207 110526 110979 110146 108413 106904 106360 106347 106041 105536 105791 107298
54807 107298 109329 110657 110764 110167 109746 109909 110333 110421 109956 109243 108713 108579 108892 109627 110549 111256 111575 111784
54789 111784 112272 113085 113959 114628 114956 114904 114620 114413 114467 114711 115098 115774 116764 117734 118435 119164 120325 121657 122483
54770 122483 122826 123696 125955 129239 132459 135140 137850 141391 146045 151636 157812 163939 169113 172753 175170
54755 175170 177148 178961 180115 180091 178895 176714 173489 169255 164667 160650 157469 154477 150907 146726 142669
54740 142669 139603 137884 137168 136748 136103 135095 133683 131770 129553 127741 127016 127318 128059 128935 130116 131596
54724 131596 132903 133689 134294 135464 137689 140932 144754 148530 151786 154551 157240 160041 162597 164464 165684
54709 165684 166641 167426 167540 166288 163409 159396 155215 151584 148490 145482 142415 139678 137622 136009 134240
$$ packed form
54824A04292K21K23M53R69J445J604J319M53q33j733j509n44j3l06n05K55J507
54807A07298K031J328J07n97m21J63M24Q8m65p13n30j34L13P35R22P07L19K09
54789A11784M88Q13Q74O69L28n2k84k07N4K44L87O76R90R70P01P29J161J332Q26
54770A22483L43Q70K259L284L220K681K710L541M654N591O176O127N174L640K417
54755A75170J978J813J154k4j196k181l225m234m588m017l181k992l570m181m057
54740A42669l066j719p16m20o45j008j412j913k217j812p25L02P41Q76J181J480
54724A31596J307P86O05J170K225L243L822L776L256K765K689K801K556J867J220
54709A65684R57P85J14j252k879m013m181l631l094l008l067k737k056j613j769
$$ plain form
54694 134240 132047 129764 127898 126531 125224 123555 121736 120509 120333 120817 121116 120776 120036 119416 119238 119398
54678 119398 119360 118516 116852 115140 114102 113515 112617 111331 110501 110820 111978 113104 113644 113637 113496 113731 114588 115719
54660 115719 116450 116446 115858 114863 113568 112455 112299 113271 114539 115180 115131 114904 114745 114558 114367 114333 114384 114275 113965
54641 113965 113609 113209 112563 111593 110526 109766 109653 110236 111144 111840 112113 112148 112083 111800 111283 110787 110417 109909 109153
54622 109153 108596 108715 109303 109764 109905 110037 110328 110542 110503 110499 111030 112240 113649 114467 114284 113500 112897 112739 112575
54603 112575 112014 111284 110844 110767 110845 111017 111379 111988 112934 114338 115922 116907 116757 115857 115062 114708 114492 114175 113931
54584 113931 113985 114222 114232 113613 112358 111041 110359 110286 110106 109517 109188 109735 110649 111004 110876 111189 112261 113421
54566 113421 114161 114775 115576 116234 116363 116221 116370 117016 118084 119496 120965 121834 121706 121136 121187 122218 123469
$$ packed form
54694A34240k193k283j866j367j307j669j819j227j76M84K99l40p40o20j78J60
54678A19398l8q44j664j712j038n87q98j286q30L19J158J126N40pj41K35Q57J131
54660A15719P31mn88r95j295j113j56R72J268O41m9k27j59j87j91l4N1j09l10
54641A13965l56m00o46r70j067p60j13N83R08O96K73L5o5k83n17m96l70n08p56
54622A09153n57J19N88M61J41J32K91K14l9mN31J210J409Q18j83p84o03j58j64
54603A12575n61p30m40p7P8J72L62O09R46J404J584R85j50r00p95l54k16l17k44
54584A13931N4K37J0o19j255j317o82p3j80n89l29N47R14L55j28L13J072J160
54566A13421P40O14Q01O58J29j42J49O46J068J412J469Q69j28n70N1J031J251
$$ plain form
54549 123469 123976 123675 123388 123850 124952 126039 126738 127229 127762 128234 128449 128541 128896 129749 131036 132475 133631
54532 133631 134117 133931 133456 132945 132279 131427 130724 130298 129621 128244 126693 125920 126028 126278 126393 127036 128687 130724
54514 130724 132027 132110 131353 130481 130079 130237 130374 129669 127991 126125 124920 124489 124447 124524 124588 124381 123730 122930 122542
54495 122542 122784 123356 123830 124001 123868 123444 122759 122018 121664 122061 123020 123825 123959 123705 123745 124316 125093 125820 126567
54476 126567 127342 127985 128531 129264 130166 130816 131071 131416 132330 133681 135094 136496 137808 138495 138026 136711 135510
54459 135510 135004 134936 134753 134187 133260 132186 131404 131305 131742 132006 131562 130629 129883 129776 130350 131520 133199 135104
54441 135104 136726 137617 137600 136688 135016 133014 131432 130888 131397 132477 133616 134408 134371 133173 131188 129475
54425 129475 128892 129458 130691 132246 133897 135277 136106 136553 136964 137348 137465 137287 136995 136654 136335 136357 136906 137478
$$ packed form
54549A23469N07l01k87M62J102J087O99M91N33M72K15R2L55Q53J287J439J156
54532A33631M86j86m75n11o66q52p03m26o77j377j551p73J08K50J15O43J651K037
54514A30724J303Q3p57q72m02J58J37p05j678j866j205m31m2P7O4k07o51q00l88
54495A22542K42N72M74J71j33m24o85p41l54L97R59Q05J34k54M0N71P77P27P47
54476A26567P75O43N46P33R02O50K55L45R14J351J413J402J312O87m69j315j201
54459A35510n06o8j83n66r27j074p82r9M37K64m44r33p46j07N74J170J679J905
54441A35104J622Q91j7r12j672k002j582n44N09J080J139P92l7j198j985j713
54425A29475n83N66J233J555J651J380Q29M47M11L84J17j78k92l41l19K2N49N72
$$ plain form
54407 137478 137326 136460 135631 135265 135032 134655 134518 135112 136368 137880 139362 140586 141275 141503 141888 142968 144576
54390 144576 146096 147154 147785 148155 148443 148790 149101 149052 148476 147527 146319 144758 142988 141625 141148 141354 141774
54373 141774 142309 142998 143479 143331 142835 142754 143354 144149 144705 145185 145945 147014 148232 149590 151114 152530 153310
54356 153310 153130 152298 151728 152294 154044 156124 157701 158851 160277 162265 164313 165859 166981 168217 169943
54341 169943 172146 174654 177326 180022 182463 184144 184495 183316 181110 178729 176627 174565 172133 169338
54327 169338 166520 163918 161606 159746 158527 157730 156680 154870 152495 150165 148267 146891 146246 146649 147966
54312 147966 149402 150138 149943 149050 147819 146844 146936 148352 150120 150780 149915 148458 147399 146764 146045 145105 144198
54295 144198 143518 143150 143247 143821 144495 144862 144984 145264 145888 146664 147304 147633 147575 147212 146799 146481 146088 145428 144696
$$ packed form
54407A37478j52q66q29l66k33l77j37N94J256J512J482J224O89K28L85J080J608
54390A44576J520J058O31L70K88L47L11m9n76r49j208j561j770j363m77K06M20
54373A41774N35O89M81j48m96q1O00P95N56M80P60J069J218J358J524J416P80
54356A53310j80q32n70N66J750K080J577J150J426J988K048J546J122J236J726
54341A69943K203K508K672K696K441J681L51j179k206k381k102k062k432k795
54327A69338k818k602k312j860j219p97j050j810k375k330j898j376o45M03J317
54312A47966J436P36j95q93j231r75R2J416J768O60q65j457j059o35p19r40r07
54295A44198o80l68R7N74O74L67J22K80O24P76O40L29n8l63m13l18l93o60p32
$$ plain form
54276 144696 144304 144377 144638 144774 144681 144416 144159 144188 144624 145205 145548 145648 145861 146352 146819 146843 146366 145690 145178 145047
54256 145047 145332 145944 146798 147952 149573 151736 154240 156602 158243 158821 158505 157902 157568 157597 157705 157646 157361
54239 157361 156764 155686 154191 152759 151869 151379 150611 149248 147924 147640 148635 150148 151311 151853 151879 151472 150889
54222 150889 150634 150819 150776 149995 149161 149452 150843 151997 151968 151135 150192 149177 148060 147465 147930 148867 149064 148003
54204 148003 146115 144069 142413 141584 141488 141255 140167 138776 138374 139413 141094 142496 143325 143481 142752 141321
54188 141321 139965 139347 139459 139966 140634 141219 141489 141665 142365 143747 145120 145753 145652 145187 144484 143752 143728 145054
54170 145054 147318 149392 150672 151341 151388 150169 147304 143505 139959 137206 135065 133483 132782 132962 133264 132892
54154 132892 132001 131518 131957 132719 132833 132114 131324 131273 132035 133097 133987 134612 135182 135957 136992 137998 138537 138490
$$ packed form
54276A44696l92P3K61J36r3k65k57K9M36N81L43J00K13M91M67K4m77o76n12j31
54256A45047K85O12Q54J154J621K163K504K362J641N78l16o03l34K9J08n9k85
54239A57361n97j078j495j432q90m90p68j363j324k84R95J513J163N42K6m07n83
54222A50889k55J85m3p81q34K91J391J154k9q33r43j015j117n95M65R37J97j061
54204A48003j888k046j656q29r6k33j088j391m02J039J681J402Q29J56p29j431
54188A41321j356o18J12N07O68N85K70J76P00J382J373O33j01m65p03p32k4J326
54170A45054K264K074J280O69M7j219k865l799l546k753k141j582p01J80L02l72
54154A32892q91m83M39P62J14p19p90n1P62J062Q90O25N70P75J035J006N39m7
$$ plain form
54136 138490 138323 138772 140223 142431 144759 146602 147674 148017 147849 147414 146966 146814 147172 147818 148047 147313 145990
54119 145990 145219 145775 147236 148538 149227 149813 150929 152559 154247 155681 156764 157342 157288 156789 156263 156020 156130
54102 156130 156421 156331 155085 152590 150042 149048 150010 151809 153138 153705 154032 154668 155852 157478 159003 159745
54086 159745 159582 159088 158806 158716 158637 158639 158790 158960 159277 160245 161953 163672 164850 165974 167666 169310 169570 168266
54068 168266 166814 166640 167858 169656 171250 172203 172453 172497 173144 174710 176794 179011 181487 184352 187214 189655
54052 189655 191977 194974 199147 204505 210970 218488 226703 234950 242736 249941 256416 261621 264992 266666
54038 266666 267558 268663 270424 272778 275459 277997 279773 280628 281355 283012 285658 288306 290248 291783 293344
54023 293344 294658 295422 296162 297602 299462 300738 301004 300611 299674 297728 294585 290775 286848 282814 278546
$$ packed form
54136A38490j67M49J451K208K328J843J072L43j68m35m48j52L58O46K29p34j323
54119A45990p71N56J461J302O89N86J116J630J688J434J083N78n4m99n26k43J10
54102A56130K91r0j246k495k548r94R62J799J329N67L27O36J184J626J525P42
54086A59745j63m94k82r0p9KJ51J70L17R68J708J719J178J124J692J644K60j304
54068A68266j452j74J218J798J594R53K50M4O47J566K084K217K476K865K862K441
54052A89655K322K997M173N358O465P518Q215Q247P786P205O475N205L371J674
54038B66666Q92J105J761K354K681K538J776Q55P27J657K646K648J942J535J561
54023B93344J314P64P40J440J860J276K66l93r37j946l143l810l927m034m268
$$ plain form
54008 278546 274235 270127 266150 262012 257414 252145 246372 240868 236411 232857 229333 225509 222089 219765
53994 219765 218269 216778 214836 212478 209841 207103 204534 202312 200469 199179 198698 198821 198826 198304 197703 197641
53978 197641 197988 198059 197473 196454 195403 194525 193830 193236 192733 192537 192889 193618 194164 194190 193904 193645 193535 193709 194449
53959 194449 195783 197293 198668 200106 201830 203561 204870 205791 206650 207528 208393 209573 211611 214649 218273
53944 218273 221959 225422 228698 232178 236421 241669 247659 254138 261267 269169 277338 285033 292132 299151
53930 299151 306371 313351 319316 323775 326773 328896 331019 333757 337087 340624 344167 347762 351416 355106
53916 355106 359069 363784 369562 376300 383547 390652 397017 402501 407527 412631 417998 423539 429101 434299
53902 434299 438519 441622 444465 448151 452856 457964 463334 469625 477068 484426 489626 491144 488523 481989
$$ packed form
54008B78546m311m108l977m138m598n269n773n504m457l554l524l824l420k324
53994B19765j496j491j942k358k637k738k569k222j843j290m81J23Nn22o01o2
53978A97641L47P1n86j019j051q78o95n94n03j96L52P29N46K6k86k59j10J74P40
53959A94449J334J510J375J438J724J731J309R21Q59Q78Q65J180K038L038L624
53944B18273L686L463L276L480M243N248N990O479P129P902Q169P695P099P019
53930B99151P220O980N965M459K998K123K123K738L330L537L543L595L654L690
53916C55106L963M715N778O738P247P105O365N484N026N104N367N541N562N198
53902D34299M220L103K843L686M705N108N370O291P443P358N200J518k621o534
$$ plain form
53888 481989 472159 460014 446600 432498 417792 402604 387463 372992 359394 346447 333997 322268
53876 322268 311639 302250 293918 286378 279505 273378 268193 263977 260268 256253 251424 245977 240396 234889
53862 234889 229595 225076 221984 220255 219166 218181 217172 215864 213884 211592 210019 209558 209428 208924 208413
53847 208413 208388 208217 206849 204357 201799 199781 198147 196918 196501 196758 196798 196003 194679 193455 192666 192456 192831
53830 192831 193306 193170 192491 192310 193435 195491 197535 199154 200488 201551 202168 202468 202948 203975 205485 207208
53814 207208 208982 210793 212633 214365 215827 217167 219004 221935 225865 230079 234103 238246 243076 248542
53800 248542 253851 258275 261968 265911 270988 277067 283118 288275 292576 296571 300495 304152 307339 309973
53786 309973 311908 313041 313522 313499 312736 310912 308199 305099 301828 298329 294760 291309 287582 282894 277305
$$ packed form
53888D81989r830j2145j3414j4102j4706j5188j5141j4471j3598j2947j2450j1729
53876C22268j0629r389q332p540o873o127n185m216l709m015m829n447n581n507
53862B34889n294m519l092j729j089r85j009j308j980k292j573m61j30n04n11
53847B08413k5j71j368k492k558k018j634j229m17K57M0p95j324j224p89k10L75
53830A92831M75j36o79j81J125K056K044J619J334J063O17L00M80J027J510J723
53814B07208J774J811J840J732J462J340J837K931L930M214M024M143M830N466
53800B48542N309M424L693L943N077O079O051N157M301L995L924L657L187K634
53786C09973J935J133M81k3p63j824k713l100l271l499l569l451l727m688n589
$$ plain form
53771 277305 271703 266711 262214 258145 254854 252258 249400 245529 241067 236898 233251 229966 227323 225688
53757 225688 224562 222945 220672 218579 217188 215929 213872 210767 207142 203856 201713 201065 201471 202014 202187
53742 202187 202231 202530 203021 203432 203747 204099 204405 204463 204307 204177 204215 204421 204882 205725 206801 207737 208442 209275 210456
53723 210456 211563 212049 212148 212721 214027 215191 215339 214910 215243 216975 219506 222064 224611 227427 230347 232941
53707 232941 235160 237311 239502 241506 243163 244579 245945 247372 248912 250526 252095 253562 255053 256719
53693 256719 258621 260933 264015 267955 272156 275690 278042 279241 279451 278883 278047 277482 277045 276025 274255
53678 274255 272644 272118 272383 272377 271755 271201 271241 271420 271062 270278 269748 269735 269863 269717 269246 268593 267923 267384 266898 266066
53658 266066 264638 263029 261881 261139 260174 258948 258349 259004 260339 261363 261896 262442 263221 264016 264759 265620 266555
$$ packed form
53771B77305n602m992m497m069l291k596k858l871m462m169l647l285k643j635
53757B25688j126j617k273k093j391j259k057l105l625l286k143o48M06N43J73
53742B02187M4K99M91M11L15L52L06N8j56j30L8K06M61Q43J076R36P05Q33J181
53723B10456J107M86R9N73J306J164J48m29L33J732K531K558K547K816K920K594
53707B32941K219K151K191K004J657J416J366J427J540J614J569J467J491J666
53693B56719J902K312L082L940M201L534K352J199K10n68q36n65m37j020j770
53678B74255j611n26K65oo22n54M0J79l58p84n30j3J28j46m71o53o70n39m86q32
53658B66066j428j609j148p42r65j226n99O55J335J024N33N46P79P95P43Q61R35
$$ plain form
53641 266555 267331 267931 268478 268930 269370 270326 272082 273877 274713 275001 276387 279678 283808 287249 289578 291182
53625 291182 292307 293173 294389 296316 298400 299964 301371 303617 306881 310254 312969 315251 317851 321253
53611 321253 325486 330298 335370 340549 345837 350938 355088 357805 359678 361887 364974 368574 372269 376008
53597 376008 379509 381923 382657 382250 381991 382735 384308 386014 387475 388936 390807 392960 394599 394985 394152 392736
53581 392736 391153 389276 386885 384140 381459 379142 377232 375493 373418 370445 366476 362170 358559 356308
53567 356308 355264 354658 353739 352361 351020 350347 350512 351089 351396 351059 350413 350420 351892 354578 357238 358889 359826
53550 359826 361093 363097 365180 366613 367578 368896 371059 373816 376673 379542 382800 386788 391399 396260
53536 396260 401228 406566 412643 419671 427720 436670 446066 455387 464691 474641 485584 496959 508040
$$ packed form
53641B66555P76O00N47M52M40R56J756J795Q36K88J386L291M130L441K329J604
53625B91182J125Q66J216J927K084J564J407K246L264L373K715K282K600L402
53611C21253M233M812N072N179N288N101M150K717J873K209L087L600L695L739
53597C76008L501K414P34m07k59P44J573J706J461J461J871K153J639L86q33j416
53581C92736j583j877k391k745k681k317j910j739k075k973l969m306l611k251
53567C56308j044o06r19j378j341o73J65N77L07l37o46PJ472K686K660J651R37
53550C59826J267K004K083J433R65J318K163K757K857K869L258L988M611M861
53536C96260M968N338O077P028Q049Q950R396R321R304R950J0943J1375J1081
$$ plain form
53523 508040 518950 530385 542600 555341 568716 583353 599451 616319 633202 650111 667545
53512 667545 685831 705137 725779 748001 771529 795634 819582 842931 865610 887968 910498
53501 910498 933246 955640 977196 998130 1018922 1039430 1058950 1077241 1094978 1112932 1130981
53490 1130981 1148373 1164888 1181292 1198423 1216182 1233838 1251207 1268894 1287155 1305097 1321524
53479 1321524 1336220 1349730 1362112 1372729 1381372 1388750 1395463 1401100 1404831 1406355 1405756 1402904 1397704
53466 1397704 1390712 1382792 1374203 1364608 1353918 1342478 1330339 1316993 1302091 1285932 1268955 1251186
53454 1251186 1232561 1213481 1194573 1176055 1157695 1139388 1121421 1104120 1087500 1071400 1055831
53443 1055831 1041074 1027426 1014959 1003599 993401 984623 977414 971542 966582 962331 958918 956587 955598
$$ packed form
53523E08040J0910J1435J2215J2741J3375J4637J6098J6868J6883J6909J7434
53512F67545J8286J9306K0642K2222K3528K4105K3948K3349K2679K2358K2530
53501I10498K2748K2394K1556K0934K0792K0508J9520J8291J7737J7954J8049
53490A130981J7392J6515J6404J7131J7759J7656J7369J7687J8261J7942J6427
53479A321524J4696J3510J2382J0617Q643P378O713N637L731J524n99k852n200
53466A397704o992p920q589r595j0690j1440j2139j3346j4902j6159j6977j7769
53454A251186j8625j9080j8908j8518j8360j8307j7967j7301j6620j6100j5569
53443A055831j4757j3648j2467j1360j0198q778p209n872m960m251l413k331r89
$$ plain form
53430 955598 956288 958887 963125 968288 973823 979749 986365 993813 1002148 1011711 1023065 1036536 1051948 1068813
53416 1068813 1086679 1105423 1125346 1146941 1170432 1195567 1221952 1249471 1278218 1308250 1339704
53405 1339704 1373019 1408648 1446524 1486168 1527341 1570206 1614781 1660658 1707464 1755161 1803603
53394 1803603 1852248 1900821 1949977 2000658 2052797 2105195 2156782 2207442 2257372 2306059 2352416
53383 2352416 2395805 2436551 2475355 2512379 2547019 2578486 2606478 2631191 2652719 2670608 2684091
53372 2684091 2692599 2695944 2694152 2687316 2675462 2658371 2635737 2607839 2575845 2540947 2503239 2462028
53360 2462028 2417304 2370327 2322528 2274464 2226200 2178094 2130554 2083409 2036282 1989485 1943878
53349 1943878 1899806 1856766 1814226 1772240 1731081 1690751 1651185 1612642 1575532 1539929 1505498
$$ packed form
53430I55598O90K599M238N163N535N926O616P448Q335R563J1354J3471J5412J6865
53416A068813J7866J8744J9923K1595K3491K5135K6385K7519K8747L0032L1454
53405A339704L3315L5629L7876L9644M1173M2865M4575M5877M6806M7697M8442
53394A803603M8645M8573M9156N0681N2139N2398N1587N0660M9930M8687M6357
53383B352416M3389M0746L8804L7024L4640L1467K7992K4713K1528J7889J3483
53372B684091Q508L345j792o836j1854j7091k2634k7898l1994l4898l7708m1211
53360B462028m4724m6977m7799m8064m8264m8106m7540m7145m7127m6797m5607
53349A943878m4072m3040m2540m1986m1159m0330l9566l8543l7110l5603l4431
$$ plain form
53338 1505498 1471883 1439210 1408273 1380186 1355554 1333911 1314032 1294830 1275843 1256993 1238244
53327 1238244 1219587 1201165 1183341 1166733 1151993 1139151 1127183 1114715 1101408 1088365 1077071
53316 1077071 1068210 1061598 1056736 1053082 1050138 1047806 1046609 1047230 1049840 1054054 1059345 1065290 1071650 1078674
53302 1078674 1087199 1098064 1111300 1126201 1142181 1159259 1177657 1197333 1218087 1239897 1262829
53291 1262829 1286701 1310998 1335168 1358899 1382072 1404457 1425516 1444658 1461817 1477680 1493123
53280 1493123 1508275 1522139 1533142 1540145 1543168 1543290 1541706 1538668 1533375 1525043 1513942 1501171 1487526
53267 1487526 1472883 1456641 1438403 1418139 1396072 1372641 1348397 1323758 1298906 1273925 1248738
53256 1248738 1222945 1196076 1168255 1140367 1113335 1087435 1062439 1038092 1014094 989954 965350
$$ packed form
53338A505498l3615l2673l0937k8087k4632k1643j9879j9202j8987j8850j8749
53327A238244j8657j8422j7824j6608j4740j2842j1968j2468j3307j3043j1294
53316A077071q861o612m862l654k944k332j197O21K610M214N291N945O360P024
53302A078674Q525J0865J3236J4901J5980J7078J8398J9676K0754K1810K2932
53291A262829K3872K4297K4170K3731K3173K2385K1059J9142J7159J5863J5443
53280A493123J5152J3864J1003P003L023J22j584l038n293q332j1101j2771j3645
53267A487526j4643j6242j8238k0264k2067k3431k4244k4639k4852k4981k5187
53256A248738k5793k6869k7821k7888k7032k5900k4996k4347k3998k4140k4604
$$ plain form
53245 965350 940602 916406 893160 870831 849342 828611 808284 788010 768093 749371 732255
53234 732255 716385 701407 687542 674957 663061 651067 638950 627243 616013 604747 593285
53223 593285 582194 571891 561872 551182 539390 526789 513870 500994 488465 476503 465105
53212 465105 454150 443732 434171 425597 417709 410106 402794 396109 390123 384295 377913 370795 363320 355851
53198 355851 348471 341383 335144 330067 325576 320652 315016 309492 305063 301795 298833 295235 290745 285908
53184 285908 281568 278133 275260 272406 269644 267611 266599 266048 265153 263696 262041 260572 259431 258596 257898
53169 257898 257041 255898 254718 253792 253027 252136 251150 250431 250161 250062 249647 248521 246571 244167 242142 241157 240930
53152 240930 240480 239321 238062 237578 237873 238154 237866 237191 236512 235881 235226 234769 234865 235530 236411 237197 237762 237885
$$ packed form
53245I65350k4748k4196k3246k2329k1489k0731k0327k0274j9917j8722j7116
53234G32255j5870j4978j3865j2585j1896j1994j2117j1707j1230j1266j1462
53223E93285j1091j0303j0019j0690j1792j2601j2919j2876j2529j1962j1398
53212D65105j0955j0418r561q574p888p603p312o685n986n828o382p118p475p469
53198C55851p380p088o239n077m491m924n636n524m429l268k962l598m490m837
53184B85908m340l435k873k854k762k033j012n51q95j457j655j469j141q35o98
53169B57898q57j143j180r26p65q91r86p19k70r9m15j126j950k404k025r85k27
53152B40930m50j159j259m84K95K81k88o75o79o31o55m57R6O65Q81P86N65J23
$$ plain form
53134 237885 237206 235704 233958 232646 231934 231584 231534 231950 232778 233645 234377 235243 236504 237956 239151 239868 240201
53117 240201 240390 240722 241406 242369 243348 244327 245589 247137 248395 248820 248589 248230 247755 246654 244735 242479 240400
53100 240400 238471 236437 234472 233142 232737 232816 232557 231608 230519 230138 230573 230994 230620 229643 228915 228928 229428 229964
53082 229964 230404 230895 231578 232423 233216 233740 234092 234660 235562 236256 236050 234899 233381 231995 230889 230171 229958
53065 229958 229976 229611 228589 227334 226427 225991 225774 225611 225524 225508 225452 225276 225078 225099 225478 225989 226210 226073 226053 226458
53045 226458 226816 226415 225352 224469 224171 223914 223085 221867 220882 220372 220118 219906 219710 219569 219588 219940 220633 221392
53027 221392 221959 222436 223163 224382 226071 227955 229563 230430 230411 229735 228760 227821 227220 227092 227266 227554 228127 229184
53009 229184 230363 231007 231113 231375 232096 232748 232948 233177 233929 234801 235154 235281 236024 237445 238741 239448 239882 240279
$$ packed form
53134B37885o79j502j746j312p12l50n0M16Q28Q67P32Q66J261J452J195P17L33
53117B40201J89L32O84R63R79R79J262J548J258M25k31l59m75j101j919k256k079
53100B40400j929k034j965j330m05P9k59r49j089l81M35M21l74r77p28J3N00N36
53082B29964M40M91O83Q45P93N24L52N68R02O94k06j151j518j386j106p18k13
53065B29958J8l65j022j255r07m36k17j63q7j6n6j76j98K1L79N11K21j37k0M05
53045B26458L58m01j063q83k98k57q29j218r85n10k54k12j96j41J9L52O93P59
53027B21392N67M77P27J219J689J884J608Q67j9o76r75r39o01j28J74K88N73J057
53009B29184J179O44J06K62P21O52K00K29P52Q72L53J27P43J421J296P07M34L97
$$ plain form
52991 240279 240314 239842 239520 240085 241346 242327 242355 241667 240969 240664 240603 240476 240281 240290 240674 241401 242538 244286 246544
52972 246544 248733 250444 251998 253930 256070 257710 258643 259445 260535 261493 261650 261057 260426 260236 260289 260158 259797
52955 259797 259520 259466 259283 258477 257047 255609 254749 254404 254042 253398 252745 252368 252035 251181 249538 247446 245518
52938 245518 244121 243206 242567 242167 242178 242738 243704 244578 244640 243339 240807 237932 235628 234026 232573 230941 229445
52921 229445 228507 228113 228075 228440 229232 230026 230240 229787 229147 228791 228888 229425 230226 230834 230777 230122 229496 229405 229746 230154
52901 230154 230605 231390 232468 233119 232520 230745 229006 228654 229898 231727 233065 233705 234060 234374 234491 234189 233439
52884 233439 232470 231739 231630 232036 232486 232894 233789 235479 237344 238487 238827 238961 239142 239102 238898 239206 240456 242145
52866 242145 243345 243659 243464 243394 243790 244466 244912 244835 244499 244393 244642 245023 245417 245820 245937 245291 243853 242153
$$ packed form
52991B40279L5m72l22N65J261R81K8o88o98l05o1j27j95RL84P27J137J748K258
52972B46544K189J711J554J932K140J640R33Q02J090R58J57n93o31j90N3j31l61
52955B59797k77n4j83q06j430j438q60l45l62o44o53l77l33q54j643k092j928
52938B45518j397r15o39m00J1N60R66Q74O2j301k532k875k304j602j453j632j496
52921B29445r38l94l8L65P92P94K14m53o40l56R7N37Q01O08n7o55o26r1L41M08
52901B30154M51P85J078O51n99j775j739l52J244J829J338O40L55L14J17l02p50
52884B33439r69p31j09M06M50M08Q95J690J865J143L40J34J81m0k04L08J250J689
52866B42145J200L14j95p0L96O76M46p7l36j06K49L81L94M03J17o46j438j700
$$ plain form
52848 242153 240549 238866 236956 235112 233535 231790 229346 226448 223940 222228 220923 219553 218229 217358
52834 217358 217014 216874 216681 216477 216404 216521 216859 217409 217894 217777 216811 215425 214227 213197 211859 210282 209298
52817 209298 209410 210082 210568 211040 212278 214469 216957 219063 220556 221374 221534 221394 221487 221980 222645 223367 224144
52800 224144 224645 224401 223535 222721 222156 221213 219351 216879 214489 212566 211266 210743 210826 210903 210586 210226 210311 210676
52782 210676 210722 210178 209273 208390 207883 207970 208471 208965 209539 210921 213368 215867 217136 217152 216931 216969 216779 216014 215132
52763 215132 214638 214357 213944 213552 213521 213724 213766 213613 213579 213749 213847 213678 213362 213072 212786 212452 212237 212479 213439 215073
52743 215073 217015 218707 219766 220355 221125 222561 224368 225716 226278 226741 228018 230061 231875 232758 233136 233990
52727 233990 235712 237828 239634 240827 241550 242048 242320 242064 241067 239669 238650 238504 238965 239354 239211 238459 237229
$$ packed form
52848B42153j604j683j910j844j577j745k444k898k508j712j305j370j324q71
52834B17358l44j40j93k04p3J17L38N50M85j17r66j386j198j030j338j577r84
52817B09298J12O72M86M72J238K191K488K106J493Q18J60j40R3M93O65P22P77
52800B24144N01k44q66q14n65r43j862k472k390j923j300n23Q3P7l17l60Q5L65
52782B10676M6n44r05q83n07Q7N01M94N74J382K447K499J269J6k21L8j90p65q82
52763B15132m94k81m13l92l1K03M2j53l4J70R8j69l16k90k86l34k15K42R60J634
52743B15073J942J692J059N89P70J436J807J348N62M63J277K043J814Q83L78Q54
52727B33990J722K116J806J193P23M98K72k56r97j398j019j46M61L89j43p52j230
$$ plain form
52710 237229 235816 234650 233941 233433 232748 231910 231319 231238 231575 232028 232287 232203 232019 232232 232882 233249 232779 232091 232359
52691 232359 233676 234856 235057 234824 235045 235662 236170 236741 237841 239034 239326 238805 238846 240192 241762 242024 240967
52674 240967 239883 239602 239791 239865 239714 239369 238672 237656 236802 236566 236855 237229 237395 237361 237302 237466 238003 238821 239725
52655 239725 240724 241916 243143 244188 245369 247320 249915 251949 252319 251153 249394 247753 246572 246194 246650
52640 246650 247157 246713 245193 243328 241740 240665 240447 241454 243304 244943 245819 246449 247646 249643 252119
52625 252119 254480 255973 256227 255995 256664 258529 260185 260136 258471 256344 254346 252212 249821 247605 245928
52610 245928 244767 244100 244067 244550 244984 244829 244048 243088 242580 242999 244296 245821 246822 247102 247054 247117 247405 247881
52592 247881 248616 249767 251351 253087 254472 255132 255155 255025 255134 255498 255973 256573 257419 258435 259210 259171 258013
$$ packed form
52710B37229j413j166p09n08o85q38n91q1L37M53K59q4j84K13O50L67m70o88K68
52691B32359J317J180K01k33K21O17N08N71J100J193K92n21M1J346J570K62j057
52674B40967j084k81J89P4j51l45o97j016q54k36K89L74J66l4n9J64N37Q18R04
52655B39725R99J192J227J045J181J951K595K034L70j166j759j641j181l78M56
52640B46650N07m44j520j865j588j075k18J007J850J639Q76O30J197J997K476
52625B52119K361J493K54k32O69J865J656m9j665k127j998k134k391k216j677
52610B45928j161o67l3M83M34j55p81r60n08M19J297J525J001K80m8O3K88M76
52592B47881P35J151J584J736J385O60K3j30J09L64M75O00Q46J016P75l9j158
$$ plain form
52575 258013 256149 254640 254338 255055 255813 255908 255363 254489 253560 252996 253188 253831 254018 253377 252563 252222 252013 251244
52557 251244 249993 248863 247970 246936 245766 244997 244967 245518 246399 247353 247804 247105 245309 243256 241708 240747 240107
52540 240107 239700 239555 239564 239556 239561 239873 240822 242394 244069 245157 245429 245196 244691 243809 242667 241952 242194 243014 243660
52521 243660 244022 244583 245498 246375 246871 246952 246618 245977 245574 246031 247286 248795 250526 253067 256555 260157 263026
52504 263026 265268 267474 269643 271043 271049 269792 267933 266058 264369 262862 261557 260390 259019 257216 255462
52489 255462 254603 254602 254298 252886 251046 249888 249317 248423 247133 246337 246402 246733 247032 247902 249833 252454 255209
52472 255209 257999 260610 262343 262839 262726 262863 263378 263979 264716 265885 267497 269378 271494 273773 275865 277453
52456 277453 278531 279137 279191 278850 278534 278154 276813 273832 269830 266278 264146 263266 262759 261770 260102 258436
$$ packed form
52575B58013j864j509l02P17P58R5n45q74r29n64J92O43J87o41q14l41k09p69
52557B51244j251j130q93j034j170p69l0N51Q81R54M51o99j796k053j548r61o40
52540B40107m07j45RqNL12R49J572J675J088K72k33n05q82j142p15K42Q20O46
52521B43660L62N61R15Q77M96Q1l34o41m03M57J255J509J731K541L488L602K869
52504B63026K242K206K169J400Oj257j859j875j689j507j305j167j371j803j754
52489B55462q59jl04j412j840j158n71q94j290p96O5L31K99Q70J931K621K755
52472B55209K790K611J733M96j13J37N15O01P37J169J612J881K116K279K092J588
52456B77453J078O06N4l41l16l80j341k981m002l552k132q80n07r89j668j666
$$ plain form
52440 258436 257673 257887 258264 258196 257825 257225 255877 253516 250893 249022 248156 248095 248900 250430 251709 251777 250951 250347
52422 250347 250344 250435 250468 250952 252053 253213 254104 255160 256835 258983 261350 264156 267794 272334 277621 283583
52406 283583 290201 297360 304811 312032 318252 322995 326611 329769 332392 333637 333010 330951 328147 324804
52392 324804 320935 316859 313004 309514 306384 303729 301621 299881 298302 296961 296082 295713 295702 295884 296196 296749
52376 296749 297835 299697 302243 305145 308178 311205 313912 315986 317657 319648 322402 325740 329333 333052
52362 333052 336598 339336 340999 342253 343994 346241 348212 349372 349921 350200 350218 350018 350156 351330 353592 356210
52346 356210 358464 360434 362789 365872 369268 372420 375433 378958 383379 388465 393890 399734 406283 413652
52332 413652 421835 430930 440970 451653 462608 473919 486131 499698 514662 530891 548298 566638
$$ packed form
52440B58436p63K14L77o8l71o00j348k361k623j871q66o1Q05J530J279O8q26o04
52422B50347lR1L3M84J101J160Q91J056J675K148K367K806L638M540N287N962
52406B83583O618P159P451P221O220M743L616L158K623J245o27k059k804l343
52392C24804l869m076l855l490l130k655k108j740j579j341q79l69j1J82L12N53
52376B96749J086J862K546K902L033L027K707K074J671J991K754L338L593L719
52362C33052L546K738J663J254J741K247J971J160N49K79J8k00J38J174K262K618
52346C56210K254J970K355L083L396L152L013L525M421N086N425N844O549P369
52332D13652Q183R095J0040J0683J0955J1311J2212J3567J4964J6229J7407J8340
$$ plain form
52320 566638 585341 603883 622272 640851 659592 677928 695461 712538 729797 747305 764592
52309 764592 781475 798320 815275 831722 846857 860501 872892 883971 893545 902135 910940 920596
52297 920596 930292 938550 944667 949062 952362 954563 955234 954268 952145 949457 946323 942392 937372 931445 925176
52282 925176 919235 914296 910956 909383 909059 909211 909710 911323 914879 920273 926539 932948 939812 948043 957981
52267 957981 968897 979732 990136 1000570 1011530 1023027 1034848 1046950 1059315 1071645 1083548
52256 1083548 1094949 1106049 1116856 1127045 1136311 1144739 1152673 1160252 1167068 1172351 1175696 1177603 1179063
52243 1179063 1180391 1180737 1179017 1175120 1169888 1164096 1157946 1151478 1144865 1138054 1130641 1122543 1114541 1107720
52229 1107720 1102383 1097927 1093844 1090413 1088149 1086847 1085716 1084488 1083868 1084568 1086323 1088317 1090301 1092593
$$ packed form
52320E66638J8703J8542J8389J8579J8741J8336J7533J7077J7259J7508J7287
52309G64592J6883J6845J6955J6447J5135J3644J2391J1079R574Q590Q805R656
52297I20596R696Q258O117M395L300K201O71r66k123k688l134l931n020n927o269
52282I25176n941m939l340j573l24J52M99J613L556N394O266O409O864Q231R938
52267I57981J0916J0835J0404J0434J0960J1497J1821J2102J2365J2330J1903
52256A083548J1401J1100J0807J0189R266Q428P934P579O816N283L345J907J460
52243A179063J328L46j720l897n232n792o150o468o613o811p413q098q002o821
52229A107720n337m456m083l431k264j302j131j228o20P00J755J994J984K292
$$ plain form
52215 1092593 1095134 1097426 1099659 1103025 1108353 1115006 1121782 1128391 1135323 1142710 1150209 1157808 1165728 1173465
52201 1173465 1179849 1184429 1188134 1192206 1197025 1202284 1207769 1213480 1219258 1224758 1229676 1233884 1237532 1241099
52187 1241099 1245006 1248976 1252163 1254069 1255016 1255464 1255288 1254012 1251439 1247657 1242666 1236398 1229014 1220850 1212180
52172 1212180 1203279 1194643 1186838 1180068 1174102 1168680 1163906 1160210 1157852 1156489 1155332 1153945 1152763 1152680
52158 1152680 1154212 1157232 1161191 1165175 1168033 1169159 1169213 1169424 1170087 1170366 1169727 1168780 1168339 1168339 1168271 1168129 1168254 1168558
52140 1168558 1168546 1167954 1166900 1165589 1164317 1163611 1163929 1165279 1167420 1170315 1174097 1178883 1184888 1192466 1201757
52125 1201757 1212612 1225214 1240306 1258341 1278756 1300621 1323658 1348048 1373582 1399750 1426398
52114 1426398 1453515 1480452 1506083 1529753 1551440 1571035 1588206 1603005 1615901 1627070 1636311
$$ packed form
52215A092593K541K292K233L366N328O653O776O609O932P387P499P599P920P737
52201A173465O384M580L705M072M819N259N485N711N778N500M918M208L648L567
52187A241099L907L970L187J906R47M48j76j276k573l782m991o268p384q164q670
52172A212180q901q636p805o770n966n422m774l696k358j363j157j387j182q3
52158A152680J532L020L959L984K858J126N4K11O63K79o39r47m41%o8j42J25L04
52140A168558j2n92j054j311j272p06L18J350K141K895L782M786O005P578R291
52125A201757J0855J2602J5092J8035K0415K1865K3037K4390K5534K6168K6648
52114A426398K7117K6937K5631K3670K1687J9595J7171J4799J2896J1169R241
$$ plain form
52103 1636311 1643747 1649856 1654645 1657578 1658697 1659096 1659739 1660316 1659732 1657417 1653702 1649212 1644257 1638572 1631432
52088 1631432 1622239 1611252 1599440 1587497 1575424 1563265 1551706 1541569 1533107 1526202 1520887 1517288
$$ packed form
52103A636311P436O109M789K933J119L99O43N77n84k315l715m490m955n685p140
52088A631432r193j0987j1812j1943j2073j2159j1559j0137q462o905n315l599
$$ [...]
##END NTUPLES=NMR SPECTRUM
##END=
