
##TITLE=AC1304_DOMAH11116_6534465_bocw5Zzm92
##JCAMPDX= 6.0         $$ Bruker NMR JCAMP-DX V2.0
##DATA TYPE= NMR SPECTRUM
##DATA CLASS= NTUPLES
##ORIGIN= BRUKER
##OWNER= Administrator
$$ 1.72 TOPSPIN		Version 2.1
$$ 2012-07-17 01:03:40.218 -0500  Administrator@TOPSPIN
$$ Compression mode = diff/dup
##.OBSERVE FREQUENCY= 400.02188249412
##.OBSERVE NUCLEUS= ^1H
##.ACQUISITION MODE= SIMULTANEOUS (DQD)
##.ACQUISITION SCHEME= undefined
##.AVERAGES= 8
##.DIGITISER RES= 22
##SPECTROMETER/DATA SYSTEM= spect
##.PULSE SEQUENCE= zg30
##.SOLVENT NAME= COFFEE_meoh
##.SHIFT REFERENCE= INTERNAL, COFFEE_meoh, 1, 14.98509
##AUDIT TRAIL= $$ (NUMBER, WHEN, WHO, WHERE, PROCESS, VERSION, WHAT)
$$ ##TITLE= Audit trail, TOPSPIN		Version 2.1
$$ ##JCAMPDX= 5.01
$$ ##ORIGIN= Bruker BioSpin GmbH
$$ ##OWNER= Administrator
$$ $$ C:\Bruker\TOPSPIN/data/COFFEE/nmr/AC1304_DOMAH11116_6534465_bocw5Zzm92/10/pdata/1/auditp.txt
$$ ##AUDIT TRAIL=  $$ (NUMBER, WHEN, WHO, WHERE, PROCESS, VERSION, WHAT)
(   1,<2012-07-17 01:03:32.671 -0500>,<Administrator>,<TOPSPIN>,<go>,<TOPSPIN 2.1>,
      <created by zg
	started at 2012-07-17 01:02:25.781 -0500,
	POWCHK enabled, PULCHK disabled,
       configuration hash MD5:
       6B 1B 68 BB D9 2E 58 E2 7F 35 AD 54 07 DF 0E 41
       data hash MD5: 64K
       49 82 4B B4 42 65 37 93 DB 4D 5B 9D 5E 1B F8 C7>)
(   2,<2012-07-17 01:03:35.921 -0500>,<Administrator>,<TOPSPIN>,<proc1d>,<TOPSPIN 2.1>,
      <Start of raw data processing
       efp LB = 0 FT_mod = 6 PKNL = 1 PHC0 = 0 PHC1 = 0 SI = 32K 
       data hash MD5: 32K
       03 B4 58 29 0C B2 B4 AC 9A 3A C6 63 B9 07 39 07>)
(   3,<2012-07-17 01:03:36.218 -0500>,<Administrator>,<TOPSPIN>,<proc1d>,<TOPSPIN 2.1>,
      <pk PHC0 = 178.8245 PHC1 = 0 
       data hash MD5: 32K
       47 F9 A7 60 B5 57 EB E8 CC E0 BA 94 AC 8D 9A AC>)
(   4,<2012-07-17 01:03:36.281 -0500>,<Administrator>,<TOPSPIN>,<proc1d>,<TOPSPIN 2.1>,
      <abs ABSG = 1 
       data hash MD5: 32K
       F5 BC 22 C2 4E 9B 4F C4 DF 66 5F 76 66 8F DE 13>)
(   5,<2012-07-17 01:03:36.312 -0500>,<Administrator>,<TOPSPIN>,<proc1d>,<TOPSPIN 2.1>,
      <abs ABSG = 2 
       data hash MD5: 32K
       D4 50 8F B8 D9 9F 86 21 66 0A B7 37 DF 79 F6 01>)
(   6,<2012-07-17 01:03:36.343 -0500>,<Administrator>,<TOPSPIN>,<proc1d>,<TOPSPIN 2.1>,
      <abs ABSG = 3 
       data hash MD5: 32K
       2F CE 87 A0 66 07 51 36 22 FB 76 46 7D BE 83 6D>)
(   7,<2012-07-17 01:03:36.359 -0500>,<Administrator>,<TOPSPIN>,<proc1d>,<TOPSPIN 2.1>,
      <abs ABSG = 4 
       data hash MD5: 32K
       07 BA 4D BA 56 42 D4 21 46 36 34 1D 9B A1 9C 0C>)
(   8,<2012-07-17 01:03:36.390 -0500>,<Administrator>,<TOPSPIN>,<proc1d>,<TOPSPIN 2.1>,
      <abs ABSG = 5 
       data hash MD5: 32K
       A1 93 F1 E8 55 2A 38 21 EA BC 64 B0 34 F8 1B F2>)
$$ ##END=
$$ 
$$ $$ hash MD5
$$ $$ A1 EB 6A 2E 2A 4F 55 43 63 4E 72 CF 18 32 71 CE
##$RELAX= 
##$RELAX= 
##$RELAX= 
##$RELAX= 
##$RELAX= 
##$RELAX= 
##$RELAX= 
$$ Bruker specific parameters
$$ --------------------------
$$ [...]
150 150 150 150 150 150 150 150
##$TP07= 0
##$TPNAME0= <>
##$TPNAME1= <>
##$TPNAME2= <>
##$TPNAME3= <>
##$TPNAME4= <>
##$TPNAME5= <>
##$TPNAME6= <>
##$TPNAME7= <>
##$TPOAL= (0..7)
0.5 0.5 0.5 0.5 0.5 0.5 0.5 0.5
##$TPOFFS= (0..7)
0 0 0 0 0 0 0 0
##$TUNHIN= 0
##$TUNHOUT= 0
##$TUNXOUT= 0
##$USERA1= <user>
##$USERA2= <user>
##$USERA3= <user>
##$USERA4= <user>
##$USERA5= <user>
##$V9= 5
##$VALIST= <valist>
##$VCLIST= <CCCCCCCCCCCCCCC>
##$VD= 0
##$VDLIST= <DDDDDDDDDDDDDDD>
##$VPLIST= <PPPPPPPPPPPPPPP>
##$VTLIST= <TTTTTTTTTTTTTTT>
##$WBST= 2048
##$WBSW= 25
##$XGAIN= (0..3)
0 0 0 0
##$XL= 0
##$YL= 0
##$YMAX_a= 508086
##$YMIN_a= -649317
##$ZGOPTNS= <>
##$ZL1= 120
##$ZL2= 120
##$ZL3= 120
##$ZL4= 120
##$ABSF1= 14.98509
##$ABSF2= -5.573092
##$ABSG= 5
##$ABSL= 3
##$ALPHA= 0
##$AQORDER= 0
##$ASSFAC= 0
##$ASSFACI= 0
##$ASSFACX= 0
##$ASSWID= 0
##$AUNMP= <proc_prof1d_extract_pilot.lims>
##$AXLEFT= 0
##$AXNAME= <>
##$AXNUC= <1H>
##$AXRIGHT= 0
##$AXTYPE= 0
##$AXUNIT= <>
##$AZFE= 0.1
##$AZFW= 0.1
##$BCFW= 0
##$BC_mod= 0
##$BYTORDP= 0
##$COROFFS= 0
##$CY= 15
##$DATMOD= 1
##$DC= 0
##$DFILT= <>
##$DTYPP= 0
##$F1P= 0
##$F2P= 0
##$FCOR= 0.5
##$FTSIZE= 32768
##$FT_mod= 6
##$GAMMA= 0
##$GB= 0
##$INTBC= 1
##$INTSCL= 1
##$ISEN= 128
##$LB= 0
##$LEV0= 0
##$LPBIN= 0
##$MAXI= 10000
##$MC2= 0
##$MEAN= 0
##$ME_mod= 0
##$MI= 0
##$NCOEF= 0
##$NC_proc= -8
##$NLEV= 6
##$NOISF1= 0
##$NOISF2= 0
##$NSP= 0
##$NTH_PI= 0
##$NZP= 0
##$OFFSET= 14.98509
##$PC= 1
##$PHC0= 178.8245
##$PHC1= 0
##$PH_mod= 1
##$PKNL= yes
##$PPARMOD= 0
##$PPDIAG= 0
##$PPIPTYP= 0
##$PPMPNUM= 2147483647
##$PPRESOL= 1
##$PSCAL= 4
##$PSIGN= 0
##$PYNMP= <proc.py>
##$REVERSE= no
##$SF= 400.02
##$SI= 32768
##$SIGF1= 0
##$SIGF2= 0
##$SINO= 400
##$SIOLD= 32768
##$SPECTYP= <>
##$SREGLST= <1H.CDCl3>
##$SSB= 0
##$STSI= 32768
##$STSR= 0
##$SW_p= 8223.68421052631
##$SYMM= 0
##$S_DEV= 0
##$TDeff= 65536
##$TDoff= 0
##$TI= <>
##$TILT= no
##$TM1= 0
##$TM2= 0
##$TOPLEV= 0
##$USERP1= <user>
##$USERP2= <user>
##$USERP3= <user>
##$USERP4= <user>
##$USERP5= <user>
##$WDW= 1
##$XDIM= 32768
##$YMAX_p= 469173766
##$YMIN_p= -698680
##$CURPLOT= <Network HP LaserJet P1505>
##$CURPRIN= <$Network HP LaserJet P1505>
##$DFORMAT= <normdp>
##$LAYOUT= <+/1D_H.xwp>
##$LFORMAT= <normlp>
##$PFORMAT= <normpl>
##$SURQMSG= 1
$$ End of Bruker specific parameters
$$ ---------------------------------
##NTUPLES= NMR SPECTRUM
##VAR_NAME=  FREQUENCY,     SPECTRUM/REAL,   SPECTRUM/IMAG
##SYMBOL=    X,             R,               I
##VAR_TYPE=  INDEPENDENT,   DEPENDENT,       DEPENDENT
##VAR_FORM=  AFFN,          ASDF,            ASDF
##VAR_DIM=   32768,         32768,           32768
##UNITS=     HZ,            ARBITRARY UNITS, ARBITRARY UNITS
##FACTOR=    0.250966925370066, 1,           1
##FIRST=     8223.43324360094, -104561,      -105951
##LAST=      0,             -225213,         -177890
##MIN=       0,             -698680,         0
##MAX=       8223.43324360094, 469173766,    0
$$ Real data points
##PAGE= N=1
##DATA TABLE= (X++(R..R)), XYDATA
$$ [...]
19538c56972f1197C14381A30800f945D6184N1837a59253D9358f614j37110g203
$$ -356972 -61197 314381 130800 -6945 46184 98021 -159253 49358 -6614 -143724 -7203
19526c76827O0903g7670l1576j9156I3439a66611B46065d28749J41579a42224
$$ -376827 -315924 -77670 -109246 -128402 93439 -166611 246065 -428749 -287170 -142224
19515h4723J235A7713i6535l88135b14814H3497i4862E8030a24073A07148b22374
$$ -84723 -83488 17713 -96535 -484670 -214814 83497 -94862 58030 -124073 107148 -222374
19503I1000c19303A39506a69334C3798c6166C0819K8364a09194M1444K315l41463
$$ 91000 -319303 139506 -169334 33798 -36166 30819 59183 -109194 -67750 -65435 -406898
19492d06898A24731a15001c4105F3776R7560i0566b2120j1965k76279a1589A22018
$$ -406898 124731 -115001 -34105 63776 161336 -90566 -22120 -34085 -310364 -11589 122018
19480c7112p5216a8202o6524B16243d5253F9114d87902A97452a00706C9042L60697
$$ -37112 -112328 -18202 -84726 216243 -45253 69114 -487902 197452 -100706 39042 399739
19469C99739c4456m3902B8323a03172M7833j03036M2506o6457A29875j9965a19538
$$ 399739 -34456 -78358 28323 -103172 -55339 -158375 -115869 -182326 129875 109910 -119538
19457e0582J6074G4069C6996c02254h4808A01284P1637a08068a0475m4958G0051
$$ -50582 -34508 74069 36996 -302254 -84808 101284 172921 -108068 -10475 -55433 70051
19445a32728j07462k26283I297h7398j31493J7897O0280L8223B4919a0243k43287
$$ -132728 -240190 -466473 9297 -87398 -218891 -200994 -140714 -102491 24919 -10243 -253530
19434b53530j2054I3077g7221A18821R5661b56272a27812a6300k70033J14889
$$ -253530 -265584 93077 -77221 118821 214482 -256272 -127812 -16300 -286333 -171444
19424a71444j2944K7458b1880A60973a43792j24078G0309c4479D3369O7097d7656
$$ -171444 -184388 -156930 -21880 160973 -143792 -267870 70309 -34479 43369 110466 -47656
19412a6309B43166m3298H3863d9741j43485B84275b765k68017A46670b2168j72759
$$ -16309 243166 199868 83863 -49741 -193226 284275 -2765 -270782 146670 -22168 -194927
19401a94927B2807f5795c1339A9792Q3080K1716l6009a27958r181J5812A21128
$$ -194927 22807 -65795 -31339 19792 102872 124588 88579 -127958 -137139 -121327 121128
19389e0512E9159C160b94345M8723a11316D6506a79717d3184k05682G7936a40505
$$ -50512 59159 3160 -294345 -245622 -111316 46506 -179717 -43184 -248866 77936 -140505
19377A60699b66205R8556q8318C17279A48657L1102b98162a37866O7162j38958
$$ 160699 -266205 -167649 -255967 317279 148657 179759 -298162 -137866 -70704 -209662
19367b09662K5876k69311c5865B57085m7398A8015P7176Q823J18624d00821P2235
$$ -209662 -183786 -453097 -35865 257085 209687 18015 95191 104014 222638 -400821 -328586
19356c28586A07450c47659e0973H500c73149A93226p3190E4067b69147B0726R1521
$$ -328586 107450 -347659 -50973 8500 -373149 193226 120036 54067 -269147 20726 112247
19345A12247a55011k49864a64802O3883p4983m7611A14535g0030C80140f2159
$$ 112247 -155011 -404875 -164802 -100919 -175902 -223513 114535 -70030 380140 -62159
19334a13779c7406j33694j37103b0849R585k08344k466r7725A14615J19046a83400
$$ -113779 -37406 -171100 -308203 -20849 -11264 -219608 -222074 -319799 114615 233661 -183400
19322d1475B84399b90874c1693l01639A10996b06417e4173B80557B8601L7547
$$ -41475 284399 -290874 -31693 -333332 110996 -206417 -54173 280557 28601 66148
19312F6148a44538j44500J24028N7880H2277F744a28232A53784b24660H4092b54184
$$ 66148 -144538 -289038 -165010 -107130 82277 6744 -128232 153784 -224660 84092 -254184
19300I8747K5077i1258B80265b43296C18758H400e573A0367L22308d600n6653
$$ 98747 123824 -91258 280265 -243296 318758 8400 -5573 10367 332675 -4600 -61253
19289f1253I470a17447B410b96723O4267c1843F7182B7606Q957a95677r7266q364
$$ -61253 9470 -117447 2410 -296723 -232456 -31843 67182 27606 36563 -195677 -292943 -301307
19277c01307g8073j23960g4711K8728j25057l2497A22652D7036b054A17142a69602
$$ -301307 -78073 -202033 -74711 -45983 -171040 -203537 122652 47036 -2054 117142 -169602
19265c917p0485A83112e4595j96336B28405e4721k92786A09992a95097A01476
$$ -3917 -74402 183112 -54595 -250931 228405 -54721 -347507 109992 -195097 101476
19254a02405C002K80656i3589E0555g0837B8074d1376j75124a2619A05661j3477
$$ -102405 3002 283658 -93589 50555 -70837 28074 -41376 -216500 -12619 105661 92184
19243I2184b90232A40704K3840i9725j04853N7086B75326B4990M6886d47090a19341
$$ 92184 -290232 140704 164544 -99725 -204578 -147492 275326 24990 71876 -447090 -119341
19231D7652d0093A20759k4078K47950a87879N1672b2425j09551J6743A73670g1286
$$ 47652 -40093 120759 96681 344631 -187879 -136207 -22425 -131976 -115233 173670 -71286
19219b57107F185a92276j36692D2136a70201B700c2078r7346A41418b38660p8174
$$ -257107 6185 -192276 -328968 42136 -170201 2700 -32078 -129424 141418 -238660 -316834
19208c16834J27070B0667N90K21827H1772c2534j1185A79880a75345D8315h879
$$ -316834 -189764 20667 21257 243084 81772 -32534 -43719 179880 -175345 48315 -8879
19196f8820j3072j73925J20026C77103c16996F3982i2233A47112b3220A21909
$$ -68820 -81892 -255817 -135791 377103 -316996 63982 -92233 147112 -23220 121909
19185A61490g5959j89323J9276a682r050C753J50461C559a49496q5771a01172
$$ 161490 -75959 -265282 -246006 -1682 -10732 3753 154214 3559 -149496 -235267 -101172
19173C1532c87087J69579c928l09687I2341D1286R5765C5244a44753E9417P419
$$ 31532 -387087 -217508 -3928 -313615 92341 41286 137051 35244 -144753 59417 66836
19162F6836a01281h692l1783D6573a40921n7722N4405A6234b77535d7498D7283
$$ 66836 -101281 -8692 -40475 46573 -140921 -198643 -144238 16234 -277535 -47498 47283
19150a86042C5691d58903A9412c44013j5185A34827F7123J69427a26104A03413
$$ -186042 35691 -458903 19412 -344013 -359198 134827 67123 236550 -126104 103413
19139d91311a03274K6717e754A56258j0338n625b6565B754a50116C70093H0944
$$ -491311 -103274 -76557 -5754 156258 145920 140295 -26565 2754 -150116 370093 80944
19127A11552R1784d8123B91275a22712A69109p072G1929b54230f014j61511M8064
$$ 111552 203336 -48123 291275 -122712 169109 162037 71929 -254230 -6014 -167525 -119461
19116a19461b0088o3878c9344A97637l2882c09228g9650m822m2343d2713k2825
$$ -119461 -20088 -83966 -39344 197637 164755 -309228 -79650 -84472 -126815 -42713 -65538
19105f5538A94088B9709g7522j08970B12710r6773N3717g5155A25501b54344e0473
$$ -65538 194088 29709 -77522 -186492 212710 115937 169654 -75155 125501 -254344 -50473
19093a89514r7366A15237b75206a01066A19421b41572L5935E4864b29071p7207
$$ -189514 -286880 115237 -275206 -101066 119421 -241572 -205637 54864 -229071 -306278
19083c06278A38765f1680p8438A53770b02231h542q6887b1541l73044i5489q0370
$$ -306278 138765 -61680 -140118 153770 -202231 -8542 -95429 -21541 -394585 -95489 -175859
19072a75859o0032B19256r5541b33279a019A751P4232a36275A34017e3512F5969
$$ -175859 -235891 219256 123715 -233279 -1019 1751 75983 -136275 134017 -53512 65969
19060b38162b9593q0033q5477A15728a79342B7431J32355J05398a92924l5057
$$ -238162 -29593 -109626 -195103 115728 -179342 27431 159786 265184 -192924 -227981
19050b27981E9217R0158a9536E5012J80181c47291B1287i4382J1100j91855A8134
$$ -227981 59217 149375 -19536 55012 235193 -347291 21287 -94382 -83282 -275137 18134
19038c5119k66836J6066a6335A22095a19983E134J27279b30740A55418N7480F8222
$$ -35119 -301955 -285889 -16335 122095 -119983 5134 132413 -230740 155418 212898 68222
19026G2608J18467Q3958J65850a3702B54057D3442K96863B1705J88057e3617B32494
$$ 72608 191075 275033 440883 -13702 254057 43442 340305 21705 209762 -53617 232494
19014A53733h3851n5115d877r864j37354C3543b84204a26931c3605r3004D6957
$$ 153733 -83851 -138966 -4877 -14741 -152095 33543 -284204 -126931 -33605 -126609 46957
19002C01334a53299j9422j70478A72635a80642A66528d7171A02065d16322a4633
$$ 301334 -153299 -172721 -343199 172635 -180642 166528 -47171 102065 -416322 -14633
18991G3335b26197g5428K7716C9784P4122A1379d0845l6729j08963N588H6032
$$ 73335 -226197 -75428 -47712 39784 113906 11379 -40845 -77574 -186537 -180949 86032
18979f6440K6781r0756J6423J163b2481k08456A15245j862c2118q8337p9242I8450
$$ -66440 -39659 -130415 -113992 -112829 -22481 -230937 115245 113383 -32118 -120455 -199697 98450
18966A99828C952J37604C9956a0108o0229k9467m4970F4058A2138b47104R7066
$$ 199828 3952 141556 39956 -10108 -70337 -99804 -144774 64058 12138 -247104 -150038
18955a50038L4565M5100q8414d7541i962k96783i4908A75803b69714l0381R2711
$$ -150038 -115473 -70373 -158787 -47541 -9962 -306745 -94908 175803 -269714 -300095 -207384
18944b07384b1269l018n2000G9079a66407B06284b80825d2087j8375B8667b53469
$$ -207384 -21269 -24287 -76287 79079 -166407 206284 -280825 -42087 -60462 28667 -253469
18932a46372A54837c77324a059j41159e2326j2959l9669m06363a4944A539a5245
$$ -146372 154837 -377324 -1059 -142218 -52326 -65285 -104954 -511317 -14944 1539 -15245
18920b08627d2200r5572a5443A19458c3688a2185l44102b1918o2125m4658A2598
$$ -208627 -42200 -137772 -15443 119458 -33688 -12185 -356287 -21918 -84043 -128701 12598
18908b20257a686o0792A99452a84590O9769p7739G0272R281b63304k19910C9890
$$ -220257 -1686 -62478 199452 -184590 -114821 -192560 70272 79553 -263304 -483214 39890
18896i5783B11256b02719B29019H8297g1797A71102a2987n2841p2833C0158J06115
$$ -95783 211256 -202719 229019 88297 -71797 171102 -12987 -65828 -138661 30158 136273
18885A36273c7269r8321l2755H4364P6208b08751A07484f6596j64028a11797j5122
$$ 136273 -37269 -135590 -168345 84364 160572 -208751 107484 -66596 -230624 -111797 -126919
18874a26919q3503g9191k61733A0649J7368f4124D4443c886l5999B60835C2068
$$ -126919 -210422 -79191 -340924 10649 28017 -64124 44443 -3886 -39885 260835 32068
18862B48579G3254a24895A60098o6636J17022j9694a20994C7055Q425M8007l2677
$$ 248579 73254 -124895 160098 93462 210484 190790 -120994 37055 45480 93487 60810
18851F0810j4370a7191B47349b2987F1963d4409j41512q2902A6037j344f6543
$$ 60810 46440 -17191 247349 -22987 61963 -44409 -185921 -268823 16037 14693 -66543
18839A7346h6087j25037R1430C06809F5612c337B31327O489c39607J66696l2352
$$ 17346 -86087 -211124 -119694 306809 65612 -3337 231327 237816 -339607 -172911 -205263
18828b05263A47709d004j79598A40229J49914c01245J04913l6643Q4541E5313
$$ -205263 147709 -4004 -183602 140229 290143 -301245 -196332 -232975 -148434 55313
18817C8742M6012J07488q9976n0247J83472i3171A81273b22090B27940a35928
$$ 38742 84754 192242 102266 52019 235491 -93171 181273 -222090 227940 -135928
18806G0019K26266a34975d168B23779B1547d41117g3958F6701c75806R1660h2634
$$ 70019 296285 -134975 -4168 223779 21547 -441117 -73958 66701 -375806 -284146 -82634
18794b06302g5612j32153A20460J54744b57073F5984J98438C9146c7969j16435
$$ -206302 -75612 -207765 120460 275204 -257073 65984 264422 39146 -37969 -154404
18784a54404O8557k34693a58300j85795a46076g2563k8400A81414F5521a93096
$$ -154404 -85847 -320540 -158300 -344095 -146076 -72563 -100963 181414 65521 -193096
18773A3084d9904A68538l772e0928j71511A6727a27073o4726I6474B4117b30866
$$ 13084 -49904 168538 164766 -50928 -222439 16727 -127073 -191799 96474 24117 -230866
18761i5719A44225K8734e52691C7549L8031M9017E8086K87625b5873B1081J99715
$$ -95719 144225 172959 -552691 37549 75580 124597 58086 345711 -25873 21081 220796
18750B20796A2636a68829n4429O7115d3081A02902c77513J37184A39372h0864
$$ 220796 12636 -168829 -223258 -156143 -43081 102902 -377513 -240329 139372 -80864
18739D84715A51795D2626b7389r8039B4926K8239j7140J5004q896a22991I637
$$ 484715 151795 42626 -27389 -125428 24926 53165 36025 51029 42133 -122991 9637
18727A71496a48643c2878p684m1931C061K60730e4171A16854J59026a04711b2456
$$ 171496 -148643 -32878 -40562 -82493 3061 263791 -54171 116854 275880 -104711 -22456
18715C4244a77116f0037o0256G0173K51486a0561k55694g5615k7361l8592j04287
$$ 34244 -177116 -60037 -120293 70173 321659 -10561 -266255 -75615 -102976 -141568 -245855
18704b45855A95872c60827A29291d6433j86933A45764i8841j00073N8722j0644
$$ -245855 195872 -360827 129291 -46433 -233366 145764 -98841 -198914 -140192 -150836
18694a50836A05553k998a53429g2268c6102k51915A15803m6832i3124n3400B48389
$$ -150836 105553 102555 -153429 -72268 -36102 -288017 115803 68971 -93124 -146524 248389
18682D58a3134j63164G9038M038e9452k38848p7575G8141K969N9069L52g6940
$$ 458 -13134 -176298 79038 83076 -59452 -298300 -375875 78141 81110 140179 140531 -76940
18669A24784c3405r7621L4404l3130K0700p1393M8720k15275g9400j33659A80358
$$ 124784 -33405 -131026 -96622 -129752 -109052 -180445 -131725 -347000 -79400 -213059 180358
18657a5735D3830e2083r4173q2807A38217b08867c2382C2896b48859A28399A1007
$$ -15735 43830 -52083 -146256 -229063 138217 -208867 -32382 32896 -248859 128399 11007
18645c27493J63225I3455a48977d8368k5707l27759J18012H114c77389a78191
$$ -327493 -164268 93455 -148977 -48368 -74075 -401834 -283822 8114 -377389 -178191
18634H2334a97284A70757K7105c24813B15575b159o4640g999B2690a20966j26681
$$ 82334 -197284 170757 197862 -324813 215575 -2159 -66799 -7999 22690 -120966 -247647
18623b47647a12436F0906J62824b11950A1069K04915b67398a26414b6656j33453
$$ -247647 -112436 60906 223730 -211950 11069 215984 -267398 -126414 -26656 -160109
18613a60109j13347a09239A00030a5118j9160j14549d6319p7426d8020E9437a64358
$$ -160109 -273456 -109239 100030 -15118 -34278 -148827 -46319 -123745 -48020 59437 -164358
18601B0066e0754F5511A8790a45858K7320j54284k5970B76923n9470c672A00294
$$ 20066 -50754 65511 18790 -145858 -118538 -272822 -298792 276923 217453 -3672 100294
18589a03689c7534l57039A19059J63198a14702b5320l87800a49989B7805g9317
$$ -103689 -37534 -394573 119059 282257 -114702 -25320 -413120 -149989 27805 -79317
18578A8516f5817J7404l79920h4978l15656A35103a61046b6489k14199N5475l3806
$$ 18516 -65817 -48413 -428333 -84978 -400634 135103 -161046 -26489 -240688 -185213 -219019
18567b19019M3326B35727h9862B52135I1998b69404f5829j47698B32485J45914
$$ -219019 -175693 235727 -89862 252135 91998 -269404 -65829 -213527 232485 378399
18557C78399b99596h9685K526A64964b78549o8874a44179m1592a6315A79528b38542
$$ 378399 -299596 -89685 -87159 164964 -278549 -347423 -144179 -185771 -16315 179528 -238542
18545c06128K4797E3456b50326M2254j2812K5032A8889o338h4689F2685J7825
$$ -306128 -281331 53456 -250326 -208072 -220884 -195852 18889 12551 -84689 62685 80510
18534H0510K33687B9320J22376J07550i6505n2849D31718a94673G3244J16938
$$ 80510 314197 29320 151696 259246 -96505 -149354 431718 -194673 73244 190182
18524A90182d7271j78212O1579K3240H1978J92454c9677D16313G7515b56083F0313
$$ 190182 -47271 -225483 -163904 -140664 81978 274432 -39677 416313 77515 -256083 60313
18512a54089C94248G9467H84Q790b56355j630B84843b32628C0879J07800K6554
$$ -154089 394248 79467 884 9674 -256355 -257985 284843 -232628 30879 138679 165233
18501A65233a41151J945j83781J40799B30165d1722q1174F296c0872a1110k76703
$$ 165233 -141151 -139206 -322987 -182188 230165 -41722 -122896 6296 -30872 -11110 -287813
18490b87813L2989i2177k25783A90235a27793O1302j79818L0100c9233k1672A72346
$$ -287813 -254824 -92177 -317960 190235 -127793 -66491 -246309 -216209 -39233 -60905 172346
18478a31744O813o625A03456K08740B4757c42379B35043f84j70143A16030l7816
$$ -131744 -124931 -131556 103456 312196 24757 -342379 235043 -684 -170827 116030 78214
18467G8214a62822E4734O5673A9745b1923k62542J09789l06991H7491b2760k40569
$$ 78214 -162822 54734 120407 19745 -21923 -284465 -174676 -481667 87491 -22760 -263329
18456b63329J6665E1810b46116b9198I3284a87026I8219d3434C7517c471p1480
$$ -263329 -246664 51810 -246116 -29198 93284 -187026 98219 -43434 37517 -3471 -74951
18445g4951B96409F8603c15631a34300m4074I3016B7810b95446a08481p748E467
$$ -74951 296409 68603 -315631 -134300 -178374 93016 27810 -295446 -108481 -116229 5467
18433b03071m0144E0631J2446b3859E7947A1411f7651A09540g2177A13643b1578
$$ -203071 -243215 50631 63077 -23859 57947 11411 -67651 109540 -72177 113643 -21578
18421F9807N9793g0768n2471q2212P8237B355J30226b12162C62650a55616B3522
$$ 69807 129600 -70768 -123239 -205451 -127214 2355 132581 -212162 362650 -155616 23522
18409b33732c7804D21888c1710C97844H6281R7373b60503Q0932d5774p5106o4183
$$ -233732 -37804 421888 -31710 397844 86281 183654 -260503 -179571 -45774 -120880 -185063
18398a85063H4839a43961m3108d8844I5775b25161E5889a05760L7857A02733K34634
$$ -185063 84839 -143961 -187069 -48844 95775 -225161 55889 -105760 -67903 102733 337367
18387C37367q1450b2611a503j15622j09480A30813b16050C22508j03905I7190
$$ 337367 255917 -22611 -1503 -117125 -226605 130813 -216050 322508 218603 97190
18376B77646a897l46003f3028j78535D4333J53249q3006c29368a05883B1658K82432
$$ 277646 -1897 -347900 -63028 -241563 44333 197582 114576 -329368 -105883 21658 304090
18365C04090B0691a04711C9143d35363a33991L5918C71381a9989A81442f9993
$$ 304090 20691 -104711 39143 -435363 -133991 -98073 371381 -19989 181442 -69993
18354b2140l71913a09710I4693h1041G4294D860M2470g938D6646J33379a27656
$$ -22140 -394053 -109710 94693 -81041 74294 4860 47330 -7938 46646 180025 -127656
18342a82392E234a43965K907A14094J69798a8036n7478r9117G0880b50598F9513
$$ -182392 5234 -143965 -141058 114094 283892 -18036 -75514 -174631 70880 -250598 69513
18330A71295a57810B24137F4940M4209a38764L3237E6875a2459E0351a08947a5506
$$ 171295 -157810 224137 64940 109149 -138764 -105527 56875 -12459 50351 -108947 -15506
18318b36624g5933K3813A82634F7582d96601h1030j3071A52156c7127B5357a11819
$$ -236624 -75933 -52120 182634 67582 -496601 -81030 -94101 152156 -37127 25357 -111819
18306c14941N3618b0543j30482j25348B10814l5394B9895b56842B31032p5432
$$ -314941 -261323 -20543 -151025 -276373 210814 175420 29895 -256842 231032 155600
18296A55600G3323K5732b0845C42780b14823M9430c6971C6240J40849c1206p1345
$$ 155600 73323 99055 -20845 342780 -214823 -165393 -36971 36240 177089 -31206 -102551
18285a02551A41401a22826D7884b87847i5085a2613p7615D6936b6842n9766A04962
$$ -102551 141401 -122826 47884 -287847 -95085 -12613 -90228 46936 -26842 -86608 104962
18273a36052j63343k9341a01723j93166J44150A70498a46580o0360A06425b80248
$$ -136052 -299395 -328736 -101723 -294889 -150739 170498 -146580 -206940 106425 -280248
18262H3878b55085i8766L6466k24596A53480h2716M90A27479D4684e3060D5821
$$ 83878 -255085 -98766 -62300 -286896 153480 -82716 -82226 127479 44684 -53060 45821
18250c8948r1277n1713G2675e8949A25920e2509A16497e9812o8332B60281A04427
$$ -38948 -130225 -181938 72675 -58949 125920 -52509 116497 -59812 -128144 260281 104427
18238a21209Q95I8697a00988n0897B3901c48804A06393D3096e3734G3735j5831
$$ -121209 -120314 98697 -100988 -151885 23901 -348804 106393 43096 -53734 73735 57904
18227E7904b41859B41661D9905R7452a72174P1535A51358k2011l1177b10840m7476
$$ 57904 -241859 241661 49905 147357 -172174 -100639 151358 129347 98170 -210840 -258316
18216b58316A53919B909K26118A1609a74541m0887d8673J2462o0170d2401q3433
$$ -258316 153919 2909 229027 11609 -174541 -215428 -48673 -36211 -96381 -42401 -125834
18205a25834K6162n4928f0897c644m10841A6088a43906k2639e4962B98281A48190
$$ -125834 -99672 -154600 -60897 -3644 -414485 16088 -143906 -166545 -54962 298281 148190
18193A4231b41288L9315C7147h3039k88162a05206L6413B4830K20928a16280b2794
$$ 14231 -241288 -201973 37147 -83039 -371201 -105206 -68793 24830 245758 -116280 -22794
18181c532D96267b08228Q2672E1813Q6715b2676j60440R060a5899A16740o859
$$ -3532 496267 -208228 -125556 51813 138528 -22676 -183116 -174056 -15899 116740 109881
18170A09881N9778c14155F2057P9155a4949k89400D0992L9786h0609n403E9561
$$ 109881 169659 -314155 62057 141212 -14949 -304349 40992 80778 -80609 -86012 59561
18158b87970A3497c79805H419a36787D1331a40233A85605Q4321d2344o8085A61015
$$ -287970 13497 -379805 8419 -136787 41331 -140233 185605 269926 -42344 -110429 161015
18146A00585b81162h47j62982J7748f406a064j72206H9554b24654A40353a42176
$$ 100585 -281162 -847 -163829 -146081 -6406 -1064 -173270 89554 -224654 140353 -142176
18134H4851J47458b02936a5009F3316J32607A8965b05111j9034a5089m2181A65954
$$ 84851 232309 -202936 -15009 63316 195923 18965 -205111 -224145 -15089 -57270 165954
18122c2843l394B72180c6402k47810a27640r2791Q9476f1090A27458b66072A00953
$$ -32843 -36237 272180 -36402 -284212 -127640 -220431 -130955 -61090 127458 -266072 100953
18110a30633c3329q5221A83902a46207k76576c3959A59607b51354a03413N547
$$ -130633 -33329 -118550 183902 -146207 -422783 -33959 159607 -251354 -103413 -97866
18100i7866q8327h5832A13393R1286f7443j06898N3270a2175p2772B54649p4329
$$ -97866 -186193 -85832 113393 204679 -67443 -174341 -121071 -12175 -84947 254649 180320
18089A80320K28851a01831M1157k1186b0081j79033O5322A86502A550a55361I4762
$$ 180320 409171 -101831 -60674 -81860 -20081 -199114 -133792 186502 1550 -155361 94762
18077e8626n0559E0414O7783a54640A91637l2530i0533H1773h2430j58264i8510
$$ -58626 -109185 50414 118197 -154640 191637 159107 -90533 81773 -82430 -240694 -98510
18065A97775a94318p9727h1236A61000J60049D4038j1245a0467A52565b96570
$$ 197775 -194318 -274045 -81236 161000 321049 44038 32793 -10467 152565 -296570
18054b69416L6896p3131C11301c87283C10806a35277k42983C94a59826A80792
$$ -269416 -232520 -305651 311301 -387283 310806 -135277 -378260 394 -159826 180792
18043A07591b875E1388b10856A71206i0443B09640a22607J7550K9890b491A01049
$$ 107591 -2875 51388 -210856 171206 -90443 209640 -122607 -105057 -75167 -2491 101049
18031a06708A69527C5514K6269b11726e6618O503k39147f8731o7338j4379N8652
$$ -106708 169527 35514 61783 -211726 -56618 -50115 -289262 -68731 -136069 -150448 -91796
18020i1796A5566B542h8083j44378e5336A41710b39676C9366c5892B12088n1741
$$ -91796 15566 2542 -88083 -232461 -55336 141710 -239676 39366 -35892 212088 160347
18009A60347J32744b28288B3130b72136h1181j727c9184o9073C37955b04216e4830
$$ 160347 293091 -228288 23130 -272136 -81181 -82908 -39184 -108257 337955 -204216 -54830
17997A11565c82743A36556d30166d707A17968a17100j92767K4361H8273J00763
$$ 111565 -382743 136556 -430166 -4707 117968 -117100 -309867 -285506 88273 189036
17987A89036a37600c0674G9993J39410g5971B56657A04832O4464J45075h8586
$$ 189036 -137600 -30674 79993 219403 -75971 256657 104832 169296 314371 -88586
17976f8167G0934a06801D04898j31991j10339a58708A9534b22892D1208j8808
$$ -68167 70934 -106801 404898 272907 162568 -158708 19534 -222892 41208 22400
17966B2400J0472m593a83924A33057f5953J7727C4367b22940K8677E9644J030
$$ 22400 32872 28279 -183924 133057 -65953 -48226 34367 -222940 -194263 59644 60674
17955F0674b68149R7980K0489q3427H8149l7674B4625R6479p807h7768B72548
$$ 60674 -268149 -170169 -149680 -233107 88149 50475 24625 121104 113297 -87768 272548
17943d8275B61575D3530J53080E8303K05635B0831h6276A84832b81952B01439
$$ -48275 261575 43530 196610 58303 263938 20831 -86276 184832 -281952 201439
17932a53957C05274A07004c7219J4961p1381B18706I0455J34116c46335D3286
$$ -153957 305274 107004 -37219 -22258 -93639 218706 90455 224571 -346335 43286
17921C20194H3984f3208j22352G0959J67029a31863e2753j5039a821A16209C565
$$ 320194 83984 -63208 -185560 70959 237988 -131863 -52753 -67792 -1821 116209 3565
17909a73138J4245j5036g6316C5309a34790n8220k08798g5139K307c3557p9032
$$ -173138 -158893 -173929 -76316 35309 -134790 -193010 -401808 -75139 -72832 -33557 -112589
17898a12589g22I2376g0129B42632F2882b89062b4977B34856a47359N3110R927
$$ -112589 -722 92376 -70129 242632 62882 -289062 -24977 234856 -147359 -94249 -84322
17887h4322I1258M3769N605L47006b60383a10991G855b74845J36673I0661a03983
$$ -84322 91258 135027 140632 487638 -260383 -110991 7855 -274845 -138172 90661 -103983
17875a50467G6268Q3276a41812K588B24382c3375j45723g5061j20288j5411g1641
$$ -150467 76268 159544 -141812 -139224 224382 -33375 -179098 -75061 -195349 -210760 -71641
17863c00021A9107J44249h0172C10591g2556j43817A22325a76229D37588j60389
$$ -300021 19107 163356 -80172 310591 -72556 -216373 122325 -176229 437588 277199
17853B77199A29984E2962b33283f7576r3520A60120c8124m0313B04485a85245
$$ 277199 129984 52962 -233283 -67576 -161096 160120 -38124 -78437 204485 -185245
17842C0483N2381J87166B7230J54553r0130a73838e2523G1682b08454D11811a71988
$$ 30483 82864 270030 27230 181783 91653 -173838 -52523 71682 -208454 411811 -171988
17830a64239A96297D1419J98941b48593Q3744D54483d8936L793k3413m946F8869
$$ -164239 196297 41419 240360 -248593 -164849 454483 -48936 -45143 -68556 -73502 68869
17818a92429k09628D2036J64516I3289K0308R0733l2273j9567c27998g44k52344
$$ -192429 -402057 42036 206552 93289 113597 204330 172057 152490 -327998 -744 -253088
17807b53088A98098L753A6895J01791h670j05819A17334C7997a97093b229m0812
$$ -253088 198098 201851 16895 118686 -8670 -114489 117334 37997 -197093 -2229 -43041
17796d3041l06011I455L9386R4675a44806A9438l282Q9501N4120j796p8536a48467
$$ -43041 -349052 9455 48841 143516 -144806 19438 16156 105657 159777 157981 79445 -148467
17783b9572q7673C7586K2464a37551A88888c14178A049b9810r4470A19994c17655
$$ -29572 -117245 37586 60050 -137551 188888 -314178 1049 -29810 -124280 119994 -317655
17771a82562C3443a07760A08232J70079a61985F9767J31454n4976L59123E9886
$$ -182562 33443 -107760 108232 278311 -161985 69767 201221 146245 505368 59886
17760a22338A07818j4098J30637a52622A017J91990F2934D902M403a8788n6943
$$ -122338 107818 93720 224357 -152622 1017 193007 62934 4902 9305 -18788 -75731
17749g5731A72642b18224c8400I9658C4345b34878f9451j5282H2771e5130B0605
$$ -75731 172642 -218224 -38400 99658 34345 -234878 -69451 -84733 82771 -55130 20605
17737A75622r218a16123r8163A99703a31893c9554j08612j46142b7863A37325
$$ 175622 166404 -116123 -214286 199703 -131893 -39554 -148166 -294308 -27863 137325
17726b44971D8304L25715j69640M5297d7230j33939Q5221B1939J16108o990h473
$$ -244971 48304 374019 204379 249676 -47230 -181169 -95948 21939 138047 131057 -8473
17714G2231i9794b9486j8919k40933J06147G3874i4903L9575j05406e9496A82331
$$ 72231 -99794 -29486 -48405 -289338 -183191 73874 -94903 -55328 -160734 -59496 182331
17702D615J53793a7629j56235N1785A68848e5493A17K80061j00761p5592J01470
$$ 4615 158408 -17629 -173864 -122079 168848 -55493 117 280178 179417 103825 205295
17691B05295r2045m834J04978D4432B0156J17460f6474E4828L09393a51687P0043
$$ 205295 113250 108416 213394 44432 20156 137616 -66474 54828 364221 -151687 -81644
17680h1644J8130A82208f7997A25759a03988D19716e3641C85652j21838c91559
$$ -81644 -63514 182208 -67997 125759 -103988 419716 -53641 385652 263814 -391559
17669C6918K53315A20594j4566B094c468b41A5368M3053B7140b45103M8537a9955
$$ 36918 290233 120594 106028 2094 -3468 -241 15368 58421 27140 -245103 -196566 -19955
17656c44590A55143p5406b30360g0903l8330A92219b45439F1490J67907a0485
$$ -344590 155143 79737 -230360 -70903 -109233 192219 -245439 61490 229397 -10485
17645B57482j12501J8160e1340k72061i042G2932b56416A87384f9072D1874R5902
$$ 257482 144981 163141 -51340 -323401 -9042 72932 -256416 187384 -69072 41874 137776
17634A37776D16i7418I9357C9405c5975k3483b4749k85223g1104A72835b44260
$$ 137776 416 -97418 99357 39405 -35975 -59458 -24749 -309972 -71104 172835 -244260
17622F7640a85225C26315b44299a01551B75501j29198J5417F2362L23752C6907
$$ 67640 -185225 326315 -244299 -101551 275501 146303 161720 62362 386114 36907
17611H545c9959B2410K35591f3240r7032J8587b3596A25236N2923m6800N9945
$$ 8545 -39959 22410 258001 -63240 -160272 -141685 -23596 125236 178159 131359 191304
17600A91304H4115J55391l0193n9515b64895B48312g8934H0138g1165c472A69527
$$ 191304 84115 239506 209313 149798 -264895 248312 -78934 80138 -71165 -3472 169527
17588G6742a36230B64364A19116l9604L3474D4690P0298P0026b05882O2328A66681
$$ 76742 -136230 264364 119116 79512 112986 44690 114988 185014 -205882 -143554 166681
17576b52701A18072J86139A17206D2648M9147a46131j66186Q0025B54329L98a11454
$$ -252701 118072 304211 117206 42648 91795 -146131 -312317 -232292 254329 254727 -111454
17564a14476B43190E4144K40813I6709A8862K82831j03277q5312c5524k14699
$$ -114476 243190 54144 294957 96709 18862 301693 198416 113104 -35524 -250223
17554b50223A16493b0374A18782a04164A87300M1619P8619j35618a99723B48665
$$ -250223 116493 -20374 118782 -104164 187300 228919 307538 171920 -199723 248665
17543C36315j53864a9799j32193A78544J00246j19268H798J10434a13479h513
$$ 336315 182451 -19799 -151992 178544 278790 159522 8798 119232 -113479 -8513
17532a47372G6105b07115c7501F1165h8440E2947j8993e6669A8376M9824f6570
$$ -147372 76105 -207115 -37501 61165 -88440 52947 33954 -56669 18376 68200 -66570
17520I0996N5172C6555Q6304J00217L73655F5890J21876p9642A7133M882e8957
$$ 90996 146168 36555 122859 223076 596731 65890 187766 108124 17133 22015 -58957
17508d11483A63927o9088a4716D08872g0605C1593f3979A41073c0924C4623K86572
$$ -411483 163927 94839 -14716 408872 -70605 31593 -63979 141073 -30924 34623 321195
17497C21195C7029L37194A45402d3244C72731A8408K91440A01326J80074j26642
$$ 321195 37029 374223 145402 -43244 372731 18408 309848 101326 281400 154758
17487A54758P1371j5743M18574B24622P7782A19873h3455C15981b16857B45182
$$ 154758 226129 210386 628960 224622 302404 119873 -83455 315981 -216857 245182
17476A45099B26a15115G4919M1733N4757b1723A78816m526J85884B6132a01036
$$ 145099 226 -115115 74919 116652 171409 -21723 178816 174290 360174 26132 -101036
17464B60742b17387k29681B26611h6931j08586B19806F8563f8462B25212a76025
$$ 260742 -217387 -447068 226611 -86931 -195517 219806 68563 -68462 225212 -176025
17453G8882J21361c2825A98417p7862K19189F5038J72292L04244A03490R6289
$$ 78882 200243 -32825 198417 120555 339744 65038 237330 541574 103490 199779
17443A99779H4898K03673E0562K81204A49175J46165j8367M8132I0025N00198
$$ 199779 84898 288571 50562 331766 149175 295340 276973 325105 90025 590223
17433E90223j06483k25995N0068h629B84378J80390r9853q0181R1915o7855P2085
$$ 590223 483740 257745 307813 -8629 284378 464768 364915 284734 376649 308794 380879
17422C80879r5854D4561K80494k805E1585K19451N5780J41132D7927J99801Q9943
$$ 380879 285025 44561 325055 322250 51585 271036 326816 467948 47927 247728 337671
17411C37671A09668J49230j4049B6198K0238J89958I4536K58063A31814L07333
$$ 337671 109668 258898 244849 26198 46436 236394 94536 352599 131814 439147
17401D39147E3261Q5152K9829l3081J94466A10679K01807M3478o567B971J24913
$$ 439147 53261 138413 168242 135161 329627 110679 312486 355964 349397 2971 127884
17390A27884O6281N1614j8856A9110L13733j35954n9511M22973f1952B29652D3128
$$ 127884 194165 245779 226923 19110 332843 196889 137378 560351 -61952 229652 43128
17378c5869B06765R983p5122J86808j13679l2904d6547B82018A20918J65995e2749
$$ -35869 206765 216748 141626 328434 214755 181851 -46547 282018 120918 286913 -52749
17366b8223H5900a2035A70435a52903I8612P2002b4654j58926C46661a20319B78524
$$ -28223 85900 -12035 170435 -152903 98612 170614 -24654 -183580 346661 -120319 278524
17354C13649N1623A7031K29679K1246c9667A84595J6368M1769a04843B51492k0180
$$ 313649 365272 17031 246710 267956 -39667 184595 200963 242732 -104843 251492 231312
17343B31312j01494J26126j00450b28267B81991o8835P9844A21808b98500c9421
$$ 231312 129818 255944 155494 -228267 281991 213156 293000 121808 -298500 -39421
17332a83201C12695A42850K27377j84279n2965a3919B19001a0455D78028A51263
$$ -183201 312695 142850 370227 185948 132983 -13919 219001 -10455 478028 151263
17321D55817A12496J13384d1572B6911J40035j0376J33570A38461K20358A20405
$$ 455817 112496 225880 -41572 26911 166946 156570 290140 138461 358819 120405
17310i4974r4569e0275D19972H9267K3938k0942K47910b27005i7923B50280k4107
$$ -94974 -189543 -50275 419972 89267 113205 92263 340173 -227005 -97923 250280 226173
17299B26173N6552q594h2584A58232b21511A69692b44351A91149q1593J8690j2559
$$ 226173 282725 274131 -82584 158232 -221511 169692 -244351 191149 109556 128246 115687
17288A15687N5477J82451b21528i6045A3787N6029a37556C88429d2949C02834
$$ 115687 171164 353615 -221528 -96045 13787 69816 -137556 388429 -42949 302834
17277i539G27494G7276c6298D3474J46598K3964A05444K92564a82592G3889K30998
$$ -9539 727494 77276 -36298 43474 190072 214036 105444 398008 -182592 73889 304887
17266C04887A38665L91846A58087L55789A14951J5566J83471J53232A91360M2903
$$ 304887 138665 530511 158087 513876 114951 130517 313988 467220 191360 234263
17256B34263d8783A23585B6774a47683C94120a03372C07774A33717J96105o4385
$$ 234263 -48783 123585 26774 -147683 394120 -103372 307774 133717 329822 265437
17246B65437J0939J61780j03928L9069A32536F5442L79180a4720F2077L35166
$$ 265437 276376 438156 334228 373297 132536 65442 444622 -14720 62077 397243
17236C97243E5548K46857K98974B53849g1712A07354O52787B39994J21707A39502
$$ 397243 55548 302405 601379 253849 -71712 107354 760141 239994 361701 139502
17225F54538l11895H6447J24370J72453n9299b07025B49764K94794j02656j33266
$$ 654538 342643 86447 210817 383270 323971 -207025 249764 544558 441902 308636
17215C08636i6439B61651J59201i988C58824E9379g2110C95732j7430J4665j25201
$$ 308636 -96439 261651 420852 -9988 358824 59379 -72110 395732 378302 392967 267766
17204B67766f792B97097L0802p9728m6607K41129p7996c40321A96274e3750B36078
$$ 267766 -6792 297097 327899 248171 201564 442693 364697 -340321 196274 -53750 236078
17192B46122J25560q1176P2988K74167d5814C86679j06158j9249K27876k24678
$$ 246122 371682 290506 363494 637661 -45814 386679 280521 261272 489148 264470
17182B64470q65p1127c3289D3352J53829o4986O6051k6966L94655j34686j55121
$$ 264470 263605 192478 -33289 43352 197181 132195 198246 171280 565935 431249 276128
17171B76128e5238C55892A59884K08378Q1150p7827j75094K43857A66951p3609
$$ 276128 -55238 355892 159884 368262 449412 371585 196491 440348 166951 93342
17161I3342J66515A03314J10489M29652A34723a76169A22697L03215J520B3877
$$ 93342 259857 103314 213803 643455 134723 -176169 122697 425912 427432 23877
17150D00096j36270m6889P6953J54873j75108q8318J01082p1296M59674a70726
$$ 400096 263826 216937 293890 448763 273655 185337 286419 215123 674797 -170726
17139D09761A76244J59226A55442g8786D92637J07786A61687K97669f6841A57995
$$ 409761 176244 335470 155442 -78786 492637 600423 161687 459356 -66841 157995
17128C65375f861A97707K53740I9902L11625J25177B48051J62574L1360j4836
$$ 365375 -6861 197707 451447 99902 411527 536704 248051 410625 441985 427149
17118D27149n0174l0411r4275K82654B45978E2806Q2630N7029K27961j39944L33750
$$ 427149 376975 346564 252289 534943 245978 52806 135436 192465 420426 280482 614232
17107F14232C04606J94118k28642L90000C18335J66926a69753B75308P7306A53050
$$ 614232 304606 498724 270082 660082 318335 485261 -169753 275308 352614 153050
17096A78050L46370l5257A56401M21671j00228j19406R6581j2285M8395J50767
$$ 178050 524420 489163 156401 578072 477844 358438 455019 442734 491129 641896
17086F41896k71403A79362L49147j32774J50880j18238n0947K24645j68245J09248
$$ 641896 370493 179362 528509 395735 546615 428377 377430 602075 433830 543078
17076E43078M6923j7411K4485k7135O2590G3300J37133M61289k21078O1603K56490
$$ 543078 590001 572590 597075 569940 632530 73300 210433 671722 450644 512247 768737
17065G68737D516M28303N9940L8481N3293k84753p4711L86103J2871A89597K44015
$$ 768737 4516 432819 492759 531240 584533 299780 225069 611172 624043 189597 433612
17054D33612k5508Q7585L39093j99511j71538m2290q8254J34233l3568K91054
$$ 433612 408104 495689 834782 635271 463733 421443 333189 467422 433854 724908
17044G24908C12409m2332M32965J2248j991j56650B18966K27064K04160J42314
$$ 724908 312409 270077 703042 715290 713299 556649 218966 446030 650190 792504
17034G92504q1613p2184C06446L88561L2901j6285j2056N1215j04927j64152J53365
$$ 792504 710891 638707 306446 695007 727908 711623 699567 750782 645855 481703 635068
17023F35068n1495j03309J96554j47904L3370J10969R0214l51940M359M27850
$$ 635068 583573 480264 676818 528914 562284 673253 763467 411527 415886 843736
17013H43736L77326E23473o5074K80154m8878j00796L7604p8730K02855N723L7348
$$ 843736 1221062 523473 458399 738553 689675 588879 626483 547753 750608 756331 793679
17002G93679j38040Q5765L17821D64549K90463q2971J01175O3962K15310l65725
$$ 793679 655639 741404 1059225 464549 755012 672041 773216 837178 1052488 686763
16992F86763K4840K91012k32858p7214J60112j21319j17417L66551m03712K34315
$$ 686763 711603 1002615 769757 692543 852655 731336 613919 980470 576758 811073
16982H11073j9747K62465k51003J03814J67733j49469J68042l74270K58888r5583
$$ 811073 791326 1053791 802788 906602 1074335 924866 1092908 718638 977526 881943
16972H81943k9703j23823K85460n2030Q4660l04315L31291k05173k69040K69391
$$ 881943 852240 728417 1013877 961847 1046507 742192 1073483 868310 599270 868661
16962H68661Q4077J8161l47333N54245j60738l2348K72934m70133J37250K05603
$$ 868661 952738 970899 623566 1177811 1017073 984725 1257659 787526 924776 1130379
16952A130379Q6702j21948p505M5156k92433L06252J17519l44951K81505l21447
$$ 1130379 1217081 1095133 1087628 1132784 840351 1146603 1264122 919171 1200676 879229
16942H79229L14479L3225J69321n7945l3630k07330P6699j23614R8752M939J09948
$$ 879229 1193708 1226933 1396254 1338309 1304679 1097349 1174048 1050434 1149186 1154125 1264073
16931A264073M5221p7909Q2797K07054j64400k03499N3242K95705k52029J64135
$$ 1264073 1309294 1231385 1314182 1521236 1356836 1153337 1206579 1502284 1250255 1414390
16921A414390j73725R9713K30177j11874k02540L08943N9410l89149N32735l29075
$$ 1414390 1240665 1340378 1570555 1458681 1256141 1565084 1624494 1235345 1768080 1439005
16911A439005J16640J19985k2271J26659q9093p6441o3870l21876J95030N89306
$$ 1439005 1555645 1675630 1653359 1780018 1690925 1614484 1550614 1228738 1423768 2013074
16901B013074l50078J9761M2010N40883p2414l28928j98930J68753J95420J74344
$$ 2013074 1662996 1682757 1724767 2265650 2193236 1864308 1665378 1834131 2029551 2203895
16891B203895l94307P2052n0026R6666j03567J59378K5033q0613K38326P4886
$$ 2203895 1809588 1881640 1831614 1928280 1824713 1984091 2009124 1928511 2166837 2241723
16881B241723K91303k91157M68502m79367M3553K20343R2210P1253l97466J27634
$$ 2241723 2533026 2241869 2710371 2231004 2274557 2494900 2587110 2658363 2260897 2388531
16871B388531K36158R9302K34j25358j7079p9002M11643P0533k85038j19098L81574
$$ 2388531 2624689 2723991 2724225 2598867 2581788 2502786 2914429 2984962 2699924 2580826 2962400
16860B962400K02601m17210L43028K50102p5744J3804q7702j34920K14017J46438
$$ 2962400 3165001 2747791 3090819 3340921 3265177 3278981 3191279 3056359 3270376 3416814
16850C416814m25390M39304k38636L30294L2844L33035K7387k11946J45937J42895
$$ 3416814 2991424 3430728 3192092 3522386 3555230 3888265 3915652 3703706 3849643 3992538
16840C992538j49668R8311L0822K45469j02945L91251k48862J27607L20845K29328
$$ 3992538 3842870 3941181 3972003 4217472 4114527 4505778 4256916 4384523 4705368 4934696
16830D934696P1288M1814l59539K03957j1399L06358k30526J32814N51855l61080
$$ 4934696 5005984 5047798 4688259 4892216 4880817 5187175 4956649 5089463 5641318 5280238
16820E280238K49492L22115j42850J53873K14722K0080M61296k77666K88419m4444
$$ 5280238 5529730 5851845 5708995 5862868 6077590 6097670 6558966 6281300 6569719 6525275
16810F525275L0033P70262m58315N31793J85306P97K5276N31085k34173M00978
$$ 6525275 6555308 7325570 6867255 7399048 7584354 7585151 7610427 8141512 7907339 8308317
16800H308317K38545K11553L0788L74220L10003J0647M32880O24524j95258Q168
$$ 8308317 8546862 8758415 8789203 9163423 9473426 9484073 9916953 10541477 10346219 10354387
16790A0354387N68373J71474N27940j5083O07434O54138o7836K15040O13428O41439
$$ 10354387 10922760 11094234 11622174 11607091 12214525 12868663 12800827 13015867 13629295 14270734
16780A4270734K35353L16066L37917O71542N22905L83462O12049N80202P35239
$$ 14270734 14506087 14822153 15160070 15831612 16354517 16737979 17350028 17930230 18665469
16771A8665469M99496P23597R66549N83503N31778J012001P19935J227502P95934
$$ 18665469 19164965 19888562 20855111 21438614 21970392 22982393 23702328 24929830 25725764
16762B5725764J033341J230000P90091J440276J177153J662452J362633J253410
$$ 25725764 26759105 27989105 28779196 30219472 31396625 33059077 34421710 35675120
16754C5675120J877707J820547J731616J704496K318157K166561K599470K332860
$$ 35675120 37552827 39373374 41104990 42809486 45127643 47294204 49893674 52226534
16746E2226534K865999K766686L408682L231934L690658L665512L972199M523480
$$ 52226534 55092533 57859219 61267901 64499835 68190493 71856005 75828204 80351684
16738H0351684M615590M850517N590569N708041N703194O442713O594846O757672
$$ 80351684 84967274 89817791 95408360 101116401 106819595 113262308 119857154 126614826
16730A26614826P133731P210924P417843P305759P312762O965123O677421O019043
$$ 126614826 133748557 140959481 148377324 155683083 162995845 169960968 176638389 182657432
16722A82657432M980150L727412L372972K064903K03483l84737k090807k762067
$$ 182657432 187637582 191364994 194737966 196802869 197006352 196621615 194530808 191768741
16714A91768741m541228n056428n851847o593135p063053p406819p172257p555044
$$ 191768741 187227513 182171085 176319238 169726103 162663050 155256231 148083974 140528930
16706A40528930p530622p638480o479863o811859o504114n785565n665152n811050
$$ 140528930 132998308 125359828 118879965 112068106 105563992 99778427 94113275 88302225
16698H8302225n440445m499975m271968l977180m014474l542257l474486k875275
$$ 88302225 82861780 78361805 74089837 70112657 66098183 62555926 59081440 56206165
16690E6206165l124326l074597k048471k699146j895543k275587j667432k018977
$$ 56206165 53081839 50007242 47958771 45259625 43364082 41088495 39421063 37402086
16682C7402086j966936j242550j558990j674501j213862j373109j070008j117967
$$ 37402086 35435150 34192600 32633610 30959109 29745247 28372138 27302130 26184163
16674B6184163r03290r15767j290713n33304p77316r98551p17562j129088q6948
$$ 26184163 25280873 24365106 23074393 22541089 21763773 20765222 20047660 18918572 18831624
16665A8831624r80002q81402k82135m34752o04424m07190n48742m19975k38054
$$ 18831624 17851622 16970220 16688085 16253333 15648909 15241719 14692977 14273002 14034948
16656A4034948r85602j11686l27675k44039m80647k83292o05623K22113m14782
$$ 14034948 13049346 12937660 12609985 12365946 11885299 11602007 10996384 11218497 10803715
16647A0803715o06531k03396j71954m28097l77090j16248j09438l57496J88578
$$ 10803715 10197184 9993788 9821834 9393737 9016647 8900399 8790961 8433465 8622043
16638H622043n72131N1817o69731J4523K13468k58663j54488n13055J29569Q7510
$$ 8622043 8049912 8101729 7431998 7446521 7659989 7401326 7246838 6733783 6863352 6950862
16628F950862l61626j91434k36488j00123K21632l15847m00698J28119l67263
$$ 6950862 6589236 6397802 6161314 6061191 6282823 5966976 5566278 5694397 5327134
16619E327134R177m10360J91062l13001Q3441j98239J22316l50511R1128p0141
$$ 5327134 5336311 4925951 5117013 4804012 4887453 4689214 4811530 4461019 4552147 4482006
16609D482006m39264J4511M5821J49710j09384l04286J23134o706k49832N7305
$$ 4482006 4042742 4057253 4103074 4252784 4143400 3839114 3962248 3955542 3705710 3763015
16599C763015j23835k01948Q9541J99166l14099l13745j5275K12328k36393J7421
$$ 3763015 3639180 3437232 3526773 3725939 3411840 3098095 3082820 3295148 3058755 3076176
16589C076176J07327k25957q1988L32375j80422k17609J47446j96202J30781m64530
$$ 3076176 3183503 2957546 2875558 3207933 3027511 2809902 2957348 2761146 2891927 2427397
16579B427397M89563j51523l73442k83019M08910N780l59551K79394j80343j43403
$$ 2427397 2916960 2765437 2391995 2108976 2517886 2523666 2164115 2443509 2263166 2119763
16569B119763r2012K78235k07188j60128L26589q0632q6603J50203r0041K26482
$$ 2119763 2027751 2305986 2098798 1938670 2265259 2184627 2098024 2248227 2158186 2384668
16559B384668m05772k19941J79754l86740J8091K38556L01526l13078K53255m21146
$$ 2384668 1978896 1758955 1938709 1551969 1570060 1808616 2110142 1797064 2050319 1629173
16549A629173K10592j05629l14280K65584J92150k65660J99105M3535j54745q9562
$$ 1629173 1839765 1734136 1419856 1685440 1877590 1611930 1811035 1854570 1699825 1610263
16539A610263q0596L0923j87042L728j81609K76987K88711l14853M70J65903j57043
$$ 1610263 1529667 1560590 1373548 1377276 1195667 1472654 1761365 1446512 1446982 1612885 1455842
16528A455842l7356k09701n3140k20108M07279p8415J56688j00713l8091j11579
$$ 1455842 1418486 1208785 1155645 935537 1342816 1264401 1421089 1320376 1282285 1170706
16518A170706Q9410k57208K5761N87652m16518q4522J62291L5344L7018l11514
$$ 1170706 1260116 1002908 1028669 1616321 1199803 1115281 1277572 1312916 1349934 1038420
16508A038420J26460K2656q5988k93728J12467K7616j37253L02424J70445m16013
$$ 1038420 1164880 1187536 1101548 807820 920287 947903 810650 1113074 1283519 867506
16498H67506r4614J64399L00170k07025l36558K45667q7224J81834q6694j33179
$$ 867506 772892 937291 1237461 1030436 693878 939545 852321 1034155 947461 814282
16488H14282j09636p9212N9750J55067K73404m4562j91102Q812J07691j19260
$$ 814282 704646 625434 685184 840251 1113655 1069093 877991 886803 994494 875234
16478H75234j07198J23988N5641j62370j89504J30971k38397J68313K66782l77029
$$ 875234 768036 892024 947665 785295 595791 726762 488365 656678 923460 546431
16468E46431m3503L56343D15538K50877o4107B43318L98083m9260j08201K96654
$$ 546431 502928 859271 415538 666415 602308 243318 641401 592141 483940 780594
16458G80594k8259r0458K2329K37724C55030J22621K4714K55865J15952l51536
$$ 780594 752335 661877 684206 921930 355030 477651 502365 758230 874182 522646
16448E22646K2700M29727j16537l26587J71962j30596k79342L30134M1761M738
$$ 522646 545346 975073 858536 531949 703911 573315 293973 624107 665868 670606
16438F70606p6849l1464J35129k15228j21910O0320k7481M56202B34906K55465
$$ 670606 593757 562293 697422 482194 360284 420604 393123 849325 234906 490371
16428D90371J27227j66180D6129M57166B29218R8238Q9791j42453J77777K2817
$$ 490371 617598 451418 46129 503295 229218 327456 417247 274794 452571 475388
16418D75388r6186L1576K67026C13282L13097j49645j62253K27567J97496B29954
$$ 475388 379202 410778 677804 313282 626379 476734 314481 542048 739544 229954
16407A15403M34468j47360k3709p3973J08118R0085j7755I9566L91546j0291j48835
$$ 115403 549871 402511 378802 304829 412947 503032 485277 99566 491112 480821 331986
16396C31986M4286j4280A65986J78517M9098J23211O3000k05944o3576m3525N29382
$$ 331986 376272 361992 165986 344503 393601 516812 579812 373868 310292 266767 796149
16385G96149C56451A58984L32714P0747q9944j14648J53910B03952o7059K63719
$$ 796149 356451 158984 491698 562445 472501 357853 511763 203952 136893 400612
16375D00612L34734l10771o4061R2566O86K65839C05005j22781p1224J1706M22674
$$ 400612 735346 424575 360514 453080 453766 719605 305005 182224 111000 122706 545380
16364E45380a8883F23108A02864j8813M62080A53912J75331N3181A14338Q4179
$$ 545380 -18883 623108 102864 84051 546131 153912 329243 382424 114338 198517
16354A98517a67B94373A42670M14039N4757k83434F5277K87278A55907K11725
$$ 198517 -167 294373 142670 556709 611466 328032 65277 352555 155907 367632
16344C67632E0074M04445B12774Q2021I3234K09402a0874C956J7903L86532A66367
$$ 367632 50074 454519 212774 294795 93234 302636 -10874 3956 21859 408391 166367
16332C18485J76605G4755Q8120K57180b65229C95605H242K14203L50898A56642
$$ 318485 495090 74755 162875 420055 -265229 395605 8242 222445 573343 156642
16321B33316M3170J3949A34311L48126j4022j80752B2976M44520j48892J75273
$$ 233316 276486 290435 134311 482437 468415 287663 22976 467496 318604 493877
16311D93877b32478D16668M8875J2097H2788g3288B72576R7325l5547A49020P4345
$$ 493877 -232478 416668 465543 477640 82788 -73288 272576 369901 334354 149020 223365
16300B23365E9893B1429L62120a2122A73101J5417K10991b51466A35237R2643
$$ 223365 59893 21429 383549 -12122 173101 188518 399509 -251466 135237 227880
16290B27880G0462M02292I5216a56937A89638C0277B812K20246q9466J90114n1798
$$ 227880 70462 472754 95216 -156937 189638 30277 2812 223058 133592 323706 271908
16279B71908Q4276a13068M4255E927N8485K35566b2698A23334b9025F84683B2810
$$ 271908 356184 -113068 -68813 5927 64412 299978 -22698 123334 -29025 684683 22810
16267B22572K76074A97358J23949g3855A30833L05434b5762l5081e134l774n4411
$$ 222572 498646 197358 321307 -73855 130833 436267 -25762 -60843 -5134 -8908 -63319
16256f3319A78294Q2309b03363C23822m7267f1765C23976c80917A21766d6955
$$ -63319 178294 260603 -203363 323822 276555 -61765 323976 -380917 121766 -46955
16245A35915Q9881n9889j0146F9924B9871c5757r6057B59793a82780B57766r4347
$$ 135915 225796 165907 155761 69924 29871 -35757 -131814 259793 -182780 257766 163419
16234A63419o6310J41449K0017m2869a10264A71098l7454B8574R3477D7940J16057
$$ 163419 97109 238558 258575 215706 -110264 171098 133644 28574 122051 47940 163997
16223A63997e7020A72757b57301d3432A38949b0734D3563L16475a86354C3962
$$ 163997 -57020 172757 -257301 -43432 138949 -20734 43563 360038 -186354 33962
16212I4939m3948O8974J00270j6846H0541m952J39586a74008B31388P8279A8110
$$ 94939 50991 119965 220235 203389 80541 75589 215175 -174008 231388 309667 18110
16200b05799l7723C99774i0681L7035j51178R1709B2416L31009C0J96335J95183
$$ -205799 -243522 399774 -90681 -53646 -204824 -113115 22416 353425 30 196365 391548
16189C91548b918I2014P9949k040a96396A44367P7296h9227A38715K0993G724
$$ 391548 -2918 92014 171963 169923 -196396 144367 221663 -89227 138715 159708 7724
16177a4658B19726a00948G5442a28546B42467G3650C1690J12907a32899A32384
$$ -14658 219726 -100948 75442 -128546 242467 73650 31690 144597 -132899 132384
16166A24485J0344N2162K71588C4417f4708A78752J705b1200I8869c2130D47334
$$ 124485 134829 186991 458579 34417 -64708 178752 180457 -21200 98869 -32130 447334
16154d6979B40817b16357l0345D3954K74479i2585E4525a80467j14304C02990
$$ -46979 240817 -216357 -246702 43954 318433 -92585 54525 -180467 -294771 302990
16143a72218D5634h2321K6947A84296a63343B30433a52458a6608j42809J7944
$$ -172218 45634 -82321 -55374 184296 -163343 230433 -152458 -16608 -159417 -141473
16133a41473A04290a05514B41761J32078A46297C0457J54494F2695a395A27889
$$ -141473 104290 -105514 241761 373839 146297 30457 184951 62695 -1395 127889
16122A00380J52046e7265C2117c3546B69995k7035b33873A0503O0519J03713b79473
$$ 100380 252426 -57265 32117 -33546 269995 242960 -233873 10503 71022 174735 -279473
16110f2906k64304A25819e1370r7169D35594A58452p8860Q4616l0814m9556e25989
$$ -62906 -327210 125819 -51370 -148539 435594 158452 79592 164208 133394 83838 -525989
16098d8930k00876B1763r865a38965M6385k42739a35692I3647h8145b8703A89636
$$ -48930 -249806 21763 11898 -138965 -92580 -335319 -135692 93647 -88145 -28703 189636
16086E5885K12676J41267b2991R914j1314B8111d01337A20568e9655q1835a4278
$$ 55885 268561 409828 -22991 -13077 -24391 28111 -401337 120568 -59655 -141490 -14278
16074D4483O6029C4911C652c2642I0865N5908C0759K07793a6542k05939c1936
$$ 44483 110512 34911 3652 -32642 90865 146773 30759 238552 -16542 -222481 -31936
16062B21219P4400A0962J18278b75341A10332b83721A5143R7286o880a97041B3515
$$ 221219 295619 10962 129240 -275341 110332 -283721 15143 112429 105549 -197041 23515
16050h2385L841a2329k09734c832j59637f3273A10513A0095a92628A89804b73519
$$ -82385 -78544 -12329 -222063 -3832 -163469 -63273 110513 10095 -192628 189804 -273519
16038c3160G6905Q1521b65269n9195a54m8343f296l11231N5195C1880M0147J8974
$$ -33160 76905 158426 -265269 -324464 -154 -48497 -6296 -317527 -262332 31880 72027 91001
16026I1001b59938O7744A37570K72949e2073B22221C2473J6648a36070c8193C11328
$$ 91001 -259938 -192194 137570 410519 -52073 222221 32473 49121 -136070 -38193 311328
16014D5190c15967a20632A02859i7020A8707f19627C7946d1636a7638j51493q7501
$$ 45190 -315967 -120632 102859 -97020 18707 -619627 37946 -41636 -17638 -169131 -256632
16003b56632A07259c47243i1575A52247p0728j9692J65004r5996i6905A08468
$$ -256632 107259 -347243 -91575 152247 81519 61827 226831 130835 -96905 108468
15992A02948C2630g5527N689q5295B7937e3179a9463C8431J26776m1488J70318
$$ 102948 32630 -75527 -69838 -155133 27937 -53179 -19463 38431 165207 123719 294037
15981B94037P365m2972J675c03652J11988B23253I91g8810c5141m6971A23458
$$ 294037 301402 258430 260105 -303652 -191664 223253 991 -78810 -35141 -82112 123458
15969a36121O1088G992K2269O2355a13446K3933k18734F4990b9990j17543M2486
$$ -136121 -75033 7992 30261 92616 -113446 -89513 -308247 64990 -29990 -147533 -105047
15958a05047A77027a33687l6870Q4959C68298m0398h6246n3985j05949I1097Q3739
$$ -105047 177027 -133687 -170557 -85598 368298 327900 -86246 -140231 -246180 91097 174836
15947A74836b31958F7532c3974j69588h6424A22488a51035E9873e44444K71809
$$ 174836 -231958 67532 -33974 -203562 -86424 122488 -151035 59873 -544444 -272635
15937b72635a27144r5431j23312J54875B13115A0676J43844c183A81703E1428
$$ -272635 -127144 -222575 -345887 -191012 213115 10676 154520 -3183 181703 51428
15926e9388o1471N6129r7278m22869A27545b17408g4560l8236r7650A40405C6817
$$ -59388 -120859 -64730 -162008 -584877 127545 -217408 -74560 -112796 -210446 140405 36817
15914i4034k8219n8519H6513J18375a62501O2862L0461Q301H2051C9436J3337
$$ -94034 -122253 -180772 86513 204888 -162501 -99639 -69178 -60877 82051 39436 52773
15903E2773q618C601a53076O1126B3530L2178a39798J1274E36723A47939c7937
$$ 52773 44155 3601 -153076 -91950 23530 55708 -139798 -128524 536723 147939 -37937
15891a97980N925j81449i1647q1320j1816O9926J1440G4667j3834b20614O3946
$$ -197980 -192055 -373504 -91647 -172967 -184783 -114857 -103417 74667 60833 -220614 -156668
15880a56668j17187A02608J21180l8040E2899a66286c7637j15093d6007p5905
$$ -156668 -273855 102608 223788 185748 52899 -166286 -37637 -152730 -46007 -121912
15870a21912n9270L9622l726N9800A46410a02767A06164c66526a57649A41276
$$ -121912 -181182 -141560 -145286 -85486 146410 -102767 106164 -366526 -157649 141276
15859I5995K7119E5688b31263q2684a53871A54924b74448D7922a9851F0068B1805
$$ 95995 123114 55688 -231263 -313947 -153871 154924 -274448 47922 -19851 60068 21805
15847a04647M3165I2128O3529a11447A00840i5542G8195a45244j13654A36133
$$ -104647 -61482 92128 155657 -111447 100840 -95542 78195 -145244 -258898 136133
15836B92445g8072J9045P587B22691l2356D6950g2552l1289A25312O3551b7065
$$ 292445 -78072 -59027 -51440 222691 190335 46950 -72552 -103841 125312 188863 -27065
15824a67484B7657a27647j73792J44199r342f6953k48771H574N1806a37915A5040
$$ -167484 27657 -127647 -301439 -157240 -166582 -66953 -315724 8574 60380 -137915 15040
15812I6874a88634C8832P6897d28188C17468B6532c0300A08625E0323J26350A8387
$$ 96874 -188634 38832 115729 -428188 317468 26532 -30300 108625 50323 176673 18387
15800A51633c46787d1569A45469m6724c33513b7808k6059A6679g7110B4741J31386
$$ 151633 -346787 -41569 145469 98745 -333513 -27808 -53867 16679 -77110 24741 156127
15789A56127G6954A3798a70113k7322n938j01610K6275A6136a01349k20981J0813
$$ 156127 76954 13798 -170113 -197435 -203373 -304983 -278708 16136 -101349 -322330 -311517
15778c11517L8102D7722a65382b7092m45994B06532b12949C09331a56382g310
$$ -311517 -273415 47722 -165382 -27092 -473086 206532 -212949 309331 -156382 -7310
15767a0978j73452B82398j30760F4270a72808O1051q8886I688d9134E42958d6394
$$ -10978 -184430 282398 151638 64270 -172808 -111757 -200643 9688 -49134 542958 -46394
15755D1315M8187a82861F9386b09611C9260r63J65130m3132r433a25528q3079
$$ 41315 89502 -182861 69386 -209611 39260 38297 203427 160295 150862 -125528 -208607
15744b08607A86729F8773a03200e1231q7492a2144q3243A03016a57862C24747
$$ -208607 186729 68773 -103200 -51231 -138723 -12144 -95387 103016 -157862 324747
15733b52023b9434k84059I0809a93006j65061B536b55139a07949j28589B15513
$$ -252023 -29434 -313493 90809 -193006 -358067 2536 -255139 -107949 -236538 215513
15722a71962A79605b57845A39233M5209c2667D6155Q0199b71197C57479A77795
$$ -171962 179605 -257845 139233 184442 -32667 46155 126354 -271197 357479 177795
15711B62989f6420A9700i3140A17889b57686A5242K6583c0233n5109A21995c1564
$$ 262989 -66420 19700 -93140 117889 -257686 15242 41825 -30233 -85342 121995 -31564
15699G0229l4380a1162H1506K09511E5076h8196j56584B99389C6213K18447b16618
$$ 70229 35849 -11162 81506 291017 55076 -88196 -244780 299389 36213 254660 -216618
15687i0874A7651g4031I0965b26774E3195k2684a33866j72764G1800b41625D44469
$$ -90874 17651 -74031 90965 -226774 53195 30511 -133866 -306630 71800 -241625 444469
15675g1281A90676n6962a4871j03726r6161B5792b19110A02651b48369h4147j3509
$$ -71281 190676 133714 -14871 -118597 -214758 25792 -219110 102651 -248369 -84147 -97656
15664i7656d6945G1925A1284b49962i3497B4490B27a87107c2663A82646g9070
$$ -97656 -46945 71925 11284 -249962 -93497 24490 227 -187107 -32663 182646 -79070
15652A06263l2390K31220c52219B3306K11626F9819h1506p5600j35819A5048R5911
$$ 106263 73873 305093 -352219 23306 234932 69819 -81506 -157106 -292925 15048 110959
15641A10959c3982C0421J12769a92300e773k56136a9957j23727j6000A59507G1984
$$ 110959 -33982 30421 143190 -192300 -5773 -261909 -19957 -143684 -159684 159507 71984
15629f4007o9180J0343K5865j10013B1815b49748B5661a0559m90595J53403i5257
$$ -64007 -133187 -122844 -96979 -206992 21815 -249748 25661 -10559 -501154 -347751 -95257
15617B37070i2107D80732c9700A73008q4985J14537g7652K3702B4143P6216B7189
$$ 237070 -92107 480732 -39700 173008 88023 202560 -77652 -53950 24143 100359 27189
15605g6613F1444a01369A33816a78753l5264r0748B89126g8532B00436d8035B3864
$$ -76613 61444 -101369 133816 -178753 -214017 -304765 289126 -78532 200436 -48035 23864
15593b67649G9791J28621a4549j00701E2825a08290A89546a7242A42723L9939
$$ -267649 79791 208412 -14549 -115250 52825 -108290 189546 -17242 142723 182662
15583A82662h7209B69397b66654d8919G9330l0960K10428c4622A08219a02101
$$ 182662 -87209 269397 -266654 -48919 79330 48370 258798 -34622 108219 -102101
15572b00645b8521n6960J0379I4339a70370A5682c12941A90903r2596A3302J56231
$$ -200645 -28521 -85481 -75102 94339 -170370 15682 -312941 190903 98307 13302 169533
15561A69533P7879B9755J05925J899a97958d1674A48147E0335N8333m5711J10018
$$ 169533 247412 29755 135680 137579 -197958 -41674 148147 50335 108668 62957 172975
15550A72975d6359C32712c7810H3246h007k5517H3957R2863C555O557b13941G1658
$$ 172975 -46359 332712 -37810 83246 -8007 -33524 83957 176820 3555 10112 -213941 71658
15537A59486a84706e0085n5812A66311P8666m7007a59098k1769h2221j30226A83790
$$ 159486 -184706 -50085 -105897 166311 244977 197970 -159098 -180867 -82221 -212447 183790
15525b19817g7484b5726p6392A19405a51292B03600a91768D00875c24794A34990
$$ -219817 -77484 -25726 -102118 119405 -151292 203600 -191768 400875 -324794 134990
15514a25047k9932B05160j3543m6093R5793B737b5846n1285n397p4407F5040a6026
$$ -125047 -154979 205160 191617 145524 241317 2737 -25846 -77131 -82528 -156935 65040 -16026
15501b68739I4194j7223c01525a28774o2260n5601l31089b61419a27942A42357
$$ -268739 94194 76971 -301525 -128774 -191034 -246635 -577724 -261419 -127942 142357
15490h3832A04854Q8479a84267H419J65722j7445g614F8419g9749D1205J46806
$$ -83832 104854 193333 -184267 8419 174141 156696 -7614 68419 -79749 41205 188011
15479A88011d43158A63397b97686h3709B80889G0238a08317A07321c28967e045
$$ 188011 -443158 163397 -297686 -83709 280889 70238 -108317 107321 -328967 -5045
15468a15827A12195m5869J66296f2149G9997J14438q0280D798J77490Q1712b2507
$$ -115827 112195 66326 232622 -62149 79997 194435 114155 4798 182288 264000 -22507
15456A59564a02964D46790A72897i7267E2453i7805j96177a43516A16963b28604
$$ 159564 -102964 446790 172897 -97267 52453 -97805 -293982 -143516 116963 -228604
15445a15764J8754j74047A03208A0313a28628C50484a70505A6580B939J95172
$$ -115764 -97010 -271057 103208 10313 -128628 350484 -170505 16580 2939 198111
15435A98111c2021A36201c26074J45849C85480a39662e4236J9963j52397A82532
$$ 198111 -32021 136201 -326074 -180225 385480 -139662 -54236 -34273 -186670 182532
15424b16094A73533F3934j2255b74064J19930A902P7832g3837A30765c8792R646
$$ -216094 173533 63934 51679 -274064 -154134 1902 79734 -73837 130765 -38792 -29146
15413b9146G1975b3826A38027b08278C5298A6293a94930B43731a8008k37802J9288
$$ -29146 71975 -23826 138027 -208278 35298 16293 -194930 243731 -18008 -255810 -236522
15402b36522c5512j3374D11845a16642N0299B1654a06459d5785B7068a49566j33316
$$ -236522 -35512 -48886 411845 -116642 -66343 21654 -106459 -45785 27068 -149566 -282882
15391b82882A22927C6942K79841F9683c3686C01146A7303K57044N101j11421G6042
$$ -282882 122927 36942 316783 69683 -33686 301146 17303 274347 279448 168027 76042
15379B45186e966A22241n7046K89206b75681f6022C10250d0337B00078c24545
$$ 245186 -5966 122241 65195 354401 -275681 -66022 310250 -40337 200078 -324545
15368A0352a18049A7512a47813B27021j1820i1136j84715J37345M6821C26210
$$ 10352 -118049 17512 -147813 227021 215201 -91136 -275851 -138506 -91685 326210
15357B40123a45237j91156e7278o925C19003b7764j28934g0372i348B0357P1731
$$ 240123 -145237 -336393 -57278 -64203 319003 -27764 -156698 -70372 -9348 20357 92088
15346I2088g4856M769B14066d03875B20941l7398Q3550g0879F7060c4722j98509
$$ 92088 -74856 -70087 214066 -403875 220941 183543 267093 -70879 67060 -34722 -233231
15335b33231A27130J26556a00799A43697b24795g4166A34625a39075G1896a55516
$$ -233231 127130 253686 -100799 143697 -224795 -74166 134625 -139075 71896 -155516
15324d8377I3060b09997K6850B42972p6468f8155G4789b6800j72705H4632i0446
$$ -48377 93060 -209997 -183147 242972 166504 -68155 74789 -26800 -199505 84632 -90446
15312i3524A47433i9983A1190K19542A0114J08800b36203h2988d1461b721A05515
$$ -93524 147433 -99983 11190 230732 10114 118914 -236203 -82988 -41461 -2721 105515
15300A506J54118e0235k00566B2008c6400B3415c38851c8760A49609a44572A05795
$$ 1506 155624 -50235 -250801 22008 -36400 23415 -338851 -38760 149609 -144572 105795
15288a50174a9172C67099D8017J99532k4351n4897o2052B9627b5305F0448f0280
$$ -150174 -19172 367099 48017 247549 223198 168301 106249 29627 -25305 60448 -60280
15276B29938a8897B48194d0320A53225R6101H4643b43219E4663J91172I9583i6443
$$ 229938 -18897 248194 -40320 153225 249326 84643 -243219 54663 245835 99583 -96443
15264b97545A06851J34707A18277J10806n6318e6854k23842B32000a18864A20805
$$ -297545 106851 241558 118277 229083 172765 -56854 -280696 232000 -118864 120805
15253A79347E9962a62705D01721J08013M73290N31163j76900j09388l1221D69206
$$ 179347 59962 -162705 401721 509734 983024 1514187 1337287 1227899 1196678 469206
15242B18050j06797c32264c008k57537D9630N794M0032L81080E1142d9118B72085
$$ 218050 111253 -332264 -3008 -260545 49630 55424 95456 476536 51142 -49118 272085
15230A04368a91331h0746B89129a37651l38558f8220K3986H6412C3805M0801K01751
$$ 104368 -191331 -80746 289129 -137651 -476209 -68220 -44234 86412 33805 74606 276357
15219B76357d2202E347L16655h662C81823j05887h4452p7410A28433J54899B4933
$$ 276357 -42202 5347 322002 -8662 381823 275936 -84452 -161862 128433 283332 24933
15207A60791K5640b23903h3062B59967j06890p3377J89050j09926i0359B86061
$$ 160791 186431 -223903 -83062 259967 153077 79700 268750 158824 -90359 286061
15196B19956b90113f0017K146C57116b17768B15558K2976n2013N4648a32400B33199
$$ 219956 -290113 -60017 -57871 357116 -217768 215558 238534 186521 241169 -132400 233199
15184B69135j15214F5276k9922b11820B88622b2085B03735F3040R1789D6129i309
$$ 269135 153921 65276 35354 -211820 288622 -22085 203735 63040 154829 46129 -9309
15172A08589a3234B00011g6049a5116j22298C2595a02243d2146A13699a02363
$$ 108589 -13234 200011 -76049 -15116 -137414 32595 -102243 -42146 113699 -102363
15161A06348m9727b7936C06642j22318k454L9778a64979B70508K9233e443H2071
$$ 106348 56621 -27936 306642 184324 181870 221648 -164979 270508 299741 -5443 82071
15149b934A78091H1607b07967C00735D7990K22259m562H5652O1736J01571G7220
$$ -2934 178091 81607 -207967 300735 47990 270249 265687 85652 147388 248959 77220
15137B03021L933b90698H4750R0689E5135i1774E7675a59437B69131c3160A79989
$$ 203021 206954 -290698 84750 175439 55135 -91774 57675 -159437 269131 -33160 179989
15125b17399B88503i8636D8588J8302k4656N91712A13861L8833J85053f0763B2882
$$ -217399 288503 -98636 48588 66890 42234 633946 113861 152694 337747 -60763 22882
15113A01138M4321O4941q0194Q6990a22421A59784N4700l6051M48521B04244c04507
$$ 101138 145459 210400 130206 217196 -122421 159784 214484 178433 626954 204244 -304507
15101A25631B1309L17561J7818r5708L2446l7889F4881M6801L21837E3485J93653
$$ 125631 21309 338870 356688 260980 293426 255537 64881 111682 433519 53485 247138
15090B47138N6523C0068J89198J62524G3584d1725E44085g675j28886A78968b02110
$$ 247138 303661 30068 219266 381790 73584 -41725 544085 -7675 -136561 178968 -202110
15078a8624E0887j08M12494A60521J07038p4297J34879c08734e994C5959a82685
$$ -18624 50887 50779 463273 160521 267559 193262 328141 -308734 -5994 35959 -182685
15066D3314J34419a04502A18087b35896H2344h9685B62732a25613C854J38839
$$ 43314 177733 -104502 118087 -235896 82344 -89685 262732 -125613 3854 142693
15056A42693A9994H296N9031J06667F3948J11904C8803K85265A35424e4999C6021
$$ 142693 19994 8296 67327 173994 63948 175852 38803 324068 135424 -54999 36021
15044A18211O2165J47444D067Q9262B1024M60022E0504K18587J06998A08179R1864
$$ 118211 180376 327820 4067 93329 21024 481046 50504 269091 376089 108179 200043
15033B00043o1191b81602D13900B7339c2049B75248Q0188j61845q4916N2131L625
$$ 200043 138852 -281602 413900 27339 -32049 275248 355436 193591 108675 160806 164431
15022A64431a03176B98341j01053J12209L0616j5959R2917E9952h445A77490R0860
$$ 164431 -103176 298341 197288 309497 340113 324154 417071 59952 -8445 177490 268350
15011B68350j267R5024I2418J55227J7509K21561a03140C14769F6341k4700K76157
$$ 268350 267083 362107 92418 247645 265154 486715 -103140 314769 66341 41641 317798
15000C17798F342a769k78473F6343J54309C5149N5272a164l9106B5672K96408
$$ 317798 6342 -1769 -280242 66343 220652 35149 90421 -1164 -40270 25672 322080
14989C22080A38316A5946Q9970a29527C04934O9809A66571l6057M5124n1348M0075
$$ 322080 138316 15946 105916 -129527 304934 374743 166571 130514 175638 124290 164365
14978A64365G1923J30924J20125B5520K0666P3076A3252L36444H3363K73987j63378
$$ 164365 71923 202847 322972 25520 46186 119262 13252 349696 83363 357350 193972
14967A93972J35368K1190a64973B29449j14125n2307M58925g681B29311M9192
$$ 193972 329340 350530 -164973 229449 115324 63017 521942 -7681 229311 278503
14957B78503A19460K74524j07159B9919L12218A51092e4736C00174d2586B30753
$$ 278503 119460 393984 286825 29919 342137 151092 -54736 300174 -42586 230753
14946B8864J95159I0277a4594A75439J71231K83312B11091A04579J43111O7181
$$ 28864 224023 90277 -14594 175439 346670 629982 211091 104579 247690 314871
14936C14871F7081K11177D7297K9205M06734j20725K96149r6532J36645B94999
$$ 314871 67081 278258 47297 76502 483236 362511 658660 562128 698773 294999
14925A35974M33185k15276j23291N3314O5926r2299J32545m7727J14154O5802
$$ 135974 569159 353883 230592 283906 349832 257533 390078 342351 456505 522307
14915E22307j82961J63480o2861A30298M25871C5930J47293q8458L29316A28945
$$ 522307 339346 502826 439965 130298 556169 35930 183223 94765 424081 128945
14904E22634j70278A12841K96442j45612k4841K00977J25459k01699J51502J49348
$$ 522634 352356 112841 409283 263671 238830 439807 565266 363567 515069 664417
14894F64417C01702F1324J15033J70955Q4128j39086J07864N4322q544Q1492j84428
$$ 664417 301702 61324 176357 347312 431440 292354 400218 454540 445996 527488 343060
14883C43060A46387J05977K54612j22048r31A12272m2386N75403A97794J00913
$$ 343060 146387 252364 506976 384928 383997 112272 69886 645289 197794 298707
14873B98707K10901j02002k7920m670k9665B5983M08077j77649K01730J13324
$$ 298707 509608 407606 379686 375016 345351 25983 434060 256411 458141 571465
14863E71465p664j38283A92613K50096j52650j43641M65457k56738J82142O2391
$$ 571465 563801 425518 192613 442709 290059 146418 611875 355137 537279 599670
14853E99670k23508j36407L45396k06889Q5249R4435j9689j06721N3190j36154
$$ 599670 376162 239755 585151 378262 463511 557946 538257 431536 484726 348572
14843C48572J12525j96933A24568J16893L38140j28170J79401k0834A40137J71155
$$ 348572 461097 264164 124568 241461 579601 451431 630832 609998 140137 311292
14833C11292M05260k07083A27514K23506J06513K6047k5649j14568L97034B77382
$$ 311292 716552 509469 127514 351020 457533 483580 457931 343363 740397 277382
14822E61730j81726K07102K83093m03214A86146o1799P46422k69266k132J73742
$$ 561730 380004 587106 870199 466985 186146 124347 870769 601503 599371 773113
14812G73113k00787j89929q366r2652j1320J80444A12810N72364p8043J04270
$$ 773113 572326 382397 374031 281379 270059 450503 112810 685174 607131 711401
14802G11401l28446M53052k52251J8854K34734B85868J22649e1055E82968k15932
$$ 711401 382955 836007 583756 602610 837344 285868 408517 -51055 582968 367036
14792C67036M68987l14899J95326k26056m8681j11541K3080L26437K410k77973
$$ 367036 836023 521124 716450 490394 441713 330172 353252 679689 682099 404126
14782D04126j27470N05479k74748M2495J72672C49305J14685O02902l20098j59763
$$ 404126 276656 782135 507387 549882 722554 349305 463990 1066892 746794 587031
14772E87031l7692j22832M5238J80060o0766K72617l48710j35142J57936p8168
$$ 587031 549339 426507 471745 651805 591039 863656 514946 379804 537740 459572
14762D59572L58340J00339D02231N46772k66567j6197K27736l35247N26036n40790
$$ 459572 817912 918251 402231 949003 682436 666239 893975 558728 1084764 543974
14752E43974L69432j28821j40353o7223o3826m8739L07543k47599J36837r2385
$$ 543974 913406 784585 644232 577009 513183 464444 771987 524388 661225 568840
14742E68840j14020O26031r6303O8665j74859l36476L99909l90097K41448k4998
$$ 568840 454820 1080851 984548 1053213 878354 541878 941787 551690 793138 768140
14732G68140L8663P291M4606l2273r8399K0029J14211n980K23060o1317m85811
$$ 768140 806803 814094 858700 826427 728028 748057 862268 856288 1079348 1018031 532220
14721E32220K37190L08002j49230P1766L1397m93682K44739o4894J04012L6712
$$ 532220 769410 1077412 928182 999948 1031345 537663 782402 717508 821520 858232
14711H58232j24356R0118o5169K04260l88608N34161m78347K58845l7010K12859
$$ 858232 733876 823994 758825 963085 574477 1108638 630291 889136 852126 1064985
14701A064985m70647K95668m2547J75671l80593K22710j0939J30462L1968J19251
$$ 1064985 594338 890006 847459 1023130 642537 865247 854308 984770 1016738 1135989
14691A135989n0834k08723K70350j88292j39960K020K21458p5319J57249k4810
$$ 1135989 1085155 876432 1146782 958490 818530 820550 1042008 966689 1123938 1099128
14681A099128l4704l13527L81183j13989m6086j02320J83750m9752k0442K01991
$$ 1099128 1064424 750897 1132080 1018091 972005 869685 1053435 1003683 983241 1185232
14671A185232J77777l61188J03717q2330L26728m31774K5527P0988k1765K41624
$$ 1185232 1363009 1001821 1105538 1023208 1349936 918162 943689 1014677 992912 1234536
14661A234536L2868M5308l97788M52571m50649P3016K86406k68981J24363K90128
$$ 1234536 1267404 1312712 914924 1367495 916846 989862 1276268 1007287 1131650 1421778
14651A421778l24365K34508m94230L46960j44379K56517M9462m67888L01777P8329
$$ 1421778 1097413 1331921 837691 1184651 1040272 1296789 1346251 878363 1180140 1258469
14641A258469J43304p4147O3535m06342K51924Q1371J61214k93941J95853p556
$$ 1258469 1401773 1327626 1391161 984819 1236743 1318114 1479328 1185387 1381240 1373684
14631A373684J2163J60906L6959j96251R0513q786J12286k32008k72861J55209
$$ 1373684 1385847 1546753 1583712 1387461 1477974 1469188 1581474 1349466 1076605 1231814
14621A231814N12016j56658J73667l88746m979L58439l15380K62985k51004k68518
$$ 1231814 1743830 1587172 1760839 1372093 1367114 1725553 1410173 1673158 1422154 1153636
14611A153636L96956m3730n6272P5877q1932j35678O71959l67024j80898N38162
$$ 1153636 1550592 1506862 1450590 1526467 1444535 1308857 1980816 1613792 1432894 1971056
14601A971056p0810M7420l56601J11160L25644l39156J2377j57609J13909J40859
$$ 1971056 1900246 1947666 1591065 1702225 2027869 1688713 1701090 1543481 1657390 1798249
14591A798249j0800n2566P6915j56339K34072J102j26481L0572J02924K31661
$$ 1798249 1787449 1734883 1811798 1655459 1889531 1890633 1764152 1794724 1897648 2129309
14581B129309k26356Q7252K6311j99977L33246k74575K46790j0268J73027j19687
$$ 2129309 1902953 1990205 2016516 1816539 2149785 1875210 2122000 2111732 2284759 2165072
14571B165072q9877J21845O8393Q6328j01297N16785l59021q5326L27496L57067
$$ 2165072 2075195 2197040 2265433 2351761 2250464 2767249 2408228 2322902 2650398 3007465
14561C007465J1756j38869J00560j3347J20244L54291l42293Q23842K22320K22041
$$ 3007465 3019221 2880352 2980912 2967565 3087809 3442100 3099807 3923649 4145969 4368010
14551D368010P21932J282072J627057M513403Q570514J8160841M305645k0629394
$$ 4368010 5089942 6372014 7999071 12512474 21082988 39243829 43549474 22920080
14543B2920080A0989436n080603j656645j113220m30242j95070m15689Q1422J25677
$$ 22920080 10989436 5908833 4252188 3138968 2708726 2513656 2097967 2179389 2305066
14534B305066J4855l28572J99298q1866K81504n00215L66085P320R1477m6663
$$ 2305066 2319921 1991349 2190647 2108781 2390285 1890070 2256155 2263475 2354952 2308289
14524B308289M9111N1023q2765K71386J38092j26571j99544M51434j48273J44353
$$ 2308289 2357400 2408423 2325658 2597044 2735136 2608565 2409021 2860455 2712182 2856535
14514B856535L17247l51912J82969J03955l49055o5260j42308L76676Q5951J01493
$$ 2856535 3173782 2821870 3004839 3108794 2759739 2694479 2552171 2928847 3014798 3116291
14504C116291J79227l0235p7931O4436J83888m5569M2085j14136M00781j74520
$$ 3116291 3295518 3265283 3187352 3251788 3435676 3390107 3432192 3318056 3718837 3544317
14494C544317M5823k61012J50242L78255o87229O18011k78018K16142M21107l58763
$$ 3544317 3590140 3329128 3479370 3857625 3170396 3788407 3510389 3726531 4147638 3788875
14484C788875M90975j67262j3395n5938K7050m74884N75620K84313J49769k70150
$$ 3788875 4279850 4112588 4099193 4043255 4070305 3595421 4171041 4455354 4605123 4334973
14474D334973M46407m14922L29439l83061N4198O12363l34581M5097J41054k50176
$$ 4334973 4781380 4366458 4695897 4312836 4367034 4979397 4644816 4689913 4830967 4580791
14464D580791J62909j37945L27469l36068N32493l0290K33575Q4441J49287n2707
$$ 4580791 4743700 4605755 4933224 4597156 5129649 5099359 5332934 5417375 5566662 5513955
14454E513955j56579O425K14913K4942p0169k2932K47971j7239K05054J54944
$$ 5513955 5357376 5363801 5578714 5603656 5533487 5510555 5758526 5741287 5946341 6101285
14444F101285N7509j58126M98166J00442p8806r4036J83768J47241N1015r6772
$$ 6101285 6158794 6000668 6498834 6599276 6520470 6426434 6610202 6757443 6808458 6711686
14434F711686K55735L9449K61594p891K36007J5734q5733J75586L80284J74373
$$ 6711686 6967421 7006870 7268464 7260573 7496580 7512314 7426581 7602167 7982451 8156824
14424H156824o8972k16194P0929N0128N14401L52088k57867L06463K49030q5975
$$ 8156824 8087852 7871658 7942587 7992715 8507116 8859204 8601337 8907800 9156830 9070855
14414I070855r0302L12029l6929J79007L88134P5084J86255P783K98139j34691
$$ 9070855 8980553 9292582 9255653 9434660 9822794 9897878 10084133 10091916 10390055 10255364
14404A0255364L58740Q5743M02716K40698k54353K94468J25448J57025O36687
$$ 10255364 10614104 10699847 11102563 11343261 11088908 11383376 11508824 11665849 12302536
14395A2302536l51133O46034k87733L71914K91981M83914q6910K71322K133M86975
$$ 12302536 11951403 12597437 12309704 12681618 12973599 13457513 13370603 13641925 13644058 14131033
14385A4131033N30024K14651r0654K05919P96253K93531j99776N06991N24369
$$ 14131033 14661057 14875708 14785054 14990973 15787226 16080757 15880981 16387972 16912341
14376A6912341M7511L47703L53051L83305N14684N0046N93330L27030J29273P44772
$$ 16912341 16959852 17307555 17660606 18043911 18558595 18608641 19201971 19529001 19658274 20403046
14366B0403046J72967P32895L55365N80497J73265P70264M65045L85447Q73881
$$ 20403046 20576013 21308908 21664273 22244770 22418035 23188299 23653344 24038791 24912672
14357B4912672K72968N69047O50262M81878O96165P40376M64806N64700P42738
$$ 24912672 25185640 25754687 26404949 26886827 27582992 28323368 28788174 29352874 30095612
14348C0095612P83004P64709R63368O97018J073329M54156J094173J319540R69115
$$ 30095612 30878616 31643325 32606693 33303711 34377040 34831196 35925369 37244909 38214024
14339C8214024P90799J131548J069518J369261J068602J357642J424264J207770
$$ 38214024 39004823 40136371 41205889 42575150 43643752 45001394 46425658 47633428
14331D7633428J187386J857210J400958J565226J675094J745266K128907J944484
$$ 47633428 48820814 50678024 52078982 53644208 55319302 57064568 59193475 61137959
14323F1137959K086143K344160K246078K123159K777314K431286K651100K884851
$$ 61137959 63224102 65568262 67814340 69937499 72714813 75146099 77797199 80682050
14315H0682050L083405L298231L583342L450255L826124L765805M243393M527023
$$ 80682050 83765455 87063686 90647028 94097283 97923407 101689212 105932605 110459628
14307A10459628M964476M637558N397170N256185N965671O303914O309370P350554
$$ 110459628 115424104 120061662 125458832 130715017 136680688 142984602 149293972 156644526
14299A56644526P343453P898450P870893Q873100R245964R601195J0269342J0751199
$$ 156644526 163987979 171886429 179757322 188630422 197876386 207477581 217746923 228498122
14291B28498122J1031940J2057805J2072413J2955456J3723712J3712019J4067853
$$ 228498122 239530062 251587867 263660280 276615736 290339448 304051467 318119320
14284C18119320J4659122J4801934J5156650J4851002J4591636J4323894J3595286
$$ 318119320 332778442 347580376 362737026 377588028 392179664 406503558 420098844
14277D20098844J2679774J1549578R799726P966472N609888J469484j251410j818329
$$ 420098844 432778618 444328196 454127922 462094394 467704282 469173766 467922356 466104027
14269D66104027l334737l974025n662303p082279p536250r757382j0726526j2210077
$$ 466104027 462769290 458795265 453132962 446050683 438514433 428757051 418030525 405820448
14261D05820448j3918768j4727308j4844455j5623537j5595947j5449466j3761989
$$ 405820448 391901680 377174372 362329917 346706380 331110433 315660967 301898978
14254C01898978j4577891j3564198j3457663j2751398j2073761j1588563j0945670
$$ 301898978 287321087 273756889 260299226 247547828 235474067 223885504 212939834
14247B12939834j0061096r607095r191352q308208q340815p726767p522264o808416
$$ 212939834 202878738 193271643 184080291 175772083 167431268 159704501 152182237 145373821
14239A45373821o703249n485927n590193n513124n263675m685471m957545l834171
$$ 145373821 138670572 133184645 127594452 122081328 116817653 112132182 107174637 103340466
14231A03340466l919267l888276l740898l699806l284867l410905k749509k970799
$$ 103340466 99421199 95532923 91792025 88092219 84807352 81396447 78646938 75676139
14223G5676139k882759k262214k505880k048436k162699k189100j941734k391064
$$ 75676139 72793380 70531166 68025286 65976850 63814151 61625051 59683317 57292253
14215E7292253j150073j864143j443531j983749j092365k099334j409407o88830
$$ 57292253 56142180 54278037 52834506 50850757 49758392 47659058 46249651 45560821
14207D5560821p26326j746046j237060j223989j191449j026649q33819l94702
$$ 45560821 44834495 43088449 41851389 40627400 39435951 38409302 37575483 37180781
14199C7180781j603406j004746q14101q96393o03422r47790o60953o99806r90966
$$ 37180781 35577375 34572629 33758528 32862135 32258713 31310923 30649970 29950164 28959198
14190B8959198q87078n42789n29957p16232o18653o64638m77947l81235n24046
$$ 28959198 28072120 27529331 26999374 26283142 25664489 24999851 24521904 24140669 23616623
14181B3616623n50419l00047o35611l43932n35297j83559n75905n71241j74926
$$ 23616623 23066204 22766157 22130546 21786614 21251317 21067758 20491853 19920612 19745686
14172A9745686p67897j74687k13158m91919k53279j69506o45629m04391l88106
$$ 19745686 18977789 18803102 18589944 18098025 17844746 17675240 17029611 16625220 16237114
14163A6237114J04780k59721o79930k1175k08107o31886J32256k01318k21190
$$ 16237114 16341894 16082173 15402243 15381068 15172961 14541075 14673331 14472013 14250823
14154A4250823m83112m90326J88094k78845k94226o2998k39396k07912r3096n43709
$$ 14250823 13767711 13277385 13465479 13186634 12892408 12829410 12590014 12382102 12289006 11745297
14144A1745297L54435n02195j74964k28540k41339K01981n06095j49867J70452
$$ 11745297 12099732 11597537 11422573 11194033 10952694 11154675 10648580 10498713 10669165
14135A0669165l10326o0375n32135L70118k92155l31647k35207L63508k59905
$$ 10669165 10358839 10298464 9766329 10136447 9844292 9512645 9277438 9640946 9381041
14126I381041m03710Q3325k61071O3136o77324K35365J855j14216k33336J36700
$$ 9381041 8977331 9060656 8799585 8862721 8185397 8420762 8422617 8308401 8075065 8211765
14116H211765K2160l87198k84686K36717m91864J58811J20449k42908J77029k24836
$$ 8211765 8233925 7846727 7562041 7798758 7306894 7465705 7586154 7343246 7520275 7295439
14106G295439j99116K9088l69296j29683L11961k4048q15916M02471M9536j66074
$$ 7295439 7096323 7125411 6756115 6626432 6938393 6914345 6098429 6500900 6550436 6384362
14096F384362k73854J8143J1768p3099Q8907m10086j72543N04898l41988m69481
$$ 6384362 6110508 6128651 6140419 6067320 6156227 5746141 5573598 6078496 5736508 5267027
14086E267027J91735n0648J86137n4743k19832k61131L42689l84409Q1543k07004
$$ 5267027 5458762 5408114 5594251 5539508 5319676 5058545 5401234 5016825 5098368 4891364
14076D891364K63898j43280n2414k24341L20574n9664k79376j43201k62424O94433
$$ 4891364 5155262 5011982 4959568 4735227 5055801 4996137 4716761 4573560 4311136 5005569
14066E005569o41982M42475n76609N11480n46695N9549L6490J75537M8112j82495
$$ 5005569 4363587 4806062 4229453 4740933 4194238 4253787 4290277 4465814 4513926 4331431
14056D331431J82241o48695N05723m92258K62054r6826M0982k22245o93232O31611
$$ 4331431 4513672 3864977 4370700 3878442 4140496 4043670 4084652 3862407 3169175 3800786
14046C800786k34979L91260j88380j46692J84348m0529j72211J76314J6766j35719
$$ 3800786 3565807 3957067 3768687 3621995 3806343 3765814 3593603 3769917 3786683 3650964
14036C650964j21262k42394J33465k53620M1214J55359R7979J04385k84100j91930
$$ 3650964 3529702 3287308 3420773 3167153 3208367 3363726 3461705 3566090 3281990 3090060
14026C090060r5171L43445k45284J06270l50674J58471n6504k60225j44386N77475
$$ 3090060 2994889 3338334 3093050 3199320 2848646 3007117 2950613 2690388 2546002 3123477
14016C123477l45413J14881J8133k440l90592k8765J65817K55220l69228m18270
$$ 3123477 2778064 2892945 2911078 2908638 2518046 2489281 2655098 2910318 2541090 2122820
14006B122820L99238k7676O1129j86048Q0225j73249K19365j21872L63638o52524
$$ 2122820 2522058 2494382 2555511 2369463 2449688 2276439 2495804 2373932 2737570 2085046
13996B085046M39558o30909J93937L46614M3304l574O52575P45145L131425P268771
$$ 2085046 2524604 1893695 2087632 2434246 2477550 2473976 3126551 3871696 7003121 14271892
13986A4271892J7841170J1354003j6557861j1184395n896983k595209j756861
$$ 14271892 32113062 43467065 26909204 15724809 9827826 7232617 5475756
13979E475756p86845l89476n12097k67603k29839j59832k80892J99731j61359
$$ 5475756 4688911 4299435 3787338 3519735 3289896 3130064 2849172 3048903 2887544
13970B887544k59257J85708L2810k56830k01506q9953J90434j10058k45983J52750
$$ 2887544 2628287 2813995 2846805 2589975 2388469 2298516 2488950 2378892 2132909 2285659
13960B285659O351j55773J02650L9656j95576p9928J4587L5710l40298N88902
$$ 2285659 2292010 2136237 2238887 2278543 2082967 2003039 2017626 2053336 1713038 2301940
13950B301940l31494L64641k71505j48606L42585l36941L42775m62477j21730
$$ 2301940 1970446 2335087 2063582 1914976 2257561 1920620 2263395 1800918 1679188
13941A679188L96078q8915n9986J86923j64282k49460J09098K13766k26965J58409
$$ 1679188 2075266 1986351 1926365 2113288 1949006 1699546 1808644 2022410 1795445 1953854
13931A953854n42847L74475l4374K8568k36043l1548K85069j5083k24079J26896
$$ 1953854 1411007 1785482 1751108 1779676 1543633 1512085 1797154 1782071 1557992 1684888
13921A684888r5312J74617K19313k47755J38703l13634K41563l10657K66095L0855
$$ 1684888 1589576 1764193 1983506 1735751 1874454 1560820 1802383 1491726 1757821 1788676
13911A788676k25190k28408J47970K74385m42881o4631L31726K50697k74677j72352
$$ 1788676 1563486 1335078 1483048 1757433 1314552 1249921 1581647 1832344 1557667 1385315
13901A385315l4048K9724K4219J22431K402J17104k80672k42886N4053J78J88994
$$ 1385315 1351267 1380991 1405210 1527641 1530043 1647147 1366475 1123589 1177642 1177820 1366814
13890A366814P558L15414m10601j18929q1469K58007K7820j04247L7021k03491
$$ 1366814 1374372 1689786 1279185 1160256 1078787 1336794 1364614 1260367 1297388 1093897
13880A093897J09551j04872K77077r6967P6401j64256M83820n72888J99794l12
$$ 1093897 1203448 1098576 1375653 1278686 1355087 1190831 1674651 1101763 1301557 1301245
13870A301245j24534o410K37178k20203m51712N87968J46531J3617j67512l27145
$$ 1301245 1176711 1170301 1407479 1187276 735564 1323532 1470063 1483680 1316168 989023
13860I89023O818J54985j31633j17551L1859K32776K33752l19263J97973k04994
$$ 989023 995841 1150826 1019193 901642 933501 1166277 1400029 1080766 1278739 1073745
13850A073745j3077J05765r7537l4181J23385K91228m79839R5992J04715j26948
$$ 1073745 1060668 1166433 1068896 1034715 1158100 1449328 969489 1065481 1170196 1043248
13840A043248J86377m6872j61554k1707k4825k30332M05830r8690O2654j7590
$$ 1043248 1229625 1182753 1021199 999492 974667 744335 1150165 1051475 1114129 1096539
13830A096539E11348P12862k10925m20950J15514L24334j0098l4914j96493J83373
$$ 1096539 511348 1224210 1013285 592335 707849 1032183 1022085 987171 790678 974051
13820I74051o6263J6148k38956m6753L08764r3017L25483J94059l47149j61052
$$ 974051 907788 923936 684980 638227 946991 853974 1179457 1373516 1026367 865315
13810H65315j03382L92938l50066j17497J79917J7390j38258P3136J72771l01998
$$ 865315 761933 1154871 804805 687308 867225 884615 746357 819493 992264 690266
13800F90266J37484Q716L29883l60054J06625J13488k32982k9240o5506J08924
$$ 690266 827750 836466 1166349 806295 912920 1026408 793426 764186 698680 807604
13790H07604J59555J67220m31071M69465l25433R9694L9885j84840J26975J85762
$$ 807604 967159 1134379 703308 1172773 847340 947034 986919 802079 929054 1114816
13780A114816k27423K5006o1670M0757M7719D41573M32318D25050M07011j09216
$$ 1114816 887393 912399 850729 891486 939205 441573 873891 425050 832061 722845
13770G22845L71413m44834m7299K55205j59329p4007J29209j61607J08967J55912
$$ 722845 1094258 649424 602125 857330 698001 623994 753203 591596 700563 856475
13760H56475K73427k56978j61273l3480J61818N0716R2851Q9635D18140L16441
$$ 856475 1129902 872924 711651 678171 839989 890705 983556 1073191 418140 734581
13750G34581k32349L22406C86769Q9543J83726P5410j77816K12453L9917l16876
$$ 734581 502232 824638 386769 476312 660038 735448 557632 770085 810002 493126
13740D93126K65456j09542J85537j53380K4031K65819k94446J13371j66683j46838
$$ 493126 758582 649040 834577 681197 705228 971047 676601 789972 623289 476451
13730D76451J56401N5315j00555K23643C21984L10159R2523k26252K06082k30875
$$ 476451 632852 688167 587612 811255 321984 632143 724666 498414 704496 473621
13720D73621K90833k41858k15079J669N41926l23172j82468m8398J96686j68425
$$ 473621 764454 522596 307517 309186 851112 527940 345472 297074 493760 325335
13710C25335J80656J1051J81961k55861O10960n13028K91050j06867k01935k43231
$$ 325335 505991 517042 699003 443142 1054102 541074 832124 725257 523322 280091
13700B80091L75012C22642L37321j0815m9383k12905L62464R3572l08256P7043
$$ 280091 655103 322642 659963 649148 599765 386860 749324 842896 534640 611683
13690F11683j40899K22046C17887M38998C30743K7908O9116J58580q2924L3039
$$ 611683 470784 692830 317887 756885 330743 358651 427767 586347 503423 536462
13680E36462j97813o68l0046J62629J52553P3399J9431k55715j7916K529n0743
$$ 536462 338649 337981 307935 470564 623117 696516 715947 460232 442316 444845 394102
13669C94102j16510L19624J41136j60763o8002k0652k42504L05865J23664k58152
$$ 394102 277592 597216 738352 577589 509587 488935 246431 552296 675960 417808
13659D17808j18269K9856K87262r811J55997Q9676j46653l22749l4643r8145K45820
$$ 417808 299539 329395 616657 606846 762843 852519 705866 383117 348474 250329 496149
13648D96149J9332M1503j76443L52335A93456J74368n9416N37270C08015K8546
$$ 496149 515481 556984 380541 732876 193456 367824 308408 845678 308015 336561
13638C36561M25494l09417J83458p9418M9346R3792c04871A18748J87714j29170
$$ 336561 762055 452638 636096 556678 606024 699816 -304871 118748 306462 177292
13628A77292K37590J34035j56935j15432J08709j12784J01737K62972Q4703J4390
$$ 177292 414882 548917 391982 276550 385259 272475 374212 637184 721887 736277
13618G36277A39982N61784j74520k16510J96346A03521K79042K1136r4325Q2323
$$ 736277 139982 701766 527246 310736 507082 103521 382563 403699 309374 391697
13608C91697r6300K30537L04178l97849k9460K07405A61417C2992M44091J15062
$$ 391697 295397 525934 830112 432263 402803 610208 161417 32992 477083 592145
13598E92145B57523L30400k78780K93655k63302K28071r1543O82A93601M52240
$$ 592145 257523 587923 309143 602798 339496 567567 476024 476706 193601 645841
13588F45841k72537L404C6882M23272P7605j32869j44902L02599j22691A10524
$$ 645841 373304 376708 36882 460154 537759 404890 259988 562587 439896 110524
13577E08245m431k02229A41578K37431L6880A95202L40598M493j01800o743N2650
$$ 508245 503814 301585 141578 379009 415889 195202 535800 540293 438493 431750 484400
13566D84400J02324k57845A54165o7783P8212G6083N46215k15757j79210P5658
$$ 484400 586724 328879 154165 86382 164594 76083 622298 406541 227331 302989
13556C02989H8769N92408A51256J24490O8421l4063d3249D45830j97935J71873
$$ 302989 88769 681177 151256 275746 344167 310104 -43249 445830 247895 419768
13546D19768A85641J81019N6400j05737C04N12306j50524A69050L25098m3072
$$ 419768 185641 366660 423060 317323 304 512610 362086 169050 494148 451076
13536D51076A84186J99951H7107J27942J06281L1155M397b71545A66468o4785
$$ 451076 184186 384137 87107 215049 321330 352485 356882 -271545 166468 101683
13526A01683M82532B07699L289Q4709r5839L8478I7807L08086j0949a6415A62337
$$ 101683 584215 207699 210988 295697 199858 238336 97807 405893 394944 -16415 162337
13514B95466n9558J63342q1193L3046p9552j07992K83404J34929B61001K11574
$$ 295466 235908 399250 318057 351103 271551 163559 446963 581892 261001 472575
13504D72575j25351P7283j59565o1264J7003O2209A26496L7962p6679M08063j66876
$$ 472575 347224 424507 264942 203678 220681 282890 126496 164458 87779 495842 328966
13493C28966j06446Q3631j30345d08333A79481l8125J3957p7453J36697L00981
$$ 328966 222520 306151 175806 -408333 179481 141356 155313 77860 214557 515538
13483E15538k03269j10375P8499K14282F1934J41157m9038a1682C16207Q294j22728
$$ 515538 312269 201894 280393 494675 61934 203091 154053 -11682 316207 324501 201773
13472B01773P853J21146J03057j19393k5735K8582J66254j53045h5977D22754
$$ 201773 209626 330772 433829 314436 288701 317283 483537 330492 -85977 422754
13461e4900F03408A97508J04467j06129J62291R0677E5726P0190K45447j0313
$$ -54900 603408 197508 301975 195846 358137 448814 55726 125916 371363 361050
13451C61050M2469A12676M49926A14494A2029J58683J40630a35556B90796I5896
$$ 361050 403519 112676 562602 114494 12029 170712 311342 -135556 290796 95896
13440B61158J00873p8163A25682K21721j44378G4223J31256J88165a3143B87279
$$ 261158 362031 283868 125682 347403 203025 74223 205479 393644 -13143 287279
13429B22334J1837J99944A86286R3323j2945a2852A36855D2686J82663J30955
$$ 222334 234171 434115 186286 279609 266664 -12852 136855 42686 225349 356304
13419C56304j74057J6070G7492L66557C967N09774q9833o6058A15891K01827F0849
$$ 356304 182247 198317 77492 444049 3967 513741 423908 357850 115891 317718 60849
13407D27193r1588L74A16163J30147D5772L56235n2691H3619k1811M41566k34297
$$ 427193 335605 335979 116163 246310 45772 402007 349316 83619 61808 503374 269077
13396B69077A23006a9620q4628q3988D42115A20701A1810M61967G422a58111B7005
$$ 269077 123006 -19620 -104248 -188236 442115 120701 11810 473777 7422 -158111 27005
13384B0384M85675A68415J67043l9115O3328M0802e5251C63375A55005J17453
$$ 20384 506059 168415 335458 296343 359671 400473 -55251 363375 155005 272458
13374B72458j8974j12825K51218R5364B35653J34317L1225A90629L62710B73999
$$ 272458 253484 140659 391877 487241 235653 369970 401195 190629 553339 273999
13363D60026k24535K00400A7130d683B27010O6285M12314A94703K99689j95184
$$ 460026 235491 435891 17130 -4683 227010 293295 705609 194703 494392 299208
13353B99208F5474K80226O8565I8082J67203Q0112A29749M39090k52116b0725
$$ 299208 65474 345700 414265 98082 265285 345397 129749 568839 316723 -20725
13342C06835j46765L9801M8670R312O6257b1227C91119c8270D41622r1118L68908
$$ 306835 160070 199871 248541 257853 324110 -21227 391119 -38270 441622 350504 719412
13331G19412E2385J00424m643J10935R4549j27962J33901A59421m9632L94047
$$ 719412 52385 152809 148166 259101 353650 225688 359589 159421 109789 503836
13321E03836G772O3834M07938j75783k0756J46019A99429J85365J15455G8224
$$ 503836 7772 71606 479544 303761 283005 429024 199429 384794 500249 78224
13310B10385J60058M2928A51787m6555O6719c75A13123J20188J02850a32197j34685
$$ 210385 370443 413371 151787 105232 171951 -375 113123 233311 336161 -132197 -266882
13299b66882D79671j94469r39n5155k5181B0736O9521m3091D245J84068p07G8883
$$ -266882 479671 285202 284263 229108 203927 20736 90257 47166 4245 188313 187606 78883
13286C61311i3299M3019j50254A68331l4311Q0875c3072m7556A19455a54315A78148
$$ 361311 -93299 -50280 -200534 168331 134020 214895 -33072 -80628 119455 -154315 178148
13274g472A8035R5844L74057g3186r9032A43881g1797j73719A88816O2195O9205
$$ -7472 18035 113879 487936 -73186 -172218 143881 -71797 -245516 188816 251011 320216
13263C20216r3284A07213k7066L05308j47993H1138N2048B9633J97900I7713K56941
$$ 320216 226932 107213 80147 385455 237462 81138 133186 29633 227533 97713 354654
13252C54654H266M8497i8115B27693a4697B44340r9686k4313R9360J19955M20247
$$ 354654 8266 56763 -98115 227693 -14697 244340 144654 120341 219701 339656 759903
13241G59903I5698D4672P6896K26688I8308a33142A20635a35007d648k5968A46018
$$ 759903 95698 44672 121568 348256 98308 -133142 120635 -135007 -4648 -30616 146018
13229c7131O685A00025a36055A87852c0791A30272l7853a81317B73027f6299A62115
$$ -37131 -30446 100025 -136055 187852 -30791 130272 92419 -181317 273027 -66299 162115
13217B47624A06730J23470D2956M6678a50237J2493g695A1054J22604n3432J07312
$$ 247624 106730 230200 42956 89634 -150237 -137744 -7695 11054 133658 80226 187538
13206A87538o2683g4150B7730a10122A3975K74542j28893a6304A73101E1086J16569
$$ 187538 124855 -74150 27730 -110122 13975 288517 159624 -16304 173101 51086 167655
13195A67655A4696L05615D0709J28520n4835J46097F2238a9295C88273q2721a03709
$$ 167655 14696 320311 40709 169229 114394 260491 62238 -19295 388273 305552 -103709
13183A11986K28103e8028j1139C71150r1898a96944D07543e006D13633h1600D640
$$ 111986 340089 -58028 -69167 371150 279252 -196944 407543 -5006 413633 -81600 4640
13171b5773B39319E8276B8662K86277F1030A0641K17872G6836K69037G2319j3842
$$ -25773 239319 58276 28662 314939 61030 10641 228513 76836 345873 72319 58477
13160E8477g3388C2113a63060B06859P8011j7542I5697h3489A29660J7329J2259
$$ 58477 -73388 32113 -163060 206859 284870 267328 95697 -83489 129660 146989 159248
13149A59248a03949D73403F1549J93004A22648a18956o2866A20131N5903J33518
$$ 159248 -103949 473403 61549 254553 122648 -118956 -181822 120131 176034 309552
13139C09552d5677A72882d9303A73010J97271q7539a5322B9064P1728k6844R3218
$$ 309552 -45677 172882 -49303 173010 370281 282742 -15322 29064 100792 73948 167166
13128A67166f0309m582c2246H8714Q2757l6287a04389J610l1330B53208E656J67158
$$ 167166 -60309 -64891 -32246 88714 171471 135184 -104389 -102779 -134109 253208 5656 172814
13116A72814O1148c33763A763L60792A50266m6261Q767b42990C36903I0735a47137
$$ 172814 233962 -333763 1763 362555 150266 104005 112772 -242990 336903 90735 -147137
13104B23043N9611c9790A00571J18323H8245J60649c05019b7406p7763B002K05737
$$ 223043 282654 -39790 100571 218894 88245 248894 -305019 -27406 -105169 2002 207739
13093B07739h8833A49477J06415d6082A79804F1512P3305J52259A37510h9211
$$ 207739 -88833 149477 255892 -46082 179804 61512 134817 287076 137510 -89211
13082B33635R3651C4743q798f1658B67855i5720p0520G3352L73052d4172n5135
$$ 233635 327286 34743 25945 -61658 267855 -95720 -166240 73352 446404 -44172 -99307
13071i9307j10448d8342A0747i2422A07328l915O3951C2791K51338j01571G7088
$$ -99307 -209755 -48342 10747 -92422 107328 103413 167364 32791 284129 182558 77088
13059B11945J29860a75250B69884j06410J17925a70000B05751i9E1856Q3472J18729
$$ 211945 341805 -175250 269884 163474 281399 -170000 205751 -99 51856 135328 254057
13048B54057m2932R4162G122Q824a64418E73730A73296J92949j26807Q550J70027
$$ 254057 211125 305287 7122 15946 -164418 573730 173296 366245 239438 247988 418015
13037D18015b089m2739L656H9902J37847h7812A1831N6302N7007j6076b3216B35428
$$ 418015 -2089 -44828 -41172 89902 227749 -87812 11831 68133 125140 109064 -23216 235428
13024E34761G6572d979A66154a09178A30761J03172O1320n1416a20234B42158
$$ 534761 76572 -4979 166154 -109178 130761 233933 295253 243837 -120234 242158
13013e9500A22765D8878a04674B04703I2641f2426A33803a2375k31151B03756
$$ -59500 122765 48878 -104674 204703 92641 -62426 133803 -12375 -243526 203756
13002A63919n8885D4524L04343F748K64821e230A4838J54713q1080K12396j44739
$$ 163919 105034 44524 348867 6748 271569 -5230 14838 169551 88471 300867 156128
12991A56128L5003a03432A71830a49597C0718J17047P9719a63928e7294D64331
$$ 156128 191131 -103432 171830 -149597 30718 147765 227484 -163928 -57294 464331
12980A31479E6825a8560A23275M1054G9014G664c8789m5882k9699J7151A7131
$$ 131479 56825 -18560 123275 164329 79014 7664 -38789 -84671 -114370 -97219 17131
12968A76214a9025g030m6455m9129j11165j96698A98578J14211a6612q1767j66697
$$ 176214 -19025 -7030 -53485 -102614 -213779 -410477 198578 312789 -16612 -98379 -265076
12957b65076i3952A96895a07141M7777j62552f5252H3745G202a96347A18897L7637
$$ -265076 -93952 196895 -107141 -59364 -221916 -65252 83745 7202 -196347 118897 156534
12946A56534g9692A33411R3336c01539c6795B2137e4944J2307A22299k3904b20888
$$ 156534 -79692 133411 226747 -301539 -36795 22137 -54944 -42637 122299 98395 -220888
12934a49357A31101k0210a32101M4812o9190B41486g490I7567K64093j56842E330
$$ -149357 131101 110891 -132101 -87289 -156479 241486 -7490 97567 361660 204818 5330
12922F7190c12389c463G3926f3396r9239d7985C68205B3611K14944b13128B47126
$$ 67190 -312389 -3463 73926 -63396 -162635 -47985 368205 23611 238555 -213128 247126
12910b62852C22821F1752K94225a85063e5396o520J7026D0597Q9762P2227b56008
$$ -262852 322821 61752 355977 -185063 -55396 -61916 -44890 40597 130359 202586 -256008
12898a41453f2694B11826d7790B69072j20578N4214b25726A11286a00829M7740
$$ -141453 -62694 211826 -47790 269072 148494 202708 -225726 111286 -100829 -53089
12888e3089A53470m9219b2722A0661J21431J22969n8576F5632J27120C7875L4268
$$ -53089 153470 104251 -22722 10661 132092 255061 196485 65632 192752 37875 72143
12877G2143Q5269K4002a02863q2124E0749P3651a35923A48661E4600a738j15187
$$ 72143 157412 181414 -102863 -184987 50749 124400 -135923 148661 54600 -1738 -116925
12866a16925B09953E9477J52804g0240A6556b83859a20501A331Q3988m0438J82226
$$ -116925 209953 59477 212281 -70240 16556 -283859 -120501 1331 85319 44881 227107
12855B27107p3922p4526h8578m6162B19225O2320k7610A12700f0549G5849e3592
$$ 227107 153185 78659 -88578 -134740 219225 281545 253935 112700 -60549 75849 -53592
12843G897K28913a18086A28483L50539d463j03371G0965b0273A26578b79348A82845
$$ 7897 236810 -118086 128483 479022 -4463 -107834 70965 -20273 126578 -279348 182845
12831A01564B0250a12022A32665m716b45083E1454J46832k3840a86773K1928Q0304
$$ 101564 20250 -112022 132665 127949 -245083 51454 198286 174446 -186773 -164845 -84541
12820h4541H6657K20418A25923i0058A92540b16720a0567A65812o7605O1883a21110
$$ -84541 86657 307075 125923 -90058 192540 -216720 -10567 165812 98207 160090 -121110
12808D1621L1054c5603H3788a90094j1919B45793b3722j23911E39162a07825A98140
$$ 41621 72675 -35603 83788 -190094 -202013 245793 -23722 -147633 539162 -107825 198140
12796i7215N467H6527c15689g5076k79441g5933e002F5750a11269d6936A58755
$$ -97215 -91748 86527 -315689 -75076 -354517 -75933 -5002 65750 -111269 -46936 158755
12784b56858B7870f6685B09005L9041f1163b6028E0444a22438d4308B30155E8176
$$ -256858 27870 -66685 209005 248046 -61163 -26028 50444 -122438 -44308 230155 58176
12772b60421A35545h2461a6436p408Q372A66210J82717a67481H6853L5669i2575
$$ -260421 135545 -82461 -16436 -23844 -15472 166210 348927 -167481 86853 122522 -92575
12760B45802H5089J15304e2135a2615j74436A15341m6362a01528C4532J29460
$$ 245802 85089 200393 -52135 -12615 -187051 115341 68979 -101528 34532 163992
12750A63992K0042h9684n79k2863H5202l1126L7064a34759B80078c4332A56112
$$ 163992 184034 -89684 -90263 -113126 85202 54076 91140 -134759 280078 -34332 156112
12738d491H5671R3287G1022b50303N2231e9110H292J268a92804e8977C79176j88201
$$ -4491 85671 178958 71022 -250303 -198072 -59110 8292 9560 -192804 -58977 379176 190975
12726A90975a74643N72O296B7963L5453R8531p0075J11508H9922a03420M2859
$$ 190975 -174643 -174071 -167775 27963 63416 161947 91872 203380 89922 -103420 -60561
12715f0561A01289O4470M4157A9970R9683N8872O7380m6940e1708D04344A23464
$$ -60561 101289 165759 209916 19970 119653 178525 245905 198965 -51708 404344 123464
12703A16105J26154K41285a49067D08106b05595m7595C74582g7113o84A8680B155
$$ 116105 242259 483544 -149067 408106 -205595 -253190 374582 -77113 -77797 18680 2155
12691A26462n4685N2624b9647l1219i519D9548L37276A2541a6617A65817p4998
$$ 126462 71777 124401 -29647 -60866 -9519 49548 386824 12541 -16617 165817 90819
12680I0819M0618K609J2146L391M2512b5355B5476J92014L2587H9321a12305L0267
$$ 90819 131437 134046 146192 149583 192095 -25355 25476 217490 250077 89321 -112305 -82038
12668h2038C39602B3936C649L05311J8543j0651a7548k8581B58768A01765B7223
$$ -82038 339602 23936 3649 308960 327503 316852 -17548 -46129 258768 101765 27223
12656A00175g9738C19072a57431B46614q6872l6507a80636A81028E6241B7900
$$ 100175 -79738 319072 -157431 246614 159742 123235 -180636 181028 56241 27900
12645a03421j15678R8953b5480p3952N577D31290j85499A9969g4579B90112r7984
$$ -103421 -219099 -120146 -25480 -99432 -93855 431290 245791 19969 -74579 290112 192128
12634A92128b91789E4514L90420a661B047N24526E0824J18437J7918J77022E9179
$$ 192128 -291789 54514 444934 -1661 2047 526573 50824 169261 187179 364201 59179
12622A49776L03974k04055o2591A7923c1494B49723a48372G5882a6296B5713d51476
$$ 149776 453750 249695 187104 17923 -31494 249723 -148372 75882 -16296 25713 -451476
12610f0896E6859K05687A24597L8599o4170k1489a51776B28294a64572B78493
$$ -60896 56859 262546 124597 163196 99026 77537 -151776 228294 -164572 278493
12599A87677f4386D71719A66485i761A15139A7829a0840j3944D04606g7232l7445
$$ 187677 -64386 471719 166485 -9761 115139 17829 -10840 -24784 404606 -77232 -114677
12588a14677k8345A21865L4925n0627D3054P3645B6200M2392b60912A7591L49178
$$ -114677 -143022 121865 156790 106163 43054 116699 26200 68592 -260912 17591 366769
12577C66769l1020D6656c19493C6632L64406B0970K3793i207A62397b73194A93650
$$ 366769 335749 46656 -319493 36632 401038 20970 44763 -9207 162397 -273194 193650
12565a80511a3899C5375K83253h9053A50695D4104a5681E2261R4629a00549E1198
$$ -180511 -13899 35375 318628 -89053 150695 44104 -15681 52261 146890 -100549 51198
12553C7856L9025j2481L40074b36150d1854k4069k59833F4947h4359l5324q4947
$$ 37856 76881 64400 404474 -236150 -41854 -65923 -325756 64947 -84359 -119683 -204630
12542b04630B9001J89392E1021J19367O7960a11702h177j21643J2846A7369N4908
$$ -204630 29001 218393 51021 170388 238348 -111702 -8177 -129820 -116974 17369 72277
12531G2277O4636a90527M4487E6124J52597d9717j3348B79862b99268B7453a13816
$$ 72277 136913 -190527 -146040 56124 208721 -49717 -63065 279862 -299268 27453 -113816
12519G9891a7922B22282k7221c66883c9430B11265N9370a54475f3571A67402a11169
$$ 79891 -17922 222282 195061 -366883 -39430 211265 270635 -154475 -63571 167402 -111169
12507C8344b981I1476j6262d0148G2939J3893K32672A12363J32024a15765j9388
$$ 38344 -2981 91476 75214 -40148 72939 86832 319504 112363 244387 -115765 -135153
12496a35153j42492A16475c98234A6943a07174k3961A98866e5267A5077b25779
$$ -135153 -277645 116475 -398234 16943 -107174 -131135 198866 -55267 15077 -225779
12485h8876A55866A7374a55248k918k4530m5834h6593C42660F2794K47727A8417
$$ -88876 155866 17374 -155248 -158166 -182696 -228530 -86593 342660 62794 310521 18417
12473a72987A85246a17977j44294E687M6038L84228a00810A29808b1298f384j97518
$$ -172987 185246 -117977 -262271 5687 51725 435953 -100810 129808 -21298 -6384 -203902
12462b03902A75925b94167h82D5811M5085i925A00785K3971c09670R5784j60785
$$ -203902 175925 -294167 -882 45811 90896 -9925 100785 124756 -309670 -213886 -374671
12451c74671J00161B30311a72842n5918P7888d4559I1989J33692G4087O7316e1697
$$ -374671 -274510 230311 -172842 -228760 -150872 -44559 91989 225681 74087 141403 -51697
12439g3340D0737c40359J17766l3206j48806b01700B94608i4107I3222h2000j0009
$$ -73340 40737 -340359 -222593 -255799 -404605 -201700 294608 -94107 93222 -82000 -92009
12428i2009c6602B98728b29665N9109m6317B40349D9866J04940b22951A78978
$$ -92009 -36602 298728 -229665 -170556 -216873 240349 49866 154806 -222951 178978
12417a47768B00517i2236A41705d44706A6370J04286a35131A94820c00304A65314
$$ -147768 200517 -92236 141705 -444706 16370 120656 -135131 194820 -300304 165314
12406c7362B53435B6216a3082m71471a40304C06844A14492D6642e6478H7545Q8704
$$ -37362 253435 26216 -13082 -484553 -140304 306844 114492 46642 -56478 87545 176249
12395A76249f2542C1333M2985b62061C2598J9449J65769A06148l1633o363k4721
$$ 176249 -62542 31333 74318 -262061 32598 52047 217816 106148 74515 68152 43431
12384D3431c1295r443A52657j5341L3405k4297b9801C45326B7954e3398n024k0147
$$ 43431 -31295 -40738 152657 137316 170721 146424 -29801 345326 27954 -53398 -58422 -78569
12372g8569F0592a18172E9487b625I085R7119c3722C81766b29126J7434C3768
$$ -78569 60592 -118172 59487 -2625 9085 106204 -33722 381766 -229126 -211692 33768
12360B74804a0087B37418c6016G3075N1893O5069e1915D70035j23622O9562D3653
$$ 274804 -10087 237418 -36016 73075 124968 190037 -51915 470035 346413 415975 43653
12348a25897H8074b35223n1804A96429a9324j42534a3222E2370K8624a64085L5458
$$ -125897 88074 -235223 -287027 196429 -19324 -161858 -13222 52370 80994 -164085 -128627
12337a28627o4477H7057b527m9166A17662d98582G9348P665Q3012b2796B17285
$$ -128627 -193104 87057 -2527 -51693 117662 -498582 79348 87013 170025 -22796 217285
12325A71511b58215j2333A17333f8784D7715b45486B66328r3701F9995b55480
$$ 171511 -258215 -270548 117333 -68784 47715 -245486 266328 172627 69995 -255480
12314b4341B91066h5458L1539l3387a0462q1462A82860k6639K02497d1527k02047
$$ -24341 291066 -85458 -53919 -87306 -10462 -91924 182860 156221 358718 -41527 -243574
12303b43574E9521i0299A34507f9133A70095O349G3793Q2185k4934a30299A77773
$$ -243574 59521 -90299 134507 -69133 170095 176444 73793 155978 131044 -130299 177773
12291a98857g7639d122j7679p9349q7143A62281a09868B29894a80458A53173D2453
$$ -198857 -77639 -4122 -21801 -101150 -188293 162281 -109868 229894 -180458 153173 42453
12279F5504i6367C67348A54529J27840m5610p8410g2005A00228O7761J02515A19138
$$ 65504 -96367 367348 154529 282369 236759 158349 -72005 100228 167989 270504 119138
12267e5854A35187M2844G5039M7527C5556M2546J63402b54917o5315J55714A7371
$$ -55854 135187 178031 75039 122566 35556 78102 241504 -254917 -320232 -164518 17371
12255A41171h3084l1089j1167L4466A54673K41976A06693N1529h656A53611j6162
$$ 141171 -83084 -114173 -125340 -90874 154673 396649 106693 158222 -8656 153611 137449
12244A37449J98469l8860a64673A06270h3270B47199r9928F9479a10911C06948
$$ 137449 335918 297058 -164673 106270 -83270 247199 147271 69479 -110911 306948
12233c0949m2385B65453K22551h5774A04377M1862C3125h1697C55224N6741a8295
$$ -30949 -73334 265453 488004 -85774 104377 146239 33125 -81697 355224 411965 -18295
12221C26163M107F7960M88458j0367B40592O9876j23343q0383l9063K28405A6530
$$ 326163 330270 67960 556418 546051 240592 310468 187125 106742 67679 296084 16530
12209A366N7891a98053D83977A90819l6848J12537A04064J42959E2289B040K95730
$$ 1366 59257 -198053 483977 190819 153971 266508 104064 247023 52289 2040 297770
12198B97770q1955a93634D57288A62554J692Q4728J19483q7249A26023n2800a17352
$$ 297770 215815 -193634 457288 162554 164246 248974 368457 281208 126023 73223 -117352
12186C12673d7266B81536n2031B3075O6714O9888a82248A97740o0658D5129K93050
$$ 312673 -47266 281536 229505 23075 89789 159677 -182248 197740 137082 45129 338179
12175C38179N0454A64291F0948J07017N0992j08363b80421P3271G6862J46360
$$ 338179 388633 164291 60948 167965 218957 110594 -280421 -207150 76862 223222
12165B23222a590B0102f03158H150A254J04495K5020A0458O8194Q696E489M7943
$$ 223222 -1590 20102 -603158 8150 1254 105749 130769 10458 78652 87348 5489 53432
12153E3432J00032k5655B5606a54298B41407g5107i657A39902l1194c06553A6865
$$ 53432 153464 127809 25606 -154298 241407 -75107 -9657 139902 108708 -306553 16865
12141g0351j84583i9975M5210B50595P4127Q427c3673d642A98818r6204J19790
$$ -70351 -254934 -99975 -54765 250595 324722 333149 -33673 -4642 198818 102614 222404
12130B22404b24158r8387H7127k8640K8187K7175J11133m8629b5827G6399f6473
$$ 222404 -224158 -322545 87127 58487 86674 113849 224982 176353 -25827 76399 -66473
12118f6833A21847p080R971a5369o1944F6241K88620B1225c3606j28662B36808
$$ -66833 121847 114767 124738 -15369 -77313 66241 354861 21225 -33606 -162268 236808
12106A65862B9817c29455B44518g9621K1897A87171b92608J27021F7685a87613
$$ 165862 29817 -329455 244518 -79621 -57724 187171 -292608 -165587 67685 -187613
12095B02531a87682o411A92993n4622e5996D6937b09874b3660n2390A972a63429
$$ 202531 -187682 -194093 192993 138371 -55996 46937 -209874 -23660 -76050 1972 -163429
12083c8136k06884m5901A13034M4837c66322a01425C85088j26428M58701R64627
$$ -38136 -245020 -290921 113034 157871 -366322 -101425 385088 258660 717361 1681988
12073A681988q20069j77772D5191K93371b1534A84311m2141Q9923G1864a50441
$$ 1681988 861919 684147 45191 338562 -21534 184311 142170 232093 71864 -150441
12062a04708l00289a55584D0775R6782R1461h517l3408k05895H5334J23043a1488
$$ -104708 -404997 -155584 40775 137557 229018 -8517 -41925 -247820 85334 208377 -11488
12050A27287P0200E678J42061M5855d5913A01386B29b0230f331A0253J80121D2011
$$ 127287 197487 5678 147739 193594 -45913 101386 229 -20230 -6331 10253 190374 42011
12037A60620M6848r6654d9472A25416a6266A38787j4904c42170h8111O170F7985
$$ 160620 207468 110814 -49472 125416 -16266 138787 123883 -342170 -88111 -81941 67985
12025c5710A02110k5326b52072H0583h4084A15964a45688B4514J07374a83337
$$ -35710 102110 76784 -252072 80583 -84084 115964 -145688 24514 131888 -183337
12014b45540d7589A35596e39714C26800A5615d1415r2948A2390b4854l1130B15579
$$ -245540 -47589 135596 -539714 326800 15615 -41415 -134363 12390 -24854 -55984 215579
12002b297C04957H4687a58048f4871j83062A82351a56481J8442A31535b84768
$$ -2297 304957 84687 -158048 -64871 -247933 182351 -156481 -138039 131535 -284768
11991A80750c2150G5904K01314A31813E0408a40700B69349G656J6383b01974i0390
$$ 180750 -32150 75904 277218 131813 50408 -140700 269349 7656 24039 -201974 -90390
11979b1317B69606a21593A51586F9866P1071f5203A21498N3732a31437n3266L5849
$$ -21317 269606 -121593 151586 69866 140937 -65203 121498 175230 -131437 -184703 -148854
11968a48854n0543i5534C13847A2863a06958l22515a10274q217J2835A72148C8769
$$ -148854 -199397 -95534 313847 12863 -106958 -429473 -110274 -118491 -105656 172148 38769
11956e3663j27751I160L31849F5174J0445a17410B53489K7436a19466e9121j25420
$$ -53663 -181414 9160 341009 65174 75619 -117410 253489 280925 -119466 -59121 -184541
11945a84541j97195b6463A67061d7191j62189B13051j73G438Q1487a46542D7537
$$ -184541 -381736 -26463 167061 -47191 -209380 213051 212878 7438 88925 -146542 47537
11933D44783c45497g9679E4847b77419a12364A56171d6848B5885a85690f0026
$$ 444783 -345497 -79679 54847 -277419 -112364 156171 -46848 25885 -185690 -60026
11922a58791d0161F5642a17081H8425f7955r4227k1886N2483F3859J96708j17325
$$ -158791 -40161 65642 -117081 88425 -67955 -162182 -184068 -131585 63859 260567 143242
11911A43242J86637E4020a81590j78692a6466q7629H2436h497k32781F5847c6241
$$ 143242 329879 54020 -181590 -360282 -16466 -104095 82436 -8497 -241278 65847 -36241
11899e0580r1719j1402C007c512B41803E9144c49439i1280A83903E320a03959
$$ -50580 -142299 -153701 3007 -3512 241803 59144 -349439 -91280 183903 5320 -103959
11887B33134b44072J06958J3240j10344I6958a43276j50038a30009C1961c09694
$$ 233134 -244072 -137114 -123874 -234218 96958 -143276 -293314 -130009 31961 -309694
11876a53401k86685J10753f3374I4259N9035p3994g749C4447b40526C7150J27014
$$ -153401 -440086 -329333 -63374 94259 153294 79300 -7749 34447 -240526 37150 164164
11865A64164M1956C8051a86252K4165A6942L1899e38004a59562A22057b0199j45297
$$ 164164 206120 38051 -186252 -162087 16942 48841 -538004 -159562 122057 -20199 -165496
11854a65496d7747E0739J38985l1770C6700N0260b4231r4848c5474k31738G5777
$$ -165496 -47747 50739 189724 157954 36700 86960 -24231 -119079 -35474 -267212 75777
11842B8900c24915e0102q770A29882a62770f7826A71109H2933b25481a09481c1648
$$ 28900 -324915 -50102 -58872 129882 -162770 -67826 171109 82933 -225481 -109481 -31648
11830a51645e7020j41253k44151a39527f4206H7229e0114D09942c73324J85177
$$ -151645 -57020 -198273 -442424 -139527 -64206 87229 -50114 409942 -373324 -188147
11820a88147c6547A16725g3576k18198B9112a53961k4545A45961B9429b02616
$$ -188147 -36547 116725 -73576 -291774 29112 -153961 -178506 145961 29429 -202616
11809B76510b4142p5859C18578b02516E9006f320k15444A50852h4187j3458B9893
$$ 276510 -24142 -100001 318578 -202516 59006 -6320 -221764 150852 -84187 -97645 29893
11797b63283B34762e0732j69181d2574k36224A11490b5065B21987h2518G8777
$$ -263283 234762 -50732 -219913 -42574 -278798 111490 -25065 221987 -82518 78777
11786a31430e7239B8052a174p1807j54652C03299A7635g9845K7317A59984B2330
$$ -131430 -57239 28052 -1174 -72981 -227633 303299 17635 -79845 -52528 159984 22330
11774b63888E4488e3987k28249B11590a696n1793A49917b3040A57357J44301A26278
$$ -263888 54488 -53987 -282236 211590 -1696 -53489 149917 -23040 157357 301658 126278
11762B46527b13234N9066B3538d0573k11559q9853D6603B3057b83252M7709g7122
$$ 246527 -213234 -154168 23538 -40573 -252132 -341985 46603 23057 -283252 -235543 -77122
11750a63958e0749n0903A73013i2309A30209j7217b01306C9021a05424H620L50641
$$ -163958 -50749 -101652 173013 -92309 130209 112992 -201306 39021 -105424 8620 359261
11739C59261A21377J1142a53677d0027n8805b1409A8007J28616K12230j11416
$$ 359261 121377 132519 -153677 -40027 -98832 -21409 18007 146623 358853 247437
11729B47437i4304H4560L772K13064k4578a52250j5393O607F6350J7059a92994
$$ 247437 -94304 84560 88332 301396 276818 -152250 -167643 -161036 66350 83409 -192994
11717b0593j44772N0131n6424j28593a09267A18378b04853h1833D03136A12071
$$ -20593 -165365 -115234 -171658 -300251 -109267 118378 -204853 -81833 403136 112071
11706b4134l7159B11797b25554B51683a15056B10611b6831A03377R99P3106i0172
$$ -24134 -61293 211797 -225554 251683 -115056 210611 -26831 103377 104376 177482 -90172
11694F2676a07058b2068I0431J48305a84143A32441b93892B65230g045C0126a10333
$$ 62676 -107058 -22068 90431 238736 -184143 132441 -293892 265230 -7045 30126 -110333
11682f9896n900A1076J96395b10487B16265Q3249I3452L2683B5031K44027a56218
$$ -69896 -75796 11076 207471 -210487 216265 299514 93452 126135 25031 269058 -156218
11670A15731b10634B42995b89820f2669j27243C45380A16911c4270B50674p2534
$$ 115731 -210634 242995 -289820 -62669 -189912 345380 116911 -34270 250674 178140
11660A78140q7484g5147K4410n6658d7318k15998a16077l0192A64727b7678A31724
$$ 178140 90656 -75147 -50737 -107395 -47318 -263316 -116077 -146269 164727 -27678 131724
11648B14071I8365A6961J3172N1107a4547B59240a25505J2352C04400G0621K32165
$$ 214071 98365 16961 30133 81240 -14547 259240 -125505 -113153 304400 70621 302786
11637C02786e0105A09434q764g1080c2078p6004B31827r2971E883b74820C71430
$$ 302786 -50105 109434 100670 -71080 -32078 -108082 231827 138856 5883 -274820 371430
11625G101M12750m2005A43744J38i9266G7731c11592C82998j41321b46277B2630
$$ 7101 419851 377846 143744 143882 -99266 77731 -311592 382998 241677 -246277 22630
11613A9001a63810p136d7047D0349c37225g4789C16531j05150h9839I8852b51508
$$ 19001 -163810 -170946 -47047 40349 -337225 -74789 316531 211381 -89839 98852 -251508
11601g527A30586K43788I6159a05764C27065M5634j38180M2445D2556d05633B64389
$$ -7527 130586 374374 96159 -105764 327065 372699 234519 276964 42556 -405633 264389
11589F9213j6682k0747b04752C85788A11877L9717f3511A7166J10836j2447N5267
$$ 69213 52531 31784 -204752 385788 111877 151594 -63511 17166 128002 115555 170822
11578A70822b47895I1051f8845A62395o6132K7488k5311K17895A17041a81807
$$ 170822 -247895 91051 -68845 162395 96263 123751 98440 316335 117041 -181807
11567a39007A29285M1571c0409H8431c35498E1664J04889D8390h483j72206d5346
$$ -139007 129285 170856 -30409 88431 -335498 51664 156553 48390 -8483 -180689 -45346
11555b6043n0184o3518A50915j348a22616H7669J5879l3533M3796m5447g9434
$$ -26043 -76227 -139745 150915 149567 -122616 87669 103548 70015 113811 68364 -79434
11543A3630a17793B44458G9397A1308J27508Q2001e9503p6638A27818J95943h5771
$$ 13630 -117793 244458 79397 11308 138816 220817 -59503 -136141 127818 323761 -85771
11531B52658j00391a40085C5706J61832C2152R9555j3470N7241d683B50048b22908
$$ 252658 152267 -140085 35706 197538 32152 131707 118237 175478 -4683 250048 -222908
11519d5521B57643O3159q9099p2564R0439K1174p9821p8528a8004B95673A6906
$$ -45521 257643 320802 231703 159139 249578 270752 190931 112403 -18004 295673 16906
11507A21795R2824P3454c0312E49020B02053N3207a6532A5019L7661M3755P2548
$$ 121795 214619 288073 -30312 549020 202053 255260 -16532 15019 52680 96435 168983
11496A68983J16685B5588J59987c6513j77786B30984C1248M10012A46462e1339
$$ 168983 285668 25588 185575 -36513 -214299 230984 31248 441260 146462 -51339
11485G8859J27507p8188i5237C10432r8440I6519a5310D7415J84801e6543k7849
$$ 78859 206366 128178 -95237 310432 211992 96519 -15310 47415 232216 -56543 -84392
11474h4392C71974a92789h029A26772j0912a39848D33a10165A07064a57764A43468
$$ -84392 371974 -192789 -8029 126772 115860 -139848 433 -110165 107064 -157764 143468
11462C89926g075A54211m1623R6329a12235A06000a25665e2230E1572L30093E0367
$$ 389926 -7075 154211 112588 208917 -112235 106000 -125665 -52230 51572 381665 50367
11450F1971a61652j03141H5861k9410a2802j00672B55475c24994E61460a43622
$$ 61971 -161652 -264793 85861 56451 -12802 -113474 255475 -324994 561460 -143622
11439A91689H7226b62705I0590K24136q8970C0581J5594g6713A89362h3567a0405
$$ 191689 87226 -262705 90590 314726 225756 30581 46175 -76713 189362 -83567 -10405
11427c7116K6o6623F2689J9648f2486J4082j55630E5446L9475k2871b18333A45644
$$ -37116 -37090 -103713 62689 82337 -62486 -48404 -204034 55446 94921 72050 -218333 145644
11414a97650B1598q280a1405E6651b1494K931l9486R222j44519A3158K23994J13445
$$ -197650 21598 13318 -11405 56651 -21494 -18563 -58049 -48827 -193346 13158 237152 350597
11402C50597a14364A692N0316Q2685P2606P0860d2201j04488P1500K6611j13883
$$ 350597 -114364 1692 52008 134693 207299 278159 -42201 -146689 -75189 -48578 -162461
11391a62461j61587a8999A00565Q6951c7518g458l5505G7557a07765A77695a0923
$$ -162461 -324048 -18999 100565 187516 -37518 -7458 -42963 77557 -107765 177695 -10923
11379B56512a28105A80834M8385h2938A47955B4446h8443d4059a7464c918B09186
$$ 256512 -128105 180834 229219 -82938 147955 24446 -88443 -44059 -17464 -3918 209186
11367b26033B20065A6766J00977l6336b9618j09581j3899I4573B8171I159K77824
$$ -226033 220065 16766 117743 81407 -29618 -139199 -153098 94573 28171 9159 286983
11356B86983b99374A45648a37713q6570a1206j80148F6895k7385d5076j31866
$$ 286983 -299374 145648 -137713 -224283 -11206 -191354 66895 39510 -45076 -176942
11346a76942A29896D7867L58878b046A27980M42319a37878A80211H6111R51a90732
$$ -176942 129896 47867 406745 -2046 127980 570299 -137878 180211 86111 87062 -190732
11334C06627k3277F5615K17988a35171C73651A40584n6449C3194K40934D290K2919
$$ 306627 283350 65615 283603 -135171 373651 140584 84135 33194 274128 4290 27209
11323B7209j0291Q4945j2092l1522b52547J24838B69814C2034h30C671R7441C3516
$$ 27209 16918 101863 89771 58249 -252547 -127709 269814 32034 -830 3671 101112 33516
11310B41825P0990j41838B8344f0690n8885F9594M33849a3976B28940b80255J07681
$$ 241825 312815 170977 28344 -60690 -119575 69594 503443 -13976 228940 -280255 -172574
11299a72574k1422d3507J9367g643k4018k54264A33259M1596a48328f96j98881
$$ -172574 -193996 -43507 -24140 -7643 -31661 -285925 133259 174855 -148328 -696 -199577
11288a99577e4941A07263b75451C7277c2720A12513d1933j38263B9588M4716a2454
$$ -199577 -54941 107263 -275451 37277 -32720 112513 -41933 -180196 29588 74304 -12454
11276a11611l83136d6753C04799b41954i7305H401c40727B8194a48634f1273j97407
$$ -111611 -494747 -46753 304799 -241954 -97305 8401 -340727 28194 -148634 -61273 -258680
11265b58680E1985J07128m1968a49132q4997H5775j2934e0704J0012B57207a55779
$$ -258680 51985 159113 117145 -149132 -234129 85775 72841 -50704 -40692 257207 -155779
11253b86929h1512D0702a06485B15726a01283L7760A85606b7589j38060a9134
$$ -286929 -81512 40702 -106485 215726 -101283 -63523 185606 -27589 -165649 -19134
11242b29037D4500Q2491e5379k17968e2681k6343k4707b9920A6110b9279k5629
$$ -229037 44500 126991 -55379 -273347 -52681 -79024 -103731 -29920 16110 -29279 -54908
11231e4908H0283k9128K16368I3192i5517I5618m3623g4322k02402N138P8540
$$ -54908 80283 51155 267523 93192 -95517 95618 51995 -74322 -276724 -271586 -193046
11220a93046A19258a06267B28858b53617A76228m3656f931B80341b65929N3200
$$ -193046 119258 -106267 228858 -253617 176228 132572 -6931 280341 -265929 -212729
11210b12729j0127j34026J38077H5655d05967A21488a07211a7444L309A94723
$$ -212729 -222856 -356882 -218805 85655 -405967 121488 -107211 -17444 -14135 194723
11199f5067j84240R3440e9993B06039c03593B6184m171a70334A35130a35997A96678
$$ -65067 -249307 -155867 -59993 206039 -303593 26184 22013 -170334 135130 -135997 196678
11187g363B07394A00552C5094b23442G9836a89487M6686k60556a82811I0604b4209
$$ -7363 207394 100552 35094 -223442 79836 -189487 -142801 -403357 -182811 90604 -24209
11175a94788q3922G7690b13801m4376j0172J13941k8120C63868A53774C3580J9507
$$ -194788 -278710 77690 -213801 -258177 -268349 -154408 -182528 363868 153774 33580 53087
11164E3087M4817D7308b75573a22297I7852A9195a53418I3432J19904i3195k3075
$$ 53087 97904 47308 -275573 -122297 97852 19195 -153418 93432 213336 -93195 -116270
11153a16270N2848p4026j46551A90132d933j73866j10219B51692a86734j44210
$$ -116270 -63422 -137448 -283999 190132 -4933 -178799 -289018 251692 -186734 -330944
11143c30944J12909i5846B8416a80675G1251l0109f6193D9271O0040d1243A40374
$$ -330944 -218035 -95846 28416 -180675 71251 41142 -66193 49271 109311 -41243 140374
11131b13302c0268D53009A00653L4912R6965a87200B4167J34390A6583e9652j71436
$$ -213302 -30268 453009 100653 135565 232530 -187200 24167 158557 16583 -59652 -231088
11120b31088F0048K45821D3998J52762O3946d73796A03142d0849B26789n4396
$$ -231088 60048 305869 43998 196760 260706 -473796 103142 -40849 226789 172393
11110A72393Q5232n0721L6089A0491J72150J03388J19539A5045L90801j60450
$$ 172393 257625 206904 242993 10491 182641 286029 405568 15045 405846 245396
11100B45396F6903a2734E6106O4173K01717J02660j92576b11707B29031g2915
$$ 245396 66903 -12734 56106 120279 321996 424656 232080 -211707 229031 -72915
11089G26715A96869J15802a3446G6716k126M63553j94022L7428F3169N7492J57389
$$ 726715 196869 312671 -13446 76716 74590 538143 344121 381549 63169 120661 278050
11078B78050Q3521J99256k50615A28900R3615o0640K12341j56910K43159Q8348
$$ 278050 361571 560827 310212 128900 222515 161875 374216 217306 460465 548813
11068E48813q5452A84487R4899J5049K79007k60806K27513A48059L17781J13111
$$ 548813 463361 184487 279386 294435 573442 312636 540149 148059 465840 578951
11058E78951M4829J02493k31921J80573J78512l26776L42079k57868r5086J81023
$$ 578951 623780 726273 494352 674925 853437 526661 868740 610872 515786 696809
11048F96809N5622j55710j06246j17647K27051k0391K43233j59319j30541K20412
$$ 696809 752431 596721 490475 372828 599879 579488 822721 663402 532861 753273
11038G53273Q9091j47534L87411l71232J68327r9951q1709j83316K722J22350
$$ 753273 842364 694830 1082241 711009 879336 779385 697676 514360 517082 639432
11028F39432J60140J09791P1515D80218Q2627J22403J0441k60827q5461J98462
$$ 639432 799572 909363 980878 480218 562845 685248 695689 434862 349401 547863
11018E47863J18111l22866M34239l47844K86490k30631j37905K59442J34233j70908
$$ 547863 665974 343108 777347 429503 715993 485362 347457 606899 741132 570224
11008E70224j87698L64867M3622j64060j96968J87598Q5626P2513j29864J65596
$$ 570224 382526 747393 791015 626955 429987 617585 703211 775724 645860 811456
10998H11456l04515n9796R4648K71662r4586M37023n04918j4766Q2352J55246
$$ 811456 506941 447145 541793 813455 718869 1155892 650974 636208 718560 873806
10988H73806k6259J4937J10223n5483J50959J2163k9465M09406o02576J06872
$$ 873806 847547 862484 972707 917224 1068183 1080346 1050881 1460287 857711 964583
10978I64583O50035p8055M83372r4421L82244J98057J65234L7178k55444j36234
$$ 964583 1614618 1536563 2019935 1925514 2307758 2505815 2671049 2708227 2452783 2316549
10968B316549r2860L02604o87635j37566k63647M29160k98407j4881N74096m99114
$$ 2316549 2223689 2526293 1838658 1701092 1437445 1866605 1568198 1553317 2127413 1628299
10958A628299J27502j74204J55196J67977k76811l9299k07077l25520l66650j70576
$$ 1628299 1755801 1581597 1736793 1904770 1627959 1588660 1381583 1056063 689413 518837
10948E18837p3718j32594K48582q7562j38739K06271k41651A33615N3602b50582
$$ 518837 445119 312525 561107 473545 334806 541077 299426 133615 187217 -250582
10937E7740i6388A10467g5233B3581K8859o947M14218A00277b27B09737n4483
$$ 57740 -96388 110467 -75233 23581 52440 45493 459711 100277 -227 209737 155254
10926A55254L2696a7771j00352C66815q0936b1850C9710a0361q1516Q336b1486
$$ 155254 187950 -17771 -118123 366815 285879 -21850 39710 -10361 -91877 -83541 -21486
10914B7453a26596A94999H2669J20359a20279p0124A77082D229a00078b7915l8186
$$ 27453 -126596 194999 82669 203028 -120279 -190403 177082 4229 -100078 -27915 -66101
10903f6101F7431L8474A508d31268M0170A01756D6701P6851a12278B88541a59563
$$ -66101 67431 105905 1508 -431268 -391098 101756 46701 123552 -112278 288541 -159563
10891c2454H7390a38648A35461f4653B01100F511f4875b4953d609l16980g7449
$$ -32454 87390 -138648 135461 -64653 201100 6511 -64875 -24953 -4609 -321589 -77449
10879I7537b35922j75456h963F427J91737a73806j42016a20168L4432I1758a20443
$$ 97537 -235922 -411378 -8963 6427 198164 -173806 -315822 -120168 -85736 91758 -120443
10867i2399a1053B2744P7896M6666b16791J03539A61410e2357J9775j35386d8600
$$ -92399 -11053 22744 100640 147306 -216791 -113252 161410 -52357 -32582 -167968 -48600
10855a16583B2918b41105H1581c92044B7105d9926B59266a16018q0190A51300
$$ -116583 22918 -241105 81581 -392044 27105 -49926 259266 -116018 -196208 151300
10844a7735k75830J21943j83448a21596n28B05775H8675a43291B1990J51891E4021
$$ -17735 -293565 -171622 -355070 -121596 -122124 205775 88675 -143291 21990 173881 54021
10832A83814b79766K8358d7766l2352A11095a70330e0721A73832I15M5237d5167
$$ 183814 -279766 -251408 -47766 -80118 111095 -170330 -50721 173832 915 46152 -45167
10820a87276A4917J82183H9724b23569M5628I1759c8682j10594A64054D3012J54449
$$ -187276 14917 197100 89724 -223569 -177941 91759 -38682 -149276 164054 43012 197461
10809A97461a89424A14339c67123f2499j36318h2282B61330K24356a88693q3794
$$ 197461 -189424 114339 -367123 -62499 -198817 -82282 261330 485686 -188693 -272487
10799b72487l995A40694K9761K8047o4949E7887f4798A64467c74256J46015Q0457
$$ -272487 -276482 140694 170455 198502 133553 57887 -64798 164467 -374256 -228241 -147784
10788a47784j13468H4073R9937a15138f554j93646m7931J22844K0947l895B2431
$$ -147784 -261252 84073 184010 -115138 -6554 -200200 -248131 -125287 -104340 -108235 22431
10776C26235b63967a12544k21281c0111A03430k1459A1772a04585j36245B7589
$$ 326235 -263967 -112544 -333825 -30111 103430 81971 11772 -104585 -240830 27589
10765b69125b469B13494h4347q8385F0808a41642J1059C4413b7949B1007R9570
$$ -269125 -2469 213494 -84347 -172732 60808 -141642 -130583 34413 -27949 21007 120577
10754A20577A8534K57259M5870a44302A62935D220i1532k25110J09326B71835
$$ 120577 18534 275793 321663 -144302 162935 4220 -91532 -316642 -207316 271835
10743a89237i1325A92371f8799j72911D01661b93002B7073P1701C589a28691R51
$$ -189237 -91325 192371 -68799 -241710 401661 -293002 27073 98774 3589 -128691 -127740
10732a27740C57933b68290j01615C4360J74345d5208m2286k68127D0565J09321
$$ -127740 357933 -268290 -369905 34360 208705 -45208 -87494 -355621 40565 149886
10722A49886A0330b37975B52830a55090d9364K3377C64887e4065H2424a10725
$$ 149886 10330 -237975 252830 -155090 -49364 -25987 364887 -54065 82424 -110725
10711b26104B55375b14422B07784d1064j76771b7108l21578A37292a7814C85651
$$ -226104 255375 -214422 207784 -41064 -217835 -27108 -348686 137292 -17814 385651
10700a39301B2206J61231b2102B0203J6991M3929f0942H4113j0805b22537A62206
$$ -139301 22206 183437 -22102 20203 37194 81123 -60942 84113 73308 -222537 162206
10688g5458D6269b29194B73511d37944J53044G1046J17796a99170A26260c4718
$$ -75458 46269 -229194 273511 -437944 -284900 71046 188842 -199170 126260 -34718
10677a98746R1162j1289A86920d74527F0079J21730d5068k0423B91240H3945c4961
$$ -198746 -107584 -118873 186920 -474527 60079 181809 -45068 -65491 291240 83945 -34961
10665d0183o8281j29612h0275j40040N8079P486n9132c6725C34911d874l6189
$$ -40183 -108464 -238076 -80275 -220315 -162236 -154750 -213882 -36725 334911 -4874 -41063
10654d1063B58717c86096b3801j01774e4443A26666b1549j29612q5215J13918
$$ -41063 258717 -386096 -23801 -125575 -54443 126666 -21549 -151161 -236376 -122458
10644a22458j4291p0578I8807N794a36682K6498M9234l2083C16169j36393a84836
$$ -122458 -136749 -207327 98807 104601 -136682 -110184 -60950 -93033 316169 179776 -184836
10632a98916I4375a79207E5396b21577B82172b8624k04783e4901k83626A540h6503
$$ -198916 94375 -179207 55396 -221577 282172 -28624 -233407 -54901 -338527 1540 -86503
10620b71160a17927A10873b3707A92194b05906c5357j71892B71306a08925o4152
$$ -271160 -117927 110873 -23707 192194 -205906 -35357 -207249 271306 -108925 -173077
10610a73077N4927I2763b13114A75633b58903A36014a69774k22970A38820d2845
$$ -173077 -118150 92763 -213114 175633 -258903 136014 -169774 -392744 138820 -42845
10599G0962b5202C6714b4223C7044a98436b0349j51420H515a34664J5859c2729
$$ 70962 -25202 36714 -24223 37044 -198436 -20349 -171769 8515 -134664 -118805 -32729
10587b75457C1561N3347J11510k7233a27246N8535C41406j60424E8037a211k86215
$$ -275457 31561 84908 196418 169185 -127246 -68711 341406 180982 58037 -1211 -287426
10576b87426a2092k58906D801J00880A4013K97941D9692b38097B18203a20537
$$ -287426 -12092 -270998 4801 105681 14013 311954 49692 -238097 218203 -120537
10565a20147j21742E8062A0769K01649E5741J2295a58195A93398O2145E7168b03598
$$ -120147 -241889 58062 10769 212418 55741 68036 -158195 193398 255543 57168 -203598
10553a17183I9898b54107a3343j28835k3155A36497O8663e8474C51916A27405
$$ -117183 99898 -254107 -13343 -142178 -165333 136497 205160 -58474 351916 127405
10542I4634b14579B06790g2482j12863q3143B8539J61920p4771b43407o6078A42952
$$ 94634 -214579 206790 -72482 -185345 -268488 28539 190459 115688 -243407 -309485 142952
10530a77613C13486b2301b476k25961A83524c11089J21727D9296a39431L4053
$$ -177613 313486 -22301 -2476 -228437 183524 -311089 -189362 49296 -139431 -105378
10520a05378F9923a39419j8743e1812l2027M1522C705J29228j0706c29556J13027
$$ -105378 69923 -139419 -158162 -51812 -83839 -42317 3705 132933 122227 -329556 -216529
10509b16529e1973A71404O8316b43364A36806d2509E1797J15037G4813d35734
$$ -216529 -51973 171404 239720 -243364 136806 -42509 51797 166834 74813 -435734
10498E8537f5731j24126A6251a1230k92814N6488a0564k25593k45757a06292A51333
$$ 58537 -65731 -189857 16251 -11230 -304044 -247556 -10564 -236157 -481914 -106292 151333
10486c67849a70069e9586A85239M7784L72158j45572n1809l0607A04418N32921
$$ -367849 -170069 -59586 185239 233023 605181 459609 407800 377193 104418 637339
10476F37339b25739B25434E2576K5478K9747k9223K7656h429j78555G6780k8059
$$ 637339 -225739 225434 52576 78054 107801 78578 106234 -8429 -186984 76780 48721
10465D8721b12765e108j11919H7250J31386b3362B67917a15331e4542j04389A2892
$$ 48721 -212765 -5108 -117027 87250 218636 -23362 267917 -115331 -54542 -158931 12892
10453b5918k5207G8116b11986c4040o7284j47621L4358h4856k4644N0863m0466
$$ -25918 -51125 78116 -211986 -34040 -101324 -248945 -214587 -84856 -109500 -58637 -99103
10442i9103B08464a70800A21826a9353k9286l25295C01850g0164n9186d3784A64468
$$ -99103 208464 -170800 121826 -19353 -48639 -373934 301850 -70164 -129350 -43784 164468
10430A78991c96826e7694K3444n2724j45395B8299d4742n3881j13478C2626a49198
$$ 178991 -396826 -57694 -34250 -86974 -232369 28299 -44742 -98623 -212101 32626 -149198
10418C0811J52381G8611d6028j65394J2311h1187B26961j08193E1542J71434r0665
$$ 30811 183192 78611 -46028 -211422 -199111 -81187 226961 118768 51542 222976 132311
10407A32311a76648H4774J82549c31998d0346C676i7487n4244J7590K3699A06893
$$ 132311 -176648 84774 267323 -331998 -40346 3676 -97487 -151731 -134141 -110442 106893
10395b40307f925I5268J29411a60145B49655j13979J51353a76929B22136G474
$$ -240307 -6925 95268 224679 -160145 249655 135676 287029 -176929 222136 7474
10384D79496A32774a00175A75290A8834R069K27441o4453J8076Q5838L3987j31468
$$ 479496 132774 -100175 175290 18834 27903 255344 190891 208967 294805 328792 197324
10373A97324J36268j40033I1011J80080d441A51278J59096J73296L7661j59263
$$ 197324 333592 193559 91011 271091 -4441 151278 310374 483670 521331 362068
10363C62068C4789L23994j67786m8094J63102A9834K69541P2406A06243J02705
$$ 362068 34789 358783 190997 142903 306005 19834 289375 361781 106243 208948
10353B08948J4660a44484D00335J98153j21770K23758A41989C3576M90233o9234
$$ 208948 223608 -144484 400335 598488 476718 700476 141989 33576 523809 454575
10343D54575J35627j65110F1795K17861H5211K8994J12536Q759n5131J58208I4265
$$ 454575 590202 425092 61795 279656 85211 114205 226741 235500 180369 338577 94265
10331I1105f2401A20888c4458A74512D5799K77923h5216A08710c624E8973Q9700
$$ 91105 -62401 120888 -34458 174512 45799 323722 -85216 108710 -3624 58973 148673
10320A48673L27140a93703A62680l6693a20867q311A65132o9890C2710K60765
$$ 148673 475813 -193703 162680 125987 -120867 -129178 165132 95242 32710 293475
10310B93475A24838h3517n096C39511C006K83634A8579a77971j78524E6149i6440
$$ 293475 124838 -83517 -88613 339511 3006 286640 18579 -177971 -356495 56149 -96440
10298A07227i4445m2919d6845a1800m2244B07947i7719B08828l5518G3582b01568
$$ 107227 -94445 -137364 -46845 -11800 -54044 207947 -97719 208828 173310 73582 -201568
10286a16916j32527A05403a13235m6975A55990o2542f9383g404A01114b05088
$$ -116916 -249443 105403 -113235 -160210 155990 93448 -69383 -7404 101114 -205088
10275b60735F9602O2412a81404P9938J8792A96101F0887M1175D0697J30774E8041
$$ -260735 69602 132014 -181404 -101466 -82674 196101 60887 102062 40697 171471 58041
10263g6793A57294L68068B48340p0047K28724C1487L78490I6297l7717a58878
$$ -76793 157294 525362 248340 178293 407017 31487 409977 96297 58580 -158878
10252D2945b8115D3226J31385d5384j056B5923c94900J35259C9160a40095A23540
$$ 42945 -28115 43226 174611 -45384 -46440 25923 -394900 -259641 39160 -140095 123540
10240D4364a30436k57585E2011i8320A27232a55777l0122B51951f0713C0706L14680
$$ 44364 -130436 -388021 52011 -98320 127232 -155777 -185899 251951 -60713 30706 345386
10229C45386b80202J05006A04804a37336m4819A06703K41199c4293k25586f6864
$$ 345386 -280202 -175196 104804 -137336 -182155 106703 347902 -34293 -259879 -66864
10218a00803b3241B36658e16374C4832O5843c22347h7919o5163E9137b09186G3455
$$ -100803 -23241 236658 -516374 34832 100675 -322347 -87919 -153082 59137 -209186 73455
10206b84584A90920a09301G6298f9482G7926c14689B92557b40449N3925K8633
$$ -284584 190920 -109301 76298 -69482 77926 -314689 292557 -240449 -186524 -157891
10196a57891j340N8573F0903a4039m10908J62538a08349I9779a78549N366c6914
$$ -157891 -159231 -100658 60903 -14039 -424947 -262409 -108349 99779 -178549 -173183 -36914
10184a5866C5998d8037j04444e6840k24215a36863L5043j04066b4659q6321A33853
$$ -15866 35998 -48037 -152481 -56840 -281055 -136863 -101820 -205886 -24659 -110980 133853
10172a86642B00132R4051J052A37340b26517I8022c9425k46983h7289n3187b8678
$$ -186642 200132 294183 295235 137340 -226517 98022 -39425 -286408 -87289 -140476 -28678
10160b05189R6928H3844b94184A25154L1637c7824A90479F7231L253a37054b1556
$$ -205189 -108261 83844 -294184 125154 156791 -37824 190479 67231 70484 -137054 -21556
10148c08143i4760p5259k29242a2324A38904c5950k60346h6425E9912b15040B15333
$$ -308143 -94760 -170019 -399261 -12324 138904 -35950 -296296 -86425 59912 -215040 215333
10136a43540k96363B1435M0063b63686A571f0010B2423J28443k8530g9188E3211
$$ -143540 -439903 21435 61498 -263686 1571 -60010 22423 150866 122336 -79188 53211
10124d27647J31192a3126H2173b1392k78380A05736n0586L30325D0074K12005
$$ -427647 -296455 -13126 82173 -21392 -299772 105736 55150 385475 40074 252079
10114B52079m4684b81402A86193n2451e7683A04713Q1234i9723d9337k26533K6307
$$ 252079 207395 -281402 186193 133742 -57683 104713 185947 -99723 -49337 -275870 -249563
10103b49563I4912a39483a4114H4084Q5872j5072D1853b7821C4454I294e6464
$$ -249563 94912 -139483 -14114 84084 169956 154884 41853 -27821 34454 9294 -56464
10091A61933d0758j98930n5417A3695J37000f5927q2549D9310d9730k06740k7170
$$ 161933 -40758 -239688 -295105 13695 150695 -65927 -148476 49310 -49730 -256470 -283640
10080b83640j10192a13782A15092b60474C7602d1115j16685j53114B17640I0881
$$ -283640 -393832 -113782 115092 -260474 37602 -41115 -157800 -310914 217640 90881
10069D1639J08078c59825A90281a57345b9950A88830b7143B02542a48621j59455
$$ 41639 149717 -359825 190281 -157345 -29950 188830 -27143 202542 -148621 -308076
10059c08076D1554a59453G1461c52519J15978b8267m6805p7320C945b10941L8347
$$ -308076 41554 -159453 71461 -352519 -236541 -28267 -75072 -152392 3945 -210941 -172594
10048a72594J8619j53012b8118a0816B13312a72467c0916l92479K3311I0945j3359
$$ -172594 -153975 -306987 -28118 -10816 213312 -172467 -30916 -423395 -400084 90945 77586
10037G7586d6868p1827G7879j7992b59077a15634I4576p792a13067l68218a55158
$$ 77586 -46868 -118695 77879 59887 -259077 -115634 94576 86784 -113067 -481285 -155158
10025a14472A17411b0493A20463b2038m156k12338C2643N3075N7952a30618c137
$$ -114472 117411 -20493 120463 -22038 -26194 -238532 32643 85718 143670 -130618 -3137
10013a03316C6024H858M52961h6154A75230m4207A6971L6766K6532d23738J74630
$$ -103316 36024 8858 461819 -86154 175230 131023 16971 53737 80269 -423738 -249108
10002b49108R0064k20945e8508C065J080b20162B6929f2618C95114b21143f0471
$$ -249108 -159044 -379989 -58508 3065 4145 -220162 26929 -62618 395114 -221143 -60471
9990a19034A68405a50032A0145d76541a77701C8834g949j08432j19667a04148
$$ -119034 168405 -150032 10145 -476541 -177701 38834 -7949 -116381 -236048 -104148
9979a87675m6924j88664A01181K6140c29373f4595H6048i0500k6961C3012c32107
$$ -187675 -234599 -423263 101181 127321 -329373 -64595 86048 -90500 -117461 33012 -332107
9967E8750j872a93664R4050E51a0421C18241B6343b24054M8928q4893C9095b11998
$$ 58750 56878 -193664 -99614 551 -10421 318241 26343 -224054 -175126 -260019 39095 -211998
9954a44978A23872l3711K77081A49517a41706J5972A91372A846c9578q5669J1809
$$ -144978 123872 90161 367242 149517 -141706 -125734 191372 1846 -39578 -125247 -113438
9943a13438j59649O0055E064b3314l31762D3742b20392d9205F5566g6888B71128
$$ -113438 -273087 -213032 5064 -23314 -355076 43742 -220392 -49205 65566 -76888 271128
9931e7991b0177j05023j16927a00929k4362A411c0849B44382a21320n2403N8782
$$ -57991 -20177 -125200 -242127 -100929 -125291 1411 -30849 244382 -121320 -173723 -114941
9920a14941k57335i6468O3l872c2998k30927g7103k27119J04639A14665P4832
$$ -114941 -372276 -96468 -96405 -100277 -32998 -263925 -77103 -304222 -199583 114665 189497
9909A89497q5967g2621n4969j15666L0844A74001Q6660A07869h1827C048b01759
$$ 189497 103530 -72621 -127590 -243256 -212412 174001 260661 107869 -81827 3048 -201759
9897B02734J7364a88588e6938l4083A82209B299K03280l6518a28547k09784H021
$$ 202734 220098 -188588 -56938 -91021 182209 2299 205579 169061 -128547 -338331 8021
9885a02370k77833a34243B74481h5774b6873G6932J82133d8320q1943k6904E2236
$$ -102370 -380203 -134243 274481 -85774 -26873 76932 259065 -48320 -130263 -157167 52236
9873c0483E0618k0564h4357L9698k30263D3588a15762c8855n07788J75732J56283
$$ -30483 50618 30054 -84357 -44659 -274922 43588 -115762 -38855 -546643 -370911 -214628
9862b14628f5316A9970g2414c5925j6094J6015C1307b7272A9460M6872K827a81404
$$ -214628 -65316 19970 -72414 -35925 -52019 -36004 31307 -27272 19460 66332 69159 -181404
9849a25567M956j50189a07798I6131g9662L2540q5225B98540I2399d5741q4703
$$ -125567 -120611 -270800 -107798 96131 -79662 -47122 -132347 298540 92399 -45741 -130444
9838a30444a3870k35153M0626H697a05778k97422a40807d6308k78327h3007m2264
$$ -130444 -13870 -249023 -208397 8697 -105778 -403200 -140807 -46308 -324635 -83007 -125271
9827a25271A40021D6460a22679B41973e1899B70924a49642j5996j0119N6346k61292
$$ -125271 140021 46460 -122679 241973 -51899 270924 -149642 -165638 -175757 -119411 -380703
9816c80703A67016J41173G6948k5042J1108a24336j30225A13801b49195J22779
$$ -380703 167016 308189 76948 51906 63014 -124336 -254561 113801 -249195 -126416
9806a26416k4629q388k59159A26929n8129a08301g571A00236a6009I5343e9040
$$ -126416 -151045 -159433 -418592 126929 68800 -108301 -7571 100236 -16009 95343 -59040
9794b8265B97759c1945A10898O0755k9121A7763a03238K5972k17124O8286g3306
$$ -28265 297759 -31945 110898 171653 142532 17763 -103238 -77266 -294390 -226104 -73306
9782H7383c12456J9354a07287j32168A850a8012p5334M3146k53053i6298j05096
$$ 87383 -312456 -293102 -107287 -239455 1850 -18012 -93346 -50200 -303253 -96298 -201394
9771b01394g9845H5078N9846c40388A1913c11268d8846J1735l48203J49022I0089
$$ -201394 -79845 85078 144924 -340388 11913 -311268 -48846 -37111 -385314 -236292 90089
9759i4896A61866a64698B03901b52444k7309m3017d4350F9967e8809A43386m8146
$$ -94896 161866 -164698 203901 -252444 -279753 -322770 -44350 69967 -58809 143386 95240
9748I5240i7611D9430d16790D25252a23238b643A123a78473k23961f14j68194
$$ 95240 -97611 49430 -416790 425252 -123238 -2643 1123 -178473 -402434 -614 -168808
9737a68808f6915G5639b02073I1377c86333I9898C4389A4830J66163h4361K7437
$$ -168808 -66915 75639 -202073 91377 -386333 99898 34389 14830 180993 -84361 -56924
9726e6924F6105a80359A67744A7484L31072h2719j26142B8287a01945J0587i142
$$ -56924 66105 -180359 167744 17484 348556 -82719 -208861 28287 -101945 -91358 -9142
9714a10782a6877q2746m9474F23J07350a26631j22959j71753D4554b72717e1136
$$ -110782 -16877 -99623 -149097 623 107973 -126631 -249590 -421343 44554 -272717 -51136
9702a00656J2000b8514A13517g3396j06988A38386a36439A67419c95478a43196
$$ -100656 -88656 -28514 113517 -73396 -180384 138386 -136439 167419 -395478 -143196
9691a0400B54748A21892e1096A84765G5056b43568d4757k12980a05323c3491C8722
$$ -10400 254748 121892 -51096 184765 75056 -243568 -44757 -257737 -105323 -33491 38722
9679A12856c7492q4490H6992a0237j53893c881k28896J01335j08743C1067j393
$$ 112856 -37492 -121982 86992 -10237 -164130 -3881 -232777 -131442 -240185 31067 29674
9668B9674b26643A39406d9505l2136A12222C5609a36316M1982b1606k38758A70578
$$ 29674 -226643 139406 -49505 -81641 112222 35609 -136316 -94334 -21606 -260364 170578
9656a42601l148j26372A5639Q468f1583l66287D9000a20775A17004i7590l14105
$$ -142601 -145749 -272121 15639 24107 -61583 -427870 49000 -120775 117004 -97590 -411695
9645d11695B34382a85388M4537M7547j02257j36388e7659g136A66936a38055b4089
$$ -411695 234382 -185388 -140851 -93304 -195561 -331949 -57659 -7136 166936 -138055 -24089
9633b45619J17076E3155J60897O0046b6831l53453D993Q4374O3575R6332a26934
$$ -245619 -128543 53155 214052 274098 -26831 -380284 4993 89367 152942 249274 -126934
9621f4646j99094a0749p697j32597l5116P8531p6164A144b45079a7169F087K0422
$$ -64646 -263740 -10749 -18446 -151043 -186159 -107628 -183792 1144 -245079 -17169 6087 26509
9609B6509a68886h0058r1023O9701j20223f8077A5636b3937N552H9503c84826
$$ 26509 -168886 -80058 -171081 -101380 -221603 -68077 15636 -23937 -18385 89503 -384826
9597A31775c0373j19958B63060d5665k87858D3131b62092e0730k33995d8270A07683
$$ 131775 -30373 -150331 263060 -45665 -333523 43131 -262092 -50730 -284725 -48270 107683
9585a82656j5502h4657J841c2506m1352l04094J29368O0913A89877g8656B5001
$$ -182656 -198158 -84657 -82816 -32506 -73858 -377952 -248584 -187671 189877 -78656 25001
9573b34443A86106D2993e1466j76939Kd4805l61824i4849k6488B96286a62431
$$ -234443 186106 42993 -51466 -228405 -228403 -44805 -406629 -94849 -121337 296286 -162431
9561A68592a60442A08466k8364b81186j9834A80077a99992B61690g7919j39225
$$ 168592 -160442 108466 80102 -281186 -301020 180077 -199992 261690 -77919 -217144
9551b17144O0758O5125j53418J10207r8202C452a38206F5384c77209A11057b01782
$$ -217144 -156386 -91261 -244679 -134472 -232674 3452 -138206 65384 -377209 111057 -201782
9539c69840a46569f8665j77111h2653J640F1729c08451h8069j68007c1308k47785
$$ -369840 -146569 -68665 -245776 -82653 -81013 61729 -308451 -88069 -256076 -31308 -279093
9528b79093P4798L2141i316A73486L7494b56546j47278A28096a77398e0682k7120
$$ -279093 -204295 -172154 -9316 173486 210980 -256546 -403824 128096 -177398 -50682 -77802
9517g7802A71728f4926B16565K7296b05114A26620D6432J00282B8288c06317h2564
$$ -77802 171728 -64926 216565 243861 -205114 126620 46432 146714 28288 -306317 -82564
9505D9517K11001I0894a23316j55230J6596A2818a28595A00787R1705i6260A3658
$$ 49517 260518 90894 -123316 -278546 -261950 12818 -128595 100787 192492 -96260 13658
9493d16223A94414a8165k6869C09027G5209a67174A63415d3067G2702b8168K9
$$ -416223 194414 -18165 -45034 309027 75209 -167174 163415 -43067 72702 -28168 -28139
9482b8139p1593j6032l70705a76517f1107j57037k6616Q3639n2110A07591a97314
$$ -28139 -99732 -115764 -486469 -176517 -61107 -218144 -244760 -161121 -213231 107591 -197314
9470C26795A35902a45747I3192B8364a6447l2438G6705J73364m8238a61810j56827
$$ 326795 135902 -145747 93192 28364 -16447 -48885 76705 250069 201831 -161810 -318637
9459c18637j05360a5426A59434b56887N5472M9798f569l42726a66684B15399r2557
$$ -318637 -423997 -15426 159434 -256887 -201415 -151617 -6569 -349295 -166684 215399 122842
9448A22842a5752j74721K353c6723o3258j06529R9320A48085a28756o1601b5052
$$ 122842 -15752 -190473 -188120 -36723 -99981 -206510 -107190 148085 -128756 -190357 -25052
9436A40313E9249J58118g4042k27831d0297j1786o1988N0386a3599j87703Q6933
$$ 140313 59249 217367 -74042 -301873 -40297 -52083 -114071 -63685 -13599 -201302 -114369
9425a14369A24567c20849a19715n0336E4974j3338L56740E905P4138O812l1567
$$ -114369 124567 -320849 -119715 -170051 54974 41636 398376 5905 80043 86855 55288
9414E5288a84793B4758K00601c55711e6813o9269A64345G8572K4292a19083c6388
$$ 55288 -184793 24758 225359 -355711 -56813 -126082 164345 78572 102864 -119083 -36388
9402e7809r8937E6020P6871q398c74483a46873A561Q2615b55064J01040A61208
$$ -57809 -156746 56020 132891 124493 -374483 -146873 1561 84176 -255064 -154024 161208
9390b90690A65927E6414b5552l78787a39577e280E15227c60195g1118C8944J3023
$$ -290690 165927 56414 -25552 -404339 -139577 -5280 515227 -360195 -71118 38944 51967
9379E1967J67670a90304M7002A67179E0287a78381e418m0683j49369A05910a25491
$$ 51967 219637 -190304 -143302 167179 50287 -178381 -5418 -46101 -195470 105910 -125491
9367a6183m7744q5358O5293Q764o5872E15435a00296j36467a17706B60450a03854
$$ -16183 -63927 -149285 -83992 -75228 -141100 515435 -100296 -236763 -117706 260450 -103854
9355b05186k06749M8245J30216F7927a04615k93317I5301b19282f4342l4451H0277
$$ -205186 -411935 -363690 -233474 67927 -104615 -397932 95301 -219282 -64342 -98793 80277
9343a8965B20566b1358e047A40380b02757n9138B7874a58192F0L7718K61295A40803
$$ -18965 220566 -21358 -5047 140380 -202757 -261895 27874 -158192 60 37778 299073 140803
9330A08492a71393D3223a08163a2868A83759E5336a12439E3855j8103J07946c46049
$$ 108492 -171393 43223 -108163 -12868 183759 55336 -112439 53855 35752 143698 -346049
9318a12014I7038b56472j62546b1085B31442G9932a39066C958K4098K50826b51210
$$ -112014 97038 -256472 -419018 -21085 231442 79932 -139066 3958 28056 278882 -251210
9306a11616j6053A67789b18531h6133H9989c62393e996j86313p4826a00398k5451
$$ -111616 -127669 167789 -218531 -86133 89989 -362393 -5996 -192309 -267135 -100398 -125849
9295a25849C09837a23392A78035a45436p7953A73822L8885i8917K5863I2215K42666
$$ -125849 309837 -123392 178035 -145436 -223389 173822 212707 -98917 -73054 92215 334881
9284C34881E5059B4429L2896a09665B3639D565d02491A03811a56601e3306l30604
$$ 334881 55059 24429 57325 -109665 23639 4565 -402491 103811 -156601 -53306 -383910
9273c83910A31884l0731a59982C26999a83641j20232H053d09664b1898m04080
$$ -383910 131884 101153 -159982 326999 -183641 -303873 8053 -409664 -21898 -425978
9263d25978c5792M442j08388C9350a71710B05482O8270C9701N4269a13800B6583
$$ -425978 -35792 -31350 -139738 39350 -171710 205482 273752 39701 93970 -113800 26583
9251d89754b05332N9418A45945j101c6989j59974B1145P3693b15063A87595d3531
$$ -489754 -205332 -145914 145945 144844 -36989 -196963 21145 94838 -215063 187595 -43531
9239B09433k2444a01216r9562K7059K7860k69777D4000a08677L0938j67100B64859
$$ 209433 186989 -101216 -200778 -173719 -145859 -415636 44000 -108677 -77739 -244839 264859
9227b43508e8143p29k09446A80213b12678Q4412p798j20865k7539A20335K7610
$$ -243508 -58143 -58872 -268318 180213 -212678 -128266 -136064 -256929 -284468 120335 147945
9216A47945k788c621q9697A03428A3828J83839g4734B15571C2220J26991A0221
$$ 147945 145157 -3621 -93318 103428 13828 197667 -74734 215571 32220 159211 10221
9204a43551A1261a68092B2749b0285j17613B47470d9607l11038A47481j0532h9874
$$ -143551 11261 -168092 22749 -20285 -137898 247470 -49607 -360645 147481 136949 -89874
9192a91370g5361N558k36058B41271c71703A40012L1688a0505b656A09310J67418
$$ -191370 -75361 -69803 -305861 241271 -371703 140012 171700 -10505 -2656 109310 276728
9181B76728a24550C46862A68612a32667H2641b97024O2927J13721G3507a98493
$$ 276728 -124550 346862 168612 -132667 82641 -297024 -234097 -120376 73507 -198493
9170C6187a79417D1659R1755b69670J1721n2069O2543A70105C9347b0894n53009
$$ 36187 -179417 41659 133414 -269670 -257949 -310018 -247475 170105 39347 -20894 -573903
9159e73903a46041F0847A6565A988b22018A85804D3741h6479n853n2946c555j00801
$$ -573903 -146041 60847 16565 1988 -222018 185804 43741 -86479 -92332 -145278 -3555 -104356
9147a04356A57762b2916k79517i6042i971p9842A16470j01D66a62278k6093Q4171
$$ -104356 157762 -22916 -302433 -96042 -9971 -89813 116470 116369 466 -162278 -188371 -104200
9135a04200d1986j86972D0522b26540F8938a87012q6142I3265J43800f5098C13377
$$ -104200 -41986 -228958 40522 -226540 68938 -187012 -273154 93265 237065 -65098 313377
9123A55546a8667j95400J4880h9433j80974H0312c38073C4314Q574P7233g2457
$$ 155546 -18667 -214067 -199187 -89433 -270407 80312 -338073 34314 42888 120121 -72457
9111C51265i6002i988l04630a04291r75m5722c9906A95178J75339b56150L7312
$$ 351265 -96002 -9988 -314618 -104291 -105266 -150988 -39906 195178 370517 -256150 -218838
9100b18838B4138b40988A39308J33472F4613c8337G2418K2707e4266l83119a77962
$$ -218838 24138 -240988 139308 272780 64613 -38337 72418 95125 -54266 -437385 -177962
9088a29383J1659j44210f3955D7004a97884P2780j91863a20694j98962F7445J20010
$$ -129383 -117724 -261934 -63955 47004 -197884 -125104 -316967 -120694 -319656 67445 187455
9077A87455a10957C47604b29995H2879R614d8420l6497A92743K1296d05866i0761
$$ 187455 -110957 347604 -229995 82879 92493 -48420 -84917 192743 214039 -405866 -90761
9065a31057j52660j6165G6561a18139r9837e5704k90993E5058b12691i0113q1386
$$ -131057 -283717 -299882 76561 -118139 -217976 -55704 -346697 55058 -212691 -90113 -171499
9054a71499r1348j60447H2652b42383g0874a7701G7155B1646e9553B08119o0943
$$ -171499 -262847 -423294 82652 -242383 -70874 -17701 77155 21646 -59553 208119 147176
9043A47176c53958A84266a43190C45060j62708k0229b7995E2566L1403L2149J83722
$$ 147176 -353958 184266 -143190 345060 182352 162123 -27995 52566 83969 116118 299840
9032B99840a61316c0819D5134c12639g4270m2695A2444J75395D9703o907b11390
$$ 299840 -161316 -30819 45134 -312639 -74270 -116965 12444 187839 49703 42796 -211390
9020b05817A82839a22505j16581E9218c30656C2001a86857m634G9753c83190g246
$$ -205817 182839 -122505 -239086 59218 -330656 32001 -186857 -191491 79753 -383190 -7246
9008a87259B17807E2979a60910N6643k01444A43872a84631J1532G0698a04137
$$ -187259 217807 52979 -160910 -104267 -305711 143872 -184631 -173099 70698 -104137
8997c20342L0572F0512b55419J05233D9210f7490e669j21858a5406l40427k30223
$$ -320342 -289770 60512 -255419 -150186 49210 -67490 -5669 -127527 -15406 -355833 -586056
8986e86056c8992G057O9819C7846J5509i3370e575k12590D0117h2559k44921J51984
$$ -586056 -38992 7057 76876 37846 53355 -93370 -5575 -218165 40117 -82559 -327480 -175496
8974a75496B14271a81191K3585N0092C2688g2617q7279f6001a4580C5604J36286
$$ -175496 214271 -181191 -157606 -107514 32688 -72617 -159896 -66001 -14580 35604 171890
8963A71890i4012k86319J67864f4538k59415C14546j25951a784j37368o2135G9626
$$ 171890 -94012 -380331 -212467 -64538 -323953 314546 188595 -1784 -139152 -201287 79626
8951c29236I8145K424a71768b7966A8606K43658A16062b1575k99973e3546l77448
$$ -329236 98145 100569 -171768 -27966 18606 262264 116062 -21575 -321548 -53546 -430994
8940d30994C00961b33869J15307A44379a17988H8076O7509a992G4275a98578J5781
$$ -430994 300961 -233869 -118562 144379 -117988 88076 155585 -1992 74275 -198578 -182797
8929a82797k12517c7393B77919A02058J12680K57572J240200M778822j522582
$$ -182797 -395314 -37393 277919 102058 214738 472310 1712510 6491332 4968750
8920D968750A756196F33360J21576H7386a02900B47314F7705c4978h980E4870
$$ 4968750 1756196 633360 754936 87386 -102900 247314 67705 -34978 -8980 54870
8909B8373a27604A84754a1594k9707k2902j20704A23509b60374A73877a21324
$$ 28373 -127604 184754 -11594 -41301 -64203 -184907 123509 -260374 173877 -121324
8898a81076C26447E3193a1297I9154d0049B58896a13987d9121j03355L5850D04466
$$ -181076 326447 53193 -11297 99154 -40049 258896 -113987 -49121 -152476 -116626 404466
8886H8257b17250h4950L3266a8105p926B19620G7380a62315A47202C1692a53851
$$ 88257 -217250 -84950 -51684 -18105 -26031 219620 77380 -162315 147202 31692 -153851
$$ [...]
##END NTUPLES=NMR SPECTRUM
##END=
