
##TITLE=AC1305_DOMAH11117_6613836_ogVs06oHye
##JCAMPDX= 6.0         $$ Bruker NMR JCAMP-DX V2.0
##DATA TYPE= NMR SPECTRUM
##DATA CLASS= NTUPLES
##ORIGIN= BRUKER
##OWNER= Administrator
$$ 1.72 TOPSPIN		Version 2.1
$$ 2012-08-02 13:46:58.250 -0500  Administrator@TOPSPIN
$$ Compression mode = diff/dup
##.OBSERVE FREQUENCY= 400.02188249412
##.OBSERVE NUCLEUS= ^1H
##.ACQUISITION MODE= SIMULTANEOUS (DQD)
##.ACQUISITION SCHEME= undefined
##.AVERAGES= 64
##.DIGITISER RES= 22
##SPECTROMETER/DATA SYSTEM= spect
##.PULSE SEQUENCE= noesygpps1d.comp
##.SOLVENT NAME= COFFEE_meoh
##.SHIFT REFERENCE= INTERNAL, COFFEE_meoh, 1, 14.96251
##AUDIT TRAIL= $$ (NUMBER, WHEN, WHO, WHERE, PROCESS, VERSION, WHAT)
$$ ##TITLE= Audit trail, TOPSPIN		Version 2.1
$$ ##JCAMPDX= 5.01
$$ ##ORIGIN= Bruker BioSpin GmbH
$$ ##OWNER= Administrator
$$ $$ C:\Bruker\TOPSPIN/data/COFFEE/nmr/AC1305_DOMAH11117_6613836_ogVs06oHye/12/pdata/1/auditp.txt
$$ ##AUDIT TRAIL=  $$ (NUMBER, WHEN, WHO, WHERE, PROCESS, VERSION, WHAT)
(   1,<2012-08-02 13:46:52.609 -0500>,<Administrator>,<TOPSPIN>,<go>,<TOPSPIN 2.1>,
      <created by zg
	started at 2012-08-02 13:35:22.203 -0500,
	POWCHK enabled, PULCHK disabled,
       configuration hash MD5:
       6B 1B 68 BB D9 2E 58 E2 7F 35 AD 54 07 DF 0E 41
       data hash MD5: 64K
       42 2B 01 98 02 5A 70 6B 6B 67 3C 2F 26 A2 B9 E2>)
(   2,<2012-08-02 13:46:56.078 -0500>,<Administrator>,<TOPSPIN>,<proc1d>,<TOPSPIN 2.1>,
      <Start of raw data processing
       efp LB = 0.3 FT_mod = 6 PKNL = 1 PHC0 = 0 PHC1 = 0 SI = 128K 
       data hash MD5: 128K
       3A 1F AC 3E 96 FB C8 AF 0C F0 EA 7A 24 9F 79 99>)
(   3,<2012-08-02 13:46:57.156 -0500>,<Administrator>,<TOPSPIN>,<proc1d>,<TOPSPIN 2.1>,
      <pk PHC0 = 3.779297 PHC1 = 0 
       data hash MD5: 128K
       37 F9 13 B3 EB 04 42 6C 13 24 1F 6F B0 F0 FD 88>)
(   4,<2012-08-02 13:46:57.890 -0500>,<Administrator>,<TOPSPIN>,<proc1d>,<TOPSPIN 2.1>,
      <abs ABSG = 1 
       data hash MD5: 128K
       17 6B 08 B9 65 0D 71 29 C7 B2 99 08 72 C0 0A 13>)
(   5,<2012-08-02 13:46:57.968 -0500>,<Administrator>,<TOPSPIN>,<proc1d>,<TOPSPIN 2.1>,
      <abs ABSG = 2 
       data hash MD5: 128K
       C3 19 3D 70 8D AE 21 E8 80 8B 68 8B 50 A8 95 80>)
(   6,<2012-08-02 13:46:58.015 -0500>,<Administrator>,<TOPSPIN>,<proc1d>,<TOPSPIN 2.1>,
      <abs ABSG = 3 
       data hash MD5: 128K
       27 76 AD 47 D7 46 0A B7 AA 46 E0 3C 82 70 FF DA>)
(   7,<2012-08-02 13:46:58.078 -0500>,<Administrator>,<TOPSPIN>,<proc1d>,<TOPSPIN 2.1>,
      <abs ABSG = 4 
       data hash MD5: 128K
       08 D6 30 3B 14 21 BF F1 D1 ED 6A 99 B6 52 76 50>)
(   8,<2012-08-02 13:46:58.140 -0500>,<Administrator>,<TOPSPIN>,<proc1d>,<TOPSPIN 2.1>,
      <abs ABSG = 5 
       data hash MD5: 128K
       5C 2D D1 BC 01 BC 84 70 D7 B7 3F 51 DD EA 19 8F>)
$$ ##END=
$$ 
$$ $$ hash MD5
$$ $$ AD 1F 52 BD F0 E4 BF B9 80 9F 54 A8 13 17 84 FE
##$RELAX= 
##$RELAX= 
##$RELAX= 
##$RELAX= 
##$RELAX= 
##$RELAX= 
##$RELAX= 
##$RELAX= 
$$ Bruker specific parameters
$$ [...]
150 150 150 150 150 150 150 150
##$TP07= 0
##$TPNAME0= <>
##$TPNAME1= <>
##$TPNAME2= <>
##$TPNAME3= <>
##$TPNAME4= <>
##$TPNAME5= <>
##$TPNAME6= <>
##$TPNAME7= <>
##$TPOAL= (0..7)
0.5 0.5 0.5 0.5 0.5 0.5 0.5 0.5
##$TPOFFS= (0..7)
0 0 0 0 0 0 0 0
##$TUNHIN= 0
##$TUNHOUT= 0
##$TUNXOUT= 0
##$USERA1= <user>
##$USERA2= <user>
##$USERA3= <user>
##$USERA4= <user>
##$USERA5= <user>
##$V9= 5
##$VALIST= <valist>
##$VCLIST= <CCCCCCCCCCCCCCC>
##$VD= 0
##$VDLIST= <DDDDDDDDDDDDDDD>
##$VPLIST= <PPPPPPPPPPPPPPP>
##$VTLIST= <TTTTTTTTTTTTTTT>
##$WBST= 1024
##$WBSW= 4
##$XGAIN= (0..3)
0 0 0 0
##$XL= 0
##$YL= 0
##$YMAX_a= 17100727
##$YMIN_a= -9290664
##$ZGOPTNS= <>
##$ZL1= 120
##$ZL2= 120
##$ZL3= 120
##$ZL4= 120
##$ABSF1= 14.96251
##$ABSF2= -5.595672
##$ABSG= 5
##$ABSL= 3
##$ALPHA= 0
##$AQORDER= 0
##$ASSFAC= 0
##$ASSFACI= 0
##$ASSFACX= 0
##$ASSWID= 0
##$AUNMP= <proc_prof1d_extract.lims>
##$AXLEFT= 0
##$AXNAME= <>
##$AXNUC= <1H>
##$AXRIGHT= 0
##$AXTYPE= 0
##$AXUNIT= <>
##$AZFE= 0.1
##$AZFW= 0.1
##$BCFW= 0
##$BC_mod= 0
##$BYTORDP= 0
##$COROFFS= 0
##$CY= 15
##$DATMOD= 1
##$DC= 0
##$DFILT= <>
##$DTYPP= 0
##$F1P= 0
##$F2P= 0
##$FCOR= 0.5
##$FTSIZE= 131072
##$FT_mod= 6
##$GAMMA= 0
##$GB= 0
##$INTBC= 1
##$INTSCL= 1
##$ISEN= 128
##$LB= 0.3
##$LEV0= 0
##$LPBIN= 0
##$MAXI= 10000
##$MC2= 0
##$MEAN= 0
##$ME_mod= 0
##$MI= 0
##$NCOEF= 0
##$NC_proc= -2
##$NLEV= 6
##$NOISF1= 0
##$NOISF2= 0
##$NSP= 0
##$NTH_PI= 0
##$NZP= 0
##$OFFSET= 14.96251
##$PC= 1
##$PHC0= 3.779297
##$PHC1= 0
##$PH_mod= 1
##$PKNL= yes
##$PPARMOD= 0
##$PPDIAG= 0
##$PPIPTYP= 0
##$PPMPNUM= 2147483647
##$PPRESOL= 1
##$PSCAL= 4
##$PSIGN= 0
##$PYNMP= <proc.py>
##$REVERSE= no
##$SF= 400.020009030884
##$SI= 131072
##$SIGF1= 0
##$SIGF2= 0
##$SINO= 400
##$SIOLD= 131072
##$SPECTYP= <>
##$SREGLST= <1H.CDCl3>
##$SSB= 0
##$STSI= 131072
##$STSR= 0
##$SW_p= 8223.68421052631
##$SYMM= 0
##$S_DEV= 0
##$TDeff= 65536
##$TDoff= 0
##$TI= <>
##$TILT= no
##$TM1= 0
##$TM2= 0
##$TOPLEV= 0
##$USERP1= <user>
##$USERP2= <user>
##$USERP3= <user>
##$USERP4= <user>
##$USERP5= <user>
##$WDW= 1
##$XDIM= 131072
##$YMAX_p= 345426755
##$YMIN_p= -16024
##$CURPLOT= <Network HP LaserJet P1505>
##$CURPRIN= <$Network HP LaserJet P1505>
##$DFORMAT= <normdp>
##$LAYOUT= <+/1D_H.xwp>
##$LFORMAT= <normlp>
##$PFORMAT= <normpl>
##$SURQMSG= 1
$$ End of Bruker specific parameters
$$ ---------------------------------
##NTUPLES= NMR SPECTRUM
##VAR_NAME=  FREQUENCY,     SPECTRUM/REAL,   SPECTRUM/IMAG
##SYMBOL=    X,             R,               I
##VAR_TYPE=  INDEPENDENT,   DEPENDENT,       DEPENDENT
##VAR_FORM=  AFFN,          ASDF,            ASDF
##VAR_DIM=   131072,        131072,          131072
##UNITS=     HZ,            ARBITRARY UNITS, ARBITRARY UNITS
##FACTOR=    0.0627417313425164, 1,          1
##FIRST=     8223.62146879497, 1304,         -56662
##LAST=      0,             1706,            -57570
##MIN=       0,             -16024,          0
##MAX=       8223.62146879497, 345426755,    0
$$ Real data points
##PAGE= N=1
##DATA TABLE= (X++(R..R)), XYDATA
$$ [...]
63224G84708K9006K8990K8303K6300K4028K2829K2430K1870K1404K1799K2492
$$ 784708 813714 842704 871007 897307 921335 944164 966594 988464 1009868 1031667 1054159
63213A054159K2212K0975J9731J8342J5704J1703P383L152j584o949j2245j7212
$$ 1054159 1076371 1097346 1117077 1135419 1151123 1162826 1170209 1173361 1171777 1164828 1152583 1135371
63201A135371k2174k6787l0113l2186l4103l6103l6911l5537l2688k9772k7353
$$ 1135371 1113197 1086410 1056297 1024111 990008 953905 916994 881457 848769 818997 791644
63190G91644k5078k2445j9250j5805j2904j1071r816q232o135m026k111k24J494
$$ 791644 766566 744121 724871 709066 696162 685091 675275 667043 660908 656882 654771 654547 656041
63177F56041K759L780M895N770N914N679N738N908N619N245N600O360O397N680
$$ 656041 658800 662580 667475 673245 679159 684838 690576 696484 702103 707348 712948 719308 725705 731385
63163G31385N243N192M349K307K61q36j551k752m307n815p517r548j1156j1587
$$ 731385 736628 741820 746169 748476 748737 747901 746350 743598 739291 733476 725959 716411 705255 693668
63149F93668j1183j0845j0794j0543r734q591p636p216p037o359m971l757l639
$$ 693668 682485 671640 660846 650303 640569 631978 624342 617126 610089 603730 598759 595002 591363
63136E91363m247m509m275m230m293l522j849n79o17j292j534j244q68m73O9O14
$$ 591363 587116 582607 578332 574102 569809 566287 564438 563859 563242 561950 560416 559172 558304 557831 557900 558514
63120E58514J094J771K662L289L417L463L799M182M320M393M625M861M977N208
$$ 558514 559608 561379 564041 567330 570747 574210 578009 582191 586511 590904 595529 600390 605367 610575
63106F10575N674O066O161O194O479O922P175O999O367N578N118N107M983M335
$$ 610575 616249 622315 628476 634670 641149 648071 655246 662245 668612 674190 679308 684415 689398 693733
63092F93733L670L663L932L548K571K027K340K881L192L518L976M264M488N204
$$ 693733 697403 701066 704998 708546 711117 713144 715484 718365 721557 725075 729051 733315 737803 743007
63078G43007O263O732O407O373P519R336J0767J1407J1473J1335J1567J2556J3783
$$ 743007 749270 756002 762409 768782 776301 785637 796404 807811 819284 830619 842186 854742 868525
63065H68525J4253J4048J4426J5967J7731J8891K0103K2342K5371K8297L1058
$$ 868525 882778 896826 911252 927219 944950 963841 983944 1006286 1031657 1059954 1091012
63054A091012L4234L7900M1540M4891M8139N1384N4427N6970N8795N9934O0801
$$ 1091012 1125246 1163146 1204686 1249577 1297716 1349100 1403527 1460497 1519292 1579226 1640027
63043A640027O1710O2248O1754O0439N9220N8327N7054N5147N3368N2227N1204
$$ 1640027 1701737 1763985 1825739 1886178 1945398 2003725 2060779 2115926 2169294 2221521 2272725
63032B272725M9890M8781M8141M7010M4308M0186L5280K9253K1156J0835r30j3370
$$ 2272725 2322615 2371396 2419537 2466547 2510855 2551041 2586321 2615574 2636730 2647565 2646635 2633265
63020B633265k5939l7923m8650n7994o6020p2313p6236p7708p7270p5577p3181
$$ 2633265 2607326 2569403 2520753 2462759 2396739 2324426 2248190 2170482 2093212 2017635 1944454
63009A944454p0371o6877o2136n6267n0323m5087m0177l4885k9338k4188j9535
$$ 1944454 1874083 1807206 1745070 1688803 1638480 1593393 1553216 1518331 1488993 1464805 1445270
62998A445270j4968j0365o032k205R66L154M193M539M994N988P402Q817R681R542
$$ 1445270 1430302 1419937 1413905 1411700 1412666 1415820 1420013 1424552 1429546 1435534 1442936 1451753 1461434 1470976
62984A470976Q511P202N922M309K038n87l136n746q877j2670j6864k1064k4779
$$ 1470976 1479487 1486689 1492611 1496920 1498958 1498371 1495235 1489489 1480612 1467942 1451078 1430014 1405235
62971A405235k7589k9565l1182l2605l3511l3798l3836l3708l2813l0765k8157
$$ 1405235 1377646 1348081 1316899 1284294 1250783 1216985 1183149 1149441 1116628 1085863 1057706
62960A057706k5922k4312k2940k1398j9448j7079j4712j3018j2134j1464j0509
$$ 1057706 1031784 1007472 984532 963134 943686 926607 911895 898877 886743 875279 864770
62949H64770r365q194o827n331m319m208m680n214n697o118o294o320o649p382
$$ 864770 855405 847211 840384 835053 830734 826526 821846 816632 810935 804817 798523 792203 785554 778172
62935G78172p975q097q059q075p855p385p245p600p686o990o144n839n706n078
$$ 778172 770197 762100 754041 745966 738111 730726 723481 715881 708195 701205 695061 689222 683516 678438
62921F78438m284m098m453m612m325l961l781l745l815l853l626l330l595m382
$$ 678438 674154 670056 665603 660991 656666 652705 648924 645179 641364 637511 633885 630555 626960 622578
62907F22578m625l652k261j578j484j115l51K12L44K44j63r99j783j940j750j931
$$ 622578 617953 614301 612040 610462 608978 607863 607512 607724 608068 608312 608149 607150 605367 603427 601677 599746
62891E99746k474k765k641k489k468k447k557l037l617l742l349k819k351j963
$$ 599746 597272 594507 591866 589377 586909 584462 581905 578868 575251 571509 568160 565341 562990 561027
62877E61027j872k224k680k828k695k367j618m90K61Q6n08p48p14q46j017j004
$$ 561027 559155 556931 554251 551423 548728 546361 544743 544253 544514 544600 544092 543344 542630 541784 540767 539763
62861E39763j246j980k287j327K1J86p71j409j317j546k546l340l206k689k343
$$ 539763 538517 536537 534250 532923 532944 533130 532359 530950 529633 528087 525541 522201 518995 516306 513963
62846E13963j825r64n63j243k242k375j587q07o08o74m48J52O38M72j97m97N9
$$ 513963 512138 511174 510611 509368 507126 504751 503164 502357 501749 501075 500627 500779 501417 501889 501692 501195 501254
62829E01254O99K91j031j901j509n09P2L2k34m24m40l00k72o37j047p19M98J762
$$ 501254 501953 502244 501213 499312 497803 497294 497366 497398 497164 496740 496300 496000 495728 495091 494044 493325 493823 495585
62811D95585K288K269K432L046L794M259M297M130M304N208O522P404P447P193
$$ 495585 497873 500142 502574 505620 509414 513673 517970 522100 526404 531612 538134 545538 552985 560178
62797E60178P489Q628J0201J1635J2716J3763J5288J7342J9338K0761K1874K3342
$$ 560178 567667 576295 586496 598131 610847 624610 639898 657240 676578 697339 719213 742555
62785G42555K5364K7629L0043L2900L6316M0017M3799M7787N2123N6849O2115
$$ 742555 767919 795548 825591 858491 894807 934824 978623 1026410 1078533 1135382 1197497
62774A197497O8035P4165P9674Q4230Q8378R2693R6775R9361R9390R6828R2445
$$ 1197497 1265532 1339697 1419371 1503601 1591979 1684672 1781447 1880808 1980198 2077026 2169471
62763B169471Q6768P9332O9076N5529L9441K2252N195j0963k5848l9479n2100
$$ 2169471 2256239 2335571 2404647 2460176 2499617 2521869 2527064 2516101 2490253 2450774 2398674
62752B398674o3597p3367q0943q6478r0293r2369r2635r1364q8885q5282q0784
$$ 2398674 2335077 2261710 2180767 2094289 2003996 1911627 1818992 1727628 1638743 1553461 1472677
62741A472677p6052p1577o7179o2597n8160n4371n1180m8136m4935m1378l7317
$$ 1472677 1396625 1325048 1257869 1195272 1137112 1082741 1031561 983425 938490 897112 859795
62730H59795l3238l0168k8377k6824k4664k2573k1532k0975j9497j6992j4702
$$ 859795 826557 796389 768012 741188 716524 693951 672419 651444 631947 614955 600253
62719F00253j3346j2461j1607j0840r999q679p105n864m720k934q78J10q7K26
$$ 600253 586907 574446 562839 551999 542000 533321 526216 520352 515632 512698 511820 511930 511843 512069
62705E12069K207M840O498P146P901R183J0438J1327J2191J3410J5039J7036J9354
$$ 512069 514276 519116 525614 532760 540661 549844 560282 571609 583800 597210 612249 629285 648639
62692F48639K1719K3749K5314K6582K7813K9135L0409L1194L1023K9726K7408
$$ 648639 670358 694107 719421 746003 773816 802951 833360 864554 895577 925303 952711
62681I52711K4233K0464J6468J2310P517J752m457j0140j4843j8704k1874k4478
$$ 952711 976944 997408 1013876 1026186 1033703 1035455 1030998 1020858 1006015 987311 965437 940959
62669I40959k6932k9398l1143l1302l0258k9250k8634k7599k5852k4299k3589
$$ 940959 914027 884629 853486 822184 791926 762676 734042 706443 680591 656292 632703
62658F32703k3012k1607j9577j7806j6485j5124j3640j2580j2289j2320j1897
$$ 632703 609691 588084 568507 550701 534216 519092 505452 492872 480583 468263 456366
62647D56366j0761r432q627q425q233p677p101o855o552n742m860m671n014n050
$$ 456366 445605 436173 427546 419121 410888 403211 396110 389255 382703 376961 372101 367430 362416 357366
62633C57366m685m625m945m803l864k936k716k797k564k193k080k016j651j223
$$ 357366 352681 348056 343111 338308 334444 331508 328792 325995 323431 321238 319158 317142 315491 314268
62619C14268j116j085o46J37Q17J261J649K056K441K884L421L951M588N711P232
$$ 314268 313152 312067 311421 311558 312375 313636 315285 317341 319782 322666 326087 330038 334626 340337 347569
62604C47569Q240Q028P330P828J0283J3590J5934J6713J7060J8481K1260K4441
$$ 347569 355809 363837 371167 378995 389278 402868 418802 435515 452575 471056 492316 516757
62592E16757K7197K9675L2401L5470L8762M2387M6216M9400N1100N1501N1380
$$ 516757 543954 573629 606030 641500 680262 722649 768865 818265 869365 920866 972246
62581I72246N0773M8861M5051L9478L2554K4782J6893R319J665o480j4318k0571
$$ 972246 1023019 1071880 1116931 1156409 1188963 1213745 1230638 1239957 1241622 1235142 1220824 1200253
62569A200253k5285k9690l4139l7490l8985l9451l9975m0369l9751l7897l5275
$$ 1200253 1174968 1145278 1111139 1073649 1034664 995213 955238 914869 875118 837221 801946
62558H01946l2418k9880k8119k6895k5404k3523k2153k1791k1541k0350j8544
$$ 801946 769528 739648 711529 684634 659230 635707 613554 591763 570222 549872 531328
62547E31328j7240j6734j6309j5409j4174j2941j1809j0711r572q477p756p629
$$ 531328 514088 497354 481045 465636 451462 438521 426712 416001 406429 397952 390196 382567
62535C82567p661p066n721m325l360k553j681j116j114j184p28K05J250K292L238
$$ 382567 374906 367840 362119 357794 354434 351881 350200 349084 347970 346786 346058 346263 347513 349805 353043
62520C53043L794L915L977M174M300M478N317O898Q382R279J0249J1957J3924
$$ 353043 356837 360752 364729 368903 373203 377681 382998 389896 398278 407557 417806 429763 443687
62507D43687J5412J6695J8333J9765J9831J8559J7291J6987J7207J6869J5263
$$ 443687 459099 475794 494127 513892 533723 552282 569573 586560 603767 620636 635899
62496F35899J2305Q404M288N34k818n932q669j0700j1976j2758j3329j3937j4715
$$ 635899 648204 656608 660896 661430 658612 652680 644011 633311 621335 608577 595248 581311 566596
62483E66596j5386j5445j4814j3905j2821j1204r207p784p339o960n833m551l965
$$ 566596 551210 535765 520951 507046 494225 483021 473814 466030 458691 451731 445898 441347 437382
62470D37382l422j645R72K558K309J536J722K765L702M181M494M804N107N567
$$ 437382 433960 432315 433287 435845 438154 439690 441412 444177 447879 452060 456554 461358 466465 472032
62456D72032O288O987P340P475P736Q198Q709R217R695R894R503Q605P649O851
$$ 472032 478320 485307 492647 500122 507858 516056 524765 533982 543677 553571 563074 571679 579328 586179
62442E86179N850M087J534j196l474n304p216r561j2102j4233j5450j5569j4801
$$ 586179 592029 596116 597650 596454 592980 587676 580460 570899 558797 544564 529114 513545 498744
62429D98744j3677j2712j2000j1222j0145q932p879o981n866m141j882K12J332
$$ 498744 485067 472355 460355 449133 438988 430056 422177 415196 409330 405189 403307 403519 404851
62416D04851J360J056J216J869K608L418M648O254P630Q348Q617Q878R244R482
$$ 404851 406211 407267 408483 410352 412960 416378 421026 427280 434910 443258 451875 460753 469997 479479
62402D79479R304Q629P659O647N491L891K035O42j09j091k977n024o003n899n660
$$ 479479 488783 497412 505071 511718 517209 521100 523135 523777 523668 522577 519600 514576 508573 502674 497014
62387D97014n571n065m110l422l164k584j316M2J053K140L739N623P531R539J1521
$$ 497014 491443 486378 482268 478846 475682 473098 471782 471824 472877 475017 478756 484379 491910 501449 512970
62372E12970J3092J4533J6827K0322K4183K7614L0732L3795L6526L8804M1164
$$ 512970 526062 540595 557422 577744 601927 629541 660273 694068 730594 769398 810562
62361H10562M3923M6578M8540M9742N0092M9169M6962M3917L9910L4096K6389
$$ 810562 854485 901063 949603 999345 1049437 1098606 1145568 1189485 1229395 1263491 1289880
62350A289880J7978R832J915n541j1410j5349j8806k3037k7272l0150l1903l3638
$$ 1289880 1307858 1317690 1319605 1314064 1302654 1287305 1268499 1245462 1218190 1188040 1156137 1122499
62338A122499l5257l5720l4843l3322l1384k8876k6325k4586k3485k2126k0433
$$ 1122499 1087242 1051522 1016679 983357 951973 923097 896772 872186 848701 826575 806142
62327H06142j9220j8858j8898j8898j8628j7597j5506j3001j1035r630q183o759
$$ 806142 786922 768064 749166 730268 711640 694043 678537 665536 654501 644871 636688 629929
62315F29929n977n799n519m941m520m377m178m062m623n869p027p608p875q130
$$ 629929 623952 618153 612634 607693 603173 598796 594618 590556 585933 580064 573037 565429 557554 549424
62301E49424q230q013p662p500p726q225q344p253n033k889j734j110k04P53J063
$$ 549424 541194 533181 525519 518019 510293 502068 493724 486471 481438 478549 476815 475705 475501 476254 477317
62286D77317J014J592L043M783O420P817Q490Q188P872Q875J1065J2987J3872
$$ 477317 478331 479923 482966 487749 494169 501986 510476 518664 526536 535411 546476 559463 573335
62273E73335J4321J4920J5395J5450J5441J5826J6723J8247K0477K2949K4925
$$ 573335 587656 602576 617971 633421 648862 664688 681411 699658 720135 743084 768009
62262G68009K6408K8128L0407L2784L4969L7322M0074M2614M3953M3481M1105
$$ 768009 794417 822545 852952 885736 920705 958027 998101 1040715 1084668 1128149 1169254
62251A169254L7045L1615K5045J7558R776K555l865j0045j6137k1263k4855k7830
$$ 1169254 1206299 1237914 1262959 1280517 1290293 1292848 1288983 1278938 1262801 1241538 1216683 1188853
62239A188853l1256l4474l5859l5183l3813l2654l1314k9392k7253k5159k2767
$$ 1188853 1157597 1123123 1087264 1052081 1018268 985614 954300 924908 897655 872496 849729
62228H49729j9940j7177j4828j2736j0921r803r443r239q737q128p738p526p206
$$ 849729 829789 812612 797784 785048 774127 764324 754881 745642 736905 728777 721039 713513 706307
62215G06307o556n596m885n190o322o843n765m058l331l515l181j926q43n38k21
$$ 706307 699751 694155 689270 684080 677758 670915 665150 661092 657761 654246 651065 649139 648296 647758 647537
62200F47537Q09K168L393M773O508Q061Q998R737J0880J2466J4287J6243J7968
$$ 647537 648346 650514 653907 658680 665188 673249 682247 691984 702864 715330 729617 745860 763828
62187G63828J8775J8457J7615J6888J6281J5481J4302J2740J1038R781R340R353
$$ 763828 782603 801060 818675 835563 851844 867325 881627 894367 905405 915186 924526 933879
62175I33879R352R706J1111J3349J5492J7309J9456K2220K5084K7580K9614L0838
$$ 933879 943231 952937 964048 977397 992889 1010198 1029654 1051874 1076958 1104538 1134152 1164990
62163A164990L0763K9591K7980K5812K2379J7864J3527J0089P032L854Q79j600
$$ 1164990 1195753 1225344 1253324 1279136 1301515 1319379 1332906 1342995 1350027 1353881 1354760 1353160
62151A353160l955o530r134j1554j3690j5026j4944j3851j2943j2613j2211j1556
$$ 1353160 1349205 1342675 1333541 1321987 1308297 1293271 1278327 1264476 1251533 1238920 1226709 1215153
62139A215153j1316j1488j0991r493q252q201q477p936p035o882p258o919n418
$$ 1215153 1203837 1192349 1181358 1171865 1163613 1155412 1146935 1138999 1131964 1125082 1117824 1110905 1105487
62126A105487l450j631K3J503K620L421M291N452O787Q091R349J0716J2228J3437
$$ 1105487 1102037 1100406 1100429 1101932 1104552 1107973 1112264 1117716 1124503 1132594 1141943 1152659 1164887 1178324
62112A178324J3672J3072J2946J4366J6657J8264J8889J9645K1100K2506K3316
$$ 1178324 1191996 1205068 1218014 1232380 1249037 1267301 1286190 1305835 1326935 1349441 1372757
62101A372757K4193K5852K7968K9844L1364L2679L3729L4608L5769L7433L9409
$$ 1372757 1396950 1422802 1450770 1480614 1511978 1544657 1578386 1612994 1648763 1686196 1725605
62090A725605M1729M4616M7593M9500M9790M8940M7479M5624M4140M4230M5948
$$ 1725605 1767334 1811950 1859543 1909043 1958833 2007773 2055252 2100876 2145016 2189246 2235194
62079B235194M7830M8619M8366M7385M5442M2686M0121L8283L6535L4583L3555
$$ 2235194 2283024 2331643 2380009 2427394 2472836 2515522 2555643 2593926 2630461 2665044 2698599
62068B698599L4494L6780L9139M1270M3398M5061M5593M5272M4726M3690M1415
$$ 2698599 2733093 2769873 2809012 2850282 2893680 2938741 2984334 3029606 3074332 3118022 3159437
62057C159437L8004L4405L1331K8932K7159K5738K4139K2241K0581J9502J8584
$$ 3159437 3197441 3231846 3263177 3292109 3319268 3345006 3369145 3391386 3411967 3431469 3450053
62046C450053J7503J6729J6768J7363J8130J9220K0619K1621K1922K2408K3794
$$ 3450053 3467556 3484285 3501053 3518416 3536546 3555766 3576385 3598006 3619928 3642336 3666130
62035C666130K5215K5306K4153K2971K2246K1384J9989J8281J6290J3696J0613
$$ 3666130 3691345 3716651 3740804 3763775 3786021 3807405 3827394 3845675 3861965 3875661 3886274
62024C886274P758N595L891K196L55j464k934l881m578n500o643p518p992q436
$$ 3886274 3894032 3899627 3903518 3905714 3906069 3904605 3901671 3897790 3893212 3887712 3881069 3873551 3865559 3857123
62010C857123q808q365o749m730l252k372j621p72L19J977M168O236P756R143
$$ 3857123 3848315 3839950 3833201 3828471 3825219 3822847 3821226 3820454 3820773 3822750 3826918 3833154 3840910 3850053
61996C850053J0786J2204J2604J1784R997P551N068L345K375J177q08k878m199
$$ 3850053 3860839 3873043 3885647 3897431 3907428 3914979 3920047 3923392 3925767 3926944 3926136 3923258 3919059
61983C919059m962n730o439o919p629r023j0704j2063j3187j4476j5930j7518
$$ 3919059 3914097 3908367 3901928 3895009 3887380 3878357 3867653 3855590 3842403 3827927 3811997 3794479
61971C794479j9539k1948k4019k5382k6690k8494l0266l1292l1764l2192l2569
$$ 3794479 3774940 3752992 3728973 3703591 3676901 3648407 3618141 3586849 3555085 3522893 3490324
61960C490324l2889l3589l4542l4607l3162l1209k9932k9123k8172k7464k7404
$$ 3490324 3457435 3423846 3389304 3354697 3321535 3290326 3260394 3231271 3203099 3175635 3148231
61949C148231k6998k5108k2401k0435j9314j7895j5897j4087j2590j0697q326
$$ 3148231 3121233 3096125 3073724 3053289 3033975 3016080 3000183 2986096 2973506 2962809 2954483
61938B954483o244m646k865n97J697L791O028Q578J1279J4209J7558K0978K3904
$$ 2954483 2948239 2943593 2940728 2940131 2941828 2945619 2951647 2960225 2971504 2985713 3003271 3024249 3048153
61925C048153K6462K9385L3201L8095M4212N1283N8431O5315P2993Q2863R5133
$$ 3048153 3074615 3104000 3137201 3175296 3219508 3270791 3329222 3394537 3467530 3550393 3645526
61914C645526J09201J24935J42580J62050J83468K07851K36100K67851L02575
$$ 3645526 3754727 3879662 4022242 4184292 4367760 4575611 4811711 5079562 5382137
61905E382137L41090L84519M32180M81987N32283N81420O25560O58482O73441
$$ 5382137 5723227 6107746 6539926 7021913 7554196 8135616 8761176 9419658 10093099
61896A0093099O63944O23394N46832M34490K93017J33151l2927j92766l35054
$$ 10093099 10757043 11380437 11927269 12361759 12654776 12787927 12755000 12562234 12227180
61887A2227180m51846n39440n97375o27523o33910o21691n95580n59732n18663
$$ 12227180 11775334 11235894 10638519 10010996 9377086 8755395 8159815 7600083 7081420
61878G081420m76715m36307l97923l61975l29468l00685k74707k50745k28916
$$ 7081420 6604705 6168398 5770475 5408500 5079032 4778347 4503640 4252895 4023979
61869D023979k09369j91769j75997j62288j50270j38839j27414j16456j06537
$$ 4023979 3814610 3622841 3446844 3284556 3134286 2995447 2868033 2751577 2645040
61860B645040r7658q9666q2506p5914o9672o4045n9282n4732m9666m4633m0752
$$ 2645040 2547382 2457716 2375210 2299296 2229624 2165579 2106297 2051565 2001899 1957266 1916514
61849A916514l7765l4234k9822k5903k3549k2253k1059j9801j8653j7531j6347
$$ 1916514 1878749 1844515 1814693 1788790 1765241 1742988 1721929 1702128 1683475 1665944 1649597
61838A649597j5057j3325j1022r028q301q241p269n205l517k997k793k157j536
$$ 1649597 1634540 1621215 1610193 1601165 1592864 1584623 1577354 1572149 1568632 1565635 1562842 1560685 1559149
61825A559149j209m32J179K710L381L753M604N661O412P230Q728J0718J2663J4539
$$ 1559149 1557940 1557508 1558687 1561397 1564778 1568531 1573135 1578796 1585208 1592438 1601166 1611884 1624547 1639086
61811A639086J6548J8691K1149K4331K8091L1663L4897L8569M2944M7121N0599
$$ 1639086 1655634 1674325 1695474 1719805 1747896 1779559 1814456 1853025 1895969 1943090 1993689
61800A993689N4326N9288O4988P0458P5999Q2697R0718R9247J07884J17115J27494
$$ 1993689 2048015 2107303 2172291 2242749 2318748 2401445 2492163 2591410 2699294 2816409 2943903
61789B943903J39172J52231J66861J83251K01667K22638K46743K74351L05705
$$ 2943903 3083075 3235306 3402167 3585418 3787085 4009723 4256466 4530817 4836522
61780D836522L41059L80687M25043M74911N30963N93205O61383P35721Q16413
$$ 4836522 5177581 5558268 5983311 6458222 6989185 7582390 8243773 8979494 9795907
61771I795907R02112R89380J073314J147452J202679J227076J207709J133172
$$ 9795907 10698019 11687399 12760713 13908165 15110844 16337920 17545629 18678801
61763A8678801R96304P97473N46819K62750l2831l18600n75534p88561r49096
$$ 18678801 19675105 20472578 21019397 21282147 21249316 20930716 20355182 19566621 18617525
61754A8617525j055835j112470j125206j102328j053866r89464r16422q40217
$$ 18617525 17561690 16449220 15324014 14221686 13167820 12178356 11261934 10421717
61746A0421717p65680o96384o33437n76252n24464m78306m37522m01088l68132
$$ 10421717 9656037 8959653 8326216 7749964 7225500 6747194 6309672 5908584 5540452
61737E540452l38335l11377k86563k63288k41401k20996k02126j84849j69390
$$ 5540452 5202117 4890740 4604177 4340889 4099488 3878492 3676366 3491517 3322127
61728C322127j55960j44290j33499j22819j12491j03466r5998q9189q2379p6122
$$ 3322127 3166167 3021877 2888378 2765559 2653068 2549602 2453604 2364415 2282036 2205914
61718B205914p1041o6533o1659n6710n2526m8808m4652m0411l7292l5198l2742
$$ 2205914 2134873 2068340 2006681 1949971 1897445 1848637 1803985 1763574 1726282 1691084 1658342
61707A658342k9609k7072k5754k4701k3298k2369k2492k2802k2526k2267k2667
$$ 1658342 1628733 1601661 1575907 1551206 1527908 1505539 1483047 1460245 1437719 1415452 1392785
61696A392785k3044k2598k1811k1502k1360k0713j9924j9750j9909j9422j8072
$$ 1392785 1369741 1347143 1325332 1303830 1282470 1261757 1241833 1222083 1202174 1182752 1164680
61685A164680j6516j5358j4760j4638j4579j3982j2817j1704j0930j0035q785
$$ 1164680 1148164 1132806 1118046 1103408 1088829 1074847 1062030 1050326 1039396 1029361 1020576
61674A020576p723p198o718n805m733l833k890j773r06n24l30k72o96j306j188
$$ 1020576 1012853 1005655 998937 993132 988399 984566 981676 979903 978997 978473 978143 977871 977175 975869 974681
61659I74681m20l59j532k579k316j535j547k131k229j767j405j235j088j419k570
$$ 974681 974261 973902 972370 969791 967475 965940 964393 962262 960033 958266 956861 955626 954538 953119 950549
61644I50549l826m315m326m575m806m369l530l030k771k176j333o79j2J040K042
$$ 950549 946723 942408 938082 933507 928701 924332 920802 917772 915001 912825 911492 910813 910801 911841 913883
61629I13883K432K647L360M104L976L258L077L670M276M499M600M555M052L295
$$ 913883 916315 918962 922322 926426 930402 933660 936737 940407 944683 949182 953782 958337 962389 965684
61615I65684K812K544K035J374R82P48L09r3j14k94j396k941l656l332l104l803
$$ 965684 968496 971040 973075 974449 975431 976179 976488 976395 976281 975987 974591 971650 967994 964662 961558 957755
61599I57755n030o034o595o869p005p064o819n860m316l104k801k781k194j244
$$ 957755 952725 946691 940096 933227 926222 919158 912339 906479 902163 899059 896258 893477 891283 890039
61585H90039n85k8J011K300L212M034N553P632R433J0878J2541J4264J5327J6105
$$ 890039 889454 889426 890437 892737 895949 899983 905536 913168 922601 933479 946020 960284 975611 991716
61571I91716J8055K1686K5671K8479K9833L0240L0132K9977L0331L1125L1506
$$ 991716 1009771 1031457 1057128 1085607 1115440 1145680 1175812 1205789 1236120 1267245 1298751
61560A298751L0813K9318K7677K6230K5033K4113K3337K2424K1261J9964J8618
$$ 1298751 1329564 1358882 1386559 1412789 1437822 1461935 1485272 1507696 1528957 1548921 1567539
61549A567539J7162J5484J3340J0466P118M076J598j125m825q871j1948j3694
$$ 1567539 1584701 1600185 1613525 1623991 1631109 1635185 1636783 1635658 1630833 1621962 1610014 1596320
61537A596320j4769j5518j5544j4666j3361j2161j1281j0765j0367r340p145m310
$$ 1596320 1581551 1566033 1550489 1535823 1522462 1510301 1499020 1488255 1477888 1468548 1461403 1457093
61525A457093j886q2J925M816Q511J2684J7118K1477K5483K9430L4049L9740M6366
$$ 1457093 1455207 1455125 1457050 1461866 1470377 1483061 1500179 1521656 1547139 1576569 1610618 1650358 1696724
61512A696724N3706O1604O9825P8347Q7702R8464J10581J23653J37587J52351
$$ 1696724 1750430 1812034 1881859 1960206 2047908 2146372 2256953 2380606 2518193 2670544
61502B670544J67456J82391J97309K12363K26408K37142K42465K40956K31312
$$ 2670544 2838000 3020391 3217700 3430063 3656471 3893613 4136078 4377034 4608346
61493D608346K12379J84125J48034J06474O2095J7665k4300o2007r4205j19878
$$ 4608346 4820725 5004850 5152884 5259358 5321453 5339118 5314818 5252811 5158606 5038728
61483E038728j38568j50760j57313j58755j55632j49132j40577j30555j19299
$$ 5038728 4900160 4749400 4592087 4433332 4277700 4128568 3987991 3857436 3738137
61474C738137j07575r6306q5544p4657o3452n2292m1301l0360j9813j0316j921
$$ 3738137 3630562 3534256 3448712 3374055 3310603 3258311 3217010 3186650 3166837 3156521 3154600
61463C154600N932J3513K0558K6856L2413L7037M0351M2235M2839M2412M1492
$$ 3154600 3160532 3174045 3194603 3221459 3253872 3290909 3331260 3373495 3416334 3458746 3500238
61452C500238M0787M0309L9213L7286L5788L5814L6539L6479L6021L7072M0266
$$ 3500238 3541025 3581334 3620547 3657833 3693621 3729435 3765974 3802453 3838474 3875546 3915812
61441C915812M4046M6743M8156M8719M8355M6826M4296M0936L6591L1141K4773
$$ 3915812 3959858 4006601 4054757 4103476 4151831 4198657 4242953 4283889 4320480 4351621 4376394
61430D376394J7637R819J737o021j3289k0186k6439l1500l5337l8499m1282m3256
$$ 4376394 4394031 4403850 4405587 4399566 4386277 4366091 4339652 4308152 4272815 4234316 4193034 4149778
61418D149778m3620m1761l7806l2965k8798k5540k1835j6740j1232o723l077O10
$$ 4149778 4106158 4064397 4026591 3993626 3964828 3939288 3917453 3900713 3889481 3882758 3879681 3880291
61406C880291L913N456N059L899K615P83j762m580p609j0986j3728j4116j1796
$$ 3880291 3884204 3889660 3894719 3898618 3901233 3902016 3900254 3895674 3888065 3877079 3863351 3849235 3837439
61393C837439q146m178P11P562J6649K7899M1288N6316P2136Q8619J06319J25172
$$ 3837439 3829293 3825115 3825826 3833388 3850037 3877936 3919224 3975540 4047676 4136295 4242614 4367786
61381D367786J44308J63415J83031K02987K21694K37477K49647K57673K60197
$$ 4367786 4512094 4675509 4858540 5061527 5283221 5520698 5770345 6028018 6288215
61372F288215K55457K42031K18999J86474J46404J02073N6348J1004l2352p1964
$$ 6288215 6543672 6785703 7004702 7191176 7337580 7439653 7496001 7507005 7474653 7402689
61362G402689j06896j37269j63134j84204k00861k14212k24569k31033k33170
$$ 7402689 7295793 7158524 6995390 6811186 6610325 6396113 6171544 5940511 5707341
61353E707341k31942k28324k22089k12915k01730j90006j78279j66256j53874
$$ 5707341 5475399 5247075 5024986 4812071 4610341 4420335 4242056 4075800 3921926
61344C921926j41498j29415j17695j06301r5004q3521p1994o0897n0335l9928
$$ 3921926 3780428 3651013 3533318 3427017 3332013 3248492 3176498 3115601 3065266 3025338
61334C025338k9532j9480j0097j461O245J2890J8843K4562K9807L3969L7036L9332
$$ 3025338 2995806 2976326 2966229 2964768 2971013 2983903 3002746 3027308 3057115 3091084 3128120 3167452
61322C167452M0568M0263L8981L7854L6863L4945L1988K9193K7184K5243K2883
$$ 3167452 3208020 3248283 3287264 3325118 3361981 3396926 3428914 3458107 3485291 3510534 3533417
61311C533417K0761J9346J8040J6378J4796J3440J1375P908L629q11n925j2368
$$ 3533417 3554178 3573524 3591564 3607942 3622738 3636178 3647553 3655461 3659090 3658279 3652354 3639986
61299C639986j9453k5787l0879l5346l9867m4568m9000n2302n3911n4417n5015
$$ 3639986 3620533 3594746 3563867 3528521 3488654 3444086 3395086 3342784 3288873 3234456 3179441
61288C179441n5889n5936n4393n1725m8490m4400l9196l3561k8404k3871j9702
$$ 3179441 3123552 3067616 3013223 2961498 2913008 2868608 2829412 2795851 2767447 2743576 2723874
61277B723874j5936j2752j0223q602q268r034j0180j1356j2731j4137j5025j5399
$$ 2723874 2707938 2695186 2684963 2676361 2668093 2659059 2648879 2637523 2624792 2610655 2595630 2580231
61265B580231j5759j5859j4707j2071q813n412j386L445Q493J3747K0194K8251
$$ 2580231 2564472 2548613 2533906 2521835 2513022 2507610 2506224 2509669 2518162 2531909 2552103 2580354
61253B580354L7033M5867N5243O5510P5959Q5946R5647J04839J12198J16673J18219
$$ 2580354 2617387 2663254 2718497 2784007 2859966 2945912 3041559 3146398 3258596 3375269 3493488
61242C493488J16302J09120R5510P6343N2963K5619n198l7077o6949r3140j14893
$$ 3493488 3609790 3718910 3814420 3890763 3943726 3969345 3964147 3927070 3860121 3766981 3652088
61231C652088j30908j40111j43246j42293j38633j32826j25532j17384j08422
$$ 3652088 3521180 3381069 3237823 3095530 2956897 2824071 2698539 2581155 2472733
61222B472733r8802q9543q1603p4795o8472o2649n7503n2548m7374m2479l8334
$$ 2472733 2373931 2284388 2202785 2127990 2059518 1996869 1939366 1886818 1839444 1796965 1758631
61211A758631l4376l0006k5745k2311j9276j5838j2140q674n147j264K106L918
$$ 1758631 1724255 1694249 1668504 1646193 1626917 1611079 1598939 1590265 1585118 1583854 1585960 1589878
61199A589878M573N290O373P277P807P985P273N259K660M47j564m064o792q994
$$ 1589878 1594451 1599741 1606114 1613391 1621198 1629183 1636456 1641715 1644375 1644822 1643258 1639194 1632402 1623408
61185A623408j0795j2784j4708j5891j6512j7209j7910j8268j8757j9867k0806
$$ 1623408 1612613 1599829 1585121 1569230 1552718 1535509 1517599 1499331 1480574 1460707 1439901
61174A439901k0488j9419j9014j9352j9360j8941j9220k0524k1808k2377k2756
$$ 1439901 1419413 1399994 1380980 1361628 1342268 1323327 1304107 1283583 1261775 1239398 1216642
61163A216642k3518k4477k5374k6283k7008k7043k6345k5336k4063k2286k0354
$$ 1216642 1193124 1168647 1143273 1116990 1089982 1062939 1036594 1011258 987195 964909 944555
61152I44555j9037j8334j7445j6067j4831j4342j4541j5077j5612j5768j5417
$$ 944555 925518 907184 889739 873672 858841 844499 829958 814881 799269 783501 768084
61141G68084j4964j4725j4293j3111j1407r758q168o348m532l089j726m6J494
$$ 768084 753120 738395 724102 710991 699584 689826 681658 675310 670778 667689 665963 665917 667411
61128F67411K186K326K805L759M636N351O231P108P531P667P954Q174P910P623
$$ 667411 669597 671923 674728 678487 683123 688474 694705 701813 709344 717011 724965 733139 741049 748672
61114G48672Q074R024R646R943J0436J0804J0299R306Q936R042Q247O153L951
$$ 748672 756746 765770 775416 785359 795795 806599 816898 826204 835140 844182 852429 858582 862533
61101H62533K433R12j281l464m631m914n253o170p472q708r525r853r918r876
$$ 862533 864966 865878 864597 861133 856502 851588 846335 840165 832693 823985 814460 804607 794689 784813
61087G84813r556q892q346q354q650q692q444q106p475o328n095m375m068l756
$$ 784813 775257 766365 758019 749665 741015 732323 723879 715773 708298 701970 696875 692500 688432 684676
61073F84676l492l456l275k610j921j759j744j237n76n70j178j687j813j694j328
$$ 684676 681184 677728 674453 671843 669922 668163 666419 665182 664606 664036 662858 661171 659358 657664 656336
61058F56336q78r84j756k226j769j242j461j624p46L45K67n00l69P97J902K761
$$ 656336 655458 654474 652718 650492 648723 647481 646020 644396 643650 643995 644262 643762 643393 644190 646092 648853
61042F48853M019N351N941O348P690R312R554Q713Q765J0123J1131J0954J0579
$$ 648853 652872 658223 664164 670512 678202 687514 697068 705781 714546 724669 735800 746754 757333
61029G57333J0591J0353R867J0100J0897J0832R748R173R680J0136J0226J1243
$$ 757333 767924 778277 788144 798244 809141 819973 829721 838894 848574 858710 868936 880179
61017H80179J3457J5152J5418J5645J7003J8655J9735K1055K3361K5831K7648
$$ 880179 893636 908788 924206 939851 956854 975509 995244 1016299 1039660 1065491 1093139
61006A093139K9409L1676L3918L6047L9231M3991M9268N4292N9427O4298O7514
$$ 1093139 1122548 1154224 1188142 1224189 1263420 1307411 1356679 1410971 1470398 1534696 1602210
60995A602210O9486P2881P8868Q5656R2406J01451J14330J28615J41628J54550
$$ 1602210 1671696 1744577 1823445 1909101 2001507 2102958 2217288 2345903 2487531 2642081
60985B642081J69798J87018K05447K27789K57700K95461L40380L95279M63627
$$ 2642081 2811879 2998897 3204344 3432133 3689833 3985294 4325674 4720953 5184580
60976E184580N44528O36687P45681Q80293J043751J239053J481031J781146K102375
$$ 5184580 5729108 6365795 7111476 7991769 9035520 10274573 11755604 13536750 15639125
60967A5639125K339645K373294K157374J751185J263746P83188L68978Q6486N37
$$ 15639125 17978770 20352064 22509438 24260623 25524369 26307557 26676535 26763021 26763558
60958B6763558J09166L00648M08017L19486L4914l73296q28328j271626j647567
$$ 26763558 26872724 27173372 27581389 27900875 27935789 27562493 26734165 25462539 23814972
60949B3814972j903277k014392j998173j893518j734085j542750j340031j145452
$$ 23814972 21911695 19897303 17899130 16005612 14271527 12728777 11388746 10243294
60941A0243294r71323q21774o97944o00080n25293m67739m22201l85449l54663
$$ 10243294 9271971 8450197 7752253 7152173 6626880 6159141 5736940 5351491 4996828
60932D996828l27151l01920k79378k59222k40143k21554k03880j87033j70291
$$ 4996828 4669677 4367757 4088379 3829157 3589014 3367460 3163580 2976547 2806256
60923B806256j53894j39379j27887j19169j12372j06771j01648r6501r1534q7122
$$ 2806256 2652362 2512983 2385096 2265927 2153555 2046784 1945136 1848635 1757101 1669979
60913A669979q2755p7502p1454o5629o0466n5448n0390m5922m2390l9336l6416
$$ 1669979 1587224 1509722 1438268 1372639 1312173 1256725 1206335 1160413 1118023 1078687 1042271
60902A042271l3895l1787k9540k7041k5021k3792k2516k0425j8006j6116j4627
$$ 1042271 1008376 976589 947049 920008 894987 871195 848679 828254 810248 794132 779505
60891G79505j2830j0746r045p954o994n652l733j368P37J525Q69J61P10J906K073
$$ 779505 766675 755929 746884 738930 731936 726284 722551 721183 721920 723445 724314 724475 725185 727091 729164
60876G29164Q79l41o53n93q89j351j568j696j886j747j037k37P2k03j084k742
$$ 729164 730043 729702 729049 728456 727567 726216 724648 722952 721066 719319 718282 718045 718117 717914 716830 714088
60860G14088m721n794n339m255l772l961m128m037l845l360k301r27M06J889L688
$$ 714088 709367 703573 698234 693979 690207 686246 682118 678081 674236 670876 668575 667648 668054 669943 673631
60845F73631N139N581N583O307P846R250J0009J0445J0702J0440R722R185R068
$$ 673631 678770 684351 689934 696241 704087 713337 723346 733791 744493 754933 764655 773840 782908
60832G82908Q875Q304P786P852Q461R203R643R449Q596P552O802O324N899N598
$$ 782908 791783 800087 807873 815725 824186 833389 843032 852481 861077 868629 875431 881755 887654 893252
60818H93252N368M614L015J455J087J625J710R03R2j83o07j773l173m093m787
$$ 893252 898620 903234 906249 907704 908791 910416 912126 913029 913121 912938 912331 910558 907385 903292 898505
60803H98505n990p754r360j0115r957r472r412r939j0393j0153r409q627p662
$$ 898505 892515 884761 875401 865286 855329 845857 836445 826506 816113 805960 796551 787924 780262
60790G80262o166m551l521k858j760k76P46J246K195M040N969P246Q176R283J0439
$$ 780262 774096 769545 766024 763166 761406 761130 761876 763122 765317 769357 775326 782572 790748 800031 810470
60775H10470J1314J1989J2581J2912J2941J2983J3187J3314J3123J2437J0919
$$ 810470 821784 833773 846354 859266 872207 885190 898377 911691 924814 937251 948170
60764I48170Q538O192M899M345L322J635L83K16N30P67J229K095K783K923L007
$$ 948170 956708 962900 967799 972144 975466 977101 977484 977700 978230 978997 980226 982321 985104 988027 991034
60749I91034L445L887M008M102M347M379M010L621L358K851K003J195M22p63k117
$$ 991034 994479 998366 1002374 1006476 1010823 1015202 1019212 1022833 1026191 1029042 1031045 1032240 1032662 1031899 1029782
60734A029782k703k395k151k369k288j594j247j908k891l426l734l998l610k408
$$ 1029782 1027079 1024684 1022533 1020164 1017876 1016282 1015035 1013127 1010236 1006810 1003076 999078 995468 993060
60720I93060j406j213r67R7J233J516J357J354Q27r83l286m840n798o881p643
$$ 993060 991654 990441 989474 989571 990804 992320 993677 995031 995858 994875 991589 986749 980951 974070 966427
60705I66427p313o681p214q648r232q293o851n729m657l450k593k207j645n31
$$ 966427 959114 952433 945219 936571 927339 919046 912195 906466 901809 898359 895766 893559 891914 891383
60691H91383O57J352J504J221M89n23j478k283l109m054n193o731q564j0033j0596
$$ 891383 892040 893392 894896 896117 896606 896083 894605 892322 889213 885159 879966 873235 864671 854638 844042
60676H44042j0522j0350j0098r534q823q201p440o310n154m363l646k592j451
$$ 844042 833520 823170 813072 803538 794715 786514 779074 772764 767610 763247 759601 757009 755558
60663G55558o82j38M73Q01L81m23q50r00j168j779k309k552k579k257j359j15
$$ 755558 754876 754738 755211 756012 756393 755970 755120 754220 753052 751273 748964 746412 743833 741576 740217 740102
60647G40102R96J799K312K425K144J778J436P83j94q32p26m18m59m47L31J852
$$ 740102 741098 742897 745209 747634 749778 751556 752992 753775 753581 752749 752023 751605 751146 750699 751030 752882
60631G52882L628N303O381O234N258N117O781R092J0447J1091J2408J4590J6492
$$ 752882 756510 761813 768194 774428 779686 784803 791584 800676 811123 822214 834622 849212 865704
60618H65704J7428J7786J7998J8120J8246J8277J7552J5724J3639J2210J0880
$$ 865704 883132 900918 918916 937036 955282 973559 991111 1006835 1020474 1032684 1043564
60607A043564Q520N500L376K597J966M46j764m124o494q671j0219j1166j2101
$$ 1043564 1052084 1057584 1060960 1063557 1065523 1065969 1064205 1060081 1053587 1044916 1034697 1023531 1011430
60594A011430j3346j4604j5451j5546j4484j2206r499p382o070n115m300l773
$$ 1011430 998084 983480 968029 952483 937999 925793 916294 908912 902842 897727 893427 889654
60582H89654l498l359l459l742l705l235l137l974m910m771l772l041k810k310
$$ 889654 886156 882797 879338 875596 871891 868656 865519 861545 856635 851864 848092 845051 842241 839931
60568H39931j112N32K449M470N871O063N648N677O107O132N721N533N537N073
$$ 839931 838819 839351 841800 846270 852141 858204 863852 869529 875636 881768 887489 893022 898559 903632
60554I03632M156L388K667J346k77j036n83K14P67J432K545L900N463P526R979
$$ 903632 907788 911176 913843 915189 914912 913876 913293 913507 914274 915706 918251 922151 927614 935140 945119
60539I45119J2401J4957J8200K1875K4956K6904K7889K7786K6039K2632J8090
$$ 945119 957520 972477 990677 1012552 1037508 1064412 1092301 1120087 1146126 1168758 1186848
60528A186848J2472N481k296r366j4705j8259k0151k0479j9784j8498j5955j1263
$$ 1186848 1199320 1204801 1202505 1193139 1178434 1160175 1140024 1119545 1099761 1081263 1065308 1054045
60516A054045n134M43M510P754J0652J2602J3252J3244J3114J2688J2153J2397
$$ 1054045 1048911 1049354 1053864 1061618 1072270 1084872 1098124 1111368 1124482 1137170 1149323 1161720
60504A161720J3620J4867J5690J7217K0732K6068L2303L9234M7284N6508O6468
$$ 1161720 1175340 1190207 1205897 1223114 1243846 1269914 1302217 1341451 1388735 1445243 1511711
60493A511711P6917Q8089J00448J14441J30178J47334J65601J85193K06606K29974
$$ 1511711 1588628 1676717 1777165 1891606 2021784 2169118 2334719 2519912 2726518 2956492
60483B956492K54822K79555L00423L11572L07480K85281K44410J85240J10092
$$ 2956492 3211314 3490869 3791292 4102864 4410344 4695625 4940035 5125275 5235367
60474E235367K5177o0525j39016k05160k55634k88352l03588l04096k93283k74161
$$ 5235367 5260544 5200019 5061003 4855843 4600209 4311857 4008269 3704173 3410890 3136729
60464C136729k50038k24493j99894j77033j56496j39133j24770j11970r9823q8838
$$ 3136729 2886691 2662198 2462304 2285271 2128775 1989642 1864872 1752902 1653079 1564241
60454A564241p9550p1512o4248n7960n2601m7468m2394l8160l5043l2152k9048
$$ 1564241 1484691 1413179 1348931 1290971 1238370 1190902 1148508 1110348 1075305 1043153 1014105
60443A014105k6774k6292k6774k6566k5159k3248k1451j9787j8159j6588j5171
$$ 1014105 987331 961039 934265 907699 882540 859292 837841 818054 799895 783307 768136
60432G68136j4082j3324j2479j1234j0061r567r272q137o316n108m973m838l848
$$ 768136 754054 740730 728251 717017 706956 697389 688117 679980 673664 668556 663583 658745 654897
60419F54897k520j656j222r17p31m29N14J892K728K755K909L739M441M159L237
$$ 654897 652377 650721 649499 648582 647851 647422 647936 649828 652556 655311 658220 661959 666400 670559 673796
60404F73796K447J984J933K682M103N113M976M324M198M807N734O631P094O610
$$ 673796 676243 678227 680160 682842 686945 692058 697034 701358 705556 710363 716097 722728 729822 736432
60390G36432N324M190L782L657L282K853K702K612K277J743J022l6j262k265l215
$$ 736432 741756 745946 749728 753385 756667 759520 762222 764834 767111 768854 769876 769840 768578 766313 763098
60375G63098m575n933o225n374m521m210l689k412j015j30N01J156J513J578K020
$$ 763098 758523 752590 746365 740991 736470 732260 728571 726159 725144 725014 725515 726671 728184 729762 731782
60360G31782K885L176K379J373J141J651K606M026N448N875N353N253O195P040
$$ 731782 734667 737843 740222 741595 742736 744387 746993 751019 756467 762342 767695 772948 779143 786183
60346G86183O904O727P632R008R594R430R411R661R623R074Q113O862N912O213
$$ 786183 793087 799814 807446 816454 826048 835478 844889 854550 864173 873247 881360 888222 894134 900347
60332I00347P692Q996R452J0188J2367J5437J8150K0215K1739K2204K1296J9717
$$ 900347 908039 917035 926487 936675 949042 964479 982629 1002844 1024583 1046787 1068083 1087800
60320A087800J7856J4612Q917J640n325j1053j5450j8098j8756j8301j7779j6996
$$ 1087800 1105656 1120268 1129185 1130825 1125500 1114447 1098997 1080899 1062143 1043842 1026063 1009067
60308A009067j5378j3490j2343j1688j0430q367o310m784l726k973k154n82J703
$$ 1009067 993689 980199 967856 956168 945738 937371 931061 926277 922551 919578 917424 916842 918545
60295I18545L455L786L511L871M724N239N537O170O668O159M939M021L467K550
$$ 918545 922000 925786 929297 933168 937892 943131 948668 954838 961506 967665 972604 976625 980092 982642
60281I82642J244K03m01q14q15j51N18N21N92K010M435O152O400O202O764Q264
$$ 982642 983886 984089 983688 982874 982059 981908 982426 982947 983539 985549 989984 996136 1002536 1008738 1015502 1023766
60265A023766J0288J2427J4221J5466J6656J8542K1247K4402K7869L1604L5235
$$ 1023766 1034054 1046481 1060702 1076168 1092824 1111366 1132613 1157015 1184884 1216488 1251723
60254A251723L8505M1791M5491M9399N3451N8418O4854P1991P8726Q5179R2104
$$ 1251723 1290228 1332019 1377510 1426909 1480360 1538778 1603632 1675623 1754349 1839528 1931632
60243A931632R9259J05620J10883J15423J19021J20772J20212J17483J12594J05511
$$ 1931632 2030891 2136511 2247394 2362817 2481838 2602610 2722822 2840305 2952899 3058410
60233C058410R6808Q7174P6426O3963N0056L5834K2107R071l027j3761k2930l0399
$$ 3058410 3155218 3242392 3318818 3382781 3432837 3468671 3490778 3499849 3496822 3483061 3460131 3429732
60221C429732l5778l8907m0167l9719l6983l1602k4334j6205p410K163J2090K2078
$$ 3429732 3393954 3355047 3314880 3275161 3238178 3206576 3182242 3166037 3158627 3160790 3172880 3194958
60209C194958L2669M4196N5806O6690P7412Q8680R9529J08161J14042J17695J18885
$$ 3194958 3227627 3271823 3327629 3394319 3471731 3560411 3659940 3768101 3882143 3999838 4118723
60198D118723J16614J10695J01891R0723P7379O2539M6942L0374J2332o507k4637
$$ 4118723 4235337 4346032 4447923 4538646 4616025 4678564 4725506 4755880 4768212 4761705 4737068
60187D737068m1231n6155o8855p8533q5121q8905q9562q6805q1499p4752o6333
$$ 4737068 4695837 4639682 4570827 4492294 4407173 4318268 4228706 4141901 4060402 3985650 3919317
60176C919317n5412m2416k8697j4702j45J4404K7799M0026N1895O3024P1725P7027
$$ 3919317 3863905 3821489 3792792 3778090 3777945 3792349 3820148 3860174 3912069 3975093 4046818 4123845
60164D123845P9228P8458P4305O7066N7924M7571L5961K3502J1117q99j2658k3199
$$ 4123845 4203073 4281531 4355836 4422902 4480826 4528397 4564358 4587860 4598977 4598078 4585420 4562221
60152D562221l0696l4378l5010l3292k9089k2408j3736l119R817K4728M0623N7215
$$ 4562221 4531525 4497147 4462137 4428845 4399756 4377348 4363612 4360493 4370310 4395038 4435661 4492876
60140D492876P5038R4163J14063J34823J57055J80446K03773K26590K49562K72841
$$ 4492876 4567914 4662077 4776140 4910963 5068018 5248464 5452237 5678827 5928389 6201230
60130F201230K95352L15996L34290L49459L60218L65813L66231L61042L49179
$$ 6201230 6496582 6812578 7146868 7496327 7856545 8222358 8588589 8949631 9298810
60121I298810L30211L04760K73519K36947J96127J52568J06904N8880Q947m1301
$$ 9298810 9629021 9933781 10207300 10444247 10640374 10792942 10899846 10958726 10967673 10926372
60111A0926372r0459j37791j82104k21355k53915k79182k96651l05490l05531
$$ 10926372 10835913 10698122 10516018 10294663 10040748 9761566 9464915 9159425 8853894
60102H853894k97737k83389k63584k39641k12992j84379j54002j22468r0774n9433
$$ 8853894 8556157 8272768 8009184 7769543 7556551 7372172 7218170 7095702 7004928 6945495
60092F945495k8725L85K6711N0088P0849Q8160J00237J06169J06179J00262Q8225
$$ 6945495 6916770 6917155 6943866 6993954 7064803 7152963 7253200 7359369 7465548 7565810 7654035
60081G654035P1093N0785K8301L818k1402m5235o7080q8024j08118j25590j39565
$$ 7654035 7725128 7775913 7804214 7808032 7786630 7741395 7674315 7586291 7478173 7352583 7213018
60070G213018j51478j62552j71645j76984j78617j77708j74543j68745j60579
$$ 7213018 7061540 6898988 6727343 6550359 6371742 6194034 6019491 5850746 5690167
60061E690167j50710j39204j25846j10956r5115p8513o1239m3623k5723p144J2045
$$ 5690167 5539457 5400253 5274407 5163451 5068336 4989823 4928584 4884961 4859238 4852094 4864139
60050D864139L0879M8435O4628P9602R2947J03899J11756J15811J15508J10886
$$ 4864139 4895018 4943453 5008081 5087683 5180630 5284529 5396285 5512096 5627604 5738490
60040E738490J02318Q9853P3541N4260L3211J0763j3062l7130n9602p9842r8419
$$ 5738490 5840808 5930661 6004202 6058462 6091673 6102436 6089374 6052244 5992642 5912800 5814381
60029E814381j15074j28209j36770j41150j41797j38544j31870j23316j13768
$$ 5814381 5699307 5571098 5434328 5293178 5151381 5012837 4880967 4757651 4643883
60020D643883j02639q9466p5057o0308m5159k9468j3671K188J8899L6747N4844
$$ 4643883 4541244 4451778 4376721 4316413 4271254 4241786 4228115 4230303 4249202 4285949 4340793
60009D340793P2544R0341J08616J26582J43202J57931J69773J76948J78525J75304
$$ 4340793 4413337 4503678 4612294 4738876 4882078 5040009 5209782 5386730 5565255 5740559
59999E740559J68099J56265J39049J17387R3169O7478M0653J3313j3801m0467
$$ 5740559 5908658 6064923 6203972 6321359 6414528 6482006 6522659 6535972 6522171 6481704
59989F481704o6400r0379j10768j26587j37549j43546j44762j41774j35088j24982
$$ 6481704 6415304 6324925 6214157 6087570 5950021 5806475 5661713 5519939 5384851 5259869
59979E259869j12085r7457q1801o5296m8288l1299j4199L520K1389L8008N2765
$$ 5259869 5147784 5050327 4968526 4903230 4854942 4823643 4809444 4812964 4834353 4872361 4925126
59968D925126O6303P8888Q9595R7665J03342J06705J06947J03678R7738Q9994
$$ 4925126 4991429 5070317 5159912 5257577 5360919 5467624 5574571 5678249 5775987 5865981
59958E865981Q0341O8741N6211M3970L2535K2274J3879P681L579K150M567J0907
$$ 5865981 5946322 6015063 6071274 6115244 6147779 6170053 6183932 6191613 6195192 6197342 6201909 6212816
59946F212816J9964L1460M6857O6958R0314J15222J41978J71698K04101K37943
$$ 6212816 6232780 6264240 6311097 6378055 6468369 6583591 6725569 6897267 7101368 7339311
59936G339311K72567L07486L41194L71723L97703M17582M28569M27692M13402
$$ 7339311 7611878 7919364 8260558 8632281 9029984 9447566 9876135 10303827 10717229
59927A0717229L85082L41853K83403K11672J30509M4018m3709j27879k03618k67514
$$ 10717229 11102311 11444164 11727567 11939239 12069748 12113766 12070057 11942178 11738560 11471046
59917A1471046l17958l54308l76608l85922l84010l72669l53693l29058l00588
$$ 11471046 11153088 10798780 10422172 10036250 9652240 9279571 8925878 8596820 8296232
59908H296232k69603k37225k04449j71680j38817j06176p4544m4120j4202J5620
$$ 8296232 8026629 7789404 7584955 7413275 7274458 7168282 7093738 7049618 7035416 7051036
59898G051036M4869P3013R9786J24238J44663J59969J69993J73805J69129J54320
$$ 7051036 7095905 7168918 7268704 7392942 7537605 7697574 7867567 8041372 8210501 8364821
59888H364821J29842R7113N7186J1514l7261q6430j34126j78280k16139k46023
$$ 8364821 8494663 8591776 8648962 8660476 8623215 8536785 8402659 8224379 8008240 7762217
59878G762217k68453k84225k92598k92781k86192k75556k62395k46799k29100
$$ 7762217 7493764 7209539 6916941 6624160 6337968 6062412 5800017 5553218 5324118
59869E324118k10283j91087j71867j53156j35518j19225j04723r2733q3202p5069
$$ 5324118 5113835 4922748 4750881 4597725 4462207 4342982 4238259 4145526 4062324 3987255
59859C987255o7916o2884o0865o0762o0684o0091n9468n8611n6532n2643m7021
$$ 3987255 3919339 3856455 3795590 3734828 3674144 3614053 3554585 3495974 3439442 3386799 3339778
59848C339778l9937l2055k4548j8200j2953q995p355q638j2079j6724k2559k9510
$$ 3339778 3299841 3267786 3243238 3225038 3212085 3203090 3195735 3187097 3175018 3158294 3135735 3106225
59836C106225l6371m1944m6291m9790n1798n1483m9119m5387m0220l3520k6230
$$ 3106225 3069854 3027910 2981619 2931829 2880031 2828548 2779429 2734042 2693822 2660302 2634072
59825B634072j9445j3138o778l41O311J4043K3128L2152L9527M5284N0290N4595
$$ 2634072 2614627 2601489 2594711 2594370 2600681 2614724 2637852 2670004 2709531 2754815 2805105 2859700
59813B859700N7830O0333O2494O3801O3670O2340N9764N4785M6813L7278K7946
$$ 2859700 2917530 2977863 3040357 3104158 3167828 3230168 3289932 3344717 3391530 3428808 3456754
59802C456754J8871R592J246m411p261q266p394l909J960R356J8304K9199M1458
$$ 3456754 3475625 3485217 3486463 3482052 3474791 3466525 3459131 3455222 3457182 3466538 3484842 3514041 3555499
59789C555499N4349O8510Q4959J03204J22204J42553J65781J92015K20198K50193
$$ 3555499 3609848 3678358 3763317 3866521 3988725 4131278 4297059 4489074 4709272 4959465
59779D959465K82533L16170L47991L74075L89470L87454L61797L10735K37723
$$ 4959465 5241998 5558168 5906159 6280234 6669704 7057158 7418955 7729690 7967413
59770G967413J48914N1815m4279j29721j97964k46761k76149k87115k82428k66670
$$ 7967413 8116327 8168142 8123863 7994142 7796178 7549417 7273268 6986153 6703725 6437055
59760F437055k44195k17837j89661j61599j34822j09575q6060o4800m5948k9053
$$ 6437055 6192860 5975023 5785362 5623763 5488941 5379366 5293306 5228506 5182558 5153505
59750E153505j3469J681J7500L4265N0821O6147Q1062R7134J14439J31907J49528
$$ 5153505 5140036 5141717 5159217 5193482 5244303 5310450 5391512 5488646 5603085 5734992 5884520
59739E884520J68521J89434K11638K34798K59391K85705L13571L43225L75283
$$ 5884520 6053041 6242475 6454113 6688911 6948302 7234007 7547578 7890803 8266086
59730H266086M09753M45985M83340N20872N56674N88668O15678O36546O48856
$$ 8266086 8675839 9121824 9605164 10126036 10682710 11271378 11887056 12523602 13172458
59721A3172458O50144O40146O20593N93258N59891N23778M89601M61586M42811
$$ 13172458 13822602 14462748 15083341 15676599 16236490 16760268 17249869 17711455 18154266
59712A8154266M35742M41600M59223M86005N19735N58038N96474O29228O51762
$$ 18154266 18590008 19031608 19490831 19976836 20496571 21054609 21651083 22280311 22932073
59703B2932073O61195O54314O27489N79210N11290M27276L31168K27958J23840
$$ 22932073 23593268 24247582 24875071 25454281 25965571 26392847 26724015 26951973 27075813
59694B7075813K5053o2877j35132j88277k21166k34227k28026k03564j63407j10825
$$ 27075813 27100866 27037989 26902857 26714580 26493414 26259187 26031161 25827597 25664190 25553365
59684B5553365m7911K4251J03991J89333K79542L74596M73226N73085O72474P69737
$$ 25553365 25505454 25529705 25633696 25823029 26102571 26477167 26950393 27523478 28195952 28965689
59674B8965689Q60659R38173R94765J023442J016498R65883Q66225P17004N22435
$$ 28965689 29826348 30764521 31759286 32782728 33799226 34765109 35631334 36348338 36870773
59665C6870773K91307L7243k23026m73093o98668q87540j030839j125425j173599
$$ 36870773 37162080 37199323 36976297 36503204 35804536 34916996 33886157 32760732 31587133
59656C1587133j180076j150523j092932j018097r37626q62338q02216p65310p55114
$$ 31587133 30407057 29256534 28163602 27145505 26207879 25345541 24543325 23778015 23022901
59647B3022901p69468q02139q44540q86707r19459r37316r38830r24373q95038
$$ 23022901 22253433 21451294 20606754 19720047 18800588 17863272 16924442 16000069 15105031
59638A5105031q53527q03980p50028o94118o38694n86259n37887m93199m52093
$$ 15105031 14251504 13447524 12697496 12003378 11364684 10778425 10240538 9747339 9295246
59629I295246m15013l81399l49680l19280k91008k65203k41212k18945j99023
$$ 9295246 8880233 8498834 8149154 7829874 7538866 7273663 7032451 6813506 6614483
59620F614483j80950j63087j45136j28913j15880j05555r7028r0400q5957q3409
$$ 6614483 6433533 6270446 6125310 5996397 5880517 5774962 5677934 5587534 5501577 5418168
59610E418168q2763q4563q8600r3571r8620j03850j08905j12483j13746j12994
$$ 5418168 5335405 5250842 5162242 5068671 4970051 4866201 4757296 4644813 4531067 4418073
59600D418073j10621j06722j01943r7059r1509q3997p4823o5910n8219n0991m3815
$$ 4418073 4307452 4200730 4098787 4001728 3910219 3826222 3751399 3685489 3627270 3576279 3532464
59589C532464l7334l1422k4757j7075r872m111R21N694R382J1676J3727J6153
$$ 3532464 3495130 3463708 3438951 3421876 3412004 3407893 3408814 3414508 3423890 3435566 3449293 3465446
59577C465446J7842J7889J7134J6800J7143J8303K0907K4836K9044L3413L9202
$$ 3465446 3483288 3501177 3518311 3535111 3552254 3570557 3591464 3616300 3645344 3678757 3717959
59566C717959M6794N4838O2555P0961Q0786R1091J01299J12583J25765J39633
$$ 3717959 3764753 3819591 3882146 3953107 4033893 4124984 4226283 4338866 4464631 4604264
59556D604264J52970J66683J82187J99117K16334K33785K51571K68362K82523
$$ 4604264 4757234 4923917 5106104 5305221 5521555 5755340 6006911 6275273 6557796
59547F557796K93997L03402L10177L13196L12488L08704L01635K90806K77200
$$ 6557796 6851793 7155195 7465372 7778568 8091056 8399760 8701395 8992201 9269401
59538I269401K62835K48680K33953K17474J99046J79785J61613J46214J34138
$$ 9269401 9532236 9780916 10014869 10232343 10431389 10611174 10772787 10919001 11053139
59529A1053139J25321J20189J19297J21834J25760J29431J31712J30343J22087
$$ 11053139 11178460 11298649 11417946 11539780 11665540 11794971 11926683 12057026 12179113
59520A2179113J05123P9831M6717N383m3665r7848j54114k10266k63936l12043
$$ 12179113 12284236 12364067 12410784 12416167 12372502 12274654 12120540 11910274 11646338 11334295
59510A1334295l52372l84395m07659m21073m24820m21277m12681l99309l81101
$$ 11334295 10981923 10597528 10189869 9768796 9343976 8922699 8510018 8110709 7729608
59501G729608l59576l36692l13068k88683k64184k40271k16877j94142j73079
$$ 7729608 7370032 7033340 6720272 6431589 6167405 5927134 5710257 5516115 5343036
59492E343036j54235j36800j19988j04046q8924p3494n7213m1211k6392j1920
$$ 5343036 5188801 5052001 4932013 4827967 4739043 4665549 4608336 4567125 4540733 4528813
59482D528813L180J8283L2552M6784O2318P9011R5843J12664J30044J48113J66701
$$ 4528813 4531993 4550276 4582828 4629612 4691930 4770941 4866784 4979448 5109492 5257605 5424306
59471E424306J85791K04763K21946K35890K46222K52497K53233K46873K32719
$$ 5424306 5610097 5814860 6036806 6272696 6518918 6771415 7024648 7271521 7504240
59462G504240K10309J79229J40395R6143M8262k553n4579j04238j48606j87131
$$ 7504240 7714549 7893778 8034173 8130316 8178578 8176025 8121446 8017208 7868602 7681471
59452G681471k19716k44909k61589k70881k74695k73618k67776k58434k47056
$$ 7681471 7461755 7216846 6955257 6684376 6409681 6136063 5868287 5609853 5362797
59443E362797k33894k19044k03848j89661j76200j62569j49078j36634j25261
$$ 5362797 5128903 4909859 4706011 4516350 4340150 4177581 4028503 3891869 3766608
59434C766608j14429j04077r4223q4490p4996o6655n9677n2938m5705l8630l2180
$$ 3766608 3652179 3548102 3453879 3369389 3294393 3227738 3168061 3115123 3069418 3030788 2998608
59423B998608k5629j8720j2701q464n086j422K368N914R779J4372J9235K4320
$$ 2998608 2972979 2954259 2941558 2933094 2928008 2926586 2928954 2934868 2944647 2959019 2978254 3002574
59411C002574L0017L5123L7121L5838L4445L5274L7193L8961M2388M9693O0064
$$ 3002574 3032591 3067714 3104835 3140673 3175118 3210392 3247585 3286546 3328934 3378627 3438691
59400C438691P1561Q4326R9058J14196J27725J40344J53913J68266J82602J98793
$$ 3438691 3510252 3594578 3693636 3807832 3935557 4075901 4229814 4398080 4580682 4779475
59390D779475K19985K46642K76755L09297L44662L82268M20555M58806M96452
$$ 4779475 4999460 5246102 5522857 5832154 6176816 6559084 6979639 7438445 7934897
59381G934897N30909N58634N77819N87856N86937N73004N46868N11990M71367
$$ 7934897 8465806 9024440 9602259 10190115 10777052 11350056 11896924 12408914 12880281
59372A2880281M26753L80344L34665K90813K48768K09109J72334J37004J00702
$$ 12880281 13307034 13687378 14022043 14312856 14561624 14770733 14943067 15080071 15180773
59363A5180773O2480K2421k0474o7461j17428j67290k14553k57489k93431l19524
$$ 15180773 15243253 15265674 15245200 15177739 15060311 14893021 14678468 14420979 14127548 13808024
59353A3808024l35168l41607l39609l29832l15175l00152k87798k79096k75147
$$ 13808024 13472856 13131249 12791640 12461808 12146633 11846481 11558683 11279587 11004440
59344A1004440k77433k85702k97682l11159l24817l37196l46650l52410l54220
$$ 11004440 10727007 10441305 10143623 9832464 9507647 9170451 8823801 8471391 8117171
59335H117171l51362l43544l32088l18470l02436k83356k62657k42641k23646
$$ 8117171 7765809 7422265 7090177 6771707 6469271 6185915 5923258 5680617 5456971
59326E456971k04614j85877j68856j53444j38185j22925j08918r6412q4385p2600
$$ 5456971 5252357 5066480 4897624 4744180 4605995 4483070 4374152 4277740 4193355 4120755
59316D120755o1761n1675m1380l0945k1232j2077k651O729J5165K3127L1736M0612
$$ 4120755 4058994 4007319 3965939 3934994 3913762 3901685 3899034 3905763 3920928 3944055 3975791 4016403
59304D016403M8624N6262O4898P4161Q2421Q9502R6410J02770J07064J09150J09972
$$ 4016403 4065027 4121289 4186187 4260348 4342769 4432271 4528681 4631451 4738515 4847665 4957637
59293D957637J09095J05228R9024R2663Q6643P9746P2140O5691O1091N7371N4565
$$ 4957637 5066732 5171960 5270984 5363647 5450290 5530036 5602176 5667867 5728958 5786329 5840894
59282E840894N4112N6293N9938O4868P1972Q0489Q7950R3294R7358R9912R8935
$$ 5840894 5895006 5951299 6011237 6076105 6148077 6228566 6316516 6409810 6507168 6607080 6706015
59271F706015R3528Q4847P3426N8209L8995J7400n456k9716n4389p6702r4828
$$ 6706015 6799543 6884390 6957816 7016025 7055020 7072420 7066964 7037248 6982859 6906157 6811329
59260F811329j09050j19308j24006j22305j15534j05220r1735p5779n9125m2787
$$ 6811329 6702279 6582971 6458965 6336660 6221126 6115906 6024171 5948392 5889267 5846480
59250E846480k6269r495O345K0658L4224M7299N8808O8248P6521Q4096R0247R4978
$$ 5846480 5820211 5810716 5817061 5837719 5871943 5919242 5978050 6046298 6122819 6206915 6297162 6392140
59238F392140R9883J06169J13590J22170J33159J47413J64372J83546K05390K29841
$$ 6392140 6492023 6598192 6711782 6833952 6967111 7114524 7278896 7462442 7667832 7897673
59228G897673K55368K80079L02344L19788L29291L28543L16396K91538K52688
$$ 7897673 8153041 8433120 8735464 9055252 9384543 9713086 10029482 10321020 10573708
59219A0573708K00407J37057O4848j4223r6349j76148k49617l14987l70338m12711
$$ 10573708 10774115 10911172 10976020 10961797 10865448 10689300 10439683 10124696 9754358 9341647
59209I341647m40438m54514m56886m49133m33383m12602l89011l63531l37163
$$ 9341647 8901209 8446695 7989809 7540676 7107293 6694691 6305680 5942149 5604986
59200E604986l11301k86425k62212k39172k18411j99754j82036j65388j51048
$$ 5604986 5293685 5007260 4745048 4505876 4287465 4087711 3905675 3740287 3589239
59191C589239j38877j27380j16348j07082r9677r2664q5653p9790p5006o9610
$$ 3589239 3450362 3322982 3206634 3099552 2999875 2907211 2821558 2741768 2666762 2597152
59181B597152o3324n8001n4408n0832m5981m0794l6343l2228k8143k4677k1567
$$ 2597152 2533828 2475827 2421419 2370587 2324606 2283812 2247469 2215241 2187098 2162421 2140854
59170B140854j7442j2327q051n154j781L203Q465J2703J6564K0725K4458K7499
$$ 2140854 2123412 2111085 2103034 2097880 2096099 2099302 2107767 2120470 2137034 2157759 2182217 2209716
59158B209716L1071L5673L9986M3362M7224N2493N7828O1941O5662P0092P4727
$$ 2209716 2240787 2276460 2316446 2359808 2407032 2459525 2517353 2579294 2644956 2715048 2789775
59147B789775P9013Q3863Q9863R5654R9703J02339J04600J06502J07597J07823
$$ 2789775 2868788 2952651 3042514 3138168 3237871 3340210 3444810 3551312 3658909 3766732
59137C766732J06629J02863R6544Q9261Q1927P3795O4451N4913M5893L7041K8905
$$ 3766732 3873361 3976224 4072768 4162029 4243956 4317751 4382202 4437115 4483008 4520049 4548954
59126D548954K3569K2136K3402K6156L0919L8363M7935N9132P2313Q7294J02989
$$ 4548954 4572523 4594659 4618061 4644217 4675136 4713499 4761434 4820566 4892879 4980173 5083162
59115E083162J19201J36704J54919J71727J86295J99516K10733K16781K15418
$$ 5083162 5202363 5339067 5493986 5665713 5852008 6051524 6262257 6479038 6694456
59106F694456K06935J91240J66370J31773R0410M5836k45m5781q6612j19303j43623
$$ 6694456 6901391 7092631 7259001 7390774 7481184 7527020 7526775 7480994 7394382 7275079 7131456
59095G131456j60390j69160j70091j65753j58690j49175j37330j25407j15688
$$ 7131456 6971066 6801906 6631815 6466062 6307372 6158197 6020867 5895460 5779772
59086E779772j08047j01684r7418r6183r7102r9202j03272j09874j17235j23225
$$ 5779772 5671725 5570041 5472623 5376440 5279338 5180136 5076864 4966990 4849755 4726530
59076D726530j27964j32508j36567j39308j40871j41333j39846j36405j32670
$$ 4726530 4598566 4466058 4329491 4190183 4049312 3907979 3768133 3631728 3499058
59067C499058j29382j25046j18760j12205j06831j01478r4903q8447q3724p9715
$$ 3499058 3369676 3244630 3125870 3013665 2906834 2805356 2710453 2622006 2538282 2458567
59057B458567p4724o9469o5683o3208o0811n8424n6376n3981n0984m8801m8183
$$ 2458567 2383843 2314374 2248691 2185483 2124672 2066248 2009872 1955891 1904907 1856106 1807923
59046A807923m7395m4852m1738l9715l7970l4969l1393k8706k6382k3169j9687
$$ 1807923 1760528 1715676 1673938 1634223 1596253 1561284 1529891 1501185 1474803 1451634 1431947
59035A431947j7169j5019j2019q657n947l316p4K569L375L489M455N336M467K695
$$ 1431947 1414778 1399759 1387740 1379083 1373136 1369820 1369746 1372315 1375690 1379179 1383634 1388970 1393437 1396132
59021A396132K064K382J822Q3j577k720l715m142l351j899o06Q65K834M357M936
$$ 1396132 1398196 1400578 1402400 1402483 1400906 1398186 1394471 1390329 1386978 1385079 1384473 1385338 1388172 1392529 1397465
59006A397465N924Q217J0158R987Q773Q624R399R542Q783P778O485N062M885O434
$$ 1397465 1403389 1411606 1421764 1431751 1440524 1449148 1458547 1468089 1476872 1484650 1491135 1496197 1501082 1507516
58992A507516P812P582P212Q424J0059J0315J0066J0999J2314J2412J2147J3212
$$ 1507516 1515328 1522910 1530122 1538546 1548605 1558920 1568986 1579985 1592299 1604711 1616858 1630070
58980A630070J4775J5061J4832J5966J7851J8599J8697K0015K2194K3494K4324
$$ 1630070 1644845 1659906 1674738 1690704 1708555 1727154 1745851 1765866 1788060 1811554 1835878
58969A835878K6495K9669L1916L3231L5191L7659L9130L9788M1019M2330M2024
$$ 1835878 1862373 1892042 1923958 1957189 1992380 2030039 2069169 2108957 2149976 2192306 2234330
58958B234330M0632M0418M1670M2656M3117M4731M8011N1695N5371N9984O5556
$$ 2234330 2274962 2315380 2357050 2399706 2442823 2487554 2535565 2587260 2642631 2702615 2768171
58947B768171P0918P5879Q1432Q7834R4627J02236J11485J21824J32116J42632
$$ 2768171 2839089 2914968 2996400 3084234 3178861 3281097 3392582 3514406 3646522 3789154
58937C789154J54243J66560J78998J92720K09095K27280K45909K65991K89374
$$ 3789154 3943397 4109957 4288955 4481675 4690770 4918050 5163959 5429950 5719324
58928E719324L15449L42394L70785M02682M37935M74611N12622N53490N96764
$$ 5719324 6034773 6377167 6747952 7150634 7588569 8063180 8575802 9129292 9726056
58919I726056O39783O80912P19984P55475P83930Q02095Q07053P94643P60553
$$ 9726056 10365839 11046751 11766735 12522210 13306140 14108235 14915288 15709931 16470484
58910A6470484P03095O22823N20311L97078K58137J10845l8372j83710l17857
$$ 16470484 17173579 17796402 18316713 18713791 18971928 19082773 19044401 18860691 18542834
58901A8542834m33830n28918o03960o59266o94325p10935p13102p03745o84388
$$ 18542834 18109004 17580086 16976126 16316860 15622535 14911600 14198498 13494753 12810365
58892A2810365o57761o27483n95058n60085n23383m87194m52583m19444l88670
$$ 12810365 12152604 11525121 10930063 10369978 9846595 9359401 8906818 8487374 8098704
58883H098704l61455l36780l12659k89547k69498k52442k36441k21216k08062
$$ 8098704 7737249 7400469 7087810 6798263 6528765 6276323 6039882 5818666 5610604
58874E610604j96588j84873j72710j61466j50897j39543j28064j18652j11074
$$ 5610604 5414016 5229143 5056433 4894967 4744070 4604527 4476463 4357811 4246737
58865D246737j02777r3173q4376p7421p1007o4381n8270n2615m6363l9871l4584
$$ 4246737 4143960 4050787 3966411 3888990 3817983 3753602 3695332 3642717 3596354 3556483 3521899
58854C521899l0204k5009j8925j3254p622m83P528J4263K0016K7284L6350M4769
$$ 3521899 3491695 3466686 3447761 3434507 3426885 3426402 3433930 3448193 3468209 3495493 3531843 3576612
58842C576612N1561N8458O6481P4715Q3003R2478J02899J12674J22073J33215
$$ 3576612 3628173 3686631 3753112 3827827 3910830 4003308 4106207 4218881 4340954 4474169
58832D474169J46464J60008J73389J88254K05230K23275K42557K64669K89640
$$ 4474169 4620633 4780641 4954030 5142284 5347514 5570789 5813346 6078015 6367655
58823F367655L15907L43561L74377M08392M43814M80580N20378N62789O04929
$$ 6367655 6683562 7027123 7401500 7809892 8253706 8734286 9254664 9817453 10422382
58814A0422382O45225O83860P18781P45027P58705P58160P40749P02318O40902
$$ 10422382 11067607 11751467 12470248 13215275 13973980 14732140 15472889 16175207 16816109
58805A6816109N57605M53481L29465J90328M4791r9534k38102l65909m76312n65104
$$ 16816109 17373714 17827195 18156660 18346988 18391779 18292245 18054143 17688234 17211922 16646818
58795A6646818o32491o79798p07517p17576p14023o99939o76591o46414o13450
$$ 16646818 16014327 15334529 14627012 13909436 13195413 12495474 11818883 11172469 10559019
58786A0559019n79859n45208n10151m77317m47592m19050l90724l64101l39893
$$ 10559019 9979160 9433952 8923801 8446484 7998892 7579842 7189118 6825017 6485124
58777F485124l16747k94285k74109k56671k40435k25035k11965k01205j90637
$$ 6485124 6168377 5874092 5599983 5343312 5102877 4877842 4665877 4464672 4274035
58768D274035j79704j70092j61920j52916j42399j32314j23394j14024j03962
$$ 4274035 4094331 3924239 3762319 3609403 3467004 3334690 3211296 3097272 2993310
58759B993310r5287q8486q1437p3483o6591o1341n5776m9487m4756m2180l9327
$$ 2993310 2898023 2809537 2728100 2654617 2588026 2526685 2470909 2421422 2376666 2334486 2295159
58748B295159l5291l2407l1771l1177k9371k8242k8865k9356k8652k8488k9602
$$ 2295159 2259868 2227461 2195690 2164513 2135142 2106900 2078035 2048679 2020027 1991539 1961937
58737A961937k9905k8516k7679k8545k8887k7265k5650k5638k5752k4790k4245
$$ 1961937 1932032 1903516 1875837 1847292 1818405 1791140 1765490 1739852 1714100 1689310 1665065
58726A665065k5080k5652k5036k4934k6166k6878k6348k6717k8719k9583k7583
$$ 1665065 1639985 1614333 1589297 1564363 1538197 1511319 1484971 1458254 1429535 1399952 1372369
58715A372369k4947k3756k2687k0368j8283j7646j6874j4860j3384j3647j3756
$$ 1372369 1347422 1323666 1300979 1280611 1262328 1244682 1227808 1212948 1199564 1185917 1172161
58704A172161j2202j0456r791q855o914n908o841p534o540n767o707p587o881
$$ 1172161 1159959 1149503 1139712 1130857 1123943 1118035 1111194 1103660 1097120 1091353 1084646 1077059 1070178
58691A070178o085o424o274m571l253l709m234l657l872o127q344q858r215j0589
$$ 1070178 1064093 1057669 1051395 1046824 1043571 1039862 1035628 1031971 1028099 1021972 1013628 1004770 995555 984966
58677I84966j1080r375p386o582n393k945j443j976k015q4J260J74r02K45J693
$$ 984966 973886 964511 957125 950543 945150 942205 940762 938786 936771 936687 937947 938121 937219 937464 939157
58662I39157J576J854M121N737M392K576L250M652L797J894J669K284J198j381
$$ 939157 940733 942587 946708 952445 956837 959413 962663 967315 971112 973006 974675 976959 978157 976776
58648I76776l781o078q440q915o310k543R04N749J3067K0204K4890K8903L4219
$$ 976776 972995 966917 958477 949562 943252 940709 941613 947362 960429 980633 1005523 1034426 1068645
58635A068645L9179M2144M5189N0261N5402N8714O2432O8990P6709Q3584R1549
$$ 1068645 1107824 1149968 1195157 1245418 1300820 1359534 1421966 1490956 1567665 1651249 1742798
58624A742798J02669J14760J25461J36996J52161J69030J84438J99304K15514
$$ 1742798 1845467 1960227 2085688 2222684 2374845 2543875 2728313 2927617 3143131
58615C143131K30644K40749K45343K44749K35626K14441J82768J44365R9768M8764
$$ 3143131 3373775 3614524 3859867 4104616 4340242 4554683 4737451 4881816 4981584 5030348
58605E030348m536n4248r8158j36182j66115j85675j96369k00901j99246j91403
$$ 5030348 5025812 4971564 4873406 4737224 4571109 4385434 4189065 3988164 3788918 3597515
58595C597515j80835j70662j59505j45605j31664j20821j11416j00802r0795q3952
$$ 3597515 3416680 3246018 3086513 2940908 2809244 2688423 2577007 2476205 2385410 2301458
58585B301458p7931o9401o0320n4421n0513m5286l9837l7296l6588l4674l2434
$$ 2301458 2223527 2154126 2093806 2039385 1988872 1943586 1903749 1866453 1829865 1795191 1762757
58574A762757l2287l2566l0444k7986k8942l1834l2564l1708l2686l4761l4397
$$ 1762757 1730470 1697904 1667460 1639474 1610532 1578698 1546134 1514426 1481740 1446979 1412582
58563A412582l1994l0793l0659k9022k6562k5845k5909k4179k2054k2472k3758
$$ 1412582 1380588 1349795 1319136 1290114 1263552 1237707 1211798 1187619 1165565 1143093 1119335
58552A119335k2059j8290j6351j6065j4255j1294j0106j0105q544o556p325r522
$$ 1119335 1097276 1078986 1062635 1046570 1032315 1021021 1010915 1000810 992266 985710 978385 968863
58540I68863r134o690o091p220o417l515j865j880q75J133J529N03N09J034l93
$$ 968863 959729 953039 946948 939728 933311 929796 927931 926051 925176 926309 927838 928341 928850 929884 929491
58525I29491k907l772l887o032q964r457q745j0486j3636j3949j1541j0328j0895
$$ 929491 926584 922812 918925 912893 903929 894472 885727 875241 861605 847656 836115 825787 814892
58512H14892j0536r448j0083j1235r489n858m343m745l592j271j232k897k448
$$ 814892 804356 794908 784825 773590 764101 758243 753900 749155 745563 744292 743060 740163 737715
58499G37715p2N63m86J36K082J871m5M1J738J242j031r48J397J679n89j438k6
$$ 737715 737643 738206 737720 737856 739938 741809 741764 741805 743543 744785 743754 742806 744203 745882 745293 743855 743829
58482G43829L63p60m14J384J530M59J752M897N590L503K698M037M328L262L989
$$ 743829 744192 743432 743018 744402 745932 746391 748143 753040 758630 762133 764831 768868 773196 776458 780447
58467G80447O429P129O099O715Q681Q247N557M516N274M178J188j23Q2j876n659
$$ 780447 786876 794005 800104 806819 815500 823747 829304 833820 839094 843272 844460 844337 844419 842543 836884
58452H36884p358p249r159j2291j2011q837q013r939r771o965o207q074p864m791
$$ 836884 829526 822277 813118 800827 788816 779979 771966 762027 752256 745291 739084 731010 723146 718355
58438G18355l411m585l957q58J67j769k251l32j95k421k498L20J414j98j36K373
$$ 718355 714944 710359 706402 705544 705711 703942 701691 701359 701164 698743 696245 696565 697979 697781 697645 700018
58422G00018K793M11J48L202M921M023M849Q279R706Q261Q856J2504J3985J1712
$$ 700018 702811 703222 703370 706572 711493 715516 720365 728644 738350 746611 755467 767971 781956 793668
58408G93668J0652J2712J3472J1304J0463J2156J1837Q372O663Q046P371K801
$$ 793668 804320 817032 830504 841808 852271 864427 876264 884636 891299 899345 906716 909517
58396I09517p26r08j692m384m618j453r9k267l083q01K0j855j398K549M268J839
$$ 909517 908791 907883 906191 901807 897189 895736 895637 893370 890287 889486 889506 887651 886253 888802 893070 894909
58380H94909Q42L661N247L431L205O554Q200N851M613O853P751N302M460O891
$$ 894909 895751 899412 904659 908090 911295 917849 926049 931900 936513 943366 951117 956419 960879 967770
58366I67770P029K916N69K789M146J886J120M110N192J704o22J427K830Q42M78
$$ 967770 974799 977715 978284 981073 985219 987105 988225 992335 997527 999231 998609 1000036 1002866 1003708 1004186
58351A004186M027N853L327K093M901O074K857J096L858N455K845J680M959P056
$$ 1004186 1008213 1014066 1017393 1019486 1024387 1030461 1033318 1034414 1038272 1043727 1046572 1048252 1053211 1060267
58337A060267N152N050R419J2049J0133J0164J5076J7879J4900J2816J5429J6242
$$ 1060267 1065419 1070469 1079888 1091937 1102070 1112234 1127310 1145189 1160089 1172905 1188334 1204576
58325A204576J1689Q779J1638J3308R212N935Q179R874O842N343R221J1606Q456
$$ 1204576 1216265 1225044 1236682 1249990 1259202 1265137 1273316 1283190 1290032 1295375 1304596 1316202 1324658
58312A324658P192J2568J7115J5098J2735J5081J6293J2604J1188J6039J8965
$$ 1324658 1331850 1344418 1361533 1376631 1389366 1404447 1420740 1433344 1444532 1460571 1479536
58301A479536J4942J2229J6707K0623J7902J5938K0691K4820K2388K0579K4758
$$ 1479536 1494478 1506707 1523414 1544037 1561939 1577877 1598568 1623388 1645776 1666355 1691113
58290A691113K6995K1895J8476K3440K8083K5020K2219K6759L0696K7401K5633
$$ 1691113 1718108 1740003 1758479 1781919 1810002 1835022 1857241 1884000 1914696 1942097 1967730
58279A967730L2360L7951L4063L0036L5350M1915M0424L8174M3531M8779M5814
$$ 1967730 2000090 2038041 2072104 2102140 2137490 2179405 2219829 2258003 2301534 2350313 2396127
58268B396127M2917M8325N3309M9381M5730N1444N7302N3978N0964N8073O5683
$$ 2396127 2439044 2487369 2540678 2590059 2635789 2687233 2744535 2798513 2849477 2907550 2973233
58257B973233O3380O0429O7228P4517P2100O9821P8282Q7484Q6794Q6721R7969
$$ 2973233 3036613 3097042 3164270 3238787 3310887 3380708 3458990 3546474 3633268 3719989 3817958
58246C817958J08931J07844J06678J18191J30577J30797J31174J45386J60523
$$ 3817958 3926889 4034733 4141411 4259602 4390179 4520976 4652150 4797536 4958059
58237D958059J61718J61848J76781J94199J98236K01566K20376K41548K48654
$$ 4958059 5119777 5281625 5458406 5652605 5850841 6052407 6272783 6514331 6762985
58228F762985K55929K80976L09113L21843L34377L66134M01366M20146M40049
$$ 6762985 7018914 7299890 7609003 7930846 8265223 8631357 9032723 9452869 9892918
58219I892918M83763N34569N69750O07589O72789P47424Q07793Q76202R80943
$$ 9892918 10376681 10911250 11481000 12088589 12761378 13508802 14316595 15192797 16173740
58210A6173740J100429J206371J324958J491600J685526J878593K105397K408664
$$ 16173740 17274169 18480540 19805498 21297098 22982624 24861217 26966614 29375278
58202B9375278K762410L134822L577201M156024M851759N631600O560346P716140
$$ 29375278 32137688 35272510 38849711 43005735 47857494 53489094 60049440 67765580
58194F7765580R068933J0593640J2427223J4737076J7534331K0844924K4877615
$$ 67765580 76834513 87428153 99855376 114592452 132126783 152971707 177849322
58187A77849322K9493900L3399025L4402922L0965117K3393650J3362263K560556
$$ 177849322 207343222 240742247 275145169 306110286 329503936 342866199 345426755
58180C45426755p859421j6893577k3532054k7260771k8381308k7620841k5606573
$$ 345426755 337567334 320673757 297141703 269880932 241499624 213878783 188272210
58173A88272210k2804882j9682118j6650885j3923387j1563144r621693q124348
$$ 188272210 165467328 145785210 129134325 115210938 103647794 94026101 85901753
58166H5901753o996326o115832n409775m836335m329533l832366l346256k892743
$$ 85901753 78905427 72789595 67379820 62543485 58213952 54381586 51035330 48142587
58158D8142587k460170k025885j589973j152463o92659j88738L80422J038710
$$ 48142587 45682417 43656532 42066559 40914096 40221437 40032699 40413121 41451831
58150D1451831J731173K231616K246739J676701P06136l96246j476173k449891
$$ 41451831 43183004 45414620 47661359 49338060 50044196 49647950 48171777 45721886
58142D5721886l190897l586984l661062l532724l285130k946089k563358k205255
$$ 45721886 42530989 38944005 35282943 31750219 28465089 25519000 22955642 20750387
58134B0750387j894400j612517j364726j178477j047758r37246q37234p63538
$$ 20750387 18855987 17243470 15878744 14700267 13652509 12715263 11878029 11114491
58126A1114491p10005o51118n86920n39303n07916m72064m31456m04021l87839
$$ 11114491 10404486 9753368 9166448 8627145 8119229 7647165 7215709 6811688 6423849
58117F423849l64018l33203l12213k98916k76245k46545k27238k16597j97817
$$ 6423849 6059831 5726628 5414415 5115499 4839254 4592709 4365471 4148874 3951057
58108C951057j73088j60231j58655j51102j36610j30297j32304j27427j14572
$$ 3951057 3777969 3617738 3459083 3307981 3171371 3041074 2908770 2781343 2666771
58099B666771j07470j06971j00422q7745q1447q1461p5776o5063o1549o4477o1332
$$ 2666771 2559301 2452330 2351908 2264163 2182716 2101255 2025479 1960416 1898867 1834390 1773058
58088A773058n2300m9313n1926m8173l8529l5385l9174l8219l1948l1452l6848
$$ 1773058 1720758 1671445 1619519 1571346 1532817 1497432 1458258 1420039 1388091 1356639 1319791
58077A319791l6560k9596k6865k9708k8241k1754k0012k3431k2094j5444j3243
$$ 1319791 1283231 1253635 1226770 1197062 1168821 1147067 1127055 1103624 1081530 1066086 1052843
58066A052843j6143j4751q857q134j2760j2539o676n389j0273j1715p780p267
$$ 1052843 1036700 1021949 1013092 1004958 992198 979659 972983 967594 957321 945606 937826 930559
58054I30559j1693j2286p515o196j0261j1350p462o541j0500j1559p558n517p131
$$ 930559 918866 906580 899065 892869 882608 871258 863796 857255 846755 835196 827638 822121 814990
58041H14990n807q50L97k784k426K858N168K523K218O182P265L318J029K554J867
$$ 814990 809183 808333 808730 805946 803520 806378 811546 814069 816287 822469 829734 833052 834081 836635 838502
58026H38502k401l889j320j330n394o758l514k046m488n196k647k425n502n854
$$ 838502 836101 832212 830892 829562 824168 817410 813896 811850 807362 802166 799519 797094 791592 785738
58012G85738k581k146n697o614l517l185p385r251o335m865p251p595l721j732
$$ 785738 783157 781011 775314 768700 765183 761998 754613 745362 739027 734162 726911 719316 715595 713863
57998G13863m258n667l302k338m938n618j909Q67p4j88K585L533R97L39L714N765
$$ 713863 709605 703938 700636 698298 693360 687742 685833 686700 686626 686438 689023 692556 693553 693892 697606 703371
57982G03371L837K704M799N503K582P96K550L322Q13n72J223J541j814m069k671
$$ 703371 707208 709912 714711 720214 722796 723592 726142 729464 730277 729705 730928 732469 730655 726586 723915
57967G23915k105m968o980n508m503o343p100m574k748l766l615l33J595m53k438
$$ 723915 721810 716842 709862 704354 699851 693508 686408 681834 679086 675320 671705 671372 672967 672514 670076
57952F70076j645j488l937n131l065j757l229l218M80L277K197J280L598N553
$$ 670076 668431 666943 663006 657875 654810 653053 649824 646606 647086 650363 652560 653840 657438 662991
57938F62991M165K649L560L614O00j595j64J179p63k906k340k035m687p096o131
$$ 662991 667156 669805 673365 676979 677579 675984 675820 676999 676236 673330 670990 668955 664268 657172 651041
57923F51041m371m681m880k788r28j312j158J493L475K412J326K815M281L474
$$ 651041 646670 641989 637109 634321 633393 632081 630923 632416 635891 638303 639629 642444 646725 650199
57909F50199L050N048O475N097L928N329O237M073J737J927K018m83k724j870
$$ 650199 653249 658297 664772 669869 673797 679126 685363 689436 691173 693100 695118 694635 691911 690041
57895F90041m53j407k745k131j738l632n139l820k342l532n129m334l053l842
$$ 690041 689588 688181 685436 683305 681567 677935 672796 668976 666634 663102 657973 653639 650586 646744
57881F46744m947m070k805k905k463j20J375J10j027M66K191J833J753M061O090
$$ 646744 641797 637727 634922 632017 629554 629434 630809 630919 629892 630358 632549 634382 636135 640196 646286
57866F46286N433M768O697Q525P286N419O155P587O644M903N086N578L744J171
$$ 646286 651719 656487 663184 671709 678995 684414 690569 698156 704800 709703 714789 720367 724111 725282
57852G25282N01M41j208k962k799k459l994n507m856m016n260o566n489l912m361
$$ 725282 725783 726224 725016 722054 719255 716796 712802 707295 702439 698423 693163 686597 681108 677196 672835
57837F72835n204m209l144m079m811k908p18j307k878k352j095j942l606l322
$$ 672835 667631 663422 660278 656199 651388 648480 647762 646455 643577 641225 640130 638188 634582 631260
57823F31260k122k463l424l097k915m685o265n046k969l176m461l929k446k477
$$ 631260 629138 626675 623251 620154 617239 612554 606289 601243 598274 595098 590637 586708 584262 581785
57809E81785l098k050l48j10k84R80K230J515N54J652L217K901K333L915N956
$$ 581785 578687 576637 576289 576179 575895 576875 579105 580620 581174 582826 586043 588944 591277 595192 601148
57794F01148N848N300P244J0195J0862R863R732R695P662N066M538M930L757K335
$$ 601148 606996 612296 619540 629735 640597 650460 660192 669887 677549 682615 687153 692083 695840 698175
57780F98175L279N152M828L198L234M324L725J883J140R51n49k041j207M46R6
$$ 698175 701454 706606 711434 714632 717866 722190 725915 727798 728938 729889 729340 727299 726092 726538 726634
57765G26634r57L83L082L846L242M352O653O926N221M498N082M721L408L241M061
$$ 726634 725677 726060 729142 732988 736230 740582 747235 754161 759382 763880 768962 773683 777091 780332 784393
57750G84393M022L599M503N663M952L674M516O364O188M799N501Q034R270R134
$$ 784393 788415 792014 796517 802180 807132 810806 815322 821686 827874 832673 838174 846208 855478 864612
57736H64612J0440J3228J4587J3970J3726J4405J4220J3106J2811J3128J2226
$$ 864612 875052 888280 902867 916837 930563 944968 959188 972294 985105 998233 1010459
57725A010459J0282Q662O308J342m484p471p262o082l843J137P458J1887J4611
$$ 1010459 1020741 1029403 1035711 1037053 1032569 1025098 1017836 1011754 1007911 1009048 1016506 1028393 1043004
57712A043004J8293K2636K5021K5986K8614L2836L5648L6994L9970M5130M9857
$$ 1043004 1061297 1083933 1108954 1134940 1163554 1196390 1232038 1269032 1309002 1354132 1403989
57701A403989N3632N8722O5278P0924P5723Q2571R2060J01856J11646J23810J38469
$$ 1403989 1457621 1516343 1581621 1652545 1728268 1810839 1902899 2004755 2116401 2240211 2378680
57690B378680J52836J66217J80859J96987K11681K23476K33359K40203K39944
$$ 2378680 2531516 2697733 2878592 3075579 3287260 3510736 3744095 3984298 4224242
57681D224242K30418K12853J87737J53899J12880O9943K9486o760l6498n6271
$$ 4224242 4454660 4667513 4855250 5009149 5122029 5191972 5221458 5214698 5178200 5121929
57671E121929o5018o4349n5089l8470k1410j5031k5564n0311q3183j19495j54229
$$ 5121929 5056911 4992562 4937473 4899003 4877593 4862562 4836998 4786687 4703504 4584009 4429780
57660D429780j81209j97112k02995k00309j89091j71351j51892j33593j15503
$$ 4429780 4248571 4051459 3848464 3648155 3459064 3287713 3135821 3002228 2886725
57651B886725r7095q0591o7323n5670m4544l5375k8698k2301j4642o972k43O895
$$ 2886725 2789630 2709039 2641716 2586046 2541502 2506127 2477429 2455128 2440486 2433514 2433271 2440166
57639B440166J5352K3983L2274M1590N2290O2685P2284Q2989R5702J08826J21392
$$ 2440166 2455518 2479501 2511775 2553365 2605655 2668340 2740624 2823613 2919315 3028141 3149533
57628C149533J34547J48623J61854J73226J83367J91287J93463J87455J73444
$$ 3149533 3284080 3432703 3594557 3767783 3951150 4142437 4335900 4523355 4696799
57619D696799J51389J20263Q1407L9052l809m6668q7611j22202j47988j66556
$$ 4696799 4848188 4968451 5049858 5088910 5085101 5038433 4950822 4828620 4680632 4514076
57609D514076j79444j85705j85251j80846j74557j65603j53768j41659j31307
$$ 4514076 4334632 4148927 3963676 3782830 3608273 3442670 3288902 3147243 3015936
57600C015936j21667j11557j02096r4243q6858p9245p2742o7839o2711n6455n0881
$$ 3015936 2894269 2782712 2680616 2586373 2499515 2420270 2347528 2279689 2216978 2160523 2109642
57589B109642m7181m3754l9284l5049l2215k9701k6682k4354k3326k2023j9601
$$ 2109642 2062461 2018707 1979423 1944374 1912159 1882458 1855776 1831422 1808096 1786073 1766472
57578A766472j7593j6805j5526j2713j0007q663p423n372l910l810l328j367M70
$$ 1766472 1748879 1732074 1716548 1703835 1693828 1685165 1677742 1672370 1668460 1664650 1661322 1659955 1660425
57565A660425J064J954M159N933O107O612R143J2144J3711J4684J6341J7833J8554
$$ 1660425 1661489 1663443 1667602 1673535 1679642 1686254 1695397 1707541 1721252 1735936 1752277 1770110 1788664
57552A788664K0301K4206K8147L0071L1499L4831L9525M3783M7875N2887N8216
$$ 1788664 1808965 1833171 1861318 1891389 1922888 1957719 1997244 2041027 2088902 2141789 2200005
57541B200005O3065O8591P5891Q3733R0741R7986J06947J16796J26094J35186
$$ 2200005 2263070 2331661 2407552 2491285 2582026 2680012 2786959 2903755 3029849 3165035
57531C165035J44555J52737J58115J60798J60316J53793J38992J17289R1208O1157
$$ 3165035 3309590 3462327 3620442 3781240 3941556 4095349 4234341 4351630 4442838 4503995
57521D503995K7198q037m1058p0468r5717j14888j26431j31550j32358j29219
$$ 4503995 4531193 4523156 4482098 4411630 4315913 4201025 4074594 3943044 3810686 3681467
57511C681467j22078j12559j02374r1494q0110p0279o3256n7210n0192m3257l8148
$$ 3681467 3559389 3446830 3344456 3252962 3172852 3102573 3039317 2982107 2931915 2888658 2850510
57500B850510l4078k9599k5476k2729j9977j5794j1706r585p922m135J037M909
$$ 2850510 2816432 2786833 2761357 2738628 2718651 2702857 2691151 2681566 2673644 2669509 2670546 2675455
57488B675455P310J0302J4532J9088K4010K9889L5835M0701M5527N2078N9923
$$ 2675455 2682765 2693067 2707599 2726687 2750697 2780586 2816421 2857122 2902649 2954727 3014650
57477C014650O7544P5291Q4571R5092J05534J15890J26624J36592J44238J49658
$$ 3014650 3082194 3157485 3242056 3337148 3442682 3558572 3685196 3821788 3966026 4115684
57467D115684J52959J51896J43826J28790J08105Q1481M8514J1805k4410n7798
$$ 4115684 4268643 4420539 4564365 4693155 4801260 4882741 4931255 4943060 4918650 4860852
57457D860852q7514j11717j28655j39163j45080j46198j41720j33594j25096j16902
$$ 4860852 4773338 4661621 4532966 4393803 4248723 4102525 3960805 3827211 3702115 3585213
57447C585213j07632r7527q8386q0540p2876o5458n9221n3705m7895m2618l9299
$$ 3585213 3477581 3380054 3291668 3211128 3138252 3072794 3013573 2959868 2911973 2869355 2830056
57436B830056l7021l3731k9680k6651k4546k1748j8388j6078j4802j3095j0948
$$ 2830056 2793035 2759304 2729624 2702973 2678427 2656679 2638291 2622213 2607411 2594316 2583368
57425B583368r621q839p126m678l120k651k144j654k045k552j542O26K209L092
$$ 2583368 2573747 2564908 2557782 2553104 2549984 2547333 2545189 2543535 2541490 2538938 2537396 2538022 2540231 2543323
57411B543323M383N611N385M414M697O047O530O148O790Q542R405Q911Q792R699
$$ 2543323 2547706 2553317 2558702 2563116 2567813 2573860 2580390 2586538 2593328 2601870 2611275 2620186 2628978 2638677
57397B638677J0233R815R690J0521J1401J1798J2079J2036J1151J0338J1025J2593
$$ 2638677 2648910 2658725 2668415 2678936 2690337 2702135 2714214 2726250 2737401 2747739 2758764 2771357
57385B771357J3196J2825J2986J3685J3597J3033J3564J4839J4863J3617J3216
$$ 2771357 2784553 2797378 2810364 2824049 2837646 2850679 2864243 2879082 2893945 2907562 2920778
57374B920778J4185J4835J4654J5150J6653J7390J6549J5499J5199J5053J4923
$$ 2920778 2934963 2949798 2964452 2979602 2996255 3013645 3030194 3045693 3060892 3075945 3090868
57363C090868J5526J6330J5808J4390J4259J5634J6237J5223J4604J5698J7088
$$ 3090868 3106394 3122724 3138532 3152922 3167181 3182815 3199052 3214275 3228879 3244577 3261665
57352C261665J7427J7559J8429J9238J9155J8806J8858J8910J8755J8963J9504
$$ 3261665 3279092 3296651 3315080 3334318 3353473 3372279 3391137 3410047 3428802 3447765 3467269
57341C467269J9566J9159J9066J9039J8263J7646J8941K1396K2215K0886K0056
$$ 3467269 3486835 3505994 3525060 3544099 3562362 3580008 3598949 3620345 3642560 3663446 3683502
57330C683502K1286K2884K3165K2892K3186K3581K3654K4264K5734K6845K6915
$$ 3683502 3704788 3727672 3750837 3773729 3796915 3820496 3844150 3868414 3894148 3920993 3947908
57319C947908K6838K7162K7216K7046K7895K9805L1119L1337L2034L3883L5224
$$ 3947908 3974746 4001908 4029124 4056170 4084065 4113870 4144989 4176326 4208360 4242243 4277467
57308D277467L4991L4527L5108L5869L5662L4981L4606L4324L4155L4913L6367
$$ 4277467 4312458 4346985 4382093 4417962 4453624 4488605 4523211 4557535 4591690 4626603 4662970
57297D662970L6909L6130L5693L6533L7417L7435L7621L8800M0041M0607M1366
$$ 4662970 4699879 4736009 4771702 4808235 4845652 4883087 4920708 4959508 4999549 5040156 5081522
57286E081522M2922M4438M5563M7274M9551N0503M9348M7902M7558M7019M4769
$$ 5081522 5124444 5168882 5214445 5261719 5311270 5361773 5411121 5459023 5506581 5553600 5598369
57275E598369M1532L8488L4978K9978K4067J8186J2179O145J463j160k954m844
$$ 5598369 5639901 5678389 5713367 5743345 5767412 5785598 5797777 5803922 5805385 5804225 5801271 5796427
57263E796427n783m856l067j381J168N487J0365J4168J7045J9696K1641K2432
$$ 5796427 5790644 5785788 5782721 5781340 5782508 5787995 5798360 5812528 5829573 5849269 5870910 5893342
57251E893342K3046K4279K5166K4609K3142K1723K0336J9112J9057K0201K0888
$$ 5893342 5916388 5940667 5965833 5990442 6013584 6035307 6055643 6074755 6093812 6114013 6134901
57240F134901K0513K0949K3550K6813K8926L0712L3858L7852M0967M2899M4379
$$ 6134901 6155414 6176363 6199913 6226726 6255652 6286364 6320222 6358074 6399041 6441940 6486319
57229F486319M5449M5936M6448M7156M6926M5196M3277M2285M1397L9817L8641
$$ 6486319 6531768 6577704 6624152 6671308 6718234 6763430 6806707 6848992 6890389 6930206 6968847
57218F968847L8934L9769M0049M0543M2100M3607M3923M4190M6030M8804N0810
$$ 6968847 7007781 7047550 7087599 7128142 7170242 7213849 7257772 7301962 7347992 7396796 7447606
57207G447606N1797N2232N1550M9270M6544M4594M2938M0920L9442L9177L8875
$$ 7447606 7499403 7551635 7603185 7652455 7698999 7743593 7786531 7827451 7866893 7906070 7944945
57196G944945L7514L6384L6813L7664L7448L7186L8507M0579M1663M2152M3340
$$ 7944945 7982459 8018843 8055656 8093320 8130768 8167954 8206461 8247040 8288703 8330855 8374195
57185H374195M4560M4379M3232M2143M0196L6295L2085L0032K9585K8355K6203
$$ 8374195 8418755 8463134 8506366 8548509 8588705 8625000 8657085 8687117 8716702 8745057 8771260
57174H771260K4934K4671K3735K1782K0051J8708J6574J3370R798N713N24n080
$$ 8771260 8796194 8820865 8844600 8866382 8886433 8905141 8921715 8935085 8944883 8950596 8951120 8946040
57162H946040j0081j5109k1263k7719l2926l7351m2582m8413n3293n6717n8699
$$ 8946040 8935959 8920850 8899587 8871868 8838942 8801591 8759009 8710596 8657303 8600586 8541887
57151H541887n7881n3010m5486l7734k9783k0220r680n46N976R618Q847J983j0005
$$ 8541887 8484006 8430996 8385510 8347776 8317993 8297773 8288093 8287547 8293523 8303141 8311988 8313971 8303966
57138H303966k4650m0968n8377p3830q3520q6712q4679p7088o3309m6507l2236
$$ 8303966 8279316 8238348 8179971 8106141 8022621 7935909 7851230 7774142 7710833 7664326 7632090
57127G632090k3119j8417j8031k2498k9351l3986l4783l3754l2355l0585k9942
$$ 7632090 7608971 7590554 7572523 7550025 7520674 7486688 7451905 7418151 7385796 7355211 7325269
57116G325269l2516l6687l7957l4687k8992k1892j2041M28J3555K7739M5587O7052
$$ 7325269 7292753 7256066 7218109 7183422 7154430 7132538 7120497 7120925 7134480 7162219 7207806 7274858
57104G274858Q9555J13654J43603J81473K25983K78031L41759M19036N08991O14368
$$ 7274858 7364413 7478067 7621670 7803143 8029126 8307157 8648916 9067952 9576943 10191311
57094A0191311P41825Q93954J067417J260612J475564J709491J952515K196451
$$ 10191311 10933136 11827090 12894507 14155119 15630683 17340174 19292689 21489140
57086B1489140K436356K658835K838592K951780K982072K910427K721372K439030
$$ 21489140 23925496 26584331 29422923 32374703 35356775 38267202 40988574 43427604
57078D3427604K138332J882722J642713J302217P63706M0605p55752j500466k115625
$$ 43427604 45565936 47448658 49091371 50393588 51157294 51197899 50442147 48941681 46826056
57069D6826056k571702k865142l004698l006006k889128k681535k420373k143215
$$ 46826056 44254354 41389212 38384514 35378508 32489380 29807845 27387472 25244257
57061B5244257j874125j622734j395622j201220j042497r12469q01554p05769
$$ 25244257 23370132 21747398 20351776 19150556 18108059 17195590 16394036 15688267
57053A5688267o25014n57356m98957m47584m02713l63240l27737k96285k70159
$$ 15688267 15063253 14505897 14006940 13559356 13156643 12793403 12465666 12169381 11899222
57044A1899222k50016k35751k27281k23929k23448k23147k21848k20043k18583
$$ 11899222 11649206 11413455 11186174 10962245 10738797 10515650 10293802 10073759 9855176
57035I855176k18208k19861k24252k31077k39351k48299k57312k65338k71163
$$ 9855176 9636968 9417107 9192855 8961778 8722427 8474128 8216816 7951478 7680315
57026G680315k74317k75214k74525k72854k70688k68089k64629k60071k54795
$$ 7680315 7405998 7130784 6856259 6583405 6312717 6044628 5779999 5519928 5265133
57017E265133k49037k42224k33797k24340k15051k06330j97697j88850j79967
$$ 5265133 5016096 4773872 4540075 4315735 4100684 3894354 3696657 3507807 3327840
57008C327840j71177j62476j53970j45377j35665j24060j10926r6729q0713o1894
$$ 3327840 3156663 2994187 2840217 2694840 2559175 2435115 2324189 2227460 2146747 2084853
56998B084853m0348j5787J3829M8867Q2806J03759J02910P9908L9986j0528o3893
$$ 2084853 2044505 2028718 2042547 2091414 2174220 2277979 2380889 2460797 2500783 2490255 2426362
56987B426362j10064j40762j54344j54644j46028j31696j15202j00085q7708p7565
$$ 2426362 2316298 2175536 2021192 1866548 1720520 1588824 1473622 1373537 1285829 1208264
56977A208264o9589o4235o0687n7248n3414m9690m5653m0317l4252k9063k4810
$$ 1208264 1138675 1074440 1013753 956505 903091 853401 807748 767431 733179 704116 679306
56966F79306k0137j5053j1184q907o517k900J092M681Q411J2378J5031J5014J2740
$$ 679306 659169 644116 632932 624025 617508 614608 615700 620381 628792 641170 656201 671215 683955
56953F83955R131M143k347r233j4923j8645k0435k0542j9485j7921j6034j3655
$$ 683955 693086 697229 694882 685649 670726 652081 631646 611104 591619 573698 557664 544009
56941E44009j1065q810o653l876o22K136M195O499R838J4184J9154K3769K5926
$$ 544009 532944 524134 517481 513605 512983 515119 519314 525813 535651 549835 568989 592758 618684
56928F18684K3680J7304Q812m10r936j8494k4056k6191k6521k6325k5314k3229
$$ 618684 642364 659668 668480 668070 658134 639640 615584 589393 562872 536547 511233 488004
56916D88004k0804j8495j5940j3272j1388j0398r350q061p426p478p011n766n054
$$ 488004 467200 448705 432765 419493 408105 397707 388357 380296 372870 365392 358381 352615 347561
56903C47561n428n667m950m159l999l737k922k471k800k519m47K672N643Q576
$$ 347561 342133 336466 331516 327357 323358 319621 316699 314228 311428 308909 308462 311134 316777 325353
56889C25353J1924J5310J8576K2460K6687K8907K7091K1915J5437Q682J881m050
$$ 325353 337277 352587 371163 393623 420310 449217 476308 498223 513660 522342 524223 520173
56877E20173q034j0085j0756j0123q275n989l762j039K621O565J0083J3550J7616
$$ 520173 512139 502054 491298 481175 472900 466911 463149 462110 464731 471296 481379 494929 512545
56864E12545K2231K7219L2917L9511M6571N3356N8288N8179N0103L4868J6790
$$ 512545 534776 561995 594912 634423 680994 734350 792638 850817 900920 935788 952578
56853I52578n19j6139k9232l7470l9769l8134l4824k9723k2256j3870o332P21
$$ 952578 952059 935920 906688 869218 829449 791315 756491 726768 704512 690642 684310 685031
56841F85031Q349J6018K2840K9696L8034M7950N9211P2245Q5587R3933R1717P8025
$$ 685031 693380 709398 732238 761934 799968 847918 907129 979374 1064961 1158894 1250611 1328636
56829A328636N5979K8739j155k9684n2190o6701p4277p6153p2738o5194n5725
$$ 1328636 1384615 1413354 1412199 1382515 1330325 1263624 1189347 1113194 1040456 975262 919537
56818I19537m5832l5790k5920j6884q769j086O420J3923K2145L1717M2271N2517
$$ 919537 873705 837915 811995 795111 786342 785256 791676 805599 827744 859461 901732 954249
56806I54249O0266O1931N4059L6942J5326n872k5090m2182n5308o2318o3754o1872
$$ 954249 1014515 1076446 1130505 1167447 1182773 1176901 1151811 1109629 1054321 992003 928249 866377
56794H66377n7637n0974m2854l4752k6831j8928j2204p636l838J150O957J2197
$$ 866377 808740 757766 714912 680160 653329 634401 622197 614561 610723 611873 618830 631027
56782F31027J7414K3714K9349L0790K6918J9412R529k485j5077k5616l3226l8740
$$ 631027 648441 672155 701504 732294 759212 778624 788153 785668 770591 744975 711749 673009
56770F73009m1916m1476l8037l4130l0930k7461k3321j9637j6865j4184j1632
$$ 673009 631093 589617 551580 517450 486520 459059 435738 416101 399236 385052 373420
56759C73420j0416j0469j0004q218o381n617n520n511n683n736m973l840l657
$$ 373420 363004 352535 342531 334313 327932 322315 316795 311284 305601 299865 294892 291052 287395
56746B87395m473m907m435l972l968l792l359l397l789l512k566k115k427k557
$$ 287395 282922 278015 273580 269608 265640 261848 258489 255092 251303 247791 245225 243110 240683 238126
56732B38126k355k757l726l901k871j857j685j845j986k476l063k834j989j807
$$ 238126 235771 233014 229288 225387 222516 220659 218974 217129 215143 212667 209604 206770 204781 202974
56718B02974k426k543j745j189j424j470p26K8K17K84L47k73j463k000j429p86
$$ 202974 200548 198005 196260 195071 193647 192177 191451 191479 191696 191980 192327 192054 190591 188591 187162 186376
56702A86376q06r76q47p15n75N8Q52P96k5m04q1r9p36r59l66M5l03o92n64k96
$$ 186376 185570 184594 183747 183032 182457 182515 183367 184163 184138 183734 183653 183554 182818 181859 181493 181538 181235 180543 179979 179683
56682A79683j05K83N27j19j249j568q88j79M37J700L148L257K022J240J721K320
$$ 179683 179578 179861 180388 180269 179020 177452 176564 176385 176822 178522 181670 184927 186949 188189 189910 192230
56666A92230K254K173K343J985J165J185K341L271L346L589M503N056M709M383
$$ 192230 194484 196657 199000 200985 202150 203335 205676 208947 212293 215882 220385 225441 230150 234533
56652B34533M497M105K874J960J882J575M70m12m06l30o99p92m98j054k819m255
$$ 234533 239030 243135 246009 247969 249851 251426 251896 251484 251078 250748 250049 249257 248759 247705 244886 240631
56636B40631m277l741l501k935j613n63n61q28o24m77o83l53R37K150K569K881
$$ 240631 236354 232613 229112 226177 224564 224001 223440 222612 221988 221511 220828 220475 221412 223562 226131 229012
56620B29012L444L355K364J855K617L365K859J840J511J588J264P21M13Q1m32
$$ 229012 232456 235811 238175 240030 242647 246012 248871 250711 252222 253810 255074 255795 256208 256289 255857
56605B55857o51o20j220k504l215k713j908j584j422j304j761k437k087q39l80
$$ 255857 255206 254586 253366 250862 247647 244934 243026 241442 240020 238716 236955 234518 232431 231592 231212
56590B31212j163j584q31k05n30o58J31O13L9k20R07K200K258J707J628J648J219
$$ 231212 230049 228465 227634 227429 226899 226241 226372 226985 227024 226804 227711 229911 232169 233876 235504 237152 238371
56573B38371J060J671K065J511R56J251J673J521J496K120K518K155K027K785
$$ 238371 239431 241102 243167 244678 245634 246885 248558 250079 251575 253695 256213 258368 260395 263180
56559B63180L441L191K731K589K126J345J530K785L220J919M55R1o5o39m57P97
$$ 263180 266621 269812 272543 275132 277258 278603 280133 282918 286138 288057 288512 288603 288538 287899 287442 288239
56543B88239J076p11k446k194j298j695k512k030r98j095j878j941j622j987k523
$$ 288239 289315 288604 286158 283964 282666 280971 278459 276429 275431 274336 272458 270517 268895 266908 264385
56528B64385k267j887k367k930k426j435j041r65p46j140k432l185k508j749j999
$$ 264385 262118 260231 257864 254934 252508 251073 250032 249067 248321 247181 244749 241564 239056 237307 235308
56513B35308k057r23j0n69j153k74O69j0r55j32J357J037p95j914j822j570j091
$$ 235308 233251 232328 232318 231749 230596 230322 230991 230981 230026 229894 231251 232288 231493 229579 227757 226187 225096
56496B25096L12J787J960J282R77Q07J31k10N93J357Q79L02J046K067J852J348
$$ 225096 225408 227195 229155 230437 231414 232221 232352 232142 232735 234092 234971 235273 236319 238386 240238 241586
56480B41586K095L137K843K201L074M582M500L027K068J832J228N92R33J458Q89
$$ 241586 243681 246818 249661 251862 254936 259518 264018 267045 269113 270945 272173 272765 273698 275156 276045
56465B76045J71R71K481K719J934J746J991J405N18P73J729J969J843K468L149
$$ 276045 276216 277187 279668 282387 284321 286067 288058 289463 289981 290754 292483 294452 296295 298763 301912
56450C01912K691K091K878M011L505J951J317J474J104P94J818L054K584J282
$$ 301912 304603 306694 309572 313583 317088 319039 320356 321830 322934 323728 325546 328600 331184 332466
56436C32466J250J834P98j485k680k544k656k961k211j099j301k022j223M24N46
$$ 332466 333716 335550 336348 334863 332183 329639 326983 324022 321811 320712 319411 317389 316166 316590 317136
56421C17136o59r32k17m61j652j859j122j424k915l742l615m196o056q556j2169
$$ 317136 316477 315545 315328 314867 313215 311356 310234 308810 305895 302153 298538 294342 288286 279730 267561
56406B67561j7516k2490k3917k1755j8341j4266q694l004J06Q98J986L812M613
$$ 267561 250045 227555 203638 181883 163542 149276 140582 137578 137684 138582 140568 144380 148993
56393A48993M499N312O630O151M192L513M525M776L550K796L018K355M25p37l17
$$ 148993 153492 158804 165434 171585 175777 179290 183815 188591 192141 194937 197955 200310 200735 199998 199681
56378A99681K41L58J070K245K425J807K046L037L190K820L740N605O224N368M698
$$ 199681 199922 200280 201350 203595 206020 207827 209873 212910 216100 218920 222660 228265 234489 239857 244555
56363B44555M276K942J672K409L969L422J285Q75K660L850L542L547M009L153
$$ 244555 248831 251773 253445 255854 259823 263245 264530 265405 268065 271915 275457 279004 283013 286166
56349B86166J626K136M340M986L639L251M471M632L247L174N114O072M850M042
$$ 286166 287792 289928 294268 299254 302893 306144 310615 315247 318494 321668 326782 332854 337704 341746
56335C41746N016N741N263N629P551Q705Q153Q071R387J0001R034Q575R462R639
$$ 341746 346762 352503 357766 363395 370946 379651 387804 395875 405262 415263 424297 432872 442334 451973
56321D51973Q343P734Q567Q519O582M994N010M814L351K241K214J597r6r75o20
$$ 451973 460316 468050 476617 485136 491718 496712 501722 506536 509887 512128 514342 515939 515843 514868 514248
56306E14248j043k574k887j422n51j117j119N6N66L45J659M303N225M147M359
$$ 514248 513205 510631 507744 506322 505771 504654 503535 503591 504157 504502 506161 510464 515689 519836 524195
56291E24195O600P578O253N936Q106R845R682J0473J3674J6295J6370J6406J8407
$$ 524195 530795 538373 544626 550562 558668 568513 578195 588668 602342 618637 635007 651413 669820
56278F69820K0472K1256K2860K6373K9337L0577L2754L7271M1495M3976M7448
$$ 669820 690292 711548 734408 760781 790118 820695 853449 890720 932215 976191 1023639
56267A023639N3650O0149O5378P1796Q0811Q9568R6252J03731J14377J26012J36452
$$ 1023639 1077289 1137438 1202816 1274612 1355423 1444991 1541243 1644974 1759351 1885363 2021815
56256B021815J47403J60200J72277J81465J89288J96554K00317J98717J94182
$$ 2021815 2169218 2329418 2501695 2683160 2872448 3069002 3269319 3468036 3662218
56247C662218J88182J77577J59984J38153J15239R0277O2227L3998Q428j5393
$$ 3662218 3850400 4027977 4187961 4326114 4441353 4531630 4593857 4627855 4636283 4620890
56237D620890l8113n6920p0104q0367q9873r6537r8877r9727j01335j01575r9130
$$ 4620890 4582777 4525857 4455753 4375386 4285513 4188976 4090099 3990372 3889037 3787462 3688332
56226C688332r7368r8910j01170j01703j03018j07480j12206j13863j14008j14996
$$ 3688332 3590964 3492054 3390884 3289181 3186163 3078683 2966477 2852614 2738606 2623610
56216B623610j15105j12454j09321j07850j05753j00898r5699r2415q8616q1947
$$ 2623610 2508505 2396051 2286730 2178880 2073127 1972229 1876530 1784115 1695499 1613552
56206A613552p4845o9893o5181n8938n3839n1830m9621m4443l9310l7333l5821
$$ 1613552 1538707 1468814 1403633 1344695 1290856 1239026 1189405 1144962 1105652 1068319 1032498
56195A032498l1556k6939k5154k4052k0747j7515j7207j7327j4768j1856j1540
$$ 1032498 1000942 974003 948849 924797 904050 886535 869328 852001 837233 825377 813837
56184H13837j1180p474l166k306k956j153J836K738K927N314Q150Q251O978P023
$$ 813837 802657 795183 792017 789711 786755 785602 787438 790176 793103 798417 806567 814818 821796 828819
56170H28819O858M301J769K091K946J334n63N4O42j859m661m008k081k492l319
$$ 828819 835677 839978 841747 843838 846784 848118 847555 847609 848251 846392 841731 837723 835642 833150 829831
56155H29831j314J316J167M36K515N171M983M277O598R664R917R754J2911J7158
$$ 829831 828517 829833 831000 831436 833951 839122 844105 848382 854980 864644 874561 884315 897226 914384
56141I14384J8889K0534K5839L2317L6030L9427M6581N5199O1335O7398P7140
$$ 914384 933273 953807 979646 1011963 1047993 1087420 1134001 1189200 1250535 1317933 1395073
56130A395073Q7165R1893R2566R2969R0854Q2579P1911O5033O0751N4490M7616
$$ 1395073 1482238 1574131 1666697 1759666 1850520 1933099 2005010 2070043 2130794 2185284 2232900
56119B232900M3649L9573L0529J9253J1473N936j573q692j0955j1696j7303k6327
$$ 2232900 2276549 2316122 2346651 2365904 2377377 2383313 2381740 2373048 2362093 2350397 2333094 2306767
56107B306767l3395l9923n0444o2060o8294p0204p3130p5753p2999o6622o2251
$$ 2306767 2273372 2233449 2183005 2120945 2052651 1982447 1909317 1833564 1760565 1693943 1631692
56096A631692n9012n2523m4914m1305l9708l4964k9143k7360k7122k2893j7241
$$ 1631692 1572680 1520157 1475243 1433938 1394230 1359266 1330123 1302763 1275641 1252748 1235507
56085A235507j6082j6876j3358p945p260r262p291l016k627l894k46N778O619
$$ 1235507 1219425 1202549 1189191 1181246 1173986 1164724 1157433 1154417 1151790 1147896 1147650 1153428 1160047
56072A160047L875M980Q901Q899O371Q044J2279J2107R133J0432J4499J4467J2087
$$ 1160047 1163922 1168902 1177803 1186702 1193073 1201117 1213396 1225503 1234636 1245068 1259567 1274034 1286121
56059A286121J4143J8165J6620J2123J3198J8101J8395J5413J7149K1902K1510
$$ 1286121 1300264 1318429 1335049 1347172 1360370 1378471 1396866 1412279 1429428 1451330 1472840
56048A472840J7858J9452K4481K4376K1205K3876L0034K9979K5778K7751L4501
$$ 1472840 1490698 1510150 1534631 1559007 1580212 1604088 1634122 1664101 1689879 1717630 1752131
56037A752131L5740L2548L5078M2126M3172L9120M0554M6924M8118M5153M8146
$$ 1752131 1787871 1820419 1855497 1897623 1940795 1979915 2020469 2067393 2115511 2160664 2208810
56026B208810N5204N5098M9473N0256N6404N6089N0602N2324O0033O0725N5227
$$ 2208810 2264014 2319112 2368585 2418841 2475245 2531334 2581936 2634260 2694293 2755018 2810245
56015B810245N6901O5384O7406O3452O7149P8156Q2708Q1210Q7438J00158J04480
$$ 2810245 2867146 2932530 2999936 3063388 3130537 3208693 3291401 3372611 3460049 3560207 3664687
56004C664687J01656J07658J21607J26850J24155J31270J48077J56111J54789
$$ 3664687 3766343 3874001 3995608 4122458 4246613 4377883 4525960 4682071 4836860
55995D836860J63064J82255J93393J94854K05434K26241K38108K41121K56549
$$ 4836860 4999924 5182179 5375572 5570426 5775860 6002101 6240209 6481330 6737879
55986F737879K84799L03095L10097L29342L62995L87979M03938M36631M86910
$$ 6737879 7022678 7325773 7635870 7965212 8328207 8716186 9120124 9556755 10043665
55977A0043665N27344N57204O06919O79569P45493Q04370Q91066J008750J122124
$$ 10043665 10571009 11128213 11735132 12414701 13160194 13964564 14855630 15864380 16986504
55968A6986504J229938J373879J561322J755517J958696K221737K553129K910692
$$ 16986504 18216442 19590321 21151643 22907160 24865856 27087593 29640722 32551414
55960C2551414L306121L816230M464389N204712O053896P107235Q387421R834938
$$ 32551414 35857535 39673765 44138154 49342866 55396762 62503997 70891418 80726356
55952H0726356J1501436J3570623J6127564J9147521K2781514K7201276L1733193
$$ 80726356 92227792 105798415 121925979 141073500 163855014 191056290 222789483
55945B22789483L4423947L3127147K7222627J8007392P433691l101043j2701227
$$ 222789483 257213430 290340577 317563204 335570596 343004287 339903244 327202017
55938C27202017k0440636k5519573k7831388k7957168k6594757k4231233k1283957
$$ 327202017 306761381 281241808 253410420 225453252 198858495 174627262 153343305
55931A53343305j8202701j5317378j2759709j0596054q898725p650617o719066
$$ 153343305 135140604 119823226 107063517 96467463 87568738 79918121 73199055
55924G3199055n983733n403009m936119m507275m083817l702180l382034l088024
$$ 73199055 67215322 61812313 56876194 52368919 48285102 44582922 41200888 38112864
55916C8112864k799787k544725k334391k136190j934330j756983j618594j492501
$$ 38112864 35313077 32768352 30433961 28297771 26363441 24606458 22987864 21495363
55908B1495363j363580j253555j171864j092655j002581r23638q67718q13607
$$ 21495363 20131783 18878228 17706364 16613709 15611128 14687490 13819772 13006165
55900A3006165p49230o93640o57310o21276n74846n35357n11956m86616m49193
$$ 13006165 12256935 11563295 10905985 10284709 9709863 9174506 8662550 8175934 7726741
55891G726741m16221l97345l76958l46011l19570l06067k90485k64436k42733
$$ 7726741 7310520 6913175 6536217 6190206 5870636 5564569 5274084 5009648 4766915
55882D766915k33983k23908k03720j86848j81705j75195j58937j45544j43229
$$ 4766915 4532932 4309024 4105304 3918456 3736751 3561556 3402619 3257075 3113846
55873C113846j39648j26398j15079j13652j10570r7746q6514q5464q4228p4393
$$ 3113846 2974198 2847800 2732721 2619069 2508499 2410753 2324239 2238775 2154547 2080154
55863B080154o5516o5468o4947n6261m8113m7530m5749l6115k7778k7775k7153
$$ 2080154 2014638 1949170 1884223 1827962 1779849 1732319 1686570 1650455 1622677 1594902 1567749
55852A567749j8658j1079j2469j5539j3121j2177j9105k6357k6686k6190l0765
$$ 1567749 1549091 1538012 1525543 1510004 1496883 1484706 1465601 1439244 1412558 1386368 1355603
55841A355603l3900l0193k6932l0189l2964k9033k5149k7754l0564k6973k2351
$$ 1355603 1321703 1291510 1264578 1234389 1201425 1172392 1147243 1119489 1088925 1061952 1039601
55830A039601k2685k3150j8973j5662j7755j9102j4828j1317j4038j7047j4702
$$ 1039601 1016916 993766 974793 959131 941376 922274 907446 896129 882091 865044 850342
55819H50342j2295j4784j6506j2416q459j0309j2599r494n495n721n828j595J762
$$ 850342 838047 823263 806757 794341 785882 775573 762974 753480 747985 742264 736436 734841 736603
55806G36603l86k793o43R06k877o497m573k106m631p761o448n173q892j2962j2033
$$ 736603 736217 733424 732781 733687 730810 724313 719740 717634 713003 705242 698794 693621 684729 671767 659734
55791F59734j0180j2464j5016j3280j1432j3902j5910j2292p615p734r228o838
$$ 659734 649554 637090 622074 608794 597362 583460 567550 555258 547643 539909 530681 523843
55779E23843l680m433n864l714j735m419p948p570o797j0055j3342j1609q520
$$ 523843 520163 515730 509866 506152 504417 499998 492050 484480 477683 467628 454286 442677 434157
55766D34157r444j1465r643o776p578r384p720n120n617o557m459k802n308p818
$$ 434157 424713 413248 403605 396829 389251 379867 372147 367027 361410 354853 350394 347592 342284 334466
55752C34466n615k529l869o558n400k984m133o309m898k514l741n951m491j829
$$ 334466 328851 326322 322453 315895 310495 307511 303378 297069 292171 289657 285916 279965 275474 273645
55738B73645k478m003k138L61r45l024q85K697K317K6Q01K544K72l874m484k946
$$ 273645 271167 267164 265026 265387 264442 261418 260533 263230 265547 265573 266374 268918 269190 265316 260832 257886
55722B57886m106o416n060j727j743m174l974j580j371k850j998N25Q55l25N71
$$ 257886 253780 247364 242304 240577 238834 234660 230686 229106 227735 224885 222887 223412 224267 223942 224513
55707B24513K738K910K388M557P676P653N664N599O373M260O33k46R83N65r62
$$ 224513 227251 230161 232549 237106 244782 252435 258099 263698 270071 274331 274964 274718 275701 276266 275304
55692B75304m35R94j29k638k920j924k974m782l771j206r46k096r98J493J731
$$ 275304 274869 275863 275734 273096 270176 268252 265278 260496 256725 255519 254573 252477 251479 252972 254703
55677B54703L91Q36K292J569l52k56P24o72l064k795j066j673l583k907m68k17
$$ 254703 255094 255930 258222 259791 259439 259183 259907 259235 256171 253376 252310 250637 247054 244147 243679 243462
55661B43462j635r67J430J923O19N96J456M43j310m75J797J611n61j179o92k395
$$ 243462 241827 240860 242290 244213 244832 245428 246884 247327 246017 245542 247339 248950 248389 247210 246518 244123
55645B44123n466o129m725m837o307n959m390n015p131o798m192l244m363m130
$$ 244123 238657 232528 227803 222966 216659 210700 206310 201295 194164 187366 183174 179930 175567 171437
55631A71437k058j188k076k347j954k929m323l412j324j420k839j903P70J102
$$ 171437 169379 168191 166115 163768 161814 158885 154562 151150 149826 148406 145567 143664 144434 145536
55617A45536j030j793n70n63k282k789j646j469k403j985n18p20j998j130J418
$$ 145536 144506 142713 142143 141580 139298 136509 134863 133394 130991 129006 128488 127768 125770 124640 126058
55602A26058J827k97j446o41m64j462j414l85p83k141j546N61P45j145j714k48
$$ 126058 127885 127588 126142 125501 125037 123575 122161 121776 120993 118852 117306 117867 118612 117467 115753 115505
55586A15505N47J56Q21K277J777l41q18M84M54j163j384p6l92k547l170j549o25
$$ 115505 116052 116208 117029 119306 121083 120742 119924 120408 120862 119699 118315 118239 117847 115300 112130 110581 109956
55569A09956j032r6K325K959J205L26J333J341o23j774r76o31j608j509L79J409
$$ 109956 108924 108828 111153 114112 115317 115643 116976 118317 117694 115920 114944 114313 112705 111196 111575 112984
55553A12984M89l8J017J760J236R57J272N24j125j318J71J000P32J316K732K752
$$ 112984 113473 113435 114452 116212 117448 118405 119677 120201 119076 117758 117929 118929 119661 120977 123709 126461
55537A26461J501J467K579K205M36K41J890K411J239J028K208K191P89Q98K736
$$ 126461 127962 129429 132008 134213 134649 134890 136780 139191 140430 141458 143666 145857 146646 147544 150280
55522A50280K992R07l23M89O82p41j250j9L61q91j187J11J40j908k971j803j169
$$ 150280 153272 154179 153856 154345 155027 154286 153036 153017 153378 152487 151300 151411 151551 149643 146672 144869 143700
55505A43700k425l085j916j273k102j696J115L406L267K867L963M886M416M194
$$ 143700 141275 138190 136274 135001 132899 131203 132318 135724 138991 141858 145821 150707 155123 159317
55491A59317M987M826L144K393L349L130L0l997p713j2789j9371k3980k4408k2600
$$ 159317 164304 169130 172274 174667 178016 181146 181176 177179 169466 156677 137306 113326 88918 66318
55477F6318k0435j6993j2172H162A011d508k564p02j075j072P80J987R34J35J664
$$ 66318 45883 28890 16718 8162 1011 -4508 -7072 -7774 -8849 -9921 -9141 -7154 -6220 -6085 -4421
55462d421i15B542K705K636K094N42N9J399J959M74l54J262K800J997P21J028
$$ -4421 -915 2542 5247 7883 9977 10519 10578 11977 13936 14410 14056 15318 18118 20115 20836 21864
55446B1864J343l7j333p22J07o74j439k77J347J453J042J557J849Q07Q3J084K096
$$ 21864 23207 23170 21837 21115 21222 20548 19109 18832 20179 21632 22674 24231 26080 26887 26970 28054 30150
55429C0150J429N44J109J833J186L91P48Q99l74j428p88m3p94j612q75J28j05
$$ 30150 31579 32123 33232 35065 36251 36642 37390 38289 37915 36487 35699 35656 34862 33250 32375 32503 32398
55412C2398l79N66J312N95K3J046J951R22n79m84M14N64O45J523J888P16l31K20
$$ 32398 32019 32585 33897 34492 34515 35561 37512 38434 37855 37371 37785 38349 38994 40517 42405 43121 42790 43010
55394D3010R88N23J8N45N51j063k242j206L17K30l67J44N67n08j527p19N86N25
$$ 43010 43998 44521 44539 45084 45635 44572 42330 41124 41441 41671 41304 41448 42015 41507 39980 39261 39847 40372
55376D0372O9O20R95L2m33J252L030K300K17o46n93j218j828j067n4l70r28q6
$$ 40372 40441 41061 42056 42088 41655 42907 45937 48237 48454 47808 47215 45997 44169 43102 43048 42678 41750 41664
55358D1664J066Q06PJ05Q1j229k155r81N99K84q00m97K45n03j598q52P49Q35o3
$$ 41664 42730 43536 43543 43648 43729 42500 40345 39364 39963 40247 39447 38950 39195 38692 37094 36242 36991 37826 37763
55339C7763P3P31K19n84K04J524R95p75j295n46m12q71m22N72O08J55O34J246
$$ 37763 37836 38567 38786 38202 38406 39930 40925 40150 38855 38309 37897 37026 36604 37176 37784 37939 38573 39819
55321C9819K64j465j693o10j46l87K8P91N82m2M22J365J102J18J21P42L30q14
$$ 39819 40083 38618 36925 36315 36169 35782 35810 36601 37183 37141 37563 38928 40030 40148 40269 41011 41341 40527
55303D0527j087o62q79j355p83K98M55J54P05J407P92l59l43K15l22j183m39J167
$$ 40527 39440 38778 37899 36544 35761 36059 36514 36668 37373 38780 39572 39213 38870 39085 38763 37580 37141 38308
55285C8308J215k19q12J29J131J460J524R06r21k477j867L6Q61M76N13R74M99
$$ 38308 39523 39304 38492 38621 39752 41212 42736 43642 42721 40244 38377 38413 39274 39750 40263 41237 41736
55268D1736n86o79N3Q4m96k80O00Q01M29N99R53M18l34qN94o3j062m25J130J228
$$ 41736 41150 40471 40524 40608 40112 39832 40432 41233 41662 42261 43214 43632 43298 43290 43884 43821 42759 42334 43464 44692
55248D4692n5n46L8l0r18j003j19J76l90n39j05q4k30M78J283N23j193j691q14
$$ 44692 44637 44091 44129 44099 43181 42178 42059 42235 41845 41306 41201 41117 40887 41365 42648 43171 41978 40287 39473
55229C9473l32n68k09P12Q16K69N78J568J538M25j60Q9Ql55R9Q76M78n62l09R51
$$ 39473 39141 38573 38364 39076 39892 40161 40739 42307 43845 44270 44110 44199 44207 43852 43951 44827 45305 44743 44434 45385
55209D5385R90n02j501j210q53p56J70J668J987R34K23M27M14j8J47N50l81k216
$$ 45385 46375 45873 44372 43162 42309 41553 41723 43391 45378 46312 46535 46962 47376 47358 47505 48055 47674 45458
55191D5458k536p39J003J184O87N13L98L04P53J254O90m56o08Q9oj009j424j052
$$ 45458 42922 42183 43186 44370 45057 45570 45968 46272 47025 48279 48969 48513 47905 47994 47988 46979 45555 44503
55173D4503j151j554o91J300K373J909J354J219M28q80j029M7L44p26j303m51
$$ 44503 43352 41798 41107 42407 44780 46689 48043 49262 49690 48810 47781 47828 48172 47446 46143 45692
55157D5692K96j52o67j66O09P32M87K04m24j226j506j411j540j279L31K223K353
$$ 45692 45988 45836 45169 45003 45612 46344 46831 47035 46611 45385 43879 42468 40928 39649 39980 42203 44556
55140D4556J053O09J478J761P15k23l18n30j050o99M68P54k36q47l32M8l72n32
$$ 44556 45609 46218 47696 49457 50172 49949 49631 49101 48051 47352 47820 48574 48338 47491 47159 47207 46835 46303
55122D6303P2M56J98J49M74L40LP02K101K373J294N89P92M92p71j678j653j531
$$ 46303 46375 46831 47029 47178 47652 47992 47995 48697 50798 53171 54465 55054 55846 56338 55567 53889 52236 50705
55104E0705j277M3J688J698M33L60J775K229J004M16J493K028O36p58m09M78M72
$$ 50705 49428 49471 51159 52857 53290 53650 55425 57654 58658 59074 60567 62595 63231 62473 62064 62542 63014
55087F3014M60J355J920J150L47P59J284N61o13q21k48L34R84J641J507O02J67
$$ 63014 63474 64829 66749 67899 68246 69005 70289 70850 70237 69416 69168 69502 70486 72127 73634 74236 74403
55070G4403M75K74p00j003j88K49k71k74Q05J300L42m36J5K01r97k038j454l76
$$ 74403 74878 75152 74452 73449 73261 73510 73239 72965 73770 75070 75412 74976 74991 75192 74195 72157 70703 70327
55052G0327k42k45O61J409P62k64k23K00l37j354j618j289j109p66J24P30L35
$$ 70327 70085 69840 70501 71910 72672 72408 72185 72385 72048 70694 69076 67787 66678 65912 66036 66766 67101
55035F7101k98l74m78j102j326m04P64J181J316J766J894J196N27O56J010R76
$$ 67101 66803 66429 65951 64849 63523 63119 63883 65064 66380 68146 70040 71236 71763 72419 73429 74405
55019G4405R97J326J364J179J751K799K539O88o17k25J48r61k239k074j276j218
$$ 74405 75402 76728 78092 79271 81022 83821 86360 87048 86431 86206 86354 85393 83154 81080 79804 78586
55003G8586j350o66J70K20J57P75J250P70K07L69L35o30j285n86J93l76j268p73
$$ 78586 77236 76570 76740 76960 77117 77892 79142 79912 80119 80488 80823 80193 78908 78322 78515 78139 76871 76098
54985G6098N67J073O38K36p7o36q31j30N95M85K52P60J400J424J443J939J953
$$ 76098 76665 77738 78376 78612 78535 77899 77068 76938 77533 78018 78270 79030 80430 81854 83297 85236 87189
54968H7189Q94Q3O67J702K028K310L295L918L359L117M655O693P290P136Q126
$$ 87189 88083 88166 88833 90535 92563 94873 98168 102086 105445 108562 113217 119910 127200 134336 142462
54953A42462J0055J1427J2372J3942J5544J5722J4815J4143J3262J0600O253J799
$$ 142462 152517 163944 176316 190258 205802 221524 236339 250482 263744 274344 280597 282396
54941B82396k309o662j0608j2521j2399j2090j2706j3536j3571j2599j0778q433
$$ 282396 280087 273425 262817 250296 237897 225807 213101 199565 185994 173395 162617 154184
54929A54184o246m694l615k950l040l445k827r91L45J08l56M16J589J733J376
$$ 154184 147938 143244 139629 136679 133639 130194 127367 126376 126721 126829 126473 126889 128478 130211 131587
54914A31587J866L023M069N562Q197J0830J1970J2265J3171J4193J3774J2047
$$ 131587 133453 136476 140545 146107 154304 165134 177104 189369 202540 216733 230507 242554
54902B42554J0264Q200M678J72l505n965q338j0818j2292j2434j2182j2009j1482
$$ 242554 252818 261018 265696 265868 262363 256398 248060 237242 224950 212516 200334 188325 176843
54889A76843j0534r679q984q131p300o730n864m187k421j549j267p83l84q23j764
$$ 176843 166309 156630 147646 139515 132215 125485 119621 115434 113013 111464 110197 109414 109030 108207 106443
54874A06443k312k442k517k205j265n61q17j243q84l19n12j028j050j057j683
$$ 106443 104131 101689 99172 96967 95702 95141 94324 93081 92197 91878 91366 90338 89288 88231 86548
54859H6548k003r77L40J45j279k167j977j564j218n28J99K55j48m46r55k023k750
$$ 86548 84545 83568 83908 84053 82774 80607 78630 77066 75848 75320 75519 75774 75626 75180 74225 72202 69452
54842F9452k171r57l22j66Q6k8q80j345m95M78J43n67PJ208J288N99Q97K115K580
$$ 69452 67281 66324 66002 65836 65922 65894 65014 63669 63174 63652 63795 63228 63235 64443 65731 66330 67227 69342 71922
54823G1922J925J213O98m2k78R37K526K671J849J960K908K874J699J081J503J846
$$ 71922 73847 75060 75758 75716 75438 76375 78901 81572 83421 85381 88289 91163 92862 93943 95446 97292
54807I7292K041L199M940N563N173N782P795R255R288R528J1110J2815J3364J3400
$$ 97292 99333 102532 107472 113035 118208 123990 131785 141040 150328 159856 170966 183781 197145 210545
54793B10545J3864J4288J3751J2125R478N723J467k167n006p765j0260j1313j0699
$$ 210545 224409 238697 252448 264573 274051 279774 281241 279074 274068 266303 256043 244730 234031
54780B34031r626q940q444q129q375q686p898o067m534l951l676l314l095k683
$$ 234031 224405 215465 207021 198892 190517 181831 173933 167866 163332 159381 155705 152391 149296 146613
54766A46613j328N67J740K120K798L852M095L337L032M154O068P987R931J1842
$$ 146613 145285 145852 147592 149712 152510 156362 160457 163794 166826 170980 177048 185035 194966 206808
54752B06808J3241J4149J4958J5181J3871J1297Q616N867K070k500o059p737q526
$$ 206808 220049 234198 249156 264337 278208 289505 298121 303988 306058 303558 297499 289762 281236
54739B81236r446j0377j1101j1879j2515j2328j1359j0331r302p754n988m926
$$ 281236 271790 261413 250312 238433 225918 213590 202231 191900 182598 174844 168856 163930
54727A63930m601m371m394n159n809n048l518l107l884l972k694j469j218j170
$$ 163930 159329 154958 150564 145405 139596 134548 131030 127923 124039 120067 117373 115904 114686 113516
54713A13516q26q80j477j604r41m31m27j77L39R0q49r25L07J284R34J57j34m73
$$ 113516 112690 111810 110333 108729 107788 107357 106930 106753 107092 107182 106333 105408 105715 106999 107933 108090 107956 107483
54695A07483j260j565p09M37Q31O24K95k30p89p10OM50L78N89J270J531J135J062
$$ 107483 106223 104658 103949 104386 105217 105841 106136 105906 105117 104407 104413 104863 105241 105830 107100 108631 109766 110828
54677A10828J671J862Q55n73j365j354o34P72K150K427J809J585K107K489K526
$$ 110828 112499 114361 115216 114643 113278 111924 111290 112062 114212 116639 118448 120033 122140 124629 127155
54662A27155K987L732L566K504K041K495K331R74K1N68J430J329Q68J015J361
$$ 127155 130142 133874 137440 139944 141985 144480 146811 147785 147806 148374 149804 151133 152001 153016 154377
54647A54377J316J322J643J503P10M82J351J989J535J364K863M950N656M982M426
$$ 154377 155693 157015 158658 160161 160871 161353 162704 164693 166228 167592 170455 175405 181061 186043 190469
54632A90469M532M642M350L724K543O33j514l314m801o049o623o378n920n707
$$ 190469 195001 199643 203993 207717 210260 210893 209379 206065 201264 195215 188592 182214 176294 170587
54618A70587n434m950m681m602l901k413j228j099j372j250j007j061r90l47M62
$$ 170587 165153 160203 155522 150920 147019 144606 143378 142279 140907 139657 138650 137589 136599 136252 136714
54603A36714Q81R56Q15L48j35K8O33O29j93q52q98j136k020k802k932k911l125
$$ 136714 137595 138551 139366 139714 139579 139607 140240 140869 140676 139824 138926 137790 135770 132968 130036 127125 124000
54586A24000l118k697k440k541k467k200k348k670k224j305j320k200k154p38
$$ 124000 120882 118185 115745 113204 110737 108537 106189 103519 101295 99990 98670 96470 94316 93578
54572I3578J67n07j222n94L14J42l58L1O67L73l84n38m62j032j748j545p02k90
$$ 93578 93745 93238 92016 91422 91736 91878 91520 91551 92218 92591 92207 91669 91207 90175 88427 86882 86180 85890
54554H5890m80p66j092j468j280j94J040J636J730J550Q17k31o00k30l60j250
$$ 85890 85410 84644 83552 82084 80804 80610 81650 83286 85016 86566 87383 87152 86552 86322 85962 84712
54538H4712j372k0J160P91K5L98J278J413J400K274L131K522J168R30J886K656
$$ 84712 83340 83320 84480 85271 85296 85694 86972 88385 89785 92059 95190 97712 98880 99810 101696 104352
54522A04352K856L038K835J447l75j067o53n07r80j147q14q21j325j566j461j810
$$ 104352 107208 110246 113081 114528 114153 113086 112433 111926 110946 109799 108985 108164 106839 105273 103812 102002
54506A02002k728l235k777j962j493j308r88l46M47Q91N57j36j35Q50J832J974
$$ 102002 99274 96039 93262 91300 89807 88499 87511 87165 87612 88503 89060 88924 88789 89639 91471 93445
54490I3445J620J317Q52J08j87L60R37P93M75P19J188J422J928L060L833L304
$$ 93445 95065 96382 97234 97342 97155 97515 98452 99245 99720 100439 101627 103049 104977 108037 111870 115174
54474A15174K222J889K195K199J898J937K243K281K123K049J730Q96J49l1k71
$$ 115174 117396 119285 121480 123679 125577 127514 129757 132038 134161 136210 137940 138836 138985 138954 138683
54459A38683j126j877j717j198j218j474j306j105j460j834j608j517k437l564
$$ 138683 137557 135680 133963 132765 131547 130073 128767 127662 126202 124368 122760 121243 118806 115242
54445A15242l480k371j555j372j200r38j018j342j582j929k409k217j080k58p73
$$ 115242 111762 109391 107836 106464 105264 104326 103308 101966 100384 98455 96046 93829 92749 92491 91718
54430I1718j601j295l92l50r89r60j80K48J08J14K87R7rR48K572L295K483R72
$$ 91718 90117 88822 88430 88080 87091 86131 85951 86199 86307 86421 86708 86805 86796 87744 90316 93611 96094 97066
54412I7066l16j007q63l8O40O66O49J098J312P22K46Q25J740J989K188L204M078
$$ 97066 96750 95743 94880 94842 95482 96148 96797 97895 99207 99929 100175 101000 102740 104729 106917 110121 114199
54395A14199L503K283K040K393J926J119J563K752K632J135L28Q78J175L27o29
$$ 114199 117702 119985 122025 124418 126344 127463 129026 131778 134410 135545 135873 136751 137926 138253 137624
54380A37624j051j752k983l594l017k190j703j026k09m09j839k946k642j785j595
$$ 137624 136573 134821 131838 128244 125227 123037 121334 120308 120099 119690 117851 114905 112263 110478 108883
54365A08883j894j859j344o76q3J61j53n85m94r0m8k37K3O23R00R80J387J606
$$ 108883 106989 105130 103786 103110 103027 103188 103035 102450 101956 101866 101818 101581 101604 102227 103127 104107 105494 107100
54347A07100P56m99n73N43J385J599K274L393L404J965R58J648K802K792J932
$$ 107100 107856 107357 106784 107327 108712 110311 112585 115978 119382 121347 122305 123953 126755 129547 131479
54332A31479J457J497J382R69N51J82j84m90r48j810k590k617k401l153m643n110
$$ 131479 132936 134433 135815 136784 137335 137517 137333 136843 135895 134085 131495 128878 126477 123324 118681 113571
54316A13571l819k172j621j834j870j767k018k414k488k284j999j537j060j169
$$ 113571 109752 107580 105959 104125 102255 100488 98470 96056 93568 91284 89285 87748 86688 85519
54302H5519j956k576k318j433m99K57O91N85J71Q9M82Q29Q39O79K11r30k263k580
$$ 85519 83563 80987 78669 77236 76737 76994 77685 78270 78441 78530 79012 79841 80680 81359 81570 80640 78377 75797
54284G5797j505p9O07M89j6o11q89l92O37J316J275J016R37Q56O75O96R76J138
$$ 75797 74292 74213 74820 75309 75293 74682 73793 73401 74038 75354 76629 77645 78582 79438 80113 80809 81785 82923
54266H2923J065J077J268J335J123P67L28l1Q8O12N92m91j545j255j00M34J70
$$ 82923 83988 85065 86333 87668 88791 89558 89886 89855 89943 90555 91147 90656 89111 87856 87756 88190 88360
54249H8360J24L72j3q82r40KN10j36q46o68j77j67l55k60j71l72m18Q5P83J173
$$ 88360 88484 88856 88843 87961 87021 87023 87533 87397 86551 85883 85706 85539 85184 84924 84753 84381 83963 84048 84831 86004
54229H6004J117M99o77j631j403l51J02n05j136j002n69l76j73K40M85M17M00
$$ 86004 87121 87620 86943 85312 83909 83558 83660 83155 82019 81017 80448 80072 79899 80139 80624 81041 81441
54212H1441M12no11n28J69K86o44j565j544r30l75J23N84O37L51L99Q29Q10Q4
$$ 81441 81853 81848 81237 80709 80878 81164 80520 78955 77411 76481 76106 76229 76813 77450 77801 78200 79029 79839 79923
54193G9923m16k1P14J045J006P99K16o82j304j404j367j277o83L10Q13M28k10
$$ 79923 79507 79486 80200 81245 82251 83050 83266 82584 81280 79876 78509 77232 76549 76859 77672 78100 77890
54176G7890m99n56n54m17l51o21p41l4R86J163N62K55K65m44j664j721j87J164
$$ 77890 77391 76835 76281 75864 75513 74892 74151 74117 75103 76266 76828 77083 77348 76904 75240 73519 73332 74496
54158G4496R92J98K7Q5m91j303j401p27K50J294K056J912J011M31O35Q39M99J38
$$ 74496 75488 75686 75713 75798 75307 74004 72603 71876 72126 73420 75476 77388 78399 78830 79465 80304 80803 80941
54140H0941O3l15j156j492p76J25L67K68K52n7p68j039m22K89L90K33J15m22j284
$$ 80941 81004 80689 79533 78041 77265 77390 77757 78025 78277 78220 77452 76413 75991 76280 76670 76903 77018 76596 75312
54121G5312j344l27K98m81j526j377m81j10k20N7O49Q08N12L05K41J19J47M50
$$ 75312 73968 73641 73939 73458 71932 70555 70074 69964 69744 69801 70450 71258 71770 72075 72316 72435 72582 73032
54103G3032N61K53J34N89R14M69j91k60Pq9m92p19p45p83p82p70r53j048m16O85
$$ 73032 73593 73846 73980 74569 75483 75952 75761 75501 75508 75419 74927 74208 73463 72680 71898 71128 70175 69127 68711 69396
54083F9396J131O98M90J002J192L48n40l55M80R73J048R81N34k66n49M2M71j35
$$ 69396 70527 71225 71715 72717 73909 74257 73717 73362 73842 74815 75863 76844 77378 77112 76563 76605 77076 76941
54065G6941j071j195n23K81R59J314R54K55M05J527K145J396L26mr5m32k2J760
$$ 76941 75870 74675 74152 74433 75392 76706 77660 77915 78320 79847 81992 83388 83714 83710 83615 83183 83161 84921
54047H4921L391L118J562O32P96J109J129J144J229J387J999K958L334K910K878
$$ 84921 88312 91430 92992 93624 94420 95529 96658 97802 99031 100418 102417 105375 108709 111619 114497
54032A14497L776M255L291K104K191K960L192L398M546N717N413M248L928M391
$$ 114497 118273 122528 125819 127923 130114 133074 136266 139664 144210 149927 155340 159588 163516 167907
54018A67907M267L546L355L572K992J643O94L09l37j081r26r3J42l73o23n29j064
$$ 167907 172174 175720 179075 182647 185639 187282 187976 188285 187948 186867 185941 185848 185990 185617 184994 184465 183401
54001A83401k195k632j966j238j096j031p35o30p10l56L63N91O8n53r38j326j520
$$ 183401 181206 178574 176608 175370 174274 173243 172508 171878 171168 170812 171175 171766 171834 171281 170343 169017 167497
53984A67497j034l09m04j296j839j593j366j640j816j444j016j092j471j687j650
$$ 167497 166463 166154 165750 164454 162615 161022 159656 158016 156200 154756 153740 152648 151177 149490 147840
53969A47840j501j431j615j877j621o13N25J163J474J712J443M38m43l30L42P28
$$ 147840 146339 144908 143293 141416 139795 139182 139707 140870 142344 144056 145499 145937 145494 145164 145506 146234
53953A46234R91J592J880J027k53m35O34J851K725L581M228M054L364L219L916
$$ 146234 147225 148817 150697 151724 151471 151036 151670 153521 156246 159827 164055 168109 171473 174692 178608
53938A78608M851N718O561O972O534N794N493N239M307L273L174L483K627M95
$$ 178608 183459 189177 195738 202710 209244 215038 220531 225770 230077 233350 236524 240007 242634 243129
53924B43129j372k032j999j754j029J47J115J542J637J403Q10N10J143K177K738
$$ 243129 241757 239725 237726 235972 234943 235090 236205 237747 239384 240787 241597 242107 243250 245427 248165
53909B48165L158M245N408N301M095L282L305L176K570K327K606K323R87m38j067
$$ 248165 251323 255568 260976 266277 270372 273654 276959 280135 282705 285032 287638 289961 290948 290510 289443
53894B89443j175j300j507j880k589l248l268k994l326m199m716m717m951n585
$$ 289443 288268 286968 285461 283581 280992 277744 274476 271482 268156 263957 259241 254524 249573 243988
53880B43988n870n472m859m372m033m124m757n072m260l068k788l129k771j822
$$ 243988 238118 232646 227787 223415 219382 215258 210501 205429 201169 198101 195313 192184 189413 187591
53866A87591j744k830l725l672l364l294l073k743l019l810m130l797l651l817
$$ 187591 185847 183017 179292 175620 172256 168962 165889 163146 160127 156317 152187 148390 144739 140922
53852A40922l493k721k539k941k582j052L21N39J85L1m0j16O5P6r54k533k955
$$ 140922 137429 134708 132169 129228 126646 125594 125915 126454 126639 126670 126630 126514 126579 126655 125701 123168 120213
53835A20213j827o88n49o72m00k92n73l38O56J185O06O3N05J088P34j44p17j129
$$ 120213 118386 117698 117149 116477 116077 115785 115212 114874 115530 116715 117321 117384 117889 118977 119711 119567 118850 117721
53817A17721j625j630q68j54KL21J184J574Q04pL77J298J375P21M97J024J731
$$ 117721 116096 114466 113598 113444 113446 113767 114951 116525 117329 117322 117699 118997 120372 121093 121590 122614 124345
53800A24345K405L127L496L093K468K620L729N109O031O065N120L787L078L309
$$ 124345 126750 129877 133373 136466 138934 141554 145283 150392 156423 162488 167608 171395 174473 177782
53786A77782L744L704L317K867K321J892K041K457K060N97p27q90l39m6k46p52
$$ 177782 181526 185230 188547 191414 193735 195627 197668 200125 202185 202782 202055 201165 200826 200780 200534 199782
53770A99782j549k353k519k073j967k671l343l111k290j680j493j518j628j588
$$ 199782 198233 195880 193361 191288 189321 186650 183307 180196 177906 176226 174733 173215 171587 169999
53756A69999j143p04r89j762j939j279p52q65r51o31n46r87j241j018j112j807
$$ 169999 168856 168152 167163 165401 163462 162183 161431 160566 159615 158984 158438 157451 156210 155192 154080 152273
53740A52273j984r15M32R26R05J154J418J129O51O10P96P54P43J108J487J498
$$ 152273 150289 149374 149806 150732 151637 152791 154209 155338 155989 156599 157395 158149 158892 160000 161487 162985
53724A62985J441J539J352O95K28L28L73j14o01n89m29l44K09J365K203K129J716
$$ 162985 164426 165965 167317 168012 168240 168568 168941 168827 168226 167637 167208 166864 167073 168438 170641 172770 174486
53707A74486J421P19m99j197r44q95j749k199j041N77P65k45p21j35N48O98N16
$$ 174486 175907 176626 176127 174930 173986 173091 171342 169143 168102 168679 169444 169199 168478 168343 168891 169589 170105
53690A70105J07m57n24M10J755K650L170L607L366J940K67l05P6K64J6P1O86J383
$$ 170105 170212 169755 169231 169641 171396 174046 177216 180823 184189 186129 186396 186091 186167 186431 186447 186518 187204 188587
53672A88587J863K063J721Q79L98Q94J646J617R98O27N38K52l5J15L44P2l18j23
$$ 188587 190450 192513 194234 195113 195511 196405 198051 199668 200666 201293 201831 202083 202048 202163 202507 202579 202261 202138
53654B02138L25K14k84l85j08o2j87k5R1n88j790k417k040j197l89K63N80N21
$$ 202138 202463 202677 202393 202008 201900 201838 201651 201626 201717 201129 199339 196922 194882 193685 193296 193559 194139 194660
53636A94660N37Q21O53n42j915k105j063R7P17J014J206J291J499J931K060J456
$$ 194660 195197 196018 196671 196129 194214 192109 191046 191143 191860 192874 194080 195371 196870 198801 200861 202317
53620B02317O64M51O94R26J317K071K446J736P27P89J877K733K787K533K272J843
$$ 202317 202981 203432 204126 205052 206369 208440 210886 212622 213349 214138 216015 218748 221535 224068 226340 228183
53604B28183J516J806K450K704K593K813L437L881M049M430N008N108M425L411
$$ 228183 229699 231505 233955 236659 239252 242065 245502 249383 253432 257862 262870 267978 272403 275814
53590B75814K613K323K651L263L353K644J986K156K597K323J503J033J040J015
$$ 275814 278427 280750 283401 286664 290017 292661 294647 296803 299400 301723 303226 304259 305299 306314
53576C06314R64J230J512J251P15N34N48K31j06J84Q03J042J128J692K262J887
$$ 306314 307278 308508 310020 311271 311986 312520 313068 313299 313193 313377 314180 315222 316350 318042 320304 322191
53560C22191R58P86J419J520N63m11m34L37J417K536L153K781J985J895K503K699
$$ 322191 323149 323935 325354 326874 327437 327026 326592 326929 328346 330882 334035 336816 338801 340696 343199 345898
53544C45898K116J701K099K833L370L789L975L355K085J367J965L163L800L622
$$ 345898 348014 349715 351814 354647 358017 361806 365781 369136 371221 372588 374553 377716 381516 385138
53530C85138L218L207L818M746N248M884M251M399N495O755P558P904P895P643
$$ 385138 388356 391563 395381 400127 405375 410259 414510 418909 424404 431159 438717 446621 454516 462159
53516D62159P656Q453R653J0358J0434J0609J1210J1677J1573J1307J1613J2792
$$ 462159 469815 478268 487921 498279 508713 519322 530532 542209 553782 565089 576702 589494
53504E89494J4520J6040J6740J6881J7420J8648J9626J9657J9512K0211K1301
$$ 589494 604014 620054 636794 653675 671095 689743 709369 729026 748538 768749 790050
53493G90050K1664K1405K1508K2007K2037K1514K1252K1403K1299K0863K0783
$$ 790050 811714 833119 854627 876634 898671 920185 941437 962840 984139 1005002 1025785
53482A025785K1112K1120K0717K0671K1132K1227K0524J9701J9362J9328J9392
$$ 1025785 1046897 1068017 1088734 1109405 1130537 1151764 1172288 1191989 1211351 1230679 1250071
53471A250071J9709K0036J9667J8551J7510J7008J6562J5692J4500J3115J1470
$$ 1250071 1269780 1289816 1309483 1328034 1345544 1362552 1379114 1394806 1409306 1422421 1433891
53460A433891R846Q722P865O496M501K527P61j222l328m844n769o969q641r820
$$ 1433891 1443737 1452459 1460324 1466820 1471321 1473848 1474609 1473387 1470059 1465215 1459446 1452477 1443836 1434016
53446A434016j0040j0236j1369j3009j4158j4648j5016j5532j6071j6586j7156
$$ 1434016 1423976 1413740 1402371 1389362 1375204 1360556 1345540 1330008 1313937 1297351 1280195
53435A280195j7779j8340j8647j8505j8048j7737j7609j6907j5131j3012j1577
$$ 1280195 1262416 1244076 1225429 1206924 1188876 1171139 1153530 1136623 1121492 1108480 1096903
53424A096903j0653r386p843o849o441n816m767l828k971j584J01J061J251J847
$$ 1096903 1086250 1076864 1069021 1062172 1055731 1049915 1045148 1041320 1038349 1036765 1036866 1037927 1039178 1041025
53410A041025L350M777N348N679O584P899R200J0688J2559J4405J5885J7320J8980
$$ 1041025 1044375 1049152 1054500 1060179 1066763 1074662 1083862 1094550 1107109 1121514 1137399 1154719 1173699
53397A173699K0420K1150K1442K1970K3136K4967K7158K9090L0360L1380L2823
$$ 1173699 1194119 1215269 1236711 1258681 1281817 1306784 1333942 1363032 1393392 1424772 1457595
53386A457595L4619L6213L7682L9567M1681M3185M3898M4410M4893M5011M5074
$$ 1457595 1492214 1528427 1566109 1605676 1647357 1690542 1734440 1778850 1823743 1868754 1913828
53375A913828M5930M7357M7859M6564M4274M2235M0845L9879L8912L7194L4151
$$ 1913828 1959758 2007115 2054974 2101538 2145812 2188047 2228892 2268771 2307683 2344877 2379028
53364B379028L0351K6953K4072K0811J6959J3298J0033O435K370j362m750q899
$$ 2379028 2409379 2436332 2460404 2481215 2498174 2511472 2521505 2527940 2530310 2528948 2524198 2515299
53352B515299j4000j8548k1468k3567k5895k8158k9859l1641l4107l6497l7835
$$ 2515299 2501299 2482751 2461283 2437716 2411821 2383663 2353804 2322163 2288056 2251559 2213724
53341B213724l8516l9422m0330m0500m0135l9892l9448l7937l5579l3675l2979
$$ 2213724 2175208 2135786 2095456 2054956 2014821 1974929 1935481 1897544 1861965 1828290 1795311
53330A795311l2965l2670l1650l0173k8885k8171k7584k6306k4261k2262k0731
$$ 1795311 1762346 1729676 1698026 1667853 1638968 1610797 1583213 1556907 1532646 1510384 1489653
53319A489653j9160j7155j5231j3968j3085j2059j1003j0397j0352j0720j1366
$$ 1489653 1470493 1453338 1438107 1424139 1411054 1398995 1387992 1377595 1367243 1356523 1345157
53308A345157j1956j2020j1599j1308j1414j1387j0701r468q022o549n357m724
$$ 1345157 1333201 1321181 1309582 1298274 1286860 1275473 1264772 1255304 1247282 1240733 1235376 1230652
53296A230652m240l121j444j78K76O43J539K685L762N001O431P533Q206R140J0682
$$ 1230652 1226412 1223291 1221847 1221669 1221945 1222588 1224127 1226812 1230574 1235575 1242006 1249539 1257745 1266885 1277567
53281A277567J2268J3560J5068J7016J8624J9270J9549K0238K1024K1002J9852
$$ 1277567 1289835 1303395 1318463 1335479 1354103 1373373 1392922 1413160 1434184 1455186 1475038
53270A475038J7959J5934J4452J3835J3366J1907R486P341O032M705K764R09k95
$$ 1475038 1492997 1508931 1523383 1537218 1550584 1562491 1571977 1579318 1585350 1590055 1592819 1593728 1593433
53257A593433j613l866o465q397r756j1237j2828j4131j5316j6741j8098j8905
$$ 1593433 1591820 1587954 1581489 1573092 1563336 1552099 1539271 1525140 1509824 1493083 1474985 1456080
53245A456080j9421k0221k1230k1885k1987k1802k1615k1582k1626k1296k0323
$$ 1456080 1436659 1416438 1395208 1373323 1351336 1329534 1307919 1286337 1264711 1243415 1223092
53234A223092j9359j9280j9688j9206j7575j6189j6022j6326j6074j5435j4929
$$ 1223092 1203733 1184453 1164765 1145559 1127984 1111795 1095773 1079447 1063373 1047938 1033009
53223A033009j4270j3013j1556j0498r767r033q327p656o885o345o630p393p539
$$ 1033009 1018739 1005726 994170 983672 973905 964872 956545 948889 942004 935659 929029 921636 914097
53210I14097o991o906p697q467q929j0024j1809j2679j1985j1486j2666j4309
$$ 914097 907106 900200 892503 884036 875107 865083 853274 840595 828610 817124 804458 790149
53198G90149j4560j3770j3333j3103j2187j1203j1470j2555j2753j1689j0580
$$ 790149 775589 761819 748486 735383 723196 711993 700523 687968 675215 663526 652946
53187F52946j0257j0554j1347j2592j3600j3649j3117j2847j2876j2896j3176
$$ 652946 642689 632135 620788 608196 594596 580947 567830 554983 542107 529211 516035
53176E16035j3759j3631j2191j0702j0589j1092j0423q629p337p167p302p326
$$ 516035 502276 488645 476454 465752 455163 444071 433648 425019 417682 410515 403213 395887
53164C95887p496p439o481n296n302o378o960o437n757n511n214m757m812n371
$$ 395887 388391 380952 374471 369175 363873 357495 350535 344098 338341 332830 327616 322859 318047 312676
53150C12676n443m694m024l977l955l490l065l068l002k376j547j153j304j689
$$ 312676 307233 302539 298515 294538 290583 287093 284028 280960 277958 275582 274035 272882 271578 269889
53136B69889j909j595p77j11j47m83l64J42L89L24M70Q87J098R92R28J026J095
$$ 269889 267980 266385 265608 265497 265350 264867 264503 264645 265034 265358 265828 266715 267813 268805 269733 270759 271854
53119B71854J123J153R17K80k98m82p46j548k452k978l580m722n656n378m269
$$ 271854 272977 274130 275047 275327 275029 274547 273801 272253 269801 266823 263243 258521 252865 247487 243218
53104B43218l516l466l757m390n299n509m354k929k715l310l261k561k361k647
$$ 243218 239702 236236 232479 228089 222790 217281 212927 209998 207283 203973 200712 198151 195790 193143
53090A93143k339j537j491k279k629k243k193k718k716j960j708k420k860k250
$$ 193143 190804 189267 187776 185497 182868 180625 178432 175714 172998 171038 169330 166910 164050 161800
53076A61800j520j483j497r53n11p40r77o39m43j150k139k366j893j417j091p05
$$ 161800 160280 158797 157300 156347 155836 155096 154119 153480 153037 151887 149748 147382 145489 144072 142981 142276
53060A42276l56j50J79P48J156J151R84P24N1r08j399j223j195j892k741k887
$$ 142276 141920 141770 141949 142697 143853 145004 145988 146712 146763 145855 144456 143233 142038 140146 137405 134518
53044A34518k275j326l00N53Q27M21k76r54j457j400m88O48R27L17j59pJ79j6
$$ 134518 132243 130917 130617 131170 131997 132418 132142 131188 129731 128331 127843 128491 129418 129735 129576 129569 129748 129732
53026A29732k56m44r86j645j429k41O09L33j25K93J052J095O38O70J205J302N75
$$ 129732 129476 129032 128046 126401 124972 124731 125340 125673 125548 125841 126893 127988 128626 129296 130501 131803 132378
53009A32378k83m96j9O49J003R45Q58J115J505J428P50k5m45n13l82j71j03k49
$$ 132378 132095 131599 131580 132229 133232 134177 135035 136150 137655 139083 139833 139808 139363 138850 138468 138297 138194 137945
52991A37945k44K24P82Q88P20P53Q27O68Q81K135L560L599K453K006K987L923
$$ 137945 137701 137925 138707 139595 140315 141068 141895 142563 143444 145579 149139 152738 155191 157197 160184 164107
52975A64107L528K489K047K159K140J950J852J640J172Q32P71M23m83j295j510
$$ 164107 167635 170124 172171 174330 176470 178420 180272 181912 183084 183916 184687 185110 184627 183332 181822
52960A81822j531j680j501q47o45j461k240j650p9R05O75m0n67j026j592j932
$$ 181822 180291 178611 177110 176263 175618 174157 171917 170267 170188 171093 171768 171728 171161 170135 168543 166611
52944A66611j634p26L00Q55O91J31l04m87o11o17l02R3O1k98l51K5K50O7m4K75
$$ 166611 164977 164251 164551 165406 166097 166228 165924 165437 164826 164209 163907 164000 164061 163763 163412 163437 163687 163754 163710 163985
52924A63985P29R92J064Q75K94k64j42M95Q36P64R72J502J397K83q58j114q12
$$ 163985 164714 165706 166770 167645 167939 167675 167533 168028 168864 169628 170600 172102 173499 173782 172924 171810 170998
52907A70998o46n90l26Q8N47J114J508J229N89N62J249J574J042N34P48J047P01
$$ 170998 170352 169762 169436 169524 170071 171185 172693 173922 174511 175073 176322 177896 178938 179472 180220 181267 181968
52890A81968J62J71N83Q75R97R30L96l07j93Q46J447O68n94j049q17o85n81l3
$$ 181968 182130 182301 182884 183759 184756 185686 186082 185775 185582 186428 187875 188543 187949 186900 186083 185398 184817 184784
52872A84784O71R77J104J465J710J364Q24O90Q14R24J379K277K649J801O84P06
$$ 184784 185455 186432 187536 189001 190711 192075 192899 193589 194403 195327 196706 198983 201632 203433 204117 204823
52856B04823J722K500K585K396K049J419J043J584K612L092K816K323J725P70
$$ 204823 206545 209045 211630 214026 216075 217494 218537 220121 222733 225825 228641 230964 232689 233459
52842B33459k17n86m15k74j90J54N22M09Qj89l92r79j367p01M76O24o05j872k033
$$ 233459 233242 232656 232241 231967 231777 231931 232453 232862 232870 232681 232289 231310 229943 229242 229718 230342 229737 227865 225832
52823B25832j438j012j059j387j789k010j749j117o42p09j244j932k371k229j612
$$ 225832 224394 223382 222323 220936 219147 217137 215388 214271 213629 212920 211676 209744 207373 205144 203532
52808B03532j138j211j526j646j649j703j595j278j317j949k311j537k39K31l50
$$ 203532 202394 201183 199657 198011 196362 194659 193064 191786 190469 188520 186209 184672 184433 184664 184314
52793A84314j003j161j194j388j455j229j000r51j000j183j594j890j613r67o29
$$ 184314 183311 182150 180956 179568 178113 176884 175884 174933 173933 172750 171156 169266 167653 166686 166057
52778A66057q13j178j563k036k286j795p15J17J92k47p73j142j089m58L23M96
$$ 166057 165244 164066 162503 160467 158181 156386 155671 155788 155980 155733 154960 153818 152729 152271 152594 153090
52762A53090o5o94q44p77j109k002k937l172k435j295o38p08r61r93j099j547
$$ 153090 153025 152331 151487 150710 149601 147599 144662 141490 139055 137760 137122 136414 135453 134460 133361 131814
52746A31814j953j883j651j839k414k907l085k874k047p37J59j00j017j391p77
$$ 131814 129861 127978 126327 124488 122074 119167 116082 113208 111161 110424 110583 110483 109466 108075 107298
52731A07298K29R56J169Q94L82J60M71Q79Q86O43M53L7r20j831j771q37j33l47
$$ 107298 107527 108483 109652 110546 110928 111088 111559 112438 113324 113967 114420 114457 113537 111706 109935 109098 108965 108618
52713A08618j146j846k050j606n98N39J363J841K068J870J203O18O42R74R72O45
$$ 108618 107472 105626 103576 101970 101372 101911 103274 105115 107183 109053 110256 110874 111516 112490 113462 114107
52697A14107M98N33L00k21n22m05k83m85q19r76r58j016j367j879k075j661j135
$$ 114107 114605 115138 115438 115217 114695 114290 114007 113522 112703 111727 110769 109753 108386 106507 104432 102771 101636
52680A01636j293k029k375j960j566j731j801j132k30K06M71J011J169J09j553
$$ 101636 100343 98314 95939 93979 92413 90682 88881 87749 87519 87725 88196 89207 90376 90485 88932
52665H8932k398k113j563j208p61k40j19m13o37o59o59m48K27Q61P35J59R6O59
$$ 88932 86534 84421 82858 81650 80889 80649 80530 80117 79480 78821 78162 77714 77941 78802 79537 79696 79792 80451
52647H0451J002O65O3l47m41o9P00J129O38j00M7R08J256P92N60J202J998K070
$$ 80451 81453 82118 82181 81834 81393 81324 82024 83153 83791 83691 83738 84646 85902 86694 87254 88456 90454 92524
52629I2524J474P27P6m38q29j315j995k408k076j419j274j554j378n54R2Mm04
$$ 92524 93998 94725 94801 94363 93534 92219 90224 87816 85740 84321 83047 81493 80115 79561 79653 79657 79253
52612G9253n15j96L91R35R17J92m49j15Q81J429J166O57K12l12o46k81L87L53
$$ 79253 78738 78542 78933 79868 80785 80977 80528 80413 81294 82723 83889 84546 84758 84446 83800 83519 83906 84259
52594H4259m49j034r75q26q18l77O23J416J575J588J773J689J138O55N58M33K4
$$ 84259 83810 82776 81801 80975 80157 79780 80403 81819 83394 84982 86755 88444 89582 90237 90795 91228 91252
52577I1252k84k87k38JR70K299K635J548L75L51R47R60L45l4J14L38L34K44K66
$$ 91252 90968 90681 90443 90444 91414 93713 96348 97896 98271 98622 99569 100529 100874 100840 100954 101292 101626 101870 102136
52558A02136N16R68J252R44K82j9J51J36k52k61N60J536J858J698J620J629J461
$$ 102136 102652 103620 104872 105816 106098 106079 106230 106366 106114 105853 106413 107949 109807 111505 113125 114754 116215
52541A16215J212J046P88M53N37J179J646J367Q96J018J383R64l21j383j353n03
$$ 116215 117427 118473 119261 119714 120251 121430 123076 124443 125339 126357 127740 128704 128383 127000 125647 125144
52525A25144L15O83Q12J065J400J390P58j69p65p82m25Q0N95Q35N88J41q2k19
$$ 125144 125459 126142 126954 128019 129419 130809 131567 131398 130633 129851 129426 129506 130101 130936 131524 131665 131583 131364
52507A31364p41j527j852j444p83k91J31N34O41L95J14p6m10q15q25l54J22M00
$$ 131364 130623 129096 127244 125800 125017 124726 124857 125391 126032 126427 126541 126465 126055 125240 124415 124061 124183 124583
52489A24583Q11J372J494R54M12M57P62P02K53j85m15m17j22L90P73Q60Q78J002
$$ 124583 125394 126766 128260 129214 129626 130083 130845 131547 131800 131615 131200 130783 130661 131051 131824 132684 133562 134564
52471A34564J083R26N15k01j191j937j716n04Q27J503J549J415J340J232Q99K83
$$ 134564 135647 136573 137088 136887 135696 133759 132043 131539 132366 133869 135418 136833 138173 139405 140304 140587
52455A40587k29L6J121K063K020J437J309J611J533R48N31M87M17L30N54O25k25
$$ 140587 140358 140394 141515 143578 145598 147035 148344 149955 151488 152436 152967 153454 153871 154201 154755 155380 155155
52438A55155j381j187N57K017J854Q75M41N42M87K72K96N22Q79J630K556K675
$$ 155155 153774 152587 153144 155161 157015 157890 158331 158873 159360 159632 159928 160450 161329 162959 165515 168190
52422A68190J618M82M02J021J274R66O51N01K60r2l34m34m46l89n31j199k040
$$ 168190 169808 170290 170692 171713 172987 173953 174604 175105 175365 175273 174939 174505 174059 173670 173139 171940 169900
52405A69900k193j574j092j205j266q53o36j168j778j603q48j59M45J085J279
$$ 169900 167707 166133 165041 163836 162570 161717 161081 159913 158135 156532 155684 155525 155970 157055 158334
52390A58334O45j97l35K68J019J541J622J020%o16n54n25r03j007l50L55L86J84
$$ 158334 158979 158782 158447 158715 159734 161275 162897 163917 163917 163301 162747 162222 161319 160312 159962 160317 160703 160887
52372A60887L43L89k36p89j92J262K342K530K140J441P76Q66J808K369J605N05
$$ 160887 161230 161619 161383 160594 160402 161664 164006 166536 168676 170117 170893 171759 173567 175936 177541 178046
52356A78046N97J562J788R70M13Q39J554J926K223K643K779K476K204K213K227
$$ 178046 178643 180205 181993 182963 183376 184215 185769 187695 189918 192561 195340 197816 200020 202233 204460
52341B04460K209K544L191L507L218K839K829K962K837K407J871J416J274J569
$$ 204460 206669 209213 212404 215911 219129 221968 224797 227759 230596 233003 234874 236290 237564 239133
52327B39133K024K135J720J081P12J014J995L047L355K893K494K656K937K988
$$ 239133 241157 243292 245012 246093 246805 247819 249814 252861 256216 259109 261603 264259 267196 270184
52313B70184L377M558N772N979N349M853M754M621M462M749N472O217P028Q267
$$ 270184 273561 278119 283891 289870 295219 300072 304826 309447 313909 318658 324130 330347 337375 345642
52299C45642R656J0430J0427J0149R912R723R948J1065J2719J3920J4296J4417
$$ 345642 355298 365728 376155 386304 396216 405939 415887 426952 439671 453591 467887 482304
52287D82304J4842J5513J6205J6750J6901J6602J6458J7197J8636J9836K0327
$$ 482304 497146 512659 528864 545614 562515 579117 595575 612772 631408 651244 671571
52276F71571K0441K0428J9985J8888J7483J6312J5584J5126J4570J3662J2652
$$ 671571 692012 712440 732425 751313 768796 785108 800692 815818 830388 844050 856702
52265H56702J2110J2007J1390R518O956M906L732K880J918Q75k57j532k617l101
$$ 856702 868812 880819 892209 901727 908683 913589 917321 920201 922119 922994 922737 921205 918588 915487
52251I15487l172l376l779l998l924l789l618l280k878k527j848m46J378K963
$$ 915487 912315 908939 905160 901162 897238 893449 889831 886551 883673 881146 879298 878852 880230 883193
52237H83193M277N775P510R024J0086J0851J1418J1863J2501J3519J4377J4316
$$ 883193 887470 893245 900755 909779 919865 930716 942134 953997 966498 980017 994394 1008710
52225A008710J3341J2149J1221J0508R811Q889P390N279L100J385K6j250k332
$$ 1008710 1022051 1034200 1045421 1055929 1065740 1074629 1082019 1087298 1090398 1091783 1091809 1090559 1088227
52212A088227l174m309o124q091r461j0313j1210j2305j3504j4931j6364j6915
$$ 1088227 1085053 1080744 1074620 1066529 1057068 1046755 1035545 1023240 1009736 994805 978441 961526
52200I61526j6308j5834j6754j8333j8803j7856j6752j6222j5778j5009j4166
$$ 961526 945218 929384 912630 894297 875494 857638 840886 824664 808886 793877 779711
52189G79711j3323j2257j1230j0730j0399r455q107p309p113o654n898n879o859
$$ 779711 766388 754131 742901 732171 721772 712317 704210 696901 689788 683134 677236 671357 664498
52176F64498p679p410o486n692n106m583m260m072l587k779k178j985j867j784
$$ 664498 656819 649409 642923 637231 632125 627542 623282 619210 615623 612844 610666 608681 606814 605030
52162F05030k126k796l173l142l273l735m042m024l994l763k678r50K84O15P54
$$ 605030 602904 600108 596935 593793 590520 586785 582743 578719 574725 570962 568284 567334 567618 568233 568987
$$ [...]
##END NTUPLES=NMR SPECTRUM
##END=
