
##TITLE=AC1305_DOMAH11117_6534176_SSEQbSwYrv
##JCAMPDX= 6.0         $$ Bruker NMR JCAMP-DX V2.0
##DATA TYPE= NMR SPECTRUM
##DATA CLASS= NTUPLES
##ORIGIN= BRUKER
##OWNER= Administrator
$$ 1.72 TOPSPIN		Version 2.1
$$ 2012-07-17 00:27:22.375 -0500  Administrator@TOPSPIN
$$ Compression mode = diff/dup
##.OBSERVE FREQUENCY= 400.02188249412
##.OBSERVE NUCLEUS= ^1H
##.ACQUISITION MODE= SIMULTANEOUS (DQD)
##.ACQUISITION SCHEME= undefined
##.AVERAGES= 8
##.DIGITISER RES= 22
##SPECTROMETER/DATA SYSTEM= spect
##.PULSE SEQUENCE= zg30
##.SOLVENT NAME= COFFEE_meoh
##.SHIFT REFERENCE= INTERNAL, COFFEE_meoh, 1, 14.98509
##AUDIT TRAIL= $$ (NUMBER, WHEN, WHO, WHERE, PROCESS, VERSION, WHAT)
$$ ##TITLE= Audit trail, TOPSPIN		Version 2.1
$$ ##JCAMPDX= 5.01
$$ ##ORIGIN= Bruker BioSpin GmbH
$$ ##OWNER= Administrator
$$ $$ C:\Bruker\TOPSPIN/data/COFFEE/nmr/AC1305_DOMAH11117_6534176_SSEQbSwYrv/10/pdata/1/auditp.txt
$$ ##AUDIT TRAIL=  $$ (NUMBER, WHEN, WHO, WHERE, PROCESS, VERSION, WHAT)
(   1,<2012-07-17 00:27:14.812 -0500>,<Administrator>,<TOPSPIN>,<go>,<TOPSPIN 2.1>,
      <created by zg
	started at 2012-07-17 00:26:08.312 -0500,
	POWCHK enabled, PULCHK disabled,
       configuration hash MD5:
       6B 1B 68 BB D9 2E 58 E2 7F 35 AD 54 07 DF 0E 41
       data hash MD5: 64K
       63 DA 53 5F 52 B2 27 16 D4 B3 D8 69 F9 5C 49 C5>)
(   2,<2012-07-17 00:27:18.078 -0500>,<Administrator>,<TOPSPIN>,<proc1d>,<TOPSPIN 2.1>,
      <Start of raw data processing
       efp LB = 0 FT_mod = 6 PKNL = 1 PHC0 = 0 PHC1 = 0 SI = 32K 
       data hash MD5: 32K
       52 51 5E 42 B9 26 42 1D 76 7F 66 D9 71 AE 33 7D>)
(   3,<2012-07-17 00:27:18.390 -0500>,<Administrator>,<TOPSPIN>,<proc1d>,<TOPSPIN 2.1>,
      <pk PHC0 = 179.231 PHC1 = 0 
       data hash MD5: 32K
       88 85 8B 8A 45 C0 66 1E C1 19 F8 F9 48 0B 1E EE>)
(   4,<2012-07-17 00:27:18.468 -0500>,<Administrator>,<TOPSPIN>,<proc1d>,<TOPSPIN 2.1>,
      <abs ABSG = 1 
       data hash MD5: 32K
       B5 70 AA C3 93 44 3D E8 29 FE D7 20 DC E2 0C 67>)
(   5,<2012-07-17 00:27:18.500 -0500>,<Administrator>,<TOPSPIN>,<proc1d>,<TOPSPIN 2.1>,
      <abs ABSG = 2 
       data hash MD5: 32K
       FE 77 1C 49 2D F0 EA 58 31 90 C4 FA 94 55 E2 BA>)
(   6,<2012-07-17 00:27:18.531 -0500>,<Administrator>,<TOPSPIN>,<proc1d>,<TOPSPIN 2.1>,
      <abs ABSG = 3 
       data hash MD5: 32K
       43 DA 21 FD 95 4E 71 3C DC B7 5D 44 63 EE 4B 0B>)
(   7,<2012-07-17 00:27:18.562 -0500>,<Administrator>,<TOPSPIN>,<proc1d>,<TOPSPIN 2.1>,
      <abs ABSG = 4 
       data hash MD5: 32K
       78 AC 2B 6F E1 9C 2D 32 23 99 EF FF A0 56 6C 0B>)
(   8,<2012-07-17 00:27:18.593 -0500>,<Administrator>,<TOPSPIN>,<proc1d>,<TOPSPIN 2.1>,
      <abs ABSG = 5 
       data hash MD5: 32K
       B4 D8 14 C0 B5 9B B4 2B 9E 42 9A 1F 68 1F 6B 0C>)
$$ ##END=
$$ 
$$ $$ hash MD5
$$ $$ C2 9A 55 0A 9C FE 66 A5 E8 07 4B 83 FF C2 9B D9
##$RELAX= 
##$RELAX= 
##$RELAX= 
##$RELAX= 
##$RELAX= 
##$RELAX= 
##$RELAX= 
$$ Bruker specific parameters
$$ --------------------------
$$ [...]
150 150 150 150 150 150 150 150
##$TP07= 0
##$TPNAME0= <>
##$TPNAME1= <>
##$TPNAME2= <>
##$TPNAME3= <>
##$TPNAME4= <>
##$TPNAME5= <>
##$TPNAME6= <>
##$TPNAME7= <>
##$TPOAL= (0..7)
0.5 0.5 0.5 0.5 0.5 0.5 0.5 0.5
##$TPOFFS= (0..7)
0 0 0 0 0 0 0 0
##$TUNHIN= 0
##$TUNHOUT= 0
##$TUNXOUT= 0
##$USERA1= <user>
##$USERA2= <user>
##$USERA3= <user>
##$USERA4= <user>
##$USERA5= <user>
##$V9= 5
##$VALIST= <valist>
##$VCLIST= <CCCCCCCCCCCCCCC>
##$VD= 0
##$VDLIST= <DDDDDDDDDDDDDDD>
##$VPLIST= <PPPPPPPPPPPPPPP>
##$VTLIST= <TTTTTTTTTTTTTTT>
##$WBST= 2048
##$WBSW= 25
##$XGAIN= (0..3)
0 0 0 0
##$XL= 0
##$YL= 0
##$YMAX_a= 509545
##$YMIN_a= -650949
##$ZGOPTNS= <>
##$ZL1= 120
##$ZL2= 120
##$ZL3= 120
##$ZL4= 120
##$ABSF1= 14.98509
##$ABSF2= -5.573092
##$ABSG= 5
##$ABSL= 3
##$ALPHA= 0
##$AQORDER= 0
##$ASSFAC= 0
##$ASSFACI= 0
##$ASSFACX= 0
##$ASSWID= 0
##$AUNMP= <proc_prof1d_extract_pilot.lims>
##$AXLEFT= 0
##$AXNAME= <>
##$AXNUC= <1H>
##$AXRIGHT= 0
##$AXTYPE= 0
##$AXUNIT= <>
##$AZFE= 0.1
##$AZFW= 0.1
##$BCFW= 0
##$BC_mod= 0
##$BYTORDP= 0
##$COROFFS= 0
##$CY= 15
##$DATMOD= 1
##$DC= 0
##$DFILT= <>
##$DTYPP= 0
##$F1P= 0
##$F2P= 0
##$FCOR= 0.5
##$FTSIZE= 32768
##$FT_mod= 6
##$GAMMA= 0
##$GB= 0
##$INTBC= 1
##$INTSCL= 1
##$ISEN= 128
##$LB= 0
##$LEV0= 0
##$LPBIN= 0
##$MAXI= 10000
##$MC2= 0
##$MEAN= 0
##$ME_mod= 0
##$MI= 0
##$NCOEF= 0
##$NC_proc= -8
##$NLEV= 6
##$NOISF1= 0
##$NOISF2= 0
##$NSP= 0
##$NTH_PI= 0
##$NZP= 0
##$OFFSET= 14.98509
##$PC= 1
##$PHC0= 179.231
##$PHC1= 0
##$PH_mod= 1
##$PKNL= yes
##$PPARMOD= 0
##$PPDIAG= 0
##$PPIPTYP= 0
##$PPMPNUM= 2147483647
##$PPRESOL= 1
##$PSCAL= 4
##$PSIGN= 0
##$PYNMP= <proc.py>
##$REVERSE= no
##$SF= 400.02
##$SI= 32768
##$SIGF1= 0
##$SIGF2= 0
##$SINO= 400
##$SIOLD= 32768
##$SPECTYP= <>
##$SREGLST= <1H.CDCl3>
##$SSB= 0
##$STSI= 32768
##$STSR= 0
##$SW_p= 8223.68421052631
##$SYMM= 0
##$S_DEV= 0
##$TDeff= 65536
##$TDoff= 0
##$TI= <>
##$TILT= no
##$TM1= 0
##$TM2= 0
##$TOPLEV= 0
##$USERP1= <user>
##$USERP2= <user>
##$USERP3= <user>
##$USERP4= <user>
##$USERP5= <user>
##$WDW= 1
##$XDIM= 32768
##$YMAX_p= 471609860
##$YMIN_p= -692349
##$CURPLOT= <Network HP LaserJet P1505>
##$CURPRIN= <$Network HP LaserJet P1505>
##$DFORMAT= <normdp>
##$LAYOUT= <+/1D_H.xwp>
##$LFORMAT= <normlp>
##$PFORMAT= <normpl>
##$SURQMSG= 1
$$ End of Bruker specific parameters
$$ ---------------------------------
##NTUPLES= NMR SPECTRUM
##VAR_NAME=  FREQUENCY,     SPECTRUM/REAL,   SPECTRUM/IMAG
##SYMBOL=    X,             R,               I
##VAR_TYPE=  INDEPENDENT,   DEPENDENT,       DEPENDENT
##VAR_FORM=  AFFN,          ASDF,            ASDF
##VAR_DIM=   32768,         32768,           32768
##UNITS=     HZ,            ARBITRARY UNITS, ARBITRARY UNITS
##FACTOR=    0.250966925370066, 1,           1
##FIRST=     8223.43324360094, -119685,      -110905
##LAST=      0,             30637,           -151293
##MIN=       0,             -692349,         0
##MAX=       8223.43324360094, 471609860,    0
$$ Real data points
##PAGE= N=1
##DATA TABLE= (X++(R..R)), XYDATA
$$ [...]
$$ plain form
19566 44275 249778 -99599 -537537 -160372 -127552 -164723 154268 334572 -100516 -163799
19556 -163799 -113658 -1449 213286 67160 236909 -238278 -40607 -23584 203076 106314 -67401
19544 -114434 163353 -33154 -267993 65300 86069 -358654 157105 -55705 19280 -10676 4779
19532 147495 80120 -60400 25356 135381 97106 -249306 24243 -54150 78463 -215292 163016
19520 -34100 160408 128511 -279724 -80592 -67843 -76192 229290 -209049 155452 121032 -247763
19508 27105 193615 79972 -234132 -154094 -214813 20615 239585 -19997 64388 -162212 27872
19496 77155 -246548 176156 -262806 34215 -72019 61503 -39615 -398937 -160141 -293548
19486 -293548 95565 198636 80242 100826 176625 173962 -3854 -127792 -586 102301 30550 64189
$$ packed form
19566D4275K05503i9599m37938a60372L2820l7171A54268J80304a00516o3283
19556a63799N0141a449B13286F7160J69749b38278d0607J7023B03076r6762f7401
19544a14434A63353c3154k34839F5300K0769c58654A57105e5705A9280a0676D779
19532A47495o7375f0400B5356J10025l8275b49306B4243e4150G8463b15292A63016
19520c4100A60408l1897b79724h0592J2749q349B29290b09049A55452l4420b47763
19508B7105J66510G9972b34132Q0038o0719B0615K18970a9997F4388a62212B7872
19496G7155b46548A76156b62806C4215g2019F1503c9615l59322a60141j33407
19486b93548I5565J03071H0242K0584P5799k663c854j23938e86A02301C0550L3639
$$ plain form
19474 64189 -171643 -13169 -343693 -207609 -113537 144295 -340990 -20944 164108 2119 106936
19463 106936 -68306 -107889 -215084 -33433 110417 -324863 -226989 -442121 -246194 -351226
19453 -351226 -44105 5838 -299594 141964 -239573 -21433 -67305 152076 -51727 -144492 4321
19441 -33295 -57619 -285903 -364893 141506 21266 -18189 -121773 178006 -8240 -71432 209728
19429 -218725 40140 -75180 -48731 -446584 -92369 -334308 -56209 127090 28770 -48210 -173382
19418 -173382 1017 214117 -15793 -154806 130236 -19277 -91480 198675 -59210 -6231 -24114
19407 -24114 84388 -212579 165418 -208429 -227196 -260450 -137305 -83124 -99766 -397240 -90477
19395 -40831 139444 -257945 115814 63411 184125 -362754 -41136 11656 -83154 -204242
$$ packed form
19474F4189a71643a3169l30524J36084R4072A44295c40990b0944A64108B119J04817
19463A06936f8306l9583j07195c3433A10417c24863R7874k15132J95927j05032
19453c51226d4105E838b99594A41964b39573b1433m5872A52076e1727r2765D321
19441c3295k4324k28284p8990A41506B1266a8189j03584A78006h240o3192B09728
19429b18725D0140g5180K6449l97853i2369k41939e6209A27090B8770d8210j25172
19418a73382A017K13100a5793j39013A30236a9277p2203A98675e9210f231j7883
19407b4114H4388b12579A65418b08429j8767l3254J23145N4181j6642k97474i0477
19395d0831A39444b57945A15814n2403J20714c62754d1136A1656h3154j21088
$$ plain form
19385 -204242 -155240 -24218 -330736 -18847 -157601 -196935 -19709 -114841 -72045 57922 -75928
19373 -40285 12949 -464418 -351505 93891 -70397 57882 -235463 119508 -177710 231017
19362 181116 -169304 -286297 -254096 32036 -128088 96181 56595 75889 73903 -303597 25157
19350 -6753 76721 -19811 -407067 163532 -229005 -207396 40903 -222274 -56617 -76650 123902
19338 377397 -72061 -201192 -450970 -251313 221087 79242 54505 -133687 -103880 -144224
19328 -144224 -86563 283212 -177995 -44500 367498 186690 37594 140374 53514 -159684
19317 -259000 -127367 165476 45732 -27254 -342990 -10372 131681 -322151 -40000 -105333
19307 -105333 -344854 -672 -81557 -151816 -98930 66458 139115 -325735 -261400 -100352 -418953
$$ packed form
19385b04242M9002b4218l06518a8847j38754l9334a9709r5132M2796E7922g5928
19373d0285A2949d64418J12913I3891g0397E7882b35463A19508a77710B31017
19362A81116a69304j16993L2201C2036a28088I6181l9586J9294j986c03597B5157
19350f753G6721a9811l87256A63532b29005K1609D0903b22274e6617k0033A23902
19338C77397g2061j29131k49778J99657B21087G9242k4737a33687K9807m0344
19328a44224N7661B83212a77995d4500C67498j80808C7594J02780E3514a59684
19317b59000a27367A65476D5732b7254l15736a0372A31681c22151d0000o5333
19307a05333k39521f72q0885p0259N2886F6458P2657c25735O4335a00352l18601
$$ plain form
19296 -418953 -285898 67520 -146633 149259 -83660 -267552 125611 -316014 21548 159594
19286 159594 -123913 12392 64787 137701 -102116 -44798 107683 -432846 121642 262733
19276 262733 -64084 143341 -202758 261776 -14655 -6269 -189586 -166320 49303 -54323 -115777
19265 -115777 -368683 -85457 9427 100147 -35338 -78887 -534478 58341 181142 -163242 -74591
19253 -143155 -48590 122133 -434480 -95102 -60422 -250809 -91742 -306535 -223279 120790
19242 -44070 87181 151727 -168017 -127846 145736 299231 -301804 -29334 -130723 -247113
19232 -247113 -9983 178232 14968 -203829 75962 18048 -15700 259267 -251508 -247912 121723
19220 -87802 -261719 16369 -94621 42323 -89869 -109976 -101920 -202570 -127152 -27868 -15761
$$ packed form
19296d18953J33055F7520a46633A49259h3660j83892A25611c16014B1548J38046
19286A59594a23913A2392N2395P2914a02116d4798A07683d32846A21642J41091
19276B62733f4084A43341b02758B61776a4655f269j83317K3266D9303e4323o1454
19265a15777k52906h5457I427R0720c5338m3549m55591E8341J22801a63242g4591
19253a43155d8590A22133d34480i5102L4680j90387i1742k14793Q3256A20790
19242d4070H7181O4546a68017M0171A45736J53495c01804b9334j01389j16390
19232b47113i983A78232A4968b03829G5962A8048a5700B59267b51508L596A21723
19220h7802j73917A6369i4621D2323h9869k0107Q056j00650P5418b7868J2107
$$ plain form
19209 -15761 -54389 -79037 192579 307690 -351767 79792 -130260 -34284 35012 44451 162756
19198 162756 18883 -210184 -60910 -94447 -143001 -17001 -45214 16274 88772 -5243 547828
19186 4597 -89167 -15523 -141999 -24873 128356 37573 111037 129218 111008 11457 154066
19175 154066 138794 174463 -33165 -97802 -65571 118722 -7478 -532735 -140559 104481 -52388
19163 73645 30155 -270655 -24194 214664 -187029 -161330 -122586 73350 -278679 144558 -151804
19151 -103119 -111672 274019 31441 -303972 82069 42584 -28318 92128 8682 50569 -272149
19139 -227740 38264 103410 -240592 25563 263802 -91796 -68176 -55657 105535 51430 41662
19128 41662 -116517 -51600 23482 33187 -32946 -53013 -138131 167969 -249296 -470989 -213520
$$ packed form
19209a5761l8628k4648A92579J15111c51767G9792a30260c4284C5012R439J18305
19198A62756A8883b10184f0910l3537m8554a7001k8213A6274P2498e243E47828
19186D597h9167a5523j26476b4873A28356C7573P3464J8181j8210A1457J42609
19175A54066j5272L5669c3165o4637L2231A18722g478n25257a40559A04481e2388
19163G3645C0155b70655b4194B14664a87029K5699L8744G3350b78679A44558a51804
19151a03119q553B74019C1441c03972H2069l9485b8318I2128H682M1887b72149
19139b27740C8264O5146b40592B5563K38239i1796K3620J2519A05535E1430r768
19128D1662a16517e1600B3482R705c2946k0067q5118A67969b49296k21693b13520
$$ plain form
19116 99158 -328467 14705 193171 -43412 -281540 35436 29801 -102061 -273005 -96064 -65673
19105 -65673 -112618 40203 184901 -45736 -193318 -81537 216976 -133882 -300713 -69456 87131
19093 -45791 -43652 -117053 46545 180515 -5758 49396 -85520 -123946 13814 -119455 -306196
19082 -306196 -89228 -36381 -277877 22647 57476 280222 317654 -67557 -152348 -338332 133180
19070 41038 198223 -18700 -103176 -23564 247993 82178 -390953 53815 8776 143716 -206300
19058 119815 -2165 -42787 -38818 -252179 -401881 154141 -239151 80921 176058 192828 -31635
19046 -86964 121205 106227 56083 224838 54786 24798 -78704 -269870 107940 -207137 359462
19034 162391 -248089 -55433 222436 90824 224006 -135826 83337 94415 -129236 528043
$$ packed form
19116I9158c28467A4705J78466d3412k38128C5436n635a02061j70944i6064L0391
19105f5673m6945D0203J44698d5736j47582h1537B16976a33882j66831f9456H7131
19093d5791K139p3401D6545J33970e758D9396h5520l8426A3814a19455j86741
19082c06196h9228c6381k41496B2647L4829K22746L7432f7557q4791j85984A33180
19070D1038J57185a8700q4476b3564B47993H2178c90953E3815H776J34940b06300
19058A19815b165m0622L969k13361j49702A54141b39151H0921R5137J6770c1635
19046h6964A21205j4978n0144J68755E4786B4798g8704j91166A07940b07137C59462
19034A62391b48089e5433B22436I0824J33182a35826H3337J1078a29236E28043
$$ plain form
19023 -27096 -140284 -58315 25792 162024 26431 72610 -65140 102718 -128850 -38654 368623
19011 -193380 -292873 -222796 -311297 -208502 -115139 174194 28105 -286714 26031 -123436 -25635
18999 -52968 98826 -76479 241706 40806 320905 196545 -105924 -513209 128725 59531
18988 92710 -53156 -428998 -25422 -74132 156788 -7591 35471 -332085 34296 -48562 -222059
18977 -222059 20519 43796 -344372 -295858 58249 -262502 -78379 -518538 -212065 15383 41732
18966 41732 -188489 -215493 -238232 -535746 248847 -44976 -28840 518 89644 54804 -85022
18954 -238955 -10424 -361916 -403705 -90620 -312438 -431343 163813 -277701 166578 159566
18944 159566 247632 196028 -199120 -241361 -157399 88289 71497 546 -152816 253767 -329170
$$ packed form
19023b7096j13188e8315B5792J36232B6431M6179f5140A02718a28850c8654C68623
19011a93380r9493P0077q8501J02795R3363A74194B8105b86714B6031a23436b5635
18999e2968I8826g6479B41706D0806K80099j24360a05924m07285A28725E9531
18988I2710e3156l75842b5422m8710A56788g591C5471c32085C4296d8562j73497
18977b22059B0519K3277c44372M8514E8249b62502g8379m40159b12065A5383K6349
18966D1732a88489k7004k2739k97514B48847d4976J6136E18Q9126l4840h5022
18954b38955a0424l51492m1789i0620k21818j18905A63813b77701A66578p012
18944A59566Q8066n1604a99120m2241Q3962H8289j6792E46a52816B53767c29170
$$ plain form
18932 102122 -130676 31232 1756 -153651 -183687 10854 -369934 65983 -103218 265748 -271431
18920 -18908 179924 -134950 48632 -58369 94810 -325972 67903 295872 -209498 123114
18909 -112706 -158773 305293 -34410 330548 41019 96107 55301 -206732 -95881 8165 246532
18898 246532 -230225 -164478 -225561 104827 47608 143325 -88225 17894 -63483 -292690 21321
18886 -146057 87862 -224127 45360 221876 -74390 -143317 -106987 63896 -145315 -120945 -143532
18875 -143532 28555 84060 -58641 -201739 134421 -122084 -86013 61923 79536 -136977 -73006
18864 -73006 -105536 -139887 -93045 -345794 -148888 -183001 -284036 82973 -146452 -44940 -149776
18853 -149776 10378 24740 226950 567693 4041 94407 -312017 260858 -59485 -112495 35624
$$ packed form
18932A02122a30676C1232A756a53651l0036A0854c69934F5983a03218B65748b71431
18920a8908A79924a34950D8632e8369I4810c25972F7903K27969b09498A23114
18909a12706m6067C05293c4410C30548D1019N5088m0806b06732i5881H165K38367
18898B46532b30225O5747o1083A04827D7608R5717h8225A7894f3483k29207B1321
18886a46057H7862b24127D5360J76516g4390o8927L6330F3896a45315K4370k2587
18875a43532B8555N5505e8641j43098A34421a22084L6071F1923J7613a36977O3971
18864g3006l2530l4351M6842k52749a48888l4113j01035H2973a46452d4940j04836
18853a49776A0378J4362K02210L40743D041R0366c12017B60858e9485n3010C5624
$$ plain form
18841 -293997 -181045 -217565 -8537 -158965 19055 91569 -66042 -174918 1924 -50253 -5200
18829 147766 -231105 174031 -305949 200228 -286418 70863 -106761 366614 81617 15849
18818 -305675 66472 169293 98685 -205018 255733 -104998 249957 123501 -64775 205394
18807 516755 112489 -23426 -8534 -20476 -79228 -143865 -137596 -16618 -85735 -39994 -32599 112165
18794 -240457 -218722 280115 -56602 90665 16905 -431752 -201250 242841 -98180 198470
18783 -91861 -9040 65277 -170598 -174239 -263305 118321 -257524 152278 83683 158779 -215353
18771 9795 390874 43192 -57916 -69053 78198 -278354 -51965 165497 226714 -72742 8715
18759 -225240 -163391 66378 -273568 71345 -200339 359793 179646 92103 -72036 -46416 161380
$$ packed form
18841b93997J12952l6520h537j50428A9055P2514f6042j08876A924e0253e200
18829A47766b31105A74031c05949B00228b86418G0863a06761C66614H1617A5849
18818c05675F6472J02821p0608b05018B55733a04998B49957A23501f4775B05394
18807E16755A12489b3426h534j1942n8752o4637O269a6618o9117c9994P395A12165
18794b40457K1735B80115e6602I0665A6905d31752b01250B42841i8180A98470
18783i1861i040F5277a70598l641q9066A18321b57524A52278o8595P5096b15353
18771I795L81079D3192e7916j1137G8198b78354e1965A65497O1217g2742H715
18759b25240O1849F6378b73568G1345b00339C59793A79646q7543g2036K5620A61380
$$ plain form
18747 -35176 54068 -104113 -571316 -17937 184203 -121671 -368775 85005 -130957 124032
18736 -258596 81092 -19403 -278398 -8992 25219 -4513 245992 -3128 -160061 86699 74314
18725 74314 117523 -195725 21910 112356 33742 -4729 -230847 -208467 -121288 12485 -245144
18713 -102824 53598 -11554 170700 -247118 25224 119449 -15735 11492 14694 81639 257720
18702 257720 207883 -163238 -42961 377018 -251152 132146 161169 -214624 -116956 -150548
18692 -150548 -137113 -48885 -125511 -56950 -20054 -100467 -17409 188746 -153069 -1995 100988
18680 39810 -19291 -23861 -26619 23322 287134 152209 -170084 48847 260223 -194123 41810
18668 109903 -35015 -457598 -106823 -137998 256849 238014 -149327 -241593 168347 -46217
$$ packed form
18747c5176E4068a04113m67203a7937A84203a21671k47104H5005a30957A24032
18736b58596H1092a9403k58995h992B5219d513B45992c128j56933H6699j2385
18725G4314M3209a95725B1910R0446C3742d729k26118K2380Q7179A2485b45144
18713a02824E3598a1554A70700b47118B5224R4225a5735A1492L202O6945J76081
18702B57720m9837a63238d2961C77018b51152A32146K9023b14624R7668l3592
18692a50548J3435d8885p6626e6950b0054q0413a7409A88746a53069a995A00988
18680C9810a9291m570k758B3322K63812j34925a70084D8847K11376a94123D1810
18668A09903c5015m22583a06823l1175B56849j8835a49327r2266A68347d6217
$$ plain form
18657 -102469 59168 -100327 -141245 128887 32496 127118 -46014 -315766 64606 -154933 -239813
18646 -239813 55943 158063 -69836 76295 26762 -269974 132306 -58314 -237841 -303250 202764
18634 207832 18341 -37222 -20585 -326061 60810 273964 5976 -74280 -70187 -165906 -168490 -26886
18621 -290967 -35450 236406 -18638 207854 -45204 -217881 -41153 -126452 -75230 71887 -164889
18609 -20606 -59429 -310415 -42067 -86740 74056 169937 -149205 -298521 -107025 110003 -413413
18597 135281 45248 131303 -50884 -81555 -401134 37896 -288563 -113228 -144528 -188161 -19255
18585 -150175 -47084 247609 -212267 5091 109512 58052 6881 -188794 345286 -89522 -261852
18574 -261852 -397765 -122384 278573 144579 5254 -238248 -37567 -52929 135659 -244570
$$ packed form
18657a02469E9168a00327m0918A28887C2496R4622d6014k69752F4606a54933q4880
18646b39813E5943J02120f9836G6295B6762b69974A32306e8314j79527o5409B02764
18634B07832A8341c7222J6637l05476F0810K13154E976g4280M093r5719k584b6886
18621b90967c5450B36406a8638B07854d5204j72677d1153q5299N1222G1887a64889
18609b0606l8823k50986d2067m4673G4056R5881a49205j49316a07025A10003d13413
18597A35281D5248Q6055e0884l0671l19579C7896b88563a13228l1300m3633a9255
18585a50175d7084B47609b12267E091J04421n1460F881a88794C45286h9522j72330
18574b61852j35913a22384B78573j33994E254b38248c7567j5362A35659b44570
$$ plain form
18563 -240300 -124825 -79545 16639 84990 9319 -107987 -34736 -74956 174115 -99779 94643
18551 235832 338739 -17592 -5015 -470235 -27767 208286 40513 -100964 28774 -274116 -52508
18539 167720 -108495 162473 211010 -139126 -87110 -372522 -367388 192223 132581 28632 -72158
18527 29050 -120596 -60328 -156701 -308164 -38747 192825 62560 112721 65196 -84094 -234548
18516 -234548 -247912 -155156 -200878 -116199 162412 -60555 -213470 280799 -23021 -241022 -138265
18505 -138265 -68813 -82182 -224365 112422 20315 -164513 -13935 27251 -114972 -185810 -359882
18494 -359882 29207 175895 -91507 -53510 -36670 21712 -111177 2842 242757 -87232 -284358
18483 -284358 294686 24617 -126172 -47600 74203 289407 163227 -211984 1255 -232298
$$ packed form
18563b40300J15475M5280A6639O8351I319a07987c4736m0220A74115i9779I4643
18551B35832J02907a7592e015m65220b7767B08286D0513a00964B8774b74116e2508
18539A67720a08495A62473M8537a39126N2016k85412N134A92223n9642B8632g2158
18527B9050a20596O0268r6373j51463c8747A92825F2560N0161m7525h4094j50454
18516b34548j3364R2756m5722Q4679A62412f0555j52915B80799b3021k18001J02757
18505a38265f8813j3369j42183A12422B0315a64513a3935B7251a14972p0838j74072
18494c59882B9207J46688i1507L7997J6840B1712a11177B842K39915h7232j97126
18483b84358B94686B4617a26172d7600G4203K15204j26180b11984A255b32298
$$ plain form
18472 -116382 -50775 -418077 -22758 -70540 -68676 71533 -316019 -79470 -110748 399618 -355154
18460 -161577 -10531 -205566 -302062 -29996 -158574 114940 161442 -99951 279845 91901 -216848
18448 207842 -265181 -233252 -93022 14810 -297347 -193826 -372413 -105225 -382 -211711 28173
18436 -40585 -414503 -87016 181185 -183099 112477 -199106 -31574 50308 23314 117176 -140026
18424 -118095 -377341 96877 -396906 -347507 -170869 -94461 -147034 53404 -40956 -196306 -100203
18413 -100203 416720 11585 263583 181453 -95875 -241917 227537 143990 -107126 407716
18402 -282073 94552 92145 -137675 150826 110329 23864 230982 247067 55451 46282 -133512
18390 -79799 -115711 15354 -425276 30459 233167 -96081 -86118 -59106 -312693 389892 -171169
$$ packed form
18472a16382e0775l67302b2758m7782J864G1533c16019g9470l1278C99618c55154
18460a61577a0531j95035r6496b9996j28578A14940M6502i9951B79845I1901b16848
18448B07842b65181L1929i3022A4810b97347J03521j78587a05225c82k11329B8173
18436d0585l73918h7016A81185a83099A12477a99106c1574E0308B3314R3862a40026
18424a18095k59246I6877c96906M9399a70869P6408n2573E3404d0956j55350R6103
18413a00203D16720A1585K51998q2130i5875j46042B27537q3547a07126D07716
18402b82073I4552k407a37675A50826m0497B3864K07118J6085E5451r169a33512
18390g9799l5912A5354d25276C0459K02708i6081R963K7012k53587C89892a71169
$$ plain form
18378 -195528 -49371 -154235 165387 -92191 -33751 41696 178764 -295908 -204915 -301236 133705
18366 179778 -51525 22922 74885 -37848 46594 141795 142260 84817 84206 2873 -90043 187503
18353 -102020 8732 -141726 -149895 -210196 164626 -56485 -41569 328193 352491 151267 -234651
18341 226579 -195542 33631 249232 -11043 -173786 218144 21447 170113 -525837 3217
18330 285706 -34054 107206 -24762 14092 103388 -318123 93453 -156088 199930 -44637 -236711
18319 -236711 152326 -108925 -158921 195645 71584 -61305 -264174 -88280 39063 -321231
18308 -78543 6114 29176 -124832 81364 193630 15781 166895 -127785 208162 -200186 -173125
18297 -173125 -72607 18785 -30242 78011 -21809 -238753 8723 283621 -941 37339 -83224 141484
$$ packed form
18378a95528d9371j04864A65387i2191c3751D1696J37068b95908R0993r6321A33705
18366A79778e1525B2922N1963c7848D6594R5201M65n7443o11B873i0043A87503
18353a02020H732a41726q169o0301A64626e6485J4916C28193K4298A51267b34651
18341B26579a95542C3631K15601a1043j62743B18144B1447J48666e25837C217
18330B85706c4054A07206b4762A4092Q9296c18123I3453a56088A99930d4637j92074
18319b36711A52326a08925m9996A95645G1584f1305k02869h8280C9063c21231
18308g8543F114K3062a24832H1364J12266A5781J51114a27785B08162b00186K7061
18297a73125g2607A8785c0242G8011b1809k16944H723K74898i41C7339h3224A41484
$$ plain form
18284 194198 51927 -130782 -252324 38939 299531 11625 -46294 -115614 382588 -252480
18273 -53120 -167033 -190838 -199599 255415 -120012 -11012 -178227 337191 129501 -63305 114645
18261 60749 47875 -213503 -195467 -240169 -210645 -456672 35198 -122788 -105831 217331 77956
18249 29986 -98867 -291081 -142953 130636 -320137 -182451 5719 -218495 -74217 -62420 101959
18237 253553 -199124 64805 130790 -95204 -236328 -185840 36823 224785 -124386 -375557
18227 -375557 -281213 275801 -37658 -69372 -56552 -101607 -178065 50051 368965 81227 -295207
18215 -105991 91857 310665 -47131 -195174 207614 140774 -80467 91802 -238985 84322 -36329
18203 -222833 97024 -13917 -50892 -1054 -305385 68221 -201055 159084 186760 -31324 -146405
$$ packed form
18284A94198E1927a30782j21542C8939K60592A1625d6294o9320C82588b52480
18273e3120j13913k3805q761B55415a20012a1012j67215C37191A29501f3305A14645
18261F0749j2874b13503J8036m4702K9524k46027C5198a22788J6957B17331G7956
18249B9986i8867j92214a42953A30636c20137J37686E719b18495g4217J1797A01959
18237B53553a99124F4805O5985i5204j41124N0488C6823J87962a24386k51171
18227c75557R4344B75801c7658l1714J2820m5055p6458E0051L18914H1227b95207
18215a05991I1857K18808d7131j48043B07614o6840h0467I1802b38985H4322c6329
18203b22833I7024a3917l6975a054l04331F8221b01055A59084K7676c1324j15081
$$ plain form
18192 -146405 50961 -17489 -172420 -165593 -48549 -59955 -127402 43514 37780 -36660 -321638
18181 -321638 -134391 -186258 147807 -9502 -27784 -335378 133724 -90559 -288772 253394
18170 261069 133372 -305055 -129860 160681 -18454 -185612 25068 179650 -261613 150379
18159 -78456 -99647 -328827 -191502 47229 37380 -349008 -320886 -77669 -26809 -35621 -203732
18148 -203732 76675 -14587 35980 -125772 -81697 90580 191726 -148675 -30498 190367 -359777
18136 -141922 -91974 27329 -79043 -97132 -91239 -310047 -59845 -41089 -341645 69551 -255452
18124 -38508 652 14290 -83741 -46281 -55947 -80749 92780 -224430 -16708 328135 -22179 -143297
18112 -143297 -32508 101230 559019 -232338 -150857 -24768 -345968 -153374 54548 161352
$$ packed form
18192a46405E0961a7489j54931O827d8549j1406o7447D3514n734c6660k84978
18181c21638a34391n1867A47807i502j8282l07594A33724i0559j98213B53394
18170B61069j27697c05055a29860A60681a8454j67158B5068J54582b61613A50379
18159g8456k1191k29180J37325D7229r849c49008K8122g7669b6809q812j68111
18148b03732G6675a4587C5980a25772M4075I0580J01146a48675c0498A90367c59777
18136a41922M9948B7329g9043j8089N893k18808e9845J8756l00556F9551b55452
18124c8508F52J3638h3741L7460r666k4802I2780b24430a6708C28135b2179j21118
18112a43297c2508A01230M57789b32338Q1481b4768l21200a53374E4548J06804
$$ plain form
18102 161352 37182 -262056 -16297 -84417 48399 -279869 -144567 57100 15442 158587 -289649
18090 99191 -80846 -73572 -297079 39107 -343395 -330824 -198295 147175 -34989 -189399 70212
18078 166671 120252 172486 84068 -51975 -15624 -261423 -90987 80702 -68002 202976 37465
18066 32195 -33495 -125517 25525 4798 139718 -42610 -289226 68814 299614 -64464 219246
18054 1865 -235039 -65656 -17124 -22202 -224884 -43613 -80241 -30914 -305488 -242234 12143
18042 -115395 -86703 44412 -107115 48038 87473 165954 217787 38850 -44202 -83897 5166
18030 -142497 55802 -43286 -252763 121034 40901 17652 111649 362305 286268 50447 -120121
18018 112964 42916 -121798 64135 233799 90795 -85668 -148498 -6292 267477 210996 -188738
$$ packed form
18102A61352C7182b62056a6297o8120D8399b79869J35302E7100A5442J43145b89649
18090I9191h0846P274k23507C9107c43395J2571J32529A47175c4989j54410G0212
18078A66671m6419N2234H4068e1975a5624k45799i0987H0702f8002B02976C7465
18066C2195c3495r2022B5525D798J34920d2610k46616F8814K30800f4464B19246
18054A865b35039f5656a7124n078k02682d3613l6628c0914k74574O3254A2143
18042a15395K8692D4412a07115D8038L9435P8481N1833C8850d4202l9695E166
18030a42497E5802d3286k09477A21034D0901A7652R3997K50656p6037E0447a20121
18018A12964D2916a21798F4135J69664I0795h5668o2830f292B67477n6481a88738
$$ plain form
18006 127370 -62239 -205031 -54755 -145823 -441248 -261676 184995 -77511 -226456 -103761
17995 87613 -272709 -341408 449047 328770 2740 273931 -151911 -36503 -163212 -195518 311098
17983 121316 -77261 -179304 -174278 131215 -89776 -29518 -202178 -17275 72507 297326 59720
17971 95727 36248 113916 -263127 509686 -187868 26986 -146891 154890 -9337 -54144 335615
17959 6734 -139381 337837 137819 225832 -41880 121673 180321 42277 14867 -63719 37323
17947 -263791 -97343 -245812 108420 41982 111647 98475 37671 96066 -110574 125490 98824
17936 98824 -47827 -216013 27978 -33662 -70376 59666 -256306 418342 112676 -13901 -78196
17925 -78196 -338226 -245468 72110 -61420 79683 -90790 67925 34800 -196303 167051 -109052
$$ packed form
18006A27370f2239j42792e4755r1068k95425J79572A84995g7511j48945a03761
17995H7613b72709o8699D49047j20277B740K71191a51911c6503j26709l2306C11098
17983A21316g7261j02043N026A31215h9776b9518j72660a7275G2507K24819E9720
17971I5727C6248P7668b63127E09686a87868B6986a46891A54890i337m4807C35615
17959F734a39381C37837A37819Q8013d1880A21673N8648D2277A4867f3719C7323
17947b63791i7343j48469A08420D1982O9665j3172C7671N8395a10574A25490k6666
17936I8824d7827j68186B7978c3662l6714E9666b56306D18342A12676a3901o4295
17925g8196k60030R2758G2110f1420G9683i0790F7925l3125a96303A67051a09052
$$ plain form
17913 306401 24795 -134643 -62899 -7002 -186584 226424 125080 -58542 -31842 -63230 110275
17901 86783 27176 -107090 -158624 117840 155627 -23708 170730 -75618 69422 -219437 -235219
17890 -235219 -61263 -3624 -69407 -25676 -65570 61554 14139 15478 151723 223053 -60880 272985
17877 -101779 83463 43736 120206 85638 35191 156106 179760 204972 -332577 45299 290587
17866 290587 61914 -92204 -52855 142318 119945 78319 -101855 -237620 236154 -229155
17855 94886 78119 -377460 -136372 155927 -17231 277097 37840 96536 64667 111201 45779
17843 -200925 113413 -136896 -250992 -139106 271268 -229309 -194303 160210 -26851 52716
17832 15798 318155 155180 -259882 -9923 -54185 215765 -131983 6255 131544 214868 -213892
$$ packed form
17913C06401B4795a34643f2899g002j79582B26424j01344e8542K6700l1388A10275
17901H6783B7176a07090n1534A17840L7787b3708A70730g5618F9422b19437j5782
17890b35219f1263c624o5783b5676l9894F1554A4139J339J36245P1330f0880B72985
17877a01779H3463l9727P6470l4568C5191J20915K3654K5212c32577D5299K45288
17866B90587F1914i2204L9349A42318k2373m1626a01855j35765B36154b29155
17855I4886j6767c77460a36372A55927a7231B77097C7840N8696l1869M6534D5779
17843b00925A13413a36896j14096J11886B71268b29309L5006A60210b6851E2716
17832A5798L02357A55180b59882i923m4262B15765a31983F255J25289Q3324b13892
$$ plain form
17820 92665 -225300 -20727 4605 -31646 171497 98211 19576 -18584 152944 241893 57347
17808 382296 5315 11652 43086 -86803 11796 288122 -207640 -325912 321691 17503 -231467
17796 163718 -53787 222416 216730 -471424 -4376 176069 -337073 36565 -107883 147780 107016
17785 107016 -175986 128330 14106 143447 261876 303963 -91446 -50667 146918 -156960
17774 -25199 -93636 161841 180021 -9028 1022 338606 127901 -204643 369928 52677 -112542
17762 32472 20967 198085 310266 -54092 283067 148071 -166853 -328391 5161 250904
17752 250904 -12191 -102990 -278522 104061 -88173 -195384 183642 -132795 26025 327114
17742 327114 251050 -145391 332974 -3918 -214767 -58745 -118872 -76 -121387 -208003 -9908 -45901
$$ packed form
17820I2665b25300b0727D605c1646A71497p3286A9576a8584A52944Q8949E7347
17808C82296E315O337L1434h6803A1796K76326b07640j18272C21691A7503b31467
17796A63718e3787B22416n686d71424d376A76069c37073C6565a07883A47780m0764
17785A07016a75986A28330A4106J29341J18429M2087i1446M0779A46918a56960
17774b5199o8437A61841J8180i028A022L37584A27901b04643C69928E2677a12542
17762C2472j1505J77118J12181e4092B83067j34996a66853j61538E161K45743
17752B50904a2191r0799j75532A04061h8173j07211A83642a32795B6025L01089
17742C27114p6064a45391C32974c918k10849e8745o0127g6j21311q6616i908l5993
$$ plain form
17730 -45901 147154 -210625 64275 -20934 41904 -129210 -35322 116488 -260994 201095
17719 16360 34933 130505 -158507 246684 108484 200857 -101067 162371 -11604 275159
17708 -281046 -99935 87300 46295 -36596 -115593 58269 -141517 -349371 159366 -158549 -26624
17696 -101479 -52941 85291 -231985 -126498 46075 82117 151862 -37379 -76134 65226 206808
17685 206808 46164 268456 110128 90874 259277 581 309721 -103344 241171 -146617
17674 201475 -128395 6721 -246608 33133 -119106 110080 151981 50633 -62773 -146728 112295
17662 -163751 -81624 -77811 2103 -980 -244463 96828 -111469 232757 -51864 -95966 251526
17650 8887 170171 -106378 11182 -173146 231320 -12281 129918 -105358 -80729 179075
$$ packed form
17730d5901A47154b10625F4275b0934D1904a29210c5322A16488b60994B01095
17719A6360J8573R5572a58507B46684A08484R2373a01067A62371a1604B75159
17708b81046i9935H7300m1005c6596p8997E8269a41517k07854A59366a58549b6624
17696a01479M8538H5291b31985J05487D6075L6042O9745c7379l8755F5226J41582
17685B06808D6164K22292A10128j9254J68403E81L09140a03344B41171a46617
17674B01475a28395F721b46608C3133a19106A10080M1901E0633f2773q3955A12295
17662a63751h1624L813B103i80k43483I6828a11469B32757e1864m4102B51526
17650H887J61284a06378A1182a73146B31320a2281A29918a05358K4629A79075
$$ plain form
17639 334754 -300821 28989 -273056 141309 214814 -105107 62167 15794 -6455 134374 118914
17628 118914 -186214 240681 160172 -141460 237352 -240832 -84396 237760 105687 -243888
17617 121750 153491 127767 103624 113917 56241 324626 126992 -198297 153409 347348
17607 347348 179258 120447 -213710 -138588 127801 -326019 248596 -140331 137225 230750
17597 230750 275598 355199 -58713 56465 40294 -162952 176725 302867 -242947 -34131 140039
17585 560589 340767 173930 260030 -60284 3642 -77185 418443 -258407 -399411 8008 325078
17574 325078 35899 11116 55068 18218 -81193 -22493 319847 274753 126482 184802 -309244
17562 -251798 -351718 44992 312480 -158879 -255974 -54652 79937 96853 79189 -188424 -27600
$$ packed form
17639C34754c00821B8989b73056A41309P3505a05107F2167A5794f455A34374j5460
17628A18914a86214B40681q0509a41460B37352b40832h4396B37760A05687b43888
17617A21750L1741k5724k4143J0293E6241K68385A26992a98297A53409J93939
17607C47348j68090n8811b13710P5122A27801c26019B48596a40331A37225R3525
17597B30750M4848P9601e8713E6465j6171a62952A76725J26142b42947c4131A40039
17585E60589k19822j66837Q6100f0284C642g7185D18443b58407j41004H008L17070
17574C25078C5899A1116M3952A8218h1193b2493C19847m5094A26482N8320c09244
17562b51798r9920D4992K67488a58879r7095e4652G9937J6916j7664a88424b7600
$$ plain form
17550 128707 474337 330668 81358 -163223 -163966 283696 42427 248313 40727 91745 82067
17539 82067 188302 159340 247992 108461 17954 193523 11473 269387 103062 -9177 -7408
17528 -7408 228490 485896 -518039 -118495 15962 97022 289398 92189 -61092 82523 224017
17517 224017 7104 -6446 149573 33029 531385 209104 60366 -17906 221814 243974 314671
17506 314671 -75672 -92993 -188892 128931 -187533 161193 154727 117357 126817 117740 67437
17495 67437 323911 146756 252132 244476 166018 140481 647593 -101849 250077 -38599 176133
17483 373208 23257 23240 249543 116438 206181 -162368 183436 -14056 80834 -349024 509068
17471 75017 146425 208807 -303176 162029 9933 325511 335761 -59175 114890 96029 23689
$$ packed form
17550A28707L45630j43669H1358a63223p43B83696D2427K05886D0727N1018r678
17539H2067J06235k8962Q8652A08461A7954J75569A1473K57914A03062i177J769
17528g408B28490K57406e18039a18495A5962Q1060J92376I2189f1092H2523J41494
17517B24017G104f446A49573C3029M98356B09104F0366a7906B21814K2160P0697
17506C14671g5672j7321r5899A28931a87533A61193o466l7370R460r077n0303
17495F7437K56474A46756J05376p656p8458k5537N07112a01849B50077c8599A76133
17483C73208B3257j7K26303A16438Q9743a62368A83436a4056H0834c49024E09068
17471G5017P1408O2382c03176A62029I933L15578J0250e9175A14890j8861B3689
$$ plain form
17459 165500 -58104 170585 219087 110334 167606 52276 431819 145022 218399 340406
17449 340406 396799 56849 -79368 330887 112838 -140745 136061 -233304 61347 222288
17439 222288 517655 296037 146457 197366 312383 485274 124892 72745 170539 -88419
17428 430077 266710 286267 20166 328392 438080 188167 509717 632083 300003 -6616
17417 221725 185620 352753 173549 276325 183406 47045 394397 -268564 169319 274660
17407 274660 482434 -74743 314961 116143 -134318 168631 -10190 -33040 350733 -213033
17396 198779 208699 156506 148266 -8039 234656 326988 245871 462418 137396 -56493 56239
17384 -276251 -33235 155877 -44862 -18066 215332 125056 -99722 303853 328728 415461 384638
$$ packed form
17459A65500e8104A70585M8502j08753N7272E2276L79543A45022P3377J22007
17449C40406N6393E6849g9368C30887A12838a40745A36061b33304F1347J60941
17439B22288K95367k21618A46457N0909J15017J72891A24892n2147R7794h8419
17428D30077j63367J9557B0166L08226J09688A88167L21550J22366C00003f616
17417B21725l6105J67133A73549J02776r2919D7045L47352b68564A69319J05341
17407B74660K07774g4743C14961A16143a34318A68631a0190k2850C50733b13033
17396A98779R920n2193q240h039B34656R2332q1117K16547A37396e6493E6239
17384b76251c3235A55877d4862a8066B15332r0276i9722C03853K4875Q6733l0823
$$ plain form
17373 384638 522905 35645 7122 102691 170057 -36016 270155 -343393 84579 90030 -209228
17361 401729 156269 -219700 168626 37540 101651 180554 312343 -101791 431184 131381
17350 211878 -125075 199877 135261 -326619 55905 91962 213193 -229868 220043 -309000
17339 63335 235451 13025 100392 339608 249600 591266 41359 505382 453311 93471 108216
17328 108216 336817 221827 212046 323934 236511 116460 82735 81147 48653 139301 188990
17317 188990 485257 -66988 319069 318291 260266 -124222 178536 115633 198875 305977 129445
17305 113334 370013 -93685 100505 111092 283333 -18479 -320557 247686 222984 -35870
17294 344667 355668 277463 -215893 146882 390362 204502 181253 391707 4971 -24329 132767
$$ packed form
17373C84638J38267C5645G122R5569O7366c6016B70155c43393H4579N451b09228
17361D01729A56269b19700A68626C7540O4111P8903J31789a01791D31184A31381
17350B11878a25075A99877o4616c26619E5905L6057J21231b29868B20043c09000
17339F3335J72116A3025Q7367K39216r0008L41666D1359M64023n2071I3471J4745
17328A08216K28601j14990r781J11888q7423A16460l3725j588l2494R0648M9689
17317A88990K96267f6988C19069p78n8025a24222A78536o2903Q3242J07102A29445
17305A13334K56679i3685A00505J0587J72241a8479l02078B47686k4702c5870
17294C44667J1001p8205b15893A46882K43480j85860k3249K10454D971b4329A32767
$$ plain form
17282 489747 222746 205772 -112827 364891 -111358 163471 462286 348352 456063 71538
17271 19743 306671 121858 -18755 202670 131615 -101860 -63464 -41596 201617 189659 412600
17260 412600 426272 23830 492070 147809 360829 239896 72172 120027 335241 -44966
17249 137522 129529 570736 171406 117187 263300 371782 175477 54461 149462 -26559 170503
17237 333032 330587 -12268 120851 557577 121740 374404 86157 -11302 -152093 371048
17226 648448 268841 270171 526110 -22204 325952 186865 119038 60162 449022 76425 252093
17215 252093 -100099 184828 312649 265586 362574 251660 655715 231229 63438 374459
17205 374459 -129906 -23016 86927 198679 141280 335219 187629 266455 394930 313201
$$ packed form
17282D89747B22746j6974a12827C64891a11358A63471K98815j13934J07711G1538
17271A9743K86928A21858a8755B02670p1055a01860L8396K1868B01617j1958K22941
17260D12600J3672B3830M68240A47809K13020j20933G2172M7855K15214d4966
17249A37522p993M41207A71406n4219J46113J08482A75477E4461R5001b6559A70503
17237C33032k445a2268A20851M36726A21740K52664H6157a1302j40791C71048
17226F48448B68841J330K55939b2204C25952j39087o7827n8876L88860G6425J75668
17215B52093a00099A84828J27821m7063R6988j10914M04055B31229F3438L11021
17205C74459a29906b3016H6927J11752n7399J93939j47590P8826J28475q1729
$$ plain form
17195 313201 372140 294559 101302 374854 361678 56891 278165 437327 244130 478473
17185 478473 380787 474218 357824 278746 268194 -17430 292344 104999 640981 217201
17174 116609 146804 6273 540102 216614 479020 349508 340277 404502 459992 -53218 307698
17162 -31390 523271 129256 296924 631203 47711 305705 180464 168014 511479 551279
17152 551279 145097 110953 489186 589690 500231 767624 165346 257834 413723 482805
17142 482805 504913 394769 29939 373392 186524 250666 24136 139090 447289 129253
17131 39341 391711 516643 247957 95978 242418 166723 472190 974005 525602 228660
17120 79446 380035 118678 438550 110235 274647 424730 373301 113250 722425 362120
$$ packed form
17195C13201N8939p7581A01302K73552j3176E6891K21274J59162j93197K34343
17185D78473r7686R3431j16394p9078j0552a7430B92344A04999N35982B17201
17174A16609L0195F273N33829B16614K62406j29512r231O4225N5490e3218C07698
17162c1390E23271A29256J67668L34279D7711K57994j25241j2450L43465L9800
17152E51279A45097l4144L78233J00504q9459K67393A65346R2488J55889O9082
17142D82805K2108j10144B9939L43453A86524O4142B4136J14954L08199A29253
17131C9341L52370J24932B47957I5978J46440p5695L05467N01815m48403B28660
17120G9446L00589A18678L19872A10235J64412J50083n1429A13250O09175l60305
$$ plain form
17110 362120 244189 155004 400460 647286 449581 396237 786934 322600 342555 464948
17100 464948 218912 411840 649178 397283 433886 671230 534663 349337 188019 296248
17090 296248 340319 572510 611451 115097 439019 627072 277347 533387 615488 709086
17080 709086 502027 759653 229177 560967 482020 256743 538229 484033 500697 360060
17070 360060 511409 202977 395689 506620 311888 622918 409341 240673 899940 663170
17060 663170 791770 629384 361327 262913 359428 554273 460233 371593 801988 401746
17050 401746 665346 542013 474721 737758 753771 636935 638998 249666 609688 505214
17040 505214 -26025 610071 638614 550521 775000 624624 485173 931735 716639 613252
$$ packed form
17110C62120j17931q9185K45456K46826j97705n3344L90697C22600J9955J22393
17100D64948B18912J92928K37338k51895L6603K37344j36567j85326j61318J08229
17090B96248M4071K32191L8941A15097L23922J88053B77347K56040Q2101R3598
17080G09086k07059K57626B29177L31790p8947k25277K81486n4196J6664j40637
17070C60060J51349B02977J92712J10931j94732L11030k13577j68668O59267k36770
17060F63170J28600j62386k68057r8414R6515J94845r4040q8640M30395m00242
17050D01746K63600j23333o7292K63037J6013j16836K063B49666L60022j04474
17040E05214b6025F10071K8543q8093K24479j50376j39451M46562k15096j03387
$$ plain form
17030 613252 580649 529864 478911 303941 535898 840254 802292 664155 680967 622718 661653
17019 661653 755091 916204 510847 585567 581691 627429 723298 713636 845016 983386 584943
17008 584943 704910 784060 952687 655902 757779 761826 771568 1139882 1153540 1098850 958915
16997 958915 929358 752196 899736 1041708 886453 1261963 643612 722142 698449 534362
16987 534362 842007 639593 896193 799437 768778 730667 666838 846746 907895 952384 979904
16976 979904 884476 909747 973334 831047 890074 800359 988827 922465 1096981 928303 694242
16965 694242 1033257 992065 956920 795352 1240383 801073 972406 827098 989209 779650
16955 779650 1196397 1182270 888764 1149147 888683 1492554 1023057 1061924 875314 988660
$$ packed form
17030F13252l2603n0785n0953j74970K31957L04356l7962j38137J6812n8249L8935
17019F61653R3438J61113m05357P4720l876M5738R5869r662J31380J38370l98443
17008E84943J19967P9150J68627k96785J01877M047R742L68314J3658n4690j39935
16997I58915k9557j77162J47540J41972j55255L75510o18351P8530k3693j64087
16987E34362L07645k02414K56600r6756l0659l8111o3829J79908O1149M4489K7520
16976I79904r5428K5271O3587j42287N9027q9715J88468o6362J74516j68678k34061
16965F94242L39015m1192l5145j61568M45031m39310J71333j45308J62111k09559
16955G79650M16747j4127k93506K60383k60464O03871m69497L8867j86610J13346
$$ plain form
16945 988660 1169659 1121998 1071807 1033963 1316464 1269492 1222514 1480855 1401666 1392672 1307102
16934 1307102 1215790 1273463 1335988 1748219 1518031 1313083 1163332 1319314 1326301 1209896
16924 1209896 1400790 1761325 1443611 1646209 1312986 1406558 1708876 1315118 1658818 1609047
16914 1609047 1581620 1365511 1675606 1953082 1373233 1484309 1664958 1602954 1414988 1909703
16904 1909703 1584883 1707585 2061477 1765649 2087904 1601230 1976576 1774806 1711120 1922958
16894 1922958 1735170 1995974 2172601 2032260 1844033 1861638 2094703 1944433 2341238 2310127
16884 2310127 2214878 2352060 2560643 2522418 2426794 2483579 2260842 2317133 2569138 2417954
16874 2417954 2332109 2508164 2326972 2648164 2622467 2530021 2623229 2537081 2393169 2613987
$$ packed form
16945I88660J80999m7661n0191l7844K82501m6972m6978K58341p9189q994q5570
16934A307102r1312N7673O2525M12231k30188k04948j49751J55982O987j16405
16924A209896J90894L60535l17714K02598l33223R3572L02318l93758L43700m9771
16914A609047k7427k16109L10095K77476n79849J11076J80649o2004j87966M94715
16904A909703l24820J22702L53892k95828L22255m86674L75346k01770o3686K11838
16894A922958j87788K60804J76627j40341j88227J7605K33065j50270L96805l1111
16884B310127r5249J37182K08583l8225r5624N6785k22737N6291K52005j51184
16874B417954q5845J76055j81192L21192k5697r2446R3208q6148j43912K20818
$$ plain form
16864 2613987 2905872 2723422 2959375 2991642 3075087 2842005 3031019 3012027 3173250 3126694
16854 3126694 3349041 3280705 3070090 3661242 3337187 3394179 3527743 3654915 3623565 3482752
16844 3482752 3441923 3906146 3632670 3866455 3793230 3978118 4029293 4008305 3965345 4141908
16834 4141908 4117020 4670096 4414989 4413873 4787374 4766176 5070718 4733779 4951353 4940572
16824 4940572 5034459 5273909 5139391 5374829 5597966 5831096 6080303 5923015 6247662 5896473
16814 5896473 5879682 6356003 6894593 6843348 6654416 6780507 7213792 7048947 7502116 7414306
16804 7414306 7424872 7839936 7998160 7959264 8060760 8784502 8678797 9101589 9265412 9352009
16794 9352009 9446565 9744989 10172854 10495910 10700584 10855329 11347514 11360313 12089496 12487755
$$ packed form
16864B613987K91885j82450K35953L2267Q3445k33082J89014j8992J61223m6556
16854C126694K22347o8336k10615N91152l24055N6992J33564J27172l1350j40813
16844C482752m0829M64223k73476K33785p3225J84888N1175k0988m2960J76563
16834D141908k4888N53076k55107j116L73501k1198L04542l36939K17574j0781
16824D940572R3887K39450j34518K35438K23137K33130K49207j57288L24647l51189
16814E896473j6791M76321N38590n1245j88932J26091M33285j64845M53169q7810
16804G414306J0566M15064J58224l8896J01496P23742j05705M22792J63823Q6597
16794I352009R4556K98424M27865L23056K04674J54745M92185J2799P29183L98259
$$ plain form
16784 12487755 12423421 12899058 13313055 13349402 14140648 14559975 14892871 15649578 16017461 16232900
16774 16232900 16821277 17086051 17959348 18658275 19129522 19913222 20525078 21328239 22029062
16765 22029062 22765254 23731661 24298330 25402830 26361946 27814836 29127119 29960677 31503378
16756 31503378 32388529 33816750 35466408 36973372 38826948 40817300 42412374 44767952
16748 44767952 46749760 49468890 51780452 54560289 57508158 60589901 64112996 67546026
16740 67546026 71283295 75454709 80046842 85005851 89993722 95060954 101063437 107126154
16732 107126154 113645480 120757335 127736115 135209840 142938307 150925622 158749651 166226445
16724 166226445 174097950 181310868 187870117 193503306 198201044 201594107 203808950 204646119
$$ packed form
16784A2487755o4334M75637M13997L6347P91246M19327L32896P56707L67883K15439
16774A6232900N88377K64774Q73297O98927M71247P83700O11856Q03161P00823
16765B2029062P36192R66407N66669J104500R59116J452890J312283Q33558J542701
16756C1503378Q85151J428221J649658J506964J853576J990352J595074K355578
16748D4767952J981808K719130K311562K779837K947869L081743L523095L433030
16740F7546026L737269M171414M592133M959009M987871N067232O002483O062717
16732A07126154O519326P111855O978780P473725P728467P987315P824029P476794
16724A66226445P871505P212918O559249N633189M697738L393063K214843Q37169
$$ plain form
16716 204646119 204233681 201736855 198484764 193693470 188188464 181600336 174208533 166645057
16708 166645057 158679966 150358436 142281074 134286593 126463514 118731745 111702429 105359736
16700 105359736 98620506 92656497 87074944 81750358 77024034 72780564 68494173 64425208
16692 64425208 60753337 57418274 54132940 51328596 48688456 46222538 44023243 41653012
16684 41653012 39583645 37559765 35889459 34214106 32922282 30910916 29557535 28462528
16676 28462528 27145763 25878927 25094122 24153620 23184015 22122266 21306213 19959982 19859942
16667 19859942 18921498 18543139 17513799 16949680 16541003 15570659 15265347 14760889 14186507
16658 14186507 13731556 13334469 12908132 12690391 12061677 11868798 11500144 11322774 10744802
$$ packed form
16716B04646119m12438k496826l252091m791294n505006o588128p391803p563476
16708A66645057p965091q321530q077362p994481p823079p731769p029316o342693
16700A05359736o739230n964009n581553n324586m726324m243470m286391m068965
16692F4425208l671871l335063l285334k804344k640140k465918k199295k370231
16684D1653012k069367k023880j670306j675353j291824k011366j353381j095007
16676B8462528j316765j266836p84805r40502r69605j061749q16053j346231j00040
16667A9859942r38444l78359j029340n64119m08677r70344l05312n04458n74382
16658A4186507m54951l97087m26337k17741o28714j92879l68654j77370n77972
$$ plain form
16649 10744802 10147216 10092788 9674804 9767963 9303973 9134803 8600888 8834771 8297170 8631638
16639 8631638 8205470 7684339 7677528 7165402 7355779 7222580 6825228 6490685 6403555 6357493
16629 6357493 6264251 5919602 6123420 6145806 5447971 5798110 5721729 5123686 5247381 5119917
16619 5119917 4322768 4901062 4934053 4370403 4374894 4603453 4028388 4512332 4214286 4215679
16609 4215679 4085634 4046957 3973893 3637622 3855284 3568623 3485263 3616085 3445009 3326136
16599 3326136 3320798 3240725 3100803 3405900 3183542 3114805 3110670 2957198 3063095 2664767
16589 2664767 2709956 2633684 2577936 2979842 2707419 2274754 2674838 2536546 2655053 2537181
16579 2537181 2447368 2256363 2514171 2423422 2302161 2429753 2081617 2309460 2194853 2171059
$$ packed form
16649A0744802n97586n4428m17984R3159m63990j69170n33915K33883n37601L34468
16639H631638m26168n21131o811n12126J90377j33199l97352l34543q7130m6062
16629F357493r3242l44649K03818K2386o97835L50139p6381n98043J23695j27464
16619E119917p97149N78294L2991n63650M491K28559n75065M83944k98046J393
16609D215679j30045l8677p3064l36271K17662k86661q3360J30822j71076j18873
16599C326136n338q0073j39922L05097k22358o8737m135j53472J05897l98328
16589B664767M5189p6272n5748M01906k72423m32665M00084j38292J18507j17872
16579B537181q9813j91005K57808r0749j21261J27592l48136K27843j14607k3794
$$ plain form
16569 2171059 2005825 1910713 1902119 1997744 2139352 2121068 2063571 2104377 1613011 1784288 1678301
16558 1678301 1608228 1845842 1673650 1766110 1716249 1511752 1892811 1124515 1552684 1367882
16548 1367882 1733959 1483312 1598563 1433450 1410278 1402225 1329378 1149044 1461654 1417902
16538 1417902 1327284 1157377 1202079 1388637 1523853 1233621 1333849 1115402 1541154 1347655
16528 1347655 1384055 1298662 1413447 1206688 1241031 1003716 1156177 1005397 1004597 1186098
16518 1186098 983167 877959 1110493 773966 1185280 1057122 698919 1166864 1006762
16509 1006762 1048855 848242 778079 703296 706890 503988 977410 907963 597509 943876
16499 943876 1055000 885419 814283 834759 821369 804651 901978 944690 479867 531015 945426
$$ packed form
16569B171059j65234r5112q594R5625J41608j8284n7497M0806m91366J71277j05987
16558A678301p0073K37614j72192R2460m9861k04497L81059p68296M28169j84802
16548A367882L66077k50647J15251j65113k3172q053p2847j80334L12610m3752
16538A417902r0618j69907M4702J86558J35216k90232J00228k18447M25752j93499
16528A347655L6400q5393J14785k06759L4343k37315J52461j50780q00J81501
16518A186098k02931j05208K32534l36527M11314j28158l58203M67945j60102
16509A006762M2093k00613p0163p4783L594k02902M73422o9447l10454L46367
16499I43876J11124j69581p1136K0476j3390j6718R7327M2712m64823N1148M14411
$$ plain form
16488 945426 1002184 849624 952646 1076455 875391 609399 797627 689980 663792 609553
16478 609553 531575 557343 788912 819502 440832 749768 745876 651382 796321 629571 683004
16467 683004 577357 886476 226351 459019 327324 587607 562998 107533 470147 855403
16457 855403 399856 486089 678583 185329 584836 562594 580857 721118 447501 737470
16447 737470 687048 194390 514079 633908 321201 646317 638232 364847 554320 475701
16437 475701 540659 525735 485496 414885 441116 451939 251257 371471 532430 361396 409242
16426 409242 405233 544921 358027 386006 289853 514817 375971 490272 280952 146715
16416 146715 331722 450220 172358 700849 684118 145497 292757 425388 395958 194345
$$ packed form
16488I45426N6758j52560J03022J23809k01064k65992J88228j07647k6188n4239
16478F09553p7978K5768K31569L0590l78670L08936l892r4494J44939j66750N3433
16467F83004j05647L09119B26351K32668j31695K60283k4609A07533L62614L85256
16457H55403C99856Q6233J92494A85329L99507k2242J8263J40261k73617K89969
16447G37470n0422A94390L19689J19829l12707L25116q085k73385J89473p8619
16437D75701O4958j4924m0239p0611K6231J0823k00682J20214J60959j71034M7846
16426D09242m009J39688j86894K7979r6153K24964j38846J14301k09320j34237
16416A46715J85007J18498A72358N28491j6731A45497J47260J32631k9430A94345
$$ plain form
16405 253412 388083 374680 320647 366043 154692 350023 515143 281962 177829 446523
16395 446523 183229 48134 223009 249003 453215 16748 325319 519496 318728 231210
16385 231210 233799 497810 191530 -59419 78608 491494 324064 96138 -46476 258831 239109
16374 239109 388216 196643 132492 484383 505080 176103 496863 246571 248768 395257
16364 395257 -209386 421236 54502 459091 108390 205747 183670 77411 188421 119959
16354 119959 215674 112082 151527 403747 870 205333 381593 42675 319221 44910 186173
16343 186173 -151819 256646 73263 125876 204639 155042 51224 109531 279513 89976 121135
16332 121135 287864 52147 9206 435920 76737 459380 240659 213730 140974 -274978 365604
$$ packed form
16405B53412J34671j3403n4033M5396A54692J95331J65120k33181j04133K68694
16395D46523A83229D8134J74875K5994K04212A6748L08571J94177k00768q7518
16385B31210K589K64011A91530e9419G8608M12886j67430I6138d6476B58831j9722
16374B39109J49107j91573o4151L51891K0697A76103L20760B46571K197J46489
16364C95257b09386D21236E4502M04589A08390R7357k2077G7411J11010o8462
16354A19959R5715j03592L9445K52220H70K04463J76260D2675K76546D4910J41263
16343A86173a51819B56646G3263N2613P8763m9597E1224N8307J69982H9976L1159
16332A21135J66729E2147I206M26714G6737L82643k18721k6929p2756b74978C65604
$$ plain form
16320 318947 244024 404035 294763 356407 307311 272724 -42915 176373 388135 141113
16309 121387 125522 500231 570875 -151129 -35888 312290 -35852 22749 242792 151102 169637
16298 169637 33706 103409 50845 89848 257794 31511 247992 186256 28048 239122 147854
16287 147854 9347 253204 285119 178358 139279 -28598 363897 251132 275845 312533 166583
16276 166583 -195920 63487 78948 -31040 -86301 107034 169448 126417 271779 -90687 222887
16264 292571 29158 140224 293024 185674 200209 270520 248104 139216 95047 -83083 34689
16252 5277 157321 -74237 86921 128020 14255 232376 49685 -72427 -8882 -51229 32782 109156
16240 109156 376575 81802 512584 52435 499774 -24240 -64977 56587 -24529 -123290 -66915
$$ packed form
16320C18947p4923J60011j09272O1644m9096l4587d2915A76373K11762A41113
16309A21387M135L74709P0644a51129c5888C12290c5852B2749K20043r1690J8535
16298A69637C3706O9703E0845L9003J67946C1511K16481o1736B8048K11074r1268
16287A47854I347K43857L1915j06761l9079b8598C63897j12765K4713L6688j45950
16276A66583a95920F3487J5461c1040n5261A07034O2414m3031J45362i0687B22887
16264B92571B9158J11066J52800j07350J4535P0311k2416j08888m4169h3083C4689
16252E277J52044g4237H6921M1099A4255K18121D9685g2427h882m2347C2782P6374
16240A09156K67419H1802M30782E2435M47339b4240m0737E6587b4529r8761N6375
$$ plain form
16229 -66915 19101 54307 155461 -20913 147929 -181158 -290560 44462 169136 137539 381520
16218 381520 129040 -456361 -182132 81724 363261 120454 108362 125441 -173857 229072
16207 -71186 -59246 -141577 -102240 601132 -217483 -379953 285277 363022 -273949 -91833 21084
16195 287397 -104760 -103330 235519 -214142 -104591 -103429 190676 278031 252059 27528 -63313
16183 202226 9339 -63673 50089 -95542 -304518 -52748 -53509 190518 227778 158124 -109214
16171 -102735 -307162 193677 288828 -176421 -381416 234327 111168 250831 295424 421236
16161 421236 -332316 109270 -58263 159319 -369034 -13550 33298 248576 81784 -339188
16150 -105102 64872 -37477 266000 58025 229315 22766 -233152 191040 -155113 -184902
$$ packed form
16229f6915A9101L5206J01154b0913A47929a81158j09402D4462J24674l1597K43981
16218C81520A29040d56361a82132H1724K81537A20454j2092J7079a73857B29072
16207g1186J1940q2331L9337F01132b17483j62470B85277P7745b73949i1833B1084
16195B87397a04760J430B35519b14142a04591J162A90676Q7355k5972B7528f3313
16183B02226I339f3673E0089i5542k08976e2748p61A90518L7260o9654a09214
16171a02735k04427A93677R5151a76421k04995B34327A11168J39663M4593J25812
16161D21236c32316A09270e8263A59319c69034a3550C3298K15278H1784c39188
16150a05102F4872c7477B66000E8025J71290B2766b33152A91040a55113k9789
$$ plain form
16140 -184902 380761 199454 -198935 47021 54512 -170517 -19774 11710 -29493 -2694 205947
16128 -266770 185060 124495 210759 -14162 86441 34346 -105431 -136950 -161200 -71476 -416016
16117 -416016 -217130 -4095 -114239 -152917 -110017 177195 -162471 -160834 133128 -210523 64789
16105 168259 119765 -91714 127088 12505 97634 232567 179417 99068 -2357 -1770 -283800
16094 -283800 -4252 -38772 -68936 242035 -148921 -23093 -119746 -192533 -62670 -173009 54104
16082 233899 72897 115426 35809 -427055 231727 -170167 -35428 187963 -110612 -2950 39341
16070 -100297 291780 -204715 -190823 -200627 89558 -84645 108148 -176652 -222079 -129161 -65877
16059 -65877 -134988 16680 -227935 -43683 -102078 -56288 -225188 -120336 -61244 26634 -1989
$$ packed form
16140a84902C80761j81307a98935D7021P491a70517a9774A1710b9493b694B05947
16128b66770A85060o0565Q6264a4162H6441C4346a05431l1519k4250g1476l44540
16117d16016J98886d095j10144l8678M2900A77195a62471J637A33128b10523F4789
16105A68259m8494i1714A27088A2505Q5129J34933n3150q0349b357N87k82030
16094b83800d252l4520l0164B42035a48921b3093r6653p2787f2670j10339E4104
16082B33899G2897M2529C5809d27055B31727a70167c5428A87963a10612b950C9341
16070a00297B91780b04715J3892r804H9558h4645A08148a76652m5427R2918O3284
16059f5877o9111A6680b27935d3683n8395M5790j68900J04852N9092B6634a989
$$ plain form
16047 75887 54941 -197780 -312850 53843 -6850 -91918 -112561 -88536 -187364 12609 -238113
16035 -236879 -59005 -189384 65899 55758 228962 -87305 -85589 -133582 -234514 286543 146660
16024 146660 86584 -153500 -176673 -183530 -109716 29251 67679 256778 2816 -68461 38973
16012 117755 9736 268216 54609 63804 97068 -34662 -37843 -49806 117886 70704 332049
16001 332049 -60459 112719 -2651 -62184 -91079 -8449 -9291 42752 -43317 449 169054 191783
15989 191783 26058 123200 48978 214552 21224 262765 65313 128077 -24449 522264 51947
15977 77481 -212643 14090 71522 -247987 -274040 111296 187349 92995 -73601 -77994 -299773
15966 -299773 -9529 -196540 185888 2926 -20223 -404774 23699 -63304 -25404 -413293 -105299
$$ packed form
16047G5887k0946a97780j15070E3843f850q5068k0643K4025r8828A2609b38113
16035b36879e9005j30379F5899j0141J73204h7305J716m7993j00932B86543j39883
16024A46660o0076a53500k3173o857P3814B9251L8428J89099B816f8461C8973
16012A17755I736K58480E4609R195L3264c4662l181j1963A17886m7182K61345
16001C32049f0459A12719b651n9533k8895h449q42D2752d3317D49J68605K2729
15989A91783B6058R7142D8978J65574B1224K41541F5313O2764b4449E22264E1947
15977G7481b12643A4090N7432b47987k6053A11296P6053I2995g3601m393k21779
15966b99773i529j87011A85888B926b0223l84551B3699f3304b5404l87889a05299
$$ plain form
15954 -337996 -138194 106843 167534 -34469 -72692 -83689 -232608 -221036 -149701 -1922 369344
15942 96773 22708 -185833 223536 65656 -91802 142762 70362 118091 -94535 189041 223
15930 -344070 -235170 22236 168408 214037 168964 89615 -148976 86866 324694 -71881 248678
15918 -133799 -47778 -193374 -114516 -223160 -129746 -96054 210223 -77846 186696 -149359
15907 -227049 -74064 218132 -150341 -117363 -288369 50124 198225 -117799 -97123 -198598
15897 -198598 62836 -88056 164691 -43659 -196534 -185805 137555 -231979 -96908 -162094 -65454
15885 -110830 -182626 -96402 45334 -27894 -24569 27060 -503879 330304 114678 -32848 10440
15873 70344 -166355 -180 120864 85528 -106291 -55161 62578 60022 81383 153083 34185 192071
$$ packed form
15954c37996a38194A06843O0691c4469l8223j0997j48919J1572P1335a922C69344
15942I6773B2708a85833B23536F5656i1802A42762G0362M7729i4535A89041B23
15930c44070J08900B2236J46172M5629m5073p9349a48976H6866K37828g1881B48678
15918a33799d7778j45596P8858j08644R3414L3692B10223g7846A86696a49359
15907b27049g4064B18132a50341L2978j71006E0124J48101a17799K0676j01475
15897a98598F2836h8056A64691d3659j52875J0729A37555b31979i6908o5186f5454
15885a10830p1796Q6224D5334b7894L325B7060e03879C30304A14678c2848A0440
15873G0344a66355a80A20864l5336a06291N1130F2578k556K1361P1700C4185J57886
$$ plain form
15861 192071 74651 55909 35284 -158999 -378030 -239712 -422767 -124981 168299 -198953
15850 59849 -7616 -132095 58066 -399941 -34529 -46952 -223623 -52688 -21036 7507 93130
15839 93130 -382959 217843 6171 -329634 146899 44616 -71767 -41503 58624 -106983 -41788
15827 -76294 -402507 -226924 25716 170641 271812 -80247 130596 -68554 30942 52516 -70677
15815 -79884 -176809 -120155 32722 158585 -17251 -153405 -251363 -8910 -86792 108017 -245877
15803 -310614 -5015 -51258 97920 96842 -37667 -378179 -35024 -160025 92885 -74645 -47906
15792 -47906 6662 -163974 -164732 328212 -231332 111648 -29968 32346 41980 145798 -23335
15780 -104630 177202 -125386 -142627 58662 -257837 -126995 33953 -136754 318386 -166034
$$ packed form
15861A92071G4651j8742k0625a58999k19031J38318j83055a24981A68299a98953
15850E9849g616j24479E8066c99941c4529j2423j76671e2688b1036G507Q5623
15839I3130c82959B17843F171c29634A46899D4616g1767L0264E8624a06983d1788
15827g6294l26213J75583B5716J44925J01171h0247A30596f8554C0942K1574g0677
15815g9884r6925N6654C2722J25863a7251j36154r7958h910p7882A08017b45877
15803c10614e015m6243I7920j078c7667l40512c5024j25001I2885g4645K6739
15792d7906F662a63974p58C28212b31332A11648b9968C2346R634J03818b3335
15780a04630A77202a25386j7241E8662b57837a26995C3953a36754C18386a66034
$$ plain form
15769 81061 -132089 -144829 289995 -10104 94816 275720 -105427 80693 123561 224014 110407
15757 49914 -56516 314681 21299 274897 -205349 224770 155289 -106148 181090 177684 -92108
15745 -21214 108032 109600 -225599 -38094 -102778 111969 -2603 66104 80768 68017 -16944
15733 -208950 64224 292931 114504 -183400 -183999 -121310 18684 64903 -35009 -616 116798
15721 -361738 -87031 26059 -115626 83361 -62891 -2803 -167180 -65521 -190110 -241927 -192198
15710 -192198 -437976 -242702 -155926 31954 74343 -206059 186306 -108734 7751 65534 -201800
15698 -52581 230299 -44490 300639 104516 60886 -293622 -118286 -222047 110009 -146803
15687 244784 -279390 106199 143145 -154859 37140 -94309 87872 131198 91649 -227492 122803
$$ packed form
15769H1061a32089j2740B89995a0104I4816J80904a05427H0693M2868J00453A10407
15757D9914e6516C14681B1299K53598b05349B24770o9481a06148A81090l406i2108
15745b1214A08032J568b25599c8094o4684A11969b603F6104J4664j2751a6944
15733b08950F4224K28707A14504a83400n99O2689A8684M6219c5009f16A16798
15721c61738h7031B6059a15626H3361f2891b803j64377f5521j24589n1817M9729
15710a92198k45778J95274Q6776C1954M2389b06059A86306a08734G751N7783b01800
15698e2581B30299d4490C00639A04516m3630b93622a18286j03761A10009a46803
15687B44784b79390A06199L6946a54859C7140i4309H7872M3326l9549b27492A22803
$$ plain form
15675 148720 -217078 43837 160759 -49121 138155 -89562 307033 103938 166000 58973
15664 167045 73458 -36638 -239252 52737 43264 11441 301848 -146454 269461 -61861 -149809
15653 -149809 -43163 -41564 -181114 -446610 -204093 38051 -31770 79477 46179 -413696 -175869
15641 -188731 16495 -62452 36326 136800 6097 -180736 237599 117842 -79281 94940 -263317
15629 201818 41164 -248476 -58586 33967 -82187 -277615 1662 101752 105723 -44310 525214
15617 99498 -321324 64245 -200618 -47763 2125 -276060 -45994 -17950 43428 -34547 124708
15605 -159082 -109857 -72683 229187 -80011 -445153 33963 109671 127790 166240 8068 183 156827
15593 156827 -2030 -37472 199376 221800 27547 -108452 559615 60553 218019 77246 354929
$$ packed form
15675A48720b17078D3837J16922d9121A38155h9562C07033A03938O2062E8973
15664A67045G3458c6638k02614E2737r473A1441K90407a46454B69461f1861q7948
15653a49809d3163J599j39550k65496b04093C8051c1770G9477l3298d13696a75869
15641a88731A6495f2452C6326J00474F097a80736B37599A17842g9281I4940b63317
15629B01818D1164b48476e8586C3967h2187j95428A662J00090L971d4310E25214
15617I9498c21324F4245b00618d7763B125b76060d5994a7950D3428c4547A24708
15605a59082M9225L7174B29187h0011l65142C3963P5708J8119L8450H068A83J56644
15593A56827b030l5442A99376K2424B7547a08452E59615F0553J57466G7246K77683
$$ plain form
15582 354929 -386183 104424 15741 43231 -15008 201631 15726 -367267 -134758 -128164 -131196
15571 -131196 329059 -232101 -66045 96961 60975 -377159 -130806 -100530 -77349 -37982 230945
15559 -310399 274621 275107 -86358 -234697 204864 -59305 -192338 5979 53457 92367 181406
15548 181406 19065 15555 57227 9397 336483 -82323 -93106 -159447 56235 -34000 -331489
15537 -331489 51291 -115867 -147770 -54064 72332 96104 -197008 270262 -198368 -186849 265072
15525 89186 365532 -122169 -18552 -115236 -41120 85118 88567 -200125 135568 146448 243359
15514 243359 -68585 66894 -55383 43578 -459662 67757 110746 46056 179295 304415 -82155
15502 -167547 29400 44442 -215083 -216844 239988 -71948 -87416 -87438 50889 4119 -90639 -150823
$$ packed form
15582C54929c86183A04424A5741K7490a5008B01631A5726c67267a34758O594l032
15571a31196C29059b32101f6045I6961l5986c77159a30806L0276K3181c7982B30945
15559c10399B74621M86h6358j48339B04864e9305j33033E979M7478L8910Q9039
15548A81406A9065l510M1672I397L27086h2323j0783o6341E6235c4000k97489
15537c31489E1291a15867l1903e4064G2332K3772a97008B70262a98368J1519B65072
15525H9186K76346a22169a8552r6684d1120H5118L449b00125A35568J0880R6911
15514B43359f8585F6894e5383D3578d59662F7757M2989D6056J33239J25120h2155
15502a67547B9400J5042b15083j761B39988g1948j5468k2E0889D119i0639o0184
$$ plain form
15490 -150823 80383 13753 -67147 -49481 146085 -211537 -185737 184188 -47690 101592 22825
15478 -330163 940 194739 360205 -62495 14022 -262269 170574 85792 73431 -119924 121210
15466 -80677 197557 -20595 282345 -248544 153178 -126887 112824 89685 267865 68834
15455 153832 30737 256723 238640 -111050 31754 37154 -108152 216873 219778 73662 -175045
15443 58236 -172825 -9946 2680 -178650 -34739 -174239 89399 -100744 99081 165444 100660
15432 100660 239109 83580 -115250 -175946 -15107 58881 214465 -76003 -150986 -134635 271061
15420 155664 -275808 -82459 -242931 -108704 95820 469148 414012 -186676 114228 72132
15410 72132 91232 95699 299177 435438 243223 104279 97292 23093 -307698 31732 -174715
$$ packed form
15490a50823H0383A3753f7147J7666A46085b11537K5800A84188d7690A01592B2825
15478c30163I40J93799J65466f2495A4022b62269A70574q4782j2361a19924A21210
15466h0677A97557b0595B82345b48544A53178a26887A12824k3139J78180F8834
15455A53832C0737K25986j8083a11050C1754N400a08152B16873K905G3662a75045
15443E8236a72825i946B680a78650c4739j39500H9399a00744I9081O6363o4784
15432A00660J38449H3580a15250o0696a5107E8881J55584g6003p4983J6351B71061
15420A55664b75808h2459j60472a08704I5820L73328n5136a86676A14228m2096
15410G2132J9100M467K03478J36261j92215A04279o987B3093c07698C1732a74715
$$ plain form
15398 77343 26930 126746 40006 -18304 -383499 118578 65997 80586 60138 348280 5616
15386 115764 -154097 -93308 108728 70631 -58771 81260 -266540 897 159273 185349 291116
15375 291116 -4140 -176802 18378 251467 -146790 28340 -13601 7929 -19600 55181 107298
15364 107298 190404 -27822 248159 38361 -67734 10651 323581 14026 179358 32194 219338
15353 219338 -17335 -216241 -16507 197986 -87566 -229133 197377 -25693 -102877 -54737 58344
15341 -94913 341925 189144 80360 -32537 -287169 -250538 100484 114821 -155550 -80817 53574
15329 -67760 -56240 112213 134262 -268345 63303 -37960 -129004 78704 -61289 143890 66822
15317 -136116 34662 177399 -284726 199746 -115699 227539 85688 -165059 8695 117767
$$ packed form
15398G7343B6930R9816D0006a8304l65195A18578n2581J4589k0448K88142E616
15386A15764a54097O0789A08728l8097e8771H1260b66540H97J58376K6076J05767
15375B91116d140j72662A8378K33089a46790B8340a3601G929a9600E5181N2117
15364A07298Q3106b7822B48159C8361f7734A0651L12930A4026J65332C2194J87144
15353B19338a7335j98906a6507A97986h7566j41567A97377b5693p7184M8140E8344
15341i4913C41925j52781H0360c2537k54632L6631A00484J4337a55550P4733E3574
15329f7760J1520A12213K2049b68345F3303c7960r1044G8704f1289A43890F6822
15317a36116C4662J42737b84726A99746a15699B27539H5688a65059H695J09072
$$ plain form
15307 117767 -253113 207289 -7350 -41184 -112014 -182335 -147562 248286 -77722 61754 29187
15295 32016 -99890 -116973 -198458 79001 180977 -47145 57493 169717 74947 -191632 -122794
15284 -122794 196669 -230954 -105466 42670 -31876 73120 341300 37460 39973 154360 95196
15273 95196 14509 338169 89612 236409 -116201 -36141 -39337 80049 284904 -105019 39779
15261 471435 301842 96513 98534 -126930 61954 61776 374333 64605 271980 519665 346376
15250 346376 339313 752851 1686351 1458940 1211131 1646842 720890 350175 97085 -96681
15239 184994 47331 -146785 73866 186736 -76640 277555 -5229 90902 -267563 -34543 -73250
15228 -73250 37077 101062 15599 435518 -324229 -85928 -84929 273396 -493916 200035 532844
$$ packed form
15307A17767b53113B07289g350l3834p0830p0321L4773B48286g7722F1754B9187
15295C2016i9890j7083q1485G9001J01976d7145E7493J12224G4947a91632O8838
15284a22794A96669b30954a05466D2670c1876G3120K68180C7460K513J14387n9164
15273I5196A4509L23660H9612J46797a16201c6141l196H0049K04855a05019C9779
15261D71435j69593I6513K021a26930F1954j78L12557F4605K07375K47685j73289
15250C46376p063M13538R33500k27411k47809M35711G20890C50175I7085i6681
15239A84994D7331a46785G3866J12870g6640B77555e229I0902b67563c4543l8707
15228g3250C7077O3985A5599M19919c24229h5928R99B73396d93916B00035L32809
$$ plain form
15217 532844 -278502 271190 370128 10822 185495 77012 244932 351975 124608 -17327
15206 173367 -7628 289730 125663 412212 22289 -226854 254748 -6107 83771 322101 92063
15194 -86832 -11881 178190 -109107 163022 -6480 97660 112665 47579 26474 287994 172293
15183 172293 330506 -80562 154812 275576 -55255 382565 139380 2570 -75921 229629
15172 302614 -20890 -54857 -66328 4368 -122198 -103571 184362 -28513 167982 -157598 -69528
15160 321742 187103 366917 194422 20749 178804 -148058 29230 -120395 51857 99079
15150 99079 -199461 119798 38892 399751 140929 177249 10849 -98473 61514 -229762 104179
15138 184619 -52407 -226546 -109166 424059 132219 109900 186965 106113 67265 -19892 -94767
$$ packed form
15217E32844b78502B71190R8938A0822J74673G7012J67920J07043A24608a7327
15206A73367g628B89730A25663K86549B2289b26854B54748f107H3771K38330I2063
15194h6832a1881A78190a09107A63022f480I7660J5005D7579k1105K61520j15701
15183A72293J58213h0562A54812J20764e5255C82565A39380B570g5921B29629
15172C02614b0890l3967j1471D368a22198J8627A84362b8513A67982a57598f9528
15160C21742j34639J79814j72495B0749J58055a48058B9230a20395E1857M7222
15150I9079a99461A19798C8892L60859A40929L6320A0849i8473F1514b29762A04179
15138A84619e2407j74139a09166D24059A32219k2319P7065q0852l8848a9892p4875
$$ plain form
15127 -94767 115165 -69414 223869 284097 224826 199715 -16126 355557 73211 160216 154749
15116 154749 22799 117292 70826 31426 -108218 117399 149899 -249834 129736 408519
15106 408519 306049 172040 57241 -36916 257345 440003 452154 186545 34916 -41635
15095 167036 130826 89 414812 192133 121597 -235966 357910 283123 115271 92563 371513
15084 371513 -230325 126613 -74751 154708 325347 180456 155034 51875 -128889 271036
15073 471508 169198 161696 78729 216636 252216 292352 -53030 187597 257107 180711 23003
15061 129461 15349 115633 511363 -3286 -66492 349033 -48527 258119 108356 -47052 171419
15049 267237 30416 250677 380331 196342 447013 185912 67001 152927 356517 385505
$$ packed form
15127i4767A15165f9414B23869O0228n9271k5111a6126C55557G3211Q7005n467
15116A54749B2799R4493m6466C1426a08218A17399L2500b49834A29736K78783
15106D08519j02470j34009E7241c6916B57345J82658J2151A86545C4916d1635
15095A67036l6210H9M14723A92133p0536b35966C57910p4787A15271k2708K78950
15084C71513b30325A26613g4751A54708J70639j44891k5422E1875a28889B71036
15073D71508A69198p502G8729J37907L5580M0136e3030A87597O9510p6396B3003
15061A29461A5349J00284L95730c286o3206C49033d8527B58119A08356d7052A71419
15049B67237C0416K20261J29654j83989K50671A85912F7001Q5926K03590K8988
$$ plain form
15039 385505 332347 173203 276610 224074 486768 402566 99814 212152 208091 285743 258355
15028 258355 -41374 318389 408206 635535 82128 339201 295783 67281 125644 410424 189495
15016 236297 19740 455192 132959 -21629 629809 318713 242691 358202 -138390 149976
15005 173 -49672 111302 189626 -273864 183475 128493 214511 329357 112669 293839 378663
14994 378663 67761 604853 158675 174425 314770 424271 232926 227417 400691 328554
14984 328554 7240 143316 192051 597074 24999 14211 492668 414313 363243 139177 348998
14973 348998 299939 228915 202233 490135 133437 10651 186502 126925 73174 22513 472469
14962 472469 342907 316755 -4253 -75415 130321 323036 210121 521530 236041 371313
$$ packed form
15039C85505n3158j59144J03407n2536K62694q4202I9814J12338m061P7652k7388
15028B58355d1374C18389Q9817K27329H2128K57073m3418F7281N8363K84780A89495
15016B36297A9740M35452A32959b1629F29809l11096p6022J15511a38390A49976
15005A73d9672A11302P8324b73864A83475n4982Q6018J14846A12669J81170Q4824
14994C78663F7761N37092A58675J5750J40345J09501j91345n509J73274p2137
14984C28554G240J36076M8735M05023B4999j0788M78457p8355n1070A39177K09821
14973C48998m9059p1024k6682K87902A33437A0651J75851n9577n3751B2513M49956
14962D72469j29562k6152d253p1162A30321J92715j12915L11409B36041J35272
$$ plain form
14952 371313 -2557 209665 262875 511615 65023 209474 473279 219612 269615 225218 264181
14941 264181 267959 62152 234143 551905 455202 213521 476088 197045 118422 303911
14931 303911 323045 228641 407072 432058 65890 239031 34608 334273 504633 220367
14920 361695 167055 180258 439933 392578 134941 407827 445920 303881 310167 153207
14909 376242 157611 111905 594787 492658 345026 346927 345622 299274 363610 387937 666800
14898 666800 336598 366954 115753 380951 373863 340979 293980 112821 695670 631370 317780
14887 317780 652991 359292 318407 430263 323238 347016 470131 532955 467622 482464
14877 482464 374650 285295 225585 197348 500263 197715 435800 774163 497945 518859
$$ packed form
14952C71313b557B09665N3210K48740F5023J44451K63805B19612N0003m4397L8963
14941B64181L778F2152J71991L17762r6703B13521K62567A97045p8623J85489
14931C03911J9134r4404J78431K4986F5890J73141C4608K99665J70360B20367
14920C61695A67055J3203K59675m7355A34941K72886L8093j42039O286A53207
14909C76242A57611m5706M82882j02129j47632J901j305m6348O4336K4327K78863
14898F66800l30202L0356A15753K65198p088l2884m6999A12821N82849o4300l13590
14887C17780L35211k93699m0885J11856j07025K3778J23115O2824o5333J4842
14877D82464j07814q9355n9710k8237L02915A97715K38085L38363k76218K0914
$$ plain form
14867 518859 199771 20890 301584 733066 140787 449990 161542 509786 746212 518749
14857 518749 431892 -24706 512086 399253 253331 391260 661025 579188 276021 279573
14847 279573 565870 620480 406881 543820 628090 411351 248490 596043 445026 712272
14837 712272 360628 391249 448598 236861 572567 563111 643914 675753 671533 469566 539789
14826 539789 530286 600865 809216 437637 713691 596409 360771 691559 523245 646394
14816 646394 709035 452950 793845 242414 467047 558731 513568 265888 389501 559942
14806 559942 589464 575272 134110 467644 930737 744546 387471 535697 661064 180364
14795 443894 228463 561831 484914 608078 699066 587286 610348 813924 727507 717750 688317
$$ packed form
14867E18859A99771B0890K80694M31482A40787L09203A61542L48244K36426k27463
14857E18749q6857b4706E12086j12833j45922J37929K69765q1837B76021L552
14847B79573K86297N4610k13599J36939Q4270k16739j62861L47553j51017K67246
14837G12272l51644L0621N7349k11737L35706r456Q0803L1839m220k01967P0223
14826E39789r503P0579K08351l71579K76054j17282k35638L30788j68314J23149
14816F46394O2641k56085L40895B42414K24633R1684m5163k47680J23613J70441
14806E59942K9522j4192A34110L33534M63093j86191l57075J48226J25367A80364
14795D43894k15431L33368p6917J23164R0988j11780K3062K03576q6417r757k9433
$$ plain form
14784 688317 455720 629480 842455 829557 513863 600746 416712 424248 993295 458087
14773 648116 825267 600446 808022 889963 556260 738417 424928 485321 1138642 893658
14763 893658 850222 715110 585471 876038 516840 657730 725422 633078 475235 578263
14753 578263 811058 952818 383555 574462 857169 839999 564278 705077 604980 557504
14743 557504 859475 992901 842207 818047 752083 991591 1061633 848577 561840 915746
14733 915746 714871 1022297 689022 822202 765810 544338 530675 807567 494933 904368
14723 904368 604645 918634 659977 583637 1084844 816689 958822 1037021 850028 1143131
14713 1143131 763569 626710 811391 1020438 610818 1025599 788060 758268 1086418 918397
$$ packed form
14784F88317k32597J73760K12975j2898l15694Q6883j84034P536N69047D58087
14773F48116J77151k24821K07576Q1941l33703J82157l13489O0393O53321k44984
14763H93658m3436j35112j29639K90567l59198J40890O7692r2344j57843J03028
14753E78263K32795J41760C83555J90907K82707j7170k75721J40799j00097m7476
14743E57504L01971J33426j50694k4160o5964K39508P0042k13056k86737L53906
14733I15746k00875L07426l33275J33180n6392k21472j3663K76892l12634M09435
14723I04368k99723L13989k58657p6340N01207k68155J42133P8199j86993K93103
14713A143131l79562j36859J84681K09047m09620M14781k37539k9792L28150j68021
$$ plain form
14703 918397 946055 815224 933038 901737 875948 788404 952975 1286981 770185 1106020
14693 1106020 1096908 1181984 1113966 1020336 1212207 907432 1058017 823285 910856 1039727
14683 1039727 1338616 702722 884881 987539 1024761 1126008 938744 1127715 870844 1071299
14673 1071299 1041178 1168424 974494 969500 1086881 1059778 1201059 1491585 1240344 1063912
14663 1063912 1206215 1172998 1055355 1085732 1036455 1092998 1133417 1530775 1293472 1531728
14653 1531728 1377754 1135303 1406299 1156396 1360267 1280542 1111864 963859 1747591 1534220
14643 1534220 1271426 1382721 1433645 1486681 1258120 1459039 1436899 1665536 1560927 1355847
14633 1355847 1310648 1582936 1554159 1237305 1664669 1311087 1401192 1431823 1100114 1658912
$$ packed form
14703I18397K7658j30831J17814l1301k5789q7544J64571L34006n16796L35835
14693A106020r112Q5076o8018r3630J91871l04775J50585k34732Q7571J28871
14683A039727K98889o35894J82159J02658L7222J01247j87264J88971k56871K00455
14673A071299l0121J27246j93930m994J17381k7103J41281K90526k51241j76432
14663A063912J42303l3217j17643L0377m9277N6543M0419L97358k37303K38256
14653A531728j53974k42451K70996k49903K03871p9725j68678j48005P83732k13371
14643A534220k62794J11295N0924N3036k28561K00919k2140K28637j04609k05080
14633A355847m5199K72288k8777l16854M27364l53582R0105L0631l31709N58798
$$ plain form
14623 1658912 1305019 1417393 1515954 1442020 1628341 1716546 1715232 1224577 1787716 1594804
14613 1594804 1775947 1908784 1841196 1555513 1844311 1735932 1681709 1573262 1773424 1768445
14603 1768445 1648738 1855207 1486450 1788676 1757609 1498440 1899139 1718584 2083611 1892394
14593 1892394 1935726 1755218 1464646 1808384 2293601 1682340 1786444 1860373 2233193 2012887
14583 2012887 1875640 2123593 2230936 2094679 2024798 2135694 1947515 2334709 2386806 2460152
14573 2460152 2085664 2254181 2261676 2521586 2365967 2637659 2792384 2460348 2535808 2454920
14563 2454920 2515024 3105513 2676906 2846450 3030083 3074015 3485859 3178302 3769798 3661697
14553 3661697 4115720 4582036 4800306 5895344 7902530 11612455 21851192 41158955
$$ packed form
14623A658912l53893J12374R8561p3934J86321Q8205j314m90655N63139j92912
14613A594804J81143J32837o7588k85683K88798j08379n4223j08447K00162m979
14603A768445j19707K06469l68757L02226l1067k59169M00699j80555L65027j91217
14593A892394M3332j80508k90572L43738M85217o11261J04104P3929L72820k20306
14583B012887j37247K47953J07343j36257o9881J10896j88179L87194N2097P3346
14573B460152l74488J68517P495K59910j55619K71692J54725l32036P5460q0888
14563B454920O0104N90489m28607J69544J83633M3932M11844l07557N91496j08101
14553C661697M54023M66316K18270J095038K007186L709925J0238737J9307763
$$ plain form
14545 41158955 43241515 23685614 11086171 5439382 3489293 2799642 2573918 2430029
14537 2430029 2530662 2348531 1843216 2252595 2688575 2444581 2321189 2131368 2184673 2536980
14527 2536980 2293516 2446461 2425181 2639438 2565276 2819332 2676348 2788948 2853591 2971725
14517 2971725 2690281 2994326 2772098 3113171 2836899 2828009 2813320 3225062 3286822 3010683
14507 3010683 3060354 3390855 3507335 3258514 3317083 2992006 3268352 3373561 3288711 3584002
14497 3584002 3891043 3809884 3682081 3838512 3389384 3750246 3662478 3777203 3782177 4096139
14487 4096139 3874894 4061588 4178854 3875546 3837247 4178391 4137831 4081544 4108606 4273895
14477 4273895 4141971 4498732 4494637 4256523 4608227 4714947 4474832 4712768 4446937 4801100
$$ packed form
14545D1158955K082560j9555901A1086171E439382j950089o89651k25724j43889
14537B430029J00633j82131n05315M09379M35980k43994j23392j89821N3305L52307
14527B536980k43464J52945k1280K14257p4162K54056j42984J12600O4643J18134
14517B971725k81444L04045k22228L41073k76272q890j4689M11742O1760k76139
14507C010683M9671L30501J16480k48821N8569l25077K76346J05209q4850K95291
14497C584002L07041q1159j27803J56431m49128L60862q7768J14725M974L13962
14487D096139k21245J86694J17266l03308l8299L41144m0560n6287K7062J65289
14477D273895j31924L56761m095k38114L51704J06720k40115K37936k65831L54163
$$ plain form
14467 4801100 4885401 4921925 4850784 5064619 4997554 5019066 5069706 5393545 5484163 5118174 5273128
14456 5273128 5399985 5537153 5751112 5822854 5787339 5642314 5888948 5861923 5909176 6103042
14446 6103042 5919663 6455929 6072318 6133105 6175744 6537145 6528331 6704805 6802725 6687652
14436 6687652 6998412 6877251 7411780 7086200 7131083 7203721 7611857 7457778 7972776 7720800
14426 7720800 7623454 7570772 7978393 8253636 8427218 8413319 8493880 8601180 8886855 9049151
14416 9049151 8904800 9213631 9185087 9454971 9748710 9674378 10172104 9998352 10116022 10229751
14406 10229751 10523393 10340927 10740794 10848577 11145255 11483262 11585581 11796979 11988153
14397 11988153 11831018 12135701 12038947 12943140 12910718 12983645 13023323 13237606 13803227 13895415
$$ packed form
14467D801100Q4301L6524p1141K13835o7065K1512N0640L23839R0618l65989J54954
14456E273128J26857J37168K13959P1742l5515j45025K46634k7025M7253J93866
14446F103042j83379N36266l83611O0787M2639L61401q814J76474R7920j15073
14436F687652L10760j21161N34529l25580M4883P2638M08136j54079N14998k51976
14426G720800r7346n2682M07621K75243J73582j3899Q0561J07300K85675J62296
14416I049151j44351L08831k8544K69884K93739p4332M97726j73752J17670J13729
14406A0229751K93642j82466L99867J07783K96678L38007J02319K11398J91174
14397A1988153j57135L04683r6754R04193l2422P2927L9678K14283N65621R2188
$$ plain form
14387 13895415 14176503 14133115 14612499 14968370 15112906 15371397 16020623 15977175 16244706 16438049
14377 16438049 16759622 17150506 17494355 18031269 18170836 18239190 19064363 19104030 19658460 19778033
14367 19778033 20446824 21082661 21445955 21864732 22401519 22530132 23368058 23833020 24244330
14358 24244330 24559375 25292158 26002243 26322166 26963871 27957348 28699826 28946037 29911982
14349 29911982 30270395 31101476 31971390 32654954 33739712 34929423 35664134 36295633 37320575
14340 37320575 38536514 39540542 40539759 41872348 42947987 44170880 45448784 46543872
14332 46543872 48111458 50161559 50673206 52765316 54350653 56240264 57714079 59897841
14324 59897841 62136759 63642898 66145537 68645970 70797194 73106972 75657488 78515472
$$ packed form
14387A3895415K81088m3388M79384L55871J44536K58491O49226m3448K67531J93343
14377A6438049L21573L90884L43849N36914J39567O8354Q25173L9667N54430J19573
14367A9778033O68791O35837L63294M18777N36787J28613Q37926M64962M11310
14358B4244330L15045P32783P10085L19923O41705R93477P42478K46211R65945
14349B9911982L58413Q31081Q69914O83564J084758J189711P34711O31499J024942
14340C7320575J215939J004028R99217J332589J075639J222893J277904J095088
14332D6543872J567586K050101N11647K092110J585337J889611J473815K183762
14324E9897841K238918J506139K502639K500433K151224K309778K550516K857984
$$ plain form
14316 78515472 81847695 84646468 87913015 91069634 95168829 98563977 102730182 106591162
14308 106591162 111167142 115597452 120666963 125988018 131954598 137169005 143526305 149923202
14300 149923202 156986555 164228526 172034634 179901992 188732799 198016040 207335044 217964352
14292 217964352 228496223 239365172 251273264 263504235 276378036 289857557 303654863
14285 303654863 317625430 332120831 346623525 361581806 376343926 390936792 405320133
14278 405320133 418826653 431457580 443291824 453517789 462080400 468255385 471609860
14271 471609860 470711820 468006976 464703715 460687813 456368135 450898959 442091468 431879745
14263 431879745 420092196 406656410 392329130 377228731 361620677 345761525 330286471
$$ packed form
14316G8515472L332223K798773L266547L156619M099195L395148M166205L860980
14308A06591162M575980M430310N069511N321055N966580N214407O357300O396897
14300A49923202P063353P241971P806108P867358Q830807R283241R319004J0629308
14292B17964352J0531871J0868949J1908092J2230971J2873801J3479521J3797306
14285C03654863J3970567J4495401J4502694J4958281J4762120J4592866J4383341
14278D05320133J3506520J2630927J1834244J0225965Q562611O174985L354475
14271D71609860q98040k704844l303261m015902m319678n469176q807491j0211723
14263D31879745j1787549j3435786j4327280j5100399j5608054j5859152j5475054
$$ plain form
14256 330286471 315078323 300648039 286653023 272894279 259320571 246800306 234767666
14249 234767666 223492405 212285902 202116287 192331655 183289592 174691366 166581288
14242 166581288 158542274 151448119 144530366 138025585 132385182 126661534 120863560 116170711
14234 116170711 111336519 106501168 102336312 98566378 94785491 91083762 87069669 84126242
14226 84126242 80582580 77895710 75073557 72260966 69567498 67288207 65052373 63100154
14218 63100154 61117990 58565266 57236756 55243126 53520655 52338813 50712347 48865750
14210 48865750 47638910 45823434 44756571 44455308 42403727 41442635 40037857 38978310
14202 38978310 37940264 37256082 36347745 35334224 33808537 33116012 32429417 31534629 31164344
$$ packed form
14256C30286471j5208148j4430284j3995016j3758744j3573708j2520265j2032640
14249B34767666j1275261j1206503j0169615r784632r042063q598226q110078
14242A66581288q039014p094155o917753o504781n640403n723648n797974m692849
14234A16170711m834192m835351m164856l769934l780887l701729m014093k943427
14226H4126242l543662k686870k822153k812591k693468k279291k235834j952219
14218F3100154j982164k552724j328510j993630j722471j181842j626466j846597
14210D8865750j226840j815476j066863l01263k051581r61092j404778j059547
14202C8978310j038046o84182r08337j013521j525687o92525o86595q94788l70285
$$ plain form
14193 31164344 30234186 29411083 28593330 27880844 27183033 26570672 25984534 25510183 24675062
14184 24675062 24288233 23570629 23504952 22749480 22231914 21917903 21234585 21166511 20532681 19876989
14174 19876989 19966036 19177579 19279268 18446375 18282828 18072797 17515399 17360219 17219046
14165 17219046 16627537 16193200 15966410 15782529 15383920 14941355 14925338 14820975 14472541
14156 14472541 14227556 14083794 13833435 13411705 13156557 12806955 12697564 12681457 12119826
14147 12119826 12236610 12111599 11593912 11744537 11347302 11407831 11264703 11308035 11012305 10394289
14137 10394289 10390618 10116658 9850250 9981681 9954501 9762185 9445810 9452640 9304427 9268282
14127 9268282 9258557 8665206 8661504 8498351 8438416 8365382 8156082 8346782 7906800 7968755 7993269
$$ packed form
14193C1164344r30158q23103q17753p12486o97811o12361n86138m74351q35121
14184B4675062l86829p17604o5677p55472n17566l14011o83318o8074o33830o55692
14174A9876989Q9047p88457J01689q32893j63547k10031n57398j55180j41173
14165A7219046n91509m34337k26790j83881l98609m42565j6017j04363l48434
14156A4472541k44985j43762k50359m21730k55148l49602j09391j6107n61631
14147A2119826J16784j25011n17687J50625l97235O0529j43128M3332k95730o18016
14137A0394289l671k73960k66408J31431k7180j92316l16375O830j48213l6145
14127I268282r725n93351l702j63153n9935p3034k09300J90700m39982O1955K4514
$$ plain form
14116 7993269 7637109 7659316 7639705 7358892 7302536 7377724 7309784 7005454 7119402 6708153
14106 6708153 7200577 6520273 6580372 6478753 6142917 6523083 6389604 6220465 6115849 6253661
14096 6253661 5982030 6096414 5845554 5902491 5913786 5404157 5692104 5663873 5397317 5517245
14086 5517245 5352059 5311302 5376158 5213132 5309027 5243403 5010523 4773549 4925223 4507787
14076 4507787 4570882 4778014 4802371 4856884 4614005 4182654 4550167 4526590 4716568 4696870
14066 4696870 4309534 4297810 4661455 4332791 4067537 4014532 4129442 4221128 4364527 4518171
14056 4518171 4342537 4045237 4179983 4029853 3972089 3984889 3604264 3577634 4073655 3558820
14046 3558820 3459110 3315537 3681540 3441377 3467431 3345803 3155888 2959260 3555711 3054055
$$ packed form
14116G993269l56160K2207j9611k80813n6356P5188o7940l04330J13948m11249
14106F708153M92424o80304O0099j01619l35836L80166j33479j69139j04616J37812
14096F253661k71631J14384k50860N6937J1295n09629K87947k8231k66556J19928
14086E517245j65186m0757O4856j63026R5895o5624k32880k36974J51674m17436
14076D507787O3095K07132K4357N4513k42879m31351L67513k3577J89978j9698
14066D696870l87336j1724L63645l28664k65254n3005J14910R1686J43399J53644
14056D518171j75634k97300J34746j50130n7764J2800l80625k6630M96021n14835
14046C558820r9710j43573L66003k40163K6054j21628j89915j96628N96451n01656
$$ plain form
14036 3054055 3400108 3368710 3246936 3145684 3698986 3306708 3397793 3246688 3359469 3164708
14026 3164708 2869287 3067614 2707537 2538084 2865055 2793839 3081773 2646954 2630464 2753990
14016 2753990 3080635 2874166 2803444 2491328 2631288 2925027 2545382 2632542 2818966 2398415
14006 2398415 2650300 2264705 2000914 2267356 2065302 2318697 2299179 2411917 2161463 1924090
13996 1924090 2414870 2431329 2151382 2236755 2451636 2548747 3067422 3909658 5927679 14338148
13986 14338148 33716447 44172610 26685946 15040113 9252256 6452535 5060038
13979 5060038 4368220 3835265 3414062 3429794 3362151 3058670 2604549 2741171 2621361 2636194
13969 2636194 2946661 2225821 2016314 2489059 2177906 2443602 2054248 2097876 2232661 1979148
$$ packed form
14036C054055L46053l1398j21774j01252N53302l92278R1085j51105J12781j94761
14026C164708k95421J98327l60077j69453L26971p1216K87934m34819j6490J23526
14016B753990L26645k06469p0722l12116J39960K93739l79645Q7160J86424m20551
14006B398415K51885l85595k63791K66442k02054K53395j9518J12738k50454k37373
13996A924090M90780J6459k79947Q5373K14881R7111N18675Q42236K018021Q410469
13986A4338148J9378299J0456163j7486664j1645833n787857k799721j392497
13979E060038o91818n32955m21203J5732o7643l03481m54121J36622j19810J4833
13969B636194L10467p20840k09507M72745l11153K65696l89354M3628J34785k53513
$$ plain form
13959 1979148 2542975 2309705 2115284 2410783 2086874 2174987 2277138 2041354 2190003 1850039
13949 1850039 1709816 2202632 2218988 1761280 1838647 1894797 2109937 1646428 2190837 1934562
13939 1934562 1825001 1980671 1673089 1881940 1773031 1684269 2052457 1732268 1701683 1893602
13929 1893602 1728219 1866603 1392876 1517235 1567881 1628792 1840624 1632386 1885288 1595696
13919 1595696 1692511 1501209 1563149 1708795 1581731 1456230 1537480 1531410 1260807 1239752
13909 1239752 1744590 1746044 1406529 1490634 1457265 1545687 1647799 1334141 1528333 1386497
13899 1386497 1514004 1531717 884626 1541959 1628792 1441738 1348475 1443661 1206009 1180846
13889 1180846 1360239 1149109 1581141 1264044 1621314 1489670 1374000 1239729 1080311
$$ packed form
13959A979148N63827k33270j94421K95499l23909Q8113J02151k35784J48649l39964
13949A850039j40223M92816J6356m57708P7367N6150K15140m63509N44409k56275
13939A934562j09561J55670l07582K08851j08909q8762L68188l20189l0585J91919
13929A893602j65383J38384m73727J24359N0646O0911K11832k08238K52902k89592
13919A595696R6815j91302O1940J45646j27064j25501Q1250o070k70603k1055
13909A239752N04838J454l39515Q4105l3369Q8422J02112l13658J94192j41836
13899A386497J27507J7713o47091O57333Q6833j87054r3263R5186k37652k5163
13889A180846J79393k11130M32032l17097L57270j31644j15670j34271j59418
$$ plain form
13880 1080311 1105870 1204198 1148260 1440628 1089602 1006515 1120324 1306600 1379380 1488653
13870 1488653 803529 915090 1103393 1381070 1067695 1123859 1432737 920389 1356331 932318
13860 932318 1177630 997498 1272888 930663 1191250 880768 969138 1143611 1144044 1121682
13850 1121682 1385164 1158511 944335 1005954 1142504 1389374 1063065 1013470 957945 1223579
13840 1223579 953060 1074101 1153521 1056441 966148 859453 1055373 672990 812315 917411
13830 917411 633701 1081552 874662 736705 901576 809460 777358 891630 802630 793335
13820 793335 929232 1079684 921665 890853 1179846 774363 1344987 721177 1130837 892379
13810 892379 1023219 1016781 613999 728387 769921 403291 1029001 752144 824475 936242
$$ packed form
13880A080311K5559R8328n5938K92368l51026q3087J13809J86276P2780J09273
13870A488653o85124J11561J88303K77677l13375N6164L08878n12348M35942m24013
13860I32318K45312j80132K75390l42225K60587l10482Q8370J74473M33k2362
13850A121682K63482k26653k14176O1619J36550K46870l26309m9595n5525K65634
13840A223579k70519J21041P9420r7080r0293j06695J95920l82383J39325J05096
13830I17411k83710M47851k06890j37957J64871r2116l2102J14272q9000r295
13820G93335J35897J50452j58019l0812K88993m05483N70624o23810M09660k38458
13810H92379J30840o438m02782J14388M1534l66630O25710k76857P2331J11767
$$ plain form
13800 936242 928132 983412 764746 1039555 1021668 1074933 859003 962609 642028 1018218
13790 1018218 754862 904249 809053 648968 811368 1240938 727745 825380 1080362 933317
13780 933317 1020078 462510 720548 594943 816501 657407 942778 396730 1001864 599032
13770 599032 862802 846054 507102 631600 672379 765565 829000 671278 624770 718131 738646
13759 738646 609470 627310 679229 887731 560668 510079 723964 447284 373281 439013
13749 439013 492319 555079 441727 798762 503021 514035 708145 900164 628856 526578
13739 526578 803338 451316 878823 422279 447791 642865 581496 507805 396051 640881
13729 640881 716676 552877 449554 441685 672099 226057 340629 608717 545578 597181
$$ packed form
13800I36242q110N5280k18666K74809j7887N3265k15930J03606l20581L76190
13790A018218k63356J49387r5196j60085J62400M29570n13193R7635K54982j47045
13780I33317Q6761D62510K58038j25605K21558j59094K85371C96730O05134m02832
13770E99032K63770j6748l38952J24498M0779R3186O3435j57722m6508R3361K0515
13759G38646j29176J7840N1919K08502l27063n0589K13885k76680p4003O5732
13749D39013N3306O2760j13352L57035k95741J1014J94110J92019k71308j02278
13739E26578K76760l52022M27507D22279K5512J95074o1369p3691j11754K44830
13729F40881P5795j63799j03323p869K30414B26057J14572K68088o3139N1603
$$ plain form
13719 597181 660460 710019 142796 551904 415622 480738 848632 761059 474986 627322
13709 627322 517732 536987 612067 696405 322411 439501 640647 606152 496664 558350
13699 558350 440922 399087 58663 444552 99548 449444 382812 611029 628944 354810
13689 354810 777431 521312 630048 232289 301126 736996 696695 381716 526101 613257
13679 613257 452087 605392 647649 330936 600401 556333 390753 434146 531739 274633
13669 274633 366196 660788 769081 586437 215761 649574 891391 546590 526160 237400
13658 500721 387517 731881 338665 435728 274621 301086 340420 365723 655806 406676
13648 406676 923028 518253 516492 490543 -82819 516256 268702 494938 700937 708173 140950
$$ packed form
13719E97181O3279M9559A42796M09108j36282O5116L67894q7573k86073J52336
13709F27322j09590J9255P5080Q4338C22411J17090K01146l4495j09488O1686
13699E58350j17428m1835E8663L85889I9548L49896o6632K28217J7915k74134
13689C54810M22621k56119J08736B32289O8837M35870m0301l14979J44385Q7156
13679F13257j61170J53305M2257l16713K69465m4068j65580M3393R7593k57106
13669B74633R1563K94592J08293j82644B15761M33813K41817l44801k0430B37400
13658E00721j13204L44364C38665R7063j61107K6465L9334K5303K90083k49130
13648D06676N16352m04775j761k5949h2819E16256k47554K26236K05999P236A40950
$$ plain form
13636 200060 501282 485829 286286 412926 688904 378920 644067 460769 610460 495240
13626 495240 620278 424632 555155 461728 504266 232362 255310 658706 372206 553278
13616 553278 498364 646025 250187 449523 311293 309767 387716 374691 505628 376487
13606 376487 314461 206789 354244 413764 306446 381710 535674 222791 449958 461256
13596 461256 333792 429775 482018 194870 564150 344977 151862 533985 395463 77074
13585 381250 362387 91503 385959 236876 307382 391171 623562 583213 326438 503819
13575 503819 276524 368221 708993 608109 234600 322643 770071 520428 171779 524420
13565 524420 201252 272564 270265 466906 173854 81190 17174 96018 520483 460824 441838
$$ packed form
13636B00060L01222j5453j99543J26640K75978l09984K65147j83298J49691j15220
13626D95240J25038j95646J30523r3427M2538B32362K2948M03396k86500J81072
13616E53278n4914J47661B50187J99336j38230j526P7949j3025J30937j29141
13606C76487o2026j07672J47455N9520j07318P5264J53964B22791K27167J1298
13596D61256j27464R5983N2243A94870L69280k19173A51862L82123j38522G7074
13585C81250j8863I1503K94456j49083P0506Q3789K32391m0349k56775J77381
13575E03819k27295R1697L40772j00884B34600Q8043M47428k49643A71779L52641
13565E24420B01252P1312k299J96641A73854H1190A7174P8844M24465n9659j8986
$$ plain form
13554 441838 254609 211210 475520 225785 183685 351305 193229 389853 363266 592663
13544 592663 407823 315341 153908 472780 27894 283179 513258 249982 186589 106407
13534 106407 70351 119564 402456 89419 185209 84964 126515 475156 271888 200543 344364
13523 344364 127187 93534 41544 358541 185682 208658 359206 523051 284169 101997
13512 373432 299660 -9238 309152 194294 273575 32201 53864 387371 243467 374960 14776
13500 131732 -27847 671711 -40176 117270 284355 160260 301040 255903 143108 202913
13490 202913 -50261 -9608 261109 578592 506021 -27401 304627 329525 521553 81448 359164
13479 359164 335331 254856 417230 139796 367528 567234 495887 335661 -49287 132095
$$ packed form
13554D41838j87229m3399K64310B25785m2100J67620j58076J96624k6587K29397
13544E92663j84840r2482A53908L18872B7894K55285K30079B49982o3393q0182
13534A06407l6056M9213K82892H9419R5790H4964M1551L48641k03268p1345J43821
13523C44364A27187l3653D1544L16997j72859K2976J50548J63845k38882A01997
13512C73432p3772i238C09152j14858P9281C2201K1663L33507j43904J31493A4776
13500A31732b7847F71711d0176A17270J67085j24095J40780m5137j12795N9805
13490B02913e0261i608B61109L17483p2571b7401C04627K4898J92028H1448K77716
13479C59164k3833q0475J62374A39796K27732J99706p1347j60226d9287A32095
$$ plain form
13468 214399 371943 561454 96563 -69808 259770 19711 93573 224812 374859 264413
13458 264413 23265 87114 143537 340767 134906 191902 413574 274248 167013 327843
13448 327843 176344 815539 132278 167429 313742 146399 185795 -77121 447270 326747
13438 326747 569985 232101 167991 36627 250929 91313 190912 426633 64578 303744
13428 303744 87721 -236490 368878 187868 -150904 214095 116408 304097 79153 -82286
13417 271445 390594 282715 -38921 149684 188721 607815 77263 -36193 345562 -15618
13406 405719 447272 29447 122058 56661 14320 152620 217477 280559 -42605 183462 97240
13395 97240 94426 314267 145839 212010 215516 102380 46897 301904 79033 216692 133789
$$ packed form
13468B14399J57544J89511I6563f9808B59770A9711P3862J31239J50047j10446
13458B64413B3265O3849N6423J97230A34906N6996K21672j39326j07235J60830
13448C27843j51499O39195A32278L5151J46313A46399L9396g7121D47270j20523
13438C26747K43238B32101o4110C6627K14302I1313R9599K35721F4578K39166
13428C03744H7721b36490C68878j81010a50904B14095r7687J87689G9153h2286
13417B71445J19149j07879c8921A49684L9037M19094G7263c6193C45562a5618
13406D05719M1553B9447R2611E6661A4320J38300O4857O3082d2605A83462q6222
13395I7240k814K19841A45839O6171L506A02380D6897K55007G9033J37659q2903
$$ plain form
13384 133789 -96683 371320 -106764 467575 17586 196394 185657 -68768 450113 351702
13374 351702 471235 386175 286913 309561 100907 109313 298431 170447 242968 223103 398434
13363 398434 383299 101197 430877 332607 452182 107873 458079 386641 320072 249028
13353 249028 218312 211602 92677 508406 544671 186701 311547 262875 257466 243348 19059
13341 414416 478601 76158 317414 433089 171466 67016 513321 144864 254224 557582
13331 557582 197953 410133 11835 355314 95397 -54382 51297 165484 30282 56256 470756
13320 470756 260447 -105707 291037 384687 250523 286934 20181 384610 59417 133157
13310 133157 220177 -54275 -46892 256987 254272 61404 77018 102179 241108 177583 258135
$$ packed form
13384A33789i6683C71320a06764D67575A7586J78808j0737f8768D50113r8411
13374C51702J19533q5060r9262K2648A00907Q406J89118j27984P2521j9865J75331
13363C98434j5135A01197L29680r8270J19575A07873L50206p1438o6569p1044
13353B49028l0716o710I2677M15729L6265A86701J24846m8672n409j4118A9059
13341D14416O4185G6158K41256J15675A71466F7016M46305A44864J09360L03358
13331E57582A97953K12180A1835L43479I5397e4382E1297J14187C0282K5974M14500
13320D70756k10309a05707B91037R3650j34164L6411B0181L64429E9417P3740
13310A33157Q7020e4275P383B56987k715F1404J5614K5161J38929o3525Q0552
$$ plain form
13299 258135 -213396 -50830 -58129 375326 343371 -104367 162370 391129 206851 378714
13289 378714 -46208 114739 26972 150667 266573 239529 71320 -102952 -156702 -45246 244558
13277 24777 209591 206269 227175 98499 355321 175083 199744 -32065 119362 62879 231835
13266 231835 187163 178237 215135 86848 265824 266014 -5271 176833 76277 259499 9066 195448
13254 195448 48395 269591 37997 -216922 56676 199153 -155362 -18116 143210 68405
13243 616368 39020 182245 78778 121397 186910 56260 -170669 54606 326137 40639 409149
13232 409149 -86988 245599 -17764 68170 70983 -163295 79233 311202 -111180 200593 114384
13221 114384 98020 102257 204699 40187 66714 355197 -88095 -10721 -162324 -276410 -128900
$$ packed form
13299B58135b13396e0830p299C75326l1955a04367A62370K28759j84278J71863
13289C78714d6208A14739B6972J23695J15906k7044G1320a02952n3750d5246B44558
13277B4777J84814l322K0906I8499K56822A75083K4661c2065A19362n6483J68956
13266B31835m4672q926L6898H6848J78976J90e271A76833G6277J83222I066J86382
13254A95448D8395K21196C7997b16922E6676J42477a55362a8116A43210F8405
13243F16368C9020J43225G8778M2619O5513E6260a70669E4606K71531D0639L68510
13232D09149h6988B45599a7764F8170K813a63295G9233K31969a11180B00593q6209
13221A14384j6364M237J02442D0187K6527K88483h8095a0721j51603j14086a28900
$$ plain form
13209 508632 -334115 91924 238253 -45690 69368 26626 -34209 -171226 -226102 -97250 246009
13197 -139995 26698 57902 -95368 -178452 135391 208516 -148659 -193224 102179 68021 -67749
13185 63301 43672 290583 456379 74466 -256842 28315 -67720 232633 278643 192676 -71839
13173 190098 -243327 -225325 85863 100943 -104694 6601 117745 58083 393800 3471 41235
13162 41235 185424 180416 252391 177801 202212 158564 26635 104068 91188 50663 504829
13151 504829 -61513 582604 242408 107733 105980 -106086 -99016 83013 -75243 2465 235930
13140 235930 174886 206339 -16490 123721 392359 -75221 -152483 -19125 223214 387724 100408
13128 65228 298713 -193853 -99928 -68089 -27993 -24244 204939 -50152 76034 3546 215795
$$ packed form
13209E08632c34115I1924J46329d5690F9368B6626c4209j37017n4876i7250B46009
13197a39995B6698L1204i5368q3084A35391P3125a48659m4565A02179l4158f7749
13185F3301j9629K46911J65796G4466b56842B8315f7720B32633M6010q5967g1839
13173A90098b43327J8002H5863J5080a04694F601J11144E8083L35717C471L7764
13162D1235J44189n008P1975p4590K4411m3648B6635P7433j2880m0525M54166
13151E04829f1513E82604B42408A07733j753a06086P070H3013g5243B465K33465
13140B35930o1044L1453a6490A23721K68638g5221p7262a9125B23214J64510A00408
13128F5228K33485a93853R3925L1839b7993L749B04939e0152G6034C546K12249
$$ plain form
13117 215795 47857 -35764 381103 48849 -978 274289 8006 158549 118989 123602 41496 -309701
13104 153898 160096 -29056 32436 363814 -161806 51765 115172 201324 236664 317122 -22884
13092 327550 117811 74456 -26760 108713 132948 64664 -4535 -223817 -175301 48879 115728
13081 115728 170479 -149918 56783 166414 -28036 517203 174308 193107 261340 -47805 225077
13069 -69983 273692 199079 -163119 -156988 132139 240800 147364 -14195 290539 -79929 162414
13057 -110605 -33475 176404 -105630 -87305 204620 293407 277298 -406254 119352 181105
13047 181105 -228120 -83976 -6849 -351832 206506 -349950 387442 76072 186625 151217
13037 151217 -94914 56543 106994 -160648 28997 227182 336696 232192 149983 51459 -107428
$$ packed form
13117B15795D7857c5764C81103D8849i78B74289H006J50543l9560M613D1496c09701
13104A53898O198b9056C2436L31378a61806E1765O3407Q6152L5340Q0458b2884
13092C27550A17811m3355b6760A08713K4235F4664d535k19282M8516D8879O6849
13081A15728N4751a49918E6783J09631b8036E17203A74308J8799O8233d7805B25077
13069f9983B73692p4613a63119O131A32139J08661r3436a4195B90539g9929A62414
13057a10605c3475A76404a05630J8325B04620Q8787j6109d06254A19352O1753
13047A81105b28120h3976f849l44983B06506c49950C87442G6072J10553l5408
13037A51217i4914E6543N0451a60648B8997J98185J09514j04504q2209E1459a07428
$$ plain form
13025 73447 148686 353734 343609 125657 312663 29489 -116818 238560 -1637 121036 438412
13014 438412 -18258 -79079 81848 289220 678038 172216 -39411 182056 127543 -75968 143636
13002 72318 92009 33379 3407 88510 272549 92537 -208708 196706 71583 230851 32556
12990 83444 95334 51458 39496 69887 211722 49540 103557 -28298 49614 -170083 145536
12978 143622 105328 151531 138397 -150146 104188 1108 74862 128980 -135276 -51985 -137709
12967 -137709 41555 -24991 139004 36107 15734 -210533 16181 72691 -1829 211812 174947
12956 174947 266516 40106 -139341 -108317 69050 180595 242009 114663 -186639 175620
12945 -123314 185083 -79875 654 320306 310989 191919 -261924 -22051 110799 155335 96156
$$ packed form
13025G3447P5239K05048j0125A25657J87006B9489a16818B38560a637A21036L17376
13014D38412a8258o0821H1848K07372L88818A72216c9411A82056n4513g5968A43636
13002G2318J9691C3379C407Q5103J84039I2537b08708A96706G1583J59268C2556
12990H3444J1890m3876j1962L0391J41835D9540N4017b8298D9614a70083A45536
12978A43622l8294M6203j3134a50146A04188A108P3754N4118a35276e1985q5724
12967a37709D1555b4991A39004C6107A5734b10533A6181N6510a829B11812l6865
12956A74947R1569D0106a39341L1024F9050J11545O1414A14663a86639A75620
12945a23314A85083g9875F54L19652r317j19070b61924b2051A10799M4536n9179
$$ plain form
12934 96156 -4992 110750 268066 7268 -8370 245862 -66521 -32034 58284 -54305 -23978 38731
12921 -168048 35527 -5671 -51603 21967 -123899 -29178 199789 -128285 50133 -363775 4297
12909 -119834 -80448 -24904 12351 288337 -18992 135305 -154176 311872 58613 -186917
12898 -96340 46550 -170157 -182308 168962 -188150 -9357 -25928 359915 23041 31638 -234023
12886 76316 -63882 144814 -38160 136863 198617 145332 32634 -258550 202980 29294 254296
12875 254296 214165 376288 -39040 -195385 31496 -291951 17800 -32290 -8488 -174787 -15518
12863 310943 -338071 105876 -90967 -30191 97466 -131848 30536 76010 324134 -91909 48962
12851 72980 -28322 218752 46707 73923 -13169 59368 62104 307002 -58673 23275 -90015
$$ packed form
12934I6156d992A10750J57316G268h370B45862f6521c2034E8284e4305b3978C8731
12921a68048C5527e671m5932B1967a23899b9178A99789a28285E0133c63775D297
12909a19834L9386b4904A2351K75986a8992A35305a54176C11872E8613a86917
12898i6340D6550a70157j2151A68962a88150i357j6571C59915B3041Q597b34023
12886G6316f3882A44814c8160A36863O1754n3285C2634b58550B02980B9294K25002
12875B54296m0131J62123c9040j56345C1496b91951A7800c2290h488j66299a5518
12863C10943c38071A05876i0967c0191I7466a31848C0536M5474K48124i1909D8962
12851G2980b8322B18752D6707K7216a3169E9368K736K44898e8673B3275i0015
$$ plain form
12839 -219908 -95177 60724 -364 138996 1908 257623 181061 241349 -39077 -180986 229233
12827 33634 -2053 -12419 -65187 9070 8143 -94639 -162293 42955 404972 329142 -34420 -147365
12815 -147365 -89336 -162663 -136272 -134613 26977 -401169 1067 18567 -174384 -85082 205153
12803 66966 -228352 102633 133814 108830 138573 -284836 18926 34017 -106748 40152 -15101
12791 65013 -74200 -205732 223524 -176778 -22937 -14332 -13955 240096 -277592 -18929 -35525
12780 -35525 30880 -1913 -126598 409850 41670 33802 -54224 27951 308612 -29287 -89152
12769 -89152 370640 -129740 -131305 -390196 -36294 -96658 -144231 20039 114993 -105025 155153
12757 -111156 -72957 -6749 -214141 -43018 -125287 -102386 -229177 45090 -40329 -16453 -118466
$$ packed form
12839b19908i5177F0724c64A38996A908K55715p6562O0288c9077j41909B29233
12827C3634b053j0366n2768I070r27i4639o7654D2955L62017p5830c4420j12945
12815a47365N8029p3327K6391J659B6977d01169A067J7500a74384h5082B05153
12803F6966b28352A02633L1181k4984K9743b84836A8926J5091a06748D0152a5101
12791F5013g4200j31532B23524a76778b2937Q605L77B40096b77592a8929j6596
12780c5525C0880a913j24685D09850D1670p868e4224B7951K80661b9287n9865
12769h9152C70640a29740j565k58891c6294o0364m7573B0039R4954a05025A55153
12757a11156L8199f749k07392d3018q2269K2901j26791D5090d0329a6453j02013
$$ plain form
12746 -118466 261515 -89376 -34556 377622 125271 6650 -153539 -251264 58441 301619 106342
12734 295523 -72285 27290 -126554 -48358 -165009 220234 306835 117196 -543233 -541 -1706
12723 -1706 58021 97501 97672 13059 19145 58569 -183009 -118929 -69057 108240 186888 236317
12711 236317 -167723 205166 164103 374142 244009 519396 327667 109821 -61638 165558
12700 270119 1665 103523 -169144 163248 108671 80950 114087 -85054 -287494 154337 12181
12688 -36908 162996 190566 -40949 222374 -128009 -88214 51245 126384 273933 53988 182929
12677 182929 255672 143055 9844 -281996 171945 180539 7483 -194662 23344 -64687 -79415
12666 -79415 28682 311758 49125 99642 260583 48654 -3646 374985 176450 -108472 208515
$$ packed form
12746a18466B61515h9376c4556C77622A25271F650a53539r7725E8441K43178A06342
12734B95523g2285B7290a26554d8358j16651B20234Q6601A17196e43233e41j165
12723a706E8021L9480J71A3059O086L9424a83009O4080M9872A08240P8648M9429
12711B36317a67723B05166m1063K10039j30133K75387j91729A09821f1638A65558
12700B70119A665J01858a69144A63248n4577k7721L3137h5054k02440A54337A2181
12688c6908A62996K7570d0949B22374a28009L9795E1245P5139J47549E3988J28941
12677A82929P2743j12617I844b81996A71945Q594G483a94662B3344f4687j4728
12666g9415B8682K83076D9125N0517J60941D8654c646C74985A76450a08472B08515
$$ plain form
12654 322345 -76673 -176640 311503 39066 296400 192726 91423 176790 -104158 286626
12643 -201815 -210129 -76052 -2632 52355 331710 138335 -212396 228343 114803 146230 499254
12632 499254 29145 338009 215746 261257 461384 23861 231999 334898 298491 225161
12622 225161 132938 219320 130887 183242 45136 41337 -152957 -126788 175936 142618 -261358
12610 156132 164669 172311 -234155 14225 -123199 44522 -120018 132056 -299614 -131075 -24928
12598 31667 224426 330004 226519 -278662 48431 -81176 371811 60878 297522 144618
12587 135191 -29032 -97254 16915 -136412 -15966 128356 160364 -70093 39381 -39117 -363280
12576 -363280 -33088 90203 -36231 9945 213545 65559 147812 27554 -302464 -63957 -145661
$$ packed form
12654C22345g6673r9967C11503C9066K57334j03674I1423Q5367a04158B86626
12643b01815q314g6052b632E2355K79355A38335b12396B28343j13540L1427L53024
12632D99254B9145L08864j22263M5511K00127B3861K08138J02899l6407p3330
12622B25161r2223Q6382q8433N2355D5136l799a52957K6169A75936l3318b61358
12610A56132Q537P642b34155A4225a23199D4522a20018A32056b99614a31075b4928
12598C1667J92759J05578j03485b78662D8431h1176C71811F0878K36644A44618
12587A35191b9032o8222A6915a36412a5966A28356L2008g0093C9381c9117l24163
12576c63280c3088I0203c6231I945K03600F5559Q2253B7554c02464f3957q1704
$$ plain form
12565 -145661 85383 -134644 71721 -22568 88676 367524 205417 -8167 318487 84295 151046
12554 151046 88605 -36000 390372 -52189 -57914 28437 115033 173189 -19909 90744 175035
12543 175035 -43902 -70736 282185 78442 83262 159920 -74323 61040 -123533 126706 -16950
12531 -226152 -104732 349826 -81012 -173841 -326673 -128324 32738 -89903 -75792 256180
12520 338688 -104238 -370841 178833 38390 -148575 -6498 -171936 -69616 25449 -246687
12509 -92576 -230524 143465 325799 -59569 43938 -122345 251480 125123 -77361 -22849
12498 -119612 -155641 -340313 161461 311466 -84700 -136369 116439 -33655 154041 203174
12488 203174 66990 -46349 31028 -45066 135378 -211796 231642 168360 -145916 166082
$$ packed form
12565a45661H5383a34644G1721b2568H8676K78848j62107h167C18487H4295O6751
12554A51046o2441c6000C90372e2189n725B8437Q6596N8156a9909I0744Q4291
12543A75035d3902k6834B82185G8442M820P6658g4323F1040a23533A26706a6950
12531b26152a04732C49826h1012r2829j52832a28324C2738h9903J4111B56180
12520C38688a04238k66603A78833C8390a48575f498j65438f9616B5449b46687
12509i2576j37948A43465J82334e9569D3938a22345B51480A25123g7361b2849
12498a19612l6029j84672A61461J50005h4700n1669A16439c3655A54041M9133
12488B03174F6990d6349C1028d5066A35378b11796B31642o3282a45916A66082
$$ plain form
12477 188186 -247834 -129169 247506 15960 219283 354570 104643 -42478 -165166 188584
12466 38492 5945 64292 -102559 -416331 -544808 -277991 -93723 131886 -199631 -173380 60907
12454 -199950 -32537 -168322 -51777 26482 70579 -135124 202875 170890 -21963 -299292 231634
12442 -139380 -176087 -103896 -503210 92936 234662 49443 3294 57035 14116 -348840 176492
12430 -148663 36046 31518 -4757 113319 -102304 89801 -54695 -312218 -141299 231744 -227004
12418 -18067 109706 99368 -15887 232634 253936 -89080 104008 188162 -224227 -197513 -110721
12407 -110721 -208051 95202 -137150 -65198 -113983 -165207 64493 75238 66329 1829 -127467
12395 106174 86613 -106669 332178 165069 -127282 -18432 -120236 72379 -96749 -58781
$$ packed form
12477A88186b47834J18665B47506A5960K03323J35287A04643d2478j22688A88584
12466C8492E945N8347a02559l13772j28477K66817i3723A31886a99631K6251F0907
12454a99950c2537j35785e1777B6482M4097a35124B02875l1985b1963k77329B31634
12442a39380l6707P2191l99314I2936J41726D9443C294N3741A4116c48840A76492
12430a48663C6046m528d757A13319a02304H9801e4695k57523a41299B31744b27004
12418a8067A09706j0338a5887B32634K1302h9080A04008Q4154b24227K6714Q6792
12407a10721r7330I5202a37150f5198m8785n1224F4493J0745q909A829a27467
12395A06174j9561a06669C32178A65069a27282a8432j01804G2379i6749L7968
$$ plain form
12385 -58781 -60432 239798 -267631 249043 -78078 296278 392842 38140 23530 -162590 -19753
12373 -5217 -48473 48694 183439 82728 -209940 -144037 202339 177781 87952 285861 236485
12362 236485 97986 -85687 -107644 -178084 -126738 24813 -160662 -159611 309211 -29884 147159
12350 -73523 -49434 -366889 471400 276807 -91570 392524 -21931 -238599 267633 121250
12339 28930 162782 37944 287940 -310631 -129262 -13576 49785 -129324 77190 -194228
12328 288006 10909 224290 -134539 300210 -39129 10082 -234926 -157029 -306901 65348
12317 -347751 -47431 12329 -164418 -80642 162971 182311 -27887 -79718 73916 116051 82990
12306 82990 163873 -110233 -115642 -133078 -324959 116901 188 115730 -39880 173363 264610
$$ packed form
12385e8781j651B39798b67631B49043g8078B96278R6564C8140j4610a62590a9753
12373e217m3256D8694J34745H2728b09940O5903B02339k4558H7952J97909m9376
12362B36485I7986h5687k1957p0440N1346B4813a60662J051C09211b9884A47159
12350g3523K4089l17455D71400j94593i1570C92524b1931k16668B67633A21250
12339B8930J33852C7944K49996c10631a29262a3576D9785a29324G7190a94228
12328B88006A0909K13381a34539C00210c9129A0082b34926P7897j49872F5348
12317c47751d7431A2329a64418h0642A62971J9340b7887n1831G3916M2135l3061
12306H2990Q0883a10233n409j7436j91881A16901A88J15542c9880A73363R1247
$$ plain form
12295 264610 -112628 225087 153637 -31362 106999 34435 124658 140031 -36744 27579 57834
12284 57834 47685 278050 -186595 -339164 150576 -259373 88605 97485 113321 262971 330738
12273 330738 201140 22858 311101 123437 -21768 299296 -39828 -165612 -32127 201708
12262 133559 323942 143834 87355 44240 -188530 103146 267503 -21549 103008 -27538
12251 -120767 -503058 -38089 27417 488599 260660 446747 62202 216249 -20328 271730
12240 -44134 71407 -58455 73353 1032 200383 324681 153601 986 465990 197325 -52615
12228 372766 498627 155893 404761 83703 211322 77459 295998 274130 -6081 404795
12217 437551 79488 142355 103439 -3980 100060 -226404 121461 249471 -109886 104761
$$ packed form
12295B64610a12628B25087p1450c1362A06999C4435R0223J5373c6744B7579L0255
12284E7834j0149K30365a86595j52569A50576b59373H8605Q880J5836J49650O7767
12273C30738j29598B2858K88243A23437b1768B99296c9828j25784c2127B01708
12262A33559J90383A43834n6479m3115a88530A03146J64357b1549A03008b7538
12251a20767l82291c8089B7417M61182k27939J86087F2202J54047b0328B71730
12240d4134G1407e8455G3353A032J99351J24298A53601I86M65004A97325e2615
12228C72766J25861A55893K48868H3703J27619G7459K18539k1868f081D04795
12217D37551G9488O2867l8916c980A00060b26404A21461J28010a09886A04761
$$ plain form
12206 327052 128844 8135 51834 319922 251938 51653 -44534 351548 -8176 294181 348777
12195 348777 101581 264565 206179 274870 55550 378430 28978 154139 29503 -48835 -69810
12184 -69810 612880 281895 -10286 247551 63502 57253 130815 81001 -158465 31273 271904
12173 271904 -139942 -48331 -121569 580116 153651 -65324 -97532 55993 330474 -120276
12162 89590 186182 -175698 -200367 140875 59510 96100 137156 15334 -28574 -78641 86502
12150 -42888 -50952 -70084 435057 -194949 233408 -29207 -6811 123789 -76232 32908 -79779
12138 -259708 -72938 22888 -191773 180723 43056 -44069 252417 262191 -48224 -138015 138664
12126 -372969 239063 270020 49279 213499 -166045 39508 -3857 47119 -34582 66879 -11743
$$ packed form
12206C27052A28844H135M3699K68088o7984E1653d4534C51548h176B94181N4596
12195C48777A01581J62984n8386O8691E5550L22880B8978J25161B9503d8835k0975
12184f9810F12880B81895a0286B47551F3502o249P3562m9814a58465C1273K40631
12173B71904a39942d8331p3238E80116A53651f5324l2208E5993K74481a20276
12162H9590R6592a75698k4669A40875E9510L6590M1056A5334b8574n0067H6502
12150d2888q064j9132D35057a94949B33408b9207f811A23789g6232C2908g9779
12138b59708g2938B2888a91773A80723D3056d4069B52417R774d8224q9791A38664
12126c72969B39063L0957D9279J64220a66045C9508c857D7119c4582F6879a1743
$$ plain form
12114 20012 147352 265306 -219626 -268160 -295241 180339 -34530 -310124 151367 34075
12103 310306 30274 47982 -143469 146778 -33548 -192526 93398 -199755 229046 250713
12093 250713 265212 -6651 124422 -140395 267480 98994 32938 -191158 20606 -118364 138588
12081 58523 169878 -13553 197702 751452 1532872 1270902 338369 375540 15835 -134440
12070 94024 -13356 95077 -5231 -124918 -120655 204411 255659 -128099 114957 86915 25972
12058 -154784 -18284 -125273 234056 104977 251130 39071 30074 153975 286327 16811
12047 45638 -77944 -72102 -144551 -191480 191657 313662 -39783 89935 4764 -497632 -131741
12035 195432 -318709 22176 59908 61 -125297 -434961 -212149 -74415 -233743 -171464 -249321
$$ packed form
12114B0012J27340J17954b19626m8534k7081A80339c4530k75594A51367C4075
12103C10306C0274J7708a43469A46778c3548j58978I3398a99755B29046K1667
12093B50713J4499f651A24422a40395B67480I8994C2938a91158B0606a18364A38588
12081E8523J11355a3553A97702N53750P81420k61970C38369L7171A5835a34440
12070I4024a3356I5077e231j19687M263B04411N1248a28099A14957k8042B5972
12058a54784a8284j06989B34056A04977J46153C9071q997J23901J32352A6811
12047D5638g7944N842p2449m6929A91657J22005c9783H9935D764d97632a31741
12035A95432c18709B2176L7732F1a25297l09664b12149g4415j59328O2279p7857
$$ plain form
12024 -249321 124736 94817 54197 158877 30640 65563 295712 372544 -2673 215728 244757
12013 244757 69385 122358 -80590 -115709 -3676 212455 63660 121111 152005 -151331 64168
12001 136980 -298021 102461 -494853 -299109 -185317 68289 37765 -238253 -194278 -100370
11991 -100370 -133358 62768 -201064 -160281 -67762 82721 -234940 -328392 -67726 -92431 -118588
11980 -118588 279005 -32737 -190746 -13949 -171511 -309983 288119 -24499 223931 -135290
11969 -90311 -348801 449973 67294 58169 -27944 -140844 -4926 -284532 -68176 9660 -171315
11957 -29944 273028 92136 -11770 -27423 -117460 -245420 -4922 45552 -78002 -49463 -29956
11946 -29956 84377 16712 -413503 148017 -306158 299674 251566 -362972 132773 41551
$$ packed form
12024b49321A24736k9919m0620J04680C0640L4923K30149P6832b673B15728K9029
12013B44757F9385N2973h0590l5119c676B12455F3660N7451L0894a51331F4168
12001A36980b98021A02461d94853J95744J13792F8289l0524b38253M3975R3908
11991a00370l2988F2768b01064M0783f7762H2721b34940r3452f7726k4705k6157
11980a18588B79005c2737j58009a3949j57562j38472B88119b4499B23931a35290
11969i0311k58490D49973F7294r125b7944j12900d926k79606f8176I660a71315
11957b9944B73028I2136a1770j5653r0037j27960d922D5552g8002K8539J9507
11946b9956H4377A6712d13503A48017c06158B99674m8108c62972A32773D1551
$$ plain form
11935 141503 57994 99143 260324 39581 -6628 -63460 -234866 -161086 -25875 -3023 -347238
11924 -347238 -92392 -96866 216441 244270 -241465 174152 57968 -128204 91844 131594 173329
11913 173329 -261816 228647 -221699 -226932 87154 -48301 208916 16988 -341103 92988 154203
11902 154203 -20276 57186 -77339 -74159 -93641 -27242 8637 -116150 148380 21942 -126809
11890 -23902 -174469 121117 -191412 277979 -24512 -60293 94994 -103841 -13687 99737 56550
11879 56550 -35850 2161 -334066 -166398 393259 -58685 -77875 -27851 -74276 -319466 -107373
11867 -134633 102811 -347153 -53480 -105595 -101695 171409 -310393 59760 -44618 -33440 117236
11855 -494234 99863 179259 -21336 25799 -189013 -293274 29857 -281372 -160184 -200319 -262418
$$ packed form
11935A41503E7994M1149J61181C9581f628n6832j71406P3780b5875c023l44215
11924c47238i2392m474B16441K7829b41465A74152E7968a28204I1844L9750M1735
11913A73329b61816B28647b21699n233H7154d8301B08916A6988c41103I2988O1215
11902A54203b0276E7186g7339L180j9482b7242H637a16150A48380B1942a26809
11890b3902j50567A21117a91412B77979b4512l5781I4994a03841a3687I9737m3187
11879E6550c5850B161c34066a66398C93259e8685j9190b7851m6425k45190a07373
11867a34633A02811c47153e3480n2115L900A71409c10393E9760d4618J1178A17236
11855d94234I9863P9396b1336B5799a89013j04261B9857b81372J21188m0135o2099
$$ plain form
11844 -262418 49740 -236857 151749 -126920 206809 107736 36886 -74716 66048 -93020 193044
11832 -56864 4767 5318 -243128 -188886 -71952 -118645 -155407 -260357 157412 -344888 100562
11820 -139123 -182429 -53143 -87756 54935 -160509 -153216 158189 -15399 74082 -109643 39752
11808 -19274 190378 27534 -228059 95987 -253299 -26593 -51270 -212173 -261149 -141958 294079
11796 95169 -184309 -138113 -84365 -50538 -344991 -224075 151921 134260 47688 17051 102522
11785 102522 -71246 230885 165729 208231 37872 115082 588671 -136885 70710 187466 257446
11774 257446 -80252 104689 -155035 142586 182952 -228741 -189671 -400732 -67829 103755
11763 161785 -63101 -67504 86838 214156 -170922 -19659 155295 515907 -121382 -34915 -6348
$$ packed form
11844b62418D9740b36857A51749a26920B06809r9073C6886g4716F6048i3020A93044
11832e6864D767N51b43128N4242g1952m6693l6762j04950A57412c44888A00562
11820a39123m3306e3143l4613E4935a60509P293A58189a5399G4082a09643C9752
11808a9274A90378B7534b28059I5987b53299b6593k4677j60903m8976J19191B94079
11796I5169a84309M6196N3748L3827k94453J20916A51921j7661D7688A7051Q5471
11785A02522g1246B30885o5156M2502C7872P7210M73589a36885G0710J16756O9980
11774B57446h0252A04689a55035A42586M0366b28741L9070k11061f7829A03755
11763A61785f3101m403H6838J27318a70922a9659A55295L60612a21382c4915f348
$$ plain form
11751 -90425 -130784 -211587 -134199 153932 -123244 43086 -207713 -21652 50762 132121 -74728
11739 220542 117720 24110 -162848 193392 -66660 55927 313202 -188519 89688 -214960
11728 158512 -52905 -198378 9129 251381 -47121 44839 186562 19964 279786 58892 144778
11717 144778 124465 124320 -68475 -33587 106594 202572 -120990 -58609 -100778 140554 174566
11706 174566 10759 -296981 135825 13181 359530 -234990 -186575 130758 -130563 -102680
11696 -102680 420080 42207 -266824 11073 38779 -393080 -72277 -24231 -101315 38324 255580
11685 255580 -71774 190141 -102590 137327 -241013 284823 320564 -133558 -141706 4903 45597
11674 45597 119571 -94019 288789 -138690 -416829 -381161 -252734 -240222 -122428 218555
$$ packed form
11751i0425m0359q0803P7388A53932a23244D3086b07713b1652E0762Q1359g4728
11739B20542j02822B4110a62848A93392f6660E5927K57275a88519H9688b14960
11728A58512e2905j45473I129K42252d7121D4839J41723A9964K59822E8892Q5886
11717A44778k0313j45f8475c3587A06594R5978a20990e8609m2169A40554L4012
11706A74566A0759b96981A35825A3181L46349b34990M8415A30758a30563K7883
11696a02680D20080D2207b66824A1073K7706c93080g2277b4231p7084C8324K17256
11685B55580g1774A90141a02590A37327b41013B84823L5741a33558q148D903M0694
11674D5597P3974i4019B88789a38690k78139L5668J28427J2512J17794B18555
$$ plain form
11663 -468328 -7570 331632 83497 -97726 279344 425362 52364 59577 157882 -24445 -94547
11652 -94547 -5444 -401111 -177534 -205231 47728 57915 -98531 -139700 224937 -142 63848 -57308
11639 -30390 55412 94197 34557 -376322 122922 255244 10511 -19057 -184259 99478 360990
11628 360990 216242 87380 217262 89340 186939 -222591 -41412 170307 -217449 22750
11617 124068 120487 -49010 113940 83765 259319 -233126 -428978 646520 -67097 201726
11606 124440 197323 -69887 -219726 -205442 233192 -246112 301677 45928 -136149 122037
11595 -79499 157964 75521 -2885 -58126 -21422 213697 382768 -153779 -138794 146493 78141
11584 78141 414553 123355 132621 74582 -75624 26503 2553 -9372 -175147 -84980 -149948 -118960
$$ packed form
11663d68328g570C31632H3497i7726B79344J46018E2364P213R8305b4445p0102
11652i4547e444l95667a77534k7697D7728J0187i8531m1169B24937a42F3848e7308
11639c0390E5412L8785C4557c76322A22922J32322A0511a9057j65202I9478K61512
11628C60990j44748H7380J29882H9340R7599b22591d1412A70307b17449B2750
11617A24068l581d9010A13940l0175J75554b33126j95852F46520f7097B01726
11606A24440P2883f9887j49839J4284B33192b46112C01677D5928a36149A22037
11595g9499A57964G5521b885n5241b1422B13697J69071a53779J4985A46493o8352
11584G8141L36412A23355R266n8039g5624B6503B553i372j65775h4980o4968L0988
$$ plain form
11572 -118960 -61235 -195951 -75177 189033 18516 -222568 -88425 50653 863 386351 181056
11560 177837 -76486 36377 70924 186279 18227 -391569 -307535 -32368 145201 -84284 -195701
11549 -195701 -306863 -13904 -126953 185742 98904 266074 208020 63346 -5666 193322 242566
11538 242566 547605 272555 -166019 -92669 110658 161690 -102005 158210 -125841 86019
11527 -162310 234144 8066 161962 -385068 655323 171254 28992 67951 63055 300959 53235
11515 213353 359390 115816 23686 91228 143183 341778 186646 -47221 -215818 -76258
11504 -71285 211013 77738 203513 273910 -101125 153381 272477 90588 -136161 -219810
11494 -219810 -87542 -184330 127883 -47303 -74362 213764 163861 -54450 133764 74082 -194601
$$ packed form
11572a18960N7725j34716g5177A89033A8516b22568h8425E0653H63L85488A81056
11560A77837g6486C6377L4547J15355A8227c91569Q4034c2368A45201h4284j11417
11549a95701j11162a3904j13049A85742q6838J67170n8054F3346e666A93322M9244
11538B42566L05039B72555a66019P3350A10658N1032a02005A58210a25841H6019
11527a62310B34144H066J53896c85068F55323A71254B8992L8959m896K37904E3235
11515B13353J46037A15816B3686O7542N1955J98595j55132d7221j68597g6258
11504g1285B11013G7738J25775P0397a01125A53381J19096I0588a36161q3649
11494b19810h7542r6788A27883d7303k7059B13764m9903e4450A33764n9682a94601
$$ plain form
11482 -14114 10911 46165 -136749 268504 158326 -152573 -15283 124541 -18374 289874
11471 157487 237278 -23243 -76995 -120059 342068 -55834 209977 202678 194748 243128 186807
11460 186807 79557 7702 29249 307400 79703 -97234 227886 216804 134233 361409 -14201
11448 91940 -77931 32833 179977 -2879 366221 125377 425569 -67663 118894 10334 309627
11437 309627 156754 124194 -293111 105429 -152767 -304010 -313888 -141737 -41819 -208461
11427 -208461 -203840 142580 -209901 214246 -83741 -333543 198686 -369086 115189 12587
11416 -5372 -114566 -133153 116889 303793 9791 184831 -203511 -42539 -34414 -262054 -53257
11404 104926 -81964 382828 -87369 -63141 124400 -132005 34898 -324959 161290 612072
$$ packed form
11482a4114A0911L5254a36749B68504j10178a52573a5283A24541a8374B89874
11471A57487P9791b3243n3752m3064C42068e5834B09977p299p930M8380n6321
11460A86807G9557G702K1547K78151G9703i7234B27886j1082q2571K27176a4201
11448I1940g7931C2833J47144b879C66221A25377L00192f7663A18894A0334K99293
11437C09627j52873l2560b93111A05429a52767j51243r878a41737d1819j66642
11427b08461M621A42580b09901B14246h3741k49802A98686c69086A15189A2587
11416e372j09194j8587A16889J86904I791J75040b03511d2539Q125k27640e3257
11404A04926h1964C82828h7369K4228A24400a32005C4898c24959A61290M50782
$$ plain form
11394 612072 164718 -122225 53498 -291892 281718 -65763 5560 -287313 17390 -158792
11383 50030 59038 -299343 263533 91986 201690 45460 43243 -123602 -421086 104093 222998
11372 222998 -186429 286448 -143046 -176927 -322036 217175 83432 -17900 45003 247368
11362 247368 -39315 26999 -158918 168279 75393 -116326 -154630 51521 120767 11718 89698
11351 89698 164235 -147309 40765 -38037 -31583 -7856 -143493 -192468 235569 71372 -40752
11339 60148 124611 50447 -159784 -37594 63501 -216315 -116891 -115451 -194023 216382 -409221
11327 332386 -384568 713 11941 -41869 220953 44191 -322064 -122938 -12891 193795 -119299
11315 -259394 -86118 115949 -260634 83203 -101846 -111120 53395 -391785 -473539 -309621 -290801
$$ packed form
11394F12072A64718a22225E3498b91892B81718f5763E560b87313A7390a58792
11383E0030R008b99343B63533I1986J09704D5460k217a23602k97484A04093J18905
11372B22998a86429B86448a43046l3881j45109B17175H3432a7900D5003K02365
11362B47368c9315B6999a58918A68279G5393a16326l8304E1521O9246A1718P7980
11351H9698P4537a47309D0765c8037O454g856j35637m8975B35569G1372d0752
11339F0148O4463E0447a59784c7594F3501b16315R9424J440p8572B16382d09221
11327C32386c84568G13J1228d1869B20953D4191c22064a22938a2891A93795a19299
11315b59394h6118A15949b60634H3203a01846r274E3395c91785q1754J63918J8820
$$ plain form
11304 -290801 -362720 -456948 113743 -3659 129803 -125187 240108 -184471 -50424 -77288 46356
11292 -61454 53978 19267 76981 -198775 234452 -75485 102186 1273 -105917 -247832 -213164
11281 -213164 133956 119500 -69605 -48578 -42221 -8427 -151977 -210554 134401 -250553 115944
11269 -23990 -69776 13582 26816 58035 -169563 -91419 184826 6181 -54837 41924 -72831
11257 102629 -90257 9629 278575 -573521 -86033 -306988 -18556 70501 -332342 16596 -251505
11245 -225333 178296 22834 11863 23597 5200 203415 196409 -21002 -22002 191785 -220291
11233 171857 -29315 -8974 -68089 55118 -289043 -49793 133895 5789 135841 77 -132716 234963
11220 43241 -167482 57449 182012 76261 11984 -228096 -135167 226498 -18516 -163104 248693
$$ packed form
11304b90801p1919r4228A13743c659A29803a25187B40108a84471e0424k6864D6356
11292f1454E3978A9267N7714a98775B34452g5485A02186A273a05917j41915L4668
11281b13164A33956j4456f9605K1027O357h427j43550n8577A34401b50553A15944
11269b3990m5786A3582J3234L1219a69563P8144A84826F181e4837D1924g2831
11257A02629i0257I629K68946e73521h6033k20955a8556G0501c32342A6596b51505
11245b25333A78296B2834j0971J1734E200J98215p006b1002j000A91785b20291
11233A71857b9315h974n9115E5118b89043d9793A33895E789J30052G7a32716B34963
11220D3241a67482E7449J24563G6261A1984b28096R2929B26498a8516j44588B48693
$$ plain form
11208 -194559 141958 19168 14680 77402 -168008 -287987 -467489 -1401 251052 247704 14239
11196 -53337 -93589 -74687 33408 -157980 -384889 -168266 -40507 198184 -218645 -149289 -18606
11184 302862 353787 129267 -31397 99528 -46687 156181 95837 -248399 -162113 -63686 -238130
11173 -238130 -9239 29674 22874 -133841 -120638 -267502 100239 117836 131798 65595 175232
11162 175232 159707 -136943 -271690 -34449 -237116 -16394 188587 114347 67024 83501 72432
11151 72432 67080 77854 63437 71303 246122 -512417 231676 21904 58580 90440 60106
11140 60106 -103875 108980 -359078 -111894 -23157 280638 -26180 87295 -90520 132870
11129 77220 -74330 -403749 -33320 239440 -310587 271052 311523 7554 409651 -95079 -236104
$$ packed form
11208a94559A41958A9168m488O2722a68008j19979j79502a401B51052l348A4239
11196e3337m0252J8902C3408a57980k26909a68266d0507A98184b18645O9356a8606
11184C02862N0925A29267c1397I9528d6687A56181o0344b48399Q6286f3686j74444
11173b38130i239B9674o800a33841J3203j46864A00239J7597J3962F5595J09637
11162A75232j5525a36943j34747c4449k02667a6394A88587p4240m7323J6477j1069
11151G2432n352J0774j4417P866J74819e12417B31676B1904L6676L1860l0334
11140F0106a03875A08980c59078a11894b3157B80638b6180H7295i0520A32870
11129G7220g4330l29419c3320B39440c10587B71052M0471G554M02097i5079j41025
$$ plain form
11118 -236104 13570 -77535 -20214 150435 -5697 93016 -100769 204359 -229709 -226097 97678
11106 96555 205394 256501 -25624 42761 334339 196605 -66703 284524 561728 115505
11095 241464 544038 82508 211187 285457 116814 139117 127649 323989 138776 244818
11085 244818 163994 10812 297823 -180130 295286 272107 200756 91565 100160 333781 115920
11073 188193 26938 302381 73799 364709 395314 476350 297351 355243 358409 260143 240791
11062 240791 295395 731239 311466 303874 570953 533209 507234 449499 571425 703044 1126145
11051 1126145 640221 837952 844548 720842 651670 673961 648649 675827 687423 902574 683302
11040 683302 469534 712883 435758 404304 692084 506204 769123 603955 534850 693519
$$ packed form
11118b36104A3570g7535b0214A50435e697I3016a00769B04359b29709L612I7678
11106I6555J08839N1107b5624D2761K91578j37734f6703B84524K77204A15505
11095B41464L02574H2508J28679P4270A16814K2303j1468J96340A38776J06042
11085B44818q0824A0812K87011a80130B95286k3179p1351I1565Q595K33621A15920
11073A88193B6938K75443G3799K90910L0605Q1036j78999N7892L166r8266j9352
11062B40791N4604M35844C11466p592K67079l7744k5975n7735J21926J31619M23101
11051A126145m85924J97731O596j23706o9172K2291k5312K7178J1596K15151k19272
11040F83302k13768K43349k77125l1454K87780j85880K62919j65168o9105J58669
$$ plain form
11030 693519 882193 467747 749580 664387 632822 814190 647524 745172 386803 425233
11020 425233 547359 314718 642526 541292 654449 575271 664779 586280 729006 333909
11009 306029 78798 1014345 336725 502005 316978 825870 654807 355575 527494 584039
10999 584039 588063 690339 641656 689927 633934 670063 654331 676140 681301 283767 484577
10988 484577 679511 1104326 771480 931967 1035270 832332 1031647 913784 1325138 1396177
10978 1396177 1225592 1546600 1825629 1669916 2618401 2524985 3031031 2543589 2534459 2376672
10968 2376672 1900004 1961270 1797770 1574523 1382106 1564672 1486376 1085274 1460566 1361703
10958 1361703 1952372 2055457 1885041 1381374 1457180 1120775 1263517 1276238 982266 815547
$$ packed form
11030F93519J88674m14446K81833q5193l1565J81368j66666R7648l58369L8430
11020D25233J22126k32641L27808j01234J13157p9178Q9508p8499J42726C33909
11009C06029G8798R35547C36725J65280j85027N08892j71063k99232J71919N6545
10999E84039M024J02276m8683M8271n5993L6129j5732K1809N161B83767K00810
10988D84577J94934M24815l32846J60487J03303k02938J99315j17863M11354P1039
10978A396177j70585L21008K79029j55713R48485r3416N06046m87442r130j57787
10968B376672m76668O1266j63500k23247j92417J82566p8296m01102L75292r8863
10958A361703N90669J03085j70416n03667P5806l36405J42742J2721k93972j66719
$$ plain form
10948 815547 476055 287750 430978 292969 309441 447873 203571 429683 211101 209201
10938 209201 574213 158220 217510 -45892 82275 158568 342450 -20674 124423 187165 -140847
10926 456 354946 139007 69976 252837 -181705 130451 -115252 159556 -35966 60117 -234382
10914 -20479 -26915 -166807 -78233 -104448 -20176 551083 205759 69150 34417 -29804 14844
10902 -49171 -112128 -24973 219561 -158064 4182 -80918 -144303 39017 9035 133468 53827
10890 -50768 329350 -460134 158519 85874 -208664 -13951 224630 77691 -5971 -420530 35617
10878 -179465 -378008 -166833 40007 -59502 95607 -198851 -74714 5007 -132754 -280299 164258
10866 76150 224672 239059 -46365 -170346 -270528 15652 97604 97033 49421 -131038 -54248
$$ packed form
10948H15547l39492j88305J43228j38009J6472J38432B03571K26112B11101j900
10938B09201L65012A58220N9290d5892H2275P6293J83882b0674A24423O2742a40847
10926D56L54490A39007o9031J82861a81705A30451a15252A59556c5966F0117b34382
10914b0479o436j39892g8233k6215b0176E51083B05759F9150C4417b9804A4844
10902d9171o2957b4973B19561a58064D182h0918o3385C9017I035J24433E3827
10890e0768C29350d60134A58519p2645b08664a3951B24630G7691e971m14559C5617
10878a79465j98543a66833D0007e9502I5607a98851g4714E007a32754j47545A64258
10866G6150J48522J4387d6365j23981j00182A5652Q1952n71m7612a31038e4248
$$ plain form
10854 -89494 -198516 -98993 -85551 92668 -440102 194829 175908 -24973 250174 -102597 -40632
10842 -22585 -159465 53576 -100025 199107 151227 -31621 178185 -61017 -106518 -160099 2724
10830 -126337 -113689 -120177 86939 -20854 -150684 163087 -245882 -47025 -179804 -113647 -178975
10819 -178975 -76110 210804 -62638 -14651 54808 -248447 -54763 99176 37648 234883 -11008
10807 44296 -145283 190145 -41914 333999 -147039 79975 309358 -4829 -60811 -278945 109726
10795 279932 -155022 55157 -15599 153902 -69560 -335135 -276477 -225352 176859 -322899
10784 -269184 -48501 -100809 -45585 -65708 -518103 139621 -190694 -75312 -12844 38213 -13964
10772 105776 -127148 40638 124936 -430074 187920 -109541 -302525 -125361 -404972 11980
$$ packed form
10854h9494j09022i8993J3442I2668d40102A94829j8921b4973B50174a02597d0632
10842b2585j36880E3576a00025A99107m7880c1621A78185f1017m5501n3581B724
10830a26337J2648o488H6939b0854j29830A63087b45882d7025j32779O6157o5328
10819a78975g6110B10804f2638a4651E4808b48447e4763I9176C7648J97235a1008
10807D4296a45283A90145d1914C33999a47039G9975K29383d829n5982k18134A09726
10795B79932a55022E5157a5599A53902f9560k65575N8658N1125A76859c22899
10784b69184d8501n2308d5585k0123m52395A39621a90694g5312a2844C8213a3964
10772A05776a27148D0638Q4298d30074A87920a09541j92984a25361k79611A1980
$$ plain form
10761 -153639 -169862 -7618 -108105 -180690 -70047 -114314 39242 201757 -23435 80305 -158471
10749 61365 72697 -314134 104252 -143455 239512 -226751 -165323 305463 109924 38187
10738 77624 -387037 -118285 -137517 -27802 -162139 -187097 -209642 -296169 17644 -33189 -147808
10727 -147808 -17552 -162642 -24035 210423 93779 88562 62887 12812 -271212 -262653 -242456
10716 -242456 -213932 -184715 -366596 54764 -47043 -25961 228590 -70448 -275930 159876 -113426
10704 -205540 -10201 -104469 287288 382670 -121022 -131893 135142 -139385 -178348 37111 63931
10693 63931 -259332 -36216 -59632 77418 455665 -295889 -147549 -89663 17377 -12262 -43990
10682 -43990 -271182 132514 -11044 100200 -42983 -63270 7506 -202014 21233 -114627 -56590
$$ packed form
10761a53639j6223g618j00487p2585g0047m4267C9242J62515b3435H0305a58471
10749F1365J1332c14134A04252a43455B39512b26751O1428C05463A09924C8187
10738G7624c87037a18285j9232b7802j34337k4958k2545q6527A7644c3189j14619
10727a47808a7552j45090b4035B10423I3779n217k5675A2812b71212Q559K0197
10716b42456K8524K9217j81881E4764d7043K1082B28590g0448k05482A59876a13426
10704b05540a0201r4268B87288R5382a21022j0871A35142a39385l8963C7111K6820
10693F3931b59332c6216k3416G7418L78247b95889a47549N7886A7377a2262l1728
10682d3990k27192A32514a1044A00200d2983k0287G506b02014B1233a14627e6590
$$ plain form
10670 -137963 -108112 -29196 275223 -64535 42323 65353 43332 193054 62640 -161553 -195340
10659 -195340 -175502 -103131 -152023 74937 51154 57034 264992 -65824 -52856 -177612 53290
10647 -82208 92403 -312464 -229780 -37687 -168930 -115517 -152367 -149016 11497 -314045 -293180
10636 -293180 51581 -128951 -14025 22766 254369 -276288 120124 -62216 66267 -111806
10625 67786 -146738 109778 129058 -2546 -238664 -62515 32540 -65444 -62180 -110654 14194
10613 -149619 -128573 239504 -137103 -128100 34598 -36997 -14194 -174941 -123415 155758 218907
10602 218907 -146124 5965 114574 -140776 -152751 11597 170206 246079 -87175 -305656 33341
10590 -289038 -94222 -220667 -412902 133237 -195297 236207 -136426 -6709 10690 76897
$$ packed form
10670a37963K9851b9196B75223f4535D2323K3030k2021J49722F2640a61553l3787
10659a95340J9838P2371m8892G4937k3783N880K07958f5824J2968j24756E3290
10647h2208I2403c12464Q2684c7687j31243N3413l6850L351A1497c14045K0865
10636b93180E1581a28951a4025B2766K31603b76288A20124f2216F6267a11806
10625F7786a46738A09778J9280b546k36118f2515C2540f5444L264m8474A4194
10613a49619K1046B39504a37103R003C4598c6997a4194j60747N1526A55758O3149
10602B18907a46124E965J08609a40776j1975A1597J58609P5873h7175k18481C3341
10590b89038i4222j26445j92235A33237a95297B36207a36426f709A0690O6207
$$ plain form
10580 76897 -144258 6631 -74997 -67504 -294300 -122465 299661 -205585 190258 87943 102843
10569 102843 -320559 -8079 -219344 52798 -190078 183658 -13721 -239695 -187909 262955
10558 113420 -175305 -387169 112754 -218143 41523 12234 87620 255312 -130377 67460
10547 115739 64232 161892 -501277 158990 -113369 -5668 -37607 -297450 -222562 41421 -191775
10535 -336477 -111443 -118279 176004 -150622 -106590 51503 101977 -10516 -92116 -180240 96454
10523 157719 -331678 180507 -148726 54091 -185381 -26406 288542 301260 -173137 -299763
10513 -299763 119475 187140 -7285 -374221 -75706 38084 -54521 -391338 -50552 -10501 19566
10501 -18555 174838 -17969 -185792 -88694 143266 -94985 -208579 195796 161547 -468918
$$ packed form
10580G6897a44258F631g4997P493k26796a22465B99661b05585A90258H7943J4900
10569A02843c20559h079k11265E2798a90078A83658a3721k25974N1786B62955
10558A13420a75305k11864A12754b18143D1523A2234P5386J67692a30377F7460
10547A15739n1507R7660e01277A58990a13369e668l1939k59843P4888D1421a91775
10535c36477a11443o836A76004a50622M4032E1503N0474a0516q1600q8124I6454
10523A57719c31678A80507a48726E4091a85381b6406B88542J2718a73137j26626
10513b99763A19475O7665g285l66936g5706C8084e4521l36817e0552a0501A9566
10501a8555A74838a7969j67823h8694A43266i4985j13594A95796l4249d68918
$$ plain form
10490 -226604 -80602 253799 -27365 -106611 -28184 361330 165749 258816 522092 639815
10480 639815 368325 494074 237215 282214 372408 203973 -64477 92087 -82947 -274110
10470 -274110 -158262 -90314 37898 -12332 -43877 5975 -277548 -58546 -332698 -151006 323865
10458 -61046 -72636 -68521 134588 200505 149790 18715 256878 -9583 274883 -98881 7285 11649
10446 11649 -196279 -173530 198233 144075 -188608 -154930 169145 44922 25182 -39616 262687
10434 306828 -163511 350780 156596 -213304 -461 -177464 10035 26412 -186702 -226102 -189039
10423 -189039 223266 -183698 62705 81839 65297 226862 47577 176117 202374 37727 140591
10412 140591 -84026 -104159 -31215 -389424 -53783 312997 -270998 343215 -117495 49366
$$ packed form
10490b26604h0602B53799b7365p9246b8184C61330A65749R3067K63276J17723
10480F39815k71490J25749B37215M4999R0194j68435f4477I2087h2947j91163
10470b74110J15848O7948C7898a2332l1545E975b77548e8546k74152a51006C23865
10458f1046j1590M115A34588O5917n0715A8715K38163i583B74883i8881G285M364
10446A1649a96279K2749A98233n4158a88608L3678A69145D4922j9740c9616B62687
10434C06828a63511C50780A56596b13304d61j77003A0035J6377a86702l9400L7063
10423a89039B23266a83698F2705J9134j6542J61565D7577J28540K6257C7727J02864
10412A40591h4026k0133c1215l58209e3783C12997b70998C43215a17495D9366
$$ plain form
10401 -80791 175260 151196 150781 68977 -92036 -307238 393105 254799 53359 -81523 47664
10389 -87123 -248982 21921 135807 277368 -1911 -262196 56589 194172 286143 313398 54706
10377 389141 303465 -53101 87067 146392 66721 142672 -41809 245179 126616 202046 514296
10366 514296 118208 386021 346462 -257996 231349 132421 500289 181853 217792 226610
10356 226610 292956 252451 350682 304138 399049 602943 498527 446003 495301 366916 411293
10345 411293 141917 392827 569490 581448 303966 286889 34382 540162 88275 394175
10335 394175 -275088 -19677 111427 293445 87263 -254857 246930 26371 134129 -91014
10324 41552 50519 61592 222827 -29476 -46159 106718 23547 -13594 388207 347981 -33280
$$ packed form
10401h0791A75260k4064m15F8977i2036k15202C93105j38306E3359h1523D7664
10389h7123j61859B1921J13886J41561a911k60285E6589J37583R1971K7255E4706
10377C89141q5676e3101H7067N9325F6721P5951d1809B45179j18563P5430L12250
10366E14296A18208K67813l9559b57996B31349r8928L67868A81853L5939Q818
10356B26610O6346m0505R8231m6544R4911K03894j04416n2524M9298j28385M4377
10345D11293A41917K50910J76663J1958k77482j7077C4382N05780H8275L05900
10335C94175b75088a9677A11427J82018H7263b54857B46930B6371J07758i1014
10324D1552Q967J1073J61235b9476j6683A06718B3547a3594C88207m0226c3280
$$ plain form
10312 98379 -82947 -131671 -130253 -12352 42022 -68232 63390 -152334 -47816 -191337 17571
10300 10499 7557 71570 240032 -178220 -210961 -46590 -230700 -73145 -173849 49964 -34153
10288 -148243 -29213 -11306 160736 40216 -159060 48020 80555 164709 179488 271345 75739
10276 207163 -240191 -42796 -29850 154675 -97276 -199503 -34561 -159993 39435 -225779
10265 -321522 -99972 -131399 -307770 62280 247950 298207 -43635 242714 231286 451517 66161
10253 76865 -192677 -38500 -128051 -74862 -112986 90312 266128 -156237 -204050 2633 -235611
10241 -171232 172560 -55153 48095 22893 -131530 128153 58499 175820 -18766 -409852
10231 -409852 -246582 -224734 -17711 146057 -73194 -17865 -110640 -145273 62856 105969 -94064
$$ packed form
10312I8379h2947m8724J418a2352D2022f8232F3390a52334d7816j43521A7571
10300A0499k942O4013J68462a78220l2741d6590j84110g3145j00704D9964c4153
10288a48243b9213a1306A60736D0216a59060D8020L2535Q4154J4779R1857G5739
10276B07163b40191d2796J2946A54675i7276j02227c4561j25432C9435b25779
10265c21522i9972l1427j76371F2280J85670N0257d3635B42714j1428K20231F6161
10253G6865a92677c8500q9551N3189l8124I0312J75816a56237m7813B633b35611
10241a71232A72560e5153D8095B2893a31530A28153E8499J17321a8766l91086
10231d09852J63270K1848a7711A46057g3194a7865r2775l4633F2856M3113i4064
$$ plain form
10219 -312113 -533338 -197200 -30349 233841 -78557 -96368 -121412 -11183 -21991 -372518 -179977
10207 -161222 271663 -104434 -142162 31495 -97531 -289362 -216804 -43529 -88686 418663 -146790
10195 -301045 -86260 38511 -14036 -430106 30255 -3804 83142 182915 18647 -120158 161260
10183 -195530 8174 -59140 32472 61136 -311278 39908 -174821 -351211 10418 -224982 131102
10171 66139 -56548 3008 -98049 -200424 75140 -50602 -295288 12916 59440 -73486 -164140
10160 -164140 -16466 -179887 120444 -127706 -142633 37504 145439 20290 150015 57434
10149 -30261 -353589 207686 -87464 260631 -32436 -127356 -143830 -222690 83025 -52366 300943
10137 78609 68613 -4689 -36980 130759 -76431 120710 72809 -149785 -238014 -254728 -120095
$$ packed form
10219c12113k21225a97200c0349B33841g8557j7811k5044a1183j0808l50527a79977
10207a61222B71663a04434l7728C1495i7531j91831P2558d3529m5157D18663a46790
10195c01045h6260C8511a4036m16070C0255c804H3142R9773A8647a20158A61260
10183a95530H174e9140C2472K8664c11278C9908a74821j76390A0418b24982A31102
10171F6139e6548C008i8049j02375G5140e0602k44686A2916M6524g3486r0654
10160a64140a6466j63421A20444a27706j4927C7504J07935B0290J29725E7434
10149c0261l23328B07686h7464B60631c2436r4920j6474p8860H3025e2366C00943
10137G8609r996d689l2291A30759g6431A20710m7901a49785q8229j6714a20095
$$ plain form
10125 20651 48761 -79972 -81973 63572 250510 43748 -156999 -3135 40579 -67272 104409
10113 136700 -81496 52423 -205098 -139568 -59560 -242243 -84870 159415 10556 -49922 -332867
10102 -332867 68641 -256115 -31950 143279 -111309 -25027 405230 -125919 5195 48545 46611
10091 46611 -166433 -176035 -58760 -368881 -15843 -34954 -19062 -7385 -335662 56170 68103
10080 68103 242503 -182616 -257069 -363267 -71482 -45221 287942 87921 -107733 2622 -50132
10068 -126699 21632 20696 -289760 -37604 12264 153619 -148616 38366 -165279 -349193 -182597
10057 -182597 66995 230673 52333 -84618 177406 187061 -278263 280557 -251413 -157789 -189321
10046 -189321 -180898 -13561 15274 -488395 -1737 -230514 -338508 46230 -86256 299135 -120730
$$ packed form
10125B0651K8110g9972k001F3572J86938D3748a56999c135D0579f7272A04409
10113A36700h1496E2423b05098O5530e9560j82683h4870A59415A0556d9922k82945
10102c32867F8641b56115c1950A43279a11309b5027D05230a25919E195M3350j934
10091D6611a66433r602e8760l10121a5843j9111J5892g385l28277E6170J1933
10080F8103J74400a82616p4453j06198g1482K6261B87942H7921a07733B622e0132
10068a26699B1632r36b89760c7604A2264J41355a48616C8366a65279j83914J66596
10057a82597F6995J63678E2333h4618A77406R655b78263B80557b51413R3624l1532
10046a89321Q423a3561A5274d88395a737k28777j07994D6230h6256B99135a20730
$$ plain form
10034 -337470 44390 241780 -256836 -14689 -20339 -88163 -8572 195518 118649 -104595 133119
10022 -52580 -141669 81242 -43276 -155627 -333999 -172527 12013 -37920 35290 -253130 -546347
10011 -546347 -310439 -223006 -132645 -232835 -212894 -359759 -124889 232470 -176300 -243027
10001 -243027 -222668 30048 153094 -220066 -105915 -119440 63241 -165619 -106411 -277362
9991 -277362 -401244 -339121 -179664 198515 -160808 -461735 3740 -106178 -155491 103963
9980 -379564 -389912 -81252 51904 114552 -217267 -60335 279122 -184637 -335290 243124 -135238
9968 106674 -118661 -120541 27416 -765 -123742 -309769 -178495 -217026 181978 -17949 -1578
9956 14124 75691 -287191 263220 -227782 -119478 -188620 -134626 366795 -43838 -128546 -172770
$$ packed form
10034c37470D4390J97390b56836a4689n650o7824h572A95518p6869a04595A33119
10022e2580q9089H1242d3276j12351j78372J61472A2013c7920C5290b53130k93217
10011e46347K35908Q7433R0361j00190J9941j46865a24889B32470a76300o6727
10001b43027K0359C0048J23046b20066a05915j3525F3241a65619N9208j70951
9991b77362j23882O2123J59457A98515a60808l00927C740a06178m9313A03963
9980c79564j0348h1252E1904O2648b17267f0335B79122a84637j50653B43124a35238
9968A06674a18661j880B7416g65j22977j86027J31274l8531A81978a7949a578
9956A4124O1567b87191B63220b27782J08304o9142N3994C66795d3838q4708m4224
$$ plain form
9945 -172770 -61458 187200 101987 -93186 -114348 -251993 -103868 -202661 -55509 -174372 -22767
9933 -88805 -41878 -313505 365910 -76645 22512 -77817 125720 27252 -32593 -222768 -151094
9922 -151094 -229464 -261423 -316721 231673 -278186 -15444 -134880 100666 -108976 -153922 -41190
9910 -69774 43700 -404752 51603 -83950 79847 11262 46362 -195384 -56713 -146693 -300244
9899 -300244 17253 135296 -323441 214686 -164693 -69339 -194622 -114697 -244719 -293488
9889 -293488 -49386 -137196 -219200 -7402 -279407 329915 -197574 -348023 -327032 -12450 -93637
9878 -93637 -145486 -76369 56951 -9818 299893 -148662 125531 -67054 -181845 -31788 -154092
9867 -154092 297380 -10686 10433 -354231 -219046 -38988 -96628 -92771 50937 -210810 206218
$$ packed form
9945a72770f1458A87200q5213i3186k1162j37645a03868r8793e5509j18863b2767
9933h8805d1878k71627C65910g6645B2512g7817A25720B7252c2593j90175P1674
9922a51094p8370l1959n5298B31673b78186a5444j19436A00666a08976m4946d1190
9910f9774D3700d04752E1603h3950G9847A1262L5100a95384e6713q9980j53551
9899c00244A7253J18043c23441B14686a64693f9339j25283P9925j30022m8769
9889b93488d9386q7810q2004g402k72005C29915a97574j50449K0991a2450q1187
9878i3637n1849O9117E6951i818B99893a48662A25531f7054j14791c1788j22304
9867a54092B97380a0686A0433c54231J35185c8988n7640L857E0937b10810B06218
$$ plain form
9855 20545 21467 125127 -76111 -211488 247922 -368387 -199660 114824 -180471 -128183 -309328
9844 -309328 -346305 118289 -109688 -121764 -22124 -129673 237549 -298618 94432 -206439
9833 -222386 -202658 16121 -59983 -12509 -210644 138033 -494191 -69607 102172 -11994 -230457
9822 -230457 -207207 1160 3943 -24930 -155063 149096 -69566 -21780 22909 -33651 78593 -114556
9809 22754 -188102 -104774 30698 -74003 142116 178267 -184312 135569 -220225 58582 -139334
9797 52481 110250 -178857 -242280 28937 109988 -125261 -389162 -333347 -48136 142944 17064
9785 -200469 116438 -316336 111281 -75838 -85387 -50337 174600 242057 32508 -90434 -115404
9774 -115404 49157 36019 -144153 62322 30058 -203875 -155926 -49707 -40613 -189398 -79345
$$ packed form
9855B0545R22J03660g6111j35377B47922c68387J68727A14824a80471N2288j81145
9844c09328l6977A18289a09688j2076b2124j07549B37549b98618I4432b06439
9833b22386J9728A6121e9983a2509j98135A38033d94191f9607A02172a1994k18463
9822b30457K3250A160K783b4930j30133A49096f9566b1780B2909c3651G8593a14556
9809B2754a88102Q3328C0698g4003A42116L6151a84312A35569b20225E8582a39334
9797E2481N7769a78857o3423B8937Q1051a25261k63901N5815d8136A42944A7064
9785b00469A16438c16336A11281g5838r549L5050A74600O7457C2508i0434k4970
9774a15404D9157j3138a44153F2322C0058b03875M7949d9707R094j48785g9345
$$ plain form
9762 66700 -122126 31358 162712 -272295 100214 47808 -56385 -350379 26508 -163134 -187704
9751 -187704 176458 137983 -124738 -129272 -128182 39373 64176 -62733 -316 -411067 -254252 -166578
9739 -166578 213782 -43571 -31881 -532864 -256577 148488 6710 166953 200296 -282930 -36385
9727 50049 -89082 217236 21014 130068 -328374 -226713 55302 -195220 -98302 -74112 -204935
9716 -204935 -40887 -191065 74859 -103349 190192 -24985 -345901 -134414 -71391 -69544 23503
9704 -68253 -26897 -159489 2748 -103116 11466 -29701 -311180 83076 -157674 -44133 -15486
9692 -57724 -408944 41829 53930 -213276 26895 -129668 -69842 -80569 -135450 25270 -195766
9680 109376 -269795 147631 145306 -17520 -406651 154507 264416 -131394 -188738 115560
$$ packed form
9762F6700a22126C1358J31354b72295A00214D7808e6385k93994B6508a63134k4570
9751a87704A76458l8475a24738m534J090C9373K4803f2733c16m10751J56815Q7674
9739a66578B13782d3571J1690n00983b56577A48488F710J60243L3343b82930c6385
9727E0049h9082B17236B1014J09054c28374J01661E5302a95220R6918K4190j30823
9716b04935d0887j50178G4859a03349A90192b4985l20916a34414O3023J847B3503
9704f8253b6897j32592B748a03116A1466b9701k81479H3076a57674d4133a5486
9692e7724l51220D1829J2101b13276B6895a29668N9826j0727n4881B5270a95766
9680A09376b69795A47631k325a7520l89131A54507J09909a31394n7344A15560
$$ plain form
9669 104919 23943 -139568 -102333 -482593 -286749 -124289 -30212 17079 -275803 57096 -45131
9657 -336067 -321665 102252 26228 -86866 -80678 -250030 24196 -37400 -71197 -112509 -103488 -113186
9645 -113186 16381 -29102 47928 -291323 -230576 -149252 -314994 135985 -10254 -373128 139344
9633 -82160 -309226 -211973 -82564 -88257 -110720 -7402 -288898 -436983 234798 397768 -64635
9621 -92878 73382 -56176 -401554 -12411 -180977 -51831 -249249 -343844 -62448 177233 167720
9610 167720 13816 -255992 -424904 -119576 2811 -334500 61035 -31340 75688 58980 3948
9598 -296232 -111801 379214 -248922 -224208 -189646 -192519 -222033 -363791 -184913 -11009 -219630
9587 -219630 81260 -18599 46385 -7720 269004 -124200 179086 6139 77904 -264565 90616
$$ packed form
9669A04919B3943a39568L7235l80260J95844a24289c0212A7079b75803E7096d5131
9657c36067J4402A02252B6228h6866O188j69352B4196c7400l3797m1312R021r698
9645a13186A6381b9102D7928b91323O0747Q1324j65742A35985a0254l62874A39344
9633h2160k27066R7253h2564n693k2463g402k81496j48085B34798J62970f4635
9621i2878G3382e6176l45378a2411j68566e1831j97418r4595f2448A77233r513
9610A67720A3816b55992j68912a19576B811c34500F1035c1340G5688j6708C948
9598b96232a11801C79214b48922K4714L4562k873k9514j41758J78878a1009k08621
9587b19630H1260a8599D6385g720B69004a24200A79086F139P1765b64565I0616
$$ plain form
9575 -87801 -7267 -89496 28314 -251176 -215079 -107888 -166228 -200879 -209153 162834 -410695
9563 -80097 -168004 -213044 199823 -233372 77702 -44463 -117282 108182 54565 366063 -74043
9551 -366996 38468 -60620 187469 181103 -100769 -95892 25400 120624 126011 36331 -130862 255960
9538 -115920 88101 169039 49466 22044 -174150 -26858 146127 -327133 -81284 40618 -126776
9526 -175338 -179760 -276860 2338 -5671 -37900 -107879 -413034 75706 -48574 97274 19013 -38473
9513 154275 149744 -2935 -151709 -87343 -13179 -207503 24632 238135 135049 15165 -34874
9501 190430 32423 1300 -82253 -123209 -170446 -100402 -257178 -152867 -103972 204107 -111793
9489 -234462 200121 -387254 -205821 6224 -214346 -9495 -3438 -50809 39945 -63035 95669
$$ packed form
9575h7801g267q2229B8314b51176L6097J07191n8340l4651q274A62834d10695
9563h0097q7907m5040A99823b33372G7702d4463p2819A08182n3617L11498g4043
9551c66996C8468f0620A87469o366a00769M877B5400R5224N387C6331a30862B55960
9538a15920H8101Q0938D9466B2044a74150b6858A46127c27133h1284D0618a26776
9526a75338m422r7100B338e671l2229o9979l05155G5706d8574I7274A9013c8473
9513A54275m531b935j48774O4366a3179j94324B4632K13503j03086A5165c4874
9501A90430C2423A300h2253m0956m7237P0044j56776J04311M8895B04107a11793
9489b34462B00121c87254J81433F224b14346i495c438m7371C9945f3035I5669
$$ plain form
9477 17971 349575 35762 73642 -243120 61516 -122442 176233 -34219 -29384 -225748 -257253
9466 -257253 215196 -31757 197176 -44697 -12792 -128664 128917 -90960 68555 -10705 -236444
9455 -236444 -271398 -71388 -43203 149572 898 15989 -460037 159521 25802 -314 -518891 -265539
9443 -265539 -75058 95429 -65519 -230468 -94239 -4467 -133742 -224723 97953 69837 156314
9432 156314 -127159 -182704 -132856 87026 89543 152015 66789 103611 -25769 -336572 -296033
9421 -296033 142501 108774 372512 -11720 -10082 163517 72537 69387 -120836 -131202 7414
9409 19168 -193982 -180290 -75653 64995 37682 54423 -53033 -73029 56390 -255181 -35837
9397 -117782 -25009 49391 -304917 15110 -141231 181013 -225959 290311 58538 -91417 -47934
$$ packed form
9477A7971L31604C5762L7880b43120F1516a22442A76233c4219M835j96364l1505
9466b57253B15196c1757A97176d4697a2792j15872A28917i0960F8555a0705k25739
9455b36444l4954g1388K8185A49572H98J5091d60037A59521B5802c14n18577K53352
9443b65539g5058I5429f5519j64949i4239d467j29275r0981I7953k8116Q6477
9432A56314a27159n5545M9848H7026K517O2472F6789L6822b5769l10803M0539
9421b96033A42501l3727K63738a1720J638A63517G2537l150a20836j0366G414
9409A9168a93982J3692g5653F4995k7313J6741e3033j9996E6390b55181c5837
9397a17782b5009D9391c04917A5110a41231A81013b25959B90311E8538i1417M3483
$$ plain form
9386 -47934 69055 58144 -278854 295392 -258701 24731 41290 4854 -70964 47822 138333
9375 138333 -10188 -141748 43728 -254998 -29138 -191257 9391 -280554 -187356 -312476 -21502
9363 241890 129689 10132 120857 36329 -194191 118326 -85749 -329084 -549054 -228047
9352 319999 56530 -42529 247754 -198783 125626 -202102 -144836 62665 -122366 -5435 -124114
9341 -124114 202842 283312 -168855 -165882 -167754 -285425 -20992 -269483 103591 -244422 -175773
9330 -175773 -212924 -40924 -86068 297153 -63336 -218389 6799 70151 -19102 83677 58803
9319 58803 -96742 107352 -272004 -264886 84053 24132 -549632 -17182 -159605 28282 -185316
9307 -383544 -31082 -152343 4994 -105609 -34539 -197377 -272615 -204613 39464 194067 -1409
$$ packed form
9386d7934F9055j0911b78854B95392b58701B4731J6559D854g0964D7822R0511
9375A38333a0188j31560D3728b54998b9138j62119I391b80554R3198j25120b1502
9363B41890j12201A0132J10725C6329a94191A18326h5749k43335k19970b28047
9352C19999E6530d2529B47754a98783A25626b02102N7266F2665a22366e435j18679
9341a24114B02842Q0470a68855K973j872j17671b0992k48491A03591b44422O8649
9330a75773l7151d0924m5144B97153f3336j55053F799O3352a9102H3677k4874
9319E8803i6742A07352b72004P118H4053B4132e49632a7182j42423B8282a85316
9307c83544c1082j21261D994a05609c4539j62838p5238O8002C9464J54603a409
$$ plain form
9295 90272 -394935 -281884 -341306 -72331 -487888 -13464 -230470 -94241 -313937 -36883 322694
9283 -104064 -136226 222529 -101653 138353 -84127 -6632 41128 -278 234224 -188818 -82833
9271 -187906 -24159 251898 -132697 -10846 -28598 410696 317655 111310 -360653 167835
9260 125659 41583 -91021 11624 -167711 -263594 -13973 250378 107570 18973 -160385 -88817
9249 -88817 76089 -387010 -287872 -70624 -202718 425013 331361 -22741 -381081 -259671 171001
9237 -280218 -199340 53601 69845 -27038 -296312 14405 -284236 -224238 -280284 -148521 59158
9225 108270 -31949 -215795 115632 -200770 -106945 -193831 5849 117173 -125924 -94479 -106035
9214 -106035 39489 88846 -308376 -235446 235278 -3935 189921 -385906 -156954 59213 -362599
$$ packed form
9295I0272c94935J13051n9422g2331m15557a3464k17006i4241k19696c6883C22694
9283a04064l2162B22529a01653A38353h4127f632D1128b78B34224a88818h2833
9271a87906b4159B51898a32697a0846j7752D10696r3041A11310c60653A67835
9260A25659D1583i1021A1624a67711r5883a3973B50378A07570A8973a60385P1568
9249h8817G6089c87010R9138g0624j32094D25013r3652b2741l58340J21410A71001
9237b80218Q0878E3601J6244b7038k69274A4405b84236N9998n6046J31763E9158
9225A08270c1949j83846A15632b00770R3825q6886E849J11324a25924L1445j1556
9214a06035C9489M9357c08376P2930B35278c935A89921c85906a56954E9213c62599
$$ plain form
9202 89464 -54196 -88399 -73942 -195522 -109039 -68342 3502 94517 -308903 13927 -267580
9190 -169233 -32173 7034 123721 -3841 2769 -334570 24802 -7160 156925 -11194 -136952 -256201
9178 -256201 -240606 -104156 -171791 -190916 -222140 -99662 326752 199795 -176226 -71450 242215
9166 -183680 -408172 81483 -21501 24740 154601 102107 -114939 -32291 78129 470281 -148593
9154 53034 95037 432678 175398 95272 -162897 -81909 121528 53621 -102775 -185731 33288
9142 -218780 -135394 211262 10046 -337359 44178 210880 -118483 90269 -76616 268253 -178174
9130 -138663 25913 -141153 -194143 -106421 58184 -387919 -159913 -33083 -220257 -271871 -137611
9119 -137611 23861 30114 -361931 62738 94765 108114 -16564 -32972 -41834 -452915 -22139 -248519
$$ packed form
9202H9464e4196l4203J4457j21580Q6483M0697C502R1015c08903A3927b67580
9190a69233c2173G034J16687c841B769c34570B4802g160A56925a1194j25758j19249
9178b56201J5595a04156o7635j9125l1224i9662C26752j26957a76226g1450B42215
9166a83680k24492H1483b1501B4740J29861n2494a14939c2291G8129L92152a48593
9154E3034M2003L37641A75398q0126a62897Q0988A21528E3621a02775q2956C3288
9142b18780Q3386B11262A0046c37359D4178J66702a18483I0269g6616B68253a78174
9130a38663B5913a41153n2990Q7722E8184c87919a59913c3083j87174n1614J34260
9119a37611B3861O253c61931F2738L2027J3349a6564j6408q862m11081b2139k26380
$$ plain form
9107 -248519 -212034 -113039 64285 44659 118600 101238 -132090 -63058 114223 -244793 -153357
9096 -153357 123007 195474 -30209 -217060 227600 -53115 -110070 -130375 -423355 -95205 -145586
9085 -145586 -201449 -249211 31491 -83666 141431 -303326 -439514 75363 6411 272 -104182
9073 -212810 -134626 154446 26617 -118349 -118115 299148 11267 -44807 -105126 -112811 155177
9061 160296 47342 -111246 95578 -203079 -70995 -472953 -42913 -100291 191429 201531 -338585
9049 258115 -234898 -162672 43900 -251815 -164917 2742 -39251 26222 9909 129231 44093
9037 78803 190344 -155853 -123112 6462 -199880 6766 -74997 40021 83490 -79761 -184636
9026 -184636 -104044 38222 31351 -266794 -140660 -476090 -139663 25090 -180565 94728 3220
$$ packed form
9107b48519L6485R8995F4285j9626P3941j7362a32090f3058A14223b44793R1436
9096a53357A23007P2467c0209j86851B27600e3115n6955k0305k92980i5205n0381
9085a45586n5863m7762C1491h3666A41431c03326j36188G5363F411B72a04182
9073b12810P8184A54446B6617a18349K34B99148A1267d4807o0319p685A55177
9061A60296D7342a11246I5578b03079g0995m01958d2913n7378A91429J0102c38585
9049B58115b34898P2226D3900b51815Q6898B742c9251B6222I909J19322D4093
9037G8803J11541a55853L2741F462a99880F766g4997D0021M3469g9761j04875
9026a84636Q0592C8222o871b66794J26134l35430a39663B5090a80565I4728C220
$$ plain form
9014 153378 -357560 6627 242817 -16513 -107921 83655 225892 -226591 36661 -54180 52232
9002 -340013 -25024 53705 -57006 202137 219526 -243537 -228979 -46489 293148 51869 -147850
8990 107514 45720 124381 -158825 -28173 154093 -210535 -127604 -35202 95598 61739 -60073
8978 -239290 8043 5885 398772 280751 -46513 -83306 -6301 -300653 62735 137515 -54587 -118304
8966 -118304 -149908 -260869 -233481 -161943 152176 -112124 -127087 -270077 -435275 175121
8955 -241199 113991 -94695 94403 149109 168696 -49209 -150754 -69179 6813 149149 -71528
8943 253892 157368 -239556 -195636 28788 35047 100941 139787 -178996 126802 60716 -227317
8931 -61156 -238976 -393437 -299577 -137078 211916 77587 132451 771062 1636242 6086274
$$ packed form
9014A53378c57560F627K36190a6513r1408H3655J42237b26591C6661e4180E2232
9002c40013b5024E3705e7006B02137J7389b43537J4558d6489B93148E1869a47850
8990A07514D5720P8661a58825b8173A54093b10535Q2931c5202I5598l3859f0073
8978b39290H043k158L92887j18021d6513l6793f301k94352F2735P4780e4587o3717
8966a18304l1604j10961K7388P1538A52176a12124j4963j42990j65198A75121
8955b41199A13991i4695I4403N4706J9587d9209j01545f9179F813J42336g1528
8943B53892r6524b39556M3920B8788O259O5894L8846a78996A26802F0716b27317
8931f1156j77820j54461R3860a37078B11916G7587N4864O38611Q65180M450032
$$ plain form
8921 6086274 4907532 1778429 564204 520091 -10850 -175053 -185967 -79682 -127837 -295730
8911 -295730 -67217 141625 -42298 157281 113801 -119828 -215851 37514 -306525 35302 225861
8900 225861 31305 -337295 -198511 -158113 4582 -10665 -245427 326253 -117298 196639 -288422
8888 -57115 -350768 27665 -51233 -417736 117431 -75582 -156196 26635 -100082 83468 -6196
8876 -138145 -85160 163858 90540 -474074 -94397 -248540 5378 -423687 -296245 -181844 49441
$$ packed form
8921F086274j178742A778429E64204m4113a0850j64203j0914g9682m8155j67893
8911b95730f7217A41625d2298A57281m3480a19828r6023C7514c06525C5302J90559
8900B25861C1305c37295J38784M0398D582a0665k34762C26253a17298A96639b88422
8888e7115k93653B7665e1233l66503A17431g5582q0614B6635a00082H3468f196
8876a38145N2985A63858p3318d74074i4397j54143E378d23687J27442J14401D9441
$$ [...]
##END NTUPLES=NMR SPECTRUM
##END=
