
##TITLE=AC1305_DOMAH11117_6534176_SSEQbSwYrv
##JCAMPDX= 6.0         $$ Bruker NMR JCAMP-DX V2.0
##DATA TYPE= NMR SPECTRUM
##DATA CLASS= NTUPLES
##ORIGIN= BRUKER
##OWNER= Administrator
$$ 1.72 TOPSPIN		Version 2.1
$$ 2012-07-17 00:40:26.359 -0500  Administrator@TOPSPIN
$$ Compression mode = diff/dup
##.OBSERVE FREQUENCY= 400.02188249412
##.OBSERVE NUCLEUS= ^1H
##.ACQUISITION MODE= SIMULTANEOUS (DQD)
##.ACQUISITION SCHEME= undefined
##.AVERAGES= 64
##.DIGITISER RES= 22
##SPECTROMETER/DATA SYSTEM= spect
##.PULSE SEQUENCE= noesygpps1d.comp
##.SOLVENT NAME= COFFEE_meoh
##.SHIFT REFERENCE= INTERNAL, COFFEE_meoh, 1, 14.96087
##AUDIT TRAIL= $$ (NUMBER, WHEN, WHO, WHERE, PROCESS, VERSION, WHAT)
$$ ##TITLE= Audit trail, TOPSPIN		Version 2.1
$$ ##JCAMPDX= 5.01
$$ ##ORIGIN= Bruker BioSpin GmbH
$$ ##OWNER= Administrator
$$ $$ C:\Bruker\TOPSPIN/data/COFFEE/nmr/AC1305_DOMAH11117_6534176_SSEQbSwYrv/12/pdata/1/auditp.txt
$$ ##AUDIT TRAIL=  $$ (NUMBER, WHEN, WHO, WHERE, PROCESS, VERSION, WHAT)
(   1,<2012-07-17 00:40:21.265 -0500>,<Administrator>,<TOPSPIN>,<go>,<TOPSPIN 2.1>,
      <created by zg
	started at 2012-07-17 00:28:50.328 -0500,
	POWCHK enabled, PULCHK disabled,
       configuration hash MD5:
       6B 1B 68 BB D9 2E 58 E2 7F 35 AD 54 07 DF 0E 41
       data hash MD5: 64K
       37 A4 94 38 9E 19 71 FC 32 28 0C 28 86 8C 1A F7>)
(   2,<2012-07-17 00:40:24.187 -0500>,<Administrator>,<TOPSPIN>,<proc1d>,<TOPSPIN 2.1>,
      <Start of raw data processing
       efp LB = 0.3 FT_mod = 6 PKNL = 1 PHC0 = 0 PHC1 = 0 SI = 128K 
       data hash MD5: 128K
       D2 9E 8D 14 0E 76 58 A5 79 BE EB 33 BF F6 7C 83>)
(   3,<2012-07-17 00:40:25.312 -0500>,<Administrator>,<TOPSPIN>,<proc1d>,<TOPSPIN 2.1>,
      <pk PHC0 = 1.521606 PHC1 = 0 
       data hash MD5: 128K
       4B 49 A2 61 2E EB CE D7 96 3A A6 5C BC 4E 43 B9>)
(   4,<2012-07-17 00:40:26.000 -0500>,<Administrator>,<TOPSPIN>,<proc1d>,<TOPSPIN 2.1>,
      <abs ABSG = 1 
       data hash MD5: 128K
       D3 E0 58 F8 C1 03 B2 6F BA 84 A2 B9 FC C5 9F DE>)
(   5,<2012-07-17 00:40:26.078 -0500>,<Administrator>,<TOPSPIN>,<proc1d>,<TOPSPIN 2.1>,
      <abs ABSG = 2 
       data hash MD5: 128K
       96 AC 01 D3 AB 7B 27 C8 44 12 A2 A8 2C DA FD 36>)
(   6,<2012-07-17 00:40:26.125 -0500>,<Administrator>,<TOPSPIN>,<proc1d>,<TOPSPIN 2.1>,
      <abs ABSG = 3 
       data hash MD5: 128K
       A4 B0 E4 CF A0 28 81 99 E2 69 6E CA 54 B8 C0 7E>)
(   7,<2012-07-17 00:40:26.203 -0500>,<Administrator>,<TOPSPIN>,<proc1d>,<TOPSPIN 2.1>,
      <abs ABSG = 4 
       data hash MD5: 128K
       55 C8 48 BC 3C 20 7B C3 BC 3E DE B1 21 C3 A1 B8>)
(   8,<2012-07-17 00:40:26.265 -0500>,<Administrator>,<TOPSPIN>,<proc1d>,<TOPSPIN 2.1>,
      <abs ABSG = 5 
       data hash MD5: 128K
       76 DA 20 47 B1 EF 8B A8 F1 05 5B 38 7E 81 2A 38>)
$$ ##END=
$$ 
$$ $$ hash MD5
$$ $$ 1A 9F 3C 91 68 99 0B 17 55 E3 CD A1 51 1D A4 6D
##$RELAX= 
##$RELAX= 
##$RELAX= 
##$RELAX= 
##$RELAX= 
##$RELAX= 
##$RELAX= 
##$RELAX= 
$$ Bruker specific parameters
$$ [...]
##$TP07= 0
##$TPNAME0= <>
##$TPNAME1= <>
##$TPNAME2= <>
##$TPNAME3= <>
##$TPNAME4= <>
##$TPNAME5= <>
##$TPNAME6= <>
##$TPNAME7= <>
##$TPOAL= (0..7)
0.5 0.5 0.5 0.5 0.5 0.5 0.5 0.5
##$TPOFFS= (0..7)
0 0 0 0 0 0 0 0
##$TUNHIN= 0
##$TUNHOUT= 0
##$TUNXOUT= 0
##$USERA1= <user>
##$USERA2= <user>
##$USERA3= <user>
##$USERA4= <user>
##$USERA5= <user>
##$V9= 5
##$VALIST= <valist>
##$VCLIST= <CCCCCCCCCCCCCCC>
##$VD= 0
##$VDLIST= <DDDDDDDDDDDDDDD>
##$VPLIST= <PPPPPPPPPPPPPPP>
##$VTLIST= <TTTTTTTTTTTTTTT>
##$WBST= 2048
##$WBSW= 25
##$XGAIN= (0..3)
0 0 0 0
##$XL= 0
##$YL= 0
##$YMAX_a= 11832227
##$YMIN_a= -8900000
##$ZGOPTNS= <>
##$ZL1= 120
##$ZL2= 120
##$ZL3= 120
##$ZL4= 120
##$ABSF1= 14.96087
##$ABSF2= -5.597312
##$ABSG= 5
##$ABSL= 3
##$ALPHA= 0
##$AQORDER= 0
##$ASSFAC= 0
##$ASSFACI= 0
##$ASSFACX= 0
##$ASSWID= 0
##$AUNMP= <proc_prof1d_extract.lims>
##$AXLEFT= 0
##$AXNAME= <>
##$AXNUC= <1H>
##$AXRIGHT= 0
##$AXTYPE= 0
##$AXUNIT= <>
##$AZFE= 0.1
##$AZFW= 0.1
##$BCFW= 0
##$BC_mod= 0
##$BYTORDP= 0
##$COROFFS= 0
##$CY= 15
##$DATMOD= 1
##$DC= 0
##$DFILT= <>
##$DTYPP= 0
##$F1P= 0
##$F2P= 0
##$FCOR= 0.5
##$FTSIZE= 131072
##$FT_mod= 6
##$GAMMA= 0
##$GB= 0
##$INTBC= 1
##$INTSCL= 1
##$ISEN= 128
##$LB= 0.3
##$LEV0= 0
##$LPBIN= 0
##$MAXI= 10000
##$MC2= 0
##$MEAN= 0
##$ME_mod= 0
##$MI= 0
##$NCOEF= 0
##$NC_proc= -2
##$NLEV= 6
##$NOISF1= 0
##$NOISF2= 0
##$NSP= 0
##$NTH_PI= 0
##$NZP= 0
##$OFFSET= 14.96087
##$PC= 1
##$PHC0= 1.521606
##$PHC1= 0
##$PH_mod= 1
##$PKNL= yes
##$PPARMOD= 0
##$PPDIAG= 0
##$PPIPTYP= 0
##$PPMPNUM= 2147483647
##$PPRESOL= 1
##$PSCAL= 4
##$PSIGN= 0
##$PYNMP= <proc.py>
##$REVERSE= no
##$SF= 400.020009689182
##$SI= 131072
##$SIGF1= 0
##$SIGF2= 0
##$SINO= 400
##$SIOLD= 131072
##$SPECTYP= <>
##$SREGLST= <1H.CDCl3>
##$SSB= 0
##$STSI= 131072
##$STSR= 0
##$SW_p= 8223.68421052631
##$SYMM= 0
##$S_DEV= 0
##$TDeff= 65536
##$TDoff= 0
##$TI= <>
##$TILT= no
##$TM1= 0
##$TM2= 0
##$TOPLEV= 0
##$USERP1= <user>
##$USERP2= <user>
##$USERP3= <user>
##$USERP4= <user>
##$USERP5= <user>
##$WDW= 1
##$XDIM= 131072
##$YMAX_p= 409629821
##$YMIN_p= -12069
##$CURPLOT= <Network HP LaserJet P1505>
##$CURPRIN= <$Network HP LaserJet P1505>
##$DFORMAT= <normdp>
##$LAYOUT= <+/1D_H.xwp>
##$LFORMAT= <normlp>
##$PFORMAT= <normpl>
##$SURQMSG= 1
$$ End of Bruker specific parameters
$$ ---------------------------------
##NTUPLES= NMR SPECTRUM
##VAR_NAME=  FREQUENCY,     SPECTRUM/REAL,   SPECTRUM/IMAG
##SYMBOL=    X,             R,               I
##VAR_TYPE=  INDEPENDENT,   DEPENDENT,       DEPENDENT
##VAR_FORM=  AFFN,          ASDF,            ASDF
##VAR_DIM=   131072,        131072,          131072
##UNITS=     HZ,            ARBITRARY UNITS, ARBITRARY UNITS
##FACTOR=    0.0627417313425164, 1,          1
##FIRST=     8223.62146879497, 1066,         -57700
##LAST=      0,             3553,            -57312
##MIN=       0,             -12069,          0
##MAX=       8223.62146879497, 409629821,    0
$$ Real data points
##PAGE= N=1
##DATA TABLE= (X++(R..R)), XYDATA
$$ [...]
63966E33513J2611J3619J4934J6543J8415K0403K2389K4448K6827K9747L3293
63955G66742L7482M2424M8358N5417O3514P2597Q2987R5125J08979J23991J39722
63944A637338J56090J72810J88992K03655K16363K26993K35205K40492K42466
63935C520404K40593K33851K21283K02916J79754J52776J22425Q9054N3417J6535
63925E033008k0673n7376r2724j25891j56078j82402k03929k20007k30543k35943
63915C507442k36879k34015k27813k18536k06542j92468j77052j60880j44448
63906A708809j28326j13030r8784q5724p4187o4541n6685m9979m3787l7943l2699
63895I23124k8409k5281k3272k2124k1594k1580k1921k2221k2063k1403k0515
$$ plain form
63966 533513 546124 559743 574677 591220 609635 630038 652427 676875 703702 733449 766742
63955 766742 804224 846648 895006 950423 1013937 1086534 1169521 1264646 1373625 1497616 1637338
63944 1637338 1793428 1966238 2155230 2358885 2575248 2802241 3037446 3277938 3520404
63935 3520404 3760997 3994848 4216131 4419047 4598801 4751577 4874002 4963056 5016473 5033008
63925 5033008 5012335 4954959 4862235 4736344 4580266 4397864 4193935 3973928 3743385 3507442
63915 3507442 3270563 3036548 2808735 2590199 2383657 2191189 2014137 1853257 1708809
63906 1708809 1580483 1467453 1368669 1282945 1208758 1144217 1087532 1037553 993766 955823 923124
63895 923124 894715 869434 846162 824038 802444 780864 758943 736722 714659 693256 672741
63884F72741j9649j8808j7865j6634j4951j2876j0755q894p222n493l648j742
63872E34204K96K511M630O343P757R108J0105J0106R164Q331Q553R567J0191R547
63858F40413P806N934M854M700M687L809J849m27k063k739k881l208m277o140
63844F52317q236r854j0823j1586j2544j3645j4677j5592j6318j6686j6775j6939
63832D88642j7239j7214j6666j6138j6117j6075j5123j3347j1722j0669r631q256
63820C20445p180p051p432p288o274m925l834l184k954l011l017k684k129j641
63806B57841j187n70PQ4l11o27n82n48q49j273j553j821k124k040j331o85j039
63789B41392k277l312l409k882k278j645q46j69j18p61j573j935j657j096p43
$$ plain form
63884 672741 653092 634284 616419 599785 584834 571958 561203 552309 545087 539594 535946 534204
63872 534204 534500 537011 541641 547984 555741 564849 574954 585060 594224 602555 611108 620675 630866 640413
63858 640413 648219 654153 659007 663707 668394 672203 674052 673625 671562 668823 665942 662734 658457 652317
63844 652317 644081 634227 623404 611818 599274 585629 570952 555360 539042 522356 505581 488642
63832 488642 471403 454189 437523 421385 405268 389193 374070 360723 349001 338332 328701 320445
63820 320445 313265 306214 298782 291494 285220 280295 276461 273277 270323 267312 264295 261611 259482 257841
63806 257841 256654 256084 256091 256175 255864 255237 254655 254107 253258 251985 250432 248611 246487 244447 243116 242431 241392
63789 241392 239115 235803 232394 229512 227234 225589 224743 224574 224456 223695 222122 220187 218530 217434 216691
63774B16691o31l33L36Q27N49k11o55o72q80j427j577q52J18M86K87J08J24K03
63756B12491M06P27O44j50q82m62Q99J788J466P84Q54J562J933J506P66L95N97
63739B25324J114J636K087K545K855K628J782R61R04J559K246K632K951L205K984
63724B57413K300J937K428L272L711L787L976M181L927L377L183L267K642Q31
63710C00232j303k613l048l288l458k992j782o38l27o85j069j202j127o29N13
63695B76584J837K431K104J711K010K721L114L095L071L089K835K418K355K631
63681C12006K461J338k05j295j771j981j950j336k07P81J145J075R90R36P05L15
63665C13007J4j29l35p45j209j527j700j845j971k114k490l253m061m252l592
$$ plain form
63774 216691 216060 215727 216063 216890 217439 217228 216573 215901 215021 213594 212017 211165 211283 211769 212056 212164 212288 212491
63756 212491 212897 213624 214268 214118 213236 212774 213673 215461 216927 217711 218565 220127 222060 223566 224332 224727 225324
63739 225324 226438 228074 230161 232706 235561 238189 239971 240932 241836 243395 245641 248273 251224 254429 257413
63724 257413 259713 261650 264078 267350 271061 274848 278824 283005 286932 290309 293492 296759 299401 300232
63710 300232 298929 296316 293268 289980 286522 283530 281748 281110 280783 280098 279029 277827 276700 276071 276584
63695 276584 278421 280852 282956 284667 286677 289398 292512 295607 298678 301767 304602 307020 309375 312006
63681 312006 314467 315805 315600 314305 312534 310553 308603 307267 307060 307841 308986 310061 311051 311987 312692 313007
63665 313007 313021 312892 312557 311812 310603 309076 307376 305531 303560 301446 298956 295703 291642 287390 283798
63650B83798k647k176k286k417k107j503j085j021r31l61N80J243J236R97J267
63635B72587K120K873L043K896K947L331L970M868N869O520O630O700P311Q325
63621C39990R167R715J0308J1075J1845J2664J3813J5282J6775J8280K0106K2257
63609E11277K4312K6046K7673K9371L1016L2419L3328L3102L0990K6921K1588
63598H28043J5656R549M019J9k398m248o194p668q058p984q536r856j1498j3754
63584G77092j7364k1891k5568k7130k7001k6284k5332k3832k1747j9460j7201
63573E24282j4896j2526j0253q161o137m109k196n33R51K444M028N617P095Q383
63559D93989R275R477R059Q704R131J0278J1467J2467J3892J6339J9579K2965
$$ plain form
63650 283798 281151 278975 276689 274272 272165 270662 269577 268556 267625 267264 267844 269087 270323 271320 272587
63635 272587 274707 277580 280623 283519 286466 289797 293767 298635 304504 311024 317654 324354 331665 339990
63621 339990 349157 358872 369180 380255 392100 404764 418577 433859 450634 468914 489020 511277
63609 511277 535589 561635 589308 618679 649695 682114 715442 748544 779534 806455 828043
63598 828043 843699 853248 857267 857286 854888 850640 844446 836778 828720 820736 812200 802344 790846 777092
63584 777092 759728 737837 712269 685139 658138 631854 606522 582690 560943 541483 524282
63573 524282 509386 496860 486607 478446 472309 468200 466004 465471 466422 468866 472894 478511 485606 493989
63559 493989 503264 512741 521800 530504 539635 549913 561380 573847 587739 604078 623657 646622
63547F46622K6246K9498L2605L5329L7590L9058L8599L4966K8220J9932J1828
63536I80493M669j408o174r360j1006j1357j0658r442q665r091j0642j2834j5680
63523H68845j9619k4487k9100l2206l3585l3921l3781l3065l1462k9060k6409
63512E42150k4090k2323k0901j9402j7534j5294j2903j0593q618p281o644o244
63500C70323n428m194l308l287l603l307k194q81R9O18N29k57j125j035R1R78
63484C44019N72n69j093n42N54J809L172M146L993K890J965J759J502M40q48j280
63468C62489r37r93k028l251l564k940k338k562l449m107l802k613j273m49j65
63453C28018K9N48J475K591L566M194M667N446O659P765Q136P938Q012Q823R935
$$ plain form
63547 646622 672868 702366 734971 770300 807890 846948 885547 920513 948733 968665 980493
63536 980493 985162 983754 977580 968220 957214 945857 935199 925757 917092 908001 897359 884525 868845
63523 868845 849226 824739 795639 763433 729848 695927 662146 629081 597619 568559 542150
63512 542150 518060 495737 474836 455434 437900 422606 409703 399110 390492 383211 376567 370323
63500 370323 364895 360701 357393 354106 350503 347196 345002 344121 344220 344838 345367 345110 343985 342950 343041 344019
63484 344019 344591 344022 342929 342387 342941 344750 347922 352068 356061 358951 360916 362675 364177 364617 363769 362489
63468 362489 361552 360559 358531 355280 351716 348776 346438 343876 340427 336320 332518 329905 328632 328183 328018
63453 328018 328047 328595 330070 332661 336227 340421 345088 350534 357193 364958 373094 381032 389044 397867 407802
63438D07802J0704J1140J1730J2757J4221J6220J8864K1705K3777K4404K3666
63427E96990K1910J9236J5831J2562J0698J0897J2710J5150J7603K0193K3401
63416G77181K7418L1789L5664L8374L9685L9472L7404L3160K6829J9003J0628
63405A116607K912l004o720q826j0171j1045j1384j1564j2315j3971j6349j9462
63393I94708k3643k8653l3301l6344l7442l6937l5221l2753l0276k8345k6721
63382F45072k4763k2281j9632j7048j4378j1514q666o050l566j022J496L641N252
63369E26541O696Q591J0993J3074J4013J4180J4861J6633J8661J9969K0862K2409
63357G07483K4955K7908L0800L3710L6491L8350L8536L6937L3766K9062K2895
$$ plain form
63438 407802 418506 429646 441376 454133 468354 484574 503438 525143 548920 573324 596990
63427 596990 618900 638136 653967 666529 677227 688124 700834 715984 733587 753780 777181
63416 777181 804599 836388 872052 910426 950111 989583 1026987 1060147 1086976 1105979 1116607
63405 1116607 1119519 1116515 1109795 1100969 1090798 1079753 1068369 1056805 1044490 1030519 1014170 994708
63393 994708 971065 942412 909111 872767 835325 798388 763167 730414 700138 671793 645072
63382 645072 620309 598028 578396 561348 546970 535456 526790 520740 517174 516152 517648 521289 526541
63369 526541 533237 541828 552821 565895 579908 594088 608949 625582 644243 664212 685074 707483
63357 707483 732438 760346 791146 824856 861347 899697 938233 975170 1008936 1037998 1060893
63346A060893J5786Q570J952l651p945j0720j1993j2149j1862j1857j2581j4168
63334I90275j6653k0058k4072k7905l0744l2342l2910l2639l1609l0001k8020
63323F83322k5612k2641j9341j6178j3286j0479p851o018n588o679r004j1960
63311E28685j4592j5914j5648j4446j3175j2190j1414j0694r824q499o625m560
63299C91104k783j461n17L6L6n87j668k845l685l921l711l525l649l972m259m406
63283C50187m320l855l123k628k793l374l652l102j795k34R42J236O33l30r28
63268C22864q40k95L37R04J467K053K484K528K254K136K644L680M592M944N004
63253C56756N310N915O379O435O351O543P095P832Q640R540J0457J1235J1902
$$ plain form
63346 1060893 1076679 1085249 1087201 1083550 1075605 1064885 1052892 1040743 1028881 1017024 1004443 990275
63334 990275 973622 953564 929492 901587 870843 838501 805591 772952 741343 711342 683322
63323 683322 657710 635069 615728 599550 586264 575785 567934 561916 556328 549649 540645 528685
63311 528685 514093 498179 482531 468085 454910 442720 431306 420612 410788 402289 395664 391104
63299 391104 388321 386860 386343 386379 386415 385828 384160 381315 377630 373709 369998 366473 362824 358852 354593 350187
63283 350187 345867 342012 338889 336261 333468 330094 326442 323340 321545 321311 322253 323489 324122 323792 322864
63268 322864 322024 321729 322066 322970 324437 326490 328974 331502 333756 335892 338536 342216 346808 351752 356756
63253 356756 362066 367981 374360 380795 387146 393689 400784 408616 417256 426796 437253 448488 460390
63240D60390J2822J4371J6519J8880K1135K3236K5221K7007K8525K9817L0865
63229G08788L1430L1345L0858L0480L0450L0518L0223K9269K7761K6333K5854
63218A033309K6638K7958K8634K8145K6800K4920K2291J8643J4159R216L872k068
63206A262517q643j5570k2284k8046l2308l5251l7551l9416m0190l9245l6949
63195I27064l4173l1219k7832k4108k0654j7842j5530j3604j2106j0573q069m390
63183G06964o66J847L200M357N658O553O780O943P604Q416Q642Q148P425O908
63169G88779O684O669O625O111M775K752M24k079m843p761j0527j3050j5402j7355
63155G51802j8494j8906j9231j9747j9924j9244j8007j6819j5649j4047j2047
$$ plain form
63240 460390 473212 487583 504102 522982 544117 567353 592574 619581 648106 677923 708788
63229 708788 740218 771563 802421 832901 863351 893869 924092 953361 981122 1007455 1033309
63218 1033309 1059947 1087905 1116539 1144684 1171484 1196404 1218695 1237338 1251497 1260713 1264585 1262517
63206 1262517 1253874 1238304 1216020 1187974 1155666 1120415 1082864 1043448 1003258 964013 927064
63195 927064 892891 861672 833840 809732 789078 771236 755706 742102 729996 719423 711354 706964
63183 706964 706298 708145 711345 715702 721360 727913 734693 741636 749240 757656 766298 774446 781871 788779
63169 788779 795463 802132 808757 814868 819643 822395 822819 820740 815897 808136 797609 784559 769157 751802
63155 751802 733308 714402 695171 675424 655500 636256 618249 601430 585781 571734 559687
63144E59687j0202q723p246n617m329l845l887l720k984j945j059n15j75J75O06
63129E06221J094J745K775M110N242N773N990O507P368P925P689O932O260N910
63115E81541N655N200M443L502K648K088J731J328Q60N62N21N00L11J04J48M71
63099F11613Q48J000P56K12k28k32jl9l76m47K1M82K56m73q09j92J026K064K488
63080F17969K545K890L954N529O996Q000Q748R575J0543J1474J2179J2486J2435
63067G25323J2513J3316J4780J6200J7305J8830K1468K4799K7815L0265L2763
63056I55377L5770L9236M3154M7643N2421N6920O1038O5096O8837P1338P2263
63045A569093P2454P2718P2734P1882P0480O9289O8171O6359O3980O2283O1980
$$ plain form
63144 559687 549485 540762 533516 527899 523570 519725 515838 512118 509134 507189 506130 505615 505440 505615 506221
63129 506221 507315 509060 511835 515945 521187 526960 532950 539457 546825 554750 562439 569371 575631 581541
63115 581541 587196 592396 596839 600341 602989 605077 606808 608136 608996 609558 610079 610579 610890 610994 611142 611613
63099 611613 612461 613461 614217 614429 614201 613969 613968 613929 613553 613106 613127 613609 613865 613392 612583 612391 613417 615481 617969
63080 617969 620514 623404 627358 632887 639883 647883 656631 666206 676749 688223 700402 712888 725323
63067 725323 737836 751152 765932 782132 799437 818267 839735 864534 892349 922614 955377
63056 955377 991147 1030383 1073537 1121180 1173601 1230521 1291559 1356655 1425492 1496830 1569093
63045 1569093 1641547 1714265 1786999 1858881 1929361 1998650 2066821 2133180 2197160 2259443 2321423
63034B321423O2215O1606N9659N6603N2393M6562L8906K9585J8580N623r130k4686
63022B719339l9732n3421o5539p6099q4938r1643r5796r7307r6502r3865q9729
63011A834768q4246p7576o9975o1773n3433m5515l8362l1809k5416j9024j2905
63000A314734p437k851P63L485N655P603R257J0356J1038J1760J2489J2527J1516
62987A400895J0078R031Q317P292N722L767J261k241o568j0920j4896j8974k3573
62974A369191k8214l2040l4767l6654l7800l8008l7264l5965l4493l2860l0842
62963I90284k8384k5739k3238k1045j9204j7916j7458j7720j8019j7685j6682
62952G67194j5414j4113j2866j2077j2269j3251j4003j3732j2675j1642j1048
$$ plain form
63034 2321423 2383638 2445244 2504903 2561506 2613899 2660461 2699367 2728952 2747532 2753155 2744025 2719339
63022 2719339 2679607 2626186 2560647 2484548 2399610 2307967 2212171 2114864 2018362 1924497 1834768
63011 1834768 1750522 1672946 1602971 1541198 1487765 1442250 1403888 1372079 1346663 1327639 1314734
63000 1314734 1307297 1304446 1305209 1308694 1314349 1321952 1331209 1341565 1352603 1364363 1376852 1389379 1400895
62987 1400895 1410973 1420004 1428321 1435613 1441335 1445102 1446363 1444122 1437554 1426634 1411738 1392764 1369191
62974 1369191 1340977 1308937 1274170 1237516 1199716 1161708 1124444 1088479 1053986 1021126 990284
62963 990284 961900 936161 912923 891878 872674 854758 837300 819580 801561 783876 767194
62952 767194 751780 737667 724801 712724 700455 687204 673201 659469 646794 635152 624104
62941F24104j0729j0433j0113r734r121q092o734n466m730m492m223l535k664
62928E34038k056j657j129n55l66n48o43n60p03j041q56J18R68O74n73j761k376
62911E20974k686l011l374l793m270m529m270l695l292l143k867k319j818j645
62897D76262j658j592j395j141q54n84m80o44r32j025p30k91k40p08j054n69M50
62880D62815R51N80J84M84R72P93J53m6L57O58N23M07N73N00k72j326j773j242
62862D65291j92N79O35K45M0J89J13o31j472j362p5J570K727L163K892J959P87
62845D76458P5K6J13j34n64q43r55j016j009r78j058j115q05k12J31J22L06Q62
62827D69404J054L70m70m49K47O54O81J260K746M240M826M710M591M590M448M375
$$ plain form
62941 624104 613375 602942 592829 583095 573974 565882 559148 553682 548952 544460 540237 536702 534038
62928 534038 531982 530325 529196 528641 528275 527727 527084 526524 525821 524780 523924 524042 525010 525684 525111 523350 520974
62911 520974 518288 515277 511903 508110 503840 499311 495041 491346 488054 484911 482044 479725 477907 476262
62897 476262 474604 473012 471617 470476 469622 469038 468558 467914 466982 465957 465227 464936 464696 463988 462934 462365 462815
62880 462815 463766 464346 464530 465014 465986 466779 466932 466886 467243 467901 468424 468831 469404 469904 469632 468306 466533 465291
62862 465291 465099 465678 466313 466558 466598 466787 466900 466269 464797 463435 463360 464930 467657 470820 473712 475671 476458
62845 476458 476533 476559 476672 476538 475974 475131 474176 473160 472151 471173 470115 469000 468195 467983 468114 468236 468542 469404
62827 469404 470458 470828 470358 469909 470156 470810 471491 472751 475497 479737 484563 489273 493864 498454 502902 507277
62811E07277M898N990O938P193O985O918P255P783Q168Q337Q529R064J0074J1429
62797F16838J2959J4632J6376J7859J8748J9251K0141K2067K5064K8808L3074
62786H45817L7692M2373M7098N2461N9063O6528P3736Q0210Q6669R3838J01194
62775A586679J07453J11931J14806J16241J15869J13184J07912R9886Q8919P4927
62765B637807N7998L8422J7073m358k4135m1681n7656p2636q6156r7246j05432
62754B262000j10762j13292j13078j10656j06999j02835r8271r3128q7441q1508
62744A244030p5609o9829o4110n8360n2581m6916m1632l6935l2878k9440k6659
62733G09081k4506k2594k0340j7596j4936j2961j1508j0023q557p687p351o613
$$ plain form
62811 507277 512175 518165 525103 532296 539281 546199 553454 561237 569405 577742 586271 595335 605409 616838
62797 616838 629797 644429 660805 678664 697412 716663 736804 758871 783935 812743 845817
62786 845817 883509 925882 972980 1025441 1084504 1151032 1224768 1304978 1391647 1485485 1586679
62775 1586679 1694132 1806063 1920869 2037110 2152979 2266163 2374075 2473961 2562880 2637807
62765 2637807 2695805 2734227 2751300 2746942 2722807 2681126 2623470 2550834 2464678 2367432 2262000
62754 2262000 2151238 2037946 1924868 1814212 1707213 1604378 1506107 1412979 1325538 1244030
62744 1244030 1168421 1098592 1034482 976122 923541 876625 834993 798058 765180 735740 709081
62733 709081 684575 661981 641641 624045 609109 596148 584640 574617 566060 558373 551022 544409
62721E44409n035l503k992l090k674j630q10l54P65L195O189Q532R828J0467J1040
62706E74337J2213J4471J7417J9886K1433K3149K6249L0271L3612L5626L7147
62695H45811L8971M0754M1848M2391M2966M3593M3578M2210L9183L4502K8445
62684A284252K1569J4375O879j228r912j8546k6417l3199l8788m2885m5119m5639
62672A065342m5250m4827m4643m4317m3226m0929l7495l3687l0570k8584k7058
62661F44756k4960k2104j9282j7190j5655j4109j2456j1035r938q840p604o675
62649D74908o585p218p822p736o908n739m636l838l404l109k515j415j84O10Q19
62634D15228O68K64l62q13n48K28N94J66k59J31R76J324J053Q75J158J554J779
$$ plain form
62721 544409 539374 535871 532879 529789 527115 525485 524675 524321 525086 528281 534470 543002 552830 563297 574337
62706 574337 586550 601021 618438 638324 659757 682906 709155 739426 773038 808664 845811
62695 845811 884782 925536 967384 1009775 1052741 1096334 1139912 1182122 1221305 1255807 1284252
62684 1284252 1305821 1320196 1327075 1325847 1315935 1297389 1270972 1237773 1198985 1156100 1110981 1065342
62672 1065342 1020092 975265 930622 886305 843079 802150 764655 730968 700398 671814 644756
62661 644756 619796 597692 578410 561220 545565 531456 519000 507965 498027 489187 481583 474908
62649 474908 468323 461105 453283 445547 438639 432900 428264 424426 421022 417913 415398 413983 413799 414409 415228
62634 415228 415896 416160 415798 414985 414437 414665 415259 415425 415166 415297 416273 417597 418650 419525 420683 422237 424016
62617D24016K060K645L456M358N315O232P054P972R080R941J0148J0235J1250
62604E13762J3280J5276J6595J7877J9892K2342K4540K6735K9879L4272L9128
62593G73578M3509M7174N0458N3675N6634N8502N8265N5556N0894M4988L7959
62582A331192K9654K0419J1094K131o773j6009k5156l3118l9132m3516m7159n0314
62570A133313n2245n2229n0560m8179m5632m2945m0321l8141l6166l3566l0118
62559F63211k6679k3997k1635j8740j5463j2848j1445j0701r835q730p781p147
62547D88210o489n382l880k568j997k090k253j990j267l05N39P47Jj234j908j546
62531D56588q04n51p43o18K16J432K606L654M667N669O715Q020R806J1982J4086
$$ plain form
62617 424016 426076 428721 432177 436535 441850 448082 455136 463108 472188 482129 492277 502512 513762
62604 513762 527042 542318 558913 576790 596682 619024 643564 670299 700178 734450 773578
62593 773578 817087 864261 914719 968394 1025028 1083530 1141795 1197351 1248245 1293233 1331192
62582 1331192 1360846 1381265 1392359 1394490 1387717 1371708 1346552 1313434 1274302 1230786 1183627 1133313
62570 1133313 1081068 1028839 978279 930100 884468 841523 801202 763061 726895 693329 663211
62559 663211 636532 612535 590900 572160 556697 543849 532404 521703 511868 503138 495357 488210
62547 488210 481721 476339 472459 469891 467894 465804 463551 461561 460294 459989 460528 461275 461276 460042 458134 456588
62531 456588 455784 455233 454490 453872 454088 455520 458126 461780 466447 472116 478831 486851 496657 508639 522725
62516E22725J5631J6680J7946K0079K2880K5436K7113K8091K8915K9767L0280
62505G85543K9863K8195K5655K3122K1078J9002J6108J2471Q865N638K544k77
62493I77807k066k439j811m36K148O224J1209J6412K1741K7166L2202L6642M1122
62480A165921M6032N0485N3339N4808N5937N6634N5232N0185M1539L0793J9864
62469A680769J0044J231p962j8810l1121m3481n4472o3154o8845p1397p1684p0953
62457A190165o9569o6932o2671n7320n1662m6044m0454l4938k9742k5278k1783
62446F83772j8824j5493j1540p849n292l510j640K76J593K491L852N726P068P233
62432F47863O642N690M073J705o98k655m701p316r713j0622j0001r145r164r955
$$ plain form
62516 522725 538356 555036 572982 593061 615941 641377 668490 696581 725496 755263 785543
62505 785543 815406 843601 869256 892378 913456 932458 948566 961037 969902 975540 978084 977807
62493 977807 975741 973302 971491 971055 973203 979427 990636 1007048 1028789 1055955 1088157 1124799 1165921
62480 1165921 1211953 1262438 1315777 1370585 1426522 1483156 1538388 1588573 1630112 1660905 1680769
62469 1680769 1690813 1692044 1684082 1665272 1634151 1590670 1536198 1473044 1404199 1332802 1261118 1190165
62457 1190165 1120596 1053664 990993 933673 882011 835967 795513 760575 730833 705555 683772
62446 683772 664948 649455 637915 630066 624774 621264 619624 619900 621493 623984 627836 633562 640630 647863
62432 647863 654505 660195 664268 665973 665275 662620 657919 650603 640890 630268 620267 611122 601958 592003
62418E92003j0691j0838j0500j0103r878r686r256q534p643o669n684m876m405
62405D83240m219m266m628n084m906l706k212j494j453r84L33J597J932J593J328
62390D57071J376J605K044K620K842K446K003K306L296M153M417M508N124O378
62376E02189P714Q575R060R787J0982J2064J2381J2176J2252J2853J3577J4395
62364F38005J5940J8488K1411K4065K6668K9809L3522L7334M0965M4508M8111
62353I78826N1763N5134N7513N8091N6502N2783M6922L9005K9905K1001J2892
62342A460337N069k838j0243j6646k2580k8677l4372l8506m0832m1972m2135m0987
62330A145618l8747l6310l4068l1447k8035k4387k1368j9179j7607j6691j6636
$$ plain form
62418 592003 581312 570474 559974 549871 539993 530307 521051 512517 504874 498205 492521 487645 483240
62405 483240 479021 474755 470127 465043 460137 456431 454219 452725 451272 450288 450621 452218 454150 455743 457071
62390 457071 458447 460052 462096 464716 467558 470004 472007 474313 477609 481762 486179 490687 495811 502189
62376 502189 509903 518478 527538 537325 548307 560371 572752 584928 597180 610033 623610 638005
62364 638005 653945 672433 693844 717909 744577 774386 807908 845242 886207 930715 978826
62353 978826 1030589 1085723 1143236 1201327 1257829 1310612 1357534 1396539 1426444 1447445 1460337
62342 1460337 1465406 1462568 1452325 1435679 1413099 1384422 1350050 1311544 1270712 1228740 1186605 1145618
62330 1145618 1106871 1070561 1036493 1005046 977011 952624 931256 912077 894470 877779 861143
62319H61143j7196j7754j8019j8299j8948j9784k0163j9657j8510j7340j6392
62308F59081j5242j3313j0657q013o094m961m125l208k289j609j108m76L80J156
62294E89522J600J803J892J674R41o7q80j300j357r82k49J99k65j196j312j4J879
62277E91888L160L482L312L231L642M680N972O875P298P877R044J0461J1771J3367
62263F86060J5773J8725K1529K4067K6786K9892L3221L6811M0927M5544N0283
62252A029618N4803N8761O1444O2027O0225N6256N0259M2276L2921K3415J4668
62241A546673O602j409r764j8380k6844l4633m1400m7187n2142n5963n7917n7632
62229A150004n5630n2885m9940m6612m2586l8010l3530k9674k6363k3091j9661
$$ plain form
62319 861143 843947 826193 808174 789875 770927 751143 730980 711323 692813 675473 659081
62308 659081 643839 630526 619869 611856 605762 600801 596676 593468 591179 589570 588462 587986 588366 589522
62294 589522 591122 592925 594817 596491 597432 597365 596485 595185 593828 592846 592597 592796 592531 591335 590023 590009 591888
62277 591888 595048 598530 601842 605073 608715 613395 619367 626242 633540 641417 650461 660922 672693 686060
62263 686060 701833 720558 742087 766154 792940 822832 856053 892864 933791 979335 1029618
62252 1029618 1084421 1143182 1204626 1266653 1326878 1383134 1433393 1475669 1508590 1532005 1546673
62241 1546673 1553275 1551866 1542102 1523722 1496878 1462245 1420845 1373658 1321516 1265553 1207636 1150004
62229 1150004 1094374 1041489 991549 944937 902351 864341 830811 801137 774774 751683 732022
62218G32022j6557j4472j3513j2993j2049j0334q216o361n224m771m628m369l741
62205F14794k816k013j736j820j500j93J810L760N319O596P546P979Q145Q583
62191F54454R235R418Q960Q619R002R663R843R576R454R709J0204J0962J2000
62178G81099J2799J2629J1394R669Q018O788O330O836P955R181J0653J3036J6613
62165I13000K0943K5509L0126L4530L8105M0361M1382M1476M0463L7622L2439
62154A295956K5296J7398R911L266k677p975j2529j6627k0970k5803l0423l3914
62142A200909l6033l6977l6679l4947l2196k9341k6916k4604k1749j8106j4092
62131H89269j0537q013o315m840l607l378m411n638n747m688l392k355j300j57
$$ plain form
62218 732022 715465 700993 687480 674487 662438 652104 643888 637527 632303 627532 622904 618535 614794
62205 614794 611978 609965 608229 606409 604909 604716 606526 610286 615605 622201 629747 637726 645871 654454
62191 654454 663689 673107 682067 690686 699688 709351 719194 728770 738224 747933 758137 769099 781099
62178 781099 793898 806527 817921 827590 835608 842396 848726 855562 863517 872698 883351 896387 913000
62165 913000 933943 959452 989578 1024108 1062213 1102574 1143956 1185432 1225895 1263517 1295956
62154 1295956 1321252 1338650 1348561 1351827 1349150 1341175 1328646 1312019 1291049 1265246 1234823 1200909
62142 1200909 1164876 1127899 1091220 1056273 1024077 994736 967820 943216 921467 903361 889269
62131 889269 878732 870719 864404 859564 855957 852579 848168 842530 836783 832095 828703 826348 825048 824891
62117H24891O48R39J068J194R18j67j965m023n684o137n045l229k106k319l484
62102G95499n213p498r878j1272j1219j0431r545q044n366k385p16p31j273j269
62088G10659q40o07p37r43r11l58Q72K482L800M507N035N989P428Q936J0258J1441
62072G67011J2571J3685J4951J6487J7977J8918J9424K0425K2645K5671K8466
62061I78231L0584L2337L3771L4142L2752K9787K5885K1197J5439Q805K195l613
62049A241512q696j3607j8516k3038k6880l0354l3986l7721m0817m2603m3049
62038I22245m2431m0799l8241l5393l3057l1280k9346k6830k4073k1472j8867
62027E80456j6038j3332j1331j0155r466q949q451p948p538p338p172o715o064
$$ plain form
62117 824891 825539 826478 827546 828740 829658 829491 827526 823503 817819 811682 806637 803408 801302 798983 795499
62102 795499 790286 782788 772910 761638 750419 739988 730443 722399 717033 714648 713932 713201 711928 710659
62088 710659 709819 709212 708475 707532 706621 706263 707135 709617 713417 717924 722959 728948 736376 745312 755570 767011
62072 767011 779582 793267 808218 824705 842682 861600 881024 901449 924094 949765 978231
62061 978231 1008815 1041152 1074923 1109065 1141817 1171604 1197489 1218686 1234125 1242930 1245125 1241512
62049 1241512 1232816 1219209 1200693 1177655 1150775 1120421 1086435 1048714 1007897 965294 922245
62038 922245 879814 839015 800774 765381 732324 701044 671698 644868 620795 599323 580456
62027 580456 564418 551086 539755 529600 520134 511185 502734 494786 487248 479910 472738 466023 459959
62014D59959n681n611n318m581l938l820l869l637l279k965k261q90M75J114J462
61999D17160K349L451L670K891K171K128K238J983J662J665J780J583R37k28j973
61984D43467l941n483o379o884o947o126m576l349l257m022m866n350n226m158
61970C72903k213l18M46j19j262k059k031j236j22P85J233J272J097R52J039J174
61954C71541Q05j90r75p12K06O66M95O23J446K106J898J435J724K738L672M221
61938C91699M818N818P016P959Q412Q552Q788R296R688R406Q462P376O435N491
61924D99216M481L596K801J813O41m19j452k830m290m836m009k528j342n98N8
61909D90302P89J634K725M013N262O509P946R146R206Q002O529N497M464K920
$$ plain form
62014 459959 454278 448667 443349 438768 434830 431010 427141 423504 420225 417260 414999 414109 414584 415698 417160
61999 417160 419509 422960 426630 429521 431692 433820 436058 438041 439703 441368 443148 444731 445668 445440 443467
61984 443467 439526 434043 427664 420780 413833 407707 403131 399782 396525 392503 387637 382287 377061 372903
61970 372903 370690 370372 370818 370699 369437 367378 365347 364111 363989 364774 366007 367279 368376 369328 370367 371541
61954 371541 372346 372156 371181 370469 370675 371341 371836 372459 373905 376011 377909 379344 381068 383806 387478 391699
61938 391699 396517 402335 409351 417310 425722 434274 443062 452358 462046 471452 479914 487290 493725 499216
61924 499216 503697 507293 510094 511907 512548 512129 510677 507847 503557 498721 494712 492184 490842 490244 490302
61909 490302 491091 492725 495450 499463 504725 511234 519180 528326 537532 545534 552063 557560 562024 564944
61895E64944J281J68o09j473k245k709l296m363n265n164m232l268k548k002j983
61880E27236k796l849m309m407n026o231p233p664p825p816p352o525n711m803
61866D45689l428j987j343j396j037K23J595K369K927L879N021N824O417P365
61852D72118Q857J0591J2185J3337J3897J4090J4423J5046J5469J5155J4136J2820
61840F32124J1404R711P481M716J827n75k152l120l892m555m983n204n222m642
61826F32918l030o31J790L794N484O833P440P153O399N600M615L029P37j918m383
61811F75830o233p487q515r437r757r054p831p024o771o387n673n444o385q010
61797E71822r264r701r599r249q656p789o718n605m684m171l948l588k940k475
$$ plain form
61895 564944 566225 566393 565784 564311 562066 559357 556061 551698 546433 541269 537037 533769 531221 529219 527236
61880 527236 524440 520591 516282 511875 506849 500618 493385 485721 477896 470080 462728 456203 450492 445689
61866 445689 442261 440274 438931 437535 436498 436721 438316 440685 443612 447491 452512 458336 464753 472118
61852 472118 480975 491566 503751 517088 530985 545075 559498 574544 590013 605168 619304 632124
61840 632124 643528 653239 660720 665436 667263 666688 664536 661416 657524 652969 647986 642782 637560 632918
61826 632918 629888 629257 631047 634841 640325 647158 654598 661751 668150 673750 678365 681394 682131 680213 675830
61811 675830 669597 662110 653595 644158 634401 625347 617516 610492 603721 597334 591661 586217 579832 571822
61797 571822 562558 552857 543258 534009 525353 517564 510846 505241 500557 496386 492438 488850 485910 483435
61783D83435k732l518l972l479k317j300q77p80o22n33q79j425j367l96P49J178
61767D61165Q70M11J92L75J220K655L872M202M156M764O011O883O945O746O513
61752E16980N611L758J764M30n09j634k719l138k942k839l334m352n461o086n895
61737D89634n297n091n291m900l380j670j037j407j690j380r14o60m66k74l34
61722D55843o38p08j95P40J694K333K441K082J720J751J977J902J508J229J180
61707D74859R45K63o24j433k236l080l644l622l219l022l367m054m619m751m448
61692D33948l889l286k908l068l697m111l625k571k068k581l348l617l706m078
61678C87395m148l172j833j536k197k174p36Q04J074M78J93L81M86N27Q73J211
$$ plain form
61783 483435 480703 477185 473213 469734 467417 466117 465240 464460 463838 463305 462426 461001 459634 459238 459987 461165
61767 461165 462035 462446 462638 463013 464233 466888 470760 474962 479118 483882 489893 496776 503721 510467 516980
61752 516980 522591 526349 528113 528543 528034 526400 523681 520543 517601 514762 511428 507076 501615 495529 489634
61737 489634 484337 479246 473955 469055 465675 464005 462968 461561 459871 458491 457577 456917 456451 456177 455843
61722 455843 455205 454497 454302 455042 456736 459069 461510 463592 465312 467063 469040 470942 472450 473679 474859
61707 474859 475804 476067 475443 474010 471774 468694 465050 461428 458209 455187 451820 447766 443147 438396 433948
61692 433948 430059 426773 423865 420797 417100 412989 409364 406793 404725 402144 398796 395179 391473 387395
61678 387395 383247 380075 378242 376706 374509 372335 371599 372403 373477 373955 374148 374529 375015 375542 376415 377626
61662C77626R62M24L88Q08R36P31R87J904K672K802K814L226L686L706L436L132
61646D10240K514J365J65m73o17o16m09J75P74R37Q43R03R41N66Q7K33J036J806
61628D20470K181K318K025P08j452l180l501k870k435k672l251l785m118m158
61614C96280l946l745l677l519l159k986l350l906l994l605l377l650l951l706
61600C45709l087k836l302l915l766k711j597j277j601j773j503j247j269j172
61586C14653o80l05o53j418j681j137m49l46p69j111j028p87q42j200j367j004
61570B99876m14j02j6L05R25J388J466J396J314J115J115J950L269L468J635q98
61554C17792j912q90P46J673J827J599J075L73j18k97m88p43o46p5M16L81J35
$$ plain form
61662 377626 378588 379012 379400 380208 381144 381875 382862 384766 387438 390240 393054 396280 399966 403672 407108 410240
61646 410240 412754 414119 414284 413811 413194 412578 412169 412344 413118 414055 414898 415801 416742 417308 417395 417628 418664 420470
61628 420470 422651 424969 426994 427702 426250 423070 419569 416699 414264 411592 408341 404556 400438 396280
61614 396280 392334 388589 384912 381393 378234 375248 371898 367992 363998 360393 357016 353366 349415 345709
61600 345709 342622 339786 336484 332569 328803 326092 324495 323218 321617 319844 318341 317094 315825 314653
61586 314653 313973 313668 313015 311597 309916 308779 308330 307984 307215 306104 305076 304289 303447 302247 300880 299876
61570 299876 299462 299360 299344 299649 300574 301962 303428 304824 306138 307253 308368 310318 313587 317055 318690 317792
61554 317792 315880 314990 315736 317409 319236 320835 321910 322283 322165 321868 321380 320637 319991 319916 320332 320713 320848
61537C20848K89R99J918K576K504J521J19q10r67q90j002r68m18K22L04OO7O13
61519C26931R79P34K29j37n54j319k119k285j599m60O33J394J607J197N50L12
61503C26093O47J054J152J253J719K221K193J782J624J806J844J678J827K373
61489C49266K643K263J731J548J483J228J049J159J131O52K90O87J543K152K468
61474C71293K730K576J612M49M5K17n5r11j427j221j013j343j831k061k259k561
61458C64240k545k018j534j594j908j977j797j567j207o25nN01J003J467J540
61443C51974J137P43R00J642K579L158K889J844R69J172K063K395J874J525J994
61428C78858K523K196J272N57J82j28k23J97Q79J376J761K302K729K536J799J050
$$ plain form
61537 320848 321137 322136 324054 326630 329134 330655 330774 329964 328997 328107 327105 326137 325719 325941 326245 326251 326318 326931
61519 326931 327910 328644 328873 328736 328182 326863 324744 322459 320860 320400 321033 322427 324034 325231 325781 326093
61503 326093 326740 327794 328946 330199 331918 334139 336332 338114 339738 341544 343388 345066 346893 349266
61489 349266 351909 354172 355903 357451 358934 360162 361211 362370 363501 364153 364443 365130 366673 368825 371293
61474 371293 374023 376599 378211 378660 378705 378922 378867 377956 376529 375308 374295 372952 371121 369060 366801 364240
61458 364240 361695 359677 358143 356549 354641 352664 350867 349300 348093 347468 347463 347964 348967 350434 351974
61443 351974 353111 353854 354754 356396 358975 362133 365022 366866 367835 369007 371070 373465 375339 376864 378858
61428 378858 381381 383577 384849 385406 385588 385460 385237 385434 386313 387689 389450 391752 394481 397017 398816 399866
61412C99866N69K93J98K39J13l98j037j380j301q28K3Q60Q34l56j779k244j664
61395C92008q36j51O74J667K307K330K181K361K738K785K274J569J247J508J931
61380D16593J902J334P52O26R28J377J733J723J142K40l93n36n24n30k70K67M15
61363D26779k82j286j744j578j313j179j002o91k48M92J562K528K993L221L713
61348D31965M318M291L208J416k89j143p75M33J558J982J903J781J724J716J987
61333D56075K617L144L088K553J892J206O57P07J406J910J528Q41R40J839K635
61318D83038K982L422M293N203N785O158O510O873P410Q348R462J0252J0728J1428
61304E81892J2602J3825J4509J4353J3264J1348R030O693M310J784m58j830k529
$$ plain form
61412 399866 400435 400728 400926 401165 401278 400880 399843 398463 397162 396334 396357 397217 398051 397695 395916 393672 392008
61395 392008 391172 391021 391695 393362 395669 397999 400180 402541 405279 408064 410338 411907 413154 414662 416593
61380 416593 418495 419829 420581 421207 422135 423512 425245 426968 428110 428350 427957 427421 426897 426367 426097 426364 426779
61363 426779 426497 425211 423467 421889 420576 419397 418395 417704 417456 417948 419510 422038 425031 428252 431965
61348 431965 436283 440574 443782 445198 444909 443766 442991 443424 444982 446964 448867 450648 452372 454088 456075
61333 456075 458692 461836 464924 467477 469369 470575 471232 471939 473345 475255 476783 477624 478564 480403 483038
61318 483038 486020 489442 493735 498938 504723 510881 517391 524264 531674 540022 549484 559736 570464 581892
61304 581892 594494 608319 622828 637181 650445 661793 670823 677516 681826 683610 683152 681322 678793
61291F78793l419m978o857q504r689j0345j0498j0395j0267r972r341q672q334
61278E67522q006p052n598m437l813l117j983r33n64p11p73m60R7N64N65N8l46
61261E31013J23J448K769L420L545L502L239K582J739J179J166J494J655J250
61247E60124N19K43Q24J639J787J308J018J268J573J528J345J277J089M99k68
61232E75773o69l54N77J662K395K757L305M412N695O650P455Q570R681J0031R653
61217F47593R412R715R985R652Q923Q253P729P275O920O528N815M823L948L370
61203G49941K890K524K632L321M189M896N523O295P364Q797J0351J1280J1022
61190H31025R915Q609P029M730K144K57r15k329m151n327n333n145n718o629p043
$$ plain form
61291 678793 675374 670396 663539 655035 645346 635001 624503 614108 603841 593869 584528 575856 567522
61278 567522 559516 552464 546866 542429 538616 535499 533516 532583 532019 531308 530535 530075 530172 530736 531301 531359 531013
61261 531013 531136 532584 535353 538773 542318 545820 549059 551641 553380 554559 555725 557219 558874 560124
61247 560124 560643 560886 561710 563349 565136 566444 567462 568730 570303 571831 573176 574453 575542 576041 575773
61232 575773 575104 574750 575327 576989 579384 582141 585446 589858 595553 602203 609658 618228 627909 637940 647593
61217 647593 657005 666720 676705 686357 695280 703533 711262 718537 725457 731985 737800 742623 746571 749941
61203 749941 752831 755355 757987 761308 765497 770393 775916 782211 789575 798372 808723 820003 831025
61190 831025 840940 849549 856578 861308 863452 863709 862794 860465 856314 850987 845654 840509 834791 828162 821119
61175H21119p128p535q215q632q682q612q492q432q826r709j0385j0326r950r826
61161F96369r650q835p675p049p170p364p030o173n064l906k782j624l55P87J316
61146F23795J135P08L24l14j451k698l519l844l808l362k590j943j601j095K7
61131E99764J521K913M195N542O785P626Q171Q826R994J2021J4847J7487J8695
61118G18387J8599J8865K0579K2808K4026K4213K4545K5603K6936K8058K8839
61107I81458K9066K8537K7524K6433K5169K3442K1427J9435J7291J4706J1984
61096A226472R587P324M731J999k83k086l826n503o708p362p622p324o284n070
61082A198045m588m918n227m931m307l958m237n039n725n511m441l638l942m734
$$ plain form
61175 821119 813991 806456 798241 789609 780927 772315 763823 755391 746565 736856 726471 716145 706195 696369
61161 696369 686719 677884 670209 663160 655990 648626 641596 635423 630359 626453 623671 622047 621692 622479 623795
61146 623795 624930 625638 625962 625648 624197 621499 617980 614136 610328 606966 604376 602433 600832 599737 599764
61131 599764 601285 604198 608393 613935 620720 628346 636517 645343 655337 667358 682205 699692 718387
61118 718387 736986 755851 776430 799238 823264 847477 872022 897625 924561 952619 981458
61107 981458 1010524 1039061 1066585 1093018 1118187 1141629 1163056 1182491 1199782 1214488 1226472
61096 1226472 1236059 1243383 1248114 1250113 1249830 1247744 1243918 1238415 1231707 1224345 1216723 1209399 1203115 1198045
61082 1198045 1193457 1188539 1183312 1178381 1174074 1170116 1165879 1160840 1155115 1149604 1145163 1141525 1137583 1132849
61068A132849m881m497m701n862p088p546p413p420q021r048r674q894o669m297
61054A036838l075k899k840k565k304j874q95L36J336K519M617P210R075J0014
61040A055493J1049J2722J4421J5683J7010J9054K1871K5110K8198L0388L1559
61029A282558L2811L5185L8053L9955M0776M1651M2993M4317M6016M9358N4503
61018A748176O0421O7065P5624Q6090R6781J07085J18723J33600J52690J78041
61008B824296K13201K60086L17834L86138M66798N60293O65232P84789R28853
60999G407520J103220J299394J501538J696912J861439J931134J813270J459755
60991B0074182R38792M16198M7741j13568j10155p918J39438K60649K47176Q794
$$ plain form
61068 1132849 1127968 1123471 1118770 1112908 1105820 1098274 1090861 1083441 1075420 1066372 1056698 1047804 1041135 1036838
61054 1036838 1033763 1030864 1028024 1025459 1023155 1021281 1020386 1020722 1022058 1024577 1029194 1036404 1045479 1055493
61040 1055493 1066542 1079264 1093685 1109368 1126378 1145432 1167303 1192413 1220611 1250999 1282558
61029 1282558 1315369 1350554 1388607 1428562 1469338 1510989 1553982 1598299 1644315 1693673 1748176
61018 1748176 1808597 1875662 1951286 2037376 2134157 2241242 2359965 2493565 2646255 2824296
61008 2824296 3037497 3297583 3615417 4001555 4468353 5028646 5693878 6478667 7407520
60999 7407520 8510740 9810134 11311672 13008584 14870023 16801157 18614427 20074182
60991 20074182 21012974 21429172 21476913 21363345 21253190 21245272 21384710 21645359 21892535 21901329
60981B1901329m41131r72717j424367j701896j804504j780528j678417j532144
60973A0565625j366548j199066j038217q87401p50221o30188n27745m40954l68279
60964C357006l08804k60888k22557j92459j69090j50031j33274j18488j05838
60955A695577r4558q3819p3911o5277n7327m9545m2893l8643l6439l4922l3580
60944A084663l2592l1483k9499k6995k4947k3365k1594j9891j9124j9020j8361
60933H17792j7009j6172j6342j6475j5731j4624j3831j3059j1901j0759j0083
60922F61806r548q690p732p122o867o863p143p371o921n952n490n745n461l903
60908E66998k372k448l522l737k805k204k592k860k122j121r33j470k041k496
$$ plain form
60981 21901329 21460198 20487481 19063114 17361218 15556714 13776186 12097769 10565625
60973 10565625 9199077 8000011 6961794 6074393 5324172 4693984 4166239 3725285 3357006
60964 3357006 3048202 2787314 2564757 2372298 2203208 2053177 1919903 1801415 1695577
60955 1695577 1601019 1517200 1443289 1378012 1320685 1271140 1228247 1189604 1153165 1118243 1084663
60944 1084663 1052071 1020588 991089 964094 939147 915782 894188 874297 855173 836153 817792
60933 817792 800783 784611 768269 751794 736063 721439 707608 694549 682648 671889 661806
60922 661806 652258 643568 635836 628714 621847 614984 607841 600470 593549 587597 582107 576362 570901 566998
60908 566998 564626 562178 558656 554919 552114 549910 547318 544458 542336 541215 540282 538812 536771 534275
60894E34275k971l187k842k301k214k674l323l933m408m520m207l892m077m735
60880D84991n480o049o333o128n366m417l763l446l159k694k043j224l49L20P33
60865D35593J243K068K794K855K466K468L292M424N004M638L585K421J627J327
60851D75805J312J388J574J882K086J902J265K64r00j807j987j596j514k329l494
60836D73851m133m317m881o001o852o757o039n396n006m605m023l361k864k866
60822D06750l501m361m717m331l703l403l453l515l352k965k537k391k583k536
60808C59402j622k34L76l17j332j488r11n74p39p63l15J09P6r0J23N84P18L13
60790C53316j77j50M68J131J232P80L37K87L78K27j9J03N28O44J65l77l10L20
$$ plain form
60894 534275 531304 528117 525275 522974 520760 518086 514763 510830 506422 501902 497695 493803 489726 484991
60880 484991 479511 473462 467129 461001 455635 451218 447455 444009 440850 438156 436113 434889 434540 434860 435593
60865 435593 436836 438904 441698 444553 447019 449487 452779 457203 462207 466845 470430 472851 474478 475805
60851 475805 477117 478505 480079 481961 484047 485949 487214 487478 486578 484771 482784 481188 479674 477345 473851
60836 473851 469718 465401 460520 454519 447667 440910 434871 429475 424469 419864 415841 412480 409616 406750
60822 406750 403249 398888 394171 389840 386137 382734 379281 375766 372414 369449 366912 364521 361938 359402
60808 359402 357780 357546 357922 357605 356273 354785 353874 353300 352561 351798 351483 351592 351668 351578 351701 352285 353003 353316
60790 353316 353139 352989 353457 354588 355820 356600 356937 357224 357602 357829 357810 357913 358441 359085 359250 358873 358563 358883
60772C58883R00J045Q83O01J56m36q40p36l73l95j014j648j619j024n71n54m68
60755C52790J76J033J313P81nm08l09M4M12O55P55Q92J248J680J728J195M06k73
60737C64113r09j640k162k064j626j653k380l094l148k787k537k252j424k19O07
60722C36825Q34J083J793K518K627K226J863J738J615J347J034P37M39J93L7j39
60706C56770l99n58m24p2L22P39J036P74k58j474k005j690j107p22n78p47j394
60689C48213k179k241j196K73J171J202Q33O25Q21J280J610J523J300J564K437
60674C57236L208L208K676K410K737L195L093K149O20q60j720j959k053k205k034
60659C69701j291n58n89j110j003J49J373J524P66L41J060K463L483L566L000
$$ plain form
60772 358883 359783 360828 361711 362312 362468 362032 361192 360456 360083 359688 358674 357026 355407 354383 353812 353258 352790
60755 352790 352966 353999 355312 356093 356088 355680 355371 355415 355827 356482 357237 358129 359377 361057 362785 363980 364386 364113
60737 364113 363204 361564 359402 357338 355712 354059 351679 348585 345437 342650 340113 337861 336437 336218 336825
60722 336825 337659 338742 340535 343053 345680 347906 349769 351507 353122 354469 355503 356240 356679 356872 356909 356770
60706 356770 356371 355813 355389 355317 355639 356378 357414 358188 357930 356456 354451 352761 351654 350932 350354 349607 348213
60689 348213 346034 343793 342597 342870 344041 345243 346076 346701 347522 348802 350412 351935 353235 354799 357236
60674 357236 360444 363652 366328 368738 371475 374670 377763 379912 380532 379672 377952 375993 373940 371735 369701
60659 369701 368410 367852 367263 366153 365150 365299 366672 368196 368962 369303 370363 372826 376309 379875 382875
60644C82875K337J768J068Q9q91j459j619j815k284k688k627k286k195k394k308
60629C65571j575n58K44Q39J419J719J329N56K78Q29J568J805J632J467J276P52
60613C79151L3l65k58OR6P3J03J64J95K89N43P97P22K23l45n33l41k48m87o39
60593C79179k59K89K58k66l21N31J499J701J321J077J069R04N29K03r3m30l66
60576C86825N37J828K574K603K611L075L948N290P223R160J0097R989R904J0384
60562D66048J0589R599P796O193M967L524J581n00k332l819m890n400n250m421
60548D83685k975j178N75K114L534M802N753O541P648R261J1079J2905J4885J6875
60534E75504J8235J8736J8988J9428J9365J7765J4618J0802O868K685j734n805
$$ plain form
60644 382875 385212 386980 388048 388137 387246 385787 384168 382353 380069 377381 374754 372468 370273 367879 365571
60629 365571 363996 363438 363682 364521 365940 367659 368988 369544 369822 370651 372219 374024 375656 377123 378399 379151
60613 379151 379184 378819 378561 378567 378663 378736 378839 379003 379198 379487 380030 380827 381549 381772 381427 380894 380553 380305 379818 379179
60593 379179 378920 379209 379467 379201 378880 379411 380910 382611 383932 385009 386078 386982 387511 387714 387621 387191 386825
60576 386825 387362 389190 391764 394367 396978 400053 404001 409291 416514 425674 435771 445760 455664 466048
60562 466048 476637 486236 494032 500225 505192 508716 510297 509797 507465 503646 498756 493356 488106 483685
60548 483685 480710 479532 480107 482221 485755 490557 496310 502851 510499 519760 530839 543744 558629 575504
60534 575504 593739 612475 631463 650891 670256 688021 702639 713441 720309 722994 721260 715455
60522G15455q882j0780j1694j1970j1923j1633j0942r789q444p157n811m249k638
60509E99543j208J79J771L417M772N927P423R746J2988J6947K1197K5246K8874
60496G36822L2215L5304L7830L9584M0774M1450M0983L8724L5001L0895K7060
60485A136642K3242J8891J3772P934J484n478j2972k1071k9479l7308m3656m8205
60473A003796n0927n1550m9913m6705m3138l9773l6228l2095k7660k3586k0350
60462E81871j8109j6664j5446j3933j2227j0853r891q748o978m919l342k744l129
60449D54888m059m751m526l534k744k895l641m008l535k611j804j241p28j84K21
60434D14848K93M0l38o12o91o07m28k47k12m75r80j338j098l12K99Q4o88j027
$$ plain form
60522 715455 706573 695793 684099 672129 660206 648573 637631 627842 619398 612241 606430 602181 599543
60509 599543 598335 598514 600285 603702 608474 614401 621824 631570 644558 661505 682702 707948 736822
60496 736822 769037 804341 842171 881755 922529 963979 1004962 1043686 1078687 1109582 1136642
60485 1136642 1159884 1178775 1192547 1200481 1201965 1196487 1183515 1162444 1132965 1095657 1052001 1003796
60473 1003796 952869 901319 851406 804701 761563 721790 685562 653467 625807 602221 581871
60462 581871 563762 547098 531652 517719 505492 494639 484748 476000 469022 464103 460761 458017 454888
60449 454888 450829 446078 441552 438018 435274 432379 428738 424730 421195 418584 416780 415539 414811 414627 414848
60434 414848 415141 415181 414843 414231 413540 412933 412505 412258 412046 411571 410591 409253 408155 407843 408142 408226 407538 406511
60416D06511m88K98O46Q79J728L005L766L660L240K812J975O83j94N1R27J502
60400D31001J597J621J713J787K004K502K958L090L199L592L848L500L020L181
60386D68613L644L321K145J326J618K270K185J336N42L93Q57J556K009J935J596
60371D95346J577K064K610K781K577K169J673J321J429J921K301K388K597L234
60357E25988L931M202M227M672N845P421Q827R666R730R010P679O011M240K472
60343F13921O50j381l625n701p051p405p016o423o037n803n240m025k685k330
60329E49849l278m350m127k731j676j917k792l095k557j879j703j949j955j039
60315E14801Q57K896M111M594N502P661J0411J2263J2467J1538J0429R646R230
$$ plain form
60416 406511 406023 406321 406967 407846 409574 412579 416345 420005 423245 426057 428032 428715 428521 428572 429499 431001
60400 431001 432598 434219 435932 437719 439723 442225 445183 448273 451472 455064 458912 462412 465432 468613
60386 468613 472257 475578 477723 479049 480667 482937 485122 486458 487000 487393 488250 489806 491815 493750 495346
60371 495346 496923 498987 501597 504378 506955 509124 510797 512118 513547 515468 517769 520157 522754 525988
60357 525988 529919 534121 538348 543020 548865 556286 565113 574779 584509 593519 601198 607209 611449 613921
60343 613921 614571 613190 609565 603864 596813 589408 582392 575969 569932 564129 558889 554864 552179 549849
60329 549849 546571 542221 538094 535363 533687 531770 528978 525883 523326 521447 519744 517795 515840 514801
60315 514801 515658 518554 522665 527259 532761 540422 550833 563096 575563 587101 597530 607176 616406
60302F16406R158R372R512Q963P380N025K333p66m651r141j3207j5830j6789j6421
60288E91344j5074j3199j1422r914q054n461l033k121k798l820m229m123l772
60275E04324l046k071j515j695k069k147k202k609l057l096k919k979l208l307
60261D68404l345l429l073j774q8P47K94o08j039r11n23J84J385K763L675L861
60245D66523L633L355L027K413J402J80q34j167o05M98J291J052j61j497k072
60230D77038j647o66K54P84J018J326J931K622K941K732K321K129K303K843L673
60215E01602M452M702M495M678N894P584Q576Q579Q426Q741R068Q729Q064Q069
60201F01659Q917R454Q628O998O213O916P842P409N710M095L120J990J63j657
$$ plain form
60302 616406 625564 634936 644448 653411 660791 665816 668149 667383 662732 653591 640384 624554 607765 591344
60288 591344 576270 563071 551649 541735 533681 528220 525187 523066 520268 516448 512219 508096 504324
60275 504324 501278 499207 497692 495997 493928 491781 489579 486970 483913 480817 477898 474919 471711 468404
60261 468404 465059 461630 458557 456783 456695 457442 457736 457128 456089 455178 454655 454839 456224 458987 462662 466523
60245 466523 470156 473511 476538 478951 480353 480533 479699 478532 477927 478425 479716 480768 480607 479110 477038
60230 477038 475391 474725 474979 475763 476781 478107 480038 482660 485601 488333 490654 492783 495086 497929 501602
60215 501602 506054 510756 515251 519929 525823 533407 541983 550562 558988 567729 576797 585526 593590 601659
60201 601659 610576 620030 628658 635656 641869 648785 656627 664036 669746 673841 676961 678951 679114 677457
60187F77457k681l251m119n189n916o440p322q401q814q152o891n768n247n382
60173E93884n653n215l938k827k727l057k754j978j795k382k836k729k625k862
60159E50506k977k634k129j718j287r23q59p32P7J151J227N7j046j018l51P6L30
60142E37750Q76J503J743J739J938K374K909L633M524N155N262N115M958M663
60128E84142M273M165M306M048L235K689L050L831M246M249M165M025L942M447
60114F38813N623O598O602N932N147M108K687J664J794K483K479J553N13j72p30
60099F85094j334j904k567l478m360m903n368o074o547o091m994m283m329m534
60085F24328m410m162m118m237m301m204l940l597l248k711j829j183j805l640
$$ plain form
60187 677457 674776 671525 667406 662217 656301 649861 642539 634138 625324 617172 610281 604513 599266 593884
60173 593884 588231 583016 579078 576251 573524 570467 567713 565735 563940 561558 558722 555993 553368 550506
60159 550506 547529 544895 542766 541048 539761 538838 537979 537247 537324 538475 539702 539759 538713 537695 537344 537420 537750
60142 537750 538626 540129 541872 543611 545549 547923 550832 554465 558989 564144 569406 574521 579479 584142
60128 584142 588415 592580 596886 600934 604169 606858 609908 613739 617985 622234 626399 630424 634366 638813
60114 638813 644436 651034 657636 663568 668715 672823 675510 677174 678968 681451 683930 685483 685996 685824 685094
60099 685094 683760 681856 679289 675811 671451 666548 661180 655106 648559 642468 637474 633191 628862 624328
60085 624328 619918 615756 611638 607401 603100 598896 594956 591359 588111 585400 583571 582388 580583 576943
60071E76943n117n064m336m475n325n369m160l005l053l896m446m280l664k974
60057E17779k490k381k558k789k948k859k146o75R90K100K569K790K940K995L214
60042E16531L880M702N153N230N264N219M762L944L125K494K155K334K834K724
60028E70351J412l80j585k289l266m526n493o315p562q777q805p661o686o628
60014E01790o889o904o910o930o335n056m027l761l592k967k419k444k478j884
60000D39194j066p14o36k79K16L76L24M54O26N37N09J036J874K364K513K935L804
59983D54067M553M625M062L330K856K648K157Q07j130k559k827k497k468k799
59969D64825l020l138l504l885l545k321r26j8M68Q41J076J054R87J186J489J364
$$ plain form
60071 576943 571826 566762 562426 557951 552626 547257 543097 540092 537039 533143 528697 524417 520753 517779
60057 517779 515289 512908 510350 507561 504613 501754 499608 498933 499923 502023 504592 507382 510322 513317 516531
60042 516531 520411 525113 530266 535496 540760 545979 550741 554685 557810 560304 562459 564793 567627 570351
60028 570351 571763 571383 569798 567509 564243 559717 554224 547909 540347 531570 522765 515104 508418 501790
60014 501790 494901 487997 481087 474157 467822 462766 458739 454978 451386 448419 446000 443556 441078 439194
60000 439194 438128 437414 436778 436499 436715 437091 437415 437869 438495 439032 439541 440577 442451 444815 447328 450263 454067
59983 454067 458620 463245 467307 470637 473493 476141 478298 479105 477975 475416 472589 470092 467624 464825
59969 464825 461805 458667 455163 451278 447733 445412 444486 444468 444936 445777 446853 447907 448894 450080 451569 452933
59953D52933O35j64l42J74Q22J170J375J745K144K141J652J040O08L42J49N4P4
59936D66552J53L17O99J342K117K803L139L019K754K935L695M378M307L639K931
59921E04780K210J151l9p15q30j067j735k261k038j168j28P79J347J464J465J968
59905E05183K959L513K837J235k38q43o55k82l22p71r59l62N93J106J248J829
59889E16071K966L784L856L963M745N553N477M872M737N083N022M352L972M507
59875E78960N388N677N158M205L062J722K93r46j899k678l243l206k371j326j054
59860E87742j720k258j585rJ209J509J622K387L731N113O362P606Q745R502R783
59845F39739R574Q666O805M079J003j619k949k621j258j34j8o05j222j755k526
$$ plain form
59953 452933 453568 453404 453062 453236 454058 455228 456603 458348 460492 462633 464285 465325 465933 466275 466424 466478 466552
59936 466552 466705 467022 467721 469063 471180 473983 477122 480141 482895 485830 489525 493903 498210 501849 504780
59921 504780 506990 508141 508102 507387 506557 505490 503755 501494 499456 498288 498160 498939 500286 501750 503215 505183
59905 505183 508142 511655 514492 515727 515489 514646 513991 513709 513387 512616 511657 511295 511888 512994 514242 516071
59889 516071 519037 522821 526677 530640 535385 540938 546415 551287 556024 561107 566129 570481 574453 578960
59875 578960 584348 590025 595183 599388 602450 604172 604465 603519 601620 598942 595699 592493 590122 588796 587742
59860 587742 586022 583764 582179 582170 583379 584888 586510 588897 592628 597741 604103 611709 620454 629956 639739
59845 639739 649313 657979 664784 668863 669866 668247 665298 662677 661419 661285 661267 660662 659440 657685 655159
59830F55159l646m864n872o438o410n912n441n333n290m742l704k913l009l761
59816E87824m261l876k831j777r48k9J087J859J803J262R72J046R43M18n7J7N43
59799E83995J029J026L57p74j802k315k532k943l540l881l808l525l034k204j481
59784E54568j673k750l600l382k523j965j983k229k473k757l057l223l114k576
59770E17263j542k62Q61J806K812L720L995L605L254L434L779L812L751M155N105
59755E59548O204P093P649P985Q450R237R870R604Q527P600P282O870N689M289
59741F65897L679L824L751K899J682P38J99j83n98r33r02m68j42n05j370j849
59725F75719j420n40Rl4m26q41r33m25N11J230J209N27l44q59n98L45J177J236
$$ plain form
59830 655159 651513 646649 640777 634339 627929 622017 616576 611243 605953 601211 597507 594594 591585 587824
59816 587824 583563 579687 576856 575079 574131 574102 575189 577048 578851 580113 581085 582131 583074 583492 583435 583452 583995
59799 583995 585024 586050 586407 585633 583831 581516 578984 576041 572501 568620 564812 561287 558253 556049 554568
59784 554568 552895 550145 546545 543163 540640 538675 536692 534463 531990 529233 526176 522953 519839 517263
59770 517263 515721 515459 516320 518126 520938 524658 528653 532258 535512 538946 542725 546537 550288 554443 559548
59755 559548 565752 572845 580494 588479 596929 606166 616036 625640 634167 641767 649049 655919 661608 665897
59741 665897 669576 673400 677151 680050 681732 682470 682669 682486 681888 680955 680053 679585 679443 678938 677568 675719
59725 675719 674299 673759 673768 673734 673308 672467 671534 671109 671620 672850 674059 674586 674242 673383 672785 673130 674307 675543
59707F75543R80J401K491L266L452L941N129O078O036N683N945O503O540O185
59693G39173O112O279O160N795N484M869L352J233o03j904k983l679l498k727
59679G63063k438l173m450n618o473o945o952o750o809p133p207o721n955n351
59665F81088n071m962m594l483j630K23J331J765K126K611K857K668K362K411
59651F79702L007L909M539M382L500K444J511M53q93k251l455m737o081o970p279
59636F71781p673q485q932q278p097o384o041n328m407m097m333m139l286k772
59622E90529l337m436n062m924m455m214m547n395o222o416n845m815l630k522
59608E24709j777j494j366j070o04j1P80J414J117j37j079o16P04J543J597J507
$$ plain form
59707 675543 676523 677924 680415 683681 687133 691074 696203 702281 708317 714000 719945 726448 732988 739173
59693 739173 745285 751564 757724 763519 769003 773872 777224 778457 777854 775950 772967 769288 765790 763063
59679 763063 760625 757452 753002 747384 740911 733966 727014 720264 713455 706322 699115 692394 686439 681088
59665 681088 676017 671055 666461 662978 661348 661571 662902 664667 666793 669404 672261 674929 677291 679702
59651 679702 682709 686618 691157 695539 699039 701483 702994 703447 702554 700303 696848 692111 686030 679060 671781
59636 671781 664108 655623 646691 638413 631316 624932 618891 613563 609156 605059 600726 596587 593301 590529
59622 590529 587192 582756 577694 572770 568315 564101 559554 554159 547937 541521 535676 530861 527231 524709
59608 524709 522932 521438 520072 519002 518398 518387 519167 520581 521698 521561 520482 519866 520570 522113 523710 525217
59592E25217J457J144Q67J304K198K492J929J365J302J240P52K12k9k62q06j502
59576E38880k134k762l229l081k278j466j216j383j465j130l70M41P03K95n9K28
59560E19974M93l72k102l127k615j408o44m04k07M0K17M26O46N48K16N62K324
59543E14567M852O599O828O479P097R070J1294J2775J4151J6605J9232J8711J2810
59530F61070L492m660q826r656r097q112o792n300l907k765k009j573r01L96J577
59515F02937J416j42j882l044m055n278o173o302o105o089o033n613n092m751
59501E43794m308l571l077l342l927l910l031j868j050p01m99k8P88J552J877
59486E18699J986K395L174L973M653N238N423M918M268M398N266N857N664N239
$$ plain form
59592 525217 526674 527818 528685 529989 532187 534679 536608 537973 539275 540515 541267 541479 541450 541188 540382 538880
59576 538880 536746 533984 530755 527674 525396 523930 522714 521331 519866 518736 518366 518807 519510 519805 519746 519974
59560 519974 520467 520095 517993 514866 512251 510843 510199 509795 509588 509628 509845 510271 510917 511465 511681 512243 514567
59543 514567 519419 526018 532846 539325 546422 555492 566786 579561 593712 610317 629549 648260 661070
59530 661070 664562 659902 651076 641420 632323 624211 617419 612119 608212 605447 603438 601865 600964 601360 602937
59515 602937 604353 604211 602329 599285 595230 589952 583779 577477 571372 565283 559250 553637 548545 543794
59501 543794 539486 535915 532838 529496 525569 521659 518628 516760 515710 515009 514510 514482 515270 516822 518699
59486 518699 520685 523080 526254 530227 534880 540118 545541 550459 554727 559125 564391 570248 575912 581151
59472E81151N104N043M777M419L858K694J195L61M97O13o2r10r98n27k69j85L75
59455F07136J431K297K612K725L068L715M571N473O099O086N308L991K550J360
59441F58422M47n95k141l996n535o296o184n308m098l280l217l404l154k527j920
59426F07214j146K46K025L628N216P266R338J0547J1166J2411J4545J6607J8186
59413G17249J9915K1932K3481K4508K5821K6789K4696J7840Q046j094p464j0735
59401H90984j0959q670n513k829R7M617R581J1293P178j394j0346j6301j8602
59388H49136j8732j8311j7689j6265j3879j1289r266p816o612n536m523l440k496
59375G13282k134k194j887q71L15J243K087K733K458J144j15l83n5J35M28J391
$$ plain form
59472 581151 586255 591298 596075 600494 604352 607046 608241 608602 609099 609712 609650 608740 607742 607215 606946 606761 607136
59455 607136 608567 610864 613476 616201 619269 622984 627555 633028 639127 645213 650521 654512 657062 658422
59441 658422 658869 658274 656133 652137 646602 640306 634122 628814 624716 621436 618219 614815 611661 609134 607214
59426 607214 606068 606314 608339 611967 617183 624449 633787 644334 655500 667911 682456 699063 717249
59413 717249 737164 759096 782577 807085 832906 859695 884391 902231 910277 909183 901719 890984
59401 890984 880025 871355 865842 863013 863110 867727 877308 888601 895779 894385 884039 867738 849136
59388 849136 830404 812093 794404 778139 764260 752971 743705 735889 729277 723741 719218 715778 713282
59375 713282 711148 708954 707067 706196 706511 707754 709841 712574 715032 716176 716061 715678 715623 715758 716186 717577
59359G17577K738L730M280M762N285N945P177Q993J0422J0644J0226J0375J1403
59346H13557J2752J3988J4892J5045J4238J3050J2181J1563J0748R715Q508O631
59334I56868L678J89k945n526p806r710j1054j2079j2986j3439j3279j3175j3709
59321H45027j4387j4437j4000j3661j3372j2808j2256j2107j1946j1146r941q921
59309F96045p973o736n552m910m409l380k005o81J060L710O480Q265R311J0264
59295F99489J0066O850R37n036r215j2021j4166j5074j4172j2165j0025p786n290
59282F12392l129j825q60N40K199L385M074M935O334P942R298J0277J0957J1387
59268F77906J1607J1845J2486J3568J4355J3875J2060R917Q179O433M016J268
$$ plain form
59359 717577 720315 724045 728325 733087 738372 744317 751494 760487 770909 781553 791779 802154 813557
59346 813557 826309 840297 855189 870234 884472 897522 909703 921266 932014 941729 950237 956868
59334 956868 960546 960735 957790 952264 944458 934748 923694 911615 898629 885190 871911 858736 845027
59321 845027 830640 816203 802203 788542 775170 762362 750106 737999 726053 714907 704966 696045
59309 696045 688072 681336 675784 670874 666465 663085 661080 660399 661459 665169 671649 679914 689225 699489
59295 699489 709555 716405 717342 712306 703091 691070 676904 661830 647658 635493 625468 617682 612392
59282 612392 609263 607438 606578 607118 609317 612702 616776 621711 628045 635987 645285 655562 666519 677906
59268 677906 689513 701358 713844 727412 741767 755642 767702 777619 785798 792231 796247 797515
59256G97515r39k395l486m254m451m312m416m795m978m770m322l571k338q56M52
59241G48084J502K293K423J669O68K00M7m60j181j505j646k423l756m625m641
59226G36649m547m894n347n580n934o701p468p643p157o415n934o039o551o803
59212F49636o402n751n312m804l811k755k296k124j346J29J572K635L463L841
59198F26675L367K474K184K735L440L890M272M512M204L486K925K561K080J855
59184F70660K538L603L677K553J492J194R56K54k61j47k04j168k319k449j527
59169F78852n76l65r45k041l166l701l363k460j516q95q25j314j987k486k953
59154F50259l640m292m653n273o702q111q001o402n004m893n392n581n579n694
$$ plain form
59256 797515 796576 794181 790695 786441 781990 777678 773262 768467 763489 758719 754397 750826 748488 747632 748084
59241 748084 749586 751879 754302 755971 756639 756839 756886 756426 755245 753740 752094 749671 745915 741290 736649
59226 736649 732102 727208 721861 716281 710347 703646 696178 688535 681378 674963 669029 662990 656439 649636
59212 649636 643234 637483 632171 627367 623556 620801 618505 616381 615035 615164 616736 619371 622834 626675
59198 626675 630042 632516 634700 637435 640875 644765 649037 653549 657753 661239 664164 666725 668805 670660
59184 670660 673198 676801 680478 683031 684523 685717 686673 686927 686666 686519 686315 685147 682828 680379 678852
59169 678852 678276 677911 676966 674925 671759 668058 664695 662235 660719 659824 658999 657685 655698 653212 650259
59154 650259 646619 642327 637674 632401 625699 617588 609587 603185 598181 593288 587896 582315 576736 571042
59140E71042n557m912m391m603n210n519n348m750l655k326j464j248r90k56M23
59125E21236O16Q86J931L480M829N947P232Q618R671J0344J0953J1506J1573J0829
59111F19651R518Q361P948Q048P709O466N076M415M035K847R96j74j81j22r50
59096F83643k251l178l609l670l151k083j148q15p72o32n02m07l3M53J87j124
59080F60908k550l230l526m191n107n663n763n666n316m584l837l568l771m081
59066F00055m209l899l012k039j841k526l133k919k269j888j751j539j437j740
59052E65853k158k149j678j103o40l26j81n9K70O33N30J5j80K99Q46Q16M59L54
59034E61601M54K51l82r85j004k70Q37J661J995K371L267M327N025N635O742Q064
$$ plain form
59140 571042 565485 560573 556182 551579 546369 540850 535502 530752 527097 524771 523307 522059 521069 520813 521236
59125 521236 521852 522738 524669 528149 532978 538925 546157 554775 564446 574790 585743 597249 608822 619651
59111 619651 629169 637530 645478 653526 661235 667701 672777 677192 681227 684074 685070 684896 684715 684593 683643
59096 683643 681392 678214 674605 670935 667784 665701 664553 663738 662966 662334 661832 661425 661392 661845 662032 660908
59080 660908 658358 655128 651602 647411 642304 636641 630878 625212 619896 615312 611475 607907 604136 600055
59066 600055 595846 591947 588935 586896 585055 582529 579396 576477 574208 572320 570569 569030 567593 565853
59052 565853 563695 561546 559868 558765 558125 557799 557618 557559 557829 558462 558992 559007 558827 559126 559972 560788 561247 561601
59034 561601 562055 562306 561924 560939 559935 559665 560502 562163 564158 566529 569796 574123 579148 584783 591525 599589
59018E99589Q923R535J0458J0997R832P302N283M388L160P12j723k885l335l950
59004F58286m116l020j504r28j054o40M86J452J994K617L336L512K961K260J973
58989F67615K169K521K435J508K72j44M85J130J159J320K325L522M024M305N403
58974G00049P246Q908J0080J1169J2340J3453J4551J5519J5717J4817J3583J2883
58962H50315J2518J1821J0865R999Q807O651L861J294r92l580o480r077j1100
58949H84902j2719j3860j4344j4558j5155j6109j6713j6411j5144j3153j0968
58938G25768r231q033o789n183l675k640j776r10n86j024j383r29k05p3k92j27
58922F82912K64K02k68n72o72q77j022p87m59l90j69P48K001K854L321L791M098
$$ plain form
59018 599589 608512 618047 628505 639502 649334 656636 661919 666307 669467 670179 668456 665571 662236 658286
59004 658286 654170 651150 649646 648718 647664 647024 647510 648962 650956 653573 656909 660421 663382 665642 667615
58989 667615 669784 672305 674740 676248 676520 676376 676861 677991 679150 680470 682795 686317 690341 694646 700049
58974 700049 707295 716203 726283 737452 749792 763245 777796 793315 809032 823849 837432 850315
58962 850315 862833 874654 885519 895518 904325 910976 914837 916131 915139 911559 905079 896002 884902
58949 884902 872183 858323 843979 829421 814266 798157 781444 765033 749889 736736 725768
58938 725768 716537 708504 701715 696532 692857 690217 688441 687531 686945 685921 684538 683609 683404 683331 683039 682912
58922 682912 683176 683378 683110 682538 681866 680989 679967 679180 678721 678331 678162 678910 680911 683765 687086 690877 694975
58905F94975M024M248N606P770R730J1169J2359J3146J3274J3296J3896J4525
58893H18018J3999J2371J0960J0597J0986J1729J2839J4070J4836J4986J4866
58882I60257J4482J3412J1635R705P963O206M197J985k30k223l850n340p074q728
58868A002397r334q655p778p600p597o988o298o540p466p976p924q167q997r761
58854H91316j0078j0370j0977j1586j1754j1455j1034j0929j1234j1313j0379
58843G70207q740p664p586p449o506n723o228p413p837p365o999p128p246p095
58829F69228o828o287n232l999l035k067o82P42J628K189K906L521L631L684M332
58814F63731N261N709N594N242M598L661K984K731K058N40p95j058j118k181l736
$$ plain form
58905 694975 698999 703247 708853 716623 726353 737522 749881 763027 776301 789597 803493 818018
58893 818018 832017 844388 855348 865945 876931 888660 901499 915569 930405 945391 960257
58882 960257 974739 988151 999786 1009491 1017454 1023660 1027857 1029842 1029612 1027389 1023539 1018199 1011125 1002397
58868 1002397 993063 984408 976630 969030 961433 954445 948147 941607 934141 926165 918241 910074 901077 891316
58854 891316 881238 870868 859891 848305 836551 825096 814062 803133 791899 780586 770207
58843 770207 761467 753803 746217 738768 732262 726539 720311 712898 705061 697696 690697 683569 676323 669228
58829 669228 662400 656113 650881 646882 643847 641780 641098 641840 643468 645657 648563 652084 655715 659399 663731
58814 663731 668992 674701 680295 685537 690135 693796 696780 699511 701569 702109 701314 700256 699138 696957 693221
58799F93221m543m740n252n890n908n843o846q621r763r759r029p525n082k716
58785F01704j642j354m89R13J785K206L126M295M632M370M733N533N327L920K549
58770F41608J474m02l216n571o706p346p987q140p757p668q009p811o543m788
58756E61138l152j851j320j730k032j057N39J182Q85R88J619J665J135J258K102
58741E61369K461K371L279N294O703O757O650O992O760N599M854N217N535M962
58727F34803M373M431M296L406K673K673K522J716J375K317L519L870L952M706
58713F80632N669N941N733N684N622N040L975K511M23j995l846n010o505q810
58699F95064j1054j2516j3605j4671j5180j4776j4014j3307j2387j1302j0668
$$ plain form
58799 693221 688678 683938 678686 672796 666888 661045 654199 645578 635815 626056 617027 609502 604420 601704
58785 601704 600062 598708 598219 599132 600917 603123 606249 610544 615176 619546 624279 629812 635139 639059 641608
58770 641608 643082 642680 639464 633893 627187 619841 611854 603714 595957 588289 580280 572469 565926 561138
58756 561138 557986 556135 554815 553085 551053 549996 550535 551717 552602 553590 555209 556874 558009 559267 561369
58741 561369 563830 566201 569480 574774 581477 588234 594884 601876 608636 614235 619089 624306 629841 634803
58727 634803 639176 643607 647903 651309 653982 656655 659177 660893 662268 664585 668104 671974 675926 680632
58713 680632 686301 692242 697975 703659 709281 714321 718296 720807 721230 719235 715389 710379 703874 695064
58699 695064 684010 671494 657889 643218 628038 613262 599248 585941 573554 562252 551584
58688E51584j0426r629q070o681n968n433m945n058n525n206m022l196l055k410
58674D71960q14N06Q30J102K010K708K540K314K837L788M930O747Q908R909R199
58659E29474P948O803M828J707j055k415l308m601n422n077m718n430o297o071
58645E06366n203m616l940k635j538j638k397k762k685k401j506j4R36P53M17
58630D77137P12R53O84R03K073K675J475k79p61k76j56k61L97J496J834J327R50
58613D90883J274K287L920N586O039M955L668L395L664L507L021K634K134J505
58599E38472J463K070K125J003k91q72j263j795j557j50J240J859K686M325N513
58584E54828N376N223O314P667P998Q053Q907R661R069Q005P985Q543Q290P407
$$ plain form
58688 551584 541158 531529 523459 516778 510810 505377 500432 495374 489849 484643 480621 477425 474370 471960
58674 471960 471146 471652 472482 473584 475594 478302 480842 483156 485993 489781 494711 501458 510366 520275 529474
58659 529474 537422 544225 549053 550760 549705 547290 543982 539381 533959 528882 524164 518734 512437 506366
58645 506366 501163 496547 492607 489972 488434 486796 484399 481637 478952 476551 475045 475031 475967 476720 477137
58630 477137 477849 478802 479486 480389 482462 485137 486612 486333 485572 485296 485140 484879 485276 486772 488606 489933 490883
58613 490883 492157 494444 498364 503950 509989 514944 518612 522007 525671 529178 532199 534833 536967 538472
58599 538472 539935 542005 544130 545133 544842 543970 542707 540912 539355 539205 540445 542304 544990 549315 554828
58584 554828 560204 565427 571741 579408 587406 595459 604366 614027 623096 631101 639086 647629 655919 663326
58570F63326O981O933O712O977Q590J0927J3038J5416J8674K1715K3176K3614
58558H26079K4328K5055K4733K3419K1536J8435J3679Q572M511J003k772n810
58546I82768o823o639o806p109o708o442p589r447j0628j1699j4060j7138j9185
58533H52495k0106k0983k1560k0693j8758j7166j5933j3983j1405r356q098p130
58521F67324o627o912p052n948m208l149k690j993j373j624k301k435k119j779
58507F17114j007K24N55o70j757j151j9j08o78j20R24Q17L7K18J110J331J142
58490F17962J692K522K561K720M606P419Q930Q928R051R875J0701J1550J2878
58477G11395J4033J4352J4824J6266J7031J5185J1719Q857O412K826j397m433
$$ plain form
58570 663326 670307 677240 683952 690929 699519 710446 723484 738900 757574 779289 802465 826079
58558 826079 850407 875462 900195 923614 945150 963585 977264 985836 990347 991350 988578 982768
58546 982768 975945 969306 962500 955391 948683 942241 934652 925205 914577 902878 888818 871680 852495
58533 852495 832389 811406 789846 769153 750395 733229 717296 703313 691908 682552 674454 667324
58521 667324 660697 653785 646733 640785 636577 633428 630738 628745 627372 625748 623447 621012 618893 617114
58507 617114 616107 616331 616886 616216 614459 613308 613289 613181 612503 612383 613307 614124 614161 614379 615489 616820 617962
58490 617962 619654 622176 624737 627457 632063 639482 648412 657340 666391 676266 686967 698517 711395
58477 711395 725428 739780 754604 770870 787901 803086 814805 823662 830074 832900 831503 827070
58465H27070o262p897q596p110m737l768l719k439o6J611K887N536R030J1036
58451H12576J1278J1466J1706J0438P687M963K261j567n770q431r760j1404j2931
58438H22512j2576j0898j0007r581p504m227k497k696k283j46K128L557M898O199
58424G76879O593O697P932R483R139P044N306M167K091o76k299k954m456o510
58410H18436p042o137n877o439o163n282n543o367n487l263k219k426j647R7N72
58395G55213n5P51L127M675N162O575Q335P570M646L302M479N057L711K872L716
58380H19136M123L024K111J880O40j287j070J581L530L733M804P673R611R267
58366H68756Q982J0177J1048J0713J1164J3098J4161J3274J2557J3256J3774J3330
$$ plain form
58465 827070 820808 812911 804315 797205 792468 788700 784981 782542 782476 784087 786974 792510 801540 812576
58451 812576 823854 835320 847026 857464 865151 870114 872375 870808 865038 856607 846847 835443 822512
58438 822512 809936 799038 789031 779450 771946 767719 765222 762526 760243 760097 762225 765782 770680 776879
58424 776879 783472 790169 798101 807584 816723 823767 829073 833240 835331 834655 832356 829402 824946 818436
58410 818436 811394 805257 799380 792941 786778 781496 775953 769586 764099 760836 758617 756191 754544 754641 755213
58395 755213 755158 755909 759036 763711 768873 775448 783783 791353 795999 799301 803780 808837 812548 815420 819136
58380 819136 823259 826283 828394 830274 830914 829627 828557 830138 833668 837401 842205 849878 859489 868756
58366 868756 877738 887915 898963 909676 920840 933938 948099 961373 973930 987186 1000960 1014290
58354A014290J3311J3613J2020Q663O571O431N457K906J751L241M733M701N037
58341A102725O559P234O768P954J1374J3738J3582J3631J5406J6630J6126J6253
58329A247980J8052J8993J7866J7024J7422J6527J3399J0842J0261R392P309O377
58317A411444P159O836M887M706P229Q862Q098Q195J0663J2317J1712J2223J5506
58304A529837J8067J7735J7512J9509K1028K0255J9863K1452K2258K0880K0352
58293A748748K2177K3361K2676K3501K6980K9025K7723K7078K9558L1759L1368
58282B043954L1510L4099L5816L4933L5132L8302M0657M0291M1161M5245M8320
58271B469420M8106M8835N2997N6483N6863N8257O2867O6106O5560O6210P1105
$$ plain form
58354 1014290 1027601 1041214 1053234 1061897 1068468 1074899 1080356 1083262 1085013 1088254 1092987 1097688 1102725
58341 1102725 1109284 1116518 1123286 1131240 1142614 1156352 1169934 1183565 1198971 1215601 1231727 1247980
58329 1247980 1266032 1285025 1302891 1319915 1337337 1353864 1367263 1378105 1388366 1397758 1405067 1411444
58317 1411444 1418603 1425439 1430326 1435032 1442261 1451123 1459221 1467416 1478079 1490396 1502108 1514331 1529837
58304 1529837 1547904 1565639 1583151 1602660 1623688 1643943 1663806 1685258 1707516 1728396 1748748
58293 1748748 1770925 1794286 1816962 1840463 1867443 1896468 1924191 1951269 1980827 2012586 2043954
58282 2043954 2075464 2109563 2145379 2180312 2215444 2253746 2294403 2334694 2375855 2421100 2469420
58271 2469420 2517526 2566361 2619358 2675841 2732704 2790961 2853828 2919934 2985494 3051704 3122809
58260C122809P5479P5964P6749Q0686Q3323Q2095Q2094Q6275Q9368Q8231Q8422
58249D031495R3581R8409R9390J02069J10072J17699J21343J27154J38937J49955
58239E190104J55575J62257J74744J86525J92937K01138K16516K31967K41768
58230F953531K53106K72239K92536L08274L26570L53144L80519M03404M30775
58221I974098M69080N09155N44308N84795O38955O97511P53126Q17239Q99937
58212A5888204R92355J087730J199540J339016J496761J668211J873816K131174
58204B7676807K433086K778642L198479L723281M360214N131417O098808P312887
58196F2713621Q771743J0464476J2409370J4616360J7082519J9872714K3097417
$$ plain form
58260 3122809 3198288 3274252 3351001 3431687 3515010 3597105 3679199 3765474 3854842 3943073 4031495
58249 4031495 4125076 4223485 4322875 4424944 4535016 4652715 4774058 4901212 5040149 5190104
58239 5190104 5345679 5507936 5682680 5869205 6062142 6263280 6479796 6711763 6953531
58230 6953531 7206637 7478876 7771412 8079686 8406256 8759400 9139919 9543323 9974098
58221 9974098 10443178 10952333 11496641 12081436 12720391 13417902 14171028 14988267 15888204
58212 15888204 16880559 17968289 19167829 20506845 22003606 23671817 25545633 27676807
58204 27676807 30109893 32888535 36087014 39810295 44170509 49301926 55400734 62713621
58196 62713621 71485364 81949840 94359210 108975570 126058089 145930803 169028220
58189A69028220K6699284L0336271L3558133L5899655L6525193L3962172K6828487
58182C92837415J5269520J522886j1301778k1108666k7541233l1224466l2777968
58175B85675710l2584524l1038056k8615731k5729606k2669745j9666215j6891398
58168A08480435j4413283j2228051j0335670q740560p409385o287849n347752
58161D3717885m577369l943866l405695k948227k572604k262779j994335j762399
58153B0250611j571869j412039j266839j137875j032786r42484q52997p68374
58145A1265348o99620o41657n82627n25677m80717m43930m05329l68178l41804
58136F775809l22970l02207k81200k66832k55172k38036k18722k05490j95772
$$ plain form
58189 169028220 195727504 226063775 259621908 295521563 332046756 366008928 392837415
58182 392837415 408106935 409629821 398328043 377219377 349678144 318453678 285675710
58175 285675710 253091186 222053130 193437399 167707793 145038048 125371833 108480435
58168 108480435 94067152 81839101 71503431 62762871 55353486 49065637 43717885
58161 43717885 39140516 35196650 31790955 28842728 26270124 24007345 22013010 20250611
58153 20250611 18678742 17266703 15999864 14861989 13829203 12886719 12033722 11265348
58145 11265348 10565728 9924071 9341444 8815767 8335050 7891120 7485791 7117613 6775809
58136 6775809 6452839 6150632 5869432 5602600 5347428 5109392 4890670 4685180 4489408
58127D489408j82075j67087j58063j52170j42053j30360j24507j22201j15876
58118C195016j06752j01304r8302r2194q4994q2375q1994p7722p1424o9012o8727
58107B260216o4785n8779n6215n5426n1061m5100m3485m4895m3482l9730l8329
58096A718929l8300l5434l1631l1698l3579l1662k7218k5746k6477k4425k0591
58085A392168k0240k2714k2718k0358k0594k3651k4883k3390k2500k2502k0879
58074A147739j8783j9562k1779k1203j8569j7977j8963j7685j4665j3841j4929
58063I49783j4228j1981j1612j2605j1443q859q872j1225j1927j0761j1253j3513
58051H11504j4006j2264j1269j1307r859p382o969q336q227o571o334p494p154
$$ plain form
58127 4489408 4307333 4140246 3982183 3830013 3687960 3557600 3433093 3310892 3195016
58118 3195016 3088264 2986960 2888658 2796464 2711470 2629095 2547101 2469379 2397955 2328943 2260216
58107 2260216 2195431 2136652 2080437 2025011 1973950 1928850 1885365 1840470 1796988 1757258 1718929
58096 1718929 1680629 1645195 1613564 1581866 1548287 1516625 1489407 1463661 1437184 1412759 1392168
58085 1392168 1371928 1349214 1326496 1306138 1285544 1261893 1237010 1213620 1191120 1168618 1147739
58074 1147739 1128956 1109394 1087615 1066412 1047843 1029866 1010903 993218 978553 964712 949783
58063 949783 935555 923574 911962 899357 887914 879055 870183 858958 847031 836270 825017 811504
58051 811504 797498 785234 773965 762658 752799 745417 738448 730112 721885 715314 708980 701486 694332
58038F94332n388n111o274o031m533m734o583p019n817n844p496q306q075r049
58024F04072j0916j0937r127q289q834q440o773n697n127l476j809k543m483m252
58010E13369k231j824l277l609k408k167k878j896O07J468K22k31R44J500Q92
57995D98481R45J425j8k927m150l407l769n926p012n933m966n058m369k488j576
57980D49252k198k374j706k094l565l703k105j157j533j212K78R90O67J359L091
57965D33990L316J601M92P75L91j012j038O89J275m83k202k478l033m680n399
57950D22204m283l357l702l513j890p58j193j394j37J129J456K192L910M901M477
57935D20042M471N803O731O226N806O319O204M652L330L085K109o89l530m870
$$ plain form
58038 694332 688944 683833 677559 671528 666995 662261 655678 648659 642842 636998 629502 621196 613121 604072
58024 604072 593156 582219 573092 564803 555969 547529 540756 535059 529932 526456 524647 522104 517621 513369
58010 513369 511138 509314 506037 502428 500020 497853 494975 493079 493686 495154 495376 495145 496089 497589 498481
57995 498481 499426 500851 500833 497906 493756 490349 486580 480654 473642 467709 462743 457685 453316 450828 449252
57980 449252 447054 444680 442974 440880 437315 433612 431507 430350 428817 427605 427883 428873 429540 430899 433990
57965 433990 437306 438907 439399 440174 440565 439553 438515 439204 440479 439996 437794 435316 432283 427603 422204
57950 422204 417921 414564 410862 407349 405459 404701 403508 402114 401977 403106 404562 406754 410664 415565 420042
57935 420042 424513 430316 437047 443273 449079 455398 461602 466254 469584 472669 474778 474089 470559 465689
57921D65689n772p243q088p421o686p169p877p627o955o428n355l689k738k671
57907C79970j802L27J717J129j6l52n14j097j297j016j637l241l755k304p49l65
57891C64998J26J636K624J887Q01Q58J328J187J023J269Q75l98p64O69K076J868
57875C82063J233J764K684K545J728J289J058O84R02K001K715K243J713K125K625
57860D09372K309J962K377K721K136J395J438J830J917K005K184J720O57K26N94
57845D34843K05j492k809k576j923j999k077j434j073j848k819k983k818k728
57831D06469j934m20J81p88j473l13J539K349K448K952L611L747L787M196M270
57816D30621L554K907K849K464J213K8o69k070m601o517o532n919o273p005o872
$$ plain form
57921 465689 459917 452674 444586 437165 430479 423310 415433 407806 400851 394423 389068 385379 382641 379970
57907 379970 378168 378495 380212 381341 381325 380973 380459 379362 378065 377049 375412 372171 368416 366112 365363 364998
57891 364998 365124 366760 369384 371271 372072 372930 374258 375445 376468 377737 378612 378214 377450 378119 380195 382063
57875 382063 383296 385060 387744 390289 392017 393306 394364 395048 395950 397951 400666 402909 404622 406747 409372
57860 409372 411681 413643 416020 418741 420877 422272 423710 425540 427457 429462 431646 433366 434023 434249 434843
57845 434843 435048 433556 430747 428171 426248 424249 422172 420738 419665 417817 414998 412015 409197 406469
57831 406469 404535 404115 404296 403508 402035 401722 403261 405610 408058 411010 414621 418368 422155 426351 430621
57816 430621 434175 437082 439931 442395 443608 443636 442967 440897 436296 429779 423247 417328 411055 404050 397178
57801C97178o223n841n251m011l109l310l616l018k249k191k157j409p63j050
57787C52980j469j069l31J01O28J322J278O54J217L322M639L693K335K570L410
57772C75280L180K632L024L228J673m98j264j189k061l376l326k284k224l190
57758C69605l314k022o88j43J18M37O63J113K055K646K092J331J799L163L997
57743C82852M126M416M839M594L862L631M037M277L934L249K445J796J694J825
57729D31577J230Rm03M01P66l17j351p59M94P12K89N33J071O56m47j093j262j464
57711D30642j180L6R44K65j076j409r65j005j294q07M0J24k15L3M41J33l4J241
57693D25914K976L045J557N73Q30J203J221J601K341K512K129K153K628K730K664
$$ plain form
57801 397178 390955 385114 379863 375852 372743 369433 365817 362799 360550 358359 356202 354793 354030 352980
57787 352980 351511 350442 350111 350212 350840 352162 353440 354094 355311 358633 363272 366965 369300 371870 375280
57772 375280 378460 381092 384116 387344 389017 388519 387255 386066 384005 380629 377303 375019 372795 369605
57758 369605 366291 364269 363581 363438 363556 363993 364656 365769 367824 370470 372562 373893 375692 378855 382852
57743 382852 386978 391394 396233 400827 404689 408320 412357 416634 420568 423817 426262 428058 429752 431577
57729 431577 432807 432816 432413 432814 433580 433263 431912 431153 431647 432359 432648 433181 434252 434908 434461 433368 432106 430642
57711 430642 429462 429498 430442 430707 429631 428222 427257 426252 424958 424151 424191 424315 424100 424133 424574 424707 424673 425914
57693 425914 428890 431935 433492 434065 434895 436098 437319 438920 441261 443773 445902 448055 450683 453413 456077
57678D56077L631N844Q323J0679J3444J6740K0224K4275K9693L6266M3002M9487
57666G17685N5628O0360O1731N7870M7084K8498M297j9811l8475n0438n7113n9063
57654H08253n6311n0799m5326m0362l4476k7685k1884j7947j4902j2080r961q595
57642D67925p187n441l806k377j041l42o22q16J70J502J648Q72M59L35m02j255
57626D49622j114o49j340k561k292n52N43J21o10r12j330j795j369k03M76M90
57610D36525P38J081N19n55o07M51J205J323J716K242J815Q56R04J626J059p93
57594D50105j631o85J14m00r11m56j67q17j229n71Q0p0J4J105K051J744R29O34
57576D49839N07J11J66J079J775J348N54L88N41L69J72L46M34N3k73n6M52J068
$$ plain form
57678 456077 459708 465552 473875 484554 497998 514738 534962 559237 588930 625196 668198 717685
57666 717685 773313 833673 895404 953274 1000358 1028856 1033153 1013342 974867 924429 867316 808253
57654 808253 751942 701143 655817 615455 580979 553294 531410 513463 498561 486481 476520 467925
57642 467925 460738 455297 451491 449114 448073 447731 447109 446293 446463 447965 449613 450485 450944 451279 450877 449622
57626 449622 448508 447859 446519 443958 441666 441114 441657 441778 441168 440256 438926 437131 435762 435559 436035 436525
57610 436525 437263 438344 438863 438308 437701 438152 439357 440680 442396 444638 446453 447309 448213 449839 450898 450105
57594 450105 448474 447789 447903 447503 446592 446136 445969 445152 443923 443352 443432 443362 443376 444481 446532 448276 449205 449839
57576 449839 450346 450457 450623 451702 453477 454825 455379 455767 456308 456677 456849 457195 457629 457682 457409 457353 457805 458873
57558D58873J947K699K619K215K850M344M862L796K896L510M643M826M165L359
57544E07604K310J013L74Q13J326J093Q52J580K970M155M822M753L594J926J201
57529E40386J733K117J532J093J910L254L902L934M007M019L788L896M738N591
57515E85900N755N607N593N248M289L640M264N688O642O520N560M284L409L433
57501F55832L898L844L237K880K865K478J831J875K522K538J794J714K800L682
57487F93790L525L343L870M177L612L285M085N041N120M979N324N279M138L132
57473G52700L554M443M173L166K935L375L202K469K579L954N397N819N328M681
57459H07775M535N095N774N693M968M727N365N893N729N776O730P653P508O911
$$ plain form
57558 458873 460820 463519 466138 468353 471203 475547 480409 484205 487101 490611 495254 500080 504245 507604
57544 507604 509914 510927 511301 512114 513440 514533 515385 516965 519935 524090 528912 533665 537259 539185 540386
57529 540386 542119 544236 545768 546861 548771 552025 555927 559861 563868 567887 571675 575571 580309 585900
57515 585900 591655 597262 602855 608103 612392 616032 620296 625984 632626 639146 644706 648990 652399 655832
57501 655832 659730 663574 666811 669691 672556 675034 676865 678740 681262 683800 685594 687308 690108 693790
57487 693790 697315 700658 704528 708705 712317 715602 719687 724728 729848 734827 740151 745430 749568 752700
57473 752700 756254 760697 764870 768036 770971 774346 777548 780017 782596 786550 791947 797766 803094 807775
57459 807775 812310 817405 823179 828872 833840 838567 843932 849825 855554 861330 868060 875713 883221 890132
57445H90132O983P518P665P540P762Q199Q479Q916R663R850Q841P549P178P485
57431A003760P563P491P826Q246Q123P885Q428R664J0768J1329J1246J0303Q894
57418A121526Q250Q813R269Q517P572Q051R637J0727J0865J0942J1379J1734J1786
57405A249068J1664J1204J0375R939J0454J1057J0510R085Q218Q620R827J1204
57393A371225J2285J2525J1899J1355J1744J2620J3069J3157J3574J4380J5111
57382A512944J5640J6044J6097J5746J5454J5332J4761J3662J3122J3772J4606
57371A677180J4540J4042J3939J3820J3115J2655J3485J4907J5457J5131J4990
57360A833261J5230J5280J5318J5893J6581J6645J6609J7519J8892J9202J8226
$$ plain form
57445 890132 897115 904633 912298 919838 927600 935799 944278 953194 962857 972707 981548 989097 996275 1003760
57431 1003760 1011323 1018814 1026640 1034886 1043009 1050894 1059322 1068986 1079754 1091083 1102329 1112632 1121526
57418 1121526 1129776 1138589 1147858 1156375 1163947 1171998 1181635 1192362 1203227 1214169 1225548 1237282 1249068
57405 1249068 1260732 1271936 1282311 1292250 1302704 1313761 1324271 1333356 1341574 1350194 1360021 1371225
57393 1371225 1383510 1396035 1407934 1419289 1431033 1443653 1456722 1469879 1483453 1497833 1512944
57382 1512944 1528584 1544628 1560725 1576471 1591925 1607257 1622018 1635680 1648802 1662574 1677180
57371 1677180 1691720 1705762 1719701 1733521 1746636 1759291 1772776 1787683 1803140 1818271 1833261
57360 1833261 1848491 1863771 1879089 1894982 1911563 1928208 1944817 1962336 1981228 2000430 2018656
57349B018656J7354J7534J8303J8841J8838J8377J7941J8262J9237J9595J8642
57338B221580J7610J8020J9465K0438K0607K0645K0524J9744J8845J8954J9998
57327B436430K0951K1532K2183K2751K2683K2311K2368K2620K2355K1836K1763
57316B679783K1829K1395K1020K1637K2724K3142K3227K4058K5119K4928K3724
57305B932586K3219K3734K3913K3429K3586K4814K5795K5754K5561K5818K5771
57294C203980K5017K4568K5201K6249K6877K7268K7705K7763K7258K6883K7106
57283C495875K7431K7368K7286K7662K8340K8940K9281K9136K8332K7269K6563
57272C803483K6235K6071K6533K8054K9670K9834K8624K7650K7719K8060K8097
$$ plain form
57349 2018656 2036010 2053544 2071847 2090688 2109526 2127903 2145844 2164106 2183343 2202938 2221580
57338 2221580 2239190 2257210 2276675 2297113 2317720 2338365 2358889 2378633 2397478 2416432 2436430
57327 2436430 2457381 2478913 2501096 2523847 2546530 2568841 2591209 2613829 2636184 2658020 2679783
57316 2679783 2701612 2723007 2744027 2765664 2788388 2811530 2834757 2858815 2883934 2908862 2932586
57305 2932586 2955805 2979539 3003452 3026881 3050467 3075281 3101076 3126830 3152391 3178209 3203980
57294 3203980 3228997 3253565 3278766 3305015 3331892 3359160 3386865 3414628 3441886 3468769 3495875
57283 3495875 3523306 3550674 3577960 3605622 3633962 3662902 3692183 3721319 3749651 3776920 3803483
57272 3803483 3829718 3855789 3882322 3910376 3940046 3969880 3998504 4026154 4053873 4081933 4110030
57261D110030K8267K8695K8579K7646K6862K7011K7622K7924K7831K7457K6716
57250D414640K5848K5421K5403K5151K4632K4564K5082K5318K4696K3635K2561
57239D686951K1321J9994J9306J9657K0486K0993K0968K0734K0828K1687K2999
57228D915924K3629K2954K1831K1420K1581K1607K1764K2583K3242K2460K0716
57217E159711J9655J9419J8646J6939J5315J4052J2328J0313R315R318Q597O532
57205E320140M616L760K811R11p61j085r53j604k529k740k766l643m940n421m929
57190E300867m245l703l226l150l789m586m736m301l951m024m384m781m900m633
57176E242458m576n425o606o540m764k626j400q00KJ034K064L448N580Q168J0692
$$ plain form
57261 4110030 4138297 4166992 4195571 4223217 4250079 4277090 4304712 4332636 4360467 4387924 4414640
57250 4414640 4440488 4465909 4491312 4516463 4541095 4565659 4590741 4616059 4640755 4664390 4686951
57239 4686951 4708272 4728266 4747572 4767229 4787715 4808708 4829676 4850410 4871238 4892925 4915924
57228 4915924 4939553 4962507 4984338 5005758 5027339 5048946 5070710 5093293 5116535 5138995 5159711
57217 5159711 5179366 5198785 5217431 5234370 5249685 5263737 5276065 5286378 5295693 5305011 5313608 5320140
57205 5320140 5324756 5328516 5331327 5332238 5331477 5330392 5329439 5327835 5325306 5322566 5319800 5316157 5311217 5305796 5300867
57190 5300867 5296622 5292919 5289693 5286543 5282754 5278168 5273432 5269131 5265180 5261156 5256772 5251991 5247091 5242458
57176 5242458 5237882 5232457 5225851 5219311 5214547 5211921 5210521 5209721 5209723 5210757 5212821 5216269 5221849 5230017 5240709
57161E240709J2858J4268J4526J4050J3745J3514J2260R737P048M848K464n52
57149E359475l604o476j0103j4919j9865k3963k7522l0811l3023l3746l4043l4667
57137E086733l4532l2292k8399k4143j9779j5104j0853q004o405n531n814p807
57125D888070j0749j3377j5517j7513j8671j7772j4643r981l953L679J2454K1404
57113D803431L0085L8447M6242N3678O2233P3688Q8709J07164J29223J55158J84820
57102E772878K18634K58677L07665L67465M39651N26730O31286P54255Q95091
57093A0172332J052821J225323J408136J595855J784597J971768K153944K326850
57085B3691626K487233K632636K758999K858812K917935K906820K772747K450765
$$ plain form
57161 5240709 5253567 5267835 5282361 5296411 5310156 5323670 5335930 5345667 5352715 5357563 5360027 5359475
57149 5359475 5355871 5349395 5339292 5324373 5304508 5280545 5253023 5222212 5189189 5155443 5121400 5086733
57137 5086733 5052201 5019909 4991510 4967367 4947588 4932484 4921631 4913627 4907222 4901691 4895877 4888070
57125 4888070 4877321 4863944 4848427 4830914 4812243 4794471 4779828 4769847 4765894 4769573 4782027 4803431
57113 4803431 4833516 4871963 4918205 4971883 5034116 5107804 5196513 5303677 5432900 5588058 5772878
57102 5772878 5991512 6250189 6557854 6925319 7364970 7891700 8522986 9277241 10172332
57093 10172332 11225153 12450476 13858612 15454467 17239064 19210832 21364776 23691626
57085 23691626 26178859 28811495 31570494 34429306 37347241 40254061 43026808 45477573
57077D5477573J899505J139493K59677o17817j388571j996585k432865k716715
57069C9623695k878187k947048k945789k887349k779032k628611k446308k242778
57061A7868593k027969j811859j603610j409075j230702j070230r29533q08404
57053F977211p03909o13334n36166m72017m18395l72117l31665k96656k66083
57044B966869k38729k14412j93353j74902j58046j42495j28206j14653j01595
57035A500478q9597p8771o8035n6723m5804l6121k6659j6109m928N812J6253K5826
57023A125622L0279K3771M922k0752m4926o1905p0342p1889o9328o5028o0094
57012G20330n4718m9130m3678l8420l3402k9091k5845k3284k0829j8451j6278
$$ plain form
57077 45477573 47377078 48516571 48776248 48158431 46769860 44773275 42340410 39623695
57069 39623695 36745508 33798460 30852671 27965322 25186290 22557679 20111371 17868593
57061 17868593 15840624 14028765 12425155 11016080 9785378 8715148 7785615 6977211
57053 6977211 6273302 5659968 5123802 4651785 4233390 3861273 3529608 3232952 2966869
57044 2966869 2728140 2513728 2320375 2145473 1987427 1844932 1716726 1602073 1500478
57035 1500478 1410881 1332110 1264075 1207352 1161548 1125427 1098768 1082659 1077731 1083543 1099796 1125622
57023 1125622 1155901 1179672 1184594 1163842 1118916 1057011 986669 914780 845452 780424 720330
57012 720330 665612 616482 572804 534384 500982 471891 446046 422762 401933 383482 367204
57001C67204j4070j1889j0559j0452j0451r272p244n600m544l262j519M6J125
56988B79513K088L281M835O927R354J1158J1514J0566Q683N520Q51m360q726j1807
56974C29397j3684j4014j2708j0814r365p962n835l585k294j519M7K365M267N585
56960B59881P272R533J1637J3580J5917J7796J6924J2202N000k515q992j3626
56948C44609j5881j6288j6261j6415j5861j3744j0577p511m973k557K25L409O563
56935B34738R219J1557J4387J8049K1749K4388K5352K3871J8686R647r68j0107
56923D00568j6546k0843k3395k4112k3488k2415k0972j8790j6304j4281j2421
56912A87001r925p214n436m531l526k534k598l489l611k423j152o23j36R57K130
$$ plain form
57001 367204 353134 341245 330686 320234 309783 300511 293267 287667 283123 279861 278342 278388 279513
56988 279513 281601 284882 289717 296644 305998 317156 328670 339236 347919 353439 354290 349930 341204 329397
56974 329397 315713 301699 288991 278177 268812 260850 255015 251430 249136 247617 247664 250029 254296 259881
56960 259881 267153 276686 288323 301903 317820 335616 352540 364742 369742 367227 358235 344609
56948 344609 328728 312440 296179 279764 263903 250159 239582 232071 227098 224541 224766 228175 234738
56935 234738 243957 255514 269901 287950 309699 334087 359439 383310 401996 411643 410675 400568
56923 400568 384022 363179 339784 315672 292184 269769 248797 230007 213703 199422 187001
56912 187001 177076 169862 164426 159895 156369 153835 151237 147748 144137 141714 140562 139939 139803 140760 142890
56897A42890K850L438M131M575M843N721P426R196J0658J2397J4663J6611J7483
56884B56882J7380J6287J3462Q537K486l165p426r903j0630j0234r546q726p331
56871B48073n205k480J062N580J0238J3908J6789K0174K4559K9300L4043L9009
56859D35050M3614M6118M4954L9357K8877J4084k108j5632k4458k9387l1521l0802
56847E18146k7452k2921j8264j3036o723R0O804J3825K1534K9436L7151M5126
56835E83716N3543O1549O8153P2509P2463O4471M6645K1452n584k9355m6995n7715
56823I04852o2304o2438n9495n4088m6845l8845l0846k2847j4868p298j21P383
56811E12240J5623K4129L2193L9276M4620M7385M7173M3312L3909J7617l219k3052
$$ plain form
56897 142890 145740 149178 153309 157884 162727 168448 175874 185070 195728 208125 222788 239399 256882
56884 256882 274262 290549 304011 312548 315034 311869 304443 294540 283910 273676 264130 255404 248073
56871 248073 242868 240388 241450 247030 257268 271176 287965 308139 332698 361998 396041 435050
56859 435050 478664 524782 569736 609093 637970 652054 649946 634314 609856 580469 548948 518146
56847 518146 490694 467773 449509 436473 429750 429840 436644 450469 472003 501439 538590 583716
56835 583716 637259 698808 766961 839470 911933 976404 1023049 1044501 1038917 1009562 962567 904852
56823 904852 842548 780110 720615 666527 619682 580837 549991 527144 512276 504978 504857 512240
56811 512240 527863 551992 584185 623461 668081 715466 762639 805951 839860 857477 854258 831206
56799H31206l7655m6802n1992n3583n1544m7166m2145l6753l0442k3499j6941
56788C92684j1298o537k500J387O028J1453J6454K0108K2661K4094K2988J7965
56776E15487R439r46j1663k1192k7749l0621l1058l0687k9685k7502k4530k1758
56764B67535j9392j7088j5046j3687j2645j1244r665q584p916o891n312l851l190
56751A33024l395m003m273l702k657k108k382k685k248j282m50n1p3m12o48l45
56735A02310K04L22J44M24R44N47q22j529n81Q71J285P73L60L31M11O49J042J092
56717A08777O96O04J185J671J465J134J211J144M61j78j53J0j45J25J327K324
56701A21658J900P93N29J022R46J4p08m99L74J444K355K673K326J920J862J710
$$ plain form
56799 831206 793551 746749 694757 641174 589630 542464 500319 463566 433124 409625 392684
56788 392684 381386 374849 372349 373736 379764 391217 407671 427779 450440 474534 497522 515487
56776 515487 524926 523980 512317 491125 463376 432755 401697 371010 341325 313823 289293 267535
56764 267535 248143 231055 216009 202322 189677 178433 168768 160184 152268 145377 140065 136214 133024
56751 133024 129629 125626 121353 117651 114994 112886 110504 107819 105571 104289 103839 103788 103715 103303 102655 102310
56735 102310 102514 102836 102980 103404 104348 104895 104073 102544 101963 102834 104119 104892 105252 105583 105994 106643 107685 108777
56717 108777 109473 110077 111262 112933 114398 115532 116743 117887 118348 118170 118017 118027 117882 118007 119334 121658
56701 121658 123558 124351 124880 125902 126848 126862 126154 125655 126029 127473 129828 132501 134827 136747 138609 140319
56685A40319J154P78J019J280J117J245K150K812K196J082P89R47K77j018j557
56670A54590j115q65j328j683j310o71m55p96j397j797j600j087j060j554j385
56655A36487R8J745K129J558J272J454J413J113J038R80L56n66r57o77j17P00
56639A48026J741K233J610O73N83J125J188N07l20j021j634j807j359j023j405
56624A49117j819j386o22n86j140j499j710k082j932o68O46O17j26P7J101J331
56608A39319M71j44RO9k43j04O10R28N69M17P89Q65L09p5J97N85O34N35L02l46
56588A45696j011q98j80K06K27P44J696J945J256Q25J328J902J709J118O95K61
56572A57519k93l69M61J747K888L760M261M122L607L559M309N287O044O949Q476
$$ plain form
56685 140319 141473 142251 143270 144550 145667 146912 149062 151874 154070 155152 155941 156888 157165 156147 154590
56670 154590 153475 152610 151282 149599 148289 147618 147163 146367 144970 143173 141573 140486 139426 137872 136487
56655 136487 136585 138330 140459 142017 143289 144743 146156 147269 148307 149287 149643 149077 148120 147443 147326 148026
56639 148026 149767 152000 153610 154283 154866 155991 157179 157686 157366 156345 154711 152904 151545 150522 149117
56624 149117 147298 145912 145290 144704 143564 142065 140355 138273 136341 135673 136319 136936 136810 136887 137988 139319
56608 139319 139790 139646 139655 139724 139481 139377 139987 140915 141484 141901 142690 143555 143864 143789 143986 144571 145205 145740 146042 145696
56588 145696 144685 143787 143607 143813 144040 144784 146480 148425 149681 150506 151834 153736 155445 156563 157258 157519
56572 157519 157226 156857 157318 159065 161953 165713 169974 174096 177703 181262 185571 190858 196902 203851 212327
56557B12327J0311J1502J1089Q708N016J354j460l724n758o917o518n141l949
56544B26840l257k813k827l445l796l041j881j599j975j790j032q80j606k200
56530A94698k106j773j434q00j37j35o32p37k71J60M11Q14J155J022Q72J269J409
56513A93785J29j861k625j807r28r13j173j220j325j381r39n03j034k060k156
56498A73989j348j068j593j658q93m36o38m38M27P20J7l63L44J104J048Q32J106
56481A71152J371J299J512K099K059J177P03J185J364L20q59q73j70J21m7j71
56465A82242k70l79o8O06P86L43M22J512K337J755N59J88O58R47O26P0k78r1P17
56446A92682J560J609J041R39J604K087J756J090N39j44j010j580j844k305k711
$$ plain form
56557 212327 222638 234140 245229 253937 258953 260307 258847 255123 249365 242448 235930 230789 226840
56544 226840 223583 220770 217943 214498 210702 207661 205780 204181 202206 200416 199384 198504 196898 194698
56530 194698 192592 190819 189385 188585 188448 188313 187681 186944 186673 186833 187244 188058 189213 190235 191107 192376 193785
56513 193785 193914 192053 189428 187621 186693 185780 184607 183387 182062 180681 179742 179239 178205 176145 173989
56498 173989 172641 171573 169980 168322 167429 166993 166355 165917 166344 167064 167081 166718 167062 168166 169214 170046 171152
56481 171152 172523 173822 175334 177433 179492 180669 181372 182557 183921 184241 183382 182509 182339 182460 182413 182242
56465 182242 181972 181593 181525 182131 182917 183260 183682 185194 187531 189286 189845 190033 190691 191638 192264 192334 192056 191965 192682
56446 192682 194242 195851 196892 197831 199435 201522 203278 204368 204907 204763 203753 202173 200329 198024 195313
56431A95313k149p65J62K16L31Q38Q30K7m55k2L88%o61j088j603k055j393M88
56413A88402K092K318J694Q73l17j546j551q2J354J734J821K309K494J943J622
56398B05160K043K044P78o26q25k04K41N26R21R77N63N11J091J331R20J067K207
56381B18725K748J586J43J60J054J273Q40O89P02K77j32K59J049J384J340J392
56365B33489J384J194J374K041K273J645J071J111R02nm42L90J318J102M89P77
56349B50113J664K177K391K621K228Q64k99k23K75Kn94m52K50Q18J508K695L662
56332B69700L723L503L829M386M668M900M995M125K574K215L664M828L941K173
56318C23224J449J467R55K09J70M28K27J66R37J692J633J764L056M349M188L384
$$ plain form
56431 195313 193164 192399 192561 192777 193108 193946 194776 194803 194348 194326 194714 194714 194053 192965 191362 189307 187914 188402
56413 188402 190494 192812 194506 195379 195062 193516 191965 191883 193237 194971 196792 199101 201595 203538 205160
56398 205160 207203 209247 210025 209399 208574 208370 208611 209137 210058 211035 211598 212109 213200 214531 215451 216518 218725
56381 218725 221473 223059 223202 223362 224416 225689 226529 227218 227920 228197 228065 228324 229373 230757 232097 233489
56365 233489 234873 236067 237441 239482 241755 243400 244471 245582 246484 246479 246037 246427 247745 248847 249336 250113
56349 250113 251777 253954 256345 258966 261194 262058 261759 261536 261811 261813 261219 260767 261017 261835 263343 266038 269700
56332 269700 273423 276926 280755 285141 289809 294709 299704 303829 306403 308618 312282 317110 321051 323224
56318 323224 324673 326140 327095 327304 327474 327902 328129 328295 329232 330924 332557 334321 337377 341726 345914 349298
56302C49298L542M418M881N190O085O912O793O399O503O208M788L746M633O269
56288D25665O625O082O259O964P026O994Q193J0015J0821J0687J0820J1176J1088
56275E38415J1270J2664J4333J4941J5329J7059J9493K0944K1704K3191K5162
56264G34505K6500K7822L0490L3913L6699L9585M4369N0688N6771O2630O9665
56253A213637P7786Q5905R4632J05534J18213J30824J42904J54939J66005J74626
56243B465005J81278J87085J90848J90311J85464J77472J65333J47091J23685
56234D013572R8046P0825M0676Q428k2773n1413p8227j02816j23252j39183j52022
56223C561861j61770j66994j68174j67684j66134j61984j55148j47697j40389
$$ plain form
56302 349298 352840 357258 362139 367329 373414 380326 387119 393518 400021 406229 411017 414763 419396 425665
56288 425665 432290 438372 444631 451595 458621 465615 473808 483823 494644 505331 516151 527327 538415
56275 538415 549685 562349 576682 591623 606952 624011 643504 664448 686152 709343 734505
56264 734505 761005 788827 819317 853230 889929 929514 973883 1024571 1081342 1143972 1213637
56253 1213637 1291423 1377328 1471960 1577494 1695707 1826531 1969435 2124374 2290379 2465005
56243 2465005 2646283 2833368 3024216 3214527 3399991 3577463 3742796 3889887 4013572
56234 4013572 4111618 4182443 4223119 4231547 4208774 4157361 4079134 3976318 3853066 3713883 3561861
56223 3561861 3400091 3233097 3064923 2897239 2731105 2569121 2413973 2266276 2125887
56214B125887j31791j21545j11528j02980r5216q7815q1435p5920p0111o3994
56204A183552n8691n4148m9287m4401m0744l7846l4060k9662k6506k4610k2148
56193G61449j8865j6461j5350j4086j2244j0962j0312r123p562o981p087o168
56181F26248m257l134l109k829k161k166k316j064Q20R78l97o50J002K678L600
56166F13243M956O683P059O075N736O492O802O562P476R513J0652J0659J1553
56153G13461J3819J5705J6841J8879K1948K4192K5491K8075L2701L7705M2446
56142I91263M8170N4951O1231O6788P2492P7003P7550P4263O9737O4363N6499
56131A714310M7474M1429L9422L8290L6168L4279L2344K7379J8733R704K590l637
$$ plain form
56214 2125887 1994096 1872551 1761023 1658043 1562827 1475012 1393577 1317657 1247546 1183552
56204 1183552 1124861 1070713 1021426 977025 936281 898435 864375 834713 808207 783597 761449
56193 761449 742584 726123 710773 696687 684443 673481 663169 654046 646484 639503 632416 626248
56181 626248 621991 618857 615748 612919 610758 608592 606276 605212 606032 607010 606613 605963 606965 609643 613243
56166 613243 618199 624882 631941 638016 643752 650244 657046 663608 671084 680597 691249 701908 713461
56153 713461 727280 742985 759826 778705 800653 824845 850336 878411 911112 948817 991263
56142 991263 1039433 1094384 1155615 1222403 1294895 1371898 1449448 1523711 1593448 1657811 1714310
56131 1714310 1761784 1803213 1842635 1880925 1917093 1951372 1983716 2011095 2029828 2039532 2042122 2038485
56119B038485r638j4259j8220k4635l4208m4198n3196o2463p1406p6700p7408
56108A552154p6133p3772o8093n9097n0529m4224l7998l0925k5448k2321j8741
56097A044873j3711r973q422o019j677J261J112R73K865M115K804J704L362N952
56083A029219P173P919R113R393Q656R328J1653J2422J0781J0175J2111J3422
56071A151365J2363J1826J3603J5124J4992J5989J9310K1518K0675J9842K1094
56060A337701K1859K0619K0290K2276K3167K1149J9642K0778K1433J9735J9093
56049A567742K1467K3073K1293J9610K1031K2882K2843K3736K7463L0535L0589
56038A832264L1038L4348L7180L7123L7545M0736M3128M2525M2921M6835N0141
$$ plain form
56119 2038485 2028847 2014588 1996368 1971733 1937525 1893327 1840131 1777668 1706262 1629562 1552154
56108 1552154 1476021 1402249 1334156 1275059 1224530 1180306 1142308 1111383 1085935 1063614 1044873
56097 1044873 1031162 1021189 1012767 1006748 1005071 1006332 1007444 1008417 1011282 1015397 1018201 1019905 1023267 1029219
56083 1029219 1036392 1044311 1053424 1062817 1071473 1080801 1092454 1104876 1115657 1125832 1137943 1151365
56071 1151365 1163728 1175554 1189157 1204281 1219273 1235262 1254572 1276090 1296765 1316607 1337701
56060 1337701 1359560 1380179 1400469 1422745 1445912 1467061 1486703 1507481 1528914 1548649 1567742
56049 1567742 1589209 1612282 1633575 1653185 1674216 1697098 1719941 1743677 1771140 1801675 1832264
56038 1832264 1863302 1897650 1934830 1971953 2009498 2050234 2093362 2135887 2178808 2225643 2275784
56027B275784N0079N0708N4671N7402N5747N4364N7059N9827N9280N9698O4497
56016B899116O9072O9643P0741P6142Q1031Q1420Q2573Q9378R7029J00273J03144
56005C819562J10269J17395J20161J23387J31811J40572J44940J50143J61189
55996E019429J72630J79134J86222J99300K12505K20312K29354K46218K64555
55987F929659K77611K92112L15747L42456L64756L88832M22048M57831M89063
55978A0280115N23816N70951O23302O72702P27801P98540Q78024R59500J055218
55969A7089969J177323J317463J468320J646763J871017K135704K437378K803409
55961C1947346L266217L834113M521423N379407O456818P755851R265173J1000681
$$ plain form
56027 2275784 2325863 2376571 2431242 2488644 2544391 2598755 2655814 2715641 2774921 2834619 2899116
56016 2899116 2968188 3037831 3108572 3184714 3265745 3347165 3429738 3519116 3616145 3716418 3819562
56005 3819562 3929831 4047226 4167387 4290774 4422585 4563157 4708097 4858240 5019429
55996 5019429 5192059 5371193 5557415 5756715 5969220 6189532 6418886 6665104 6929659
55987 6929659 7207270 7499382 7815129 8157585 8522341 8911173 9333221 9791052 10280115
55978 10280115 10803931 11374882 11998184 12670886 13398687 14197227 15075251 16034751 17089969
55969 17089969 18267292 19584755 21053075 22699838 24570855 26706559 29143937 31947346
55961 31947346 35213563 39047676 43569099 48948506 55405324 63161175 72426348 83427029
55953H3427029J2972659J5168976J7632244K0474899K3700028K7047683L0108874
55946B30532392L2449407L3348935L1491760K5457226J5008602J892591j0924807
55939C59256106k0972933k7340877l0411418l1017740k9943149k7842878k5225265
55932A66501846k2408339j9575505j6876456j4430587j2277111j0398747q786172
55925F1748929p436944o316987n375365m586446l940717l409854k957493k571817
55917B5153306k254799j991105j757361j550783j380096j237722j106873r87020
55909A2887547q87685q05036p27266o55564n98309n51442n04550m59676m25158
55900G272861l97383l66801l35686l12405k94022k71667k47603k30366k17965
$$ plain form
55953 83427029 96399688 111568664 129200908 149675807 173375835 200423518 230532392
55946 230532392 262981799 296330734 327822494 353279720 368288322 370180913 359256106
55939 359256106 338283173 310942296 280530878 249513138 219569989 191727111 166501846
55932 166501846 144093507 124518002 107641546 93210959 80933848 70535101 61748929
55925 61748929 54311985 47994998 42619633 38033187 34092470 30682616 27725123 25153306
55917 25153306 22898507 20907402 19150041 17599258 16219162 14981440 13874567 12887547
55909 12887547 11999862 11194826 10467560 9811996 9213687 8662245 8157695 7698019 7272861
55900 7272861 6875478 6508677 6172991 5860586 5566564 5294897 5047294 4816928 4598963
55891D598963k01959j83668j70914j62563j51161j37365j27717j21275j11888
55882C230453j00777r4251r1783q8339q5295q7266r1130q9932q4881q2325q1716
55871B252758p7706p1487o8849o9150o6799o1803n8686n6913n2276m5954m2648
55860A580487m1464l7847l2785l1017l1898l0904k8410k8288k9541k7941k4453
55849A235939k3621k5110k5035k3940k5334k7911k7455k4970k4807k6164k4668
55838I56924k0987j9704k0652j9540j6350j5186j6268j5778j3349j2349j3003
55827G73758j2343j0568j0585j1682j0565q124q343j0981j2111j1462j2276j4257
55815F40461j3731j0756r239r811r195o895n960o701o062l685k575l177k681o80
$$ plain form
55891 4598963 4397004 4213336 4042422 3879859 3728698 3591333 3463616 3342341 3230453
55882 3230453 3129676 3035425 2943642 2855303 2770008 2682742 2591612 2501680 2416799 2334474 2252758
55871 2252758 2175052 2103565 2034716 1965566 1898767 1836964 1778278 1721365 1669089 1623135 1580487
55860 1580487 1539023 1501176 1468391 1437374 1405476 1374572 1346162 1317874 1288333 1260392 1235939
55849 1235939 1212318 1187208 1162173 1138233 1112899 1084988 1057533 1032563 1007756 981592 956924
55838 956924 935937 916233 895581 876041 859691 844505 828237 812459 799110 786761 773758
55827 773758 761415 750847 740262 728580 718015 709891 701548 690567 678456 666994 654718 640461
55815 640461 626730 615974 606735 596924 587729 580834 574874 568173 562111 558426 555851 552674 549993 549313
55801E49313K72J20J558M372N179L353J796J412K34j630j654o4j4k024l407l576
55785E55240m703o643o611m574l803n325o740p106q025r265q379n418l117j824
55771D73707R51N324Q426R513J0599J1305Q395J679m730q359j0851j3305j4044
55758D78610j2570j1174j0869r932p911p028q125r208r310r923j1405j1915j1027
55745C48213j0551j0677r332o437m665m826m532k701j282j212q18L34R9k102l688
55730B85823l197k461k937l469l262l525m548m700l785l824n073m987k739r55
55716B36361j186j385J57J928K381K648L802M628M265M119M968N012K940L16j135
55701B69819k092l590m906n334n730o608p011o683o836p453o562l768j570j512
$$ plain form
55801 549313 549585 549705 551263 555635 560814 564167 565963 567375 567609 565979 564325 564261 564247 562223 558816 555240
55785 555240 550537 543894 537283 532709 528906 523581 516841 509735 501710 492445 484066 478648 475531 473707
55771 473707 474658 479982 488408 497921 508520 519825 528220 529899 525169 516810 505959 492654 478610
55758 478610 466040 454866 443997 434065 426154 419126 411001 401793 392483 382560 371155 359240 348213
55745 348213 337662 326985 317653 311216 306551 301725 297193 294492 293210 291998 291180 291514 291613 289511 285823
55730 285823 282626 280165 277228 273759 270497 266972 262424 257724 253939 250115 245042 240055 237316 236361
55716 236361 235175 233790 233947 235875 238256 240904 244706 249334 253599 257718 262686 267698 270638 270954 269819
55701 269819 267727 264137 259231 253897 248167 241559 234548 227865 221029 213576 207014 203246 201676 200164
55687B00164j805o66P47Q34M04Q37J593J722J825K621L317L160K861K946K556
55672B23116J253J60l5l30j410k385k631k871l293k768j130K6o5j31N99J018N42
55655B09665M31J334J910J319Q22J413K061J777J287J250R06j51r51j090j594
55640B20389k698l115k592k711m015m911m688m847o028o451n096l641l456l327
55626A62813k181j290j684j976r87j13p40j627j253n33q48j406j027n93j284k163
55610A43108j946j465j966k600j956o77k86p30j100j437j878j595m03J54p67j538
55594A22918p14M18J13q45q01j88l30p87m31J02m00j250r99p9O4m52m66j0J21
55575A15984K34J092K191K572K603L134L734L581L148L362L845L702L018K129
$$ plain form
55687 200164 198359 197693 198440 199274 199678 200515 202108 203830 205655 208276 211593 214753 217614 220560 223116
55672 223116 224369 224529 224494 224164 222754 220369 217738 214867 211574 208806 207676 207702 207637 207506 208105 209123 209665
55655 209665 210096 211430 213340 214659 215481 216894 218955 220732 222019 223269 224175 224024 223073 221983 220389
55640 220389 217691 214576 211984 209273 205258 200347 195659 190812 184784 178333 173237 169596 166140 162813
55626 162813 160632 159342 157658 155682 154695 154582 153842 152215 150962 150429 149581 148175 147148 146555 145271 143108
55610 143108 141162 139697 137731 135131 133175 132498 132212 131482 130382 128945 127067 125472 125069 125223 124456 122918
55594 122918 122204 122622 122735 121890 121089 120901 120571 119784 119353 119455 119055 117805 116806 116727 116791 116339 115873 115863 115984
55575 115984 116218 117310 119501 122073 124676 127810 131544 135125 138273 141635 145480 149182 152200 154329
55561A54329N66j675l127k848k121k370k868k454j978k789m087m117l043k306
55547A19112k113j669j075q91o16L75J235R85M23P11J142N04m05K4J342J762J060
55530A21906M49J95k80n33K87J322Q49r66k259k268j969k110k444k798l238l336
55514A02807k724j988j700j213N1J028M79q69j392j025p44n52N6M01l43j188n83
55497I0501R53J612J159P94O93L6r59j254r84j036j047r9J019O23r28j553o93
55480H8837J15Mj80K03P11J155J835K251J461o0p95m71j88k98j46Q8n69j797k088
55461I0068j249p44j121j179k56O19N49J01NQ1K5Nm5m95j042q80j07L43K38K28
55441H5144M45L62O7J99N56L07l80m97k1M3m08l68L94Q63N26J1l06p04r73m19
$$ plain form
55561 154329 154895 153220 150093 147245 145124 142754 139886 137432 135454 132665 128578 124461 121418 119112
55547 119112 116999 115330 114255 113364 112748 113123 114358 115343 115766 116477 117619 118123 117718 117742 119084 120846 121906
55530 121906 122355 122550 122270 121737 122024 123346 124195 123229 120970 118702 116733 114623 112179 109381 106143 102807
55514 102807 100083 98095 96395 95182 95233 96261 96740 95871 94479 93454 92710 92158 92214 92615 92272 91084 90501
55497 90501 91454 93066 94225 95019 95712 95748 94789 93535 92551 91515 90468 90369 91388 92011 91083 89530 88837
55480 88837 88952 88956 88776 88979 89690 90845 92680 94931 96392 96332 95537 95066 94878 94580 94434 94522 93953 92156 90068
55461 90068 88819 88075 86954 85775 85519 86138 86687 86788 86793 86874 86899 86904 86859 86364 85322 84442 84335 84678 84916 85144
55441 85144 85589 85951 86018 86217 86773 87080 86700 86203 86182 86225 85817 85449 85843 86706 87232 87243 86937 86233 85260 84841
55421H4841O63J118Q05P37J103R10m5n73q7M56K63j47j13J59M19Q59J258R06j40
55402I3392r06j003j017j145q59k10m0m71o08j71P9j8M22J507J883P96n82q35
55384I0214j73L09K53jk83n70o81n00j34L98J005J161N39j61j7N62L44p81j709
55365H9775j947k032k064j415k06M80K78m5j32n13j114r40J54R63Q17N28O96O51
55347H3934p6o40k73L76L35k87q51j204j357j045l68n0l32m51J08O66L76m96r54
55328G7411m69O17J377R00p01j925j391K89J203O53k34m72l70m96p70j012j165
55311G3445q32K82J345J184K15M5R76J550R40O9j85j46j35J44M20k81j762k394
55293G4880j529n03l61l32M11J199J330J405J924K051J180L11M87J139J361J506
$$ plain form
55421 84841 85504 86622 87427 88164 89267 90177 90132 89559 89472 89928 90191 90044 89931 90090 90509 91368 92626 93532 93392
55402 93392 92486 91483 90466 89321 88462 88252 88212 87741 87133 86962 87041 87023 87445 88952 90835 91631 91049 90214
55384 90214 90041 90350 90603 90602 90319 89749 89068 88568 88434 88832 89837 90998 91537 91376 91359 91921 92265 91484 89775
55365 89775 87828 85796 83732 82317 82111 82591 82869 82824 82692 82179 81065 80125 80279 81242 82059 82587 83283 83934
55347 83934 83858 83218 82945 83321 83656 83369 82518 81314 79957 78912 78544 78494 78162 77711 77819 78485 78861 78365 77411
55328 77411 76942 77559 78936 79836 79135 77210 75819 76108 77311 77964 77730 77258 76888 76392 75622 74610 73445
55311 73445 72613 72895 74240 75424 75639 75684 76660 78210 79150 79219 79034 78888 78753 78897 79317 79036 77274 74880
55293 74880 73351 72848 72487 72155 72566 73765 75095 76500 78424 80475 81655 81966 82453 83592 84953 86459
55277H6459K014J982N83j127j498n84L55Q47J203J246N84k92n79l62k01JN69J117
55259I2317J119Q96R73J076P31J87k37r11j941k357j491m04n60j644k135j512
55243H4107n46K21R14J396J197L83l94o66l96K58P75M86m31q47l11N6o95j657
55225H3850j387j36O12L69j1N7K94M04M31L11L7O4O88J318J206O33M11O17P02
55206I0470N44L76M7o40j153q10P2N57L76K4j97l27l34l66r42k012k332r83R59
55187H3329J583O85j92j43J41k1j86K01P78Q99O14M20N23P66R02P37K51l10o51
55168I0326p35o57m16j10j9j43l0M71P09Q3r15j257p12N7N63R59J388J562J189
55149I2313M35k03l61j63j10n18j027j077p07m38m00k62k3o9k80q8M05M03j71
$$ plain form
55277 86459 88473 90455 91038 89911 88413 87829 88184 89031 90234 91480 92064 91772 91193 90831 90630 90631 91200 92317
55259 92317 93436 94332 95305 96381 97112 97299 97062 96151 94210 91853 90362 89958 89398 87754 85619 84107
55243 84107 83561 83782 84696 86092 87289 87672 87278 86612 86216 86474 87249 87735 87304 86457 86146 86202 85507 83850
55225 83850 82463 82327 82939 83308 83297 83354 83648 84052 84483 84794 84831 84895 85583 86901 88107 88740 89151 89768 90470
55206 90470 91014 91390 91437 90797 89644 88834 88906 89463 89839 89863 89666 89339 89005 88639 87697 85685 83353 82370 83329
55187 83329 84912 85597 85405 85262 85403 85382 85196 85397 86175 87074 87688 88108 88631 89397 90299 91036 91287 90977 90326
55168 90326 89591 88934 88518 88408 88389 88246 88216 88687 89396 89479 88564 87307 86595 86652 87215 88174 89562 91124 92313
55149 92313 92748 92545 92184 92021 91911 91393 90366 89289 88582 88144 87744 87482 87459 87390 87110 87022 87427 87830 87659
55130H7659l94M4K14l53o28K78J482J612P28r6m11l89L6Q24J193N10n66r08m15
55111I0420J97N81P42N07m5j99L53P97M76R5M71R29L77p83j236p16M0P53J478
55092I5237J663R01J86O39J495J151j29n47K45O58j02q32m45N15J164J550J832
55075A05181J618Q94M47O58R22Q23Q17J082Q59k60j425j708j395j259j276q94
55059A05084j63K81K8o89j233r76J39J287J488P69M5k29n53j296j888j584n01
55042A00009N79J080R35L10n79j438j881j564n31N49R08O32N35Q76R70M89J86
55025A02065M68L46r11k047j472J2J70j175j789n34R33Q02l50q25l08L44O96Q58
55007I7283O49j03q24p88j87K22K97M44O88N70N2k77p4K57J52l11n32j94L85P54
$$ plain form
55130 87659 87265 87309 87523 87170 86542 86820 88302 89914 90642 90546 90135 89746 89782 90606 91799 92309 91743 90835 90420
55111 90420 90617 91198 91940 92447 92402 92203 92556 93353 93829 93924 94395 95324 95701 94918 93682 92966 93006 93759 95237
55092 95237 96900 97801 97987 98626 100121 101272 101143 100596 100841 101499 101397 100565 100120 100635 101799 103349 105181
55075 105181 106799 107693 108140 108798 109720 110543 111360 112442 113301 113041 111616 109908 108513 107254 105978 105084
55059 105084 104921 105202 105230 104541 103308 102332 102471 103758 105246 106015 106060 105831 105278 103982 102094 100510 100009
55042 100009 100588 101668 102603 102913 102334 100896 99015 97451 96920 97469 98377 99009 99544 100420 101390 101879 102065
55025 102065 102533 102879 101968 99921 98449 98461 98631 97456 95667 95133 96066 96868 96518 95693 95385 95729 96425 97283
55007 97283 97932 97829 97005 96217 96030 96252 96549 96993 97681 98251 98303 98026 97952 98209 98361 98050 97518 97324 97709 98463
54987I8463R34J231J559J519J161J059J346J352O61k6J33Q25J050O04J96K66M87
54970A12820M32M5n30j055j237j090j035j190j000j38P80J091J082J257J241N30
54954A12003k33l7P81R81L41k21l17m59p54o35j34m9n27p39l40q3n49j257j484
54935A06288j130m54K33M93J68j13L04R97J149J064J671K705K976K529K730L963
54919A25573M972N064N206O121O915O577N511M503L463K168J168Q13L49r57k644
54904A74802l922m828n655o087n795n190m706m192l638l596l984l577j728L31
54890A18235J033N42J50L10M96M67M49M71N18R83K041L006L229L165L608M385
54874A43088M838N095N762O576O594N570M194L002J935Q80k28j756l974o318p761
$$ plain form
54987 98463 99397 100628 102187 103706 104867 105926 107272 108624 109285 109259 109392 110217 111267 111871 112067 112333 112820
54970 112820 113252 113297 112767 111712 110475 109385 108350 107160 106160 106022 106802 107893 108975 110232 111473 112003
54954 112003 111770 111733 112514 113495 113836 113615 113298 112839 112085 111450 111316 111267 110740 110001 109661 109578 109029 107772 106288
54935 106288 105158 104704 104937 105430 105598 105485 105789 106786 107935 108999 110670 113375 116351 118880 121610 125573
54919 125573 130545 135609 140815 146936 153851 160428 165939 170442 173905 176073 177241 178054 178403 177446 174802
54904 174802 170880 166052 160397 154310 148515 143325 138619 134427 130789 127193 123209 119632 117904 118235
54890 118235 119268 119810 119960 120270 120766 121233 121682 122153 122671 123654 125695 128701 131930 135095 138703 143088
54874 143088 147926 153021 158783 165359 171953 177523 181717 184719 186654 187534 187306 185550 181576 175258 167497
54859A67497p900p138n878m355l117k839l422l908l572k661j857j410j079p31
54845A17630o89j296k226k572j921r92o95q49n31L50Q09K61o34r91p40k69K67
54828A04912P85J055J062J033Q56J84p22j068p32m57m83j52O72J061O14L01P43
54811A09664R31j67j693k087j385q42q24n81J40P18Q70R83J133Q49N0o55p61l41
54793A06002L02Q99J188J137J019R02M32m29r43n47K98Q31J026J152R44K20k47
54776A14186L54J444J694R31K71M41J069J631K109K549K860L169L732M457N091
54761A45988N756O593P102O644N499M476L598K043m74l156n051n900n962n741
54747A61415n828o334o452n299l260j755j571k054k103j346k71L50P9o58p97J42
$$ plain form
54859 167497 159597 152459 146581 142226 139109 136270 132848 128940 125368 122707 120850 119440 118361 117630
54845 117630 116941 115645 113419 110847 108926 107934 107239 106390 105859 106209 107018 107279 106645 105654 104914 104645 104912
54828 104912 105697 106752 107814 108847 109703 109887 109165 108097 107365 106908 106425 106273 106945 108006 108620 108921 109664
54811 109664 110595 110428 108735 106648 105263 104421 103597 103016 103156 103874 104744 105727 106860 107709 107759 107104 106343 106002
54793 106002 106304 107203 108391 109528 110547 111449 111881 111452 110509 109962 110260 111091 112117 113269 114213 114433 114186
54776 114186 114540 115984 117678 118609 118880 119321 120390 122021 124130 126679 129539 132708 136440 140897 145988
54761 145988 151744 158337 165439 172083 177582 182058 185656 187699 187225 184069 179018 173118 167156 161415
54747 161415 155587 149253 142801 137502 134242 132487 130916 128862 126759 125413 125142 125492 125571 124913 124116 124258
54731A24258J296J544J003O58Q12R28R27J473K723L875M372M647N158N456M955
54716A64085M019L535L605L388K255O16p12j583k612m117n446n776n250m729m516
54701A46762m151l482l025k935k608j810j278j452j619j187q68j497k463k620
54687A15767k123j910j839r65M80J030J27j060j339q19j50M37Q26P15J69k47k78
54670A08821l28o56r11p76m51k37q9J44M92R84J512J685J269O70L88K56j46n85
54652A12042n59l14m60p94o11q7n0l66K3J240J978J436L83k78p42j332j469o55
54634A09385M23P95N85N44P45O97L37O4k1j53l31k96K3M83R50J198Q86j9j001
54615A15294j465j274o68m9J75n7j37N38J510J618O16m24p46q69j347j527o27
$$ plain form
54731 124258 125554 127098 128101 128759 129571 130499 131426 132899 135622 139497 143869 148516 153674 159130 164085
54716 164085 168104 171639 175244 178632 180887 181503 180791 179208 176596 172479 167033 161257 156007 151278 146762
54701 146762 142611 139129 136104 133169 130561 128751 127473 126021 124402 123215 122347 120850 118387 115767
54687 115767 113644 111734 109895 108930 109410 110440 110567 109507 108168 107349 107199 107636 108462 109177 109346 109099 108821
54670 108821 108493 107837 106926 106150 105699 105462 105373 105517 106009 106993 108505 110190 111459 112129 112517 112773 112627 112042
54652 112042 111483 111169 110709 109915 109304 109217 109167 108801 108824 110064 112042 113478 113861 113583 112841 111509 110040 109385
54634 109385 109808 110603 111188 111732 112477 113174 113511 113575 113554 113401 113070 112774 112797 113280 114230 115428 116314 116295 115294
54615 115294 113829 112555 111887 111838 112013 111956 111819 112357 113867 115485 116101 115677 114931 114062 112715 111188 110561
54598A10561O73R52N4p79o93j50Q8J9J34O18J183J401J086N28K84M84N25j27j009
54579A15832j104k32O31O03n6m77l46r5r4k40l24m06n94p69p77p39p90p56l80
54560A08887J36L04R1oK87O31P20P23Q28Q22N91N48J046J685J830J525J295J280
54542A23223J168Q41M92K43J62M73J199J779J650R67K39m17j041j271r04o31j211
54525A26961k108k064r67O0M38P39J282J368N21o01j170j203j101q76n17l83o20
54508A19759p75m75n1M4j52m50q68j231j022j68O16P53N28M16K97p8m24l27N2
54489A16444L19M82O98P75N31L12N38R89J119Q76O86P27P86P44Q01J129J606J882
54471A31444J659R76L08J10K99M24L38L06M58O40Q58J210J347P09n10j371j493
$$ plain form
54598 110561 111234 112186 112240 111461 110768 110618 110706 110725 110859 111477 112660 114061 115147 115675 115959 116443 116968 116841 115832
54579 115832 114728 114496 115127 115730 115674 115197 114851 114756 114662 114422 114098 113692 113098 112329 111552 110813 110023 109267 108887
54560 108887 109023 109327 109418 109412 109699 110330 111050 111773 112601 113423 114014 114562 115608 117293 119123 120648 121943 123223
54542 123223 124391 125232 125724 125967 126129 126602 127801 129580 131230 132197 132436 132019 130978 129707 128803 128172 126961
54525 126961 124853 122789 121822 121882 122320 123059 124341 125709 126230 125629 124459 123256 122155 121279 120762 120379 119759
54508 119759 118984 118509 118458 118502 118350 117900 117032 115801 114779 114611 115227 115980 116508 116924 117221 117143 116719 116392 116444
54489 116444 116763 117245 117943 118718 119249 119561 120099 121088 122207 123083 123769 124496 125282 126026 126827 127956 129562 131444
54471 131444 133103 134079 134387 134497 134796 135220 135558 135864 136322 136962 137820 139030 140377 141086 140576 139205 137712
54454A37712j494j738j533l15J099J393N33k96l18K0m6n94j094j113p06k76j09
54437A31125r2J7J31j5k98k83M5J95o2k98j06L28O52Q32R61R61Q29P84Q54O78
54417A37238L2p80j268j154l99P41J584J523P92J32k97q83j394r32N40J733J707
54400A38915J109R68J209J258J296J699J894J049l87j061o19r8l34q81q77k14
54384A44926N06P46M68Qk18l1M67J097J705K043J902J526J464J855K219K169J926
54367A64778J896K162K671L389L944L652K344P48l50r46j509k233k991l526l498
54352A70531k725j633r15o82n88q22j894l236l315j796l10j97p02m98R4j28j100
54335A50084j677j505j243j156q53k89J40M42Q84J162Q15K61K80O50M79k01m18
$$ plain form
54454 137712 136218 134480 132947 132632 133731 135124 135657 135361 135043 135063 135017 134423 133329 132216 131510 131234 131125
54437 131125 131033 131050 131181 131166 130868 130585 130630 130825 130763 130465 130359 130687 131339 132171 133132 134093 134922 135706 136560 137238
54417 137238 137270 136490 135222 134068 133669 134410 135994 137517 138309 138441 138144 137261 135867 134935 135475 137208 138915
54400 138915 140024 140992 142201 143459 144755 146454 148348 149397 149010 147949 147330 147232 146898 146017 145140 144926
54384 144926 145432 146178 146646 146654 146436 146405 146872 147969 149674 151717 153619 155145 156609 158464 160683 162852 164778
54367 164778 166674 168836 171507 174896 178840 182492 184836 185584 185234 184288 182779 180546 177555 174029 170531
54352 170531 167806 166173 165258 164576 163988 163166 161272 158036 154721 152925 152615 152418 151716 151218 151312 151184 150084
54335 150084 148407 146902 145659 144503 143650 143361 143501 143943 144827 145989 146804 147065 147345 147995 148474 148273 147855
54318A47855P0L90J4n44p82r22j138j070n55r2r8k81j76K04M42Q7j016k320k695
54299A37373j632q9N62K86J08L99N66M40O04J073R59l5q67o55Q9L98K95L60N87
54280A40821N23J98J01L65O10N49K66l1k46l63m19l61K2Q24J611J701R97J84m6
54261A47306L23Q77J320J548J525J317J077Q94P60O92O59M27j86r15j229r94n84
54244A54817l61l23l47m03m56l98j80J46N16Q44R80Q68O28K94k84j060j608j620
54226A52053j283q77l35L34O48K60m19p30o08l72m2M44P44O18N28Q56R84J49j066
54207A51886j267k77O44O12J02k12m22p71j027r73q34p57n29j27R6M1P9L77O23
54188A47264O27N44L51j70p13o06R0M55P8l00QO06Q28Q15J089J553J644J127K52
$$ plain form
54318 147855 147925 148315 148329 147785 147003 146081 144943 143873 143318 143226 143128 142847 142671 142875 143317 143404 142388 140068 137373
54299 137373 135741 135652 136214 136500 136608 137007 137573 138013 138617 139690 140649 140614 139747 139092 139181 139579 139874 140234 140821
54280 140821 141344 141542 141643 142008 142618 143167 143433 143402 143156 142793 142374 142013 142035 142859 144470 146171 147168 147352 147306
54261 147306 147629 148506 149826 151374 152899 154216 155293 156187 156947 157639 158298 158725 158539 157624 156395 155401 154817
54244 154817 154456 154133 153786 153383 152927 152529 152349 152495 153011 153855 154835 155703 156331 156625 156341 155281 153673 152053
54226 152053 150770 149893 149558 149892 150540 150800 150381 149651 149043 148671 148629 149073 149817 150435 150963 151819 152803 152952 151886
54207 151886 150619 150342 150986 151598 151700 151488 151066 150295 149268 148295 147461 146704 146175 146048 146144 146185 146264 146641 147264
54188 147264 147891 148435 148786 148616 147903 147297 147387 147842 147920 147620 147628 148234 149062 149877 150966 152519 154163 155290 155542
54169A55542n84r23m74L69O46n0r74j145n27J41L46J42k25o19r70j184j110o11
54151A47790P8L77J14j0O43J433J103l27j403j192l69M7O0J42K07j5k30qM44O31
54131A49515N20L34P1k74l51K5L84K03k80l90R3Q42J461J662J332Q66J054K165
54113A59232L435L950L675L160K718K407K463K970L436L288K701K239J869J002
54099A98545m96j916k592k679k816l182l203k243n75O52N73l76j110j369j880
54084A75333k969l783l379j986o41N2K50K87L10L91N96Q98J290J777K214K306
54068A72946J941J320O99K32K3Kj60n78o88P2J212J578Q87P1j29J%J9L10O93J092
54047A81543J804K739L195L014L097M027M968M853M010L610L979M445M585M632
$$ plain form
54169 155542 154958 154035 153561 153930 154576 154526 153552 152407 151880 152021 152367 152509 152284 151665 150695 149511 148401 147790
54151 147790 147868 148245 148359 148349 148992 150425 151528 151201 149798 148606 148237 148284 148344 148486 148693 148678 148448 148440 148884 149515
54131 149515 150035 150369 150440 150166 149815 149840 150224 150427 150147 149757 149850 150692 152153 153815 155147 156013 157067 159232
54113 159232 162667 166617 170292 173452 176170 178577 181040 184010 187446 190734 193435 195674 197543 198545
54099 198545 198049 196133 193541 190862 188046 184864 181661 179418 178843 179495 180068 179692 178582 177213 175333
54084 175333 172364 168581 165202 163216 162575 162627 162877 163164 163474 163865 164461 165359 166649 168426 170640 172946
54068 172946 174887 176207 176906 177138 177161 177163 177003 176425 175737 175809 177021 178599 179486 179557 179428 179429 179429 179448 179758 180451 181543
54047 181543 183347 186086 189281 192295 195392 199419 204387 209240 213250 216860 220839 225284 229869 234501
54033B34501M815N030N168N123M713M040L646L754L789L233K534K416K712K713
54019B88187K240J618Q08m26j709k378k577l123m245n219n449n149m834m626m366
54004B48752l967l504l182l167l258k967k249j792k198l061l433k887j763n99
53990B10725J71K61k09o82q43r69j217j064j23J005J502J528J848K554L145L605
53974B21237M447N718O824P343P168N970L407ll031m916n793n985n624n009m553
53959B27200m169l379k151j093o93q52j247j531j320n12L62P18P80J232K152L003
53943B18500L557M071M554M736M762N029N285M864L880L317L557L816L422K769
53929B76119K524K606K570K379K281K345K578L114L939M765N396N867O109N995
$$ plain form
54033 234501 239316 244346 249514 254637 259350 263390 267036 270790 274579 277812 280346 282762 285474 288187
54019 288187 290427 292045 292853 292427 290718 288340 285763 282640 278395 273176 267727 262578 257744 253118 248752
54004 248752 244785 241281 238099 234932 231674 228707 226458 224666 222468 219407 215974 213087 211324 210725
53990 210725 210896 211157 210948 210266 209423 208454 207237 206173 206050 207055 208557 210085 211933 214487 217632 221237
53974 221237 225684 231402 238226 245569 252737 258707 262114 262111 259080 254164 248371 242386 236762 231753 227200
53959 227200 223031 219652 217501 216408 215715 214863 213616 212085 210765 210253 210615 211333 212113 213345 215497 218500
53943 218500 222057 226128 230682 235418 240180 245209 250494 255358 259238 262555 266112 269928 273350 276119
53929 276119 278643 281249 283819 286198 288479 290824 293402 296516 300455 305220 310616 316483 322592 328587
53915C28587N863O352P482Q464Q693Q325P640O528N023L656K757J937P44o23j726
53900C99702k517l128l402l277l180l501l990m206m336m960o127p257p888q096
53886C33837q098p910p484o958o567o383o168n560m479l369k794k802k930k890
53872B59445k953l421m023m095l366k344j894k368l174l353k692j970j914k244
53858B19634k233j898j932k510k864k311j152k58r3m85r70j168j027q33q76j064
53842A97960j024n57K35J077J512J111J13l94L14J432J436P2j304j497p16J53
53826A99923O69P95N63K98N89J462K141K036J546J328J320J093P23O48R25J299
53810B17358J821K775L977M748M702M205L915M114M528M687M401L974L883M276
$$ plain form
53915 328587 334450 340802 348284 356748 365441 373766 381406 387934 392957 396613 399370 401307 402051 401428 399702
53900 399702 397185 394057 390655 387378 384198 380697 376707 372501 368165 363205 357078 349821 341933 333837
53886 333837 325739 317829 310345 303387 296820 290437 284269 278709 274230 270861 268067 265265 262335 259445
53872 259445 256492 253071 249048 244953 241587 239243 237349 234981 231807 228454 225762 223792 221878 219634
53858 219634 217401 215503 213571 211061 208197 205886 204734 204476 204383 203898 202928 201760 200733 199900 199024 197960
53842 197960 196936 196379 196614 197691 199203 200314 200427 200033 200347 201779 203215 203287 201983 200486 199770 199923
53826 199923 200592 201387 201950 202248 202837 204299 206440 208476 210022 211350 212670 213763 214486 215134 216059 217358
53810 217358 219179 221954 225931 230679 235381 239586 243501 247615 252143 256830 261231 265205 269088 273364
53796B73364M795M959M536L693K908K623K776K764K215J531J312J462J360P85
53782C11083j1r52k092l008l129k858l308m667n757n676m977m585m492m239m023
53767B57309m301m805m886m467l909l192k158j279j289j958k173j390l54q5p00
53752B20363j483j759j404p16j23R3j41o93j234j345r31n10o75j208j224l92N47
53735B07165Q16N97N03N59M25K81O45J456J990J793J072K47m18o43j57Q93J940
53718B19164K492K451J959J259P62Q66J549K345K753K577J916J152Q64J396K455
53703B45960L376L799L915L993L932L451K604J921J935K608L308L461L122K723
53689B90108K409J979J375P77J98n29j214j365r86q14j317k008k123j573p87q8
$$ plain form
53796 273364 278159 283118 287654 291347 294255 296878 299654 302418 304633 306164 307476 308938 310298 311083
53782 311083 311072 310120 308028 305020 301891 299033 295725 291058 285301 279625 274648 270063 265571 261332 257309
53767 257309 253008 248203 243317 238850 234941 231749 229591 228312 227023 225065 222892 221502 221148 221063 220363
53752 220363 218880 217121 215717 215001 214878 214971 214830 214137 212903 211558 210627 210117 209442 208234 207010 206618 207165
53735 207165 207981 208578 209081 209640 210065 210346 210991 212447 214437 216230 217302 217549 217131 216488 216331 217224 219164
53718 219164 221656 224107 226066 227325 228087 228953 230502 232847 235600 238177 240093 241245 242109 243505 245960
53703 245960 249336 253135 257050 261043 264975 268426 271030 272951 274886 277494 280802 284263 287385 290108
53689 290108 292517 294496 295871 296648 296846 296317 295103 293738 292752 291938 290621 288613 286490 284917 284130 284042
53673B84042K51j37j085j599r54J66N11j6l94j57Q7l9j5M21M90m41j540j415m
53654B78172J326J603J268J196J402J256N55j75m06j50K54N67P33Q03R64J474
53638B90842K368L305L904M121M090L774L072K143J332P34K06k14k46K37J020
53623C20688J796K294K275J811J563K182L327L870L332K483K243K583K990L398
53609C56835L969M373M061L130K297K077K412K989L417L232K283J077L25J26O9
53594C92672o8j73k78n73r34r90p40o13p54q53q64j308k440l535l592k595j562
53577C70800j345j745j982j695j173p86n63m16m76q33j169r85k42N69J019J104
53561C60082R22M52j30l20J22P06P85M67N19J381K594L317L164K482J906J736
$$ plain form
53673 284042 284293 284156 283071 281472 280518 280684 281195 281179 280785 280628 280715 280676 280661 281082 281572 281131 279591 278176 278172
53654 278172 279498 281101 282369 283565 284967 286223 286778 286603 286197 286047 286301 286868 287601 288404 289368 290842
53638 290842 293210 296515 300419 304540 308630 312404 315476 317619 318951 319685 319891 319677 319431 319668 320688
53623 320688 322484 324778 327053 328864 330427 332609 335936 339806 343138 345621 347864 350447 353437 356835
53609 356835 360804 365177 369238 372368 374665 376742 379154 382143 385560 388792 391075 392152 392477 392603 392672
53594 392672 392604 392431 392153 391580 390646 389656 388916 388303 387549 386696 385832 384524 382084 378549 374957 372362 370800
53577 370800 369455 367710 365728 364033 362860 362074 361511 361095 360619 359786 358617 357632 357390 357959 358978 360082
53561 360082 361004 361456 361326 361006 361128 361834 362619 363086 363605 364986 367580 370897 374061 376543 378449 380185
53545C80185J747J603J395J519K056K611K880L127L815M938O019O621O726O709
53531D31951P090Q100R357J0141J0168R937J0145J0938J1924J2671J3018J3088
53519E58528J3233J3795J4768J5807J6654J7370J8071J8820J9748K0982K2302
53508G50078K3340K4238K5498K6946K7554K6754K5418K4787K4815K4360K2857
53497A026645K1050J9945J9584J9104J7825J6104J5123J5699J7276J8401J8305
53486A225061J7602J7310J7642J8093J8239J8005J7431J6667J5913J5033J3562
53475A410558J1459R451Q105O958N153K634J11j974l880o028q494j0955j2846
53462A410252j3754j3884j3890j4068j4194j4339j5074j6440j7526j7718j7681
$$ plain form
53545 380185 381932 383535 384930 386449 388505 391116 393996 397123 400938 405876 411895 418516 425242 431951
53531 431951 439041 447141 456498 466639 476807 486744 496889 507827 519751 532422 545440 558528
53519 558528 571761 585556 600324 616131 632785 650155 668226 687046 706794 727776 750078
53508 750078 773418 797656 823154 850100 877654 904408 929826 954613 979428 1003788 1026645
53497 1026645 1047695 1067640 1087224 1106328 1124153 1140257 1155380 1171079 1188355 1206756 1225061
53486 1225061 1242663 1259973 1277615 1295708 1313947 1331952 1349383 1366050 1381963 1396996 1410558
53475 1410558 1422017 1431468 1439573 1446531 1451684 1454318 1454429 1452455 1448575 1442547 1434053 1423098 1410252
53462 1410252 1396498 1382614 1368724 1354656 1340462 1326123 1311049 1294609 1277083 1259365 1241684
53451A241684j8261j9108j9406j9296j9374j9281j8157j6317j5055j4716j4128
53440A048585j2259r418o480l951k024p55J67J149K018K317K350L038M612O239
53426A035588P279Q023Q849R569J0057J0804J2265J4170J5932J7376J8710K0146
53414A188768K1756K3440K4872K5875K6858K8365L0246L1821L2886L3928L5340
53403A504155L7028L8798M0520M1913M2942M4243M6353M8588M9774N0065N0900
53392A995279N2841N4687N5268N4940N4639N4348N3371N1529M9306M7221M5459
53381B568888M3750M1357L7763L3453K9358K5445K0835J5457J0411O251K164k618
53369B832514p799j3167j9420k6759l3742l8844m2380m5663m8918n1314n2526
$$ plain form
53451 1241684 1223423 1204315 1184909 1165613 1146239 1126958 1108801 1092484 1077429 1062713 1048585
53440 1048585 1036326 1026908 1020428 1016477 1014453 1013698 1013865 1015014 1017032 1019349 1021699 1024737 1029349 1035588
53426 1035588 1042867 1050890 1059739 1069308 1079365 1090169 1102434 1116604 1132536 1149912 1168622 1188768
53414 1188768 1210524 1233964 1258836 1284711 1311569 1339934 1370180 1402001 1434887 1468815 1504155
53403 1504155 1541183 1579981 1620501 1662414 1705356 1749599 1795952 1844540 1894314 1944379 1995279
53392 1995279 2048120 2102807 2158075 2213015 2267654 2322002 2375373 2426902 2476208 2523429 2568888
53381 2568888 2612638 2653995 2691758 2725211 2754569 2780014 2800849 2816306 2826717 2832968 2835132 2832514
53369 2832514 2824715 2811548 2792128 2765369 2731627 2692783 2650403 2604740 2555822 2504508 2451982
53358B451982n2963n2836n2152n1406n1115n0817m9572m7324m4884m2730m0770
53347A915413l9044l7755l6702l5620l4834l4654l4294l2545k9503k6589k4712
53336A549161k3327k1507j9067j6446j4129j2456j1389j0429r246q389q654r957
53324A384165j1423j2525j3314j3700j3441j2837j2475j2213j1372j0135r542
53313A251188r838r803q361o008l952k608j592o77O9P29J559K680M177O175Q537
53298A232275J0819J2881J5162J7882K0368K1759K2124K2311K2870K3604K4171
53287A446226K4524K4605K4048K2513K0213J7797J5647J3432J0590P160L862J169
53275A631786j306m178p361j0289j2857j5434j7961j9788k0735k1581k3040k4761
$$ plain form
53358 2451982 2399019 2346183 2294031 2242625 2191510 2140693 2091121 2043797 1998913 1956183 1915413
53347 1915413 1876369 1838614 1801912 1766292 1731458 1696804 1662510 1629965 1600462 1573873 1549161
53336 1549161 1525834 1504327 1485260 1468814 1454685 1442229 1430840 1420411 1411165 1402776 1394122 1384165
53324 1384165 1372742 1360217 1346903 1333203 1319762 1306925 1294450 1282237 1270865 1260730 1251188
53313 1251188 1241350 1231547 1223186 1217178 1213226 1210618 1209026 1208349 1208418 1209147 1210706 1213386 1217563 1223738 1232275
53298 1232275 1243094 1255975 1271137 1289019 1309387 1331146 1353270 1375581 1398451 1422055 1446226
53287 1446226 1470750 1495355 1519403 1541916 1562129 1579926 1595573 1609005 1619595 1626755 1630617 1631786
53275 1631786 1630480 1626302 1618941 1608652 1595795 1580361 1562400 1542612 1521877 1500296 1477256 1452495
53263A452495k5933k6481k6991k7662k8047k7921k7740k7978k8448k8652k8484
53252A148158k8185k7703k6670k5118k3792k3337k3408k3047k1925k0754k0256
53241H83963k0179j9722j8604j7255j6084j5007j3765j2324j0840r484q460p913
53229G14326p721p479o849n900n129n131o174p995j0015j1795j3175j4057j4433
53216E98473j4639j5114j5619j5258j3713j1967j1150j1051j0623r689r108r186
53204D51356r103q346p723q212r442j0205j0053r593r349r169q746q156p648p361
53190C28250p304p268o730n364l707k894l414m477m931m507l879l692l897l967
53176B62219l452k315r99j62j36n84q84q37p52q99j146j290j347j387j318j017
$$ plain form
53263 1452495 1426562 1400081 1373090 1345428 1317381 1289460 1261720 1233742 1205294 1176642 1148158
53252 1148158 1119973 1092270 1065600 1040482 1016690 993353 969945 946898 924973 904219 883963
53241 883963 863784 844062 825458 808203 792119 777112 763347 751023 740183 730699 722239 714326
53229 714326 706605 699126 692277 686377 681248 676117 669943 661948 651933 640138 626963 612906 598473
53216 598473 583834 568720 553101 537843 524130 512163 501013 489962 479339 469650 460542 451356
53204 451356 442253 433907 426184 417972 408530 398325 388272 378679 369330 360161 351415 343259 335611 328250
53190 328250 320946 313678 306948 301584 297877 294983 291569 287092 282161 277654 273775 270083 266186 262219
53176 262219 258767 256452 255453 255291 255155 254571 253687 252850 252098 251199 250053 248763 247416 246029 244711 243694
53160B43694n14J09O52O19m56k131l041k278n37P05R25P77Q25R18P93N60L12p4
53142B41858m79n60m15n47r25q77k35K19%j57N38J570J788J056K35j17j72j5N37
53123B43302J290J638J367Q97O13N20O05Q97J149J018O89P20J135J269P95K41
53107B58145J95M55L94j93r39j472j745j870j884j723j378j131j354j970k338
53092B41192j986j279r31j052j117p79k19K60N10M09o3n94q50r43j119j106m82
53075B29851L75N30q0l94J89Q01L22j006j991k142k033k083j896j079j05J45m40
53058B18964j028q87k81J0j58j10N52J309J516J377J527J994K235K024J577R24
53042B31545n0r22r74l22ln51j256j250p37n16p50q93n63L9M63M47J71J80P88
$$ plain form
53160 243694 243180 243289 243941 244560 244104 241973 238932 236654 236117 236822 237747 238524 239349 240267 241060 241620 241932 241858
53142 241858 241379 240819 240404 239857 238932 238055 237820 238039 238039 237882 238420 239990 241778 242834 243069 242952 242780 242765 243302
53123 243302 244592 246230 247597 248494 249107 249627 250232 251129 252278 253296 253985 254705 255840 257109 257904 258145
53107 258145 258340 258795 259189 258996 258057 256585 254840 252970 251086 249363 247985 246854 245500 243530 241192
53092 241192 239206 237927 236996 235944 234827 234048 233829 234089 234599 235008 234945 234351 233501 232558 231439 230333 229851
53075 229851 230226 230756 230676 230282 230471 231272 231594 230588 228597 226455 224422 222339 220443 219364 219259 219404 218964
53058 218964 217936 217049 216768 216778 216620 216510 217062 218371 219887 221264 222791 224785 227020 229044 230621 231545
53042 231545 231495 230573 229599 229277 229274 228723 227467 226217 225480 224964 224214 223321 222758 222797 223260 223707 223878 224058 224846
53023B24846J458J306M18j4P27J774J837R09P5j32k06n52p54l43L18M04k81j011
53005B30779r38o2Q01J033Q87R16J024O39k33p92n25J69P43J247J861K220J852
52988B41621J006M12M03P55J124J297J252J304J869K699K880K078J225J204J413
52973B62542O69r18k027k045j647j391r79k41K35J57K81J305K604K934K021P69
52957B64269N1p2p2l72j081j885k225j835j054m63l29n57q93j051q74o00o84j137
52939B49136j382j037m50j31k9J21J79j26m61k60L44O47M22J45Q3n8l13r7Q14
52920B47547J574J256J55n96n12j62j45l99o30p84q41o01k6M77M09k84j187j745
52902B43506j582p80J1P6n60j136j133q95r18r77n14L41Q49P35N30O66Q73P74
$$ plain form
53023 224846 226304 227610 228028 228014 228741 230515 232352 233261 233336 233204 232998 232446 231692 231349 231667 232071 231790 230779
53005 230779 229841 229779 230580 231613 232500 233416 234440 235079 234846 234054 233529 233698 234441 235688 237549 239769 241621
52988 241621 242627 243039 243442 244197 245321 246618 247870 249174 251043 253742 256622 258700 259925 261129 262542
52973 262542 263211 262293 260266 258221 256574 255183 254204 253963 254198 254355 254636 255941 258545 261479 263500 264269
52957 264269 264320 264248 264176 263804 262723 260838 258613 256778 255724 255261 254932 254375 253482 252431 251557 250957 250273 249136
52939 249136 247754 246717 246267 246136 246107 246228 246407 246281 245820 245560 245904 246551 246973 247118 247201 247143 246830 246733 247547
52920 247547 249121 250377 250532 249936 249424 249262 249117 248718 248088 247304 246463 245862 245836 246313 246722 246438 245251 243506
52902 243506 241924 241144 241155 241231 240671 239535 238402 237507 236589 235612 235098 235439 236288 237023 237553 238219 239092 239866
52884B39866N57O57J035J266J160Q57M84J08J0M98J404K109K206J857J400R32
52868B56406N39N04R41J412J382R78Q34J118J183M98n13r29m94R9N4p59j877k732
52850B58644l021k839k606k677k915k907k570k274k264k257j869j190p19q19j348
52835B26369j721j327j82Q24P30k98j029o55K39O22L69J06O1j57p31j292j525
52818B20403j487j269p90j32M08P00R00J052R84O80L95L35N39J032J613J564K54
52801B27181j720k785k193r98p12j427j942j515o81l21n02n77j40M48N00j65r36
52784B11515j028k89P08J318J327R41N32M28O47P67L83l09p31p47p67r15o65L06
52766B13421J329J446O43j31j98Q9j5o32j175j166q05n16k13N85J796K497K043
$$ plain form
52884 239866 240423 241080 242115 243381 244541 245398 245882 245990 246000 246498 247902 250011 252217 254074 255474 256406
52868 256406 256945 257449 258390 259802 261184 262162 262996 264114 265297 265795 265282 264353 263859 263958 264012 263253 261376 258644
52850 258644 255623 252784 250178 247501 244586 241679 239109 236835 234571 232314 230445 229255 228536 227717 226369
52835 226369 224648 223321 223139 223963 224693 224395 223366 222711 222950 223572 223941 224047 224108 223951 223220 221928 220403
52818 220403 218916 217647 216857 216725 217133 217833 218733 219785 220769 221449 221844 222179 222718 223750 225363 226927 227181
52801 227181 225461 222676 220483 219485 218773 217346 215404 213889 213208 212887 212385 211808 211668 212116 212616 212451 211515
52784 211515 210487 210198 210906 212224 213551 214492 215024 215452 216099 216866 217249 216940 216209 215462 214695 213780 213115 213421
52766 213421 214750 216196 216839 216708 216510 216599 216584 215952 214777 213611 212806 212290 212077 212662 214458 216955 218998
52749B18998J056O83J115J559J554J442J514J531J398J466J819J998J846J809
52735B39788J939J508L06n16N2J248J553Q80M06M97K16r18j986k055j455r93p18
52718B39752k43K46J71m87j080j152q62n70l72j89n1q5l10n49n54k38K39O55Q95
52699B35216R00N98K4m97n78j94K37K74j23o01p57m89j22j07n48j066j208q40
52681B30119j38O13J038P55k30j252j456n97P28J652J726J153N26L42O38J076
52665B36693J398J596J663J444Q96K79j01j32K19R78J864K283J993J543J601K013
52649B56230J968J039l44j419j773j506r88n77l73l03m63j027j758j923j124J30
52633B45789J094J769K665L820M649M802M604M591M937N387N337M125J624j361
$$ plain form
52749 218998 220054 220737 221852 223411 224965 226407 227921 229452 230850 232316 234135 236133 237979 239788
52735 239788 241727 243235 243541 243025 243077 244325 245878 246758 247164 247661 247877 246959 244973 242918 241463 240470 239752
52718 239752 239509 239755 239926 239439 238359 237207 236345 235775 235403 235214 235163 235078 234768 234219 233665 233427 233666 234321 235216
52699 235216 236116 236714 236738 236241 235663 235469 235706 235980 235857 235256 234499 234010 233888 233781 233233 232167 230959 230119
52681 230119 229981 230594 231632 232387 232157 230905 229449 228852 229580 231232 232958 234111 234637 234979 235617 236693
52665 236693 238091 239687 241350 242794 243690 243969 243868 243736 243955 244933 246797 249080 251073 252616 254217 256230
52649 256230 258198 259237 258893 257474 255701 254195 253207 252630 252257 251954 251491 250464 248706 246783 245659 245789
52633 245789 246883 248652 251317 255137 259786 264588 269192 273783 278720 284107 289444 293569 295193 293832
52619B93832l725m987n360n102m361l507k912k357j270K40J167P12p28j907j829
52604B57906m79J181J903J229n9q69r81q75o74r3N97N81j71n67J23J155J388P54
52586B62049j3o00j165j475j005J10R63R50M29J24L12P48J047R36L71m04j034
52569B62343j338j340j121p69n14o25j134j748k063j840j137l46Ll47j100j607
52553B45317j437o57L10R47Q21j57j421j918r28J053K548K479J257J56k25m07
52537B47738q49j097o16O8lo89p89K19J387J673J347J323J638J421K93j022j591
52520B50451j274n45K31R85J637J991J981J821J796J962K155K268K361K499K549
52505B72868K307J715Q44k72j555k703l302l171k547j877j535j635j939k029j781
$$ plain form
52619 293832 290107 285120 279760 274658 270297 266790 263878 261521 260251 260491 261658 262370 261642 259735 257906
52604 257906 257427 258608 260511 261740 261681 260812 259831 258956 258282 258189 258786 259367 259196 258629 258752 259907 261295 262049
52586 262049 262036 261436 260271 258796 257791 257901 258864 259814 260243 260367 260679 261427 262474 263410 263781 263377 262343
52569 262343 261005 259665 258544 257775 257261 256636 255502 253754 251691 249851 248714 248368 248371 248024 246924 245317
52553 245317 243880 243223 243533 244480 245301 245144 243723 241805 240877 241930 244478 246957 248214 248370 248145 247738
52537 247738 246889 245792 245176 245244 245241 244552 243763 243982 245369 247042 248389 249712 251350 252771 253064 252042 250451
52520 250451 249177 248632 248863 249848 251485 253476 255457 257278 259074 261036 263191 265459 267820 270319 272868
52505 272868 275175 276890 277734 277462 275907 273204 269902 266731 264184 262307 260772 259137 257198 255169 253388
52490B53388j580j799k069j602k86R32J106M13j95k66k47o11j008o52O97K396
52474B48617L499L432K235N64n18j93J219K328K092J006M53J036K127K988L487
52459B74372L536K728J123l05p64o49q23j285j446j338j524j906j711q69m67j343
52443B67329k824l432k587j174n36j070j841j648m48O06O43N9l50n67q83r30k50
52426B50097N16L14n97q61q4P35J049J547K540K999K206J108R35J366J338R09
52410B66117J024J885K858L737M864O127O923P161P268P115N925L497P35j362
52396C23874k608l311l741m116m592m936m635l612k438j662j271r64n55M9Q82
52381B86364J666J887J441R27J001J583K053K059J912K104K698L339L747L979
$$ plain form
52490 253388 251808 250009 247940 246338 246052 246984 248090 248503 248308 248042 247795 247184 246176 245524 246221 248617
52474 248617 252116 255548 257783 258347 257829 257636 258855 261183 263275 264281 264734 265770 267897 270885 274372
52459 274372 277908 280636 281759 281454 280690 280041 279218 277933 276487 275149 273625 271719 270008 269139 268672 267329
52443 267329 264505 261073 258486 257312 256776 255706 253865 252217 251769 252375 253018 253077 252727 252160 251277 250347 250097
52426 250097 250613 250927 250330 249469 249385 250120 251169 252716 255256 258255 260461 261569 262504 263870 265208 266117
52410 266117 267141 269026 271884 275621 280485 286612 293535 300696 307964 315079 321004 324501 325236 323874
52396 323874 321266 317955 314214 310098 305506 300570 295935 292323 289885 288223 286952 285988 285433 285482 286364
52381 286364 288030 289917 291358 292285 293286 294869 296922 298981 300893 302997 305695 309034 312781 316760
52367C16760M188M315M233L955L512K756J600L97l58o70r28j131q05J27J010J318
52351C40279J365J687K201K440K313K109K020K109K487L087L504L501L472L912
52337C76486M672N277N716O348P173P785Q165Q884J0329J2169J3757J4846J5685
52324D97292J6571J7472J8152J8647J9401K0669K1925K2370K1998K1575K1471
52313G17543K1207K0476J9810J9759K0070K0255K0292K0160J9404J7959J6676
52302I33611J6143J5587J4082J2166J1030J0492R296P229N388M198K704K22k651
52289A039497n196p533r738j1144j1319j0836j0344r618q329o961o101n415m169
52276I32794k387o56Q94K572M330N776O900Q181R924J1881J3499J4300J4167J3552
$$ plain form
52367 316760 320948 325263 329496 333451 336963 339719 341319 341716 341358 340688 339760 338629 337824 337951 338961 340279
52351 340279 341644 343331 345532 347972 350285 352394 354414 356523 359010 362097 365601 369102 372574 376486
52337 376486 381158 386435 392151 398499 405672 413457 421622 430506 440835 453004 466761 481607 497292
52324 497292 513863 531335 549487 568134 587535 608204 630129 652499 674497 696072 717543
52313 717543 738750 759226 779036 798795 818865 839120 859412 879572 898976 916935 933611
52302 933611 949754 965341 979423 991589 1002619 1013111 1022407 1029636 1035024 1039222 1041926 1042148 1039497
52289 1039497 1034301 1026768 1017030 1005886 994567 983731 973387 963769 955440 948479 942378 936963 932794
52276 932794 930407 929751 930645 933217 937547 943323 950223 958404 968328 980209 993708 1008008 1022175 1035727
52262A035727J3185J3315J3538J3556J3645J4042J4344J4011J3145J2196J1242
52251A181946J0072Q732P342N601L073j16l392o428r183j1402j2744j3498j4562
52238A145441j6473j8851k0935k2253k2659k2181k1122k0031j9296j8810j8266
52227I24564j7547j6753j5936j5042j4025j2939j1935j1149j0551r826q589o815
52215G73457n036l869l328k671j192Q46K304K352J444Q56J364K605L614L644K554
52200G78944Q90l24l08O94J693K202K708L644M425M159L043K295K658L583M041
52185H14347L632K615J335P6q50j343j875l051m799o270o790o582o283o045n552
52170G72565m775m099l592k750j261L70J410J804K084K580L219L903M613N210
$$ plain form
52262 1035727 1048912 1062227 1075765 1089321 1102966 1117008 1131352 1145363 1158508 1170704 1181946
52251 1181946 1192018 1200750 1208092 1213693 1216766 1216650 1213258 1206830 1197647 1186245 1173501 1160003 1145441
52238 1145441 1128968 1110117 1089182 1066929 1044270 1022089 1000967 980936 961640 942830 924564
52227 924564 907017 890264 874328 859286 845261 832322 820387 809238 798687 788861 780272 773457
52215 773457 768421 764552 761224 758553 757361 758207 760511 762863 764307 765163 766527 769132 772746 776390 778944
52200 778944 779834 779510 779202 779896 781589 783791 786499 790143 794568 798727 801770 804065 806723 810306 814347
52185 814347 817979 820594 821929 822005 821155 819812 817937 814886 810087 803817 797027 790445 784162 778117 772565
52170 772565 767790 763691 760099 757349 756088 756458 757868 759672 761756 764336 767555 771458 776071 781281
52156G81281N574N833N986N531M098K305J248J152J300J366J837K834L540L451
52142H27336L358M199N555O218N906N447N434N653N963O781Q382J0278J1742J2678
52128I24930J3651J5268J7690K0635K3630K6276K8343K9743L0658L1588L2950
$$ plain form
52156 781281 786855 792688 798674 804205 808303 810608 811856 813008 814308 815674 817511 820345 823885 827336
52142 827336 830694 834893 840448 846666 852572 858019 863453 869106 875069 881850 890232 900510 912252 924930
52128 924930 938581 953849 971539 992174 1015804 1042080 1070423 1100166 1130824 1162412 1195362
$$ [...]
##END NTUPLES=NMR SPECTRUM
##END=
