
##TITLE=AC1306_DOMAH11118_6615295_IFYvxexN2Q
##JCAMPDX= 6.0         $$ Bruker NMR JCAMP-DX V2.0
##DATA TYPE= NMR SPECTRUM
##DATA CLASS= NTUPLES
##ORIGIN= BRUKER
##OWNER= Administrator
$$ 1.72 TOPSPIN		Version 2.1
$$ 2012-08-02 19:23:58.281 -0500  Administrator@TOPSPIN
$$ Compression mode = diff/dup
##.OBSERVE FREQUENCY= 400.02188249412
##.OBSERVE NUCLEUS= ^1H
##.ACQUISITION MODE= SIMULTANEOUS (DQD)
##.ACQUISITION SCHEME= undefined
##.AVERAGES= 64
##.DIGITISER RES= 22
##SPECTROMETER/DATA SYSTEM= spect
##.PULSE SEQUENCE= noesygpps1d.comp
##.SOLVENT NAME= COFFEE_meoh
##.SHIFT REFERENCE= INTERNAL, COFFEE_meoh, 1, 14.96269
##AUDIT TRAIL= $$ (NUMBER, WHEN, WHO, WHERE, PROCESS, VERSION, WHAT)
$$ ##TITLE= Audit trail, TOPSPIN		Version 2.1
$$ ##JCAMPDX= 5.01
$$ ##ORIGIN= Bruker BioSpin GmbH
$$ ##OWNER= Administrator
$$ $$ C:\Bruker\TOPSPIN/data/COFFEE/nmr/AC1306_DOMAH11118_6615295_IFYvxexN2Q/12/pdata/1/auditp.txt
$$ ##AUDIT TRAIL=  $$ (NUMBER, WHEN, WHO, WHERE, PROCESS, VERSION, WHAT)
(   1,<2012-08-02 19:23:53.375 -0500>,<Administrator>,<TOPSPIN>,<go>,<TOPSPIN 2.1>,
      <created by zg
	started at 2012-08-02 19:12:23.078 -0500,
	POWCHK enabled, PULCHK disabled,
       configuration hash MD5:
       6B 1B 68 BB D9 2E 58 E2 7F 35 AD 54 07 DF 0E 41
       data hash MD5: 64K
       99 9E 25 48 87 B8 10 9C 77 08 A3 E6 C1 CE 3D A1>)
(   2,<2012-08-02 19:23:56.390 -0500>,<Administrator>,<TOPSPIN>,<proc1d>,<TOPSPIN 2.1>,
      <Start of raw data processing
       efp LB = 0.3 FT_mod = 6 PKNL = 1 PHC0 = 0 PHC1 = 0 SI = 128K 
       data hash MD5: 128K
       20 B2 18 37 9A 00 03 51 1A AA AD 71 93 F6 36 02>)
(   3,<2012-08-02 19:23:57.531 -0500>,<Administrator>,<TOPSPIN>,<proc1d>,<TOPSPIN 2.1>,
      <pk PHC0 = 1.757813 PHC1 = 0 
       data hash MD5: 128K
       71 F6 61 B9 99 6D F0 64 7E 29 32 99 07 58 F8 9F>)
(   4,<2012-08-02 19:23:57.953 -0500>,<Administrator>,<TOPSPIN>,<proc1d>,<TOPSPIN 2.1>,
      <abs ABSG = 1 
       data hash MD5: 128K
       D8 0C CF E1 AE AC 47 1F 92 2F F2 D6 7B 7F 55 C1>)
(   5,<2012-08-02 19:23:58.031 -0500>,<Administrator>,<TOPSPIN>,<proc1d>,<TOPSPIN 2.1>,
      <abs ABSG = 2 
       data hash MD5: 128K
       69 7F 75 CA 21 0A CC FA 85 4F 35 38 05 B5 C5 E7>)
(   6,<2012-08-02 19:23:58.093 -0500>,<Administrator>,<TOPSPIN>,<proc1d>,<TOPSPIN 2.1>,
      <abs ABSG = 3 
       data hash MD5: 128K
       26 62 36 1E F7 AB D5 08 0B CC 81 DD 95 E5 53 E1>)
(   7,<2012-08-02 19:23:58.140 -0500>,<Administrator>,<TOPSPIN>,<proc1d>,<TOPSPIN 2.1>,
      <abs ABSG = 4 
       data hash MD5: 128K
       52 1C B6 0A 41 B7 BC 77 DA 14 9B B9 17 95 7F 85>)
(   8,<2012-08-02 19:23:58.203 -0500>,<Administrator>,<TOPSPIN>,<proc1d>,<TOPSPIN 2.1>,
      <abs ABSG = 5 
       data hash MD5: 128K
       27 2F 69 22 30 90 34 EF E9 AF 9D 86 85 4A 4C 56>)
$$ ##END=
$$ 
$$ $$ hash MD5
$$ $$ 41 22 FF 94 A0 A7 47 83 17 89 C3 DB 1C 21 4A 5D
##$RELAX= 
##$RELAX= 
##$RELAX= 
##$RELAX= 
##$RELAX= 
##$RELAX= 
##$RELAX= 
##$RELAX= 
$$ Bruker specific parameters
$$ [...]
150 150 150 150 150 150 150 150
##$TP07= 0
##$TPNAME0= <>
##$TPNAME1= <>
##$TPNAME2= <>
##$TPNAME3= <>
##$TPNAME4= <>
##$TPNAME5= <>
##$TPNAME6= <>
##$TPNAME7= <>
##$TPOAL= (0..7)
0.5 0.5 0.5 0.5 0.5 0.5 0.5 0.5
##$TPOFFS= (0..7)
0 0 0 0 0 0 0 0
##$TUNHIN= 0
##$TUNHOUT= 0
##$TUNXOUT= 0
##$USERA1= <user>
##$USERA2= <user>
##$USERA3= <user>
##$USERA4= <user>
##$USERA5= <user>
##$V9= 5
##$VALIST= <valist>
##$VCLIST= <CCCCCCCCCCCCCCC>
##$VD= 0
##$VDLIST= <DDDDDDDDDDDDDDD>
##$VPLIST= <PPPPPPPPPPPPPPP>
##$VTLIST= <TTTTTTTTTTTTTTT>
##$WBST= 1024
##$WBSW= 4
##$XGAIN= (0..3)
0 0 0 0
##$XL= 0
##$YL= 0
##$YMAX_a= 16581239
##$YMIN_a= -9438690
##$ZGOPTNS= <>
##$ZL1= 120
##$ZL2= 120
##$ZL3= 120
##$ZL4= 120
##$ABSF1= 14.96269
##$ABSF2= -5.595491
##$ABSG= 5
##$ABSL= 3
##$ALPHA= 0
##$AQORDER= 0
##$ASSFAC= 0
##$ASSFACI= 0
##$ASSFACX= 0
##$ASSWID= 0
##$AUNMP= <proc_prof1d_extract.lims>
##$AXLEFT= 0
##$AXNAME= <>
##$AXNUC= <1H>
##$AXRIGHT= 0
##$AXTYPE= 0
##$AXUNIT= <>
##$AZFE= 0.1
##$AZFW= 0.1
##$BCFW= 0
##$BC_mod= 0
##$BYTORDP= 0
##$COROFFS= 0
##$CY= 15
##$DATMOD= 1
##$DC= 0
##$DFILT= <>
##$DTYPP= 0
##$F1P= 0
##$F2P= 0
##$FCOR= 0.5
##$FTSIZE= 131072
##$FT_mod= 6
##$GAMMA= 0
##$GB= 0
##$INTBC= 1
##$INTSCL= 1
##$ISEN= 128
##$LB= 0.3
##$LEV0= 0
##$LPBIN= 0
##$MAXI= 10000
##$MC2= 0
##$MEAN= 0
##$ME_mod= 0
##$MI= 0
##$NCOEF= 0
##$NC_proc= -2
##$NLEV= 6
##$NOISF1= 0
##$NOISF2= 0
##$NSP= 0
##$NTH_PI= 0
##$NZP= 0
##$OFFSET= 14.96269
##$PC= 1
##$PHC0= 1.757813
##$PHC1= 0
##$PH_mod= 1
##$PKNL= yes
##$PPARMOD= 0
##$PPDIAG= 0
##$PPIPTYP= 0
##$PPMPNUM= 2147483647
##$PPRESOL= 1
##$PSCAL= 4
##$PSIGN= 0
##$PYNMP= <proc.py>
##$REVERSE= no
##$SF= 400.02000895981
##$SI= 131072
##$SIGF1= 0
##$SIGF2= 0
##$SINO= 400
##$SIOLD= 131072
##$SPECTYP= <>
##$SREGLST= <1H.CDCl3>
##$SSB= 0
##$STSI= 131072
##$STSR= 0
##$SW_p= 8223.68421052631
##$SYMM= 0
##$S_DEV= 0
##$TDeff= 65536
##$TDoff= 0
##$TI= <>
##$TILT= no
##$TM1= 0
##$TM2= 0
##$TOPLEV= 0
##$USERP1= <user>
##$USERP2= <user>
##$USERP3= <user>
##$USERP4= <user>
##$USERP5= <user>
##$WDW= 1
##$XDIM= 131072
##$YMAX_p= 423004294
##$YMIN_p= -11137
##$CURPLOT= <Network HP LaserJet P1505>
##$CURPRIN= <$Network HP LaserJet P1505>
##$DFORMAT= <normdp>
##$LAYOUT= <+/1D_H.xwp>
##$LFORMAT= <normlp>
##$PFORMAT= <normpl>
##$SURQMSG= 1
$$ End of Bruker specific parameters
$$ ---------------------------------
##NTUPLES= NMR SPECTRUM
##VAR_NAME=  FREQUENCY,     SPECTRUM/REAL,   SPECTRUM/IMAG
##SYMBOL=    X,             R,               I
##VAR_TYPE=  INDEPENDENT,   DEPENDENT,       DEPENDENT
##VAR_FORM=  AFFN,          ASDF,            ASDF
##VAR_DIM=   131072,        131072,          131072
##UNITS=     HZ,            ARBITRARY UNITS, ARBITRARY UNITS
##FACTOR=    0.0627417313425164, 1,          1
##FIRST=     8223.62146879497, 3043,         -58670
##LAST=      0,             4434,            -59169
##MIN=       0,             -11137,          0
##MAX=       8223.62146879497, 423004294,    0
$$ Real data points
##PAGE= N=1
##DATA TABLE= (X++(R..R)), XYDATA
$$ [...]
67417 137831 137238 136657 136442 136653 136935 136862 136328 135637 135279 135631 136715 138137 139281 139690 139318 138461 137464 136500
67399 136500 135572 134675 133919 133530 133743 134645 136027 137333 137911 137500 136523 135767 135767 136547 137863 139441 140934 141944
67381 141944 142271 142036 141484 140816 140289 140194 140531 140886 140859 140471 140007 139638 139413 139434 139766 140316 140988 141789 142572 142942
67361 142942 142749 142445 142532 142839 142867 142720 143131 144515 146511 148546 150355 151744 152374 152159 151669 151786 152996
67344 152996 155067 157229 158640 158957 158621 158386 158548 158843 159079 159473 160235 161241 162335 163689 165569 167904
67328 167904 170204 171793 172101 171115 169651 168821 168962 169387 169364 168974 168686 168530 168177 167572 167011 166653 166435 166414
67310 166414 166781 167533 168493 169681 171272 173099 174577 175311 175553 175924 176887 178542 180608 182434 183330 183267 183131
67293 183131 183885 185484 186936 187478 187318 187054 186789 186275 185682 185584 186118 186704 186856 186808 187015 187396 187571 187587 187897
67274 187897 188684 189664 190495 190999 191056 190770 190729 191612 193424 195489 197200 198364 198849 198577 198033 198139 199230 200596
67256 200596 201392 201612 201833 202434 203513 205114 206999 208494 209137 209340 209927 211145 212616 214107 215800 217753
67240 217753 219594 220954 221856 222544 223113 223427 223298 222756 222224 222290 223129 224294 225268 226079 227118 228481 229842
67223 229842 230898 231625 232146 232639 233419 234804 236835 239216 241534 243419 244615 245138 245314 245493 245779 246140
67207 246140 246567 246967 247169 247279 247794 249030 250693 252390 254229 256407 258484 259731 260108 260202 260206 259712 258738
67190 258738 258206 259006 261031 263539 266046 268460 270673 272494 273846 274757 275255 275463 275612 275792 276002 276589
67174 276589 278215 280994 283991 286093 287234 288303 289952 291978 293906 295698 297630 299787 301944 303902
67160 303902 305751 307803 310207 312657 314535 315474 315775 316152 317088 318510 320057 321534 323088 325008 327390
67145 327390 330030 332647 335145 337510 339565 341097 342334 343969 346467 349525 352453 354938 357142 359194
67131 359194 360993 362579 364387 366873 369986 373127 375617 377195 378206 379354 381209 383871 387031 390262
67117 390262 393239 395892 398521 401652 405511 409686 413527 416846 419992 423237 426375 429026 431112 432890
67103 432890 434753 437107 440181 443765 447255 450159 452493 454616 456913 459727 463274 467315 471134 474181
67089 474181 476605 478859 481015 482929 484887 487508 490926 494693 498641 503252 508798 514574 519436 522898
67075 522898 525426 527951 531381 536201 542051 547863 552846 557173 561397 565509 569184 572707 576884 581921
67061 581921 587049 591443 595041 598323 601823 606081 611496 617808 624125 629822 635181 640829 646880 653001
67047 653001 658977 664777 670220 675106 679599 684108 688797 693537 698371 703693 709806 716465 722983 728816
67033 728816 734108 739711 746488 754473 762814 770608 777652 784352 791174 798380 806075 814194 822516 830852
67019 830852 839135 847219 854860 862048 869195 876731 884750 893206 902160 911564 921061 930404 939847 949734
67005 949734 959871 969703 979022 988094 997239 1006689 1016741 1027537 1038680 1049546 1059984 1070313
66993 1070313 1080642 1090750 1100712 1111139 1122517 1134702 1147278 1160061 1173026 1186028 1198840
66982 1198840 1211331 1223461 1235315 1247168 1259296 1271672 1284168 1297062 1310854 1325440 1339969
66971 1339969 1353862 1367582 1382012 1397307 1412774 1427662 1441702 1455103 1468502 1482775 1498375
66960 1498375 1514772 1530929 1546371 1561449 1576548 1591591 1606561 1622002 1638441 1655476 1672007
66949 1672007 1687532 1702776 1718793 1735744 1752852 1769402 1785361 1801049 1816618 1831976 1846954
66938 1846954 1861441 1875579 1889964 1905295 1921591 1938023 1953771 1968803 1983522 1997972 2011864
66927 2011864 2025238 2038524 2051931 2065249 2078363 2091579 2105209 2119131 2132923 2146198 2158724
66916 2158724 2170388 2181241 2191450 2201141 2210401 2219388 2228226 2236776 2244703 2251882 2258613 2265371 2272376
66903 2272376 2279362 2285691 2290883 2295132 2299073 2302892 2306026 2308012 2309198 2310101 2310521 2310034 2309072 2308592 2308652 2308233
66887 2308233 2306599 2304070 2301224 2298199 2295027 2291743 2287765 2282073 2274642 2266866 2259834 2252881 2244722 2235365
66873 2235365 2225856 2216584 2206992 2196797 2186344 2175670 2164186 2151590 2138319 2124797 2110913 2096530
66861 2096530 2081917 2067328 2052681 2038006 2023756 2010240 1996999 1983169 1968302 1952579 1936383
66850 1936383 1919969 1903486 1887071 1870837 1854808 1838844 1822688 1806197 1789518 1772892 1756338
66839 1756338 1739629 1722583 1705248 1687890 1670865 1654392 1638324 1622346 1606507 1591188 1576281
66828 1576281 1560803 1543907 1526083 1508767 1492852 1478099 1463945 1450114 1436345 1422231 1407689
66817 1407689 1393047 1378359 1363164 1347345 1331726 1317263 1303951 1291017 1277929 1264675 1251252
66806 1251252 1237488 1223427 1209365 1195420 1181456 1167559 1154252 1142016 1130815 1120207 1109670
66795 1109670 1098689 1086810 1074010 1060959 1048644 1037560 1027358 1017331 1007113 996792 986498
66784 986498 976203 965944 955966 946414 936991 927182 916789 906124 895727 886035 877219 869129 861344
66771 861344 853489 845511 837519 829459 821167 812733 804468 796511 788715 781022 773621 766629 759864 753130
66757 753130 746442 739801 732966 725726 718224 710753 703374 695948 688472 681139 674154 667622 661489 655421
66743 655421 648948 642015 635294 629602 624991 620679 615882 610459 604766 599154 593686 588115 582122 575817
66729 575817 570057 565848 563214 560871 557389 552533 547202 542168 537285 532022 526416 521172 516912 513577
66715 513577 510559 507220 503207 498523 493573 489077 485638 483194 481002 478309 474994 471424 467829 464107
66701 464107 460251 456659 453748 451379 448933 445947 442480 438844 435223 431673 428310 425219 422253 419175
66687 419175 415993 412921 409891 406346 401751 396268 390724 385948 382248 379420 377045 374743 372401 370201
66673 370201 368263 366225 363493 360000 356446 353513 351085 348561 345724 342908 340347 337859 335286 332824
66659 332824 330720 328965 327522 326540 325981 325301 323931 321991 320136 318687 317282 315416 312938 309924 306495
66644 306495 303019 300126 298144 296607 294649 291841 288456 285069 282185 280136 278912 278039 276993 275874
66630 275874 275370 275799 276487 276371 275157 273537 272340 271732 271278 270473 269022 266844 264059 261001 258069 255536
66614 255536 253500 251905 250500 248902 246992 245228 244251 244097 244061 243535 242713 242168 241941 241483 240432 239002
66598 239002 237511 235924 234085 232128 230407 229214 228728 229053 230058 231276 232139 232255 231495 230072 228598
66583 228598 227669 227152 226268 224704 223187 222475 222143 221143 219430 218125 217911 218062 217517 216312 215364 215170 215305
66566 215305 215142 214515 213559 212316 210751 209025 207500 206363 205375 204181 202854 201837 201212 200395 198855 196874
66550 196874 195099 193537 191611 189155 186744 184920 183742 183263 183751 184934 185656 184909 182973 181013 179743
66535 179743 178962 178220 177433 176871 176865 177462 178153 178098 176922 175130 173456 172052 170621 169080 167639 166396 165345
66518 165345 164669 164532 164617 164387 163773 163139 162523 161475 159886 158479 158108 158759 159505 159357 158033 156045 154228
66501 154228 153148 152830 152936 153098 153070 152771 152371 152170 152232 152214 151695 150548 148846 146778 144837 143788 143949 144721
66483 144721 145266 145454 145656 145827 145441 144347 143058 142072 141442 141126 141198 141495 141542 141111 140445 139716 138730 137423
66465 137423 136226 135549 135277 135137 135201 135533 135681 135053 133750 132539 131970 131931 132065 132211 132282 132059 131417 130610 130108
66446 130108 130122 130438 130728 130906 131062 131192 131210 131215 131453 131834 131751 130693 128892 127093 125738 124701 123756 122977 122615
66427 122615 122854 123699 124864 125776 126001 125698 125387 125280 125193 125103 125296 125803 126096 125636 124493 123185 122099 121284
66409 121284 120612 119905 119057 118168 117542 117504 118232 119605 120952 121204 119753 117253 115079 113905 113223 112319 111174
66392 111174 110183 109531 109229 109323 109658 109732 109182 108173 107086 106158 105711 106254 107808 109487 110332 110424 110634 111442
66374 111442 112496 113287 113642 113517 112824 111632 110245 108936 107844 107133 106983 107339 107919 108541 109265 110109 110758
66357 110758 110624 109281 106913 104337 102349 100959 99525 97770 96307 95903 96535 97534 98383 98968 99292 99403
66341 99403 99467 99476 99006 97773 96305 95521 95670 96150 96402 96462 96574 96819 97226 97762 98028 97539 96533 95978 96395
66322 96395 97104 97107 96366 95643 95328 95066 94515 93890 93518 93282 92844 92197 91677 91500 91558 91700 91975 92476 93110 93661
66302 93661 94006 94101 93912 93472 92943 92383 91563 90331 89089 88490 88551 88540 87944 87126 86722 86804 87050 87372 87831 88168
66282 88168 88063 87780 87949 88628 89143 88999 88435 87896 87425 86888 86438 86327 86419 86228 85506 84614 84238 84705 85568
66263 85568 86028 85839 85587 85838 86304 86257 85620 85077 85076 85318 85372 85255 85105 84795 84221 83650 83311 82963 82247 81309
66243 81309 80674 80637 81117 81993 83184 84414 85272 85593 85567 85437 85227 84793 83977 82763 81375 80186 79416 79009
66225 79009 78945 79451 80626 81956 82590 82156 81078 80012 79198 78456 77590 76677 76100 76373 77749 79873 81934
66208 81934 83339 84176 84937 85886 86847 87511 87705 87369 86525 85407 84481 84128 84266 84379 83950 82873 81572 80760
66190 80760 80963 82001 82970 82973 82021 81057 80972 81764 82811 83803 85084 87015 89298 91128 91994 92187 92498 93476
66172 93476 94992 96478 97433 97719 97528 97255 97301 97780 98369 98668 98643 98482 98017 96722 94489 92055 90340 89541
66154 89541 89189 88856 88426 87823 86895 85572 83916 82051 80283 79147 78948 79322 79608 79611 79620 79720 79609 79149 78652
66135 78652 78390 78198 77785 77143 76450 75832 75365 75075 74787 74316 73899 74059 74777 75245 74836 73986 73644 74062 74694
66116 74694 75172 75749 76635 77402 77435 76792 76179 76036 75911 74951 72986 70911 69843 70012 70672 70964 70567 69542
66098 69542 68007 66292 65089 65042 66173 67916 69673 71144 72258 73053 73654 74143 74380 74102 73277 72315 71808
66081 71808 71987 72406 72283 71310 70088 69555 69994 70862 71544 71887 71877 71295 70105 68865 68265 68363 68699 69060 69692
66062 69692 70777 72163 73663 75164 76295 76464 75529 74146 73131 72694 72578 72727 73321 74184 74612 74058 72830
66045 72830 71812 71524 71641 71505 70980 70658 71140 72311 73454 74052 74282 74613 75171 75701 76069 76459 76992 77399
66027 77399 77312 76733 76042 75605 75609 76183 77393 79095 81027 83061 85107 86754 87458 87349 87417 88529 90487 92449
66009 92449 94007 95308 96329 96823 97054 97860 99512 101018 101025 99209 96407 93641 91380 89589 87969 86094
65993 86094 83632 80635 77552 74968 73313 72601 72339 71902 71218 70916 71525 72660 73276 72718 71297 69905
65977 69905 69287 69627 70560 71481 71969 71956 71534 70817 70076 69742 69987 70469 70713 70535 69849 68431 66413 64823
65959 64823 64854 66478 68318 69172 69155 69082 69263 69392 69300 69180 69147 69062 68883 68835 69103 69562 69917 70009 69944 70029 70530 71367
65937 71367 72097 72385 72464 72902 73868 74906 75506 75622 75483 75226 75057 75494 76894 78736 79885 79782 78966 78215
65919 78215 77646 77113 77020 77980 79763 81327 82050 82232 82129 81294 79480 77603 76963 77652 78525 78683 78238 77546
65901 77546 76556 75333 74554 74823 75815 76652 76962 77096 77408 77843 78214 78436 78367 77799 76755 75509 74179 72594
65883 72594 70769 69239 68566 68651 68879 68936 69160 69933 70933 71271 70392 68707 67226 66619 66762 67155 67584 68140
65865 68140 68774 69200 69338 69537 70129 70973 71671 72039 72044 71510 70375 69196 68835 69463 70335 70757 70858 71103 71518
65846 71518 71851 72180 72785 73616 74393 75094 75792 76125 75607 74516 73794 73914 74408 74778 75227 76131 77335 78444
65828 78444 79403 80276 80831 80884 80778 80959 81285 81347 81279 81573 82177 82442 82078 81535 81237 80991 80446 79709 79213 79282
65808 79282 80045 81407 82840 83646 83778 84047 85064 86287 86661 86041 85407 85645 86716 88158 89827 91752
65792 91752 93633 95021 95873 96441 96638 96033 94675 93535 93657 94959 96253 96516 95855 95151 95029 95386 95742
65775 95742 95728 95257 94418 93325 91990 90327 88339 86275 84495 83178 82176 81165 79971 78847 78387 78967
65759 78967 80139 80798 80182 78649 77267 76733 76865 77012 76661 75637 74052 72271 70739 69713 69180 69049
65743 69049 69271 69725 70175 70422 70429 70221 69761 68976 67888 66703 65803 65596 66245 67547 69115 70524 71262 70898
65725 70898 69679 68680 68768 69445 69330 67942 66363 65825 66234 66657 66766 67087 67963 68995 69626 69742 69551 69304
65707 69304 69263 69591 70094 70331 70080 69481 68697 67789 66974 66562 66476 66268 65860 65908 67047 69053 71052 72316 72614
65688 72614 72120 71401 71193 71689 72200 72018 71411 71219 71629 72034 72056 71924 71702 70987 69784 68984 69365 70574 71648
65669 71648 72151 72205 71805 70859 69799 69372 69725 70247 70426 70372 70379 70420 70268 69807 69100 68393 68098 68453 69210 69961
65649 69961 70739 71847 73122 73936 74076 74087 74550 75508 76892 78874 81319 83349 84123 83876 83653 84077 84847
65632 84847 85369 85419 85083 84439 83454 82077 80364 78595 77187 76330 75761 75020 73841 72235 70419 68844 68027
65615 68027 68094 68615 69082 69348 69361 68851 67683 66330 65497 65378 65712 66412 67599 69032 70115 70588 70791 71058
65597 71058 71283 71191 70619 69414 67567 65701 64860 65341 66141 66101 65299 64741 64875 65119 64876 64315 63836 63367 62644
65578 62644 61868 61494 61515 61481 61270 61342 62047 63106 64049 64812 65513 65868 65378 64102 62840 62437 63140 64654 66431
65559 66431 67807 68268 67839 67033 66239 65418 64527 63897 63842 64138 64259 64054 63875 64045 64424 64534 64018 63048 62295
65540 62295 62348 63104 63901 64282 64341 64261 63947 63371 62864 62750 63004 63610 64832 66652 68314 69030 68969 68931 69175 69256
65520 69256 69020 69092 70112 71875 73428 73814 72802 71247 70633 71787 73990 75721 76278 76301 76763 78044 79991
65503 79991 82299 84562 86386 87664 88517 88983 89138 89469 90506 92001 93053 93248 93108 93184 93317 93161 92910
65486 92910 93009 93501 94127 94817 95739 97026 98769 101038 103682 106333 108791 111122 113251 114868 115940 116804
65470 116804 117440 117182 115619 113373 111331 109472 107066 103883 100520 97551 94959 92514 90226 88220 86489
65455 86489 84917 83405 81891 80419 79152 78176 77311 76296 75120 74035 73356 73294 73788 74303 74122 73163 72275
65438 72275 72302 72960 73141 72327 71198 70644 70576 70074 68591 66653 65262 64854 65009 65203 65519 66422 68026 69906
65420 69906 71563 72730 73240 73037 72413 71823 71281 70347 68945 67793 67667 68596 70026 71415 72337 72454 71953
65403 71953 71673 72235 73236 73857 74021 74329 74996 75600 75903 76207 76665 76905 76670 76377 76642 77596 79026 80889
65385 80889 83263 85905 88277 90046 91336 92460 93572 94667 95756 96906 98061 98969 99480 100001 101464
65370 101464 104662 109545 115308 121153 126932 133085 140080 147985 156568 165712 175558 186061 196472 205493
65356 205493 211976 215359 215537 212735 207624 201194 194242 187187 180451 174585 169744 165346 160652 155514
65342 155514 150297 145298 140609 136361 132699 129520 126467 123083 118861 113456 107220 101319 96863 93967
65328 93967 91927 90124 88353 86404 83956 81016 78107 75791 74144 72838 71643 70776 70679 71346 72013 71852
65312 71852 70964 70210 69993 69769 69034 68110 67492 67041 66451 65962 65826 65561 64610 63368 62539 61750 60054 57819
65294 57819 56862 58222 60798 62731 63386 63413 63513 63838 64180 64213 63741 63031 62584 62361 61714 60418 59288 59293 60404
65275 60404 61774 62756 63309 63605 63779 64039 64685 65886 67488 69010 69874 69894 69496 69257 69350 69848 71350 74516
65257 74516 78845 82702 85007 86280 87581 89029 89960 90083 89766 89406 89142 89013 88873 88279 86976 85438
65241 85438 84434 84148 84089 83766 83014 81740 79918 77877 76195 75107 74240 73049 71358 69461 67867 66923
65225 66923 66584 66528 66535 66587 66545 66045 64931 63540 62324 61394 60695 60351 60464 60759 60860 60826 61044 61607 62174 62455
65205 62455 62522 62558 62518 62141 61206 59840 58639 58320 59053 60196 60892 60830 60373 60148 60646 61893 63282 63930 63497
65186 63497 62472 61471 60613 59809 59260 59144 59169 58987 58837 59172 59851 60351 60678 61332 62342 63095 63239 63073
65168 63073 62808 62169 61142 60489 60954 62275 63523 64142 64250 64124 63855 63459 62925 62187 61282 60503 60170 60290
65150 60290 60603 60862 60918 60698 60319 60114 60359 60990 61769 62524 63090 63251 63083 63215 64354 66555 69234 71792
65132 71792 73885 75213 75608 75474 75591 76140 76351 75507 74009 72945 72749 72794 72323 71320 70420 70298 71261 72969
65114 72969 74444 74759 73988 73182 73114 73409 73213 72367 71512 71275 71878 73357 75531 77766 79321 80098 80650 81480
65096 81480 82801 84929 88161 92010 95287 97400 99124 101578 104904 108480 112074 116075 120720 125697
65082 125697 130500 134713 138009 140405 142503 144994 147827 150248 151643 151916 151051 148900 145616 141796 137878
65067 137878 133725 129066 123999 118776 113408 107877 102509 97755 93750 90435 87949 86399 85234 83441
65053 83441 80653 77699 75719 74894 74387 73382 71761 69769 67596 65559 64304 64263 64968 65349 64782 63569
65037 63569 62414 61833 62111 63265 64701 65341 64608 63109 61967 61588 61452 60999 60258 59667 59654 60414 61744
65020 61744 63036 63791 64156 64622 65136 64981 63727 61910 60496 59923 59928 60066 60099 59994 59896 60030 60446 60851 60866
65001 60866 60437 59843 59385 59228 59476 60168 61112 61890 62113 61753 61176 60884 61119 61683 62108 62018 61316 60161 58915
64982 58915 58059 57879 58129 58210 57817 57245 56947 57014 57331 58032 59355 61019 62165 62141 61166 60027 59260 58802 58324
64963 58324 57665 56907 56184 55509 54815 54185 54022 54823 56651 58898 60722 61673 61824 61465 60878 60353 60029 59700
64945 59700 59080 58325 57968 58225 58696 59020 59397 60122 60924 61286 61186 60967 60588 59663 58315 57319 57115 57259 57141
64926 57141 56801 56595 56528 56398 56334 56634 57217 57707 57957 58044 57850 57148 56140 55446 55452 56026 56956 58235 59712 60854
64906 60854 61176 60727 59892 58930 57952 57202 57004 57364 57885 58136 57983 57564 57153 57112 57729 58896 60041 60625 60658
64887 60658 60547 60462 60129 59302 58114 56845 55685 54943 55130 56396 58084 59329 60037 60771 61760 62592 62927
64870 62927 62956 62942 62838 62642 62652 63051 63590 63930 63953 63523 62470 61153 60429 60541 60555 59524 57793 56421 55724
64851 55724 55266 55044 55614 56987 58383 59435 60734 62731 64745 65707 65429 64568 63673 62871 62269 62015 61936
64834 61936 61578 60813 60059 59753 59833 59900 59745 59475 59192 58802 58235 57653 57263 57051 56897 56818 56838 56741 56395 56264 57046
64813 57046 58644 60056 60548 60420 60255 59989 59292 58384 57772 57503 57343 57402 57831 58140 57669 56726 56369 57079 58400
64794 58400 59981 62001 64312 66041 66545 66159 65579 65056 64547 64063 63464 62410 60930 59609 58860 58492 58343
64777 58343 58692 59619 60587 61241 62042 63378 64581 64701 63974 63624 64303 65473 66356 66730 66696 66330 65815 65490
64759 65490 65491 65639 65789 66007 66285 66324 65763 64527 63009 61923 61800 62429 62994 63015 62885 63174 63715 63885 63572
64740 63572 63208 62949 62462 61680 61172 61437 62213 62809 62868 62588 62337 62316 62503 62795 63188 63786 64589 65332 65731 65801
64720 65801 65761 65748 65798 66016 66444 66871 67065 67132 67328 67559 67473 67071 66836 67143 67877 68693 69323 69452 68754 67346
64700 67346 65962 65365 65672 66447 67250 67850 68043 67596 66523 65231 64282 63965 64121 64443 64931 65889 67360 68746
64682 68746 69299 68964 68387 68073 67943 67858 68150 69204 70753 72029 72640 72941 73503 74512 75841 77357 78875
64665 78875 79922 79942 78832 77093 75355 73880 72621 71547 70704 70118 69902 70348 71520 72813 73368 73101
64649 73101 72910 73561 74704 75326 74861 73503 71744 70117 69213 69330 70084 70793 71202 71377 71050 69819 68108
64632 68108 67114 67369 67987 67826 66895 65988 65384 64738 64106 64228 65561 67584 69291 70019 69712 68833 68201 68435
64614 68435 69212 69366 68107 65998 64381 63979 64400 64893 65152 65326 65673 66460 67920 69951 71911 73038 73175
64597 73175 72931 72998 73468 73879 73844 73403 72898 72697 73016 73682 73973 73053 70849 68303 66507 65764 65793 66543 68141
64578 68141 70085 71287 71259 70727 70607 70832 70726 70182 69795 69976 70601 71459 72448 73258 73509 73322 73222 73385 73513
64559 73513 73558 73887 74474 74672 74208 73746 73936 74480 74773 74929 75415 76077 76393 76456 76895 77905 79099 80178 80974
64540 80974 80989 79852 78343 77998 79336 81197 82149 81896 80985 79904 78991 78640 78942 79400 79406 78762 77571 76005
64522 76005 74471 73555 73472 73962 74849 76184 77602 78251 77748 76644 75583 74686 74162 74630 76068 77206 76930
64505 76930 75744 74918 74710 74510 74264 74466 74949 75035 74934 75639 77158 78103 77578 76405 75852 75999 76080 75736 75169
64486 75169 74640 74455 74990 76065 76738 76376 75583 75388 75902 76454 76764 77135 77618 77863 77912 78300 79102 79545 79023
64467 79023 78032 77568 77831 78041 77504 76451 75728 75928 76997 78483 79879 80800 81132 81175 81421 81949 82163 81450
64449 81450 80065 79049 79186 80294 81631 82676 83324 83687 84007 84564 85260 85419 84444 82692 81292 80934 81138
64432 81138 80910 79921 78819 78559 79592 81594 83713 85186 86005 86978 88901 91636 94223 95982 97154 98334
64416 98334 99645 100871 102207 104290 107407 111060 114454 117132 118958 119830 119753 119095 118435 118095 117937 117580
64400 117580 116768 115547 114135 112611 110786 108487 105822 102967 99891 96700 94164 93268 93956 94836 94547
64385 94547 93050 91235 89680 88334 87156 86372 86095 86166 86474 87019 87606 87807 87363 86457 85578 85206 85534 86286
64367 86286 86940 87362 87973 89069 90262 90964 91181 91286 91251 90788 90158 90133 90944 91870 92124 91684 91032 90488 90148
64348 90148 90144 90600 91464 92592 93891 95235 96360 96990 97045 96744 96534 96770 97284 97502 97226 97052 97639 98808
64330 98808 99866 100648 101540 102544 103040 102676 101859 101112 100478 99848 99480 99850 101220 103413 105717 107084 106959
64313 106959 105985 105317 105188 104819 103866 103125 103395 104390 105350 106104 106908 107727 108318 108707 109004 109033 108706 108481 108935
64294 108935 110099 111649 113425 115232 116462 116619 116106 115925 116640 118056 119758 121471 123013 124476 126413
64279 126413 129359 133172 137267 141455 146059 151127 156030 159995 162814 164909 166826 168634 169735 169458
64265 169458 167974 166279 165022 163758 161816 159462 157544 156207 154732 152607 150051 147409 144724 142123
64251 142123 140049 138793 138103 137476 136622 135565 134622 134267 134679 135377 135677 135577 135822 137076 139368 142338 145554
64234 145554 148508 150823 152710 154832 157530 160489 163282 165937 168798 172160 176105 180309 183892 185945
64220 185945 186407 186050 185404 184160 181923 179074 176410 174239 172259 170119 167682 164893 161834 158852 156332
64205 156332 154372 152905 151974 151581 151366 150838 149974 149319 149426 150388 151943 153749 155467 156742 157316 157241 156904
64188 156904 156796 157088 157441 157350 156759 156217 156316 157079 158092 159093 160261 161870 163879 165910 167569 168745 169652
64171 169652 170697 172262 174510 177273 180123 182679 184918 187106 189457 192031 195043 199045 204509 211339
64157 211339 219042 227296 236058 245234 254648 264348 274485 284731 294214 302327 309276 315544 321018 324949
64143 324949 326568 325539 322036 316789 310863 304952 298889 292152 284746 277164 269648 262072 254700 248417
64129 248417 243801 240391 237365 234625 232642 231433 230386 229185 228175 227498 226410 224089 220842 217903
64115 217903 216030 214838 213608 212258 211209 210558 209849 208722 207617 207644 209617 213130 216763 219434 221449
64100 221449 223963 227594 232003 236845 242420 249102 256715 264961 274016 284088 294720 305252 315886
64087 315886 327532 340500 353961 366919 379082 390478 400670 408919 414882 418750 420771 420871 418740
64074 418740 414153 407364 399280 391020 383095 375196 366958 358678 350996 344135 337858 332083 327039 322814
64060 322814 319201 316199 314263 313694 314038 314520 315011 316170 318551 322016 326212 331200 337164 343772 350486
64045 350486 357582 366195 377054 389611 402835 416526 431344 447796 465735 484766 504549 524636
64033 524636 544490 563795 582369 599743 615273 628775 640500 650362 657754 662413 664871 665586 664168
64020 664168 660107 653880 646583 638636 629588 619208 608055 596879 586106 576246 568196 562710 559836
64007 559836 559080 559815 561316 562978 564924 568026 572809 578685 584814 591414 599459 609207 619880 630898
63993 630898 642589 655360 668951 683098 698351 715509 734651 755487 778461 804627 834355
63982 834355 866920 901587 938510 978234 1020865 1066156 1114094 1164944 1218952 1276390 1337787
63971 1337787 1403791 1474886 1551510 1634434 1724865 1824184 1933778 2055124 2190057 2341097
63961 2341097 2511712 2706307 2930114 3189170 3490161 3839806 4244307 4709606 5241764
63952 5241764 5845965 6524465 7275725 8095638 8978906 9918792 10906321 11930445 12978179
63943 12978179 14033106 15073626 16073777 17006646 17847475 18574909 19171596 19625001 19927260
63934 19927260 20073468 20060062 19885106 19549973 19060892 18429712 17673965 16815871 15880118
63925 15880118 14891280 13871991 12842179 11819079 10817690 9851260 8931327 8067491 7267315
63916 7267315 6536173 5876549 5287381 4764701 4303318 3897925 3543004 3232809 2962109
63907 2962109 2726529 2521736 2342801 2185057 2045341 1921770 1812406 1714730 1626411 1545999
63897 1545999 1472662 1405646 1344194 1287707 1235670 1187411 1141985 1098344 1055769 1014216 974014
63886 974014 935016 896307 857071 817659 779425 743487 709969 678424 648587 620498 594205
63875 594205 569692 547034 526301 507260 489351 472114 455644 440517 427155 415334 404396
63864 404396 393895 383878 374595 366163 358651 352223 347027 343011 340051 338172 337510 338053 339501 341372
63850 341372 343251 345089 347289 350361 354399 359040 363932 368944 373788 377803 380419 381671 381869 380897 378202
63835 378202 373440 366803 358737 349639 339876 329741 319320 308669 298145 288220 278883 269606 260116
63822 260116 250842 242318 234489 227034 220124 214303 209620 205437 201195 196971 193047 189353 185627 181813
63808 181813 177942 173923 169891 166539 164546 163703 163089 162116 160902 159555 157821 155740 154114 153711 154300
63793 154300 154981 155249 155204 154893 154019 152423 150368 148186 145956 143722 141756 140401 139696 139286 138691 137680
63777 137680 136353 134810 132868 130435 128125 126897 126843 126901 126215 125248 124918 125119 124984 124261 123435 122623 121428
63760 121428 120026 119286 119473 119834 119990 120742 122789 125401 127247 128017 128368 128688 128787 128657 128651 128890 129162 129472
63742 129472 130125 131159 132183 132901 133457 134191 135293 136738 138363 140057 141999 144514 147522 150452 153130
63727 153130 156472 161709 168942 176922 184287 190669 196543 202387 208131 213172 216849 219020 220133 220585
63713 220585 220167 218401 215274 211307 207035 202766 198757 195220 192020 188683 184830 180477 175939 171574
63699 171574 167537 163606 159379 154892 150868 148105 146715 146192 146020 145825 145209 143988 142671 142271 143421
63684 143421 145832 148569 150678 151764 152344 153598 156350 160282 164450 168501 172989 178513 184984 191828
63670 191828 198536 204829 210563 215599 219661 222346 223424 223014 221248 218003 213339 207938 202543 197132
63656 197132 191299 185459 180846 178047 176193 173995 171110 168048 165251 162810 160824 159416 158452 157715 157412
63641 157412 158109 159986 162410 164496 166086 167959 170975 175086 179397 183226 186835 190960 195956 201714
63627 201714 208186 215528 223803 232970 243192 254711 267435 281029 295482 311177 328386 347057
63615 347057 367176 388855 411984 436157 460980 485907 509652 530372 546801 558793 566567 570026
63603 570026 569300 565456 560053 554224 548611 543826 540295 537634 534770 530796 525468 518873 510988 501614
63589 501614 490545 477805 463859 449538 435547 422117 409229 396961 385378 374328 363729
63578 363729 353905 345226 337477 330017 322665 316038 310891 307376 305116 303768 303326 304051 306262 310093 315382
63563 315382 321868 329586 338879 349876 362130 375067 388795 404226 422230 442830 465326 489079
63551 489079 513866 539475 565221 589946 612242 630591 643763 651583 655238 656477 656461 655655 654640
63538 654640 654427 655747 658353 661219 663221 663482 661427 656793 649445 639034 625020 607275 586491 563807
63524 563807 540144 516052 491966 468292 445293 423152 402173 382762 365222 349640 335936
63513 335936 323880 313130 303399 294630 286971 280507 275024 270079 265445 261501 258887 257584 256632 255162
63499 255162 253514 252845 253676 255427 257391 259535 262084 265030 268449 272798 278367 284844 291863 299564 307985
63484 307985 316315 323507 329537 335349 341590 348007 354029 359243 363130 365048 364826 362958 359951 355894
63470 355894 350842 345175 339206 332901 326357 320203 315047 310814 307078 303791 301132 298809 296209 293319
63456 293319 290872 289336 288303 287214 286181 285547 285031 284037 282769 282270 283213 285273 288017 291756 296906
63441 296906 303024 309270 315737 323464 332976 343584 354500 366093 379487 395224 412891 431892
63429 431892 452058 473482 496207 520260 545763 572894 601824 632608 664937 697937 730359
63418 730359 760906 788235 810824 827307 837149 840829 839298 833486 824449 813679 802837 793017 784302
63405 784302 775978 767112 756934 744934 730749 714063 694661 672645 648588 623372 597766 572221
63393 572221 547127 523119 500856 480496 461678 444242 428729 415922 405997 398442 392741 388764
63381 388764 386444 385462 385530 386784 389625 394257 400525 408119 416818 426666 438018 451395 467129 485107
63367 485107 504891 526097 548750 573398 600817 631353 664421 698632 732337 764038 792490
63356 792490 816804 836397 850610 858548 859792 855342 847319 837532 826705 815206 803912 793860
63344 793860 785424 778216 771413 763710 753400 739319 721719 701737 680074 656798 632336 607861
63332 607861 584381 561983 540380 519804 500899 483919 468448 453919 440226 427842 417441
63321 417441 409255 402681 396647 390630 385226 381470 379601 378688 377596 376137 375081 375095 375920 376702 376886 376518
63305 376518 375818 374869 373881 373319 373377 373458 372590 370434 367666 365284 363741 362794 362029 361364 361090 361515 362607 364036
63287 364036 365531 367076 368669 370079 371023 371492 371635 371415 370677 369652 369073 369587 371144 373134 375003 376572
63271 376572 377856 378839 379533 380076 380634 381279 382045 383033 384310 385687 386813 387550 388130 388845 389750 390805 392124
63254 392124 393855 395925 398206 400922 404565 409304 414706 420163 425443 430748 436392 442549 449257 456536
63240 456536 464523 473413 483275 494085 506129 520160 536872 556235 577575 600200 623740 648142
63228 648142 673774 701311 730878 761405 791438 820512 848975 876539 902072 925197 946991
63217 946991 968504 989502 1009490 1029127 1049470 1070347 1090652 1109955 1128611 1146236 1161166
63206 1161166 1171602 1176458 1174999 1166681 1151825 1131646 1107118 1078332 1045343 1009090 971078 932612
63194 932612 894796 858849 825908 796647 771382 750223 732846 718478 706570 697399 691705 689785
63182 689785 691128 694860 700377 707640 716974 728521 741919 756677 772717 790186 808747 827531
63170 827531 845900 863859 881567 898921 915847 932513 948863 964251 977871 989262 998088 1003792
63158 1003792 1005942 1004692 1000407 992971 981844 966705 947703 925279 900244 873945 847859 822816
63146 822816 798874 775918 754095 733653 714762 697592 682290 668722 656465 645166 634744
63135 634744 625253 616799 609687 604273 600451 597521 594859 592575 591287 591300 592339 594008 596207 598973 602199
63120 602199 605636 609019 612038 614419 616316 618480 621692 625991 630711 635312 639899 644844 650234 655912
63106 655912 661844 668120 674631 680956 686585 691226 695036 698643 702687 707071 710798 712866 713300 712991 712544
63091 712544 711640 709687 706880 704385 703457 704377 706226 707708 708315 708650 709636 711589 714203 717181 720613 724862
63075 724862 730402 737652 746590 756537 766762 777385 789295 802909 817406 831516 844912 858454
63063 858454 873115 888994 905564 922613 940700 960719 983292 1008659 1036878 1067846 1101301
63052 1101301 1137182 1175868 1217654 1262036 1308124 1355824 1405907 1458582 1512764 1567282 1622152
63041 1622152 1677822 1733677 1788350 1841326 1893237 1944559 1995000 2044360 2093107 2141764 2190497
63030 2190497 2239557 2289291 2339144 2387215 2431206 2469327 2500016 2521621 2532997 2533812 2523657 2501450
63018 2501450 2466505 2419755 2363169 2298386 2226795 2150604 2072699 1995272 1919496 1846706 1779004
63007 1779004 1718176 1664620 1617839 1577586 1544075 1517403 1497348 1483704 1476312 1474700 1477976 1485289
62995 1485289 1496286 1510986 1529249 1550538 1574198 1599773 1626822 1654459 1681371 1706509 1729785
62984 1729785 1752018 1774175 1796499 1818081 1837195 1852235 1862445 1867640 1867305 1860377 1846065 1824481
62972 1824481 1796084 1760842 1718480 1669554 1615815 1559346 1501645 1443631 1386160 1330135 1276178
62961 1276178 1224533 1175478 1129704 1088113 1051173 1018507 989162 962240 937384 914887 895415
62950 895415 879386 866411 855412 845410 836057 827315 818953 810705 802589 794575 786137 776736 766657
62937 766657 756678 746870 736499 725389 714615 705246 696948 688457 679131 669448 660168 651593 643607
62924 643607 635994 628620 621607 615322 609983 605379 601180 597317 593824 590535 587319 584403 582075 580171
62910 580171 578280 576343 574611 573059 571359 569540 568193 567746 567856 567807 567362 566922 566872 567041 566954 566533 566257
62893 566257 566481 566772 566264 564623 562270 559617 556518 552781 548767 545039 541617 538084 534407 531209 529108
62878 529108 527971 526976 525313 522851 520159 517902 516294 515239 514834 515255 516113 516471 515789 514465 513121 511786
62862 511786 510219 508668 507699 507422 507373 507072 506249 504660 502236 499390 496761 494591 492731 491163 490007 488971
62846 488971 487358 484900 482264 480493 480049 480546 481217 481579 481726 482049 482647 483170 483335 483361 483632 484127 484509 484620
62828 484620 484555 484329 483880 483354 482985 482677 482043 480924 479660 478831 478905 480016 481777 483444 484549 485300 486086
62811 486086 486819 487202 487442 488161 489693 491984 495096 499174 503901 508632 513243 518265 524032 530284 536865
62796 536865 544184 552566 561677 571073 581018 592286 605384 620372 637255 656147 677060 699779
62784 699779 724013 749638 776963 806804 840026 876923 917334 961462 1010169 1064343 1124402
62773 1124402 1190696 1263823 1343987 1430326 1521473 1616572 1715113 1815794 1916177 2013603 2105898
62762 2105898 2191014 2266498 2329801 2378840 2411949 2427625 2424947 2404329 2367407 2316036 2251725
62751 2251725 2176199 2092048 2002222 1908952 1813572 1717349 1621963 1528987 1439378 1353870 1273486
62740 1273486 1199090 1130508 1066685 1006915 951595 901560 856938 816878 780322 746733 716061
62729 716061 688228 662941 639997 619519 601654 586121 572296 559695 548145 537621 528342 520924
62717 520924 515870 512654 509930 506989 504554 503662 504261 505556 507439 510751 516147 523347 531694 540985 551648
62702 551648 564388 579720 597540 617222 638439 661793 688242 718051 750799 786366 825304
62691 825304 868164 914985 965531 1019511 1076328 1135032 1194736 1254750 1314103 1371126 1423646
62680 1423646 1469453 1506720 1534330 1551825 1558824 1554733 1539473 1514237 1480840 1440334 1392910 1339242
62668 1339242 1281229 1221252 1161255 1102629 1046194 991969 939553 889150 841746 798089 758084
62657 758084 721413 688072 657847 629922 603608 579061 556772 536755 518688 502444 487972
62646 487972 474989 463233 452687 443164 434028 424786 415536 406403 397031 387318 378189 370798 365094
62633 365094 359884 354267 348394 342829 337855 333507 329752 326398 323180 320087 317361 315125 313307 311932
62619 311932 311208 311234 311813 312611 313403 314247 315504 317540 320303 323336 326339 329432 332760 336201 339762 343934
62603 343934 349270 355842 363433 371973 381471 391861 403389 416881 433118 452099 473386 496942
62591 496942 523145 552196 584181 619600 659164 702937 750128 799823 851370 903967 956341
62580 956341 1007055 1054851 1098603 1137160 1169344 1193884 1209512 1215492 1212044 1199919 1179787 1152486
62568 1152486 1119716 1083626 1045445 1005071 962361 918421 875221 834199 795642 759333 725428
62557 725428 694551 667067 642391 619258 596830 575322 555261 536413 517974 499758 482533
62546 482533 466966 452698 438838 425067 411927 400236 390470 382578 376069 370299 364927 360164 356494
62533 356494 354186 353094 352815 352954 353235 353508 353784 354283 355382 357371 360321 364340 369790 376875 384983 392979
62517 392979 400487 408529 418478 430663 444484 459606 476425 495453 516868 540828 567649 597399
62505 597399 629609 663544 698587 734246 770044 805412 839434 870716 897798 919697 935853
62494 935853 945700 948750 945041 935068 919292 898231 872970 844919 814891 783124 750449 718669
62482 718669 689203 661839 635466 609726 585395 563409 544172 527672 513648 501604 491174
62471 491174 482496 475756 470372 465289 460323 456671 455641 457220 460298 463996 468191 472865 477639 482213
62457 482213 486817 491852 497393 503361 509988 517652 526339 535679 545473 555793 566529 577282 587818
62444 587818 598158 607998 616439 622569 625980 626463 623624 617245 607768 596006 582542 567750 552167
62431 552167 536425 520935 505946 491667 478047 464794 452066 440727 431326 423182 415346 408218
62419 408218 403276 401193 401184 402320 404496 407705 411319 414801 418560 423470 429914 437738 446693 456419 466317
62404 466317 475929 485175 493942 501816 508598 514576 519838 523788 525913 526597 526452 525207 522119 517333 511975
62389 511975 506813 501600 495938 490141 484828 480214 476193 472864 470580 469632 470155 472286 476240 482185 490075
62374 490075 499608 510503 522962 537755 555593 576530 600289 627098 657832 693225 733245 777268
62362 777268 824556 874425 926337 980134 1036044 1094074 1153248 1211436 1265956 1314427 1355295
62351 1355295 1387735 1411168 1425062 1429310 1424719 1412808 1395056 1372430 1345567 1315050 1281343 1244725
62339 1244725 1205547 1164571 1122958 1081938 1042487 1005139 969973 936924 906204 878305 853421
62328 853421 830955 809778 788994 768408 748336 729164 711143 694435 679258 665967 654933
62317 654933 646223 639405 633842 629225 625708 623420 621945 620432 618089 614415 609083 602009 593688 585118
62303 585118 577006 569111 560737 551862 543423 536256 530111 524080 517837 511996 507211 503456 500512 498776
62289 498776 498982 501094 504058 506916 509868 513903 519640 526901 535279 544586 554687 565389 576696 588823
62275 588823 601699 614815 627904 641445 656032 671505 687239 703250 720393 739365 760083
62264 760083 782374 806717 833816 863768 896213 931281 969763 1012198 1058151 1106567 1156481
62253 1156481 1206998 1256715 1303518 1345081 1379484 1405479 1422443 1430268 1429280 1420156 1403868 1381493
62241 1381493 1353861 1321428 1284672 1244666 1202953 1160780 1118743 1077402 1037876 1001382 968367
62230 968367 938524 911601 887725 866967 849158 834238 822243 812746 804822 797845 791831 786696
62218 786696 781716 776284 770688 765457 760275 754312 747540 740927 735249 730440 726250 722955 721068 720804
62204 720804 722015 724284 726899 729278 731689 735176 740463 747262 754928 763354 772806 783271 794575 807041
62190 807041 821439 838205 857067 877477 898995 921052 942720 963132 982132 1000202 1017612
62179 1017612 1033852 1048166 1060593 1072158 1083919 1096168 1108853 1122504 1138297 1157217 1179582
62168 1179582 1205363 1234513 1266798 1301665 1338470 1376532 1414734 1451374 1484706 1513545 1537211
62157 1537211 1555252 1567581 1574774 1577833 1577533 1574154 1567802 1558793 1547578 1534407 1519290 1502492 1485059
62144 1485059 1468550 1453985 1441218 1429602 1419168 1410703 1404684 1400613 1397589 1395154 1393320 1392084 1391358
62131 1391358 1391292 1392364 1395048 1399399 1404988 1411308 1418403 1426993 1437720 1450349 1464055 1478491 1494148
62118 1494148 1511609 1530904 1551697 1573643 1596286 1619109 1642079 1665828 1690994 1717676 1745787
62107 1745787 1775421 1806354 1837631 1868303 1898445 1928872 1960010 1991630 2023606 2056288 2090040
62096 2090040 2125021 2161566 2200126 2240513 2281780 2323379 2366136 2411546 2460140 2510953 2562468
62085 2562468 2613595 2663579 2711609 2757221 2801192 2845515 2892079 2941294 2992047 3042773 3092350
62074 3092350 3140169 3185866 3229254 3270463 3310140 3349649 3390931 3435726 3484715 3537468 3593190
62063 3593190 3651202 3710687 3770357 3828587 3883690 3934109 3978846 4017933 4052118 4081790 4106572
62052 4106572 4126198 4141302 4152777 4160651 4164162 4162769 4156595 4146043 4131598 4114111 4094748 4074416
62040 4074416 4053519 4032311 4011093 3989959 3968745 3947535 3926971 3907742 3889817 3872448 3854967
62029 3854967 3837443 3820472 3804469 3789399 3775261 3762482 3751442 3741741 3732461 3723282 3714886 3708047
62017 3708047 3702730 3698428 3694942 3692360 3690590 3689542 3689617 3691385 3694746 3698888 3703110 3707249 3711263 3714925
62003 3714925 3718149 3721160 3723987 3726072 3726652 3725401 3722453 3717868 3711301 3702116 3689668 3673455 3653129
61990 3653129 3628488 3599541 3566590 3530195 3491052 3449917 3407527 3364375 3320583 3276289 3232133
61979 3232133 3188983 3146999 3105443 3063718 3022210 2981761 2942714 2905063 2869141 2835379 2803450
61968 2803450 2772466 2742152 2713147 2685918 2659990 2634664 2609990 2586538 2564499 2543518 2523229
61957 2523229 2503548 2484437 2465694 2447114 2428674 2410571 2393150 2376790 2361690 2347702 2334424
61946 2334424 2321534 2309044 2297205 2286195 2276028 2266877 2259257 2253501 2249117 2245167 2241500 2239134 2239078
61933 2239078 2241301 2245374 2251634 2260866 2273007 2287175 2303198 2322345 2346152 2375083 2408776 2447119
61921 2447119 2490602 2539931 2595873 2659422 2731819 2814514 2909367 3018695 3144911 3290264 3457256
61910 3457256 3649208 3870099 4124006 4415122 4748455 5130105 5566396 6062387 6620815
61901 6620815 7241744 7922120 8654356 9424051 10208028 10973956 11682010 12288542 12751605
61892 12751605 13037555 13126745 13016310 12719598 12263195 11682424 11015923 10300410 9567147
61883 9567147 8840604 8138648 7473532 6853269 6282704 5763693 5295049 4873443 4495000
61874 4495000 4156061 3852868 3581535 3338877 3122647 2930406 2758656 2603809 2463793
61865 2463793 2337989 2225647 2125009 2034082 1951604 1876997 1809749 1749245 1694949 1646409 1603177
61854 1603177 1564940 1531662 1503358 1479628 1459545 1442122 1426898 1413946 1403312 1394556 1386992 1380278
61842 1380278 1374526 1369773 1365616 1361558 1357583 1354182 1351919 1351115 1351873 1354085 1357325 1360948 1364474 1367946
61828 1367946 1371829 1376544 1382098 1388126 1394259 1400360 1406389 1412233 1417912 1423910 1431032 1439762 1449942 1461236
61814 1461236 1473768 1488082 1504528 1522974 1543203 1565424 1590301 1618569 1650676 1686660 1726264
61803 1726264 1769296 1816036 1867194 1923248 1983897 2048512 2117296 2191673 2273264 2362654 2459510
61792 2459510 2563825 2676674 2799774 2934723 3082781 3245122 3423172 3619104 3836203
61783 3836203 4078532 4350182 4655140 4998043 5384645 5821384 6315110 6873676 7506385
61774 7506385 8223179 9033312 9944616 10962720 12089054 13318104 14635205 16014507 17416263
61765 17416263 18784930 20051126 21138389 21972790 22493441 22662654 22473121 21948512 21136817
61756 21136817 20100277 18906197 17619817 16298682 14989006 13724886 12529611 11417477
61748 11417477 10395596 9465896 8626842 7874244 7201646 6601318 6065636 5587807 5161678
61739 5161678 4781395 4441430 4136832 3863470 3618112 3398183 3201282 3024917 2866713
61730 2866713 2724629 2596842 2481613 2377479 2283412 2198493 2121451 2050712 1984892 1923211
61720 1923211 1865521 1812048 1762969 1718107 1677018 1639278 1604451 1571830 1540610 1510499 1481830
61709 1481830 1454886 1429465 1405327 1382634 1361514 1341544 1322242 1303842 1286850 1270843 1254482
61698 1254482 1237077 1219624 1203746 1189832 1176706 1163093 1148947 1135198 1122576 1111007 1100022
61687 1100022 1089347 1079005 1069092 1059675 1050836 1042574 1034713 1027062 1019659 1012757 1006550 1001027 995999
61674 995999 991129 985973 980221 973953 967555 961390 955682 950623 946292 942401 938283 933272 927039 919667
61660 919667 911625 903666 896447 890137 884459 879117 874006 869067 864237 859605 855438 852008 849542 848286
61646 848286 848323 849220 850097 850222 849484 848391 847766 848304 850129 852708 855439 858233 861295 864543 867736 871095
61630 871095 875261 880511 886479 892717 899010 904932 909642 912510 913685 913774 913235 912176 910440 907673 903673
61615 903673 898863 894081 889695 885272 880270 874663 868645 862163 855125 847740 840307 832865 825269 817357
61601 817357 808952 800102 791455 783955 777964 773041 768762 765179 762240 759511 756989 755559 756008 757979
61587 757979 760522 763279 766561 770689 775931 782671 790842 799527 807941 816649 826993 839438 853343
61574 853343 868353 885051 903983 924818 946885 969993 994301 1019795 1046294 1073783 1102394
61563 1102394 1132098 1162555 1193226 1223669 1253782 1283578 1312618 1339998 1365220 1388752 1411283
61552 1411283 1432700 1452348 1470102 1486384 1501096 1513220 1521789 1526831 1529075 1529036 1526555 1521023 1511972
61539 1511972 1499710 1485402 1470319 1454987 1439269 1423089 1406767 1390773 1375628 1361992 1350436
61528 1350436 1341053 1333661 1328269 1324989 1323606 1323787 1325756 1330304 1338215 1350113 1366737 1388658 1415684
61515 1415684 1447238 1483559 1525972 1575830 1633820 1700491 1776784 1863613 1961514 2071280 2194593
61504 2194593 2333598 2490079 2665270 2859978 3074323 3307448 3557621 3822032 4095791
61495 4095791 4371104 4637817 4884885 5101545 5278066 5406702 5482809 5505396 5476901 5402509
61485 5402509 5289200 5144742 4977039 4793924 4602771 4409718 4219303 4035056 3860189
61476 3860189 3697439 3548459 3413837 3293705 3188104 3096915 3019912 2957020 2908258 2873307
61466 2873307 2851256 2840825 2840812 2850438 2869441 2897731 2934659 2978625 3027596 3080012 3134926 3191347
61454 3191347 3247877 3303228 3356752 3408109 3456676 3501811 3543774 3583887 3623596 3663657 3704495
61443 3704495 3746848 3791442 3838142 3886052 3934594 3983919 4033949 4083449 4130455 4173359 4211268
61432 4211268 4243554 4269606 4288953 4301215 4305854 4302264 4290230 4270181 4243035 4209972 4172301 4131335
61420 4131335 4088303 4044355 4000488 3957418 3915811 3876823 3842103 3812952 3789669 3771980 3759771
61409 3759771 3752947 3750731 3751668 3754323 3757636 3760687 3762531 3762330 3759254 3752332 3740832 3724890 3705456 3683661
61395 3683661 3660616 3637846 3617443 3601598 3592239 3591122 3599949 3620243 3653438 3701272 3765922 3849594
61383 3849594 3954005 4080178 4228506 4399106 4592291 4808527 5047614 5307793 5585674
61374 5585674 5876503 6173880 6469245 6752196 7011559 7236440 7417217 7547034 7622997 7645878
61364 7645878 7618678 7545590 7431663 7282176 7101789 6894659 6665402 6419368 6161822 5897480
61354 5897480 5630959 5366885 5109002 4859529 4619794 4391198 4175340 3973569 3786790
61345 3786790 3615548 3460062 3320297 3195964 3086308 2990077 2906302 2835067 2777017 2732081
61335 2732081 2699265 2677641 2666722 2665683 2673083 2687869 2710001 2739635 2776146 2818390 2865333 2915923
61323 2915923 2968857 3023025 3077812 3132478 3185611 3235775 3282454 3325905 3366332 3403635 3437708
61312 3437708 3468581 3496434 3521729 3544966 3565965 3583732 3597410 3606975 3612554 3613491 3608663 3597506
61300 3597506 3580239 3557261 3528868 3495412 3457251 3414572 3367574 3316742 3262734 3206192 3147937
61289 3147937 3089016 3030244 2972046 2915155 2861125 2811647 2767498 2728553 2694589 2665668 2641918
61278 2641918 2623279 2609241 2598504 2589272 2580304 2571361 2562225 2551791 2538806 2523149 2505671 2487089
61266 2487089 2467825 2448681 2430657 2414002 2398299 2383710 2371458 2362823 2358366 2358546 2364580 2378206
61254 2378206 2400871 2433484 2476770 2531530 2598556 2678369 2770983 2875874 2992210 3118890 3254035
61243 3254035 3394299 3534719 3669097 3790478 3891739 3966419 4009357 4016866 3987067 3920824
61233 3920824 3822220 3697475 3553209 3395815 3231809 3067463 2907532 2754711 2610554 2476512
61223 2476512 2353807 2242785 2142874 2053063 1972317 1899812 1835130 1778150 1728555 1685419 1647398
61212 1647398 1613310 1582566 1555241 1531856 1513048 1499268 1490636 1486918 1487563 1491893 1499326 1509411
61200 1509411 1521739 1536067 1552448 1570813 1590167 1608611 1624483 1637205 1646800 1653032 1655561 1654628
61188 1654628 1650986 1645202 1637500 1628143 1617354 1604820 1589883 1572418 1553124 1532778 1511599 1489567
61176 1489567 1467014 1444608 1422842 1401703 1380693 1359113 1336478 1312868 1288892 1265205 1241955
61165 1241955 1218563 1194082 1167979 1140671 1113127 1085946 1059052 1032392 1006460 981897 958894
61154 958894 937355 917305 898694 880959 863236 845015 826340 807445 788402 769068 749228
61143 749228 729089 709737 692708 678797 667601 658441 651185 645834 641992 639481 638961 641061 645110
61130 645110 649568 653643 657827 662958 669433 677193 685712 694117 702037 710344 720281 731891 744052 755985
61116 755985 767824 779678 791197 802386 813922 826147 838467 850233 861595 872897 883779
61105 883779 893378 901111 906770 910134 910927 909064 904798 898732 891671 884074 875670 866030 855505 845017
61091 845017 834915 824723 814201 803903 794295 784966 775191 764793 754041 743110 732096 721312
61079 721312 711161 701880 693597 686354 679955 674122 668829 664177 659964 655942 652467 650145 648767 647371
61065 647371 645610 644128 643296 642509 641371 640625 641051 642125 642694 642465 641953 641339 640396 639312 638690 638693 638975 639480
61047 639480 640667 642833 645713 648860 652074 655462 659375 664211 670012 676354 682852 689610 696960 705133
61033 705133 714416 725240 737653 750938 764163 776769 788425 798826 808125 817090 826246 835245
61021 835245 843665 851976 861093 871340 882547 894747 908048 922176 936903 952640 969785 987890
61009 987890 1006370 1025769 1047313 1071387 1097472 1125478 1156112 1189984 1227427 1269206 1316188
60998 1316188 1368121 1423767 1482485 1544628 1610278 1678980 1751357 1829881 1917329 2015270 2124509
60987 2124509 2245864 2379680 2525513 2683249 2854256 3041462 3249778 3487484 3766510
60978 3766510 4101048 4507351 5005558 5619525 6373302 7290261 8399511 9743270 11374830
60969 11374830 13344795 15677760 18336685 21179477 23941224 26288440 27946479 28826532
60961 28826532 29060177 28922039 28709802 28658403 28897058 29413522 30026096 30416343 30251120
60952 30251120 29334110 27682471 25484165 22989587 20422578 17946228 15663275 13624679
60944 13624679 11841607 10302539 8987905 7875133 6938650 6152420 5493727 4942851 4480183
60935 4480183 4086409 3745741 3447172 3182622 2945607 2731876 2539342 2366240 2210022
60926 2210022 2068431 1940628 1826542 1725564 1636220 1556562 1484418 1417613 1354319 1293242
60916 1293242 1233704 1175977 1121296 1070864 1024723 982125 942829 907302 875647 847251 821732
60905 821732 799386 780275 763552 748224 734111 721595 710838 701627 693652 686615 680388 675314
60893 675314 671955 670364 669997 670538 672238 675190 678901 683018 687914 694028 701047 708151 714659 720027 723711
60878 723711 725561 725930 724938 722104 717252 711253 705188 699106 692354 684771 676846 668917 660977 653131 645556
60863 645556 638093 630544 623350 617382 613047 610071 608122 607135 607117 608087 610156 613296 617213 621839 627666
60848 627666 635110 643911 653713 664823 677708 692037 707001 722309 738096 754168 770255 786645
60836 786645 803439 819400 832800 843438 852606 860918 867598 872291 876234 880852 886165 891324 895776
60823 895776 899152 900867 900755 899557 898050 896172 893659 890871 888128 884746 879644 872682 864632 856034
60809 856034 846788 836718 825860 814282 802167 789979 778079 766298 754319 742356 731051 720847
60797 720847 711907 704418 698479 693784 689912 686909 685155 684759 685466 687146 689918 693749 698351 703698 710448
60782 710448 719591 731563 745724 760837 776151 791861 808368 825380 842122 858214 873748 888606
60770 888606 902447 915457 928341 941259 953420 964077 973316 981509 988568 994204 998373 1001042 1002004
60757 1002004 1001440 1000244 999296 998755 998383 997997 997228 995474 992709 989866 987834 986532 985471 984620 984031 983185
60741 983185 981482 978952 975697 971162 964927 957814 951160 945171 938941 931995 924795 917738 910612 903266
60727 903266 896021 889324 883617 879539 877520 877139 877628 879043 882106 886800 891972 896579 900529 904014 906805
60712 906805 908602 909438 909240 907556 904191 899737 894983 890150 885012 879519 873925 868555 863760 859947 857398
60697 857398 856128 855953 856490 857128 857285 856727 855337 852696 848312 842332 835432 827864 819078 808537 796535
60682 796535 783900 771235 758702 746349 734340 722976 712574 703198 694506 686133 678313 671851
60670 671851 667438 665204 664919 666242 668647 671508 674570 678165 682762 688358 694377 700055 704925 708991
60656 708991 712480 715351 717243 717986 717952 717686 717508 717787 719242 722381 726760 731341 735505 739237 742486 745027
60640 745027 747005 748963 751176 753467 755828 758717 762525 767227 772691 778886 785688 793005 801272 811225
60626 811225 822901 835369 847863 860711 874743 890155 906359 922601 938199 952378 964442
60615 964442 974200 981952 988006 992377 994914 995476 993979 990404 984896 977922 970302 962942 956403 950790
60601 950790 946034 942008 938181 933577 927488 920086 911932 903105 893332 882802 872295 862562 854054 847171
60587 847171 842121 838516 835730 833742 833004 833396 833987 833993 833308 831883 829382 825844 822071 818833 816131 813732
60571 813732 812023 811809 813509 816851 821111 825391 829125 832696 837168 842960 849100 854165 857705 860276
60557 860276 862399 863964 864524 863697 861298 857470 852752 847867 843420 839816 837216 835466 834353 834092 835286
60542 835286 838287 842928 849063 857066 867584 881234 898797 921232 949004 981622 1018141 1057734
60530 1057734 1099232 1140316 1177711 1208318 1230030 1241773 1243272 1234874 1217468 1192676 1163159 1132291
60518 1132291 1103018 1077068 1055315 1038446 1026843 1020171 1017681 1018865 1023404 1030629 1039498 1049094 1058758
60505 1058758 1067876 1076075 1083729 1091847 1101281 1112307 1125071 1140180 1158740 1182055 1211385 1247777
60493 1247777 1291953 1344394 1405648 1476475 1557729 1650093 1753979 1869707 1997976 2140426
60483 2140426 2299931 2480512 2686947 2924080 3195712 3503225 3844191 4210855 4588567
60474 4588567 4955446 5284875 5550398 5730318 5810056 5782985 5651321 5426673 5128658 4781199
60464 4781199 4408127 4029912 3662176 3315706 2997208 2710032 2454678 2229576 2032305
60455 2032305 1860515 1711937 1583899 1473325 1377334 1293720 1220915 1157668 1102857 1055465
60445 1055465 1014519 978903 947236 918197 891187 866442 844228 824017 804843 786357 768995
60434 768995 753006 737857 722877 708163 694502 682647 672880 665013 658505 652768 647581 643084 639277
60421 639277 635850 632752 630591 630046 631004 632594 634083 635462 637111 639124 641116 642750 644290 646366 649058
60406 649058 651565 653134 654104 655573 658189 661762 665912 670371 674690 678423 681851 685838 690734 696131
60392 696131 701936 708843 717181 725977 733866 740380 745717 749806 752410 753809 754548 754615 753533 751208 748065
60377 748065 744431 740292 735602 730411 724811 719193 714336 710735 707961 705215 702386 700125 698981 698983 699947
60362 699947 701598 703423 704994 706508 708614 711610 715183 718891 722523 725970 729233 732600 736496 741124
60348 741124 746508 752753 759873 767422 774746 781658 788493 795530 802745 810102 817650 825194 832168 838001
60334 838001 842506 846001 849148 852471 855826 858650 861098 864558 870508 879002 888826 898917 908949 918595
60320 918595 927020 933342 937074 937953 935816 930862 923632 914581 904090 892963 882411 873211 865205 857858
60306 857858 851062 845209 840721 837656 835590 833891 832373 831701 832741 835510 839165 843130 847728 853495
60292 853495 860372 867912 875868 884158 892510 900531 907998 914683 920027 923393 924693 924529 923641 922348 920576
60277 920576 918280 915775 913664 912494 912430 913261 914685 916561 918945 921964 925733 930417 936377 944135 954011
60262 954011 965813 979096 993845 1010678 1030227 1052490 1076940 1103087 1130847 1160639 1193461
60251 1193461 1230668 1273297 1321584 1375348 1434795 1500683 1573791 1654495 1742901 1839128 1943351
60240 1943351 2055563 2175183 2300762 2430197 2561350 2692334 2821073 2944802 3060344
60231 3060344 3164892 3256514 3334189 3397644 3447005 3482239 3502843 3508179 3498139 3473664 3436891
60220 3436891 3390817 3338414 3281888 3223116 3164789 3110410 3062829 3023316 2992517 2971702 2962437
60209 2962437 2965576 2981433 3010635 3053938 3111351 3182320 3266726 3364822 3475918 3597758 3727290
60198 3727290 3861390 3996670 4129377 4255948 4373301 4478343 4567768 4638840 4690130 4721152
60188 4721152 4731548 4720976 4689637 4638617 4569807 4485784 4389829 4285797 4177660 4069013 3963021
60177 3963021 3862895 3772124 3693697 3629053 3578391 3542240 3522146 3519471 3534149 3565322 3612617
60166 3612617 3675750 3752927 3840450 3933974 4029571 4123692 4212911 4294066 4364285 4420933 4462083
60155 4462083 4487070 4496184 4490019 4469719 4437702 4397263 4351330 4302310 4253218 4208120 4171083 4145174
60143 4145174 4132578 4134949 4153371 4188689 4242377 4316663 4413548 4534196 4679580 4851123 5050271
60132 5050271 5277799 5533941 5818876 6132645 6474603 6843031 7234839 7645470 8069253
60123 8069253 8499802 8929707 9350008 9750901 10123549 10461056 10757696 11007790 11205658
60114 11205658 11346267 11425727 11441625 11393277 11281567 11108679 10878583 10597923 10275892 9922990
60104 9922990 9550116 9168411 8788593 8419596 8068267 7740636 7442719 7179520 6953871
60095 6953871 6766905 6619215 6510963 6441324 6408582 6410641 6444945 6508104 6596057 6704331 6827644
60084 6827644 6959414 7092225 7218862 7332816 7428335 7500748 7546950 7565450 7556070 7519749 7458301
60073 7458301 7373794 7268055 7142754 6999752 6841253 6669893 6488831 6301456 6110817 5919601
60063 5919601 5730628 5546799 5370319 5202537 5044974 4900072 4770511 4658153 4563955 4488536
60053 4488536 4432346 4395725 4379342 4384290 4411278 4459933 4529214 4618111 4725387 4848847 4985333
60042 4985333 5131088 5281627 5431520 5575094 5707427 5824385 5921998 5996553 6045329 6066801
60032 6066801 6060130 6024995 5962087 5873383 5761791 5630768 5484317 5326996 5163621 4998860
60022 4998860 4836931 4681498 4535724 4402322 4283319 4179751 4091910 4020090 3964973 3927362
60012 3927362 3907968 3907548 3926799 3965911 4024795 4104055 4205165 4329127 4475250 4641520 4825493
60001 4825493 5023997 5232264 5444127 5653097 5852887 6037419 6201305 6340502 6452021
59992 6452021 6533160 6581776 6597277 6580515 6532568 6454418 6348197 6218055 6069294 5907109
59982 5907109 5736631 5563531 5393608 5231656 5081211 4945312 4826734 4727264 4647352 4587107
59972 4587107 4547342 4529065 4532076 4554857 4596049 4655339 4732393 4825402 4931308 5047112 5170193
59961 5170193 5297493 5425207 5549470 5666822 5774107 5868795 5949778 6017194 6071212 6111625
59951 6111625 6138924 6155050 6162553 6163702 6161149 6159077 6162881 6177789 6208177 6257899 6330691 6430414
59939 6430414 6561380 6728184 6934654 7182900 7473599 7806791 8181644 8595296 9042103
59930 9042103 9513703 9999149 10484797 10954435 11389833 11771705 12081350 12302952 12425532
59921 12425532 12443743 12357902 12173962 11903026 11559917 11161381 10724815 10267201 9803808 9347308
59911 9347308 8907996 8494297 8112559 7766696 7458763 7189968 6960931 6771458 6620911
59902 6620911 6508960 6435593 6400447 6402639 6441235 6515353 6623574 6763452 6931527 7123347
59892 7123347 7333214 7553925 7776644 7990940 8185326 8348522 8470695 8543924 8562225 8521971
59882 8521971 8422577 8266679 8059709 7809314 7524770 7216145 6893400 6565680 6240793 5924872
59872 5924872 5622619 5337912 5073954 4832779 4615055 4420603 4248842 4098719 3968855
59863 3968855 3858061 3765095 3687516 3621403 3562891 3509590 3460039 3412412 3364717 3315997 3266614
59852 3266614 3217497 3169806 3125063 3084819 3050125 3021772 3000712 2987344 2980368 2976988 2974278 2969874
59840 2969874 2961623 2947523 2926292 2897456 2860908 2817045 2767415 2714582 2661051 2608730 2559366
59829 2559366 2514734 2476002 2443321 2416458 2395695 2382021 2376583 2379943 2391716 2411027 2437599 2472150
59817 2472150 2515407 2566906 2625035 2687979 2754232 2822592 2892366 2963421 3035444 3107212 3176905
59806 3176905 3242645 3301997 3351475 3387774 3409759 3418624 3416329 3404904 3387237 3367149 3347996 3331784
59794 3331784 3319984 3314430 3316979 3328985 3351665 3386556 3435245 3499227 3580459 3681663 3805703
59783 3805703 3955189 4133054 4342984 4588665 4872817 5197159 5562402 5966690 6402912
59774 6402912 6856750 7306436 7724009 8078167 8339156 8485059 8507073 8411115 8214939 7942701
59764 7942701 7620035 7271181 6917297 6574868 6254844 5963554 5704563 5479658 5288751
59755 5288751 5130051 5000954 4898766 4820999 4765795 4732278 4719959 4727639 4753368 4795579 4853831
59744 4853831 4928370 5019540 5127807 5253764 5397768 5559899 5740571 5941017 6163166 6409474
59734 6409474 6682825 6986031 7321162 7689801 8094121 8537247 9022196 9550577 10122118
59725 10122118 10734578 11383496 12062104 12761628 13471377 14178695 14869756 15531579 16154124
59716 16154124 16731621 17263471 17754830 18215940 18659988 19100984 19552901 20029244 20541540
59707 20541540 21096947 21696566 22335310 23002744 23683884 24359672 25007702 25603834 26124594
59698 26124594 26549455 26862533 27054119 27122221 27073092 26919996 26681140 26378127 26034622 25674378
59688 25674378 25319313 24989035 24701351 24472113 24314402 24238633 24253814 24368431 24590248 24926006
59678 24926006 25381466 25960927 26665948 27494186 28438586 29486011 30615272 31795754 32987301
59669 32987301 34140819 35199858 36104336 36796452 37227108 37361687 37184950 36703861 35946390
59660 35946390 34956405 33787459 32497569 31144579 29781396 28452216 27190810 26020200
59652 26020200 24952584 23989276 23120790 22327035 21578627 20841106 20081978 19277779 18418219
59643 18418219 17506684 16557700 15592271 14632710 13699010 12807271 11968994 11190638 10474287
59634 10474287 9819475 9224556 8686743 8202069 7766200 7375243 7025524 6713140 6434267
59625 6434267 6185718 5964840 5769158 5596465 5445118 5313918 5201677 5106857 5027298 4960226
59615 4960226 4902689 4851995 4805519 4760429 4714196 4665224 4612281 4553432 4486534 4410925 4327753
59604 4327753 4238365 4143345 4043640 3941630 3840197 3741249 3645841 3555271 3471177 3394713 3326248
59593 3326248 3265765 3213165 3168391 3131669 3103453 3083751 3071725 3066279 3066850 3073323 3085428 3102562
59581 3102562 3123993 3148883 3176190 3204778 3233559 3261588 3288304 3313809 3338641 3363286 3388206
59570 3388206 3414322 3443012 3475583 3513215 3557330 3609397 3670259 3740288 3820284 3911531 4014818
59559 4014818 4130213 4258147 4400077 4557717 4732265 4924680 5135909 5366273 5615163
59550 5615163 5881774 6165484 6464890 6776881 7097184 7421442 7745384 8064541 8374464
59541 8374464 8671085 8950700 9210162 9447678 9663267 9858127 10033573 10190157 10327010
59532 10327010 10442103 10534463 10606985 10666655 10721777 10779559 10846256 10927726 11028119 11148139
59522 11148139 11285173 11434402 11588762 11738263 11870583 11972815 12032847 12040110 11986480 11867095
59512 11867095 11680469 11428287 11115423 10749635 10340583 9898976 9436192 8963542 8491093
59503 8491093 8027348 7579919 7155450 6758382 6390671 6053268 5747185 5472764 5228907
59494 5228907 5013840 4825925 4663217 4523232 4404011 4304649 4224102 4160585 4113126 4082656
59484 4082656 4070216 4074885 4094807 4129623 4180454 4247999 4332241 4433858 4554479 4695422 4857180
59473 4857180 5040057 5244169 5468738 5712237 5973115 6249326 6536967 6829936 7120538
59464 7120538 7399524 7656043 7879079 8059484 8190268 8265601 8281091 8235424 8130907 7972285
59454 7972285 7765823 7519381 7242057 6942976 6630488 6312182 5994700 5683384 5382680
59445 5382680 5096761 4828978 4580727 4351633 4140913 3948007 3772102 3612063 3467115
59436 3467115 3337017 3221460 3119643 3030258 2951442 2881168 2818374 2763474 2717044 2678429 2646409
59425 2646409 2620707 2601758 2589272 2582188 2579905 2582399 2589097 2598744 2610571 2624804 2642002 2662760
59413 2662760 2688014 2718708 2754970 2796148 2841147 2887728 2932090 2970935 3004360 3035687 3068529
59402 3068529 3105348 3148800 3202560 3269818 3351957 3449190 3561233 3686551 3822193 3965779
59392 3965779 4117761 4281640 4462790 4667417 4901548 5169892 5475609 5821321 6209653
59383 6209653 6642517 7120404 7642575 8206869 8808419 9438704 10086148 10737310 11377734
59374 11377734 11993194 12571661 13104673 13587125 14016505 14392676 14717687 14994975 15228445
59365 15228445 15421821 15577809 15697134 15778351 15818494 15813619 15759214 15651347 15488254 15270895
59355 15270895 15002564 14689116 14339693 13966016 13579895 13191083 12806594 12430321 12062364
59346 12062364 11699457 11337053 10971186 10598791 10217531 9826336 9426016 9019227 8610191
59337 8610191 8204353 7807343 7423671 7056617 6709266 6384747 6085171 5811072 5562275
59328 5562275 5338603 5139373 4962954 4807493 4671688 4554558 4455002 4372001 4304801 4252547
59318 4252547 4214147 4188776 4176062 4175591 4186734 4209170 4242965 4287835 4342807 4406785 4478760 4557118
59306 4557118 4639344 4722743 4804951 4883555 4955925 5019951 5074502 5118816 5151935 5173144 5182548
59295 5182548 5180966 5169662 5150504 5126007 5098995 5072443 5049450 5032677 5023762 5024012 5035691 5061766
59283 5061766 5104119 5162830 5237407 5327827 5433964 5554926 5689470 5836234 5992831 6155232
59273 6155232 6318560 6477946 6628338 6764426 6881698 6977307 7049475 7096600 7117413 7111495
59263 7111495 7079186 7021674 6942023 6845856 6740323 6632234 6526939 6428050 6337355 6255171 6181255
59252 6181255 6115283 6056438 6003033 5952898 5903860 5853941 5801864 5747805 5693120 5639143 5586886
59241 5586886 5538172 5496145 5464061 5444165 5438351 5449375 5480815 5536262 5619123 5732805 5880483
59230 5880483 6064837 6288223 6552579 6858479 7204228 7585716 7996457 8427252 8866054
59221 8866054 9298381 9707792 10076499 10387001 10624223 10776494 10835232 10795270 10656228 10423019
59211 10423019 10104793 9714105 9266977 8781779 8276227 7765033 7260195 6772007 6308599
59202 6308599 5875042 5473948 5106698 4773545 4473146 4203094 3961051 3745129 3553548
59193 3553548 3384391 3235418 3103877 2987018 2883165 2791718 2711774 2641374 2578540 2522367
59183 2522367 2472529 2428391 2389268 2355001 2325618 2300821 2280269 2263908 2251627 2243183 2238869 2239527
59171 2239527 2245397 2255651 2269655 2287923 2311137 2338968 2370749 2406673 2447438 2493141 2543379
59160 2543379 2598103 2657574 2721806 2790764 2864838 2944481 3029486 3119103 3212522 3308828 3406868
59149 3406868 3505524 3603613 3699178 3789538 3872521 3946981 4011686 4064585 4103881 4129133 4140644
59138 4140644 4138686 4124199 4099450 4066920 4028159 3984674 3939183 3894711 3852941 3814750 3782068
59127 3782068 3757946 3744810 3743735 3755376 3780542 3819754 3873225 3941590 4026065 4127746 4247249
59116 4247249 4384961 4541085 4715439 4907721 5117940 5346178 5591928 5853795 6129314
59107 6129314 6414415 6703110 6987859 7259853 7508840 7723801 7895055 8016083 8083480 8096213
59097 8096213 8055757 7966364 7834156 7665838 7468355 7248788 7013422 6766941 6512880 6254367
59087 6254367 5993963 5733496 5474855 5220458 4972347 4731454 4498506 4274943 4062105
59078 4062105 3860133 3668651 3488044 3319073 3161672 3015101 2878921 2752929 2636433
59069 2636433 2528510 2428753 2337023 2252787 2175383 2104510 2039773 1980284 1925400 1875273 1829822
59058 1829822 1787836 1747983 1710032 1674148 1639730 1606106 1573656 1542981 1513488 1484116 1454919
59047 1454919 1426599 1398956 1371301 1344042 1318346 1294447 1271805 1250790 1232582 1217344 1204079
59036 1204079 1192464 1183298 1176836 1172171 1168876 1167931 1170300 1175519 1182399 1190335 1199335 1209359 1220132
59023 1220132 1231165 1241691 1250929 1258611 1264886 1269802 1273351 1275899 1277925 1279445 1280307 1280993 1282540 1285694
59009 1285694 1290606 1297196 1305303 1314701 1325364 1337357 1350036 1362025 1372566 1382240 1391640 1400222 1407392
58996 1407392 1413778 1420126 1425806 1429937 1433412 1438128 1444528 1451521 1458596 1466350 1475057 1484354 1494368 1505533
58982 1505533 1517195 1528062 1538231 1549181 1561483 1574211 1587004 1600938 1616640 1633164 1649785
58971 1649785 1667598 1688218 1711838 1737603 1765184 1794998 1827265 1861620 1897421 1934019 1971010
58960 1971010 2008425 2046346 2084338 2121792 2158849 2196329 2234735 2274006 2314293 2356287 2400723
58949 2400723 2448263 2499847 2556504 2618767 2686873 2761335 2842660 2930782 3025651 3128103 3239260
58938 3239260 3359442 3488720 3628193 3779503 3943357 4119940 4310710 4518401 4745154
58929 4745154 4992008 5260416 5553029 5872790 6222484 6605400 7025309 7485463 7988544
58920 7988544 8537482 9135049 9782539 10479769 11225916 12018435 12850691 13711797 14588471
58911 14588471 15464991 16320765 17129844 17864098 18496534 19002431 19360587 19556086 19582206
58902 19582206 19439951 19137444 18690356 18120938 17454477 16715980 15929140 15115853 14294871
58893 14294871 13481334 12688037 11926056 11203361 10523914 9889144 9299868 8756402 8257872
58884 8257872 7802257 7386672 7007352 6660226 6342035 6050279 5782013 5533792 5303116
58875 5303116 5088896 4890181 4705506 4533831 4374929 4228321 4092789 3967369 3851865
58866 3851865 3746046 3649308 3561302 3481759 3409543 3343225 3282803 3229492 3183493 3143448 3108443
58855 3108443 3078929 3055250 3036959 3024316 3018672 3020375 3027823 3039664 3056634 3080240 3110955 3148675
58843 3148675 3193640 3245815 3304473 3369431 3441604 3521560 3608725 3702917 3805335 3917086 4038113
58832 4038113 4168698 4310783 4466551 4636781 4821697 5022423 5240508 5477173 5734327
58823 5734327 6015454 6324447 6664441 7038567 7450612 7903888 8400594 8943235 9535102
58814 9535102 10177880 10869837 11607427 12386791 13201372 14038624 14880538 15706408 16493343
58805 16493343 17215240 17844132 18353748 18721940 18931705 18973021 18844939 18555407 18119268
58796 18119268 17556757 16892380 16152436 15361994 14543511 13716734 12898164 12100446 11332995
58787 11332995 10602933 9914932 9270989 8671408 8115836 7603027 7130583 6695882 6296744
58778 6296744 5930713 5594714 5286227 5003711 4744992 4506367 4284382 4077386 3884193
58769 3884193 3702534 3530443 3368269 3217536 3078310 2949168 2829262 2718825 2617833
58760 2617833 2525464 2440798 2363117 2291867 2227177 2169889 2120116 2076277 2036458 2000071 1967290
58749 1967290 1937729 1910803 1886658 1865438 1846219 1827796 1809924 1792698 1775450 1757510 1739368
58738 1739368 1721791 1704406 1686420 1668169 1650649 1633956 1617432 1600883 1584459 1567792 1550443
58727 1550443 1532728 1515007 1496612 1476534 1454582 1430903 1405119 1377128 1348053 1319155 1290448
58716 1290448 1261585 1233283 1206517 1181040 1156186 1132490 1111017 1091654 1073516 1056496 1040904
58705 1040904 1026178 1011563 997676 985842 976197 967838 960447 954200 948421 941961 934856 928222 922564
58692 922564 917400 912459 908089 904679 902644 902545 904115 905632 905306 902819 898579 892415 884350 875745 868059
58677 868059 861134 854194 847781 843013 839643 836698 834428 833695 833835 833130 831247 829428 828481 828414 829820 833651
58661 833651 839412 845209 849700 852662 853951 853584 852699 852694 853419 853780 853969 855410 858626 863001 868634 876535
58645 876535 886721 897879 909294 921595 935410 950755 968035 988149 1011358 1037362 1066588
58634 1066588 1099945 1137182 1177056 1219441 1265907 1317945 1375984 1440420 1512309 1592725 1682656
58623 1682656 1783833 1898590 2028686 2175114 2338885 2520822 2720749 2938095 3173001
58614 3173001 3425178 3691303 3964477 4235990 4496252 4734335 4938557 5098493 5206081
58605 5206081 5255619 5244683 5175644 5055281 4892670 4697847 4481502 4253900 4023357 3796173
58595 3796173 3577430 3370719 3177572 2998459 2833989 2684214 2547695 2422844 2309557
58586 2309557 2208090 2117195 2035145 1961805 1897677 1841548 1791241 1746246 1707377 1674075 1644199
58575 1644199 1616345 1590327 1565511 1540815 1516184 1491998 1467133 1439791 1410197 1380331 1351073
58564 1351073 1321821 1292843 1265531 1240056 1215076 1190126 1166135 1143205 1120095 1096450 1073584
58553 1073584 1052630 1033760 1017398 1004207 993516 983722 974500 966757 960314 953797 947001 941151 936549
58540 936549 932150 927769 924506 922613 921128 919908 919793 920384 920019 918428 917115 916556 915276 912178 907469
58525 907469 900750 890656 877163 862047 846370 829660 812156 795493 780500 766555 753728 743193
58513 743193 734810 726730 718192 710423 704089 698374 693303 690333 689587 689097 687880 687267 688043 688809 688535 688338
58497 688338 689332 690955 692766 695596 699503 702749 704314 705368 706938 708203 708476 708773 709962 711298 712217
58482 712217 713605 715942 718117 719480 721169 724091 727434 730499 734126 739066 744787 751030 758566 767208
58468 767208 775101 781227 786680 792347 797428 801353 804902 808057 809026 806831 802756 797905 791542 783212
58454 783212 774186 765224 755217 743669 732299 722508 713420 704129 695701 689114 683318 677194 671536
58441 671536 667280 663726 660227 657734 656922 656687 656152 656232 657534 658762 658967 659392 661224 663401 664467 664841
58425 664841 665537 666429 667486 669931 674501 680214 686242 693182 701238 709264 716951 725719 736078 746461
58411 746461 756121 766615 778803 790968 801703 812054 822841 832446 839349 844400 848456 850255 848834
58398 848834 845737 842654 839098 834423 829751 825904 821891 817476 814603 814193 814267 813411 813230 814992 816834
58383 816834 817006 816996 818520 820230 820486 820795 823261 826997 830279 834073 840250 848273 856629 865611 875858
58368 875858 886135 895273 904226 913682 921982 928110 934168 942027 950018 955927 960647 965709 969846 971491
58354 971491 972348 974969 978802 981836 984109 986516 988415 989486 991542 995449 998836 1000037 1001493 1005808
58340 1005808 1011301 1015307 1019112 1025509 1033851 1041678 1049103 1057694 1067054 1076350 1087134 1100898 1115908
58327 1115908 1129982 1144122 1159817 1175385 1188733 1201131 1214362 1226809 1236461 1245058 1255152 1265728
58315 1265728 1274902 1284152 1295558 1307696 1318651 1330224 1344533 1359460 1372210 1384407 1398799 1413943
58303 1413943 1427330 1440760 1457221 1475306 1492148 1509016 1528458 1548747 1567010 1585053 1606206
58292 1606206 1629079 1650535 1672104 1697159 1724212 1749452 1773601 1799907 1827594 1853754 1879508
58281 1879508 1907832 1937411 1965146 1992680 2023975 2058510 2093282 2129234 2169126 2211307 2252208
58270 2252208 2292725 2335660 2379506 2421518 2464092 2511126 2560964 2610047 2660349 2715664 2773882
58259 2773882 2830901 2888901 2952479 3019893 3086647 3154532 3228297 3306695 3385869 3468113 3557780
58248 3557780 3651947 3745071 3839512 3941322 4049129 4157797 4269576 4390539 4519352 4650979
58238 4650979 4788041 4936763 5095234 5257939 5428294 5613894 5813094 6019756 6237462
58229 6237462 6474815 6730286 6996585 7276554 7579377 7904694 8246588 8609791 9005053
58220 9005053 9432143 9885134 10370859 10903617 11485404 12111031 12788811 13535462 14354957
58211 14354957 15245170 16221549 17310626 18524845 19870156 21374737 23083109 25027595
58203 25027595 27237695 29775552 32732238 36198035 40278596 45143212 51027084 58203134
58195 58203134 67003942 77859604 91247420 107609057 127402785 151252701 179930238
58188 179930238 214033915 253482876 296919896 341105800 380781624 409730184 423004294
58181 423004294 418990405 399787264 369786533 333768148 295731083 258570838 224108289
58174 224108289 193229010 166164909 142818629 122938986 106158992 92049365 80207683
58167 80207683 70288675 61977453 54990919 49108465 44166445 40024507 36563361 33705381
58159 33705381 31407379 29636442 28370547 27608872 27359450 27630305 28454279 29906692 32066799
58150 32066799 34943192 38396659 42059417 45302942 47380519 47748850 46333543 43501230
58142 43501230 39797097 35712551 31615972 27761230 24286011 21226370 18570656 16299580
58134 16299580 14380660 12761434 11391416 10237268 9268434 8447180 7743432 7143105 6632455
58125 6632455 6188854 5794704 5445653 5137082 4855551 4590543 4342064 4110270 3889515
58116 3889515 3678411 3483865 3309278 3149392 3001427 2870108 2756856 2654975 2560303 2475877
58106 2475877 2401205 2327593 2249467 2170651 2094603 2018120 1939701 1864765 1797067 1733240 1670697
58095 1670697 1612886 1562103 1514796 1468474 1425836 1388028 1351195 1313736 1279728 1251246 1224347
58084 1224347 1196369 1170125 1147110 1123659 1097805 1073211 1052329 1032159 1010546 990316 973234
58073 973234 956051 936512 917509 901513 886459 870720 856676 845842 835716 824817 815692 809772
58061 809772 804348 797629 791722 787745 783151 776637 770411 764902 756789 745217 734443 727145 720497 712138
58047 712138 704547 699947 696074 690853 686448 684843 683939 681742 680077 680549 681072 680046 679857 682642 686417
58032 686417 688866 691071 694057 695545 693804 691166 690140 689246 686116 681587 677500 673410 668581 664296
58018 664296 661290 657734 652443 647161 643194 638928 633120 627329 622503 616557 608133 599508 592932 587194
58004 587194 580537 573843 568139 562046 554619 547799 543201 539373 534848 531028 529272 528039 525724 523548
57990 523548 522886 522549 521470 521287 523466 526530 528890 531731 536296 541007 544071 546379 549081 551008 551357
57975 551357 552234 555494 559409 561416 561847 562074 561337 558445 554448 550665 545986 538896 530275 521697 513078
57960 513078 504464 497765 494002 491068 486906 482568 479397 475733 469640 462697 457725 454631 451728 449339
57946 449339 448821 449499 449848 450464 452933 456872 460789 464601 468779 472320 474169 475254 476711 477527 476409
57931 476409 474373 472808 470613 465981 459629 453486 447485 440424 432782 425983 420021 414369 410119 408683
57917 408683 409454 411147 414207 419434 425503 430482 434682 439595 445182 450682 456792 464413 472407 479155
57903 479155 485149 491449 496874 499645 500821 503149 507131 510837 512922 513348 511919 508644 504853 501528
57889 501528 497334 490629 482478 475127 468593 461539 454560 449545 446317 442937 439036 435997 434006 431711
57875 431711 428870 426742 425741 425066 424739 425757 428154 431022 434529 439830 446905 454423 461810 469558 477480
57860 477480 484433 489796 493741 496231 497367 498330 500229 502304 502851 501525 499079 495455 490096 483673 477524
57845 477524 471626 464990 457733 450919 444650 438223 431985 427153 423933 421466 419393 417790 415854 412481
57831 412481 407979 403608 399682 395677 391840 388889 386390 383103 378736 373892 368671 362902 357287 352648
57817 352648 348419 343486 338082 333230 328882 324326 319942 316721 314457 312120 309603 307398 305131 302240
57803 302240 299597 298554 298897 299627 301106 304364 308782 312747 316314 321061 327588 335296 344339 355368
57789 355368 367307 377680 385398 391293 395885 398699 399961 400830 401589 401428 400260 398968 397651 395427
57775 395427 392172 388712 385098 380530 375224 370606 367309 364604 362109 360466 360016 360250 360787 361621 362398
57760 362398 362871 363932 366605 370152 372839 374451 376327 378964 381472 383523 386008 389544 393934 399262
57746 399262 405889 413274 420361 427236 434791 442810 450061 456267 462224 467954 472612 476365 480533 485714
57732 485714 491439 497749 505269 513638 521729 529572 538151 547226 555387 562597 570602 580352 590928 601457
57718 601457 612224 623399 634598 646268 659771 675482 692451 710382 730287 752770 777411
57707 777411 804296 834295 867349 902243 938650 977744 1020449 1066964 1118392 1176764 1242765
57696 1242765 1315472 1395201 1484705 1586695 1701952 1830838 1974881 2135844 2314742 2512615
57686 2512615 2730549 2967756 3220859 3485589 3757383 4029196 4290262 4528198 4731555
57677 4731555 4890494 4997707 5050744 5052846 5010982 4934399 4835261 4728086 4626292 4539433 4473250
57666 4473250 4429148 4400956 4373180 4325020 4237971 4102085 3918899 3700506 3464306 3226030
57656 3226030 2996444 2782849 2590576 2421856 2275468 2149301 2042298 1953249 1879726 1819688
57646 1819688 1772617 1737683 1712377 1694562 1684494 1683186 1690021 1703771 1724916 1755112 1795005 1844191
57634 1844191 1902887 1972234 2053415 2147624 2256405 2380942 2521434 2677967 2851245 3041429
57624 3041429 3246782 3463995 3688737 3914801 4133516 4335024 4509576 4647268 4738365 4775948
57614 4775948 4758280 4688138 4570914 4414224 4227814 4021722 3804313 3582416 3362225 3148804
57604 3148804 2945355 2753990 2576544 2413814 2264952 2128841 2005386 1894460 1794490 1703357
57594 1703357 1620149 1544963 1477574 1417331 1363706 1315889 1272451 1232404 1196066 1163958 1135472
57583 1135472 1109465 1085510 1063615 1043451 1024834 1008313 994308 982268 971461 961877 953564 945970
57571 945970 938911 933285 929746 927497 925527 924141 924123 925251 926992 929957 935235 942759 951605 961516 972956
57556 972956 986105 1000951 1017877 1036973 1057202 1077444 1098108 1120672 1145994 1174008 1204597
57545 1204597 1237713 1273096 1311069 1353342 1401976 1457783 1520668 1591165 1670719 1760758 1862300
57534 1862300 1976114 2102429 2240777 2390751 2552251 2724213 2903689 3086736 3269132
57525 3269132 3445010 3605698 3741399 3843888 3907078 3926603 3901002 3833300 3730007 3598523
57515 3598523 3446210 3280924 3110373 2940474 2775156 2617439 2469707 2333236 2208610
57506 2208610 2096410 1996602 1907793 1828366 1758022 1697109 1644878 1599714 1560759 1527996 1501008
57495 1501008 1479033 1462118 1450872 1445030 1443401 1445147 1450048 1457714 1467851 1481312 1499645 1523476
57483 1523476 1552332 1585997 1624929 1669437 1719652 1776463 1841408 1915554 1999461 2094247 2201529
57472 2201529 2322041 2455201 2600171 2756408 2922864 3097204 3275604 3452383 3619723
57463 3619723 3768682 3890836 3978908 4026690 4030013 3988407 3905395 3787218 3641596 3476932
57453 3476932 3301172 3120849 2941364 2767563 2603178 2450037 2308720 2179700 2063060
57444 2063060 1957792 1862611 1777248 1701838 1635489 1576684 1524753 1479580 1440062 1404385 1371876
57433 1371876 1343178 1318482 1296853 1277434 1260017 1244285 1229740 1216640 1205735 1196830 1188805 1181341
57421 1181341 1175341 1171272 1168298 1165562 1163179 1161418 1159955 1158636 1158097 1158959 1161005 1163692 1166813 1170303
57407 1170303 1174006 1178039 1182818 1188394 1194235 1199848 1205139 1210184 1215260 1221085 1228182 1236007 1243533 1250736
57393 1250736 1258571 1267396 1276492 1285411 1294683 1304723 1315024 1325034 1334988 1345217 1355332 1364770 1373732
57380 1373732 1382941 1392755 1402983 1413295 1423447 1433223 1442391 1450707 1458088 1465033 1472626 1481629 1491691
57367 1491691 1501907 1511996 1522393 1533417 1544987 1557022 1569455 1581959 1594342 1607083 1620782
57356 1620782 1635185 1649400 1662929 1675872 1688397 1700885 1714260 1729192 1745079 1760791 1776310
57345 1776310 1792603 1809926 1827402 1844361 1861054 1877877 1894880 1912223 1930149 1948279 1965884
57334 1965884 1983057 2000683 2019013 2037151 2054180 2070030 2085079 2099810 2115014 2131467 2149184
57323 2149184 2167743 2187307 2208339 2230337 2252063 2273247 2294944 2317853 2341390 2364799 2388100
57312 2388100 2411489 2434881 2458625 2483736 2510740 2538979 2567534 2596161 2624969 2653919 2683075
57301 2683075 2712662 2742623 2772791 2803658 2836079 2870034 2904697 2940020 2977105 3016556 3057507
57290 3057507 3098954 3141219 3185478 3232556 3282630 3335240 3389073 3442500 3494973 3547260 3599906
57279 3599906 3652156 3702768 3751038 3796450 3838033 3874689 3905639 3930321 3948556 3961070 3969080
57268 3969080 3973153 3973369 3970782 3967541 3965090 3963420 3962619 3963912 3968336 3975468 3984377 3994943 4007342 4021133
57254 4021133 4035862 4051839 4069384 4088041 4107475 4128471 4151955 4177566 4204207 4231540 4259949
57243 4259949 4289410 4319471 4350171 4382058 4415300 4449456 4484023 4518599 4552705 4586010 4618661
57232 4618661 4650999 4683116 4715002 4746800 4778639 4810515 4842631 4875388 4908829 4942631 4976892
57221 4976892 5012140 5048124 5083420 5116921 5149078 5180965 5212696 5243520 5272915 5300774 5326931
57210 5326931 5351426 5375066 5398936 5423440 5448364 5473745 5500189 5528466 5559193 5592724 5628880
57199 5628880 5666951 5706333 5747083 5789611 5834066 5880100 5926891 5973291 6018410 6062308 6105662
57188 6105662 6148630 6190593 6231206 6271057 6310979 6351299 6392022 6433062 6473932 6513942 6553166
57177 6553166 6592568 6632729 6673079 6712852 6752077 6791051 6829485 6866829 6902925 6937626 6970189
57166 6970189 6999696 7025760 7048263 7066628 7079852 7087128 7088195 7083323 7073132 7058085 7038182 7013669
57154 7013669 6985985 6957166 6928054 6897887 6865922 6832666 6799105 6765600 6732068 6698557 6665115
57143 6665115 6631750 6599075 6568371 6540504 6515201 6491637 6469065 6446476 6422414 6395683 6365852
57132 6365852 6332751 6296083 6255869 6212760 6167778 6122281 6078249 6037884 6002825 5974302 5953488
57121 5953488 5940352 5932242 5925025 5915879 5903737 5887123 5863577 5831980 5794050 5753024 5712337 5676133
57109 5676133 5649198 5635153 5635752 5652721 5689260 5749388 5837515 5959686 6124168 6340458 6619451
57098 6619451 6975490 7427032 7994849 8700982 9569191 10623339 11883236 13362107 15066349
57089 15066349 16993586 19129828 21451779 23933042 26545326 29254430 32021623 34810718
57081 34810718 37585116 40290544 42845416 45155601 47134690 48701163 49760691 50209708
57073 50209708 49970495 49026094 47425336 45264560 42668691 39777466 36729504 33645134
57065 33645134 30616972 27710422 24968452 22417149 20071834 17941362 16028158 14326726
57057 14326726 12824802 11506514 10354216 9348955 8471602 7704449 7031748 6439547 5915744
57048 5915744 5449964 5033032 4657073 4316125 4005645 3721189 3458510 3215032 2989892
57039 2989892 2782184 2590416 2413842 2252638 2106011 1971590 1847506 1733795 1630883
57030 1630883 1537975 1453905 1378406 1311373 1251685 1197835 1149096 1105192 1065373 1028656 994600
57019 994600 963314 935085 910293 889097 870909 854738 840190 827463 816413 806537 797995 791643
57007 791643 787972 787027 789512 796922 810487 831091 860303 900317 952941 1020085 1105382 1213884
56995 1213884 1349612 1513475 1700830 1896561 2072100 2192892 2234875 2196113 2093640 1951439
56985 1951439 1791431 1630573 1479917 1344169 1223459 1116242 1020505 933730 853801 780088
56975 780088 712794 651817 597265 550345 512278 482486 458962 440209 425865 415774 409528 406832
56963 406832 407598 411742 419444 431243 447374 467300 490147 514877 539453 560572 574977 580628
56951 580628 576456 562224 539614 512566 485278 460045 437433 417637 400697 386183 373882 364607
56939 364607 359488 358809 362147 369232 380069 394790 414012 438757 469183 503681 539379 572682
56927 572682 598913 612941 611853 596925 572307 542235 509902 477747 447308 419012 393012 369955
56915 369955 350297 333481 318694 305827 294888 285142 275876 267530 260983 256017 251492 246775 242179
56902 242179 238212 235126 232948 231340 229778 228442 228421 230470 234218 239303 246589 257300 271460 288151
56888 288151 306958 328346 352865 380550 410505 440261 465985 484235 493493 493946 486735 474057
56876 474057 458969 443947 430016 417775 408282 402109 398624 397469 399920 407497 419952 436100 456220
56863 456220 482300 516234 558876 610288 669133 731447 790862 840247 873163 885112 875209 846805
56851 846805 805685 757691 708141 661890 622103 589366 563273 544531 534344 532626 538624 553009
56839 553009 577673 613578 660505 719017 791013 877683 977418 1084926 1190573 1280762 1341655
56828 1341655 1364792 1349757 1302271 1230999 1145736 1055970 968934 888673 816997 754909 703128
56817 703128 662085 631858 611961 601480 600068 608589 628235 659387 702051 756683 822995 897484
56805 897484 972593 1038199 1083858 1101395 1087961 1047466 988176 918496 844988 772873 706104
56794 706104 646506 594271 549740 513793 486516 466785 453557 446691 446334 452509 465436 485394
56782 485394 512068 544645 582096 622040 659318 687091 700073 696473 677466 646229 607362 565529
56770 565529 523729 483317 445504 411699 382404 356990 334865 315873 299500 284860 271713
56759 271713 260453 250953 242476 234873 228788 224488 221441 219161 217363 215332 212397 209178 207097 206379
56745 206379 205746 204276 202321 200300 197972 195367 193223 191915 190980 190059 189258 188279 186392 183695 181234
56730 181234 179438 177560 175152 172910 171571 171003 170939 171451 172150 172006 170672 169071 168116 167678 167258 166729 165963
56713 165963 164758 163540 163186 163685 163960 163365 162304 161046 159177 156720 154569 153247 152342 151601 151365 151390
56697 151390 150643 149011 147835 147971 148634 149005 149606 151013 152534 153371 153961 154930 155737 155744 155720 156845 158784 160050
56679 160050 159935 158996 158024 157520 157796 158747 159755 160475 161273 162441 163623 164573 165645 166888 167522 167072 166193
56662 166193 165617 165213 164854 165166 166320 167085 166329 164687 163497 162838 162002 161233 161400 162249 162459 161395 159602
56645 159602 157609 155386 153050 151000 149160 146968 144282 141639 139498 137820 136411 135138 133813 132302
56631 132302 130756 129411 128263 127164 125988 124540 122707 120910 119858 119572 119301 118708 118423 119011 120155
56616 120155 121438 123111 125404 127776 129523 130559 131006 130783 130265 130516 131948 133468 133865 133438 133383 134198
56600 134198 135647 137693 140362 143066 145070 146387 147419 148141 148476 149006 150362 152253 153956 155388 156872
56585 156872 158230 159107 159862 161163 162920 164460 165562 166547 167562 168545 169668 171113 172682 174321 176659
56570 176659 180212 184342 187872 190479 192696 194800 196624 198405 200922 204663 209346 214353 219245 223944
56556 223944 228694 233731 238848 243584 247918 252198 256305 259670 262327 264915 267263 268111 266881 264657
56542 264657 262589 260385 257327 253722 250212 246570 242381 238106 234226 230123 225154 220172 216550 214226
56528 214226 212111 209979 208473 207562 206537 205440 205103 205700 206424 206676 206456 205592 203685 200990 198432 196572
56512 196572 195191 193832 192125 189840 187274 185414 184975 185569 186387 187214 188095 188661 188722 189025 190368 192377
56496 192377 194069 195177 195940 196104 195233 193686 192268 191308 190966 191864 194295 197289 199619 201386 203525 206220
56480 206220 208954 211676 214660 217613 220060 222322 225016 227972 230638 233014 235143 236426 236701 237224 239132
56465 239132 241617 243183 244054 245606 248024 250374 252551 255169 257776 259154 259374 259716 260627 261542 262622
56450 262622 264720 267561 269914 271683 273952 276713 278567 279080 279484 280552 281603 282210 283116 284747 286400
56435 286400 287567 288551 289155 288402 286247 284050 282555 280843 278049 274725 271647 268568 265098 261671 258735
56420 258735 255902 252643 248994 245108 241123 237863 236520 237036 237865 237822 237137 236300 235172 233847 233038 232819
56404 232819 232069 230032 227529 225845 225236 225152 225188 225255 225476 226361 228311 230764 232657 233936 235538 237673 239358
56387 239358 240067 240642 241972 243866 245873 248296 251733 256319 261868 268035 274049 279036 282891 286154 289043
56372 289043 291476 293898 296919 300102 302275 303111 303272 303150 302873 303453 306163 310508 314394 316688 318082
56357 318082 319168 319460 318898 318619 319407 320703 321834 322899 323883 324267 324135 324368 325280 326344 327615 329880
56341 329880 332983 335665 337649 340253 344340 349342 354897 361595 369244 376297 382133 388246 395965 404512
56327 404512 412521 420082 428068 436685 445898 456104 467250 478236 488155 497178 505604 513242 520282
56314 520282 527343 533914 538257 539637 539177 537828 535252 531542 528148 525868 523661 520619 517457 514791
56300 514791 511835 508333 506012 506330 508234 509919 511498 514200 518124 522654 528125 535356 544241 554246
56286 554246 565461 577848 590405 602485 615109 629684 646347 664765 685499 709126 734948
56275 734948 761945 790278 820754 853755 889877 930558 976766 1027957 1083513 1144334 1212024
56264 1212024 1287562 1371871 1466490 1572502 1689891 1819020 1961484 2118369 2289016 2472596
56254 2472596 2669333 2878607 3097206 3320913 3546543 3770849 3988710 4194014 4381387
56245 4381387 4545862 4682402 4787497 4860245 4900719 4908783 4886027 4837128 4767354 4679994 4577829
56234 4577829 4465432 4347762 4227694 4106852 3987400 3870706 3755426 3639374 3522469
56225 3522469 3405744 3288440 3168496 3045297 2919812 2792605 2663819 2534635 2406756
56216 2406756 2280866 2157349 2037902 1924615 1817920 1717068 1622002 1533142 1450055 1372143
56206 1372143 1300092 1235033 1176805 1124411 1077355 1035178 996689 961193 929432 901820 876902
56195 876902 853192 831269 812295 795775 780720 767741 757917 750670 744809 740606 738761 738382 738052
56182 738052 737983 739235 741888 745823 751954 760651 770295 779580 789793 802512 816465 829160 840219
56169 840219 850473 859138 864847 868383 871489 873779 873575 870976 867408 863009 857224 851208 846838 843969
56155 843969 841221 838751 837705 837802 838050 838969 841568 845167 848928 854423 863864 876865 891881 909703
56141 909703 932499 960587 993471 1033030 1082229 1141528 1210002 1289026 1381114 1485436 1597719
56130 1597719 1713768 1829616 1939328 2037111 2121927 2196787 2263846 2323548 2377671 2428656 2475448
56119 2475448 2513608 2540072 2554890 2558686 2552054 2537410 2517814 2493545 2462586 2424013 2377633 2321065
56107 2321065 2251339 2169615 2080953 1989593 1897888 1809233 1727745 1654670 1588585 1529112 1477017
56096 1477017 1431052 1388633 1349551 1315349 1285360 1257265 1231143 1208911 1190099 1172394 1156060
56085 1156060 1143456 1134480 1126880 1120770 1118173 1118332 1118257 1117887 1119878 1124390 1129078 1134145 1142110 1152399
56071 1152399 1161619 1169568 1179502 1191907 1203623 1213916 1225765 1240093 1254299 1267726 1283102 1301187
56059 1301187 1319269 1336320 1354460 1374079 1392720 1409990 1428373 1448127 1466810 1484833 1505793
56048 1505793 1530158 1554364 1577351 1602034 1629070 1655364 1680285 1707119 1736721 1766012 1794505
56037 1794505 1825998 1861796 1898604 1934998 1973642 2015209 2056691 2097716 2141860 2189672 2237267
56026 2237267 2283932 2334018 2389073 2445302 2501084 2559450 2620635 2680028 2736406 2794466 2856278
56015 2856278 2918143 2978929 3043283 3113224 3184893 3257171 3335020 3420536 3509202 3598946 3694244
56004 3694244 3797316 3904140 4013302 4129660 4255007 4384497 4516747 4657749 4810252
55995 4810252 4969359 5133406 5308715 5498569 5698363 5906910 6131049 6373404 6627515
55986 6627515 6891255 7172684 7476190 7795926 8130068 8488169 8876849 9292239 9734699
55977 9734699 10216427 10745819 11319563 11939414 12620848 13375448 14202015 15105913 16109403
55968 16109403 17231893 18480013 19870302 21441585 23232401 25270331 27600480 30302297
55960 30302297 33465149 37179644 41578733 46866234 53294970 61161311 70847266 82817348
55952 82817348 97532996 115425627 137019700 163031607 194209940 230912581 272537111
55945 272537111 316864821 359591560 394743836 416435081 421220744 409423210 384506279
55938 384506279 351228208 314028533 276334225 240473365 207764660 178724906 153396788
55931 153396788 131615363 113094478 97448216 84266124 73183930 63876517 56033825
55924 56033825 49386290 43731290 38907744 34766048 31182101 28073854 25377656 23023722
55916 23023722 20950656 19122962 17513941 16086618 14807377 13661942 12640995 11723510
55908 11723510 10888834 10131623 9450171 8831821 8263153 7743119 7273100 6844303 6446995
55899 6446995 6082256 5753004 5452508 5172519 4913952 4679167 4462085 4255830 4062227
55890 4062227 3884381 3717667 3557056 3405706 3267423 3137904 3012000 2892548 2783575
55881 2783575 2681620 2582088 2487596 2401824 2321399 2241942 2166184 2098163 2035060 1972474 1912357
55870 1912357 1858225 1807769 1757612 1710328 1669328 1631437 1591733 1551425 1514161 1478831 1442737
55859 1442737 1407853 1377418 1350234 1324563 1303704 1291444 1285663 1282376 1282281 1287176 1293463 1295289 1291059
55846 1291059 1281493 1264937 1240436 1212212 1185335 1159731 1133424 1108086 1085885 1064283 1039795
55835 1039795 1013972 990131 967089 941811 915564 891801 870295 848797 828222 810930 795933
55824 795933 780804 766231 753807 741569 726719 710712 696761 684388 671316 658729 649510 642908
55812 642908 635958 628794 623887 621308 619287 618271 620071 623998 627770 631063 634498 636623 635697 632920
55798 632920 630164 626180 618779 608953 598865 587604 573082 556510 540846 526221 510987 495791
55786 495791 482503 470443 457843 445809 436742 429999 423221 416893 413495 413019 413293 413761 414883 414630
55772 414630 409756 400259 388954 377109 364034 350431 338500 328848 320416 313048 307291 302373 297237
55759 297237 292697 289727 286835 282170 276852 272905 269338 263880 257307 252152 248203 243254 237531 233372
55745 233372 230951 228188 224509 221060 217588 212869 207923 205121 204222 202794 200388 198768 198201 197175 195816
55730 195816 195998 197844 199424 200028 200466 200061 196855 191187 185785 181808 177867 173306 169315 166247 162866
55715 162866 158920 155706 153490 151103 148642 147965 149794 152746 155854 159804 165183 171568 178736 186761
55701 186761 194712 201179 206120 210414 213917 216053 217778 220557 223804 225783 226540 227352 227790 226303 223422
55686 223422 221321 220187 218031 214243 210460 207722 205646 204675 206173 209798 213453 216271 219000 221264
55672 221264 221380 219434 217688 217177 216498 214691 212714 211295 209704 207587 205840 204965 204572 204943 206934 209932
55656 209932 212142 213261 214670 216696 218087 218501 219031 219721 219030 216355 212741 208573 202985 196084 189351
55641 189351 183134 176143 168062 160329 153647 147062 140154 133871 128528 123307 118327 114809 112554 109727
55627 109727 105794 102217 99563 96572 92921 90135 88696 86940 84033 81490 80380 79524 77934 76629
55613 76629 76484 76465 75629 74858 75043 75508 75683 76401 78005 79093 78742 78194 78686 79338 78831 77620 76834 76343
55595 76343 75532 74720 74349 73902 72871 71738 70961 70200 69447 69521 70442 70818 69868 68597 67988 67602 67003 66894
55577 66894 67591 67957 67136 65917 65175 64491 63533 63252 64313 65789 66790 67991 70172 72551 74027 74858
55561 74858 75775 76541 76662 76417 75984 74727 72507 70495 69516 68809 67534 66191 65383 64556 63249 62240 62053
55544 62053 61715 60455 59430 60235 62723 65698 68643 71391 73229 73878 74424 75824 77394 78112 78380 79046
55528 79046 79725 79691 79581 80522 82207 83251 83022 81842 79987 77662 75411 73414 71039 68029 65310 63582
55512 63582 62021 59471 56081 52651 49395 46553 45190 45896 47513 48576 49245 50415 51732 52075 51392
55497 51392 50513 49629 48418 47341 47370 48550 49967 50926 51283 51003 50322 49886 49807 49107 46986 44000 41058
55480 41058 38058 34547 31019 28226 25740 22434 18057 13368 9125 5856 4034 3503 3259 2717 2606
55465 2606 3676 5284 6370 7132 8532 10628 12577 13858 14448 14247 13373 12618 12658 13270 14083 15443 17553
55448 17553 19531 20404 20450 20451 20358 19873 19694 20750 22570 23737 23708 23103 22475 21905 21605 21868 22551 23408 24608
55429 24608 26184 27424 27672 27266 26880 26486 25800 25104 24673 24022 22784 21725 21818 22805 23677 24022 23920 23178
55411 23178 21865 21009 21528 22846 23675 23759 23773 24036 24440 25178 26291 26919 26221 24680 23429 22689 21960 21293
55393 21293 21099 21086 20613 19825 19301 18930 18317 17886 18283 18954 18661 17316 16071 15631 15628 15659 15807 16067 16181 16125
55373 16125 16022 15677 14915 14149 13938 14255 14823 15699 16816 17512 17382 17057 17330 18093 18944 20047 21378 22045
55355 22045 21571 21030 21531 22363 22132 21059 20466 20513 20245 19619 19650 20543 21295 21286 20979 20920 21257 22127 23349 23901
55335 23901 23031 21639 21181 21457 21002 19543 18445 18578 19313 19847 20123 20138 19686 19164 19547 21135 23156 24679
55317 24679 25188 24487 23022 22021 22214 22667 22105 20895 20324 20301 19549 17906 16640 16359 16371 16369 17033 18543
55299 18543 20129 21535 23502 26288 29088 31305 33006 33817 32973 31037 29973 30709 31976 32328 31998 31934
55283 31934 32195 32261 31964 31276 30009 28451 27471 27325 27114 26044 24464 23146 22358 22160 22767 23992 25008
55266 25008 25217 24845 24343 23857 23536 23642 24048 24318 24415 24639 24884 24880 25093 26266 28021 29158 29462 29864 30616
55247 30616 30792 30036 29264 28979 28424 27175 26114 25811 25326 23851 22390 22399 23580 24358 23992 23030 22081 21307
55229 21307 20908 21108 21671 22117 22333 22564 23043 23973 25504 27386 29064 30409 31804 33233 33968 33608 32790
55212 32790 32410 32660 33235 33835 34082 33639 32894 32842 33815 34930 35311 35153 35096 35279 35663 36569 38048 39228 39119
55193 39119 37821 36344 35443 35109 34975 34745 34372 34051 33852 33357 32152 30748 30334 31337 32845 33694 33518
55176 33518 32504 30907 29228 28160 27844 27692 27331 27120 27348 27549 27088 25926 24471 23189 22643 23240 24561
55159 24561 25561 25839 26109 27075 28501 29766 30634 31064 30917 30328 29751 29237 28315 26923 25749 25222 24993
55142 24993 24838 25236 26392 27516 27839 27724 27997 28758 29612 30531 31646 32528 32462 31370 29928 28906 28735
55125 28735 29453 30699 31976 33109 34210 35191 35827 36364 37413 39010 40432 41141 41212 40775 39848 38918 38688
55108 38688 38958 38751 37971 37802 38907 40338 41050 41457 42551 44323 46039 47427 48611 49441 49868 50489 51831
55091 51831 53436 54509 55090 55795 56717 57388 57620 57708 57916 58264 58689 59093 59482 60171 61420 62762 63398 63386
55073 63386 63514 63769 63076 61160 59477 59422 60478 61129 60780 59845 58687 57495 56605 55960 54838 53054 51788
55056 51788 52184 53610 54386 53821 52577 51440 50715 50495 50588 50428 49872 49650 50247 50882 50563 49611 49042 48887
55038 48887 48364 47417 46865 47037 47394 47535 47644 47918 48296 48776 49269 49286 48509 47501 47123 47448 47949 48483 49290
55019 49290 50299 51270 52351 53626 54419 54074 53176 52979 53694 54297 53976 52848 51341 49878 49094 49331 49848
55002 49848 49516 48456 48010 48938 50504 51589 51839 51483 50792 50109 49836 50027 50420 50901 51534 52153 52519 52798
54984 52798 53306 53798 53656 52807 51828 51166 50847 50911 51433 52113 52533 52861 53698 55228 57130 59292 61891 64743
54966 64743 67317 69497 71671 73971 76095 78075 80579 84201 88938 94503 100725 107500 114866 123251
54952 123251 133241 145032 158380 173082 189043 205808 222327 237186 248913 256401 259439 258653
54940 258653 254540 246877 235510 221321 205841 190258 175317 161698 149659 138695 128427 119497
54928 119497 112699 107560 102841 98276 94677 92406 90879 89686 89091 89205 89663 90425 91990 94516 97605
54913 97605 101239 106121 112744 120890 130334 141265 153634 166881 180723 195448 210866 225557 237680
54900 237680 246130 250573 250901 247128 239509 228464 214659 199341 184099 170001 157265 145839 135814
54887 135814 127095 119250 112004 105480 99699 94315 89104 84356 80454 77403 74974 73115 71945 71516
54873 71516 71728 72299 72849 73147 73179 72806 71636 69625 67492 66046 65279 64630 63877 63161 62393 61448 60776 60923
54855 60923 61450 61213 59831 58084 56709 55603 54501 53593 53049 52555 51789 50949 50469 50534 51066 51838 52513 52873
54837 52873 53016 52972 52301 50674 48724 47612 47738 48528 49429 50379 51264 51856 52372 53346 54721 55858 56559 57265
54819 57265 58098 58660 59036 59928 61443 62756 63541 64719 67086 70063 72705 75166 78227 81888 85445 88711
54803 88711 92280 96667 101965 108335 116200 125827 137099 149761 163623 178482 194027 209759 224936
54790 224936 238745 250569 259836 265601 266758 262941 254945 244118 231624 218401 205326 193022
54778 193022 181687 171367 162213 154310 147504 141570 136434 132173 128935 126801 125470 124237 122644 121049
54764 121049 120188 120292 121123 122691 125290 128925 133375 138869 146002 154891 165112 176613 189953 205398
54750 205398 222396 240125 257920 274951 290177 302901 312791 319107 320686 317094 309235 298461
54738 298461 285600 271161 255807 240154 224550 209456 195539 183063 171645 160960 151268 142917
54726 142917 135800 129597 124122 119160 114406 109870 105883 102520 99484 96726 94582 93096 91806 90488
54712 90488 89452 88842 88283 87581 87157 87361 87970 88667 89423 90042 90031 89341 88633 88377 88290 88087 88089 88615 89395 90153
54692 90153 91134 92498 93753 94364 94463 94445 94368 94217 94201 94318 94192 93835 93915 94808 96001 96991 98037 99395 100581
54673 100581 101224 101960 103559 105674 107401 108698 110368 112930 116293 120177 124051 127013 128591 129480 130766
54658 130766 132714 135001 137668 140865 143928 145851 146665 147435 148812 150449 151982 153727 156111 159010 162013
54643 162013 164961 168022 171549 175975 181600 188432 196386 205466 215499 225864 235774 244719 252404 258447
54629 258447 262316 263374 260962 254902 246044 235721 224451 211907 198504 186059 176131 168399 161513
54616 161513 154868 148698 143092 138041 134064 131623 130137 128637 127206 126716 127214 127701 127603 127481 128070 129512
54600 129512 131617 133989 135648 135416 133108 129706 126073 122127 117514 112469 107604 103308 99708 96849
54586 96849 94687 93144 92248 91860 91352 90064 88103 86197 84709 83390 82135 81280 80894 80334 78961 76939
54570 76939 75007 73716 73135 73022 73065 73023 72844 72584 72269 71956 71757 71558 70905 69512 67813 66613 66335 66951
54552 66951 68482 70956 73859 76235 77530 78012 78241 78454 78584 78541 78334 78093 77988 77993 77927 77995 79029 81677
54534 81677 85417 88910 91419 93474 96087 99739 104271 109318 114583 119825 124807 129287 133083 136160
54520 136160 138480 139707 139331 137297 134197 130598 126495 121705 116505 111428 106740 102516 98922 95949
54506 95949 93168 90268 87631 85769 84450 83059 81635 80814 80755 80887 80806 80728 80820 80724 80114 79345 79134 79739
54488 79739 80674 81242 81308 81516 82522 83994 84868 84827 84972 86513 89306 92374 95441 98952 102744 105771 107417
54471 107417 108279 109281 110523 111431 111658 111524 111659 112306 112910 112568 111086 109323 108129 107249 105778 103427
54455 103427 100806 98650 97356 97043 97392 97579 96986 95868 94732 93370 91351 89170 87773 86967 85472
54440 85472 82882 80489 79641 80167 81030 81796 82719 83795 84453 84071 82431 79909 77414 75868 75442 75519 75473
54423 75473 75151 74647 74113 73947 74598 75907 77117 77738 77949 77966 77653 77169 77458 79471 83045 86910 89722
54406 89722 90941 90992 90848 91324 92641 94667 97403 100854 104490 107429 109367 110890 112713 115003 117649
54391 117649 120705 124196 127724 130624 132457 133261 133414 133216 132520 130910 128460 126034 124369 123090 121202
54376 121202 118418 115370 112590 110043 107723 105869 104376 102801 101252 100564 101071 101807 101501 99964 98012
54361 98012 96355 95075 93983 92985 92092 91355 90815 90440 90224 90334 90986 92206 93914 96056 98336 100051
54345 100051 100747 100938 101542 102681 103788 104868 106764 109886 113531 116858 119862 122844 125523 127322 128198
54330 128198 128621 128947 129167 129062 128276 126481 123727 120434 116888 113066 109026 105058 101271 97522 93942
54315 93942 91062 89118 87627 85906 83621 80687 77203 73789 71353 70083 69140 67739 66046 64584 63345
54300 63345 62155 61436 61839 63209 64555 65064 64729 63987 63168 62364 61591 60984 60867 61485 62635 63788 64590
54283 64590 65053 65209 64973 64443 63918 63483 62946 62285 61773 61516 61363 61460 62339 64144 66227 67858 68991 70011
54265 70011 71065 71950 72344 71974 70911 69884 69765 70543 71321 71568 71732 72279 72778 72584 71878 71404 71487 71930
54247 71930 72578 73340 73792 73347 71854 69743 67667 66172 65471 65268 65023 64621 64545 65213 66499 68035 69559
54230 69559 70782 71471 71931 72777 73871 74140 72974 71200 70050 69744 69812 70230 71254 72435 72825 72212 71353
54213 71353 70927 70882 70877 70699 70124 68979 67583 66712 66793 67395 67658 67155 66250 65703 65903 66464 66715 66594 66693 67280
54193 67280 67740 67375 66409 65746 65894 66558 67174 67470 67556 67776 68393 69218 69647 69299 68464 67751 67518 67816 68593
54174 68593 69631 70512 70959 71090 71165 71279 71385 71327 70728 69261 67267 65698 65149 65328 65663 65932 65973 65377 63983
54155 63983 62329 61123 60551 60482 60903 61720 62500 62899 63012 62906 62351 61517 61384 62685 64774 66309 66830 66904
54137 66904 66921 66572 65574 64239 63162 62773 63219 64290 65423 66068 66066 65504 64481 63295 62546 62609 63214 63793
54119 63793 63988 63546 62284 60563 59311 58944 58790 58186 57667 58195 59600 60753 61107 61120 61142 60841 59929 58693
54101 58693 57570 56708 56141 55911 55925 56092 56645 57888 59634 61366 62908 64460 65993 67118 67579 67414 66615
54084 66615 65153 63393 62008 61364 61281 61399 61417 61022 60085 58944 58208 58210 58888 60039 61408 62643 63524 64121
54066 64121 64494 64468 63994 63433 63084 62806 62510 62639 63629 65185 66641 67707 68357 68469 68268 68720 70594 73304
54048 73304 75479 76490 76696 76451 75846 75308 75440 76192 77088 78329 80783 84706 89231 93377 96853 99765
54032 99765 102276 104759 107643 110892 114216 117818 122252 127492 132927 138428 144541 151277 157508 162102
54018 162102 165150 167676 170495 173678 176735 179093 180662 182012 183669 185307 186105 185785 184731 183163 180963
54003 180963 178332 175849 173688 171529 169408 167884 167092 166380 165222 163857 162684 161658 160634 159688 158734
53988 158734 157350 155366 153217 151415 150114 149319 148938 148434 147107 145037 143142 141946 140913 139399 137617
53973 137617 136122 134912 133622 132215 130908 129678 128366 127067 126063 125450 125107 124874 124611 124302 124195 124529
53957 124529 125100 125442 125520 125793 126549 127643 128922 130338 131579 132308 132973 134676 137863 141737 145337 148604
53941 148604 152074 156157 161180 167481 174740 181687 187191 191491 195852 201116 206955 212340 216430 219076
53927 219076 220745 221880 222373 221962 221031 220428 220335 219912 218436 216323 214687 214237 214935 216356 218100 220129
53911 220129 222853 226565 230732 234419 237555 241192 246221 252385 258844 265058 270712 275380 278763 280881
53897 280881 281761 281418 280397 279623 279198 278025 275243 271480 268029 265216 262305 258713 254568 250181 245547
53882 245547 240411 234565 228179 221963 216561 211586 205780 198560 190907 184243 178852 173939 168845 163626
53868 163626 158694 154494 151369 149268 147651 145923 143748 140818 136894 132460 128758 126581 125404 124258
53854 124258 123045 122310 122013 121278 119372 116489 113543 111409 110188 109047 107117 104704 103051 102602 102216
53839 102216 100716 98548 97141 97024 97503 97844 97924 97807 97449 96923 96319 95452 94202 93029 92666 93296 94478
53822 94478 95699 96577 96760 96304 95978 96598 98030 99406 100220 100728 101347 102241 103499 105148 106922 108494 109971
53805 109971 111747 113826 115730 117063 117845 118337 118969 120424 123314 127605 132630 137724 142717 147864 153481
53790 153481 159557 165511 170554 174531 178128 181970 185707 188389 189546 189575 189250 189206 189693 190438 190851 190644
53774 190644 190061 189299 188079 186115 183663 181177 178775 176438 174356 172554 170503 167684 164299 160926 157805
53759 157805 154982 152775 151439 150633 149890 149373 149487 149943 150054 149783 149693 149836 149493 148203 146398 144792 143676
53742 143676 142992 142685 142816 143531 144868 146364 147105 146570 145191 143713 142340 141054 140241 140205 140366 139933 139235
53725 139235 139404 140676 142024 142639 142915 143601 144794 146132 147325 148122 148317 148120 148003 147935 147320 145998 144751
53708 144751 144393 144801 145189 144985 144131 142873 141623 140800 140546 140732 141302 142338 143796 145528 147610 150165
53692 150165 152815 154862 156125 157113 158094 158613 158264 157504 157249 157982 159593 161814 164427 167221 170087 173074
53676 173074 176149 179035 181523 183809 186310 189163 191989 194170 195338 195710 195911 196443 197375 198531 199696
53661 199696 200501 200504 199760 198983 198660 198251 196837 194395 191783 189525 187368 185142 183356 182574 182688 183139 183526
53644 183526 183720 183661 183334 182789 182072 181219 180316 179434 178635 178227 178668 179845 180783 180660 179978 180019 181281 183109
53626 183109 184801 186213 187218 187567 187622 188367 190134 192007 193012 193327 193738 194452 195185 196054 197556 199751
53610 199751 202090 204095 205808 207517 209400 211544 214027 216896 220124 223588 227053 230301 233348 236406
53596 236406 239607 242905 246266 249701 253009 255886 258481 261592 265904 271052 275736 278867 280512 281642
53582 281642 283042 284668 286078 287248 288605 290367 292320 294344 296617 299025 300900 301846 302429 303432 304727
53567 304727 305518 305538 305325 305404 305846 306593 307551 308316 308424 308054 307944 308516 309540 310684 311839 312831 313402 313700
53549 313700 314352 315862 318239 321168 324148 326542 328050 329110 330349 331808 333331 335442 338863 343173
53535 343173 347052 350118 353437 357805 362545 366642 370114 373458 376470 378671 380491 383052 386849 391342
53521 391342 395854 400337 405282 411220 418284 425998 433680 441291 449600 459220 469800 480499 491027
53508 491027 501772 513103 524976 537233 549946 563398 577918 593759 611088 629939 650027
53497 650027 670585 690835 710977 732298 755709 780401 804695 828047 851311 875061 898737
53486 898737 921711 944183 966485 988405 1009869 1031466 1053513 1075226 1095716 1115431 1135767
53475 1135767 1157387 1179610 1201370 1222218 1242445 1262729 1283586 1304808 1325458 1344687 1362480
53464 1362480 1379407 1395815 1411507 1425973 1438798 1449995 1460023 1469198 1477088 1482881 1486320 1487734
53452 1487734 1487161 1484202 1478884 1471864 1463410 1452994 1440386 1426392 1411930 1397061 1381520 1365558
53440 1365558 1349495 1333072 1315938 1298306 1280353 1261565 1241547 1221053 1201287 1182398 1163518
53429 1163518 1144051 1124225 1104573 1085708 1068395 1053038 1039202 1026335 1014806 1005480 998412 992762
53417 992762 987909 983845 980485 977478 974894 973377 973357 974587 976612 979265 982635 987065 993222 1001712 1012493
53402 1012493 1025021 1038938 1054230 1070822 1088539 1107464 1127859 1149681 1172561 1196233 1220653
53391 1220653 1245845 1272140 1300453 1331730 1366021 1402534 1440532 1479726 1519913 1560901 1602956
53380 1602956 1646741 1692474 1739431 1786500 1833140 1879789 1927424 1976599 2026724 2076451 2124904
53369 2124904 2172168 2218394 2262996 2305200 2344848 2381948 2415890 2446026 2472709 2496779 2518048
53358 2518048 2535268 2547707 2555782 2559863 2559338 2553394 2542173 2526632 2507629 2485520 2460387 2432308
53346 2432308 2401537 2368535 2333704 2297097 2258673 2218750 2177914 2136498 2094551 2052206 2009718
53335 2009718 1967276 1925284 1884724 1846574 1810774 1776293 1742237 1708381 1674670 1640934 1607404
53324 1607404 1574894 1544099 1515060 1487552 1461628 1437532 1415375 1395044 1376275 1358789 1342602
53313 1342602 1328079 1315295 1303521 1291863 1280217 1268919 1257530 1244924 1230806 1216375 1203054
53302 1203054 1191231 1180620 1171131 1162795 1155317 1148431 1142493 1138169 1135658 1134613 1134722 1135980 1138370 1141565
53288 1141565 1145097 1148884 1153605 1160333 1169499 1180452 1192449 1205842 1221627 1239856 1259354 1279262
53276 1279262 1300006 1322279 1345745 1369359 1392440 1414718 1435769 1455254 1473599 1491701 1509768
53265 1509768 1526906 1541893 1554000 1563065 1569273 1573057 1574906 1575051 1573448 1570144 1565441 1559569 1552338
53252 1552338 1543320 1532349 1519645 1505432 1489593 1471967 1452898 1433166 1413256 1392975 1371971
53241 1371971 1350330 1328341 1305998 1283289 1260832 1239570 1219703 1200357 1180487 1159800 1138722
53230 1138722 1117876 1097859 1079105 1061629 1044963 1028570 1012273 996332 981249 967477 955000
53219 955000 943211 931513 920070 909621 900522 892363 884620 877267 870515 864321 858375 852331 845791
53206 845791 838308 829599 819641 808497 796311 783536 770793 758226 745317 731615 717473 703839
53194 703839 691441 680377 670316 660838 651600 642323 632729 622548 611782 600854 590220 579788
53182 579788 568918 557063 544179 530545 516522 502584 489237 476730 464991 453977 443781
53171 443781 434323 425224 416184 407247 398539 389976 381453 373158 365464 358551 352233 346129 340022 334044
53157 334044 328491 323379 318346 313159 308125 303704 299863 296134 292190 288034 283767 279596 275936 272992
53143 272992 270280 267121 263594 260484 258272 256779 255830 255492 255439 254867 253499 252090 251442 251338 251016 250253
53127 250253 249470 249057 249152 249896 251334 253131 254821 256346 258053 260198 262725 265492 268397 271235 273572
53112 273572 274826 274496 272531 269553 266476 263702 260742 256798 251591 245581 239590 234349 230204 227008
53098 227008 224284 221476 218074 213728 208652 203778 200086 197640 195596 193215 190473 187680 185054 182847
53084 182847 181325 180227 178652 175962 172601 169689 167968 167356 167271 167047 166248 164937 163636 162767 162231 161624
53068 161624 160709 159556 158351 157252 156312 155452 154611 153881 153398 153181 153344 154227 155849 157355 157622 156540 155057
53051 155057 153836 152505 150560 148332 146547 145430 144768 144521 144732 145045 144833 143803 142156 140274 138497
53036 138497 137084 136151 135672 135599 135812 135936 135599 134978 134691 135018 135566 135810 135467 134250 131961 129197 127328
53019 127328 127184 128142 128999 129326 129508 129845 130245 130551 130642 130430 130135 130327 131275 132512 133448 134056 134551 134757 134350
53000 134350 133448 132448 131544 130825 130527 130595 130353 129234 127642 126514 126272 126784 127990 129843 131823 133321
52984 133321 134433 135676 137039 138076 138949 140503 143121 146230 149220 152255 155842 160029 164347 168196
52970 168196 171186 173452 175701 178559 181743 184284 185652 186241 186657 187009 187103 186903 186504 185956 185320 184621 183639
52953 183639 182048 179972 178041 176627 175290 173265 170377 167184 164287 161754 159247 156601 154133 152323
52939 152323 151288 150724 150417 150548 151309 152422 153311 153686 153715 153734 153939 154327 154728 155019 155386 156208 157548 158954
52921 158954 159952 160419 160318 159485 158082 156877 156563 157013 157665 158407 159532 160971 162203 162913 163226 163320 163293 163384
52903 163384 163814 164341 164466 164121 163701 163371 162880 162205 161917 162662 164510 166967 169350 171163 172396 173525 174984
52886 174984 176627 177978 178880 179542 180098 180610 181369 182650 184155 185323 186209 187428 189051 190269 190509 190274
52870 190274 190420 191025 191537 191735 192016 192774 193935 195097 195898 196264 196472 196973 198030 199599 201534 203798 206385
52853 206385 209165 211926 214521 216941 219316 221775 224244 226495 228531 230830 233937 237871 242042 245687
52839 245687 248239 249544 250001 250243 250322 249460 247078 243851 241128 239351 237765 235681 233255 230802 228183
52824 228183 225389 223110 221969 221533 220710 219039 217014 215214 213665 212125 210492 208592 205988 202426 198391
52809 198391 194788 191965 189397 186586 183967 182432 182106 182173 182004 181823 181876 181561 180058 177589 175325 174040
52793 174040 173429 172765 171741 170455 169042 167632 166430 165561 164828 163772 162049 159908 158225 157786 158383 158880
52777 158880 158328 156684 154368 151688 149094 147340 146673 146258 145164 143629 142555 142060 141470 140623 140147 140290
52761 140290 140410 139909 138923 137753 136368 134783 133320 132091 130780 129225 127686 126292 124752 122915 121071
52746 121071 119383 117616 115710 114017 112623 111060 109166 107511 106458 105442 103924 102457 101881 101778 100785
52731 100785 98568 96567 96388 97925 99502 99716 98739 97754 97429 97323 96840 96299 96533 97675 98963 99780 100255
52714 100255 100735 101330 102221 103728 105614 106880 106802 105846 105142 105352 106415 108004 109761 111358 112766 114284
52698 114284 115981 117481 118575 119584 120635 121021 120015 118044 116350 115563 115236 114779 114231 113903 113701 113059
52682 113059 111384 108592 105409 103040 102223 102534 102819 102226 100653 98510 96409 94994 94525 94448 93680 91496
52666 91496 88098 84382 81259 79153 77915 77230 77133 77921 79469 80948 81597 81629 81943 82963 84142 84710 84567
52649 84567 84219 84062 84033 83907 83679 83460 83155 82545 81766 81425 82002 83317 84834 86367 88161 90364 92838
52632 92838 95435 98073 100476 102241 103230 103631 103567 102990 101957 100623 98935 96760 94385 92431 91191 90487
52616 90487 90177 90275 90500 90365 89850 89376 88938 87963 86331 84745 83750 83101 82603 82764 83962 85622 86993 88162
52598 88162 89506 90670 90978 90547 90034 89550 88698 87567 86750 86396 86112 85861 86208 87518 89527 91822 94087
52581 94087 95794 96385 96085 95962 96825 98421 99943 100958 101574 102076 102720 103697 105005 106449 107873 109331
52565 109331 110955 112760 114627 116442 118211 119959 121441 122117 121751 121044 121112 122210 123451 124100 124529 125463
52549 125463 126847 128111 129163 130355 131724 133043 134450 136269 138232 139599 140085 140109 140137 140391 141128 142416
52533 142416 143531 143325 141519 139122 137378 136768 137152 138200 139421 140272 140686 141162 142079 143257 144357 145314
52517 145314 146107 146504 146355 145923 145633 145726 146266 147204 148191 148674 148478 148075 148012 148251 148369 148233 148161 148454 149059 149751
52497 149751 150389 150875 151009 150665 150109 149873 150137 150452 150369 150102 150087 150034 149130 147321 145678 145162 145654 146607 147895
52478 147895 149454 150742 151403 151961 152996 154069 154391 154186 154353 154989 155418 155594 156321 157904 159678 161195
52462 161195 162841 164919 167045 168860 170471 171739 172056 171396 170781 171104 172112 173141 174102 175120 175845 175973
52446 175973 175953 176415 177278 178106 178898 179743 180085 179235 177489 176001 175583 176234 177690 179675 181671 183183 184384
52429 184384 185928 187973 189942 191354 192413 193561 194906 196336 197838 199387 200686 201303 201095 200447 200058
52414 200058 200390 201158 201454 200541 198563 196350 194603 193445 192666 192151 191913 191919 191977 191879 191608 191377 191421 191865 192778
52395 192778 194091 195206 194994 192821 189583 187130 186389 186576 186487 185941 185524 185455 185441 185424 185735 186485 187337 188027
52377 188027 188716 189697 190976 192230 193060 193363 193576 194322 195646 196914 197794 198927 201049 203734 205730 206560
52361 206560 207032 208029 209462 210762 211759 212575 213077 213029 212644 212566 213334 215122 217829 221116 224450 227458 230252
52344 230252 233158 236245 239303 242166 244707 246637 247769 248589 250098 252843 256364 259777 262599 264813
52330 264813 266499 267878 269442 271548 273894 275855 277328 278822 280690 282754 284882 287421 290719 294566
52316 294566 298443 302089 305543 308867 312190 315819 319927 324281 328586 332994 337913 343476 349550 356141
52302 356141 363339 370944 378577 386183 394104 402638 411859 421841 432687 444326 456614 469635 483523
52289 483523 498050 512806 527748 543131 558894 574661 590435 606737 623944 642041 661133
52278 661133 681440 702383 722356 740127 756150 771967 788555 805759 822959 839569 854983
52267 854983 868784 881194 892813 903742 913373 921236 927610 932994 937303 940049 941222 941475 941290 940303
52253 940303 937837 933930 929436 925010 920425 915177 909409 903825 898913 894796 891793 890460 890846 892179
52239 892179 893719 895629 898691 903387 909657 917381 926633 937292 948776 960444 972226 984606 997916
52226 997916 1011783 1025455 1038623 1051562 1064408 1076646 1087600 1097096 1105245 1111852 1116622 1119852
52214 1119852 1122336 1124411 1125561 1125058 1122591 1118165 1111815 1103702 1094209 1083778 1072796 1061538 1049940
52201 1049940 1037518 1024001 1009919 996009 982090 967286 951504 935932 921762 909160 897772
52190 897772 887489 878153 869204 860346 852140 845217 839288 833580 827890 822555 817657 812941 808350 804034
52176 804034 799974 796118 792710 789924 787397 784671 781879 779334 776721 773496 769970 767097 765098 763135
52162 763135 760550 757665 755017 752508 749778 746889 744114 741433 738708 736119 734019 732450 731122 729774
52148 729774 728337 726865 725454 724080 722403 720003 717002 714167 712058 710257 707762 704081 699630 695133
52134 695133 691053 687629 685028 683116 681285 678909 675937 672770 669614 666263 662643 659119 656021 653129
52120 653129 649990 646563 643158 639880 636627 633611 631347 629941 628930 628048 627783 628779 630985 633705 636356
52105 636356 638907 641715 645169 649465 654600 660682 668171 677539 688686 700987 713978 727632 742031
52092 742031 757347 774231 793445 814736 836726 858402 880125 902632 925715 948688 971633
52081 971633 995120 1018941 1042072 1063931 1084798 1104939 1124098 1142025 1158705 1173800 1186524
52070 1186524 1196539 1204539 1211539 1217810 1222684 1225168 1224664 1221381 1216260 1210288 1203876 1197023 1189834 1182383
52056 1182383 1174157 1164308 1152584 1139614 1126159 1112642 1099511 1087457 1076869 1067461 1058783 1050809
52044 1050809 1043812 1038019 1033668 1031064 1030160 1030283 1030618 1030901 1031495 1032943 1035620 1039614 1044691 1050501 1056922
52029 1056922 1064086 1071990 1080363 1089042 1098131 1107518 1116472 1124161 1130444 1135862 1140888 1145493 1149475 1152880
52015 1152880 1155895 1158409 1159872 1159580 1157118 1152583 1146412 1139042 1130717 1121551 1111673 1101161 1089800 1076948
52001 1076948 1061875 1044320 1024691 1003573 981241 957837 933839 909901 886193 862411 838549
51990 838549 815147 792450 769854 746672 723031 699504 676129 652459 628446 604641 581566
51979 581566 559422 538378 518537 499548 480833 462364 444763 428514 413508 399513 386568
51968 386568 374738 363907 354062 345343 337529 329893 321950 314091 307071 301080 295650 290390 285447 281177
51954 281177 277572 274168 270458 266346 262117 257979 253821 249515 245239 241283 237702 234424 231526 229040
51940 229040 226602 223755 220560 217514 214894 212620 210787 209784 209717 210096 210356 210357 210200 209839 209157 208270 207534
51923 207534 207299 207625 208147 208281 207815 207216 207037 207119 206732 205507 203846 202379 201383 200730 200012 198660 196341
51906 196341 193348 190311 187555 185080 182983 181364 179928 178385 177255 177482 178994 180369 180322 178899 176894
51891 176894 174786 172742 171042 169783 168512 166774 164811 163201 162005 160750 159110 157238 155541 154489
51877 154489 154440 155298 156483 157487 158300 159058 159574 159544 159004 158302 157797 157793 158453 159445 160034 159899 159624 160000 161087
51858 161087 162332 163288 163828 163939 163885 164432 166315 169433 172881 175734 177545 178325 178488 178761 179753 181534 183822
51841 183822 186391 189005 191210 192681 193691 194827 196238 197482 198115 198066 197454 196413 195160 193965 192939
51826 192939 191963 190851 189479 187849 186137 184574 183254 182212 181693 181918 182498 182557 181792 180952 180835 181256 181579
51809 181579 181895 182935 184920 187159 188836 189668 189834 189756 189993 190868 192118 193262 194253 195326 196275 196448 195590
51792 195590 194193 192952 192194 191928 192012 192101 191808 191055 190078 189148 188595 188896 190172 191610 191993 190968 189267
51775 189267 187621 186091 184647 183756 183897 184923 186290 187603 188615 189074 189003 188836 188906 188984 188684 188104 187700
51758 187700 187726 188191 189137 190522 191911 192767 193177 193962 195915 199081 202841 206546 209968 213254 216542 219743
51742 219743 222802 226050 230059 235062 240785 247017 254044 262240 271407 280921 290480 300385 311034 322362
51728 322362 333829 344676 354131 361698 367505 372169 376005 378384 378172 374988 369904 364786 360980 358688
51714 358688 357403 356578 355792 354577 352494 349413 345601 341483 337472 333968 331277 329326 327541 325199 322010
51699 322010 318439 315440 313768 313327 313172 312274 310405 308240 306582 305578 304784 303913 303332 303727 305313 307518
51683 307518 309551 311322 313713 317848 324011 331211 337726 342096 343768 343044 340612 337124 333111 329013
51669 329013 325133 321623 318745 317068 317170 319011 321835 324913 328227 332262 337265 343004 349192 355744
51655 355744 362521 369019 374537 378589 381007 381815 381064 378839 375280 370625 365194 359297 353047 346306 338909
51640 338909 330975 322959 315378 308512 302332 296612 291038 285350 279568 274060 269200 264916 260793 256662
51626 256662 252840 249640 246939 244481 242382 240906 239852 238610 236830 234706 232592 230756 229596 229574 230624
51611 230624 231879 232299 231423 229434 226733 223696 220643 217807 215356 213512 212432 211936 211631 211423 211595 212252
51595 212252 213028 213564 213903 214192 214381 214576 215311 216987 219295 221671 224107 227012 230392 233698 236514 238949
51579 238949 241354 244060 247392 251541 256316 261367 266704 272650 279232 285969 292340 298140 303247 307407
51565 307407 310445 312490 313828 314622 314773 313853 311206 306525 300465 294371 289204 284933 281091 277560 274487
51550 274487 271747 269028 266513 265037 265346 267341 270223 273231 276058 278699 281317 284375 288552 294185
51536 294185 300833 307627 314034 320079 325932 331585 336918 341704 345497 347896 349044 349556 349817 349715 349207
51521 349207 348643 348207 347447 345875 343782 341947 340730 339911 339409 339623 340962 343326 346144 348729 350606 351660
51505 351660 351985 351522 350064 347748 345190 342757 339936 335914 330679 325062 319718 314525 309062 303235 297278
51490 297278 291487 286149 281445 277207 272926 268212 263253 258731 255251 252860 251161 249903 249310 249659 250704
51475 250704 251945 253364 255337 257759 259929 261636 263647 266640 270266 273856 277480 281473 285434 288724
51461 288724 291740 295697 301104 307359 313902 320891 328522 336469 344304 351862 358975 365447 371488 377552
51447 377552 383524 388741 393042 397059 401123 404568 406666 407648 408209 408468 408095 407189 406368 406027 406019 406117 406451
51430 406451 407369 409031 411156 413173 414709 415917 417148 418331 418972 418748 417783 416282 414209 411456 408038
51415 408038 404063 399706 395216 390607 385415 379211 372373 365897 360330 355346 350476 345774 341606 338235
51401 338235 335818 334307 333158 331599 329498 327603 326674 326697 327147 327614 327942 328146 328475 329301 330709 332451
51385 332451 334358 336446 338535 340192 341161 341477 341157 340199 338887 337421 335213 331360 325951 320075 314235
51370 314235 307697 299934 291757 284244 277274 270032 262417 255056 248257 241815 235648 229849 224262 218651
51356 218651 213166 208129 203533 199279 195626 192825 190558 188392 186551 185565 185273 184870 183879 182429 180651
51341 180651 178472 176135 174304 173395 173128 172870 172205 171179 170236 169803 169744 169425 168532 167483 166738 166122 165307
51324 165307 164509 164051 163695 163159 163028 164255 166867 169992 173173 176775 180986 185211 188741 191429 193489
51309 193489 195219 197134 199853 203535 207784 212237 216858 221616 226354 231066 235753 239967 243080 245160
51295 245160 246945 248679 249604 248999 247214 245148 243028 240214 236037 230534 224456 218813 214171 210193 206014
51280 206014 201265 196551 192715 189818 187077 183728 179751 175771 172392 169669 167221 164789 162437 160151
51266 160151 157564 154427 151149 148457 146600 145295 144342 143802 143585 143413 143274 143458 143960 144366 144479 144602 144953
51249 144953 145203 144903 144083 143176 142619 142699 143533 144903 146411 147963 149850 152162 154488 156450 158210 160095
51233 160095 161912 163074 163348 163191 163328 164150 165476 166778 167653 168160 168628 169187 169689 170106 170697 171622 172682
51216 172682 173579 174188 174356 173753 172281 170491 169193 168636 168340 167763 166881 166051 165539 165329 165291 165359 165543 165874
51198 165874 166389 167085 167820 168272 168104 167199 165748 164108 162660 161678 161142 160693 159980 159120 158586 158575 158752 158700
51180 158700 158354 157821 157075 156101 155047 153960 152628 151020 149604 148849 148591 148276 147693 147057 146539 146119 145803
51163 145803 145644 145628 145823 146395 147124 147297 146567 145632 145383 145664 145626 145102 144753 144872 144983 144757 144433 144069 143246
51144 143246 141859 140430 139203 137687 135637 133790 132989 133078 133308 133373 133386 133247 132748 132118 131837 132006 132347 132743
51126 132743 133317 134107 135047 136176 137535 138931 140153 141288 142544 143870 145057 146141 147482 149457 152160
51111 152160 155222 157926 159830 161286 162917 164479 164893 163750 162149 161467 161761 161984 161453 160503 159957 160534
51095 160534 162507 165345 167864 169301 170049 170897 171913 172724 173498 174723 176163 176997 177028 176851 176774 176531 176239
51078 176239 176591 177568 177914 176675 174662 173525 173734 174209 173768 172247 170286 168663 167927 168197 169100 170048 170631
51061 170631 170621 169777 167981 165551 163162 161421 160597 160632 161199 161824 162270 162828 164005 165867 167881 169418 170323
51044 170323 171031 172228 174366 177283 180324 182901 184963 186814 188691 190707 192997 195553 197958 199670
51030 199670 200691 201650 203105 205042 207139 209113 210668 211487 211650 211735 212062 212063 210909 208699 206518 205241
51014 205241 204708 204186 203284 202193 201355 201106 201521 202446 203763 205564 207863 210203 212024 213462 215321 218030
50998 218030 221105 223952 226750 230093 234151 238735 243944 250152 257428 265459 274038 283154 292621 302069
50984 302069 311466 321309 332217 344515 358137 372714 387863 403740 421237 441240 463840 488729
50972 488729 516262 547525 583299 623468 667547 715324 766749 821762 880482 943177 1009734
50961 1009734 1079424 1151312 1224571 1298246 1371117 1441963 1509594 1572497 1628946 1677752 1718543
50950 1718543 1751113 1774980 1789882 1796201 1794510 1785180 1768981 1747695 1723461 1697669 1670987 1644279
50938 1644279 1618798 1595409 1574080 1554275 1535435 1516938 1497905 1477369 1454657 1429528 1401883
50927 1401883 1371351 1337251 1299115 1257169 1212084 1164347 1114296 1062724 1010904 959816 909829
50916 909829 861411 815633 773527 735268 700412 668587 639517 612708 587689 564522 543613
50905 543613 525205 509339 496036 485028 475548 466923 459331 453433 449389 446685 444879 443928 443768 444088
50891 444088 444689 445666 447093 448853 450811 452870 454845 456612 458465 461059 464930 470186 476518 483313 490035
50876 490035 496899 504878 514496 524870 534677 543945 554058 565980 579439 594106 610583 629558
50864 629558 650781 673726 698795 726958 758442 792731 829907 871241 918235 971726 1032200
50853 1032200 1100440 1177406 1263733 1359743 1465783 1582178 1708854 1845235 1990439 2143333
50843 2143333 2302431 2466001 2632239 2798990 2963086 3120196 3265595 3395149 3505688
50834 3505688 3594866 3661069 3703457 3721984 3717543 3692289 3649550 3593037 3526259 3452939 3377540
50823 3377540 3304461 3236540 3174952 3120652 3074947 3038041 3007600 2979547 2950152 2916989 2878334
50812 2878334 2832477 2777737 2712703 2636567 2549694 2453747 2350764 2242029 2128206 2010547
50802 2010547 1891564 1774502 1662358 1557138 1459405 1368520 1283811 1205669 1135150 1072566
50792 1072566 1016971 967139 922589 883478 849933 821724 798218 778482 761639 747328 735607
50781 735607 726391 719277 713879 709901 706793 703806 700608 697441 694462 691322 687585 683164 678129 672564
50767 672564 666945 662166 658566 655267 651080 645990 641205 637816 635929 635138 635235 636180 637817 640043 643177
50752 643177 647885 654778 664159 676026 690098 705920 723187 742070 763139 786896 813461 842783
50740 842783 875077 910935 951014 995792 1045695 1101316 1163350 1232274 1308184 1390933 1480362
50729 1480362 1576293 1678232 1785048 1894909 2005543 2114494 2219219 2317235 2406441 2485156
50719 2485156 2551557 2603191 2637522 2653122 2650105 2629455 2592594 2541886 2481053 2414410 2345685
50708 2345685 2277686 2212656 2152334 2097803 2049779 2008902 1975273 1947812 1924637 1904079 1884744
50697 1884744 1864586 1840723 1810701 1773581 1729463 1678340 1620020 1555065 1485294 1413163 1340910
50686 1340910 1270315 1202932 1140009 1082043 1028700 979497 934537 894378 859271 828907 802933
50675 802933 781256 763683 749716 739043 731840 728150 727298 728427 731413 736749 744580 754284 764991
50662 764991 776210 788065 801123 815734 831235 846207 859938 873280 887578 903214 919886
50651 919886 937769 957322 978193 999566 1021687 1045936 1073083 1102581 1133962 1167938 1205527
50640 1205527 1246968 1292091 1340923 1393144 1447643 1503476 1560730 1619620 1679128 1737378 1793115
50629 1793115 1845940 1895279 1939938 1978747 2011036 2036391 2054517 2065569 2070310 2069924 2065856 2059652
50617 2059652 2052579 2045449 2039057 2034584 2033209 2035443 2041174 2050140 2061928 2075621 2090009 2104121 2117216
50604 2117216 2128293 2136128 2139907 2139394 2134349 2123993 2107205 2083058 2051117 2011418 1964283 1910206
50592 1910206 1850011 1785139 1717496 1648712 1579659 1510843 1443095 1377574 1315246 1256597 1201790
50581 1201790 1150789 1103419 1059592 1019560 983788 952538 925649 902618 882777 865590 850912
50570 850912 838907 829642 822935 818698 817147 818482 822598 829268 838343 849607 862741 877648 894477
50557 894477 913094 932940 953757 976053 1000375 1026520 1054033 1083135 1114416 1147749 1182197
50546 1182197 1216960 1251748 1286255 1320014 1352980 1385611 1418079 1449900 1480653 1510707 1541007
50535 1541007 1572490 1605939 1642050 1681241 1723631 1769431 1819241 1873803 1933653 1999180 2070828
50524 2070828 2149078 2234287 2326512 2425130 2528494 2634280 2740437 2845658 2948772 3047956
50514 3047956 3140847 3225204 3299040 3360206 3406416 3436031 3448662 3444737 3424592 3388287 3336344
50503 3336344 3270328 3192529 3105365 3011478 2914210 2817373 2724327 2637649 2559870 2493945 2442384
50492 2442384 2406050 2384278 2376101 2380918 2397956 2425493 2460787 2500442 2540702 2577561 2606890 2624590
50480 2624590 2626975 2611409 2576911 2524112 2454670 2370809 2275383 2172053 2064943 1957736 1852818
50469 1852818 1751262 1653681 1561048 1474540 1394808 1321844 1255567 1196105 1143371 1096843 1056010
50458 1056010 1020655 990451 964816 943477 926618 913967 904305 896653 891526 890137 892667 898256
50446 898256 906550 918129 933172 950696 969619 989838 1011771 1035495 1060882 1088135 1117583 1149112
50434 1149112 1182205 1216338 1251086 1286130 1321379 1356793 1391881 1425759 1457948 1488622 1517738
50423 1517738 1544465 1568006 1588604 1607059 1623574 1637732 1649573 1659973 1669922 1679980 1690562
50412 1690562 1702212 1715380 1730331 1747523 1767734 1791558 1818946 1849370 1882153 1916489 1951429
50401 1951429 1986152 2020043 2052248 2081314 2105718 2124702 2138230 2145928 2146373 2137638 2118452 2088694
50389 2088694 2048992 2000204 1943309 1879503 1810298 1737599 1663700 1590948 1521276 1456132 1396762
50378 1396762 1344191 1298896 1260970 1230873 1209620 1197793 1194659 1198732 1208973 1224856 1245288 1268102
50366 1268102 1290771 1311114 1327108 1336612 1337852 1330121 1313856 1290157 1260397 1225952 1188000 1147634
50354 1147634 1106220 1065366 1026217 988943 953114 918528 885542 854842 827100 802678 781375
50343 781375 762498 745422 730044 716555 704969 695102 686844 680078 674372 669228 664794 662046 661973
50330 661973 664676 669451 675578 682818 691232 700858 711747 724086 737980 753160 769102 785506 802514
50317 802514 820339 838855 857713 876786 896356 916845 938414 960754 983193 1005121 1026339
50306 1026339 1046858 1066223 1083326 1097156 1107642 1115490 1121242 1124783 1125728 1123980 1119851 1113865 1106482
50293 1106482 1097784 1087402 1075040 1061056 1046227 1030925 1014903 998039 980844 963870 946901
50282 946901 929149 910225 890568 870911 851638 832801 814605 797582 782106 767825 753766
50271 753766 739154 724019 708884 694083 679646 665766 652953 641617 631770 623256 616007 610049
50259 610049 605466 602409 600821 600096 599394 598526 598155 598844 600243 601579 602687 604071 606116 608758 611942
50244 611942 615831 620283 624489 627605 629717 631798 634553 637486 639371 639598 638785 637925 637248 636152 634044
50229 634044 630852 626787 622134 617352 612957 609035 605106 600697 595785 590567 585202 580128 576265 574402
50215 574402 574436 575523 576876 578108 579017 579626 580484 582402 585609 589426 592968 595974 598810 601884 605272
50200 605272 608736 611870 614348 616188 617699 618990 619644 619200 617903 616606 615720 614602 612294 608666 604460
50185 604460 600357 596474 592761 589205 585330 580113 573040 565004 557447 550701 543818 536052 527906 520461
50171 520461 514286 509352 505579 503027 501824 502254 504638 508716 513287 516837 518455 517984 515626 511818 507253
50156 507253 502454 497276 491306 484752 478500 473170 468482 463755 458720 453642 448918 444836 441571 439173
50142 439173 437511 436349 435387 434175 432186 429261 425932 423139 421536 421109 421400 421932 422417 422836 423506 425019
50126 425019 427909 432238 437568 443307 449099 454932 460984 467457 474476 482098 490282 498732 506750 513528
50112 513528 518899 523694 528914 534521 539404 542747 545012 547263 549877 552380 554319 555747 556856 557601
50098 557601 557767 557169 555730 553706 551808 550720 550464 550581 550951 552013 554101 556995 560307 563953 568093
50083 568093 572913 578632 585334 592626 599831 606797 614194 622747 632503 643125 654542 666844 679720
50070 679720 692525 704960 717417 730498 744314 758253 771439 783465 794641 805406 815682
50059 815682 825088 833657 841822 849720 857091 864013 871006 878083 884370 889177 892966 896569 899868 901993
50045 901993 902613 902307 901650 900601 898913 896589 893740 890339 886296 881560 876079 869877 863102 855798 847773
50030 847773 838978 829899 821174 812920 804780 796566 788454 780567 772768 764979 757362 750097 743191 736491
50016 736491 729693 722541 715372 709284 705232 702953 701246 699378 697765 697179 697852 699591 702247 705623 709182
50001 709182 712313 714898 717399 720425 724289 728895 733890 738909 743757 748408 752980 757826 763507 770445
49987 770445 778615 787744 797579 807676 817049 824539 829659 832775 834385 834537 833126 830487 827479 825070
49973 825070 823877 823958 825008 826805 829367 832397 834676 834397 830229 821875 809661 794043 775644 755305
49959 755305 733669 710896 687070 662813 639218 617147 596715 577516 559314 542382 527068
49948 527068 513142 499976 487500 476497 467490 459680 451655 443086 435006 428309 422702 417450 412506
49935 412506 408362 405187 402697 400691 399215 398248 397637 397345 397459 397928 398553 399328 400524 402364 404640 406721
49919 406721 407992 408362 408387 408799 409881 411355 412817 414070 415067 415717 415893 415466 414366 412815 411485 411063
49903 411063 411525 412115 412220 411995 411969 412380 413176 414451 416435 419072 421929 424549 426806 428945 431415 434585
49887 434585 438451 442763 447506 453099 459849 467375 474915 482256 490104 499422 510590 523316 537215
49874 537215 552315 569037 587850 608986 632359 657591 684062 711027 737767 763635 788013
49863 788013 810418 830749 849313 866476 882491 897852 913511 930308 948158 966086 983028
49852 983028 998235 1010923 1020097 1025010 1025482 1021493 1012703 998712 979654 956355 930013 901898 873115
49839 873115 844316 815630 787047 758808 731325 704825 679319 654841 631586 609853 589946
49828 589946 572057 556068 541550 528086 515573 504111 493669 484017 474895 466210 458117 450996
49816 450996 445241 440940 437783 435349 433366 431576 429521 426751 423290 419754 416907 415138 414298 413954 413726
49801 413726 413389 412753 411601 409908 408016 406436 405394 404717 404102 403360 402369 401010 399290 397400 395568 393916
49785 393916 392476 391221 390057 388914 387902 387258 387127 387505 388389 389805 391615 393490 395185 396701 398111
49770 398111 399308 400019 400051 399553 399147 399685 401693 405029 409142 413536 417854 421832 425616 430005 435950 443767
49754 443767 453206 464242 477275 492485 509505 527911 547579 568359 589866 611871 634397 657029
49742 657029 678523 697557 713704 727344 738892 748550 756642 763809 770808 778377 787172 797569 809444
49729 809444 822075 834119 843723 849118 849354 844256 833737 817717 796959 773360 748859 724321
49717 724321 699847 675809 653061 632361 614058 598115 584019 570904 558260 546435 536105
49706 536105 527462 520290 514521 510196 507081 504819 503276 502302 501455 500556 500158 500775 501840 502260 501938 501845
49690 501845 502550 503525 504140 504487 504831 505014 504913 504907 505350 505962 506252 506248 506417 507137 508551 510616 512955 514896 516033
49671 516033 516564 516828 516829 516498 516099 515913 515760 515238 514356 513580 513426 514291 516417 519514 522506 524193 524338 523820
49653 523820 523641 524088 524869 525666 526287 526550 526362 525978 525936 526598 527780 528902 529585 530036 530749 531781 532517 532349
49635 532349 531527 531113 531932 533687 535274 536000 536291 537086 538691 540509 541902 542955 544199 545849 547659 549449
49619 549449 551368 553568 555922 558206 560450 562957 566084 570028 574738 579932 585327 590897 596935 603863
49605 603863 611903 620825 629947 638605 646753 654959 663703 672936 682519 692740 703910 715696 727448
49592 727448 739195 751785 765911 781445 797838 814694 831801 849122 867091 886491 907661
49581 907661 930152 953549 978264 1005048 1033932 1064194 1095304 1127385 1160641 1194822 1229510
49570 1229510 1264709 1300884 1338457 1377454 1417644 1458883 1501185 1544503 1588695 1633782 1680001
49559 1680001 1727275 1774800 1821573 1867319 1912496 1957302 2001091 2042965 2082460 2119344 2153103
49548 2153103 2183074 2208907 2230536 2247878 2260894 2269780 2274756 2275746 2272640 2265789 2255981 2244050 2230758
49535 2230758 2216849 2202745 2188290 2173254 2158161 2144180 2132167 2122196 2114111 2108101 2104578 2103802
49523 2103802 2105781 2110285 2116838 2125049 2135160 2147957 2163933 2182781 2203937 2227289 2252981 2280704
49511 2280704 2309562 2338577 2367029 2394369 2420157 2444201 2466463 2486618 2503757 2516695 2524606
49500 2524606 2527458 2525817 2520152 2510270 2495487 2475384 2450188 2420331 2385937 2347094 2304480 2259234
49488 2259234 2212053 2162817 2111286 2057904 2003648 1949260 1894968 1840901 1787484 1735335 1684918
49477 1684918 1636345 1589438 1544019 1500286 1458815 1419986 1383409 1348170 1313721 1280328 1248577
49466 1248577 1218663 1190363 1163493 1138179 1114697 1093225 1073662 1055570 1038415 1022052 1006891
49455 1006891 993320 981038 969288 957780 947108 938024 930571 924116 918116 912547 907591 903220 899228
49442 899228 895528 892173 889083 885969 882692 879614 877460 876796 877713 879953 883140 886974 891493 897258 905094
49427 905094 915473 928356 943727 961991 983691 1009077 1038093 1070025 1102350 1130272 1148684
49416 1148684 1155405 1152349 1143462 1132027 1120046 1109147 1100926 1096354 1095443 1097633 1102224 1108636 1116681
49403 1116681 1126579 1138261 1150862 1163379 1175815 1189037 1203393 1218074 1232126 1245481 1258568
49392 1258568 1271378 1283527 1294938 1305819 1316062 1325351 1333922 1342619 1351938 1361452 1370579 1379573 1389351
49379 1389351 1400471 1412652 1425229 1437767 1450214 1462789 1475835 1489682 1504568 1520674 1538120
49368 1538120 1556778 1576250 1596287 1617117 1639057 1661883 1685024 1708443 1732833 1758698 1785665
49357 1785665 1813092 1841035 1870137 1900698 1932377 1964833 1998212 2032831 2068722 2105711 2143824
49346 2143824 2183449 2225165 2269350 2315869 2364251 2414359 2466706 2521751 2579015 2637473 2696909
49335 2696909 2758290 2822498 2889132 2957030 3025597 3095097 3165831 3237702 3310580 3384464 3459006
49324 3459006 3533299 3606475 3678284 3748767 3817524 3883684 3946575 4006077 4062124 4114074 4160774
49313 4160774 4201267 4235262 4262940 4284435 4299633 4308397 4310814 4307263 4298424 4285278 4268999 4250644
49301 4250644 4230862 4209865 4187625 4164167 4139868 4115600 4092506 4071450 4052684 4036134 4021958
49290 4021958 4010648 4002542 3997463 3995062 3995431 3999090 4006347 4016960 4030667 4047731 4068514 4092466 4118039
49277 4118039 4143813 4169429 4195187 4221010 4246189 4269861 4291221 4309291 4323046 4331962 4336074 4335275
49265 4335275 4328861 4315988 4296332 4270102 4237667 4199524 4156429 4109166 4058143 4003561 3946000
49254 3946000 3886466 3825681 3763606 3700005 3635421 3571223 3508548 3447434 3387269 3327960 3270251
49243 3270251 3214861 3161769 3110677 3061843 3015939 2973147 2932892 2894501 2857644 2821969 2786906
49232 2786906 2752281 2718845 2687655 2658861 2631395 2603871 2575670 2547192 2519412 2493232 2469120
49221 2469120 2447184 2427432 2409756 2393672 2378442 2363752 2350042 2337783 2326522 2315112 2302989
49210 2302989 2290780 2279428 2269005 2258750 2248127 2237428 2227317 2218142 2209868 2202451 2195997 2190651
49198 2190651 2186565 2183958 2182929 2183195 2184280 2186072 2188916 2192994 2197931 2203293 2209221 2216086 2223722 2231571
49184 2231571 2239664 2248867 2259837 2272176 2284999 2298107 2312157 2327748 2344687 2362185 2379643 2397203
49172 2397203 2415651 2435728 2457445 2480097 2502916 2525553 2547956 2570155 2592415 2615416 2639996
49161 2639996 2666709 2695648 2726459 2758455 2791026 2824181 2858403 2893764 2929529 2965026 3000571
49150 3000571 3037008 3074497 3112398 3150257 3188281 3226765 3265714 3305268 3345814 3387051 3427274
49139 3427274 3464244 3496754 3525085 3550142 3572659 3593252 3612602 3631221 3649237 3666675 3683751
49128 3683751 3700599 3716872 3732060 3746177 3759773 3773136 3785836 3797361 3807883 3818050 3828152
49117 3828152 3837904 3846931 3855105 3862437 3869147 3875865 3883254 3891277 3899297 3907113 3915400 3924729 3934646 3944221
49103 3944221 3953153 3961805 3970429 3979013 3987711 3996693 4005467 4012955 4018443 4022063 4024294 4025523 4026252 4027118
49089 4027118 4028295 4029318 4029947 4030929 4033447 4037999 4044241 4051779 4060551 4070352 4080506 4090377 4100075 4110342
49075 4110342 4121726 4133971 4146187 4157466 4167345 4175809 4183061 4189221 4194152 4197518 4199073 4198891 4197235
49062 4197235 4194205 4189646 4183371 4175262 4165129 4152744 4138204 4122067 4104857 4086522 4066568 4044692
49050 4044692 4021110 3996342 3970879 3944990 3918682 3891863 3864667 3837554 3810943 3784827 3758970
49039 3758970 3733405 3708498 3684543 3661514 3639319 3618177 3598710 3581602 3567013 3554257 3542222
49028 3542222 3530272 3518592 3507672 3497750 3488912 3481253 3474606 3468502 3462844 3458230 3455077 3452754 3450287
49015 3450287 3447630 3445391 3443517 3441280 3438711 3436924 3436556 3436788 3436487 3435507 3434161 3432180 3429187 3425749 3422867
49000 3422867 3420496 3417496 3413160 3407902 3402208 3395696 3387765 3378650 3369171 3359500 3348779 3336119 3321676
48987 3321676 3306405 3290805 3274330 3256252 3236824 3217098 3197568 3177533 3156049 3133017 3108890
48976 3108890 3083596 3056381 3026738 2995096 2962454 2929621 2896939 2864551 2832785 2802172 2773032
48965 2773032 2745100 2717857 2691324 2666139 2642652 2620401 2598915 2578684 2560655 2544927 2530689
48954 2530689 2517545 2506230 2497639 2491611 2487085 2483192 2479884 2477737 2477537 2479939 2485125 2492641 2501661 2511468
48940 2511468 2521723 2532500 2544204 2557271 2571736 2587148 2603081 2619696 2637665 2657474 2678909
48929 2678909 2701240 2723879 2746915 2771037 2796919 2824570 2853209 2881800 2909760 2937210 2964662
48918 2964662 2992536 3021011 3050247 3080521 3112005 3144480 3177574 3211368 3246566 3283825 3323073
48907 3323073 3363647 3405035 3447209 3490346 3534495 3579628 3625771 3672984 3721305 3770699 3820894
48896 3820894 3871338 3921577 3971774 4022565 4074252 4126333 4177941 4228525 4277912 4325916 4372244
48885 4372244 4416787 4459707 4501070 4540396 4576672 4608907 4636789 4660800 4681542 4698942 4712301
48874 4712301 4721152 4725772 4726651 4723746 4716643 4705310 4690266 4671910 4649992 4623964 4593660 4559519
48862 4559519 4522275 4482568 4440784 4397136 4351899 4305555 4258616 4211274 4163313 4114430 4064613
48851 4064613 4014261 3964080 3914873 3867200 3821066 3776019 3731708 3688307 3646344 3606219 3568068
48840 3568068 3532053 3498523 3467761 3439600 3413465 3388922 3366178 3345943 3328700 3314164 3301550
48829 3301550 3290259 3280118 3271054 3262971 3256038 3250737 3247280 3245256 3244269 3244756 3247731 3253709 3262231 3272497
48815 3272497 3284112 3297093 3311527 3327440 3344759 3363203 3382396 3402255 3423077 3445120 3468285
48804 3468285 3492386 3517454 3543521 3570285 3597359 3624855 3653434 3683655 3715317 3747449 3778995
48793 3778995 3809595 3839780 3870247 3900981 3931356 3961099 3990681 4020512 4050133 4078689 4105912
48782 4105912 4132174 4157784 4182813 4207530 4232296 4256789 4279943 4301000 4320365 4339073 4357651
48771 4357651 4375793 4392919 4408723 4423136 4436027 4447044 4455782 4462105 4466167 4467925 4466682 4461449
48759 4461449 4451845 4438385 4421736 4401984 4378812 4352127 4322160 4289073 4252832 4213530 4171703
48748 4171703 4128168 4083612 4038268 3991898 3944155 3895046 3845179 3795526 3746971 3700009 3654781
48737 3654781 3611381 3570193 3531950 3497380 3466768 3439829 3416034 3395073 3377120 3362692 3352148
48726 3352148 3345336 3341949 3342145 3346376 3354384 3364923 3376945 3390614 3406449 3423837 3441398 3458854
48714 3458854 3477507 3498516 3521495 3545294 3569442 3594147 3619468 3645250 3671475 3697959 3723876
48703 3723876 3748298 3771098 3792851 3813992 3834642 3855078 3875683 3896463 3917306 3938732 3961781
48692 3961781 3987027 4014291 4043428 4074713 4108308 4144033 4182154 4223740 4269625 4319351 4371740
48681 4371740 4426399 4484078 4545571 4610700 4678402 4747445 4816973 4886694 4956727 5027039 5096910
48670 5096910 5165021 5230147 5291585 5348843 5401082 5447177 5486320 5518305 5543081 5560101 5568310
48659 5568310 5566798 5555356 5534407 5504561 5466307 5419943 5365722 5304224 5236779 5165298 5091330
48648 5091330 5015313 4937026 4856833 4776074 4696092 4617203 4539007 4461528 4385554 4311812 4240220
48637 4240220 4170264 4101828 4035251 3970661 3907743 3846329 3786747 3729256 3673463 3618814 3565554
$$ [...]
##END NTUPLES=NMR SPECTRUM
##END=
