
##TITLE=AC1306_DOMAH11118_6534518_o2wEnZixA4
##JCAMPDX= 6.0         $$ Bruker NMR JCAMP-DX V2.0
##DATA TYPE= NMR SPECTRUM
##DATA CLASS= NTUPLES
##ORIGIN= BRUKER
##OWNER= Administrator
$$ 1.72 TOPSPIN		Version 2.1
$$ 2012-07-16 23:14:46.343 -0500  Administrator@TOPSPIN
$$ Compression mode = diff/dup
##.OBSERVE FREQUENCY= 400.02188249412
##.OBSERVE NUCLEUS= ^1H
##.ACQUISITION MODE= SIMULTANEOUS (DQD)
##.ACQUISITION SCHEME= undefined
##.AVERAGES= 8
##.DIGITISER RES= 22
##SPECTROMETER/DATA SYSTEM= spect
##.PULSE SEQUENCE= zg30
##.SOLVENT NAME= COFFEE_meoh
##.SHIFT REFERENCE= INTERNAL, COFFEE_meoh, 1, 14.98509
##AUDIT TRAIL= $$ (NUMBER, WHEN, WHO, WHERE, PROCESS, VERSION, WHAT)
$$ ##TITLE= Audit trail, TOPSPIN		Version 2.1
$$ ##JCAMPDX= 5.01
$$ ##ORIGIN= Bruker BioSpin GmbH
$$ ##OWNER= Administrator
$$ $$ C:\Bruker\TOPSPIN/data/COFFEE/nmr/AC1306_DOMAH11118_6534518_o2wEnZixA4/10/pdata/1/auditp.txt
$$ ##AUDIT TRAIL=  $$ (NUMBER, WHEN, WHO, WHERE, PROCESS, VERSION, WHAT)
(   1,<2012-07-16 23:14:38.859 -0500>,<Administrator>,<TOPSPIN>,<go>,<TOPSPIN 2.1>,
      <created by zg
	started at 2012-07-16 23:13:32.187 -0500,
	POWCHK enabled, PULCHK disabled,
       configuration hash MD5:
       6B 1B 68 BB D9 2E 58 E2 7F 35 AD 54 07 DF 0E 41
       data hash MD5: 64K
       EA E6 D7 0B D9 AB EF 11 D2 95 BE 64 B0 F5 A6 CC>)
(   2,<2012-07-16 23:14:41.937 -0500>,<Administrator>,<TOPSPIN>,<proc1d>,<TOPSPIN 2.1>,
      <Start of raw data processing
       efp LB = 0 FT_mod = 6 PKNL = 1 PHC0 = 0 PHC1 = 0 SI = 32K 
       data hash MD5: 32K
       E8 7E 21 C4 0E E3 93 77 94 0E 7D 37 CD 69 B6 1B>)
(   3,<2012-07-16 23:14:42.312 -0500>,<Administrator>,<TOPSPIN>,<proc1d>,<TOPSPIN 2.1>,
      <pk PHC0 = 179.1211 PHC1 = 0 
       data hash MD5: 32K
       C2 34 C1 53 30 CA 6D 59 1A 92 D4 E6 E6 5B 86 B5>)
(   4,<2012-07-16 23:14:42.390 -0500>,<Administrator>,<TOPSPIN>,<proc1d>,<TOPSPIN 2.1>,
      <abs ABSG = 1 
       data hash MD5: 32K
       3B 4C 37 51 C5 C0 0A 2B E1 7D 2B 6E 97 44 D4 16>)
(   5,<2012-07-16 23:14:42.421 -0500>,<Administrator>,<TOPSPIN>,<proc1d>,<TOPSPIN 2.1>,
      <abs ABSG = 2 
       data hash MD5: 32K
       06 A1 20 A4 66 88 D0 3A 8C C2 30 A3 C4 EF 27 56>)
(   6,<2012-07-16 23:14:42.453 -0500>,<Administrator>,<TOPSPIN>,<proc1d>,<TOPSPIN 2.1>,
      <abs ABSG = 3 
       data hash MD5: 32K
       F7 D4 8C BE E2 46 55 55 D9 CE 90 AD BD 0B 69 7E>)
(   7,<2012-07-16 23:14:42.484 -0500>,<Administrator>,<TOPSPIN>,<proc1d>,<TOPSPIN 2.1>,
      <abs ABSG = 4 
       data hash MD5: 32K
       D6 DF 06 30 B9 E2 BF 81 2E 89 F3 8E DE C0 28 2F>)
(   8,<2012-07-16 23:14:42.515 -0500>,<Administrator>,<TOPSPIN>,<proc1d>,<TOPSPIN 2.1>,
      <abs ABSG = 5 
       data hash MD5: 32K
       8E EB CC 70 94 46 BF B1 42 04 19 B9 EF 6D DE A9>)
$$ ##END=
$$ 
$$ $$ hash MD5
$$ $$ 36 1B 96 83 F4 FC FF 4E 7D ED E6 17 DB 61 A5 45
##$RELAX= 
##$RELAX= 
##$RELAX= 
##$RELAX= 
##$RELAX= 
##$RELAX= 
##$RELAX= 
$$ Bruker specific parameters
$$ --------------------------
$$ [...]
150 150 150 150 150 150 150 150
##$TP07= 0
##$TPNAME0= <>
##$TPNAME1= <>
##$TPNAME2= <>
##$TPNAME3= <>
##$TPNAME4= <>
##$TPNAME5= <>
##$TPNAME6= <>
##$TPNAME7= <>
##$TPOAL= (0..7)
0.5 0.5 0.5 0.5 0.5 0.5 0.5 0.5
##$TPOFFS= (0..7)
0 0 0 0 0 0 0 0
##$TUNHIN= 0
##$TUNHOUT= 0
##$TUNXOUT= 0
##$USERA1= <user>
##$USERA2= <user>
##$USERA3= <user>
##$USERA4= <user>
##$USERA5= <user>
##$V9= 5
##$VALIST= <valist>
##$VCLIST= <CCCCCCCCCCCCCCC>
##$VD= 0
##$VDLIST= <DDDDDDDDDDDDDDD>
##$VPLIST= <PPPPPPPPPPPPPPP>
##$VTLIST= <TTTTTTTTTTTTTTT>
##$WBST= 2048
##$WBSW= 25
##$XGAIN= (0..3)
0 0 0 0
##$XL= 0
##$YL= 0
##$YMAX_a= 505361
##$YMIN_a= -647041
##$ZGOPTNS= <>
##$ZL1= 120
##$ZL2= 120
##$ZL3= 120
##$ZL4= 120
##$ABSF1= 14.98509
##$ABSF2= -5.573092
##$ABSG= 5
##$ABSL= 3
##$ALPHA= 0
##$AQORDER= 0
##$ASSFAC= 0
##$ASSFACI= 0
##$ASSFACX= 0
##$ASSWID= 0
##$AUNMP= <proc_prof1d_extract_pilot.lims>
##$AXLEFT= 0
##$AXNAME= <>
##$AXNUC= <1H>
##$AXRIGHT= 0
##$AXTYPE= 0
##$AXUNIT= <>
##$AZFE= 0.1
##$AZFW= 0.1
##$BCFW= 0
##$BC_mod= 0
##$BYTORDP= 0
##$COROFFS= 0
##$CY= 15
##$DATMOD= 1
##$DC= 0
##$DFILT= <>
##$DTYPP= 0
##$F1P= 0
##$F2P= 0
##$FCOR= 0.5
##$FTSIZE= 32768
##$FT_mod= 6
##$GAMMA= 0
##$GB= 0
##$INTBC= 1
##$INTSCL= 1
##$ISEN= 128
##$LB= 0
##$LEV0= 0
##$LPBIN= 0
##$MAXI= 10000
##$MC2= 0
##$MEAN= 0
##$ME_mod= 0
##$MI= 0
##$NCOEF= 0
##$NC_proc= -8
##$NLEV= 6
##$NOISF1= 0
##$NOISF2= 0
##$NSP= 0
##$NTH_PI= 0
##$NZP= 0
##$OFFSET= 14.98509
##$PC= 1
##$PHC0= 179.1211
##$PHC1= 0
##$PH_mod= 1
##$PKNL= yes
##$PPARMOD= 0
##$PPDIAG= 0
##$PPIPTYP= 0
##$PPMPNUM= 2147483647
##$PPRESOL= 1
##$PSCAL= 4
##$PSIGN= 0
##$PYNMP= <proc.py>
##$REVERSE= no
##$SF= 400.02
##$SI= 32768
##$SIGF1= 0
##$SIGF2= 0
##$SINO= 400
##$SIOLD= 32768
##$SPECTYP= <>
##$SREGLST= <1H.CDCl3>
##$SSB= 0
##$STSI= 32768
##$STSR= 0
##$SW_p= 8223.68421052631
##$SYMM= 0
##$S_DEV= 0
##$TDeff= 65536
##$TDoff= 0
##$TI= <>
##$TILT= no
##$TM1= 0
##$TM2= 0
##$TOPLEV= 0
##$USERP1= <user>
##$USERP2= <user>
##$USERP3= <user>
##$USERP4= <user>
##$USERP5= <user>
##$WDW= 1
##$XDIM= 32768
##$YMAX_p= 468581588
##$YMIN_p= -675555
##$CURPLOT= <Network HP LaserJet P1505>
##$CURPRIN= <$Network HP LaserJet P1505>
##$DFORMAT= <normdp>
##$LAYOUT= <+/1D_H.xwp>
##$LFORMAT= <normlp>
##$PFORMAT= <normpl>
##$SURQMSG= 1
$$ End of Bruker specific parameters
$$ ---------------------------------
##NTUPLES= NMR SPECTRUM
##VAR_NAME=  FREQUENCY,     SPECTRUM/REAL,   SPECTRUM/IMAG
##SYMBOL=    X,             R,               I
##VAR_TYPE=  INDEPENDENT,   DEPENDENT,       DEPENDENT
##VAR_FORM=  AFFN,          ASDF,            ASDF
##VAR_DIM=   32768,         32768,           32768
##UNITS=     HZ,            ARBITRARY UNITS, ARBITRARY UNITS
##FACTOR=    0.250966925370066, 1,           1
##FIRST=     8223.43324360094, -85464,       -137725
##LAST=      0,             -39533,          -115259
##MIN=       0,             -675555,         0
##MAX=       8223.43324360094, 468581588,    0
$$ Real data points
##PAGE= N=1
##DATA TABLE= (X++(R..R)), XYDATA
$$ [...]
19553g7682A43425a13912b1169l38010e8669l33886a82587I990c61976d4187k20076
19542b64263a22110A9891q967c4072A2910b0310I9794N1111P3563I4946b43179
19530A83141J23132a88887a9492k39053a6895j11948m40183a66922b0386k49261
19520b69647B13752C2355K57348a27575B36126o6552h2786m3781A19457L24360
19510D43817d6820n8816a0235k5368D09282F896J94860e7861l9325p9476G9464
19498C10251D7146b6473A81899a58197c941l4839D22780B0227a51365A26941m3476
19487H3465Q153j6290L7537C5892a81268q1148M6325j42185a14227j31878B12185
19475c7661B36147c1484l48453H5752c7588A86274c22321a0348O20H3681d13985
$$ y = [-77682, 143425, -113912, -21169, -359179, -58669, -392555, -182587, 9990, -361976, -44187, -264263, -122110, 19891, 10924, -34072, 12910, -20310, 99794, 150905, 224468, 94946, -243179, 183141, 306273, -188887, -19492, -258545, -16895, -128843, -569026, -166922, -20386, -269647, 213752, 32355, 289703, -127575, 236126, 169574, -82786, -126567, 119457, 443817, -46820, -105636, -10235, -35603, 409282, 6896, 201756, -57861, -97186, -176662, 79464, 310251, 47146, -26473, 181899, -158197, -3941, -38780, 422780, 20227, -151365, 126941, 83465, 91618, 75328, 112865, 35892, -181268, -262416, -216091, -358276, -114227, -246105, 212185, -37661, 236147, -31484, -379937, 85752, -37588, 186274, -322321, -10348, -9728, 83681, -413985]
19463C5478K6029J4276a25474o4815n6457R3039B4947P4239b46279j61835D5247
19451f0500K1990F59f7818j09277P5883q1956A82374f7466B31291d9824A25472
19439b36944J07602j03697p3453d598k97717m9413i7233H2142P3385a49169A38778
19427e2684j77941f7209k71406J48059e9863p4683M7710l033o2825I3291d4644
19415b37742p0379I4678c1401B04076D6575J11764i7513j84179d4279j47028f9859
19403h4998j01621B3304b10979i2428B8762h3291k23014g9992k12634g3628C7902
19391D5420J43558b21214k19697J99097J17991k14456g8165l88423J54441a44533
19380b18758B20700D2727L26543A80772c75818g3071K3119A29136b43521B90052
$$ y = [35478, 61507, 75783, -125474, -190289, -246746, -153707, 24947, 99186, -246279, -408114, 45247, -60500, -38510, 659, -67818, -177095, -101212, -183168, 182374, -67466, 231291, -49824, 125472, -236944, -129342, -233039, -306492, -4598, -302315, -351728, -97233, 82142, 155527, -149169, 138778, -52684, -230625, -67209, -338615, -190556, -59863, -134546, -86836, -89869, -152694, 93291, -44644, -237742, -308121, 94678, -31401, 204076, 46575, 158339, -97513, -281692, -44279, -191307, -69859, -84998, -186619, 23304, -210979, -92428, 28762, -83291, -306305, -79992, -292626, -73628, 37902, 45420, 188978, -221214, -440911, -241814, -123823, -338279, -78165, -466588, -312147, -144533, -218758, 220700, 42727, 369270, 180772, -375818, -73071, -49952, 129136, -243521, 290052]
19369A76435a2379d480l5311j64095A28906B340J80564a78105O8891k46476A34761
19357B32195c3164j7811j17466A41763a2423D1746j8490a54960j34754k1069a37901
19345A72988B836b91187A10980a7552l34568k13477B52400a98010g6302j40464
19335b16766A78421p5713a03952a7073l41696a07121C47477j63980a72084m5158
19325b17242j71267A41623A9447g9214K4598E3108N3397a11941A0583c4077n68
19314c4645p93n155n7387A1801b5488A19728e2218k83416C22888a46688l39372
19303d86060a98539d8077m25454A32620d46739A46208J28286B8049e2274B13104
19292A74760a09228C4781a6478j12722j4589B40882f4144k92929A95264a7065
$$ y = [176435, -12379, -4480, -39791, -203886, 128906, 2340, 182904, -178105, -109214, -355690, 134761, 232195, -33164, -50975, -168441, 141763, -12423, 41746, 23256, -154960, -289714, -310783, -137901, 172988, 2836, -291187, 110980, -17552, -352120, -565597, 252400, -198010, -76302, -216766, 178421, 102708, -103952, -17073, -358769, -107121, 347477, 183497, -172084, -217242, -388509, 141623, 19447, -79214, -54616, 53108, 106505, -111941, 10583, -34077, -34645, -35438, -40593, -97980, 11801, -25488, 119728, -52218, -335634, 322888, -146688, -486060, -198539, -48077, -473531, 132620, -446739, 146208, 274494, 28049, -52274, 213104, 174760, -109228, 34781, -16478, -129200, -143789, 240882, -64144, -357073, 195264, -17065]
19281C20793q7168a56220M518A38396n2042J18065f9786q1219c5352k09806I3851
19269h3241C41647b3732j92352M2049A90024c11386a03358B07348b28191c6049
19258D498a99391h2366I558K05655b94184A33060L4523g3072A49993a15531A46897
19246g2206A3564c6351k51830c4850j08034B79156b9361A23212h3443l46094a71962
19234B2000a39594B01864f2248k0367r8307I1299k397K3794c5918j08702o0354
19223b04974K8199A2128e8992l04255a33014E3267A2246a99441q656k4110A45999
19211f9049A68118a48088q6326A34554k4541m4626g1961k05840A09930K56185
19201C66115E3178L01357b65954k6105e5786m4637o7101n4714L7729F408J22041
$$ y = [320793, 233625, -156220, -151702, 138396, 86354, 204419, -69786, -151005, -35352, -245158, 93851, -83241, 341647, -23732, -216084, -174035, 190024, -311386, -103358, 207348, -228191, -36049, 4498, -199391, -82366, 9558, 215213, -294184, 133060, 167583, -73072, 149993, -115531, 146897, -72206, 13564, -36351, -288181, -34850, -142884, 279156, -29361, 123212, -83443, -429537, -171962, 22000, -139594, 201864, -62248, -82615, -180922, 91299, 88902, 112696, -35918, -144620, -204974, -176775, 12128, -58992, -363247, -133014, 53267, 12246, -199441, -208097, -232207, 145999, -69049, 168118, -148088, -234414, 134554, 110013, 65387, -71961, -277801, 109930, 366115, 53178, 354535, -265954, -292059, -55786, -100423, -167524, -222238, -184509, 6408, 128449]
19190A28449c3095l72442A71712q0008C3233b26391k24858A24491J1282L4879
19180A70652b49021A65676a95912C9808b30853B89817H5405b5575A36752i7324
19169B6034J4058b17470k65409a62545q3033B09396o0587J1676d53649c3758E9435
19157b4063j16301L9996n978j50796R4199j0583G3925j6375e8786j73244A3333
19145A19213a34911m8564D85172a36201m34576a48501l3888a9858H6504b08093
19134a96381E7905a70409P0246l7033K4213m1302j96766a43884A32468b80665
19123f2374J2591r6575k4003a1112l32383A20975b63949H349a48425j9397p2256
19112b40078M2979A83232b99824b865A39612a14963B6320J28344b3519A1236K9495
$$ y = [128449, -33095, -405537, 171712, 91704, 33233, -226391, -451249, 124491, 135773, 170652, -249021, 165676, -195912, 39808, -230853, 289817, 85405, -25575, 136752, -97324, 26034, 40092, -217470, -482879, -162545, -245578, 209396, 148809, 160485, -453649, -33758, 59435, -24063, -140364, -100368, -106346, -257142, -162943, -173526, 73925, 57550, -58786, -232030, 13333, 119213, -134911, -183475, 485172, -136201, -570777, -148501, -182389, -19858, 86504, -208093, -196381, 57905, -170409, -100163, -137196, -112983, -154285, -351051, -143884, 132468, -280665, -62374, -49783, -146358, -170361, -11112, -343495, 120975, -263949, 8349, -148425, -167822, -240078, -197099, 183232, -299824, -2865, 139612, -114963, 26320, 154664, -23519, 11236, 40731]
19101D0731A9109a56363k76l6112I2050a95462b5243n0831G4153M6293a5794j02480
19089a18274A78924g0042I5539c82826a29609a7690j04645A39565a03271B47781
19078C8593b24551j27861O9569M2146f9019k86431J71219N7765B34862a21627
19067b4118C3037J7387K17984b12999E4828b72825a22120E0186H582a84985f1007
19055c53549a33164B6358i9865F3775a00086j0100c7561D6591c50973f6582A47410
19043b93032C1608M3906c8593A39931a30809o0481k2360E8171a08335E8044A5952
19031A2672J33637L2259B3797L7589a32287e7429q6558a5459C49737N6401e8635
19019a54909J6534H5082f3924j02160j41063J08025a8151A6525G705a10923j39456
$$ y = [40731, 19109, -156363, -156639, -192751, 92050, -195462, -25243, -76074, 74153, 120446, -15794, -118274, 178924, -70042, 95539, -382826, -129609, -17690, -122335, 139565, -103271, 247781, 38593, -224551, -352412, -282843, -240697, -69019, -355450, -184231, -126466, 234862, -121627, -24118, 33037, 50424, 268408, -212999, 54828, -272825, -122120, 50186, 8582, -184985, -61007, -353549, -133164, 26358, -99865, 63775, -100086, -110186, -37561, 46591, -350973, -66582, 147410, -293032, 31608, 75514, -38593, 139931, -130809, -191290, -213650, 58171, -108335, 58044, 15952, 12672, 146309, 178568, 23797, 61386, -132287, -57429, -143987, -15459, 349737, 406138, -58635, -154909, -138375, 85082, -63924, -166084, -307147, -199122, -18151, 16525, 7705, -110923, -250379]
19008b50379J04484J6764b7761G20J38339l7110J20227h9789c3360E8090R4494
18997A52584a53575m0942I227a31988B47687D845e8289I3135Q6447d09630B13874
18985a30298O3753j32923A68488h0782k6003Q690J5468n0232F3227h3693C77792
18973C73330a88812P3707J4176j30846n3140J03417j18772I275J57582a47764
18962b70551C02905e5711a0186j75904a1720l000k57280P4551l5936j0804F4914
18950A33997a71719j20383b4046n9301A29165n1778J42453n3505N701b19186N5888
18939a63298g5969B5779M2779d86827b0507A671K85400a93607J2133g5995k68646
18928c44641b1390o8637j51673D6297h7979b0543E6079b19604G9637E974J43034
$$ y = [-250379, -145895, -129131, -27761, 720, 139059, 101949, 222176, -89789, -33360, 58090, 152584, -153575, -194517, 9227, -131988, 247687, 4845, -58289, 93135, 179582, -409630, 213874, -130298, -66545, -199468, 168488, -80782, -106785, -98095, -82627, -132859, 63227, -83693, 377792, 373330, -188812, -115105, -100929, -231775, -284915, -181498, -300270, 9275, 166857, -147764, -270551, 302905, -55711, -10186, -186090, -11720, -14720, -272000, -197449, -233385, -244189, 64914, 133997, -171719, -292102, -24046, -83347, 129165, 77387, 219840, 166335, 172036, -219186, -163298, -75969, 25779, 68558, -486827, -20507, 1671, 287071, -193607, -181474, -75995, -344641, -21390, -90027, -241700, 46297, -87979, -20543, 56079, -219604, 79637, 5974, 149008]
18917A49008b24007R2702a206j33045B75469f9596l12932a0166k73401e0294C62455
18905a02992c8133E6221i1194j41296F2566L50412f4579O244m3414j0371j7167
18894a29287l5668a5324B32610i8340k4514l1968N8856A8336a66782b1539n5848
18883g7387a3003n3500J3363l6530p2181O8277j26459Q5424B19479G4694c34740
18871A412i3234n7226B59409a78367M9902B51694c5168r7517A89931g9706A53419
18859B3579a05700l80589G6089a50323f2049b8500j50223B89908b9776q1120A92640
18847G3580a97586e389k9803A31845a32285r5277a12498F4461B2123a75294B7355
18835b01671A64633k28J12867j17749a13553H511b82397A36574J28083Q9678b0292
$$ y = [149008, -224007, -131305, -1206, -134251, 275469, -69596, -382528, -10166, -283567, -50294, 362455, -102992, -38133, 56221, -91194, -232490, 62566, 412978, -64579, -58335, -101749, -112120, -129287, -164955, -15324, 232610, -98340, -122854, -154822, -95966, 18336, -166782, -21539, -77387, -13003, -66503, -53140, -89670, -161851, -93574, -220033, -134609, 219479, 74694, -334740, 1412, -93234, -150460, 259409, -178367, -128465, 251694, -35168, -132685, 189931, -79706, 153419, 23579, -105700, -486289, 76089, -150323, -62049, -28500, -178723, 289908, -29776, -110896, 192640, 73580, -197586, -5389, -35192, 131845, -132285, -227562, -112498, 64461, 22123, -175294, 27355, -201671, 164633, 164405, 277272, 159523, -113553, 8511, -282397, 136574, 264657, 354335, -20292]
18823a14244A38709a34630A17254A654N4168K87688K05014c4076C3714c67683
18812b02985o9531f7636B11193o7588J5188b16851Q2773G858c1112A21749C8585
18800a42647a2304E0754J01824b02701p7180R1051A34273m7782a02941k8868j32825
18789b64634a7314C7573d15476a80020j40853G0505J09231G497a6028p6566j74302
18778b66896J26339M4521j22602H2376c08251J5238I6063g8557A75909a40413
18767b79757B5290P6748J08952b4249j74253i9074j08083B5213b23705M1396J2709
18756a69600g6626l5551A93343o6108L0741a00650n3410a1924m05410B26947k8816
18745A98131a15124F2132K9924b56486F4080b73507h3755j26068q9451L4661C20953
$$ y = [-114244, 138709, -134630, 117254, 1654, 55822, 343510, 548524, -34076, 33714, -367683, -202985, -272516, -67636, 211193, 143605, 158793, -216851, -134078, 7858, -31112, 121749, 38585, -142647, -12304, 50754, 152578, -202701, -279881, -188830, 134273, 86491, -102941, -131809, -264634, -17314, 37573, -415476, -180020, -320873, 70505, 179736, 7497, -16028, -92594, -266896, -140557, -96036, -218638, 82376, -308251, -293013, 96063, -78557, 175909, -140413, -279757, 25290, 102038, 210990, -24249, -198502, -99074, -207157, 25213, -223705, -182309, -169600, -76626, -112177, 193343, 127235, 157976, -100650, -154060, -11924, -417334, 226947, 198131, -115124, 62132, 92056, -256486, 64080, -273507, -83755, -209823, -299274, -264613, 320953]
18733a74181N4425D1275b43264J08017j53254b0286q4093r6163R4886q6420F9718
18721a3941j36199e1751A86544k8875c06135l69420f2007K1497o3370E8772b79244
18709c08299d8490l77014B9904L6787a37353B5823a11671m0404D18391B5350g0365
18697d3652j28944q6869A04705e6899A08057a5984E4081M4803J02793n3028a63238
18685b71317m2860R1323I0612J63267b05817Q6450o3003E2489c61499b7070A56704
18673h5422P675p8039N3242q233l0565d035k02825F3950c0245D255a22969B45818
18660A22535a4042k79A21161a34201O0385m89j13547L4469g356H1185J51056a34045
18647b42183P1056M1533A9126a05499k58657j0832f9204B8346a00100j77222J00583
$$ y = [-174181, -119756, 41275, -243264, -135247, -288501, -20286, -104379, -200542, -105656, -192076, 69718, -13941, -150140, -51751, 186544, 157669, -306135, -675555, -62007, -40510, -103880, 58772, -279244, -308299, -48490, -425504, 29904, 66691, -137353, 25823, -111671, -152075, 418391, 25350, -70365, -43652, -172596, -259465, 104705, -56899, 108057, -15984, 54081, 98884, 201677, 148649, -163238, -271317, -314177, -222854, 90612, 253879, -205817, -119367, -182370, 52489, -361499, -27070, 156704, -85422, -77747, -155786, -102544, -110777, -141342, -4035, -206860, 63950, -30245, 4255, -122969, 245818, 122535, -14042, -14321, 121161, -134201, -73816, -74305, -187852, -153383, -7356, 81185, 232241, -134045, -242183, -171127, -129594, 19126, -105499, -364156, -374988, -69204, 28346, -100100, -277322, -176739]
18636a76739G636c20720J3121J9523J09759a8827C00395p6041J715A04946a60782
18624c28838H0057c25156P5741B36563b50439D506J20222C7525c2755B82875c2141
18612a29945C0435e957k29933M0947B23990F5222b46911A50592A380i6295B14003
18600a04669M1831j3387p750b4180A08869f6031A69264b91703m5176A8068a9804
18588a58433B73395F1355a67924B99825q989j08020a38519K8136C7406a44960
18577b1090B05543B8825o901a03406c1817K66I526J73839h1758K6627n4625k01780
18565c11536q9033a70867M9111A11712J25953b17545i3750D5633A9526a07715
18554a85263M198b8701D0080J00790m1464k6037a09052I4797b04766d3166j42947
$$ y = [-176739, 7636, -320720, -307599, -288076, -178317, -18827, 300395, 224354, 226069, 104946, -160782, -328838, 80057, -325156, -249415, 236563, -250439, 4506, 124728, 37525, -32755, 282875, -32141, -129945, 30435, -5957, -235890, -194943, 223990, 65222, -246911, 150592, 1380, -96295, 214003, -104669, -62838, -76225, -83975, -24180, 108869, -66031, 169264, -291703, -336879, 18068, -19804, -158433, 273395, 61355, -167924, 299825, 290836, 182816, -138519, -110383, 37406, -144960, -21090, 205543, 28825, 21924, -103406, -31817, -31551, 9526, 183365, -81758, -55131, -109756, -311536, -400569, -170867, -121756, 111712, 237665, -217545, -93750, 45633, 19526, -107715, -185263, -181065, -28701, 40080, 140870, 99406, 73369, -109052, 94797, -204766, -43166, -186113]
18543a86113H7563J303R464b434A08935l8644a70604j98342a9998q7925A20220
18531g7851j14029P0741k43304b1193m8191m0042C6817O4622D9151a54607A29686
18519e41360a96494a876F3129J61428b07874g9857q5891j06368b8041H1139P8895
18508A60034f861A41722b39316a7110k22914M181a01700C5557Q8545i6800j77831
18497b74631D6552b19220e5973C25361c6693l66737i4766D5368c70026a11013
18486c27038J58716k18156J05226l816i8684F2779A7444e4583j85463A79466i6581
18474A54907K90482d357p2603l0656A00684k0008b89982A16467a35707G3756a63339
18462A70892D5b49919j40298b0722j88233r1949A71451f4217j85931A50398a87406
$$ y = [-186113, 87563, 88866, 98330, -2434, 108935, 70291, -170604, -368946, -19998, -107923, 120220, -77851, -191880, -121139, -364443, -21193, -69384, -109426, 36817, 101439, 49151, -154607, 129686, -541360, -196494, -1876, 63129, 224557, -207874, -79857, -165748, -272116, -28041, 81139, 160034, -6861, 141722, -239316, -17110, -240024, -235843, -101700, 35557, 124102, -96800, -274631, 46552, -219220, -55973, 325361, -36693, -403430, -94766, 45368, -370026, -111013, -327038, -168322, -386478, -281252, -285068, -98684, 62779, 17444, -54583, -240046, 179466, -96581, 154907, 445389, -4357, -76960, -107616, 100684, 80676, -289982, 116467, -135707, 73756, -163339, 170892, 45, -249919, -390217, -20722, -208955, -300904, 171451, -64217, -250148, 150398, -187406]
18450a29651C10410c51388a1943r9700b747j72320A23831j209c77367F3649g5190
18438A91968b8581j19994j19439a22462F7889J09015d1016d253j40439K1764J3800
18427a09128d0979j88350k8699I8808a37755c3146E799a72548h0265j19603A05602
18415a27282D3026K02905a28502B09447d1053l23152G9479d2301B18625J15879
18405C34504F5268Q5805a31250A2393J65431f350q6381k24134g9151n147A02924
18393D4129b01293j743N1146A37093e4080F8540d0928l84739O4105B13328a97619
18381b99679h2159K8653j26551e3123C52903e2577A28053a28058c7162B05816
18370A47889a34738N3396c2895H7926J13350I1225a05738H1632K04814F4957K62546
$$ y = [-129651, 310410, -351388, -11943, -111643, -2747, -175067, 123831, 122622, -377367, 63649, -75190, 191968, -28581, -148575, -268014, -122462, 67889, 176904, -41016, -4253, -144692, -122928, -109128, -40979, -229329, -258028, 98808, -137755, -33146, 5799, -172548, -80265, -199868, 105602, -127282, 43026, 245931, -128502, 209447, -41053, -364205, 79479, -42301, 218625, 334504, 65268, 151073, -131250, 12393, 177824, -6350, -92731, -316865, -79151, -84298, 102924, 44129, -201293, -203036, -151890, 137093, -54080, 68540, -40928, -425667, -361562, 213328, -197619, -299679, -82159, -53506, -180057, -53123, 352903, -52577, 128053, -128058, -37162, 205816, 147889, -134738, -81342, -32895, 87926, 201276, 91225, -105738, 81632, 286446, 64957, 327503]
18359C27503A40912c36583J60703P4045j36453h8938l7630j16556i4778H5627
18348a296C9440a68913e4850B17008p9975b49375K216O6541h7614p2049H46b5018
18335A05982d9723k43633A21134c93654C4793K16870a29345B10305a90316A48638
18324a70722k4355F7836K40585g2953C7695a70482j5340k8521C89220j41012c5280
18312b84431I4864a40481f4068A79602b63219A3479J55015a57895f6982l70140
18302d37122A73418c63949F9323c42769B554K77562b51534O7566d0620r9738o5623
18291b05981A52373g3747A04571a68591e2079F5163a6227n8088C88043A4554f713
18279A11877h4181n1695C35440g5204o9952K4644k1793k44248i491E4410b06188
$$ y = [327503, 140912, -336583, -175880, -101835, -238288, -88938, -126568, -243124, -94778, 85627, -1296, 39440, -168913, -54850, 217008, 137033, -249375, -247159, -180618, -87614, -159663, 846, -25018, 105982, -49723, -293356, 121134, -393654, 34793, 251663, -129345, 210305, -190316, 148638, -170722, -195077, 67836, 308421, -72953, 37695, -170482, -185822, -214343, 389220, 248208, -35280, -284431, 94864, -140481, -64068, 179602, -263219, 13479, 168494, -157895, -66982, -437122, 173418, -363949, 69323, -342769, 2554, 280116, -251534, -183968, -40620, -140358, -205981, 152373, -73747, 104571, -168591, -52079, 65163, -16227, -74315, 388043, 14554, -6713, 111877, -84181, -135876, 335440, -75204, -145156, -120512, -142305, -386553, -9491, 54410, -206188]
18267c2566l5613D3760A6259a57905A35452D5703c48474e0299I714a24454k35538
18256c59992B62050B2597b2592j87823Q6073O1052o4932j00239a0951k86996b6383
18244b7384A944J97091e0070j0277K2266j63697k66394b05977A6950B238b2570
18232b9137o9024B43102r2578a04234A50879e140A68843J82167A02414a50871
18221d6685C2729a14182m19240f1117b694F126b4100r652a4063A24474f7483H3719
18208g6611A60178c0262k21910R6082B97867b1273j30896B8331e0108j78061P2970
18197a55199A29412e4358K4189q7132l7388A36866D37h6611k13393C8350K300
18186D0650b02614H9559a93499P4465F1898h4885A89706i4359I0023L41273d5531
$$ y = [-32566, -68179, 43760, 16259, -157905, 135452, 45703, -348474, -50299, 9714, -124454, -359992, 262050, 22597, -22592, -210415, -124342, -63290, -128222, -228461, -10951, -297947, -26383, -27384, 1944, 199035, -50070, -60347, -38081, -201778, -468172, -205977, 16950, 2238, -22570, -29137, -98161, 243102, 150524, -104234, 150879, -5140, 168843, 351010, 102414, -150871, -46685, 32729, -114182, -533422, -61117, -2694, 6126, -24100, -33752, -14063, 124474, -67483, 83719, -76611, 160178, -30262, -252172, -156090, 297867, -21273, -152169, 28331, -50108, -228169, -155199, 129412, -54358, -30169, -117301, -154689, 136866, 437, -86611, -300004, 38350, 40650, -202614, 89559, -193499, -119034, 61898, -84885, 189706, -94359, 90023, 431296, -45531]
18174A57205o0468i0431C82O4794Q9846b66548B35770a98115A47992b04941C078
18162A14390E5892a86284A32561K42065a2945p962O624A26224b70286a7120A49476
18150B57711g1735k84579F1098N6059b12238D6011Q3742K7882b04738P5503j21426
18139b50661J09583G5930b6781l89049C5664b01489N1775G3508a78902p7120J09738
18128a46284F1257P4016l9572a25614B5966a8608j26138o3211g4392j04867F44
18116a14196m3404r7714D1862j4716g2930E7407A4859K00012G1985L5900k6373
18105H1512g3657p9344k12968N2115J38746G1264B4895a04312k7540L9940A41472
18093h7999o08H5888d3320j80583f4692B96311h6519G6327a57256Q089q3036A17764
$$ y = [157205, 96737, -90431, 382, 65176, 155022, -266548, 235770, -198115, 147992, -204941, 3078, 114390, 55892, -186284, 132561, 374626, -12945, -20907, -14283, 126224, -270286, -17120, 149476, 257711, -71735, -356314, 61098, 117157, -212238, 46011, 129753, 157635, -204738, -129235, -250661, -141078, 75930, -26781, -415830, 35664, -201489, -149714, 73508, -178902, -256022, -146284, 61257, 135273, 95701, -125614, 25966, -18608, -144746, -207957, -74392, -179259, 644, -114196, -157600, -255314, 41862, 27146, -72930, 57407, 14859, 214871, 71985, 107885, 81512, -73657, -153001, -365969, -313854, -175108, 71264, 24895, -104312, -131852, -91912, 141472, -87999, -88607, 85888, -43320, -223903, -64692, 296311, -86519, 76327, -157256, -149167, -232203, 117764]
18080A85842c34453D5599a40513H5732A9617f3096b5415j42839E4608a246j92592
18069a93838A51708p5813a39890c3470i956k11153C9659N0412K9396a25855L5152
18058i0703E8720b1623A70590b02639J7010A04878i9114j04174b1649E95f0411
18046a18419k24921A79757G8254b4357n7170a6417l33302P6999K8993A89875D0504
18034f2472C78966b73381B29941a92711J7979A47792d05069F376a36125I6387
18023a376l06664A74759A1613c6729p8775k0275A89857B214Q6130a81870A85236
18011b04009Q3125D1230c15959B6458J14376b05994q0310C1703a01664L0599b1075
17999A22897K6286B8801a25269l95403A5948i6267C18327d2627l2733C15446b68845
$$ y = [185842, -334453, 45599, -140513, 85732, 19617, -63096, -25415, -168254, 54608, -1246, -193838, 151708, 75895, -139890, -33470, -9956, -221109, 39659, 90071, 119467, -125855, -90703, 58720, -21623, 170590, -202639, -185629, 104878, -99114, -203288, -21649, 595, -60411, -118419, -343340, 179757, 78254, -24357, -81527, -16417, -349719, -272720, -243727, 189875, 40504, -62472, 378966, -273381, 229941, -192711, -174732, 147792, -405069, 6376, -136125, 96387, -1376, -308040, 174759, 11613, -36729, -115504, -135779, 189857, 2214, 88344, -181870, 185236, -204009, -120884, 41230, -315959, 26458, 140834, -205994, -286304, 31703, -101664, -71065, -21075, 122897, 149183, 28801, -125269, -520672, 15948, -96267, 318327, -42627, -75360, 315446, -268845]
17987b5014B90574b54518R5527b909j09928n6308o0077G1317a08776A0732J27077
17976A37809f214k6884B07951C3372b953p7934j62998N7125b5212l04812A91026
17964A09556f2902j49981J05967A0361a94916A8800b007B747R093a42826A76440
17952A87652n847b45898A94470O1432e8863o9483C42429A31173F3967b295I0432
17940a08400A95451O2302c33707a14180A67048a96628g4488o6936A071h7001l6996
17929a23997B83174a46925c1855l8278k2106l4265a2141B84693A391Q0963M2684
17918A25038K84177A28327d79q9544K6438I4282b83272H4403a79536o065A78302
17906a46308G341K4058f7262K4004q7879B18943e3858j35993B27135B606a97225
$$ y = [-25014, 290574, -254518, -158991, -2909, -112837, -169145, -229222, 71317, -108776, 10732, 137809, -6214, -33098, 207951, 33372, -2953, -80887, -243885, -186760, -25212, -330024, 191026, 109556, -62902, -212883, -106916, 10361, -194916, 18800, -2007, 2747, 11840, -142826, 176440, 187652, 181805, -245898, 194470, 255902, -58863, -128346, 342429, 131173, 63967, -2295, 90432, -108400, 195451, 257753, -333707, -114180, 167048, -196628, -74488, -141424, 1071, -87001, -123997, 283174, -146925, -31855, -70133, -92239, -126504, -12141, 284693, 1391, 82354, 125038, 409215, 128327, -479, -90023, -63585, 94282, -283272, 84403, -179536, -185601, 178302, -146308, 7341, 31399, -67262, -43258, -131137, 218943, -53858, -189851, 227135, 2606, -197225]
17894a4894H7265J27873n7344R232f2438k91248E942b22096Q3502D53419G9759
17882b03981a2440o61164b92662f9714j69242j5331e8101D0509J7854r385B0926
17870D4392b16596K8457C5693e1805A54640p4525B1782g3385A41026C7147J66053
17859B03200i9059j36800B9834J32202a09966B85373e0961j77148A09286b34294
17848a50099D1092b53529A90536i0014B99256a91326H5814J71808a24270F0917
17837B80724B5003b0764l19935b6463f381B37857H5070h274k4441N883j73342
17826b00174H8356J86277i2603E4837B5353M706J11763b54713f387l23540i8664
17814a87052d877r9648B04106g2906A17176a09876p117B4839J66101o7749b71917
$$ y = [-14894, 87265, 215138, 157794, 167026, -62438, -353686, 5942, -222096, -138594, 453419, 79759, -203981, -12440, -673604, -292662, -69714, -238956, -254287, -58101, 40509, 58363, 48978, 20926, 44392, -216596, -188139, 35693, -51805, 154640, 80115, 21782, -73385, 141026, 37147, 203200, -99059, -235859, 29834, 162036, -109966, 285373, -50961, -228109, 109286, -234294, -150099, 41092, -253529, 190536, -90014, 299256, -191326, 85814, 257622, -124270, 60917, 280724, 25003, -20764, -340699, -26463, -6381, 237857, 85070, -8274, -32715, -26832, -200174, 88356, 274633, -92603, 54837, 25353, 30059, 141822, -254713, -6387, -329927, -98664, -187052, -4877, -104525, 204106, -72906, 117176, -109876, -116993, 24839, 190940, 123191, -271917]
17802I4038a72254k0789A45422n4118J55881h0241D7269J82642a48831B1759M5187
17791F6946b24262D2206a11968A22985d8802H5369Q5242H3944g9126m3170B1533
17779c22070A23515J05701k7963n8755C2248a66467A14952a98115M9831H8014
17768E7241a31717A65073G7949b83377A5687b02576B3134K83499c1354j67453
17758a98807e3676D508K61359c59865J64773B82961j20810P7881b81503F9738
17747E5827B310Q8465a49640a268D06810a13458C3807b78273D70287a47573g1856
17735A47794G0167a78613c8456l2725F7634b42830G5553a17206E2027J18497q1496
17724H9028P1086b5003A24790J56586n8234K4413F4460a67234A90433n9866a22655
$$ y = [94038, -172254, -193043, 145422, 91304, 247185, -80241, 47269, 229911, -148831, 21759, 66946, -224262, 42206, -111968, 122985, -48802, 85369, 170611, 83944, -79126, -122296, 21533, -322070, 123515, 229216, 201253, 142498, 32248, -166467, 114952, -198115, -148284, 88014, 57241, -131717, 165073, 77949, -283377, 15687, -202576, 23134, 306633, -31354, -198807, -53676, 4508, 265867, -359865, -195092, 282961, 162151, 240032, -281503, 69738, 55827, 2310, 90775, -149640, -1268, 406810, -113458, 33807, -278273, 470287, -147573, -71856, 147794, 70167, -178613, -38456, -71181, 67634, -242830, 75553, -117206, 52027, 170524, 89028, 160114, -25003, 124790, 281376, 223142, 247555, 64460, -167234, 190433, 130567, -122655]
17712A9315K25874i5299j94817F1148P3960C9566d4108A05875R7369b42387a19778
17700B1214a99644A52186P4683I0279p348a56330g6557j56274d3182j38133K9807
17689a51508L0567A13543k1302f180k16687F3722a41758d3219P58n5556A79027
17677A05429J1345e1731R706k217K865F1321a80224r2921R6977A06943i6151B61391
17664A43312e3883r0083k81861B68033A28095e4335j05205j09334a1216h58A43372
17652E9503f3567G3188B1933d8473C5758K92864a92370J9177E1842i4575L7234
17641e7341K4661A72073L7849C286K45980h1411q5883c69B49605d33455f332A65402
17628c46708C0242a94030A40549R9612F6475c374A16714J28797c40222A08409
$$ y = [19315, 245189, -95299, -290116, 61148, 135108, 39566, -44108, 105875, 203244, -242387, -119778, 21214, -199644, 152186, 226869, 90279, 82931, -156330, -76557, -232831, -43182, -181315, -151508, -120941, 113543, 92241, -6180, -222867, 63722, -141758, -43219, -42461, -98017, 179027, 105429, 116774, -51731, -42025, -44242, -41377, 61321, -180224, -273145, -176168, 106943, -96151, 261391, 143312, -53883, -143966, -425827, 268033, 128095, -54335, -159540, -268874, -11216, -858, 143372, 59503, -63567, 73188, 21933, -48473, 35758, 328622, -192370, -173193, 51842, -94575, -57341, -32680, 172073, 209922, 3286, 249266, -81411, -167294, -369, 249605, -433455, -6332, 165402, -346708, 30242, -194030, 140549, 240161, 66475, -3374, 116714, 245511, -340222, 108409]
17617C5300M9317J31480R4845m4767I5631j2916a30460H7688b29110B84553D0990
17605A10492b40829C63353a29514L6967a1765D11832j79574b7541m117C05152
17594H863b56495b6964j68976B96346A8735b51662E0326P2272J70333C3487P4902
17583A08389m5596o880a82290D8598b94810H0829A4255b4329A93963R069j6374
17572A86658A167b09106F5356K23519b82416J16023e7685A38303n9138d0375o7804
17561a08179L4005p8593l3431A09119k3545C2831J3108L8192j5698J66175I0760
17549C80842e3061B412b25289b7808j684I4483b27375M6282N1524C7083J18637
17538A55720q517b82145B20390G4954K19285A21778d1435k2351H4481a47508A92801
$$ y = [35300, 84617, 216097, 310942, 266175, 95631, 82715, -130460, 87688, -229110, 284553, 40990, 110492, -240829, 363353, -129514, -92547, -11765, 411832, 232258, -27541, -31658, 305152, 8863, -256495, -26964, -195940, 296346, 18735, -251662, 50326, 122598, 292931, 33487, 108389, 62793, 55913, -182290, 48598, -294810, 80829, 14255, -24329, 193963, 203032, 186658, 1167, -209106, 65356, 288875, -282416, -166393, -57685, 138303, 79165, -40375, -108179, -74174, -152767, -186198, 109119, 85574, 32831, 45939, 84131, 68433, 234608, 90760, 380842, -53061, 2412, -225289, -27808, -29492, 94483, -227375, -181093, -129569, 37083, 155720, 147203, -282145, 220390, 74954, 294239, 121778, -41435, -63786, 84481, -147508, 192801]
17526A22915b6983j28871C78649F2167a04452B36480I8543a96005E9681J19702
17516A79383J4004r2681c8456k48063G2131a39975N5866C41649n2410p9024q6480
17505A23735e7888O514A01374a61958A37370L9234a7360B02798a2836q451A07021
17493A47091J73160o2768E8245j3369L32580i5348c6414k7313C4001K85575e6504
17481A30713P3718E435M57711a848A07623O7185a12657r027A57919J1859k5352
17470A44426c2775A98334a28306k50943B21579E5531j4870K55043N8045F5981
17459B85647d4623B55589H8034J89866m874j35932J46115K91102F2612K93887
17449C56499D7366J64705L00100A83953a85850I9641k4387P155K52734q4319J1253
$$ y = [122915, -26983, -155854, 378649, 62167, -104452, 236480, 98543, -196005, 59681, 179383, 193387, 100706, -38456, -286519, 72131, -139975, -84109, 341649, 289239, 210215, 123735, -57888, -51374, 101374, -161958, 137370, 176604, -17360, 202798, -12836, -21287, 107021, 147091, 320251, 257483, 58245, 44876, 377456, -95348, -36414, -63727, 34001, 319576, -56504, 130713, 204431, 5435, 463146, -1848, 107623, 174808, -112657, -121684, 157919, 169778, 144426, -32775, 198334, -128306, -379249, 221579, 55531, 40661, 295704, 353749, 65981, 285647, -44623, 255589, 88034, 277900, 273026, 137094, 283209, 574311, 62612, 356499, 47366, 212071, 512171, 183953, -185850, 99641, 75254, 82409, 335143, 250824, 262077]
17438B62077n9244K90408F6727J47543N2421K58934k46754j34851D7293M06778
17428D54071j52879Q3771j24511G8675k1469M9164L7471g5295A47385K07858G3540
17416E59352j72084K14276j38516l777j51663I567L79046r854a06674C22901m0548
17405B82353o9409I5397J30304C8734a18613B588L2380J2479M1500J7025A6817
17393C52473c78567A88589Q9719k288H1217J57085J06356c245j86005c817A91445
17381D35759L600n8794j24894b5855B19212K2485G7217N2321J50745K7775b43874
17369a71052B26297e8026C0802J06189J30738o5699M30131b7914A23362a19425
17358A22049J12169K71783k29163k6435o7530a36448A8043K00416j07068L21623
$$ y = [262077, 202833, 493241, 66727, 214270, 266691, 525625, 278871, 144020, 47293, 454071, 301192, 384963, 260452, 78675, 57206, 106370, 143841, -75295, 147385, 355243, 73540, 559352, 387268, 601544, 463028, 459251, 307588, 9567, 388613, 378759, -106674, 322901, 282353, 212944, 95397, 225701, 38734, -118613, 2588, 34968, 47447, 88947, 105972, 16817, 352473, -378567, 188589, 278308, 276020, 81217, 238302, 344658, -3245, -189250, -3817, 191445, 435759, 439359, 380565, 255671, -25855, 219212, 241697, 77217, 129538, 280283, 308058, -243874, -171052, 226297, -58026, 30802, 136991, 267729, 202030, 632161, -27914, 123362, -119425, 122049, 234218, 506001, 276838, 250403, 182873, -136448, 18043, 218459, 111391, 433014]
17348D33014a74710B48299o5492K2106p9948C2511R6969O7998K1594c9492A29960
17336A4944K23289k5668K4800o1574K27582C4261J35868K8409o514b1911C30770
17324B08233F8024L5419N2348R0616D9357J23870F3268Q5653L70163E0549J0479
17313F1028a08103B48948K94450k49149M5332b26134A36389N2767E2536J06862
17303A59398J8965f4626A13814K1283M8058a72389B58755f1083B02304G9439f0676
17291B25313L3969J68712D8982L58137G4148L7531a76036E84594B74327H8515
17280D0662a18980G3339J77648J92558j96613J03253k898G3664J75460h20C39320
17268D9583P9315J60264p802E5286K53153o7549K61J85858j52108d5755l0810
$$ y = [433014, -174710, 248299, 182807, 204913, 124965, 32511, 129480, 197478, 219072, -39492, 129960, 14944, 238233, 212565, 237365, 175791, 403373, 34261, 170129, 198538, 192024, -21911, 330770, 208233, 68024, 103443, 155791, 246407, 49357, 173227, 63268, 148921, 519084, 50549, 61028, -108103, 248948, 543398, 294249, 339581, -226134, 136389, 189156, 52536, 159398, 178363, -64626, 113814, 135097, 183155, -172389, 258755, -61083, 202304, 79439, -60676, 225313, 259282, 427994, 48982, 407119, 74148, 111679, -176036, 584594, 274327, 88515, 40662, -118980, 73339, 250987, 443545, 246932, 350185, 347287, 73664, 249124, -820, 339320, 49583, 128898, 289162, 281360, 55286, 308439, 240890, 241151, 427009, 274901, -45755, -76565]
17257g6565A98796a0050A45585J77225A25425e4100H5331J96519J98142A26982
17246f5076A04746J90864a51703b0117H9005L8184K3057l0822M39006k19548e6342
17234b04006B42027q4253o8351K03725m1996p2757M1821n9114J1607J99352b33892
17222G1653A5344J50542N0632e7120A99153M3543J44341A38663L55790A13843
17211a97550C1799L72735j59512C3088M10527B8886K95857A49134C6532J57259
17201A93791L7820j1075j7735E7787J53224M5067D9091a39979A32018E3202K65692
17190C18894D2097J80575j8863q5545J10766J64272a26346C33911q492a1237D35315
17178A82956L9114J94925j81261P9656A19794M99652C03370o1191P624K4776J65336
$$ y = [-76565, 198796, -10050, 145585, 322810, 125425, -54100, 85331, 281850, 479992, 126982, -65076, 104746, 295610, -151703, -20117, 89005, 127189, 150246, 119424, 558430, 338882, -56342, -204006, 242027, 157774, 89423, 293148, 251152, 178395, 220216, 161102, 172709, 372061, -233892, 71653, 15344, 165886, 216518, -57120, 199153, 242696, 387037, 138663, 494453, 113843, -197550, 31799, 404534, 245022, 33088, 443615, 28886, 324743, 149134, 36532, 193791, 231611, 220536, 202801, 57787, 211011, 256078, 49091, -139979, 132018, 53202, 318894, 42097, 222672, 203809, 118264, 229030, 393302, -126346, 333911, 325419, -11237, 435315, 182956, 222070, 416995, 235734, 315390, 119794, 619446, 303370, 242179, 249803, 274579, 439915]
17167D39915Q9316j16991N1398k07379J20085j52936K26130I8658L61617A55386
17156D23769B1188L60215a42982C42189b6420C17059h2718C27800f1868A88912
17145A50131k2557K0302K5695J90238j1116A14637j0501D7113L62644r8270K26606
17134E38093j94673J98081B66880J51412p3246A22536J84621K32466q787B06659
17123C31941r8302N03173f6477E4099M93040A61626J88769A20043M82717a10024
17112B94115n3720p9274L11958j64716M61048k03932k39888k1862M17027k65922
17102D54834k8741j52425j13865L12961B14464K96705r9889j2540H9987K80975
17092C70962L3031A32097K02540m8628K59728j40434j18581n0892P0900M95036
$$ y = [439915, 529231, 412240, 463638, 256259, 376344, 223408, 449538, 98658, 460275, 155386, 423769, 21188, 381403, -142982, 342189, -26420, 317059, -82718, 327800, -61868, 188912, 150131, 127574, 147876, 173571, 363809, 352693, 114637, 104136, 47113, 409757, 311487, 538093, 343420, 541501, 266880, 418292, 345046, 122536, 307157, 539623, 530836, 206659, 331941, 233639, 736812, -66477, 54099, 547139, 161626, 350395, 120043, 602760, -110024, 294115, 240395, 161121, 473079, 308363, 769411, 565479, 325591, 303729, 720756, 454834, 426093, 273668, 159803, 472764, 214464, 511169, 411280, 398740, 89987, 370962, 403993, 132097, 334637, 286009, 545737, 405303, 286722, 235830, 306730, 801766]
17082H01766l47699k0200p0248N0630B06833K20344j11514j15734K17445K14769
17072F32143B23539Q8003K50371j05930K50917q3314n8329l039l2400k3178j47611
17061C59029K65186B22406N43627C77402j37170M64477j14034A60660L74814J12149
17051F47623j11726B13733J64371K31207k75831K19876K88568m2329k96523l8325
17041D64747j68914M18212j01865j12526q2411K90766K01790k20193k12935L4242
17031E10913O1987n4362J42520j37930r0882L03301P6108l92304N16834k02850
17021G33335j47460M27687m45388N898j4259k00250K32076K05804C82188K01963
17011E84151M23241o7654k27740j35l83J11426j15328M48861l22237p9965J42135
$$ y = [801766, 454067, 433867, 363619, 414249, 206833, 427177, 315663, 199929, 417374, 632143, 223539, 311542, 561913, 455983, 706900, 623586, 565257, 562218, 529818, 506640, 359029, 624215, 222406, 766033, 377402, 240232, 704709, 590675, 160660, 535474, 647623, 535897, 213733, 378104, 609311, 333480, 553356, 841924, 799595, 503072, 464747, 295833, 714045, 612180, 499654, 417243, 708009, 909799, 689606, 476671, 510913, 572900, 518538, 661058, 523128, 432246, 735547, 811655, 419351, 936185, 733335, 585875, 1013562, 568174, 574072, 559813, 359563, 591639, 797443, 382188, 584151, 1007392, 939738, 711998, 711863, 711480, 822906, 707578, 1156439, 834202, 754237, 896372]
17000H96372M5111k32024J87430j11193K134M8031o4139k6058K16309P4589j21578
16989I14984k47545K88802j68416R0787q6969j31170J08728k63661L42682K37569
16979A085791m8148J29819l01796O1581j64884J53237R9442o2338k93127N60634
16969A220211J43818K21735p42662k3689N7951o3000K73950J67824l38859J50959
16959A068238J66159l72231O8217j37209M90127k12142L4824O127J04087k2920
16949A193277k7737Q7303k51265M608J97577j17697k6345J42310J0758l17331
16939H95458M81607o22446N25049q7180J37514K76125n81143M04616j90085J20490
16929A360005Q1242J6617M8901O4038k44877L8425k95K22742m00064N3683K29588
$$ y = [896372, 941483, 709459, 896889, 785696, 787830, 835861, 771722, 745664, 961973, 1036562, 914984, 667439, 956241, 787825, 878612, 791643, 660473, 769201, 505540, 848222, 1085791, 1037643, 1167462, 865666, 927247, 762363, 915600, 1015042, 952704, 659577, 1220211, 1364029, 1585764, 843102, 819413, 877364, 814364, 1088314, 1256138, 917279, 1068238, 1234397, 862166, 930383, 793174, 1283301, 1071159, 1105983, 1112110, 1216197, 1193277, 1165540, 1252843, 1001578, 1006186, 1203763, 1086066, 1059721, 1202031, 1212789, 895458, 1377065, 754619, 1279668, 1192488, 1330002, 1606127, 1024984, 1429600, 1239515, 1360005, 1441247, 1457864, 1506765, 1570803, 1325926, 1364351, 1364056, 1586798, 1186734, 1240417, 1470005]
16918A470005j36378M125L00821Q9910k18316Q5861j81439J04843j59705M29781
16908A789508l8116r0463J58600J14803o5933L8785J41673n13072K75952J3444
16898A825181K06660l57400M80181m57948J29378J85250L956R1521O5496R7669
16888B269944k22086q8891J85829o1242L70268k89759J02036q664j10708Q3832
16878B230559L3907P0820p5113P8748R6239R5016k66056M00716n4531o8724J93667
16867B735248N1143K59375j88787j21370J80829o3801K85781k7000k38635n4883
16857B817900K47404k04500K31973O8397J24003o7440J84150k81011N47624o3811
16847C604689j52535J20502j54017K29492J06823L56044k56366j00255K02505
$$ y = [1470005, 1333627, 1337752, 1638573, 1728483, 1510167, 1596028, 1414589, 1519432, 1359727, 1789508, 1751392, 1660929, 1819529, 1934332, 1868399, 1907184, 2048857, 1535785, 1811737, 1825181, 2031841, 1674441, 2154622, 1696674, 1826052, 2011302, 2015258, 2106779, 2172275, 2269944, 2047858, 1958967, 2144796, 2083554, 2453822, 2164063, 2266099, 2257435, 2146727, 2230559, 2264466, 2335286, 2260173, 2338921, 2435160, 2530176, 2264120, 2664836, 2610305, 2541581, 2735248, 2786391, 3045766, 2856979, 2735609, 2916438, 2852637, 3138418, 3111418, 2872783, 2817900, 3065304, 2860804, 3092777, 3161174, 3285177, 3217737, 3401887, 3120876, 3668500, 3604689, 3452154, 3572656, 3418639, 3648131, 3754954, 4110998, 3854632, 3754377, 3956882]
16838C956882K34229j92066j9542M49330k00608K07393J28148j92760M2057L87588
16828D800651p9849N5232j52951P85250j16617J4590J7459M0224o925O05625q8981
16817E873708l919K89021J20551l5466K30140K49365k41680N63077k6638P9444
16807G097603P5128J36424M95470J85927l2593l9082K73380k53172P66095j15760
16797H589420O30973K15658J34188L38398L0959P75318J52253l43321L70182N84412
16787A1478440K10941M58062L62374J49653N40774K91612K39601N59761K80052
16778A4571270M68103O54174M10957P23573L31600L02989P90523N31866M28552
16769A9213607Q17958P82955P65078Q27177Q97915N02674R03614R61609R42184
$$ y = [3956882, 4191111, 3999045, 3979503, 4428833, 4228225, 4435618, 4563766, 4371006, 4413063, 4800651, 4720802, 4776034, 4623083, 5408333, 5291716, 5306306, 5323765, 5363989, 5357064, 5962689, 5873708, 5869789, 6158810, 6279361, 6243895, 6474035, 6723400, 6481720, 7044797, 7018159, 7097603, 7172731, 7309155, 7804625, 7990552, 7957959, 7918877, 8192257, 7939085, 8705180, 8589420, 9220393, 9436051, 9570239, 9908637, 9939596, 10714914, 10867167, 10523846, 10894028, 11478440, 11689381, 12147443, 12509817, 12659470, 13200244, 13491856, 13731457, 14291218, 14571270, 15039373, 15693547, 16104504, 16828077, 17159677, 17462666, 18253189, 18785055, 19213607, 20031565, 20814520, 21579598, 22406775, 23304690, 23807364, 24710978, 25672587, 26614771]
16760B6614771Q71295J541840J190627J132246J207512J463504J663303J536463
16752C7221561J981777J165380K393012J957500J935403K502775K646748K514703
16744E4318859K382170L767595K893832L566038L599204L837742M163580M426111
16736H2955131M622394N019478N355258N394892O175451O227714O522360O446939
16728A28719617P034108P062613O884703P010273O524787O246009O085276M687666
16720A80255052M278613L940972K034587J230863j41812j240525k385191l472236
16712A84500323l921349n572881n940335o259495p128863o644361o958253p353940
16704A34720846o815105o574640o903670o434708n940266n540496n588144n228435
$$ y = [26614771, 27486066, 29027906, 30218533, 31350779, 32558291, 34021795, 35685098, 37221561, 39203338, 40368718, 42761730, 44719230, 46654633, 49157408, 51804156, 54318859, 56701029, 60468624, 63362456, 66928494, 70527698, 74365440, 78529020, 82955131, 87577525, 92597003, 97952261, 103347153, 109522604, 115750318, 122272678, 128719617, 135753725, 142816338, 149701041, 156711314, 163236101, 169482110, 175567386, 180255052, 184533665, 188474637, 190509224, 191740087, 191598275, 190357750, 187972559, 184500323, 180578974, 175006093, 169065758, 162806263, 155677400, 149033039, 142074786, 134720846, 127905741, 121331101, 114427431, 107992723, 102052457, 96511961, 90923817, 85695382]
16696H5695382m743195m407420m424793l854770l583721l489927k959111l113244
16688E5119201k757710k444344k584812l038268j371432k206291j721900j667774
16680C7326670j897444j609047j397714j499600j125030j035656j722923p42875
16672B6296381j152241p71592r33425q16151q32537r22713p26187o41581q82942
16663A8617012n93092o53702r10994l74921k93129q45734m17382k82313n89795
16654A3655950j5058m76091l17850n63147k13823k62217l58928o25629l66295
16645A0456912n1103l53872J6685n61182k61241j06125m361o31046j9997k22861
16635H261809m52405k1387k26878l80067K12907k87594j28950j20667l48574M4187
$$ y = [85695382, 80952187, 76544767, 72119974, 68265204, 64681483, 61191556, 58232445, 55119201, 52361491, 49917147, 47332335, 44294067, 42922635, 40716344, 38994444, 37326670, 35429226, 33820179, 32422465, 30922865, 29797835, 28762179, 27039256, 26296381, 25144140, 24372548, 23439123, 22622972, 21790435, 20867722, 20141535, 19499954, 18617012, 18023920, 17370218, 16459224, 16084303, 15791174, 14945440, 14528058, 14245745, 13655950, 13640892, 13164801, 12846951, 12283804, 12069981, 11807764, 11448836, 10823207, 10456912, 10405809, 10051937, 10068622, 9507440, 9246199, 9140074, 9135713, 8504667, 8484670, 8261809, 7809404, 7788017, 7561139, 7181072, 7393979, 7106385, 6977435, 6856768, 6508194, 6552381]
16625F552381l33783m0802j28099m2744K5371N0150k18680l38905K02422l72854
16615E354457j96872j86659M5428k29205j13710J57011n62161L38930j40503k14388
16605D252328j52631j8331j23292K56220n76533N65918o07107K35522q5106j93410
16595C553578j12403J11545J72052l61373J29322k23811M2555l80730R2593J79143
16585C202471l3380m00972J68567k3198l12519J41823J80434k86948J52226l47218
16575B441286L06267M1773l26721J84364m89626J18420K03496p9961k57658K14675
16565B356315k00679j4308l61226M12049J91461o6014l45313m221j26400J88492
16555B030156K16946k13689J50977j122l01043j47703j42394j52845K77954j70128
$$ y = [6552381, 6218598, 6177796, 6049697, 6006953, 6032324, 6082474, 5863794, 5524889, 5727311, 5354457, 5157585, 4970926, 5016354, 4787149, 4673439, 4830450, 4268289, 4607219, 4466716, 4252328, 4099697, 4081366, 3958074, 4214294, 3637761, 4203679, 3596572, 3832094, 3746988, 3553578, 3441175, 3552720, 3724772, 3363399, 3492721, 3268910, 3311465, 2930735, 3023328, 3202471, 3169091, 2768119, 2936686, 2913488, 2600969, 2742792, 2923226, 2636278, 2788504, 2441286, 2747553, 2789326, 2462605, 2646969, 2157343, 2275763, 2479259, 2399298, 2141640, 2356315, 2155636, 2141328, 1780102, 2192151, 2383612, 2317598, 1972285, 1968064, 1841664, 2030156, 2247102, 2033413, 2184390, 2183268, 1882225, 1734522, 1592128, 1439283, 1717237, 1547109]
16545A547109K23713J06128j00202l20105j42619M61734J4445l13269L17591m36593
16535A357932J36393Q2816k72990R3372J40766q5444j18387K98284l14997K51520
16525A569265l44866K92708Q8229o43154K84498J9958P6647p812j00688O1690
16515A296475J45561n49784N61067k49947j29541q789J17591M8j90942K70710
16505A262449k88045J09063j23910j54448l8620q8171O66244j98138l78976L16823
16495A084271j86139L11242m71101Q921K8237J07584k08599J46132j88428J01512
16485G33632L25782l42016K08359j52989R9768n0873j55513O24099n83284J27643
16475H34608J23913J15531j02574D74494K63268j02469M0891M2016j413p1413
$$ y = [1547109, 1770822, 1876950, 1776748, 1456643, 1314024, 1775758, 1790203, 1476934, 1794525, 1357932, 1494325, 1577141, 1304151, 1397523, 1538289, 1452845, 1334458, 1632742, 1317745, 1569265, 1224399, 1517107, 1605336, 962182, 1246680, 1266638, 1343285, 1335473, 1234785, 1296475, 1442036, 892252, 1453319, 1203372, 1073831, 1065042, 1182633, 1182681, 991739, 1262449, 974404, 1083467, 959557, 805109, 766489, 678318, 1344562, 1146424, 767448, 1084271, 898132, 1209374, 738273, 747194, 775431, 883015, 674416, 820548, 632120, 733632, 1059414, 717398, 925757, 772768, 872536, 821663, 666150, 1290249, 706965, 834608, 958521, 1074052, 971478, 474494, 737762, 635293, 676184, 718200, 716787, 645374]
16465F45374k0235L77886k76933j39596K6772A96404K75202J88724j35785J99655
16455G24200k53639K31970J08301j74850K58104k41364L01695m37238J5141O6201
16445E98521k09539l4913J74385J29212j61193L32013k48084l2712K21596B93259
16434G43671p6869Q0903j06679k6099B66781J45215l4829K1644J20174J30438
16424F49423l4050j51317J82401k78724J8900L51715k47333K4802K59583C22181
16413E25995r6636K03155j53554q3004J02582J33421B18359J18702j26199O89418
16403I00280D05940N7868A68924l3967L49685j91365J88225j74259J45184O0415
16393E12842j64812p6824m4091L86035B84205J83746K00386l10342K5315N9158
$$ y = [645374, 625139, 1003025, 726092, 586496, 613268, 196404, 471606, 660330, 524545, 724200, 470561, 702531, 810832, 635982, 894086, 652722, 954417, 517179, 532320, 598521, 388982, 354069, 528454, 657666, 496473, 828486, 580402, 547690, 769286, 293259, 743671, 666802, 747705, 641026, 614927, 266781, 411996, 377167, 398811, 518985, 649423, 615373, 464056, 646457, 367733, 386633, 738348, 491015, 515817, 775400, 322181, 525995, 429359, 632514, 478960, 395956, 498538, 631959, 218359, 337061, 210862, 900280, 405940, 463808, 168924, 134957, 484642, 293277, 481502, 307243, 452427, 512842, 348030, 271206, 227115, 613150, 284205, 467951, 668337, 357995, 383310, 442468]
16383D42468j72973K49919j74116j06625p5146J76317A64801J90722A53052K91892
16373D44944r4790q5785P8614M78004l84574j88730J74319J13300j98286j26476
16363B10540m4886K47744J40630A63852J69088J0502C2459R4363Q6827p7390J53518
16352B89777K15775j24794J65890A48488J15131J59331A4681K07653L28473q4826
16342D65981d6412B24699E401K62531j30592J75978J993j42362K04225C1198P8367
16331A09565a85113B10331P8156o1602b112B74767J07436N173K3719j46800J74965
16320D39260B3802O41838B71207L2344E7900K48218H5408l7307J11083E6937J59113
16309B16050q7081K18275G6838M6962K81444p1745j51174P0821e8416A44797L56265
$$ y = [442468, 269495, 519414, 345298, 238673, 163527, 339844, 164801, 355523, 153052, 444944, 350154, 264369, 342983, 820987, 436413, 247683, 422002, 535302, 337016, 210540, 165654, 413398, 554028, 163852, 332940, 343442, 32459, 126822, 213649, 136259, 289777, 505552, 380758, 546648, 148488, 263619, 422950, 14681, 222334, 550807, 465981, -46412, 224699, 5401, 267932, 137340, 313318, 315311, 172949, 377174, 31198, 109565, -185113, 210331, 288487, 226885, -2112, 274767, 382203, 387376, 411095, 264295, 439260, 23802, 665640, 271207, 303551, 57900, 306118, 85408, 48101, 159184, 56937, 216050, 128969, 347244, 76838, 123800, 405244, 333499, 182325, 253146, -58416, 144797, 501062]
16298E01062A76613p7790k0966e5827F4182R9466K04861G8254c41109D043c6386
16286A34494R214j704K0087o1298J08184J4221E922a9351B67860h7733D14584
16274A5254N23793j32931A38863a11151B56519b13792b0205A43908a80747J2852
16264a67895P3757A34412n5751K6019M8051K34147j74309o5563a29382B47943
16253c7505B2975L27647e5913D7892K1602f2918n8387D09556j58386N9608B5287
16241B65128A26590l641B8795J52735O4777H4395C7544K97482j38879J8807g2812
16229B1920N9544f3890J5547C25564e1826B72137c4550B86854a1687D49695M0327
16218D90022D1045d8141A21109a34109a5236A30284l6385A8865J84908a22049
$$ y = [501062, 176613, 98823, 77857, -55827, 64182, 163648, 368509, 78254, -341109, 4043, -36386, 134494, 143708, 142004, 162091, 100793, 208977, 223198, 5922, -19351, 267860, -87733, 414584, 15254, 539047, 406116, 138863, -111151, 256519, -213792, -20205, 143908, -180747, -167895, -94138, 134412, 78661, 104680, 152731, 386878, 212569, 147006, -129382, 247943, -37505, 22975, 350622, -55913, 47892, 69494, -62918, -121305, 409556, 251170, 310778, 25287, 265128, 126590, 122949, 28795, 181530, 246307, 84395, 37544, 335026, 196147, 214954, -72812, 21920, 81464, -63890, -48343, 325564, -51826, 272137, -34550, 286854, -11687, 449695, 490022, 41045, -48141, 121109, -134109, -15236, 130284, 93899, 18865, 203773, -122049]
16207a6391D2236M56765d9051j57538B85215r5242J7649m3025m1409n8777a08328
16195A61073d8949B98639C1565L69745j48901j0085b63027A27263m2725j1282
16185G3256J43879i2376k1195C15437f926q027D2453J00327a52286C42289d12658
16173a72374C80446e1507j8754B53926a56482A18312B6333i338l6228j97737H1525
16161g0877G3717J22527G5429H203b02225A51755a34269j72679A3026d6624K3183
16150b3441A28714K22469q7550C170J6478c40177a13760A45219K21683a75633
16139B4874L33630a81840P398K4828C15013A47820a68482A11181k5426f8024q7532
16128a55556A18151b19723e6241F0400o84c70970D77294A60340K56175B5694K0579
$$ y = [-16391, 42236, 499001, -49051, -206589, 285215, 189973, 207622, 164597, 123188, 64411, -108328, 161073, -48949, 298639, 31565, 401310, 252409, 242324, -263027, 127263, 84538, 73256, 217135, -92376, -113571, 315437, -6926, -14953, 42453, 142780, -152286, 342289, -412658, -172374, 380446, -51507, -70261, 253926, -156482, 118312, 26333, -9338, -45566, -243303, 81525, -70877, 73717, 196244, 75429, 8203, -202225, 151755, -134269, -306948, 13026, -46624, -23441, 128714, 351183, 263633, 3170, 19648, -340177, -113760, 145219, 366902, -175633, 24874, 358504, -181840, -174442, -149614, 315013, 147820, -168482, 111181, 85755, -68024, -155556, 118151, -219723, -56241, 60400, 59716, -370970, 477294, 160340, 416515, 25694, 46273]
16117D6273Q6043d5974A64437f0851A80340e3066A56188J04218b62634a7607A14795
16105A51239i2975k80850a56076d9306A14009Q1298K80940f4006J7328j93634
16095b40312d8323B1359b68990e449A13381L28582G3728h4162J9605a0162j29250
16084a39412A7676c2129j7199k14677J06561I5700b77982B9665a0797p6559M3351
16073d4005a0003F84611b7823q9175k28157A09303c37901H0901d4044A59778A7073
16061b84032A15039a53342g478I0243c1034j8244n9399q7505c0879E0178K19694
16050B69872a99644o3532A3364b2166B31151A04447d03720B40265a8404r9577
16040a17981k21457R6526A60479p3128a73286A3823b09968O921J2314o1511L1003
$$ y = [46273, 132316, -45974, 164437, -60851, 180340, -53066, 156188, 260406, -262634, -17607, 114795, 151239, -92975, -373825, -156076, -49306, 114009, 195307, 476247, -64006, -46678, -240312, -48323, 21359, -268990, -5449, 113381, 441963, 73728, -84162, -64557, -10162, -139412, 17676, -32129, -49328, -264005, -157444, 95700, -277982, 29665, -10797, -87356, -44005, -10003, 684611, -27823, -116998, -345155, 109303, -337901, 80901, -44044, 159778, 17073, -284032, 115039, -153342, -7478, 90243, -31034, -49278, -108677, -196182, -30879, 50178, 269872, -199644, -263176, 13364, -22166, 231151, 104447, -403720, 240265, -18404, -117981, -339438, -242912, 160479, 87351, -173286, 13823, -209968, -203047, -190733, -252244, -221241]
16029b21241a07671j33744c9264j09561j00672Q5312D19705A2523b46701a4111
16018I2471a05823e0667j4268a6723p0830A3916Q9049a66714A20473m2120K382
16007H0735a46286H2360c2120m8280j1363B9981c76760J84570A4155N4552j7212
15996E1495J35527j5649N9062a62944c6083l1142A66356G108P1033A9768b13268
15984B3280L90352n4981j2376K74841B65923A13118Q494i9940q4789n5655R0666
15973a49718j8435K8236e7602j30026d9496H875K82328g0137K6294B20419a2790
15961C29594A58739L5408F9419A6160i935A95554a55882H1206A9718c40843A50611
15949A07884b5449F3725R543b19305A84877h1237k7559G2380a34298J3719K9586
$$ y = [-221241, -107671, -241415, -39264, -148825, -249497, -164185, 419705, 12523, -246701, -14111, 92471, -105823, -50667, -64935, -16723, -87553, 13916, 102965, -166714, 120473, 78353, 80735, -146286, 82360, -32120, -80400, -91763, 29981, -376760, -192190, 14155, 68707, 51495, 187022, 171373, 230435, -162944, -36083, -67225, 166356, 7108, 78141, 19768, -213268, 23280, 413632, 358651, 346275, 621116, 265923, 113118, 121612, -99940, -184729, -240384, -149718, -168153, -139917, -57602, -187628, -49496, 8875, 291203, -70137, -43843, 220419, -12790, 329594, 158739, 194147, 69419, 16160, -9935, 195554, -155882, 81206, 19718, -340843, 150611, 107884, -25449, 63725, 73268, -219305, 184877, -81237, -108796, 72380, -134298, -120579, -90993]
15938i0993l4842A35772a41487d3081l01405g5905l10604A08136K3345C3660b90315
15926A15699K8834H769a52830O8450k34167h704l18670C107a98448C12808B1422
15914d09700a02377j75009i0539k47330a58964I6707a90615d1661C03511h7017
15903C13644f7707j52735L1427D44941e4718A97911k7395J42909a06572A87949
15892A7751J02766a87651I6706a83703A98453K4832d0150A29227e581C6207Q536
15881D4743j8053M9407b23550g5875I4508a45981r8267B1313J8113c48788g6384
15869A34818b8441m22858A3458J9580J72405J08499j49204b01391C04894a85796
15858a79601C06574d5582l6397A22398b79671d6534a427C17059b34237d7915C97396
$$ y = [-90993, -125835, 135772, -141487, -43081, -344486, -75905, -386509, 108136, 131481, 33660, -290315, 115699, 144533, 8769, -152830, -84380, -318547, -8704, -327374, 3107, -198448, 312808, 21422, -409700, -102377, -277386, -90539, -337869, -158964, 96707, -190615, -41661, 303511, -87017, 313644, -67707, -220442, -189015, 444941, -54718, 197911, 170516, 313425, -106572, 187949, 17751, 120517, -187651, 96706, -183703, 198453, 223285, -40150, 129227, -5581, 36207, 44743, 26690, 76097, -223550, -75875, 94508, -145981, -244248, 21313, 39426, -348788, -76384, 134818, -28441, -451299, 13458, 33038, 205443, 313942, 164738, -201391, 304894, -185796, -179601, 306574, -45582, -81979, 122398, -279671, -46534, -1427, 317059, -234237, -47915, 397396]
15846F0387f4389b4488E9191a64281K3832G978P5290a84425b4889A67323a81915
15834F7731d8468C2712b04623M554B22277a85880M7707p225C3285a2576j73061
15823a85637j5766B12780A553e6132k16453A63132b91493a23994C0601K3280i1794
15811b22380J3361B40481d9876J0609E5334e2317m0180j71373D3648p66J66212
15800B09094c42888a02021k18661p666A61659a77220k31125a9855l2723B25954
15789A82561c86595h1154A82853H2827i2317b859k86248h7223b483j13754K7298
15778h8939k0954a6287k66602E7435g8119k53893A11051E5345i2775F2491K037
15767F4528a65123B18619a9846F4417d0920B7932b5555A15215P1460g1929H0189
$$ y = [60387, -64389, -24488, 59191, -164281, -140449, 7978, 83268, -184425, -24889, 167323, -181915, 67731, -48468, 32712, -204623, -200069, 222277, -185880, -138173, -145398, 33285, -12576, -185637, -201403, 212780, 1553, -56132, -272585, 163132, -291493, -123994, 30601, 53881, -91794, -222380, -209019, 240481, -49876, -39267, 55334, -52317, -92497, -263870, 43648, 42882, 209094, -342888, -102021, -320682, -328348, 161659, -177220, -408345, -19855, -52578, 225954, 182561, -386595, -81154, 182853, 82827, -92317, -2859, -289107, -87223, -2483, -116237, -88939, -109893, -16287, -282889, 57435, -78119, -332012, 111051, 55345, -92775, 62491, 64528, -165123, 218619, -19846, 64417, -40920, 27932, -25555, 115215, 186675, -71929, 80189]
15755B21697q8812q037l4492h1070j16473MA40358p801i896A26118F2520A7585
15742C2374c5459q4999G9630b04242M0031c126j94908J8939h2677A19419J75111
15731B94530F3926a96077K8833l18425g1701L0177A97560n1878j7096b82476e7085
15719B87580b63750B00356a74170A19092a17227j32957H1298a07234M2387K6291
15709c8556D1387O1671b58635d5447A83098h9102D6772J11099d0626A6603a68467
15697B2553g2627l4793A67420a45639B42747J60421A16102b70502H7043k6534
15687F0509J63632N8318H126J24534J09015b48206A71326b07805B24213a98729
15676b02067A60018Q9468I4895e7877A1953J4435a02976A69494Q6764g9852I3517
$$ y = [221697, 132885, 124848, 90356, -81070, -197543, -197539, 140358, 132557, -9896, 126118, 62520, 17585, 32374, -35459, -120458, 79630, -204242, -164211, -3126, -198034, -179095, -82677, 119419, 294530, 63926, -196077, -167244, -485669, -71701, -41524, 197560, 145682, 128586, -282476, -57085, 287580, -263750, 200356, -174170, 119092, -117227, -250184, 81298, -107234, -64847, -38556, 41387, 103058, -258635, -45447, 183098, -89102, 46772, 157871, -40626, 16603, -168467, 22553, -72627, -107420, 167420, -145639, 242747, 403168, 116102, -270502, 87043, 60509, 224141, 282459, 8126, 132660, 241675, -248206, 171326, -207805, 224213, -198729, -202067, 160018, 249486, 94895, -57877, 11953, 26388, -102976, 169494, 256258, -79852, 93517]
15664A26829j9397e80279A41934b56651N4779q0614g2287h035D2622h7814k77063
15653c64877J69886A03481J10259b66872d6113A38274l818b65942F8855a95226
15642F9344d1417k08021J13954p5750B49724b30434i6544H2563A4272c04833a08203
15630G9620D897e7381o8830j1156A54858m5202J31073h3427k1367A77530q6107
15619I1423d8751A56009c7730C4777b06376B22226q3306c5705m1518n8342k3436
15608a59001A28908d6774r7074q7453B32842M599d1223j49253N3716M271B7814
15596g381A11496d1200l9723l4335j80469M3048K9058h4422G2624K27348H8544
15584A52690a72297C26821G8775E970a7150j86186K7928Q2442j99541d8557j07426
$$ y = [126829, 107432, -580279, 141934, -256651, -201872, -282486, -72287, -8035, 42622, -87814, -364877, -194991, 103481, 213740, -266872, -46113, 138274, 134456, -265942, 68855, -195226, 69344, -41417, -249438, -135484, -211234, 249724, -230434, -96544, 82563, 14272, -304833, -108203, 79620, 4897, -57381, -126211, -137367, 154858, 109656, 240729, -83427, -104794, 177530, 91423, -48751, 156009, -37730, 34777, -206376, 222226, 138920, -35705, -77223, -135565, -159001, 128908, -46774, -143848, -231301, 232842, 237441, -41223, -190476, -136760, -132489, 27814, -7381, 111496, -41200, -80923, -115258, -295727, -252679, -223621, -84422, 72624, 299972, 88544, 152690, -172297, 326821, 78775, 5970, -17150, -203336, -175408, -92966, -292507, -48557, -155983]
15573a55983d7410j45746k64486a76976B90770a09904n0309I0681j9604l0974
15563D0103i8985r5329A05768J01448a55251j34406R8825A59163b21747G9221
15552a69224A25016a63353A04180c56168a69868C1450c42578I8968Q1606E2807
15541d6062A31894b47574L2120A47814l4101a39164A60678G1345a26898A40976
15530f4899b9928B79249A4052K00403G1651J30382o4782N9045j2740h0738A0466
15518B7333J1192d39996c3163n2270L2612D8837a0632j88497F4909i5902G2910
15506a32029b9257A47028a12325A87191J58161I6712J39240G6752b55411J10700
15496a44711A29662j6107C0521J2500K46434h5925A32209F1895L30421i0581F6663
$$ y = [-155983, -47410, -193156, -457642, -176976, 290770, -109904, -160213, 90681, 71077, 40103, -98985, -194314, 105768, 207216, -155251, -289657, -190832, 159163, -221747, 79221, -169224, 125016, -163353, 104180, -356168, -169868, 31450, -342578, 98968, 180574, 52807, -46062, 131894, -247574, -215454, 147814, 113713, -139164, 160678, 71345, -126898, 140976, -64899, -29928, 279249, 14052, 214455, 71651, 202033, 137251, 196296, 183556, -80738, 10466, 27333, 38525, -439996, -33163, -85433, -52821, 48837, -10632, -199129, 64909, -95902, 72910, -132029, -29257, 147028, -112325, 187191, 345352, 96712, 235952, 76752, -255411, -144711, 129662, 113555, 30521, 43021, 289455, -85925, 132209, 61895, 392316, -90581, 66663]
15484a1322k2956b908j65009e9318k05236E2685b52012j90410h1453B49379r4972
15473A54407J29387j04886h3712q7887A25634L2902D3098d34581G1797h033A20736
15461a43925D2166d70720d9058r194k1656D57981A89912l6451D8485f5947K2600
15450d3347j34007e0140A32957p659g3475C00317k9846B2367d8523j98471i5565
15438B9831a69330d8330F5395Q459P7721Q516a8249k41703I2003Q5207a63865
15426c59179a52559B12966f2830b2471F4302J27953a34358e5416O519C6969b21946
15414H6843l8479d022F1718b9610G8762b22930c8637q944M765m8727b8691k20500
15402b49191i5059C4294j2884a84972e6022l79907a20418D9524a38172D8678J87968
$$ y = [-11322, -34278, -2908, -167917, -59318, -264554, 52685, -252012, -442422, -81453, 249379, 154407, 283794, 178908, -83712, -171599, 125634, 158536, 43098, -434581, 71797, -8033, 120736, -143925, 42166, -470720, -49058, -58252, -79908, 457981, 189912, 153461, 48485, -65947, -43347, -177354, -50140, 132957, 125298, -73475, 300317, 270471, 22367, -48523, -246994, -95565, 29831, -169330, -48330, 65395, 73854, 151575, 160091, -18249, -259952, 92003, 177210, -163865, -359179, -152559, 212966, -62830, -22471, 64302, 192255, -134358, -55416, -48897, 36969, -221946, 86843, 48364, -4022, 61718, -29610, 78762, -222930, -38637, -47581, -42816, -91543, -28691, -249191, -95059, 34294, 21410, -184972, -56022, -435929, -120418, 49524, -138172, 48678, 236646]
15391B36646m5831b39376h2229r7852A34279a01166m4330f2007l8250I1163b10475
15379C59693c7900j42882E3140J55994B5273J78985G6811K41064e4884A14012
15368F0879j419a02472A0666K71314J18376G8054K37821h94r311I4474a23915
15356B45246d43323a26069d6374j24631k6485K3370g0790E5800J45597o1634a20130
15344a10706A28148E4954j8813K19873J02507O517d47902h2344A01645K23696
15334C25341j53090F3514K00609j12544E847J76807b68683B01063i326k07712
15324b17038N5489A98385a10364A73474E4577K24485H3554J66272C0949e3113
15313F1707a56201N1235c8762A30529l293B2797g1021A0082L1581a10383B30000
$$ y = [236646, 190815, -239376, -82229, -180081, 134279, -101166, -145496, -62007, -100257, 91163, -210475, 359693, -37900, -180782, 53140, 209134, 25273, 204258, 76811, 317875, -54884, 114012, 60879, 59460, -102472, 10666, 281980, 400356, 78054, 315875, -894, -10205, 94474, -123915, 245246, -443323, -126069, -46374, -171005, -197490, -174120, -70790, 55800, 201397, 139763, -120130, -110706, 128148, 54954, 36141, 256014, 358521, 365038, -447902, -82344, 101645, 325341, 172251, 63514, 264123, 151579, 5847, 182654, -268683, 201063, -9326, -217038, -161549, 198385, -110364, 173474, 54577, 279062, 83554, 249826, 30949, -53113, 61707, -156201, -104966, -38762, 130529, 127236, 22797, -71021, 10082, 41663, -110383, 230000]
15301a04756B58573g9152B22186f8683F1913L36774i2629K2956j85608B90099
15290A31561b02833i1075B3422a6081k61034J02603K8924G925K4553C958M5271
15279D9229A9445c9380j23471B52869r5189E9440a02606B24440p6565a79455h3630
15267C36158c0882j49950D7009J62223A03081P8051D6678Q5127a89720h5718b9421
15255D02320G4009a33128n2490C0553L14362J1842M17312R23916p84947L82352
15245A295390k375E14059A69651k0885b63531B59620d3409o1528B47416M4630
15235B92046b42022J5996F8955L5168k6295b29416A11644l8410P9376R1763j17469
15224A26904C5574K668b0366C685O0581k2507d6497k8800J9026I3656l4360a27458
$$ y = [-104756, 258573, -79152, 222186, -68683, 61913, 398687, -92629, -69673, -255281, 290099, 131561, -202833, -91075, 23422, -16081, -277115, -174512, -145588, 7925, 32478, 3958, 49229, 19445, -39380, -162851, 252869, 157680, 59440, -102606, 224440, 147875, -179455, -83630, 336158, -30882, -180832, 47009, 209232, 103081, 181132, 46678, 131805, -189720, -85718, -29421, 402320, 74009, -133128, -185618, 30553, 344915, 356757, 774069, 1697985, 913038, 1295390, 1293015, 514059, 169651, 148766, -263531, 259620, -43409, -104937, 247416, 292046, -242022, -226026, 68955, 104123, 77828, -229416, 111644, 73234, 152610, 244373, 126904, 35574, 38242, -20366, 3685, 64266, 41759, -46497, -75297, -56271, 93656, 59296, -127458]
15211a3703H3630J73721L8705C9947P4043l1993E712g562A09302a76282A85057
15199F0034K7806L22947g3229A24825b09274A28228L0167C9165b9006A3405N5105
15188F8510a93421l7140A79703p3119a93294q6004B20829n8681O9164J94248A80
15176B12489A2863L83099b63285I6740b3022A61927h7636A11404h7958A2442O2000
15165G4442b16487A37809d15196b03426H1857f6874j49313e5095B58349o2809
15155A95540m7302c9104A87304a99546d741B75382a2160E1131K90661c0300J0363
15144a9937I0107J55718j09413a30994f2399A73158D9623J50751G2994b5486B1510
15132A03144K59049j39327e8533H303L30658A49771L0947P9609J09233A04787
$$ y = [-13703, 83630, 257351, 296056, 39947, 113990, 81997, 5712, -7562, 109302, -176282, 185057, 60034, 87840, 410787, -73229, 124825, -209274, 128228, 158395, 39165, -29006, 13405, 68510, -193421, -230561, 179703, 106584, -193294, -279298, 220829, 162148, 231312, 425560, 180, 212489, 12863, 395962, -263285, 96740, -23022, 161927, -87636, 111404, -87958, 12442, 74442, -216487, 137809, -415196, -203426, 81857, -66874, -216187, -55095, 258349, 195540, 148238, -39104, 187304, -199546, -4741, 275382, -12160, 51131, 341792, -30300, -19937, 90107, 245825, 136412, -130994, -62399, 173158, 49623, 200374, 72994, -25486, 21510, 103144, 362193, 222866, -58533, 8303, 338961, 149771, 180718, 260327, 369560, 104787]
15121f4980A59405J9110b05149B11134c31627A84286b4857A16833L06244A47699
15110b2541H5055b1189k24898A66697p5298J07286D9248J83366k0631C2803O9772
15099A02575J93393n2581H7465L0700l3586h5354k3288B59322r2866A6249J34219
15088A50468M51826h7029A90775a138H9309a0609B86635j04631b35435A55939
15077A72091E5030K1976K12426L3929q4364f693A409K25275j3593b8762A43289
15065A30588b52544C87267d4949A04570J20517J14528m5482E1788K78711j49135
15055A81364N6902m8032R0405c9627A83751k4535P247K19734H5090a43494B70891
15043A65036J55335J08033A51285a1596C53720G3541K05091j23360m9185N6559
$$ y = [-64980, 159405, 178515, -205149, 211134, -331627, 184286, -24857, 116833, 423077, 147699, -22541, 85055, -21189, -246087, 166697, 91399, 198685, 49248, 232614, 211983, 32803, 102575, 295968, 243387, 87465, 118165, 84579, -85354, -108642, 259322, 166456, 16249, 150468, 602294, -87029, 190775, -1138, 89309, -10609, 286635, 182004, -235435, 155939, 172091, 55030, 77006, 289432, 323361, 238997, -6693, 1409, 226684, 213091, -28762, 143289, 130588, -252544, 387267, -44949, 104570, 225087, 339615, 294133, 51788, 330499, 181364, 238266, 190234, 280639, -39627, 183751, 159216, 166463, 386197, 85090, -143494, 270891, 165036, 320371, 428404, 151285, -11596, 353720, 73541, 278632, 155272, 106087, 162646]
15033A62646J3903m7750d8509A0618M10004i2052B47404r6115c5910A63243D0381
15021D19862A84948J29017j55667K52510a80754A36080M12597k55236b0011I7845
15010C72527A11777L59558A75211J27660a4409H0049J40678K19455q9353A14960
14999A28003k3627K02107D0000M65265e4304C03754J47559r2036j351j26965N8161
14988B89122q0889E6557h8369E41796A47661l0627L51223B06825E5930J7577K14324
14977B87831j03468K06830b7397m0412D04772l6127N7172A42224K04319a09561
14966B25648C3832O5034a9160C36524q5825K5266K12087r5953A3252J12700L6539
14955A62491J54179k2359j4903o8784a53410B81293J37039D1624a14364E72509
$$ y = [162646, 176549, 128799, -48509, 10618, 420622, -92052, 247404, 151289, -35910, 163243, 40381, 419862, 184948, 313965, 158298, 410808, -180754, 136080, 548677, 293441, -20011, 97845, 372527, 111777, 471335, 175211, 302871, -14409, 80049, 220727, 440182, 350829, 114960, 128003, 104376, 306483, 40000, 505265, -54304, 303754, 451313, 359277, 357926, 230961, 289122, 208233, 56557, -88369, 541796, 147661, 117034, 468257, 206825, 55930, 73507, 287831, 184363, 391193, -27397, -67809, 404772, 368645, 425817, 142224, 346543, -109561, 225648, 33832, 98866, -19160, 336524, 250699, 275965, 488052, 392099, 13252, 125952, 162491, 316670, 294311, 279408, 210624, -153410, 281293, 418332, 41624, -114364, 572509]
14944C08405j07203m2060Q1107B8399Q8261l0621J49241J28591j8712J57859j63875
14933C39143j00087J16348A31989O0243K15557j25948j700k1853P2121A56903
14922B21769J61193J3551j56039K81163j28623L85487H7318K44951P8368j6831
14912C93806G8737P5752B2668J20559J72268R3779l8337r7787A20594L34831C6823
14900B65455J64282j50542K17325I8734O5103J65997m6806l5273L15623F9544
14889C00305P8466A51018J31015A16725L89610A29102M26397B22523J57199M7687
14879D27409O1468k17758O809A33327K83438A34842K76613A93336P179K00981
14869D01496J30898J26449j43144k34253K00901j53327K05019j30172J8154J88474
$$ y = [308405, 201202, 159142, 240249, 28399, 116660, 86039, 235280, 363871, 345159, 503018, 339143, 239056, 355404, 131989, 192232, 407789, 281841, 280141, 258288, 330409, 156903, 221769, 382962, 396513, 240474, 521637, 393014, 778501, 87318, 332269, 410637, 393806, 78737, 154489, 22668, 143227, 315495, 409274, 370937, 273150, 120594, 455425, 36823, 265455, 429737, 279195, 496520, 98734, 163837, 329834, 283028, 247755, 563378, 69544, 300305, 378771, 151018, 282033, 116725, 506335, 129102, 555499, 222523, 379722, 427409, 488877, 271119, 277928, 133327, 416765, 134842, 411455, 193336, 200515, 401496, 532394, 658843, 515699, 281446, 482347, 329020, 534039, 403867, 422021, 610495]
14859F10495A75119L81083B53914K94068j72132A12395M14744p9974L21931B92573
14848D75758P8512k72289J20557j07982L7457K35909o7818J71909J37561B80492
14837D28928J37696p8420K31981j66172I1886L72451j76561K28851K12189C22452
14826D91011J2434P7888j93080L49649C67545J01071Q0538O3803k67561K68876
14816F14272k59695p1193K05942B38535L32332J25924j91657L9032J02387m3657
14806F02896E7469O08484k03896j22134J13594J55372B47841K55902j3473L34527
14796H24797k86010M53J12273B03731M22540j86495J00759J29972J550k23009
14786D49048Q2820o6634K77824C18385J51358O4538K47681k60587A46168M85051
$$ y = [610495, 175119, 556202, 253914, 547982, 375850, 112395, 527139, 447165, 769096, 292573, 475758, 554270, 281981, 402538, 294556, 332013, 567922, 500104, 672013, 809574, 280492, 428928, 566624, 488204, 720185, 554013, 91886, 464337, 287776, 516627, 728816, 322452, 491011, 503445, 581333, 388253, 737902, 367545, 468616, 549154, 612957, 345396, 614272, 354577, 283384, 489326, 238535, 570867, 696791, 505134, 544166, 646553, 602896, 57469, 665953, 462057, 339923, 453517, 608889, 247841, 503743, 490270, 824797, 538787, 539240, 651513, 203731, 626271, 439776, 540535, 670507, 672057, 449048, 531868, 465234, 743058, 318385, 469743, 534281, 781962, 521375, 146168, 631219]
14776F31219k40260O4678J01100L12884J5767l23519K20765J9298n6002k85593
14766D60337K47655C02085K12232P3346L25590D11848L97281k99695M50552j28735
14756H31251C97217J11434k3253J52608K47167k81918q5016J52381J02969r2265
14746F81324j65068K49886j67579q8395p4811Q0156N5199J80J05546K46524J93921
14735A116883E51784O0560M51599l34148k0935O1284J08590m03959L63338j46317
14725F91796k7109L64019k22088J42230k17411L87278k68018k9939m8662N9447
14715H31543j92710k0935J62615M0518O0683K82626l68771K12573j74634j91404
14705F42104J65377k8245J51986K19157k93190O9591r3296k60693P82969n98334
$$ y = [631219, 390959, 455637, 556737, 869621, 885388, 561869, 782634, 801932, 745930, 460337, 707992, 302085, 514317, 587663, 913253, 411848, 809129, 509434, 959986, 831251, 397217, 508651, 485398, 638006, 885173, 603255, 518239, 670620, 773589, 681324, 516256, 766142, 598563, 510168, 435357, 515513, 570712, 570892, 676438, 922962, 1116883, 551784, 612344, 1063943, 729795, 708860, 770144, 878734, 474775, 838113, 691796, 664687, 1028706, 806618, 948848, 731437, 1118715, 850697, 820758, 772096, 831543, 638833, 617898, 780513, 821031, 881714, 1164340, 795569, 1008142, 833508, 642104, 807481, 779236, 931222, 1150379, 857189, 926780, 833484, 572791, 1355760, 757426]
14695G57426r3782N35736l20077j22625k528K46437J00676j38037k86797M5411
14685G21840N51230k52366K7971l77850L74527l0871M50106n10124j14566j82595
14675F57302Q8709N24905n81105L50877l27002N26907j1153k77106p4329J36322
14665A014327K59433l15110J71895q7603k44500J48056J73128m6517K81885k44259
14655A110735R8524M2310O1184k29166J53486J56098l64593K2601R7290k65252
14645H83217K30161K25512L7249k32788J94054j53090j96596L23445n0790J43331
14635A403705L18639j02845l58018L35584k29817j08894L50214j35076J70365
14626A643857l42071j21006M78060j01157k00524l48140M98591r924K66699q3719
$$ y = [757426, 663644, 1199380, 879303, 756678, 754150, 1000587, 1101263, 963226, 676429, 721840, 1273070, 1020704, 1048675, 670825, 1045352, 1014481, 1464587, 954463, 839897, 657302, 746011, 1270916, 689811, 1040688, 713686, 1240593, 1229440, 952334, 878005, 1014327, 1273760, 958650, 1130545, 1042942, 798442, 946498, 1119626, 1073109, 1354994, 1110735, 1209259, 1251569, 1312753, 1083587, 1237073, 1393171, 1028578, 1051179, 1148469, 883217, 1113378, 1338890, 1376139, 1143351, 1337405, 1184315, 987719, 1311164, 1260374, 1403705, 1722344, 1619499, 1261481, 1597065, 1367248, 1258354, 1608568, 1473492, 1643857, 1301786, 1180780, 1658840, 1557683, 1357159, 1009019, 1507610, 1497686, 1764385, 1680666]
14616A680666k80621J96115l42769J62005J44285j69877K56684k01742J09162
14607A553908J94249k48292J13788M07832j70006k68094O2213l52131L44382J59818
14597A797667O212q2689j18294K17944j99455J51522K0165J4899J02788j67875
14587A742884J36847m1857k19750P5868J14725j08850N92194m11822L84023l8288
14577B225974k87625P0028K03344M9018R0252K0011j80771L76892j91145m0221
14567B335757k2520k18178Q5427O91J97549K71048L7889Q8866J5670M0260J08729
14556B941188L44903K12587J02519N18325O5443R14079P50982K020527M360270
14547A2230823Q455241K0582331Q733243B0490526G989543l505791j175000n29130
$$ y = [1680666, 1400045, 1596160, 1253391, 1415396, 1559681, 1389804, 1646488, 1444746, 1553908, 1748157, 1499865, 1613653, 2021485, 1851479, 1583385, 1645598, 1293467, 1637849, 1797667, 1803879, 1721190, 1602896, 1820840, 1621385, 1772907, 1793072, 1807971, 1910759, 1742884, 1879731, 1837874, 1618124, 1693992, 1808717, 1699867, 2292061, 1880239, 2264262, 2225974, 1938349, 2008377, 2211721, 2260739, 2350991, 2371002, 2190231, 2567123, 2375978, 2335757, 2313237, 2095059, 2180486, 2181177, 2378726, 2649774, 2687663, 2776529, 2792199, 2832459, 2941188, 3286091, 3498678, 3601197, 4119522, 4184965, 5099044, 5850026, 7870553, 12230823, 20686064, 41268395, 50001638, 20490526, 7989543, 4483752, 3308752, 2779622]
14539B779622o29005J27205l08922R2393J2674k17131K15834J12276J32925j56448
14529B161423M43720n86920K20320K82325n5167n6008O7684R8891j6908M10061
14519B969421l51540L2021j30581K48382r3727J23780J3579P9154J91812J7492
14509C099793o7062P7423j55672o1688K77804r3217p5644K0017M42696m47885
14499C016565K50496J18377K0N4355K47534n42285J57602j2764J94414L4653l31226
14488C187741N93901P4332m53240M35423J51005k09269K41498j41843J14424N1194
14478D045166k38185N67649L541o2255m7507J88135o6574M0505J03493j8367J40713
14467D656314r4225L1391K60291J56033o4303j07971L66078j99108o2755K81836
$$ y = [2779622, 2150617, 2277822, 1968900, 2061293, 2073967, 1856836, 2072670, 2184946, 2317871, 2161423, 2605143, 2018223, 2238543, 2520868, 2465701, 2409693, 2477377, 2576268, 2559360, 2969421, 2617881, 2649902, 2519321, 2767703, 2673976, 2797756, 2811335, 2890489, 3082301, 3099793, 3032731, 3110154, 2954482, 2892794, 3170598, 3077381, 3001737, 3021754, 3464450, 3016565, 3267061, 3385438, 3385458, 3439813, 3687347, 3145062, 3302664, 3289900, 3484314, 3518967, 3187741, 3781642, 3855974, 3402734, 3838157, 3989162, 3779893, 4021391, 3879548, 3993972, 4045166, 3806981, 4374630, 4378171, 4315916, 4268409, 4456544, 4389970, 4430475, 4533968, 4515601, 4656314, 4562089, 4593480, 4853771, 5009804, 4945501, 4837530, 5203608, 5004500, 4941745, 5223581]
14457E223581l34220N89796l52586L01373Q9905l21632K96405P4564m7326M22444
14447E942304O9009P9222k39309M6992J54040R9174K20476K27132k25488n7668
14437F315884L89525J4913R4478J94215J16431j48355M61454k01765n0911N70633
14427G756502r4993j61239J83481m0277R5550K63875P1677L3297J68320j30499
14417H145694N38299J18246k6350J98573j5324N45816J4846J5253J02836j6460
14407I621429M84636L17052L6625m1195L0319M24514p811L42627j71676Q7015
14397A1123535M99964J177L05078N04491J10758Q595L52639K41396K36096J01925
14387A3485654M49389j00918L68528P9378L33604L84924J24287J41703M63620
$$ y = [5223581, 4889361, 5479157, 5126571, 5427944, 5517849, 5196217, 5492622, 5567186, 5519860, 5942304, 6011313, 6090535, 5851226, 5898218, 6052258, 6151432, 6371908, 6599040, 6373552, 6315884, 6705409, 6720322, 6814800, 7009015, 7125446, 6977091, 7438545, 7236780, 7185869, 7756502, 7661509, 7500270, 7683751, 7643474, 7739024, 8002899, 8074576, 8107873, 8276193, 8145694, 8683993, 8802239, 8775889, 8974462, 8959138, 9504954, 9519800, 9535053, 9637889, 9621429, 10106065, 10423117, 10459742, 10418547, 10448866, 10873380, 10865569, 11208196, 11036520, 11123535, 11623499, 11624676, 11929754, 12434245, 12545003, 12553598, 12906237, 13147633, 13383729, 13485654, 13935043, 13834125, 14202653, 14282031, 14615635, 15000559, 15124846, 15266549, 15730169]
14378A5730169K60400N18488p7439N78634K96827M08166J87291L06066L70704
14369A8579306M39395O91721L77898K89770N06918N5587Q70692L95966O65668
14360B2872921K49512M51632O22584M16420R20711J85344Q14699O34481M33875
14351B7602179P16895O33447Q49829P71517R38343L45483R80990P81973Q11574
14342C4432230J482866O41586R59771J015856P35495J293792J341427J215249
14334D3118272R55972J386558J318258J498524J783492J110636J695705J848081
14326E4715498J741668J808966J952833J784064K155051K346771K681150K326545
14318G1512546K544293K959693K859092K738106L416692L076819L590954L912101
$$ y = [15730169, 15990569, 16509057, 16431618, 17010252, 17307079, 17715245, 17902536, 18208602, 18579306, 19018701, 19710422, 20088320, 20378090, 20885008, 20940595, 21811287, 22207253, 22872921, 23122433, 23574065, 24196649, 24613069, 25533780, 25719124, 26533823, 27168304, 27602179, 28319074, 28952521, 29802350, 30573867, 31512210, 31857693, 32838683, 33620656, 34432230, 35915096, 36556682, 37516453, 38532309, 39267804, 40561596, 41903023, 43118272, 44074244, 45460802, 46779060, 48277584, 50061076, 51171712, 52867417, 54715498, 56457166, 58266132, 60218965, 62003029, 64158080, 66504851, 69186001, 71512546, 74056839, 77016532, 79875624, 82613730, 86030422, 89107241, 92698195, 96610296]
14310I6610296L902089M069788M424152M509534M925790N035623N763064N947123
14302A35187459N824724O611186O737602P453861P683367Q018952Q703205R390384
14294A95610740R402419J0162454J0833619J1412335J1851212J2516613J2821545
14287B74610937J3417611J3801083J4362338J4782266J4724818J5221408J4776634
14280C75697095J5017687J4241367J3687539J2475624J1975943J0312202Q158519
14273D61565976M602242K144218K69152j39546k0713m233872o275641p759051
14265D50152765r078885j0654220j2095010j2878278j4249442j4712443j5634550
14258C60849937j5441761j5478442j5453998j3763164j4350715j3896741j2957346
$$ y = [96610296, 100512385, 104582173, 109006325, 113515859, 118441649, 123477272, 129240336, 135187459, 141012183, 147623369, 154360971, 161814832, 169498199, 177517151, 186220356, 195610740, 205013159, 215175613, 226009232, 237421567, 249272779, 261789392, 274610937, 288028548, 301829631, 316191969, 330974235, 345699053, 360920461, 375697095, 390714782, 404956149, 418643688, 431119312, 443095255, 453407457, 461565976, 466168218, 468312436, 468581588, 468442042, 468421329, 464187457, 457911816, 450152765, 441073880, 430419660, 418324650, 405446372, 391196930, 376484487, 360849937, 345408176, 329929734, 314475736, 300712572, 286361857, 272465116, 259507770]
14251B59507770j2906027j1947800j1685313j0649923j0479356r507691r125242
14244A83206418q212540q532122p509244p155575p432553o216532n884587n115751
14236A27147514n830865n037808n254849m352235m118222l686836l820851m104947
14228I0940901l372591l470814l310580k631899k654294l097874k598482k115749
14220F7688618k239859j837581k110082k193117k443686j585491j388209j296710
14212E2593883j771663j438573j922337j393384j163896r50071j085413j488789
14204D1379757j113424j329952n27299r03877r48240q31542j521128n79870j001882
14195C2622543q29676m35235r43305p23641o55615r57860l79147r65222n08325
$$ y = [259507770, 246601743, 234653943, 222968630, 212318707, 201839351, 192331660, 183206418, 174993878, 166461756, 158952512, 151796937, 144364384, 138147852, 132263265, 127147514, 121316649, 116278841, 111023992, 106671757, 102553535, 98866699, 95045848, 90940901, 87568310, 84097496, 80786916, 78155017, 75500723, 72402849, 69804367, 67688618, 65448759, 63611178, 61501096, 59307979, 56864293, 55278802, 53890593, 52593883, 50822220, 49383647, 47461310, 46067926, 44904030, 43953959, 42868546, 41379757, 40266333, 38936381, 38409082, 37505205, 36556965, 35725423, 34204295, 33624425, 32622543, 31792867, 31357632, 30414327, 29690686, 29035071, 28077211, 27698064, 26732842, 26224517]
14186B6224517o57185o04038l99231l45550q87389k61410n70321m55385k17010
14177B1826998n67987n02301o06261j07831n88943k63556o48841j62278l00853
14168A8078147k17770n45140k95583m62598N268l53094n88343O770k51378k75931
14158A5100348l75123k29138l54063k49663K96736m77420l00481k01173k38881
14149A2971142k21076Q3433m32233m2044l12504N4722j70818m27626k11883m30321
14139A0860792L21002o39998J95361l47974k76028J58126p2000l13257m7261n9737
14129I779026p31382J3273J77151j41853m1050m75348J83697k67820j37755j18352
14119H239587k9703m33530M27517n7796m12945J13210k88841j86466J89834k82724
$$ y = [26224517, 25567332, 24963294, 24564063, 24218513, 23331124, 23069714, 22499393, 22044008, 21826998, 21259011, 20756710, 20150449, 20042618, 19453675, 19190119, 18541278, 18379000, 18078147, 17860377, 17315237, 17019654, 16557056, 16562324, 16209230, 15620887, 15627657, 15376279, 15100348, 14725225, 14496087, 14142024, 13892361, 14189097, 13711677, 13411196, 13210023, 12971142, 12750066, 12833499, 12401266, 12359222, 12046718, 12101440, 11930622, 11502996, 11291113, 10860792, 11181794, 10541796, 10737157, 10389183, 10113155, 10271281, 10199281, 9886024, 9838763, 9779026, 9047644, 9060917, 9238068, 9096215, 9055165, 8579817, 8763514, 8495694, 8357939, 8239587, 8209884, 7776354, 8203871, 8146075, 7733130, 7846340, 7557499, 7371033, 7560867, 7278143]
14109G278143L5084l4951k24199r3213n4952J1744k92941J0318k40256L01896
14099F696673l31207k82767j43819K21439J55253l16686m93509P46925o25066
14090E627236K95791n3613j63006j72369k5150j82796K71139k73636r1851p5134
14080E156611r7822j95460K51081l33435J12480j63106J36666j465k28267q3139
14070D554144j18610L97236l32246j1990j25213q2239L34897m40890J57354M5481
14060D377924J51169j06954j05081Q7875J38113k03688l88772j27325J34167j9036
14050C938392L1687J53095k01296j11306k59340P3382k3464O5072J97173k65181
14040C598214l02826L53151k00176j64134l0531J91713N066j10968K46664k63968
$$ y = [7278143, 7313227, 7278276, 7054077, 6960864, 6905912, 6917656, 6624715, 6635033, 6394777, 6696673, 6365466, 6082699, 5938880, 6160319, 6315572, 5998886, 5505377, 6252302, 5627236, 5923027, 5869414, 5706408, 5534039, 5508889, 5326093, 5597232, 5323596, 5231745, 5156611, 5058789, 4863329, 5114410, 4780975, 4893455, 4730349, 4867015, 4865550, 4637283, 4554144, 4435534, 4832770, 4500524, 4488534, 4363321, 4281082, 4615979, 4175089, 4332443, 4377924, 4529093, 4422139, 4317058, 4404933, 4543046, 4339358, 3950586, 3823261, 3957428, 3938392, 3970079, 4123174, 3921878, 3810572, 3551232, 3624614, 3601150, 3666222, 3863395, 3598214, 3295388, 3648539, 3448363, 3284229, 3253698, 3445411, 3450477, 3339509, 3586173, 3322205]
14030C322205n1774m0687j76336L0601K01583k82293m1215K5186J71269J07039
14020C265578k75449l79773L50686j30086L0467k42719k69358L37571j87961j49639
14010B349317L04199l84334L98924q7452p1685j98547J70779J60416L5761j52221
14000B525157j89210O9203k76595Q6608j6365O1393j23832M13967m26347L50428
13990B474407N49840R30801K743880O531907J9478309J8953090B5583120j2502993
13982A3080127m874603j931860q64844p67949m29875m78509m17439k82317L20611
13973C353342l80753P8228l26330k49245J91173j89644o2827J37392l32273K04464
13963B423527J24498p1252j32613J63141k35944r64r107P6645l71659L14043n35474
$$ y = [3322205, 3270431, 3229744, 3053408, 3084009, 3285592, 3003299, 2962084, 2987270, 3158539, 3265578, 2990129, 2610356, 2961042, 2830956, 2861423, 2618704, 2349346, 2686917, 2498956, 2349317, 2653516, 2269182, 2668106, 2580654, 2508969, 2310422, 2481201, 2641617, 2677378, 2525157, 2335947, 2405150, 2128555, 2215163, 2198798, 2260191, 2136359, 2550326, 2123979, 2474407, 3024247, 3955048, 6698928, 13230835, 32709144, 51662234, 25583120, 13080127, 8205524, 6273664, 5408820, 4640871, 4210996, 3732487, 3315048, 3032731, 3353342, 2972589, 3050817, 2724487, 2475242, 2666415, 2476771, 2413944, 2551336, 2219063, 2423527, 2548025, 2476773, 2344160, 2507301, 2271357, 2270393, 2261286, 2337931, 1966272, 2280315, 1744841]
13952A744841M22567n9051m0711L18760k52787J15789m82357R1631K10245K45061
13942B313988l90326j28923L03553j03406j37096m0403L09999l14961m8271L24529
13932B088683j44401k02395K25243l73649J96290O0035N6481J35993K6464q06140
13922A262604L83675J32989k31907J59046n1012O846Q7108j6895r4572N6213l61430
13911A332665J45274j77549Q0922k52832J23677J83680N28286l98525L30173n45632
13901A350139M9437O6020j57841L18580l20478K79550j02127r0090j10301K29474
13891A512363k77952K64566k6760j25118j79632J66017M6327j07562k60248O1454
13881A073455J50278J99952k57746K45596j87796P5291Q9503P808o9015o9211
$$ y = [1744841, 2167408, 2108357, 2067646, 2386406, 2133619, 2249408, 1767051, 1858682, 2068927, 2313988, 1923662, 1794739, 2098292, 1994886, 1857790, 1817387, 2127386, 1812425, 1764154, 2088683, 1944282, 1741887, 1967130, 1593481, 1789771, 1849806, 1906287, 2042280, 2068744, 1262604, 1646279, 1779268, 1547361, 1706407, 1655395, 1662241, 1749349, 1732454, 1637882, 1694095, 1332665, 1477939, 1300390, 1381312, 1128480, 1252157, 1435837, 1964123, 1565598, 1895771, 1350139, 1399576, 1465596, 1307755, 1626335, 1305857, 1585407, 1483280, 1393190, 1282889, 1512363, 1234411, 1498977, 1472217, 1347099, 1167467, 1333484, 1379811, 1272249, 1012001, 1073455, 1223733, 1423685, 1165939, 1411535, 1223739, 1299030, 1388533, 1396341, 1327326, 1258115]
13871A258115j59911J45895J62576j11353P7537r9832k07642J13091K09671l78885
13861A009262j33441O79605k92338k14443j78949K83067j34254q484K19545l04647
13851I24923J72184k9304L9214M9731j02874k7913k76762K76912R1665j39253
13841I78523J58475k5854L22894n24600o013K41202n71215K56901n6200L69517
13831A143630k00128n2803n9348K61953J08302k99827q3840J24091o0843L81063
13821A262250l46705K1788J56233j06243k24068J33638N9478Q4118n5627o4874
13811I19988j31055k8271K20852K14698l71635k52045J55280K7588P0535L95766
13801A221701m13786M35916k43856j20370M3570J05244k6994k55706J58475L4288
$$ y = [1258115, 1098204, 1244099, 1406675, 1295322, 1372859, 1273027, 1065385, 1178476, 1388147, 1009262, 875821, 1555426, 1263088, 1048645, 869696, 1152763, 1018509, 1010025, 1229570, 924923, 1097107, 1067803, 1107017, 1156748, 1053874, 1025961, 749199, 1026111, 1117776, 978523, 1136998, 1111144, 1434038, 909438, 903425, 1144627, 573412, 830313, 774113, 1143630, 943502, 890699, 831351, 1093304, 1201606, 901779, 817939, 942030, 881187, 1262250, 915545, 937333, 1093566, 987323, 763255, 896893, 956371, 1040489, 984862, 919988, 788933, 760662, 981514, 1196212, 824577, 572532, 727812, 755400, 825935, 1221701, 807915, 1243831, 999975, 879605, 923175, 1028419, 1001425, 745719, 904194, 938482]
13791I38482L96285m88394K6590l4538j49988R360K89509j51287O2740N3707l10343
13780F42123L50142M469k36342J83823Q1807n0152n7979k9000k22658L56828k69497
13769G53564K19718j80805P3099j69982C33759O97287l11352J25142j10023J89654
13759I24467k03306j06967K35919j89621j06578L46795O2498j79058J70286C78923
13748B72458M38734C32780M41196n9788J90185j9572O6074j22279o2674k58930
13738E06992O1634K43464k0251R9037l2869K2493k11930j22153l6991j9445o8615
13727D21366K90871j37535J48221o223j60630L12610K7877l40007J77274Q5048
13717H18872j07000K78879m5046C63564K86223j11545l5067J69461j29290o527
$$ y = [938482, 1334767, 846373, 872963, 838425, 688437, 697797, 987306, 836019, 898759, 952466, 642123, 992265, 996734, 760392, 944215, 1026022, 975870, 917891, 888891, 666233, 1023061, 753564, 973282, 792477, 865576, 695594, 333759, 1031046, 719694, 844836, 734813, 924467, 721161, 614194, 850113, 660492, 553914, 900709, 963207, 784149, 954435, 378923, 272458, 711192, 332780, 773976, 714188, 904373, 884801, 950875, 828596, 765922, 506992, 568626, 812090, 791839, 890876, 858007, 880500, 668570, 546417, 509426, 489981, 421366, 712237, 574702, 722923, 716700, 556070, 868680, 896557, 556550, 733824, 818872, 711872, 990751, 945705, 363564, 649787, 538242, 503175, 672636, 543346, 536819]
13707E36819j60087K63331L8317A45418Q01840l09620K19482D21857l2931M31232
13697H20158j44489j07647j78149L57952n9521k08136P4035K31054C13492K59121
13687E72613O2807M9754R1039j70648j6999j62039L48298k69222K41314L6880
13677G83797J0678j20004l11038N6924p0840L80376p4054K1419l34860L47400
13667F89798A33062K54714K25306k51843L42315k59024L51861l75494k7438P7946
13657D71405j09521M92548D14004N0601L37178k56847B57698Q1750L69652j19566
13647E89534H5279P9198K43564L85180J1122j43071K3686l41719j6983j5239m0473
13636B70544R1361r2980K44609A76489M49030j25378K09199o9643C13721J85240
$$ y = [536819, 376732, 640063, 678380, 145418, 947258, 637638, 857120, 421857, 388926, 820158, 675669, 568022, 389873, 747825, 688304, 480168, 554203, 785257, 313492, 572613, 635420, 685174, 776213, 605565, 588566, 426527, 774825, 505603, 746917, 783797, 794475, 674471, 363433, 420357, 349517, 729893, 655839, 677258, 342398, 689798, 133062, 387776, 613082, 361239, 703554, 444530, 796391, 420897, 393459, 471405, 361884, 854432, 414004, 464605, 801783, 544936, 257698, 339448, 709100, 589534, 85279, 164477, 408041, 793221, 804343, 661272, 684958, 343239, 326256, 311017, 270544, 361905, 268925, 513534, 176489, 625519, 500141, 709340, 639697, 313721, 498961]
13626D98961k35909J41575J97825k42699K83870C14165j37604K84346R8183j08066
13616D51024A75496k3303L34319O3795J43498k20904J2348n7996R7680k59541
13606B65392L72797m7120k78934G3535K74893A68880J96073N2283m4532j60083
13596B12621K25049k160j17611L7396M2126o4586l5305n6985L37640j52724r204
13585D16257J36949L3467n8912B08250m1144O64321l75232L34103C28594K74483
13575F03077B12081L4946N66991A47774R2725K62371k44173I0122J71771L25532
13565E87425E6282K87569k2328d3162C73985n1804m1630P7833J61633A66882P6156
13554B43038P1308q5176O0151K12896R5019A47224K12381n7222I2631M55628k74044
$$ y = [498961, 263052, 404627, 602452, 359753, 643623, 314165, 176561, 460907, 559090, 451024, 175496, 152193, 486512, 550307, 693805, 472901, 485249, 427253, 524933, 265392, 638189, 591069, 312135, 73535, 348428, 168880, 364953, 417236, 372704, 212621, 437670, 435510, 317899, 355295, 397421, 332835, 297530, 240545, 578185, 425461, 416257, 553206, 586673, 527761, 208250, 167106, 831427, 456195, 790298, 328594, 603077, 212081, 247027, 814018, 147774, 240499, 502870, 258697, 90122, 261893, 587425, 56282, 343851, 321523, -43162, 373985, 322181, 280551, 358384, 520017, 166882, 243038, 314346, 229170, 289321, 502217, 597236, 147224, 359605, 302383, 92631, 548259, 274215]
13543B74215j16721L89744e1058E09446A39537M12284B65307P082K2671K49589
13533E44649j15430M6799J68955A84047J39575k8434Q4231r727H0932J88800R8797
13522C68529j18415K84238G2412J69989B8471Q9926L04210m1728r3125r2902J17047
13511C11899R1820J53956p1508B7096J83362q2183J30705C2494K08803N7452J48384
13500D47133j97131I3182J67422J25729A42302P6141Q2958J04772P3942B35724
13489C9535L22808j53458J01716A23084B5255K04169B3762K11540Q1113j36001
13479A80414K81672B12747J93817L9500o390K8056j18563f7020B31936d7796A20050
13467G3310q210M27628m8498A97401J16685p9998n7440Q3854j5072H5410L19387
$$ y = [274215, 157494, 547238, -51058, 509446, 139537, 551821, 265307, 272389, 295060, 544649, 429219, 476018, 644973, 184047, 323622, 295188, 379419, 369692, 80932, 269732, 368529, 250114, 534352, 72412, 242401, 28471, 118397, 422607, 380879, 287754, 194852, 311899, 403719, 557675, 486167, 27096, 210458, 128275, 258980, 32494, 241297, 298749, 447133, 250002, 93182, 260604, 386333, 142302, 218443, 301401, 406173, 480115, 235724, 39535, 362343, 208885, 310601, 123084, 25255, 229424, 23762, 235302, 316415, 180414, 462086, 212747, 406564, 446064, 439674, 467730, 349167, -67020, 231936, -47796, 120050, 73310, 65100, 492728, 444230, 197401, 314086, 234088, 176648, 260502, 245430, 85410, 404797]
13456D04797o5960k7089Q7879F3880N98822B53279K2155m8111r771O7997K50568
13445E36117H2017J98224A07676C3419L99807n3680C1376K24911R2341A30412
13434B37151O3821J14580Q4752j67144j04765Q7050c8173D18547q1473G5272J69080
13423B44352J13612A73995K980J40883a12534C22762B4595J38646J16440J68698
13413D48379j21400A40938n1030b39961A42878j6368M68144a07692A16588N25651
13403F42239B07509J58202j24007J87118A70098J31336A25572F1321K05183H365
13392B34230J16407j58756A5113a39164C86501A05034J44492Q4426L3858o0769
13382C07041P4688c9769B46961K0056G4508a9841B10945K85762F6351j3964P0585
$$ y = [404797, 338837, 311748, 399627, 63880, 662702, 253279, 275434, 227323, 217552, 285549, 536117, 82017, 280241, 107676, 33419, 433226, 379546, 31376, 256287, 348628, 130412, 237151, 300972, 415552, 500304, 333160, 228395, 315445, -38173, 418547, 337074, 75272, 244352, 357964, 173995, 176975, 317858, -112534, 322762, 24595, 163241, 279681, 448379, 326979, 140938, 89908, -239961, 142878, 126510, 594654, -107692, 116588, 642239, 207509, 365711, 241704, 428822, 170098, 301434, 125572, 61321, 266504, 8365, 234230, 350637, 191881, 15113, -139164, 386501, 105034, 249526, 333952, 367810, 307041, 381729, -39769, 246961, 267017, 74508, -19841, 210945, 496707, 66351, 52387, 122972]
13371A22972L50794A20943L34699J02769n0800A56576A1880H36a3035A24758L20593
13360D45351m0157j67340K47165k7231e5172A30017J18509J63160m3214A67065
13349A67185K73273A43719K94141j46529L25249C4578N24425k20979j13029J05576
13339C30571E8811M75907J15562B24485R7064J74780C732Q7388j6296K08653B1491
13327G1392J11409K2660j0219M5484o783F9064l3042J29058J00550J11281I5267
13315B66421e0434D55349d40065h2858A2462K05279A02849M8738O6321L19229
13305E37137A17495D3189g1955I2886a30178A15571J39071L4220b1555C33916
13294C51544d7532A94770n7393K92441b512D20605C8643g4548B96786B9749L25440
$$ y = [122972, 473766, 120943, 455642, 558411, 507611, 156576, 11880, 836, -13035, 124758, 445351, 405194, 237854, 485019, 457788, -55172, 130017, 248526, 411686, 368472, 167065, 167185, 440458, 143719, 437860, 291331, 616580, 34578, 559003, 338024, 224995, 330571, 58811, 534718, 650280, 224485, 321549, 496329, 3732, 91120, 74824, 283477, 21491, 71392, 182801, 205461, 195242, 240726, 233943, 69064, 36022, 165080, 265630, 376911, 95267, 266421, -50434, 455349, -440065, -82858, 12462, 217741, 102849, 151587, 217908, 537137, 117495, 43189, -71955, 92886, -130178, 115571, 254642, 288862, -21555, 333916, 351544, -47532, 194770, 137377, 429818, -2512, 420605, 38643, -74548, 296786, 29749, 355189]
13283C55189j07921D6274K20828Q1360j49871C7830P7670J1081N3849K83795k17288
13272B46937r6580a09792I7194b14587I0018m3609b28042F6706K60129E803K9146
13261C4949L12121j17624J19919H8482O5323l5667C982L59361j9286j63900D0757
13249B33908H2375J01372k2550L3705n3220F188M0410J98709p8405j2842a3114
13237C39322j34336a17279I8703J2696C9410c574E12480B3459L94578r9224i9993
13225A54765l7411J79084A16693J39389J02804A49630b18666A79628a24264B43112
13214A06632a36828B21137p135k4235J51637j7438o5295k5637A8289K69609j13324
13203A74574K45351d5550B2115M3058K13414L26782f7012B48723G6047K6707h4491
$$ y = [355189, 247268, 46274, 267102, 348462, 198591, 37830, 115500, 126581, 180430, 464225, 246937, 150357, -109792, 97194, -214587, 90018, 46409, -228042, 66706, 326835, 5803, 34949, 347070, 229446, 349365, 88482, 153805, 118138, 3982, 363343, 344057, 180157, 40757, 233908, 82375, 183747, 161197, 194902, 141682, 6188, 46598, 245307, 166902, 154060, -13114, 339322, 204986, -117279, 98703, 111399, 39410, -3574, 512480, 23459, 418037, 318813, -99993, 154765, 117354, 296438, 116693, 256082, 358886, 149630, -218666, 179628, -124264, 243112, 106632, -136828, 221137, 214002, 189767, 341404, 323966, 258671, 233034, 18289, 287898, 174574, 419925, -45550, 22115, 65173, 278587, 605369, -67012, 248723, 76047, 102754, -84491]
13191A17313M0582D1125P6613a30865B30191b86175A20340e437G2706Q7677a70632
13179A95822L26G2019P5468J51853j04953C1665J02439K28038K09719A84250Q2130
13168B66380o6218D175b39325I156J97473K5626L9390a87379A22193j4399J8087
13157A25881b30043D00499R0098c8821A59944B4917L28250n2013b26841A6754
13146B08462J39819g9602C17864G5930K6977K51564F7831b58873e5453B17828
13135a40286B19854j09501A3172K8347P2140b36269C528Q8782a66639D26608a16633
13123i7859C66103B0788J42777A9027i0971p3668B25183a68061C57525h7927A43639
13111E54885A49791c23858f5309A09248J71835K20815B22259A2199e2406E578
$$ y = [117313, 157895, 41125, 117738, -130865, 230191, -286175, 120340, -5437, 72706, 160383, -170632, 195822, 196148, 72019, 147487, 299340, 194387, 31665, 134104, 362142, 571861, 184250, 266380, 200162, 4175, -239325, 9156, 206629, 232255, 271645, -187379, 122193, 107794, 125881, -230043, 400499, 490597, -38821, 159944, 24917, 353167, 301154, -226841, 16754, 208462, 348281, -79602, 317864, 75930, 102907, 354471, 67831, -258873, -55453, 217828, -140286, 219854, 110353, 13172, 41519, 113659, -236269, 3528, 92310, -166639, 426608, -116633, -97859, 366103, 20788, 163565, 19027, -90971, -164639, 225183, -168061, 357525, -87927, 143639, 554885, 149791, -323858, -65309, 109248, 281083, 501898, 222259, 12199, -52406, 5578]
13100A40935Q466J45511l1739B2742J36608J47941a65071D25676B8933J90883
13090B19816a87556A48809f2479C34781r0911q4315b167l6508C75740d3944a5078
13078E48343F7375J71097g9082j08783c2134C59324j07648r0346e3315g318G4667
13066B9117J12055n0544a57750B55666J54749q417c8325j30067E1813a12422B39682
13054B37366Q8802E7614L07410j72267N7362c12153B05592b769C03123j01915
13044B01208a14832D8677L08317I6652M3341l1520I525O8346b0339o5724B05589
13032B18870r6461J3111j0308o0817J15266B9846J08308F3910d4294J4164A28029
13020a02363C77779A81880j6662R8890a7679l7226B30095j7495K97929A3816O6458
$$ y = [140935, 149401, 294912, 263173, 22742, 159350, 307291, -165071, 425676, 28933, 219816, -187556, 148809, -62479, 334781, 243870, 159555, -2167, -38675, 375740, -43944, -15078, 548343, 67375, 238472, -79082, -187865, -32134, 359324, 251676, 161330, -53315, -7318, 74667, 29117, 141172, 90628, -157750, 255666, 410415, 401998, -38325, -168392, 51813, -112422, 239682, 237366, 326168, 57614, 365024, 192757, 250119, -312153, 205592, -2769, 303123, 201208, -114832, 48677, 356994, 96652, 139993, 108473, 9525, 77871, -20339, -86063, 205589, 218870, 122409, 135520, 125212, 64395, 179661, 29846, 138154, 63910, -44294, -30130, 128029, -102363, 377779, 181880, 165218, 264108, -17679, -54905, 230095, 212600, 510529, 13816, 80274]
13009H0274K93216b01999B78923J2412I584J53018J04562B3210i2875K4602j17929
12998a86202B53760g0639C35109J0031g3643A27429E0064h8141A47452B1468b47832
12986A59260K24487A08339N17270A78112g1576F2329A9443R5465b6232k7626D2097
12974a54772A33485n0068K3767l740J30293K22714A88012N0098r3998C7819J44046
12963A81865A584b95777A70376a67479e980A4600K47632b59572B04147q7516c2348
12951E6979N3002K27512b21780G1294O451L24958a16248A82096m6416Q2353F8339
12939A19064N6476C1146K56600A21186b9309B76239A8016a53651E5254J6429g5553
12927B03421R3287j15977B6716a29832l3565B05252I7909J91806a09645A98043
$$ y = [80274, 373490, -201999, 278923, 291335, 9584, 162602, 267164, 23210, -92875, -68273, -186202, 253760, -70639, 335109, 345140, -73643, 127429, 50064, -88141, 147452, 21468, -247832, 159260, 383747, 108339, 625609, 178112, -71576, 62329, 19443, 114908, -26232, -53858, 42097, -154772, 133485, 83417, 107184, 103444, 233737, 456451, 188012, 238110, 144112, 37819, 181865, 1584, -295777, 170376, -167479, -5980, 14600, 262232, -259572, 204147, 116631, -32348, 56979, 109981, 337493, -221780, 71294, 77745, 402703, -116248, 182096, 135680, 218033, 68339, 119064, 175540, 31146, 287746, 121186, -29309, 276239, 18016, -153651, 55254, 71683, -75553, 203421, 296708, 180731, 26716, -129832, -163397, 205252, 97909, 289715, -109645, 198043]
12916b59967A07859J08614d7983A16143a30419a4435n8791R82B90552b84989j07549
12905c92538C14580J547a65492g2519p6157d3001B12704l8519k0195f5467A961
12893C5815J49236a21601J4296b1655l43604c2833C11667J10946a03932A75964
12882G0090K31912a01593L921m1151n2180N9616A06987Q406Q1529d7869R756k94994
12870c33107a22402A2912M2152K77041b48888b300C7997e0384A17522a05876G2557
12858A56584p3118h5412B17958L2739d8158A5168O3520b31627i7189B06530r5570
12847A10960c4513A26679D590c70523C0031K08378j17060m951N3049Q2820I1573
12835F6192Q993C4009R1711n8382a22673A84497B9873b8341D7841h4289M1058
$$ y = [-259967, 107859, 216473, -47983, 116143, -130419, -14435, -73226, -72244, 290552, -284989, -392538, 314580, 316127, -165492, -72519, -148676, -43001, 212704, 174185, 153990, -65467, 1961, 35815, 185051, -121601, -107305, -21655, -365259, -32833, 311667, 422613, -103932, 175964, 70090, 302002, -101593, -97672, -138823, -191003, -131387, 106987, 115393, 196922, -47869, -38113, -333107, -122402, 12912, 55064, 332105, -248888, -2300, 37997, -50384, 117522, -105876, 72557, 156584, 83466, -85412, 217958, 250697, -48158, 15168, 78688, -231627, -97189, 206530, 110960, -34513, 126679, 4590, -370523, 30031, 238409, 121349, 116398, 169447, 252267, 91573, 66192, 75185, 34009, 125720, 67338, -122673, 184497, 29873, -28341, 47841, -84289, -43231]
12824d3231p455G0564a4331j25617B86404b06832E7242K73113g8395l5514i357
12812a85642A29546D640J28388N4958F3607b46602i5803D8845J1541J0826a21523
12800A46424b95282J34012E3910a933B14583H0307e1495B01023F8483f7750c2631
12788A21838R1217e7497j51673d8645k05449C465d16948b0489C4760a59724D1487
12776D9396h7636A42576a04025a731B01789N7867N3500A1681P2949b30731Q1422
12765a49309B7389a60618C5598b24389A38638a51416a3309j51042A18603P9320
12755A97923e8793I0423K04396B9221K57812A07181a23839e3829I199i0376B41054
12743B56387a7763j75745i1622Q456A60450N39467B31544c05560B00962M9019
$$ y = [-43231, -50686, 70564, -14331, -139948, 286404, -206832, 57242, 330355, -78395, -113909, -9357, -185642, 129546, 4640, 133028, 187986, 63607, -246602, -95803, 48845, 60386, 71212, -121523, 146424, -295282, -161270, 53910, -1933, 214583, 80307, -51495, 201023, 68483, -67750, -32631, 121838, 213055, -57497, -209170, -48645, -254094, 3465, -416948, -20489, 34760, -159724, 41487, 49396, -87636, 142576, -104025, -1731, 201789, 259656, 313156, 11681, 84630, -230731, -149309, 27389, -160618, 35598, -224389, 138638, -151416, -13309, -164351, 118603, 197923, -58793, 90423, 294819, 29221, 287033, 107181, -123839, -53829, 9199, -90376, 241054, 256387, -17763, -193508, -91622, -83166, 160450, 699917, 231544, -305560, 200962, 249981]
12733B49981a0358n7023n1451A36500a22876A87947n6112a93266h3227M919C04212
12721C12763o0844I2790k3268N3538J05842J28271A53181c0351B55391r4092n7385
12710A03914b350B34596r9689K81755A65806p3978R9499L88316m8074g6007A9431
12698F7728J18167B4785L5178H379J38060O9699H3796c76459B84784f296p8476
12687h4772F5419O8628E1053K70940B2989K14613d0666j18778C8410J5434c29921
12675I2041b38452H3752J45761e7363j0981F9633g5157C44260b32025C38290e9163
12663i358B97093C6415J88306a47994A61352N4942J2724A01968a52903A11501
12652C19989A1285J27979d9547A54238a62870F8257L38883D0767d9291C0751K32404
$$ y = [249981, -10358, -67381, -118832, 136500, -122876, 187947, 131835, -193266, -83227, -78308, 304212, 312763, 251919, 92790, 69522, 123060, 228902, 357173, 153181, -30351, 255391, 161299, 103914, -2350, 234596, 134907, 416662, 165806, 91828, 191327, 579643, 531569, -76007, 19431, 67728, 185895, 24785, 59963, 8379, 146439, 216138, 83796, -376459, 284784, -6296, -84772, 65419, 134047, 51053, 321993, 22989, 237602, -40666, -159444, 38410, 53844, -329921, 92041, -238452, 83752, 229513, -57363, -68344, 69633, -75157, 344260, -232025, 338290, -59163, -9358, 297093, 36415, 224721, -147994, 161352, 216294, 229018, 101968, -152903, 111501, 319989, 11285, 139264, -49547, 154238, -162870, 68257, 407140, 40767, -49291, 30751, 263155]
12641B63155E7154b62118G8180J2970b10838B20549I9132m8487c1614n6123H0599
12629B91112k8240A21288L05965A67515l0969L6773R2311O3930P2068p4015A33347
12617a3071k10866I6973h2390C15710k1507d4272A78693l8530c5124q3393H573
12605I0506J6846b95632A00580M1080b57229G7860C3853M86870F3613b9859j9882
12594d9741B32729E8264N5187J39063o590B0033P153m894J61697l5521N025e7022
12581b48716B6183K10207p2419G7494K29104B5635c33467R6970C15316j10241
12571B05075k8441J84327A15144E7272B3169e5240k51162g1156B56011A0927L7399
12560D8326J56214e1685K654A56566a97047k7115a01214j240A3551e7336k5247
$$ y = [263155, 57154, -262118, 78180, 91150, -210838, 220549, 99132, 50645, -31614, -87737, 80599, 291112, 262872, 121288, 427253, 167515, 136546, 173319, 265630, 329560, 401628, 327613, 133347, -13071, -223937, 96973, -82390, 315710, 294203, -44272, 178693, 140163, -35124, -118517, 8573, 90506, 107352, -295632, 100580, 141660, -257229, 77860, 33853, 520723, 63613, -29859, -49741, 232729, 58264, 113451, 252514, 245924, 20033, 27186, 22292, 183989, 148468, 153493, -57022, -248716, 26183, 236390, 163971, 77494, 306598, 25635, -333467, -236497, 315316, 205075, 176634, 360961, 115144, 57272, 23169, -55240, -306402, -71156, 256011, 10927, 48326, 204540, -51685, -49031, 156566, -197047, -224162, -101214, -102454, 13551, -57336, -82583]
12549h2583C1062O3101c2062D4729i1937A27917P9239a63311A21768a19665A1286
12537B79548i760B94889a49753A3361P5801K7027h6591M0409G6343J62123g2364
12525F397b12546R9825D9910a41960l5252A49588a20705n3773B37703Q789C2122
12513B16527I7164K15829a32162M2236L7108A20315K24396a24559C46434A366
12502H8514L9843b2234A38760O8229d610A7697F643e4636n1393N048a8799A16094
12489G4342J8867Q7234E1494M2168c43792a66010A66927n2519n0141J97619I5216
12477F8920J2916J3737f3592G575L3464d6819j21303F8966a18647j87352A34814
12465A31233Q0486O8386b84107Q7145j15677J45607O4226p8028a289B25571C0329
$$ y = [-82583, 31062, 94163, -32062, 44729, -91937, 127917, 207156, -163311, 121768, -119665, 11286, 279548, -9760, 294889, -149753, 13361, 89162, 116189, -86591, -46182, 76343, 238466, -72364, 6397, -212546, -112721, 49910, -141960, -177212, 149588, -120705, -174478, 237703, 246492, 32122, 216527, 97164, 312993, -132162, -89926, -52818, 120315, 344711, -124559, 346434, 1366, 88514, 128357, -22234, 138760, 206989, -4610, 17697, 6643, -54636, -106029, -100981, -18799, 116094, 74342, 93209, 180443, 51494, 93662, -343792, -166010, 166927, 114408, 64267, 261886, 95216, 68920, 81836, 95573, -63592, 7575, 41039, -46819, -168122, 68966, -118647, -305999, 134814, 131233, 211719, 280105, -284107, -196962, -312639, -167032, -102806, -180834, -1289, 225571, 30329]
12453A25855a64126j22406d2664k16330A59788c1003M577b745q264A4182b6077
12441g4307j75764N5104H8554A1568i5830r0111A91215f2253j41683F4289L456
12430F7745J20145Q1415A07786b1477k62377a38007j26401A08740h595A60887
12419B29607H5280m0165b22936G5253J67195A6615J03638R3671a9892k98296A74395
12407a04732k8163A30685P2320D4722a89957G0471L06541j83664p477F9247b77519
12395a6760F3688k8801c5447j06700C3307a9957k6542k37652D5235J18853c3345
12383H8192J43302a30045G7707c37813B76570r1022D7834b4704k27371H7995l7177
12372E0818P1016b67416D1618b32023H8304G929b5212D175i9902C47389F1874
$$ y = [125855, -164126, -286532, -42664, -258994, 159788, -31003, -26426, -2745, -11009, 14182, -26077, -74307, -250071, -194967, 88554, 11568, -95830, -185941, 191215, -62253, -203936, 64289, 67745, 187890, 269305, 107786, -21477, -283854, -138007, -264408, 108740, -8595, 160887, 229607, 85280, 45115, -222936, 75253, 242448, 16615, 120253, 213924, -19892, -318188, 174395, -104732, -132895, 130685, 203005, 44722, -189957, 70471, 377012, 193348, 185871, 69247, -277519, -16760, 63688, 34887, -35447, -142147, 33307, -19957, -46499, -284151, 45235, 164088, -33345, 88192, 231494, -130045, 77707, -337813, 276570, 185548, 47834, -24704, -252075, 87995, 50818, 121834, -267416, 41618, -232023, 88304, 7929, -25212, 4175, -99902, 347389, 61874]
12360B27681I3875a55947C5372B433b4286n4115C491b8718B79218b5634B106R6893
12348I8999d12466D8467a37038B64094A15513m9323i1043j41884G3129a86295
12337a14703d3091D08854A85759G0443K53849C4500d7123D3180a64307A74551
12326C26451j15642m067n9940b35461J07276A67749D3982a3065A92405H4131K44970
12315C29101k9896A43272h4790G9504B4258a76950A65598a36705A36756C5939
12304a69460B70484o2834M8893a36645A24862e2979A10192j4114N9398P081a26910
12292A31218E118f1557D66135A54519J24690f3864G8085A1925a05024A44220n0400
12281I3820l382k5438J66060j00943B5416a52203A98838O2148a9646B25714A02069
$$ y = [227681, 93875, -155947, 35372, 2433, -24286, -78401, 3491, -28718, 279218, -25634, 2106, 98999, -412466, 48467, -137038, 264094, 115513, 66190, -91043, -232927, 73129, -186295, -114703, -43091, 408854, 185759, 70443, 324292, 34500, -47123, 43180, -164307, 174551, 326451, 210809, 206742, 146802, -235461, -128185, 167749, 43982, -13065, 192405, 84131, 329101, 299205, 143272, -84790, 79504, 24258, -176950, 165598, -136705, 136756, 35939, -169460, 270484, 207650, 256543, -136645, 124862, -52979, 110192, 96078, 155476, 162557, -126910, 131218, 5118, -61557, 466135, 154519, 279209, -63864, 78085, 11925, -105024, 144220, 93820, 90438, 65000, 231060, 130117, 25416, -152203, 198838, 260986, -19646, 225714, 102069]
12269a14892D3360J39595C2387K16491a05840B35503G0281J16071N0618A08995
12258A72207O8607l4677f3915D6102a66471E33116k23799d8478A95305a12023
12247b48655i1579B54523B5333J71838m2187l8041c2739B3614a9973k97724F565
12235B22889b98979J17433A36478K0973R7583h3962C95600a84373B14825j6753
12225A98072l8427K03298j43512G8881K82778N4810I2925L2883P7024J81490i832
12213B6972Q6958m7474M20253i3027B70252a19340e2979A9603L76380F2828j3266
12202D9562c8877D27014g1874n0788B10022b5879k2199B62277J50114j28819n1302
12191B32270B7102a06806B47068a93479R3689C45071G1172L02571F5623K93286
$$ y = [-114892, 43360, 182955, 32387, 248878, -105840, 235503, 70281, 186352, 236970, 108995, 172207, 240814, 206137, -63915, 46102, -166471, 533116, 309317, -48478, 195305, -112023, -248655, -91579, 254523, 25333, 197171, 154984, 116943, -32739, 23614, -19973, -317697, 6565, 222889, -298979, -181546, 136478, 157451, 255034, -83962, 395600, -184373, 214825, 198072, 159645, 362943, 219431, 78881, 361659, 416469, 92925, 125808, 202832, 384322, -9832, 26972, 113930, 66456, 486709, -93027, 270252, -119340, -52979, 19603, 395983, 62828, 49562, -38877, 427014, -71874, -122662, 210022, -25879, -48078, 262277, 412391, 283572, 232270, 27102, -106806, 247068, -193479, -99790, 345071, 71172, 373743, 65623, 358909]
12181C58909h7968J8131j1098F9257J45682i8697B19152A808Q5691k0495J24986
12170A91990I1454J73289K54435B23564F9746h5279H6479K09442m1425a4454B99641
12158B4283J89041j02525Q8588K96740j27830k5555I1075a43107J9827K9832m125
12147i7573A93049b03527b5703o4335D1359K36291g7894j7993A10988c2417a5008
12135E402c45123a25329k99222B9839J67713j4952i255j49607C73345A22286a90731
12123A02607C8072J39403a5434A05695a24017B67792g8186A23368p894N9343J27469
12112C02286j43534a88580F6254j376j629J99002C5134q790J81957B544f6927
12100a75285A61389L1564b55900h3020A9665K00380a53592d1663d194q1563b764
$$ y = [358909, -87968, -69837, -80935, 69257, 214939, -98697, 219152, 1808, 87499, 67004, 191990, 91454, 264743, 519178, 223564, 69746, -85279, 86479, 295921, 254496, -14454, 299641, 24283, 213324, 110799, 199387, 496127, 368297, 342742, 91075, -143107, -123280, -93448, -97573, 193049, -203527, -25703, -90038, 41359, 277650, -77894, -95887, 110988, -32417, -15008, 5402, -345123, -125329, -424551, 29839, 197552, 182600, -9255, -158862, 373345, 122286, -190731, 102607, 38072, 177475, -15434, 105695, -124017, 267792, -78186, 123368, 115474, 174817, 302286, 158752, -188580, 66254, 64878, 63249, 262251, 35134, 26344, 208301, 2544, -66927, -175285, 161389, 192953, -255900, -83020, 19665, 220045, -153592, -41663, -4194, -85757, -2764]
12088A21870m1148K6601a4487k64343A23806c6391C37344a99133B36815K2718
12078B59533m9089J414180j11066E40670k27129b2120B33896H9181J19198O3632
12068B72011D2734a87600j41953f2077B6794L9617a36573K7181C2337c4854j86583
12057b21437O186E6058M5624C3718a2127G989a6515O908H7346h43E8726b44H7672
12043c70801a38193j0119A34023i545k20775B67683b29260A09423O5111b24619
12032b12392A50851F5711d12427a91088h2769K4867I2060J87434c9447J5415A14054
12020A46224a22798D9501K93032B1129e1185j60743A7835Q5141b1178B2009J16179
12009A38188K6101a21576B5430K23496a12007j85128L2273a14710K1363p0591
$$ y = [121870, 80722, 107323, -14487, -278830, 123806, -36391, 337344, -199133, 236815, 259533, 210444, 1624624, 1513558, 540670, 313541, -22120, 233896, 89181, 208379, 272011, 42734, -187600, -329553, -62077, 26794, 66411, -136573, -109392, 32337, -34854, -221437, -215251, 56058, 101682, 33718, -12127, 7989, -16515, -9607, 87346, -843, 58726, -244, 87672, -370801, -138193, -148312, 134023, -9545, -230320, 267683, -229260, 109423, 174534, -224619, -212392, 150851, 65711, -412427, -191088, -82769, -57902, 92060, 279494, -39447, -24032, 114054, 146224, -122798, 49501, 342533, 21129, -51185, -211928, 17835, 102976, -21178, 22009, 138188, 164289, -121576, 25430, 248926, -112007, -297135, -264862, -114710, -93347, -163938]
11999a63938K7868C36372O8596b44290J03739O9236c5220b793n2316A82371C2657
11987f2046k67930A04233l4804J78771H9202N0276E5405J34045a88646f4499A22368
11975b79576d8313r0648C2652a72228E8089J90598D6717b89700B02099i5139p9047
11964a74186k9605i8784o7394A73700a91560O3896D9514a17264A49092P2765c6824
11952a58191K8892M0700C2688a41071j02131d8424k47136f8071B51621g1008a8665
11940B144b8826C70938a93321J337C1842g2439A08544P8573a31441D31289F0656
11928C71325g4023E2486j9817J03387a54460B00537e290B78261c2649A64816a88232
11916d6845C62185b18015C60258e9142A30629J9037a32750j0232G7127j9062h1462
$$ y = [-163938, -136070, 336372, 404968, -244290, -140551, -71315, -35220, -2793, -55109, 182371, 32657, -62046, -329976, 104233, 69429, 248200, 89202, 139478, 55405, 189450, -188646, -64499, 122368, -279576, -48313, -138961, 32652, -172228, 58089, 248687, 46717, -289700, 202099, -95139, -174186, -203791, -98784, -166178, 173700, -191560, -127664, 49514, -117264, 149092, 221857, -36824, -158191, -129299, -88599, 32688, -141071, -243202, -48424, -295560, -68071, 251621, -71008, -18665, 2144, -28826, 370938, -193321, -191984, 31842, -72439, 108544, 187117, -131441, 431289, 60656, 371325, -74023, 52486, 32669, 136056, -154460, 200537, -5290, 278261, -32649, 164816, -188232, -46845, 362185, -218015, 360258, -59142, 130629, 149666, -132750, -142982, 77127, 58065, -81462]
11904g8942o8032d2562j56883f3216j21893j66173A1266L7337b3476D490L30417
11893C34907E902f1095E9059c96339A99713i702K480k3706A96554g395j89972
11882a97367A89474b75890I0934d2687I3504b94188I5835j1863J4855a91781d8858
11870B88193K5401E6209e836n2071o2178l68820K00202k00041D60483A9663J80115
11859A99778d6142o0237C4906c79046a17082o6307H0109C033K5012h2412g719
11847b41869l23725K51833D6570N9304J8097b2411o1901A30018A3912c5141A2011
11835A78416B8326L52088b13198B4537P3904g5454a5149F1670K7371c738A24281
11823E9866L02517j74603b68084f5197P406r1438A9949K08256E0226c35355E0364
$$ y = [-78942, -146974, -42562, -199445, -63216, -185109, -351282, 11266, 48603, -23476, 4490, 334907, 5902, -61095, 59059, -396339, 199713, -9702, -7222, -30928, 196554, -7395, -197367, 189474, -275890, 90934, -42687, 93504, -294188, 95835, 83972, 98827, -191781, -48858, 288193, 313594, 56209, -5836, -57907, -120085, -488905, -288703, -488744, 460483, 19663, 199778, -46142, -106379, 34906, -379046, -117082, -183389, 80109, 3033, 28045, -82412, -7719, -241869, -565594, -313761, 46570, 105874, 123971, -22411, -84312, 130018, 13912, -35141, 12011, 178416, 28326, 380414, -213198, 24537, 98441, -75454, -15149, 61670, 89041, -3738, 124281, 59866, 362383, 187780, -268084, -65197, -57791, -149229, 19949, 228205, 50226, -335355, 50364]
11811a51433B2655K0401c04300A9127g9002A42913a10584o7593I1731a03928A44200
11799A74872c83756B22264E1990i2084H5090k7118J30944l0191a49636b910B72243
11787f93j98216C80442a93945n1192I653a68693e7626k8250L1676I3347K75923
11776C69270B4735j160J08458b49855E5556a67430B66598A22277L6093A378J91693
11765A93071i0869o5929C05383B2020b11039M9391O1115A76863i7712B69795a00983
11753B14648H3185C8768a49950P3456j0094j32312p4288B02815e3294n5714l3945
11742a42953B63356a69613L6080j01228h7093H6786J27206q2042o5127R177k4438
11731E1562A6016j750J26402F3305r551i9479a4614j25833C53021c24619E7332
$$ y = [-151433, 22655, 43056, -304300, 19127, -79002, 142913, -110584, -178177, 91731, -103928, 144200, 174872, -383756, 222264, 51990, -92084, 85090, 57972, 188916, 158725, -149636, -2910, 272243, -693, -198909, 380442, -193945, -245137, 9653, -168693, -57626, -85876, -54200, 93347, 369270, 24735, 23575, 132033, -249855, 55556, -167430, 266598, 122277, 158370, 1378, 193071, -90869, -156798, 305383, 22020, -211039, -161648, -100533, 176863, -97712, 269795, -100983, 214648, 83185, 38768, -149950, -76494, -86588, -218900, -293188, 202815, -53294, -109008, -142953, 263356, -169613, -133533, -234761, -87093, 86786, 213992, 131950, 66823, 76000, 51562, 16016, 14266, 140668, 63305, 53754, -99479, -14614, -140447, 353021, -324619, 57332]
11719a34321A6401g7079D81325h7422H3817I597L7434j6699K65163I2424R6188
11708A88612a74584j73161A07996F902g3180A66339a32463A01100a01635A27986
11697B06672G381J15898a19109N5861F0464j4550f7012A29676a17530B8166b53047
11685i238l2029F0218J17215H0894k2728j8707a02620A11588J54473a56487D2300
11673g5000A75549E8318A7536M2001b12921B27782p0443b92872A42948F2877b8799
11661A93317a1607A87089R6428G5863a51704j56157H311M98107F8704a69587m3923
11650b13510A25290E592b50178A02239A024a02703J3746k5175o6534I401K37262
11639B46663C0009l776a05970F9116A1436b8909B79409k6729d8312A54059J00578
$$ y = [-134321, 16401, -77079, 481325, -87422, 83817, 9597, 47031, 30332, 295495, 92424, 188612, -174584, -347745, 107996, 6902, -73180, 166339, -132463, 101100, -101635, 127986, 206672, 7381, 123279, -119109, -63248, 60464, 45914, -67012, 129676, -117530, 28166, -253047, -9238, -41267, 60218, 177433, 80894, 58166, 39459, -102620, 111588, 266061, -156487, 42300, -75000, 175549, 58318, 17536, 59537, -212921, 227782, 157339, -292872, 142948, 62877, -28799, 193317, -11607, 187089, 283517, 75863, -151704, -307861, 8311, 506418, 68704, -169587, -213510, 125290, 5592, -250178, 102239, 1024, -102703, -88957, -114132, -180666, 9401, 246663, 30009, 26233, -105970, 69116, 11436, -28909, 279409, 252680, -48312, 154059, 254637]
11628B54637k9818H3606p486a19236A55367a39854e341r2448A15749a93621D3239
11616a07676l12647a98081A71383h8150B31271c67798j63772I5098i0563l6456
11606a27019N3688c4450n9374A7995Q3977K107b7759q4333J5258B74L2468L83149
11594D15891f1755n2871C7108K05256l49Q8817F4425a00996B24827P0920B9342
11582g404G8305a11214J0957E5850K98647b39287A31015M7257Q4022H6123J35050
11571B21173I5261J88514p6605g1908E9916O6899e250k31183c6904G757L13364
11560C21121k5000q6702m0466A8785c3866q6249B54708f3852C85495i6839A28571
11548B626a65370b0060j64014C1092r613M7221a48161A31051J16895j14354f2087
$$ y = [254637, 224819, 83606, 76120, -119236, 155367, -139854, -5341, -97789, 115749, -193621, 43239, -107676, -420323, -198081, 171383, -88150, 231271, -367798, -531570, 95098, -90563, -127019, -73331, -34450, -93824, 17995, 101972, 104079, -27759, -112092, -96834, 274, 32742, 415891, -61755, -114626, 37108, 242364, 242015, 330832, 64425, -100996, 224827, 295747, 29342, -7404, 78305, -111214, -100257, 55850, 354497, -239287, 131015, 178272, 262294, 86123, 221173, 95261, 283775, 207170, -71908, 59916, 126815, -5250, -236433, -36904, 7757, 321121, 296121, 209419, 168953, 18785, -33866, -120115, 254708, -63852, 385495, -96839, 128571, 2626, -165370, -20060, -184074, 31092, 21479, 68700, -148161, 131051, 247946, 133592, -62087]
11536b12778f4841E27922c08300b5529r3645B93537F509J80226a48808C85341
11525b6333H4076b3128H6397O9860l8356a89969A12591i0293n0563j9277C1397
11513A58401K7535F0598N2627L30156j84016n5869n611r0345O6711f3714P862
11502e5852C92997d7944B85572A32790b07966B00715B37K11658l5845E659g2480
11490B48906e1503K3252I4108o386c74800B90792n5952l5109a6951j33907r4532
11479b45390F1572L37482p2414d5874b1543A51499A2312a60308D86162A62038
11468A62940K68600E1791K58722b84354C46930P0314K74280g4534q8913C0942
11457B15754j4257n7619K23695a87737B75651E1155g636A35348L0295Q8279a5786
$$ y = [-212778, -64841, 527922, -308300, -25529, -119174, 293537, 6509, 186735, -148808, 385341, -26333, 84076, -23128, 86397, 156257, 117901, -189969, 112591, -90293, -140856, -160133, 31397, 158401, 185936, 60598, 113225, 443381, 259365, 203496, 197885, 107540, 174251, -63714, -55852, 392997, -47944, 285572, 132790, -207966, 200715, 237, 211895, 176050, 5659, -72480, 248906, -51503, -28251, 94108, 87722, -374800, 290792, 234840, 199731, -16951, -150858, -245390, 61572, 399054, 326640, -45874, -21543, 151499, 12312, -160308, 486162, 162038, 162940, 431540, 51791, 310513, -284354, 346930, 417244, 691524, -74534, -163447, 30942, 215754, 201497, 143878, 367573, -187737, 275651, 51155, -7636, 135348, 165643, 253922, -15786]
11445i2492n3313k3807A97750o5856f4068j04406F8517a9456F5364K85125A12250
11433C79045a37629M8625c2108F422a68909g1291A24913a0050q6244E6128a65651
11421a840n11837A18289Q2326a35292B19462F3997B350b91318h5212B96479k2070
11410B74409h1312A38150b38415B26521q3637f7404o5617A35237K09351H3654
11399G6916a74513Q3946C1590D245f7148j51506A2889K12504a1064C9713a5296
11387A0327b26578A68966b85795h2855B14553c27685A67023h416j650E3290k5092
11376B8198a06173k7486B32310K02942b24277g4333K3284J2815o7397j86329c2436
11364d73028E1639b34897A01238D7048K17739a1062k42584i5332A47217c5996
$$ y = [-92492, -145805, -169612, 197750, 131894, -64068, -168474, 68517, -19456, 65364, 350489, 112250, 379045, -137629, -89004, -32108, 6422, -168909, -71291, 124913, -10050, -96294, 56128, -165651, -1840, -513677, 118289, 200615, -135292, 219462, 63997, 2350, -291318, -85212, 296479, 274409, -81312, 138150, -238415, 226521, 142884, -67404, -133021, 135237, 344588, 83654, 76916, -174513, -90567, 31590, 4245, -67148, -218654, 12889, 225393, -11064, 39713, -15296, 10327, -226578, 168966, -285795, -82855, 214553, -327685, 167023, -8416, -10066, 53290, 28198, -106173, -133659, 232310, 435252, -224277, -74333, -51049, -38234, -105631, -291960, -32436, -473028, 51639, -234897, 101238, 47048, 264787, -11062, -253646, -95332, 147217, -35996]
11353E5347b66509B31550j00983c7487B89984a37292a3240m8082B77054D7097
11342b71153O8975J6832J804j0166G0092C3547N0505b40067C7951K2881b27842
11330e4940p7010C8165L1811d5429A56638a60263p8494J07131p3699A20386E2262
11318b88750i0985A15905a06216J49C09237A25397a07545c8204E4034a64611d681
11306I3411N0445k0108C2874J37985g1071B973b08844F8741K5678a81952F7119
11294F0481c54518a66108A44548a33552o4543B59599b80529J26871l2136E6015
11283b34783H5979d14406I600a04397l2486j07477N7323A89858I068a66858h1589
11271A11796b03927L6868A64331N8381b0819q7520A27027k1292b27171G5602C2658
$$ y = [55347, -266509, 231550, 130567, -37487, 289984, -137292, -13240, -61322, 277054, 47097, -271153, -202178, -185346, -183542, -193708, 70092, 33547, 84052, -240067, 37951, 60832, -227842, -54940, -131950, 38165, 69976, -45429, 156638, -160263, -238757, -131626, -205325, 120386, 52262, -288750, -90985, 115905, -106216, -106067, 309237, 125397, -107545, -38204, 54034, -164611, -4681, 93411, 143856, 123748, 32874, 170859, -71071, 2973, -208844, 68741, 94419, -181952, 67119, 60481, -354518, -166108, 144548, -133552, -198095, 259599, -280529, -153658, -185794, 56015, -234783, 85979, -414406, 9600, -104397, -136883, -244360, -187037, 189858, 9068, -166858, -81589, 111796, -203927, -167059, 164331, 222712, -20819, -108339, 127027, 105735, -227171, 75602, 32658]
11259c22902C71703j82970F850O2053b38722p536j04740F6020b7305j20637j5745
11248a63687l3526C4608a25038A44891a81114e6527B88243b05596b1655A06078
11237b86106b5887B11286b39502I0201b6042j42353H3345c0000a0765j67521C12735
11225I329f8312j34868r5308B23004b43637a07613E684M7617k2624K7396a96838
11213c68889B69983r5390b64432M7763j20977G7816a6372j53508B1982K30505
11203B52487D4265M0933h7036j90770A29196a61947q4315M4817f5433C3678N4822
11192H8500a26389E35J32013m5741b22854j4072l3013G6138j906a88265j81766
11181c70031a23944f1903b928j53073i569k73847A31556p061E7607a55208M9442
$$ y = [-322902, 371703, 188733, 6850, 68903, -238722, -246258, -350998, 66020, -27305, -147942, -163687, -197213, 34608, -125038, 144891, -181114, -56527, 288243, -205596, -21655, 106078, -286106, -25887, 211286, -239502, 90201, -26042, -168395, 83345, -30000, -10765, -178286, 312735, 9329, -68312, -203180, -298488, 223004, -243637, -107613, 5684, 53301, 30677, 58073, -196838, -368889, 269983, 174593, -264432, -216669, -337646, 77816, -16372, -169880, 21982, 252487, 44265, 85198, -87036, -277806, 129196, -161947, -246262, -201445, -65433, 33678, 88500, -126389, 535, 132548, 86807, -222854, -236926, -269939, 76138, 74232, -188265, -370031, -123944, -61903, -2928, -156001, -9569, -283416, 131556, 124495, 57607, -155208, -105766]
11170a05766m1263B23190h5372l3757B08803b13128B66885i6169k20548b6150
11159a39336F8278d31032A36314J28993f4541j586B11852G6334g5217m6121L6090
11148h5248K671n3087j14230A7708J25804Q9518D215O693e1350A67441c6536A65172
11135a3742G5125Q8303J39442a79866O2959B5235K44313d3898r4182I0375l9470
11124E0905a2237B42083a33257M6604A76905a42919B94912G0695b48638B63807
11113f3657A64970Q3620h9838C14795b06398B45912B1318J61805G3095K29325
11103C02420b63459A81558J67166c22121A18440k4657c2611D8026J73961f197
11092A50566i1026L2446m8415A15084J3806J8018i9633C07586n1334j6335M0715
$$ y = [-105766, -147029, 223190, -85372, -119129, 208803, -213128, 266885, -96169, -316717, -26150, -139336, 68278, -431032, 136314, 265307, -64541, -66127, 211852, 76334, -75217, -121338, -85248, -82577, -135664, -249894, 17708, 143512, 233030, 4215, 10908, -51350, 167441, -36536, 165172, -13742, 75125, 163428, 302870, -179866, -116907, 25235, 269548, -43898, -138080, 90375, 50905, -12237, 242083, -133257, -86653, 176905, -142919, 294912, 70695, -248638, 263807, -63657, 164970, 248590, -89838, 314795, -206398, 245912, 21318, 183123, 73095, 302420, -263459, 181558, 348724, -322121, 118440, 93783, -32611, 48026, 221987, -6197, 150566, -91026, -58580, -106995, 115084, 128890, 146908, -99633, 307586, 256252, 239917, 280632]
11081B80632C486M20088j74085G7376K60286A25294A3559K90759K88046A07114
11070C18328H5922K3900K75127j79304J98914J27670L19519B31233L1601J50841
11060D13675J60384j18631n1707K86240B84427P37707l76813J44202C58233L68859
11050G27092B85338L93512j81163j83167L73893l9356o1535K90201q7521o9225
11040G20977J58658l56637J20510j20147J71756j46285M01569m21961l4320K47790
11030G41910L51849k48179j64259N18252n32201K01218j74071j07595J7653k47613
11020C56964N279P7875J56982n4959B50331N55544B77560K97668r0334K73157
11010G58051o2503j54204j99572j9824K36100J76140m7527j05856J28506k0963
$$ y = [280632, 3486, 423574, 249489, 77376, 337662, 125294, 13559, 304318, 592364, 107114, 318328, 85922, 109822, 384949, 205645, 404559, 532229, 851748, 231233, 262834, 413675, 574059, 455428, 403721, 689961, 284427, 1022134, 645321, 789523, 358233, 727092, 285338, 678850, 497687, 314520, 688413, 649057, 587522, 877723, 790202, 720977, 879635, 522998, 643508, 523361, 695117, 548832, 950401, 528440, 494120, 741910, 1093759, 845580, 681321, 1199573, 667372, 868590, 694519, 586924, 604577, 356964, 362243, 440118, 597100, 542141, 250331, 805875, 277560, 575228, 484894, 758051, 695548, 541344, 341772, 321948, 558048, 734188, 686661, 580805, 709311, 688348]
11000F88348N2135j10186j10643J41787j28520P4755j5030N0652K01793k23846
10990F21245K60464m19463L83068P225J57210j15325k3148k40885J37609L28067
10980A096067L5567j57579K82377k08149Q41908j24980L69384M85960k68384P6075
10970B428246l6421o0639M2747l44929M8657o27818j00355R9445p6676J41977
10960A514234J29402k96836J98880M2561N9528J37213k36127n4566m02026K9245
10950A121508j55541k88275m7536M4954l01993J31366B27445O0147I0739F84M05120
10939D05804A00235J0706a55823M3603D41925A60290K7369L431j9954A4590J45800
10928A60390D6818L16379a34798K3287A17150a93384L3280O7048B2938b26145
$$ y = [688348, 740483, 630297, 519654, 661441, 532921, 607676, 592646, 643298, 845091, 621245, 881709, 462246, 845314, 852539, 1009749, 894424, 871276, 630391, 768000, 1096067, 1131634, 974055, 1256432, 1048283, 1890191, 1765211, 2134595, 2620555, 2352171, 2428246, 2391825, 2331186, 2373933, 2029004, 2077661, 1449843, 1349488, 1448933, 1372257, 1514234, 1643636, 1346800, 1545680, 1588241, 1647769, 1784982, 1548855, 1494289, 1092263, 1121508, 965967, 677692, 630156, 675110, 373117, 504483, 227445, 287592, 90739, 684, 405804, 100235, 110941, -155823, -112220, 441925, 160290, 187659, 191090, 171136, 14590, 160390, 46818, 363197, -134798, -111511, 117150, -193384, -160104, -93056, 22938, -226145]
10917a4067q5458A39581a9170A88255D6991J44797K52138j11949b30066H413c4165
10905e466B70196D5266L9533c4130E5024h5315A69451g1526G8720M9387D8289
10893b41364m9109e021F8367L249a92834h7629j8657j951C209a34569d7881F7575
10880A50297l0427b2770F5004a85050j68934A41218a08472j07077F4433O5038
10870A29471d4524F3260a81100A27744a36343G7952E207L0168J2693J66512P0601
10859B85181q1600M2753a60092A16087C1523O6699a50677A19113h4760a9380l55227
10848c74607O0360a52125A02074D8164Q8987E3174J32897e57479B36907A11866
10837I9561R9500d31410c5598B2244a64397j91537G9352d7820P557A08734b55904
$$ y = [-14067, -99525, 139581, -19170, 188255, 46991, 191788, 443926, 331977, -230066, 8413, -34165, -5466, 270196, 45266, 84799, -34130, 55024, -85315, 169451, -71526, 78720, 128107, 48289, -241364, -290473, -5021, 68367, 71616, -192834, -87629, -106286, -108237, 3209, -134569, -47881, 67575, 150297, 119870, -22770, 65004, -185050, -353984, 141218, -108472, -215549, 64433, 129471, -44524, 63260, -181100, 127744, -136343, 77952, 5207, 35375, 48068, 214580, 285181, 203581, 246334, -160092, 116087, 31523, 98222, -150677, 119113, -84760, -19380, -374607, -314247, -152125, 102074, 48164, 137151, 53174, 186071, -557479, 236907, 111866, 99561, 199061, -431410, -35598, 22244, -164397, -355934, 79352, -47820, -40263, 108734, -255904]
10825A75234E4990a20201B9357K9005A6950a71883I5080M174g031m31034a23356
10813A12554b37848r2052A06464a32242A16510g4289B1213M3655i9234j28267
10803b27501k10165f3796A97125D0895K08748b1582C49849a08214c1888B16191
10792B16955R2357A20043h5201J8030A87871b48123G5755c6302A16816g563A06002
10780a00000j9881G7906l5054a57427A09005a39922f5103j34568Q9827A53443
10769H1737k8549a25392B02242I1596f602A1010P9946a17903k67594c7236A52990
10757b20227e5818G1053J61648c23671R8313K2851A77777g4907B15883l1859H6868
10745a42953I8857D3645b30903B0140h117A05066d16590B8248K32453d5234K1234
$$ y = [175234, 54990, -120201, 29357, 58362, 16950, -171883, 95080, 99254, -7031, -438065, -123356, 112554, -237848, -329900, 106464, -132242, 116510, -74289, 21213, 64868, -99234, -227501, -437666, -63796, 197125, 40895, 249643, -21582, 349849, -108214, -31888, 216191, 216955, 309312, 120043, -85201, -67171, 187871, -248123, 75755, -36302, 116816, -7563, 106002, -100000, -119881, 77906, 42852, -157427, 109005, -139922, -65103, -199671, -109844, 153443, 81737, 53188, -125392, 202242, 91596, -6602, 11010, 90956, -117903, -385497, -37236, 152990, -220227, -55818, 71053, 232701, -323671, -225358, -202507, 177777, -74907, 215883, 184024, 86868, -142953, 98857, 43645, -230903, 20140, -8117, 105066, -416590, 28248, 260701, -45234, -24000]
10734b4000k83975A02012a68999B7999e03744e2645a9022l44161i1889I2725d0046
10722a26451k6708E8630B2499K61561a03664B22218h7540C7861a17834N2157D4932
10710B71a19419j8530O7263A22150i9770a8146C29346b46490J09506R774l8742
10699a65952n4118f992q5524B75890I6800J15474D1450b10875f5014B02544h8320
10687a34607k2029a8647A36426b41657J09743N1281C205J33437a66073C22391
10676e3972l87450b15274b7633A85196a34009e4E1483B2446a1564k75781n4703
10665c42048i3671C66202a19627C9418A9022b6349k671A52738m7103a32026j13979
10654b46005N771C8366a15729C2668a44295b2768k050i981A07021a20473p2528
$$ y = [-24000, -307975, 102012, -168999, 27999, -503744, -52645, -19022, -363183, -91889, 92725, -40046, -126451, -153159, 58630, 22499, 284060, -103664, 222218, -87540, 37861, -117834, -65677, 44932, 271, -119419, -137949, -70686, 122150, -99770, -18146, 329346, -246490, -136984, -127210, -165952, -220070, -6992, -92516, 275890, 96800, 212274, 41450, -210875, -65014, 202544, -88320, -134607, -156636, -18647, 136426, -241657, -131914, -80633, 3205, 136642, -166073, 322391, -53972, -441422, -215274, -27633, 185196, -134009, -54, 51483, 22446, -11564, -287345, -342048, -93671, 366202, -119627, 39418, 19022, -26349, -29020, 152738, 105635, -132026, -246005, -240234, 38366, -115729, 32668, -144295, -22768, -24818, -9981, 107021, -120473, -193001]
10643a93001M7316k5221o5644D5433h1697l60710C26069d59917e3166b2680A09884
10631b20244k4368P2288j56198J61391A2221h6805A45178b6016r2154k19558B94950
10619H6552a7760A10924b85171h8718j03496E6401A9908K0184g1942D2208b13927
10607a21708A46516B3426I002J89630F141b50300A64147J04233F3620J03686a24076
10595b75290Q1470N8167A14791J72b42081D11185e9342G1237l4086h1575b0570
10583D14078b19695F9087J67555H7488j893A4698a52650A1633b01890g1020j7999
10572h9019B3016A0926b05817c1717E9471a85299j05494A45798E3709b53576f7096
10560A91973e7526A3451a46370I9993j1152J4751A0264O6983b80221A34059b56003
$$ y = [-193001, -145685, -170906, -236550, 45433, -81697, -442407, 326069, -459917, -53166, -22680, 109884, -220244, -244612, -172324, -328522, -167131, 12221, -86805, 145178, -26016, -118170, -337728, 294950, 86552, -17760, 110924, -285171, -88718, -192214, 56401, 19908, 40092, -71942, 42208, -213927, -121708, 146516, 23426, 9002, 198632, 6141, -250300, 164147, 268380, 63620, 167306, -124076, -275290, -193820, -135653, 114791, 114963, -242081, 411185, -59342, 71237, 37151, -81575, -20570, 414078, -219695, 69087, 236642, 87488, 85595, 14698, -152650, 11633, -201890, -71020, -89019, 23016, 10926, -205817, -31717, 59471, -185299, -290793, 145798, 53709, -253576, -67096, 191973, -57526, 13451, -146370, 99993, 88841, 103592, 10264, 77247, -280221, 134059, -256003]
10548b01114j33322D1606J88032H6758a08912F33f0410J4551E5536m018L3585
10537H5103a58875B12862a07933A26112J41697b74739H5001b34233J6062e1070
10526i4991A32212a28086j26517A09320g4525k0271k00997N3291D56386c8785
10515C532b56577A30723D9578R95g0643r8985j9686C25208A11467a67842A02235
10503f726j78076B18157A1121b86453A10512a19970P218A55180a86589q1440a28241
10491B24111p1708a90737A76185c73970a9519B31504J9I3502l5383L13285p1908
10480B99496P1629J76862b27977A68566N2077j02998a8674A77299a1768j11486
10470a23254M7924j45266A55511e0441p4480d6359k85927A41850b88461J33613
$$ y = [-201114, -334436, 41606, 229638, 86758, -108912, 633, -60410, -45859, 55536, 51518, 85103, -158875, 212862, -107933, 126112, 267809, -274739, 85001, -234233, -218171, -51070, -94991, 132212, -128086, -254603, 109320, -74525, -94796, -295793, -242502, 456386, -38785, 3532, -256577, 130723, 49578, 50573, -70643, -169628, -189314, 325208, 111467, -167842, 102235, -6726, -184802, 218157, 11121, -286453, 110512, -119970, -112752, 155180, -186589, -268029, -128241, 224111, 152403, -190737, 176185, -373970, -19519, 231504, 231523, 93502, 58119, 371404, 299496, 371125, 547987, -227977, 168566, 220643, 117645, -18674, 177299, -11768, -123254, -75330, -220596, 155511, -50441, -124921, -46359, -332286, 141850, -288461, -154848]
10460a54848N2787L7443A51485n3560b16362b2374p7794j42849g894B99317j20922
10449A78395c31575g4366a0417B14634c8934j87173A71516d59763B22612I6034
10438I0111k0656b51186a2882m4313A94910q7193P7733e5956A27336h3539c5593
10426c27395P7392E2217J22410G0083a75951B50430h6741F0245b22042r1459B06758
10414B05062C5918i7486A54023a88070B33578h0549O510A25971J2498c76405B09582
10402a0740k24853A66908b73399A5163K19535a45177b8330D1919M233d1684j17400
10391a59084N7733c9967B65145J08551h7492B66889E0527c4735C62257j79553
10381A82704R0108L08062F6361K17971F8615L5155a03119M9494B82632q124L6110
$$ y = [-154848, -102061, -64618, 151485, 97925, -216362, -22374, -100168, -243017, -7894, 299317, 178395, -331575, -74366, -10417, 214634, -38934, -226107, 171516, -459763, 222612, 96034, 90111, 69455, -251186, -12882, -57195, 194910, 107717, 185450, -55956, 127336, -83539, -35593, -327395, -250003, 52217, 174627, 70083, -175951, 250430, -86741, 60245, -222042, -313501, 206758, 205062, 35918, -97486, 154023, -188070, 233578, -80549, -74039, 125971, 138469, -376405, 209582, -10740, -235593, 166908, -273399, 15163, 234698, -145177, -28330, 41919, 46152, -41684, -159084, -101351, -39967, 265145, 373696, -87492, 266889, 50527, -34735, 362257, 182704, 272812, 580874, 66361, 284332, 68615, 103770, -103119, -53625, 282632, 274508, 310618]
10370C10618B0100m90O19225K19A80878K86848k16436J46145I6616L00012j33303
10359B63325H3758J59147J50784b25224g5523C04371j24535j4988L56125M7675
10349E68648p7714K1311A60960F289J94488J33923A01794K5813N5897J36498G6011
10337A1334K05364K33791i6652D27104M06I4647g7633A23436h9956A57187Q9684
10326B46871A01679K75555b01073A84736A3054L50088A62346o7096L34780e844
10315i5156D59375f6404j16673A51757l457o9342b21234A21229n2651f34A67386
10303F9714J06683i6302C149K08325b93050B02310a50443P799E28104a03013L6745
10292f6268j92926q6958a719j3775m2010q9035P826G9240k7715h08q5017A32843
$$ y = [310618, 20100, 19610, 638835, 639054, 180878, 467726, 251290, 397435, 96616, 396628, 263325, 83758, 242905, 393689, -225224, -75523, 304371, 179836, 164848, 520973, 568648, 490934, 512245, 160960, 6289, 200777, 334700, 101794, 127607, 183504, 320002, 76011, 11334, 216698, 450489, -96652, 427104, 427510, 94647, -77633, 123436, -89956, 157187, 246871, 101679, 377234, -201073, 184736, 13054, 363142, 162346, 95250, 430030, -5844, -95156, 459375, -66404, -183077, 151757, 148300, 78958, -221234, 121229, 68578, -634, 167386, 69714, 176397, -96302, 3149, 211474, -293050, 202310, -150443, -142644, 528104, -103013, -66268, -259194, -346152, -1719, -15494, -57504, -146539, -138713, 79240, 51525, -808, -85825, 132843]
10279b8519E3833i7249C55534a69778B43917h2321E6039A4708h0969k56320B49531
10267B31317C2308a42817B10860r7648J1144c99568B94957K04256j19924K21512
10257F00801a03805B07276E0583h9878C27599c82611A02779g0039B01407o9120
10247A32287b11779g4202B79433b6378B28275a02817j58643G0729K20825A09318
10236B73393j05916c02974D5777J9016d53770H7905K3089h6633r4711j7062j52555
10225c50961J10274A93968c7672i555l7165q7744k9307F5178g7936l7949r6000
10214b11885j43165f0935j9677l1630A11405a77870B37338D1111h2641c3579C1357
10202b54825I170J38391P7392a01093j31189C4865a58961A17094b40398h9766
$$ y = [-28519, 53833, -97249, 355534, -169778, 243917, -82321, 56039, 14708, -80969, -337289, 249531, 231317, 32308, -142817, 210860, 113212, 124356, -399568, 294957, 499213, 379289, 600801, -103805, 207276, 50583, -89878, 327599, -382611, 102779, -70039, 201407, 132287, -211779, -74202, 279433, -26378, 228275, -102817, -261460, 70729, 291554, 109318, 273393, 167477, -302974, 45777, 64793, -453770, 87905, 110994, -86633, -181344, -198406, -350961, -240687, 193968, -37672, -9555, -46720, -134464, -163771, 65178, -77936, -115885, -211885, -355050, -60935, -80612, -112242, 111405, -177870, 237338, 41111, -82641, -33579, 31357, -254825, 9170, 147561, 224953, -101093, -232282, 34865, -158961, 117094, -240398, -89766]
10191B5618J16148b0778j87064n2257q996A21111a43273B29518a29584a7755q8137
10180a05892c5214C1960J70033a08502a879m66724a95646G9668K12196b70506
10169a20426a0306D4330c05528C48055i2855A58948b1961E4296c95597H7225P3652
10158A60877a6254A23147a2061A01151Q8137b7587q1482j9511K7703j33856J13919
10147a20814F8386P0976o4943a4382m64041E3402J60396a03989k7545a9710B67052
10135c6531j36931I8714K60825d0295j9959E6322e5722K3231A42704J26555q1771
10124A87488b04752A44637E4187b69069A33237g0114A1270b67616J25602B23716
10113A57513a03061a5819n7590A78163a34942j79606a15041L3334l18311I4116
$$ y = [25618, 141766, -20778, -207842, -260099, -269095, 121111, -143273, 229518, -129584, -17755, -105892, -35214, 31960, 201993, -108502, -1879, -468603, -195646, 79668, 291864, -270506, -120426, -10306, 44330, -305528, 348055, -92855, 158948, -21961, 54296, -395597, 87225, 160877, -16254, 123147, -12061, 101151, 189288, -27587, -109069, -128580, -100877, -234733, -120814, 68386, 139362, 74419, -14382, -478423, 53402, 213798, -103989, -131534, -19710, 267052, -36531, -173462, 98714, 359539, -40295, -60254, 56322, -55722, -32491, 142704, 269259, 187488, -204752, 144637, 54187, -269069, 133237, -70114, 11270, -267616, -142014, 223716, 157513, -103061, -15819, -73409, 178163, -134942, -314548, -115041, -81707, -400018, 94116]
10102b66673a9645j29330m9713C28181a7976j6547D1364q878a39940C05680c22425
10090g83D7348a8330d68A82469m1718a84800b249G8401c40441J15264n5070J35965
10078a44282O983K4699q7179k12502g4710A57811b71048C14461a36500l13172
10068d49672B60257b92893I5949K05905G7109a52633M9115L8369D8837a44895
10057a57648H3175a92354K2123J7799E8876a64486D31807h6032j33648B15669
10046b07614q2774N2738r3837J10322i1510F3011f9941b2678k26929A52202b40818
10034E9754b15226O7111H2492e1969b2499q3862R991A15069h6503c6911G0380
10022h2090j89437G4443c44987a30140l038d9544D2141L1605Q5294b10751A2267
$$ y = [-266673, -19645, -148975, -198688, 328181, -17976, -34523, 41364, 32486, -139940, 305680, -322425, -783, 47348, -18330, -468, 182469, 140751, -184800, -2249, 78401, -340441, -225177, -280247, -144282, -137299, -112600, -199779, -412281, -74710, 157811, -271048, 314461, -136500, -449672, 260257, -292893, 95949, 301854, 77109, -152633, -103518, -65149, 48837, -144895, -157648, 83175, -192354, -170231, -152432, 58876, -164486, 431807, -86032, -219680, 215669, -207614, -290388, -237650, -331487, -221165, -91510, 63011, -69941, -22678, -249607, 152202, -240818, 59754, -215226, -148115, 82492, -51969, -22499, -106361, -96370, 115069, -86503, -36911, 70380, -82090, -271527, 74443, -344987, -130140, -133178, -49544, 42141, 73746, 159040, -210751, 12267]
10010a78283j72448A41846n499J3878b08875j50313A44099a57597B40930j05881
10000A35049c99743h4404A60075P1166B3466b42335N9463a4818D6429J06727d6974
9988h1307q8685r6902b3052L384p3040l8065C02717F2171b28922N7068F8500I787
9975C0669K55202a5599n7518r3561o9312B46777b72252B80963A25068J1198b5298
9963g8199G6597b86145a20419l42716g3806j28378A53020e7065B48667b6425p2166
9952i8591j09159A08255e910B01652o8205a23035E5605b23677p873B07265a83513
9940a94199C33911a52688c7192B19538a22553A3585N2876a25226b6692E20554
9929f6911p5151F3890g7317A1686c01408J36551l1034b2168B22387B8854c14232
$$ y = [-178283, -350731, 141846, 136347, 150225, -208875, -359188, 144099, -157597, 240930, 135049, -399743, -84404, 160075, 231241, 23466, -242335, -182872, -14818, 46429, 153156, -46974, -81307, -169992, -266894, -23052, -19668, -92708, -130773, 302717, 62171, -228922, -171854, 68500, 9787, 30669, 285871, -15599, -73117, -166678, -235990, 246777, -272252, 280963, 125068, 136266, -25298, -78199, 76597, -286145, -120419, -463135, -73806, -202184, 153020, -57065, 248667, -26425, -98591, -207750, 108255, -5910, 201652, 133447, -123035, 55605, -223677, -231550, 207265, -183513, -194199, 333911, -152688, -37192, 219538, -122553, 13585, 66461, -125226, -26692, 520554, -66911, -142062, 63890, -77317, 11686, -301408, -164857, -195891, -22168, 222387, 28854, -314232]
9917d62319h3785B0084b00098d0125o8938k05759g8375B08194a68213I0970A5995
9905B46360G9916c2207G1689J84100j27374d5065C1638e2446J6192a304k51977
9894b53281J19454A09413f6562i467A78502b1066A25929a95898j0439g9817k24722
9883c04539A5051C051c14545E292d29769C826a80686c5859Q628k18034O6515A8312
9870b87507a30867r1004O1690A42522i7495B6546a84307A31580a78610A36823
9859i8087j98612K7256G7415C1797a6959q6705d8748C22863j51418i6395q4914
9848a81309E2690K0455k4631K14337a11293n6801A47688f7042B94025b66345q669
9837b75014P3907P8905k2211b1471k17492R7199a5461l3003A56223a33022c4794
$$ y = [-462319, -83785, 20084, -200098, -40125, -109063, -314822, -78375, 208194, -168213, 90970, 15995, 246360, 79916, -32207, 71689, 255789, 128415, -45065, 31638, -52446, -36254, -1304, -253281, -133827, 109413, -66562, -9467, 178502, -21066, 125929, -195898, -206337, -79817, -304539, 15051, 3051, -314545, 5292, -429769, 3826, -180686, -35859, -27231, -245265, -178750, 18312, -287507, -130867, -221871, -160181, 142522, -97495, 26546, -184307, 131580, -178610, 136823, -98087, -296699, -269443, 77415, 31797, -16959, -103664, -48748, 322863, 171445, -96395, -181309, 52690, 73145, 48514, 262851, -111293, -168094, 147688, -67042, 294025, -266345, -275014, -201107, -122202, -144413, -21471, -238963, -141764, -15461, -48464, 156223, -133022, -34794]
9825b95661i4272I1029b99716J46823A60921K9698D5548M2038a7786B71487F2676
9813h9733k08112J03559H9704j9293O5780O503A5513b49741G3847A7374a47921
9801b04756G7133b18960K5836C5917P5915O0016d9545E0033J49048r4770c15765
9789i3286l6773j54682e6066j60097A3642c9534l47907C6437a54268D0629P16
9778D1345J52087B1486c76184J48667i6034j09076F2754K6392b42236k1550C22540
9766B0116c37504a21271k41987A82263m2059c0244A36880b83704A24021a59793
9755a90428G4795d58443G7660b30801R454j07171A01770m9679a25983A23583a03341
9743D4849K07917c03569r0453I4904B2688b08756C8562J41822R5568b91411b1372
$$ y = [-295661, -94272, 91029, -299716, -152893, 160921, 190619, 45548, 87586, -17786, 271487, 62676, -89733, -297845, -194286, 89704, 70411, 136191, 142694, 15513, -249741, 73847, 17374, -147921, -204756, 77133, -218960, -193124, 35917, 111832, 171848, -49545, 50033, 199081, 104311, -315765, -93286, -130059, -284741, -56066, -216163, 13642, -39534, -387441, 36437, -154268, 40629, 41345, 193432, 21486, -376184, -227517, -96034, -205110, 62754, 89146, -242236, -263786, 322540, 20116, -337504, -121271, -363258, 182263, 140204, -30244, 136880, -283704, 124021, -159793, -190428, 74795, -458443, 77660, -230801, -221347, -328518, 101770, 52091, -125983, 123583, -103341, 44849, 252766, -303569, -394022, 94904, 22688, -208756, 38562, 180384, 275952, -291411, -21372]
9731C07280D1855J81840q6902M7025q129b31688a10032G0192b4804l45427K5618
9720c44613f4008m681A2885b0374A90553a59754e0777a8269k19476a2367A09660
9708c79387a11759B04717p7899j7715m0257B8477a88699A80399D689J09891a79802
9696B762P1759m254a2253j07724C4206b71210e7483G1438g5109k79496J52103
9685b02502A12893I25J59395g7982r8159A88326b59753E480J58690o6170c06682
9673a79776m7368R3845j18903Q2152B6076J36704p71k7124I526L2423b33944P2209
9661a61735K8511n9697b1447k1758j25844J0192H9995d26257e1416C05895a17970
9649b63689G2742J51489l6891f4920j02308G6695b9642F4674P0458k6290a05164
$$ y = [307280, 41855, 223695, 136793, 183818, 175689, -231688, -110032, 70192, -24804, -370231, -344613, -64008, -68689, 12885, -20374, 190553, -159754, -50777, -18269, -237745, -12367, 109660, -379387, -111759, 204717, 126818, 109103, 68846, 28477, -188699, 180399, 4689, 114580, -179802, 2762, 74521, 70267, -12253, -119977, 34206, -271210, -57483, 71438, -75109, -354605, -202502, 112893, 925, 160320, -77982, -176141, 188326, -259753, 5480, 164170, 98000, -306682, -179776, -227144, -133299, -252202, -170050, 26076, 162780, 162009, 134885, 9526, 41949, -233944, -161735, -133224, -192921, -21447, -43205, -169049, -158857, 89995, -426257, -51416, 305895, -117970, -263689, 72742, 224231, 187340, -64920, -167228, 76695, -29642, 64674, 135132, 108842, -105164]
9637a58092j96723C0232a22614f470r0890A85782a52025N9562m34599A71504N1659
9626B23163c07169Q3257g5620A5415P0330e08227A45959c71781C0259a01674p7086
9615a78760B22268r0992g3836G5833d7649j00695j25397o4480c014k06411h8994
9603b50766A2672c12970A05612J10898f8598e386j30794j29049A31094B9393b38032
9591b67706c6652A93960R8901d2152a8891j66172M5877A24336a00716B98451a53317
9579e9089J010j53892d0885k32262A53207G4931b36507C6015A5378e2970J2831
9568d0139m8949E0323a2530j26126J6670k03473c9796l11448J28592C3062b61264
9556g4097J3562D6793b10772a0848I8647b51364J8248q0579b4891q2739p470j99303
$$ y = [-158092, -354815, 30232, -122614, -6470, -97360, 185782, -152025, -92463, -527062, 171504, 223163, -307169, -223912, -75620, 15415, 85745, -508227, 145959, -371781, 30259, -101674, -178760, 222268, 131276, -73836, 75833, -47649, -148344, -273741, -338221, -3014, -209425, -88994, -250766, 12672, -312970, 105612, 216510, -68598, -5386, -136180, -265229, 131094, 29393, -238032, -267706, -36652, 193960, 292861, -42152, -18891, -185063, -139186, 124336, -100716, 298451, -153317, -59089, -58079, -211971, -40885, -273147, 153207, 74931, -236507, 36015, 15378, -52970, -40139, -89088, 50323, -12530, -138656, -121986, -325459, -39796, -351244, -222652, 33062, -261264, -74097, -60535, 46793, -210772, -10848, 98647, -251364, -233116, -313695, -24891, -107630, -115100, -314403]
9544c14403a30872f0452B20404b87181H4507R5137a02397r4777R0064d6971j36148
9533a83119m2699q6096a53108J5763c2195J4085l35504i0578d3062m0591B41042
9521B49b1781B65405a22249j11229J12606j25130R09i4090A1019c83785J71369
9510b12416j05269Q5755l8508A70673a15982k1923l29187a88762A53197d3726
9499b99732d8057Q933k31118A08309m8498k3688a47931C7219c6588C5824h8694
9487b06822C8494a68587F0447d7884k27228F0081e2882j31320P9240A9013Q3695
9476A02708g751k04380I6868O1057b8499j0798k72853E0031b51112B17126C0849
9464a16640D8545L6913c29933J32713a5989E7503a22076E2485b81542A36271a31111
$$ y = [-314403, -130872, -60452, 220404, -287181, 84507, 179644, -102397, -197174, -107110, -46971, -183119, -225818, -311914, -153108, -137345, -32195, -18110, -353614, -90578, -43062, -83653, 241042, 249, -21781, 265405, -122249, -233478, -120872, -246002, -245093, -94090, 11019, -383785, -212416, -317685, -231930, -270438, 170673, -115982, -137905, -467092, -188762, 153197, -43726, -299732, -48057, -39124, -270242, 108309, 59811, 36123, -147931, 37219, -36588, 35824, -88694, -206822, 38494, -168587, 60447, -47884, -275112, 60081, -52882, -184202, -104962, 19013, 102708, -7751, -212131, 96868, 157925, -28499, -39297, -312150, 50031, -251112, 217126, 30849, -116640, 48545, 85458, -329933, -197220, -15989, 57503, -122076, 52485, -281542, 136271, -131111]
9452B09722g6907m5005M5675G8575c02055Q8302B1272r534i0475E7582a16445
9440E317Q9452a427j31365j14736g8298C1028g4910B17938E0558K22259e3120
9428c29423f2826A04772h1222J2433j70813o811c1019a0459o3652j67985a5726
9416h0293B99205j02996Q4610f9446j5072I6541a74326e5664j2623I9538b18789
9404b49026L8191B83642c8615n8940j38742b3220B05444I4266K55540a80492e9523
9392d09794B44442o4359i8528k81800J66991A58933h0711k43042a31148N8262
9382g2886B86847F1775a04284A62826b70929B3098k365J70453a49987c2134l44038
9371c76172a31343p1676P5183m3042H9782L7814b61789j85352A16023b46000I3024
$$ y = [209722, -76907, -121912, -76237, 78575, -302055, -213753, 21272, 11738, -90475, 57582, -116445, 5317, 94769, -1427, -132792, -247528, -78298, 31028, -74910, 217938, 50558, 272817, -53120, -329423, -62826, 104772, -81222, -68789, -239602, -246413, -31019, -10459, -74111, -242096, -15726, -80293, 299205, 196209, 280819, -69446, -84518, 96541, -174326, -55664, -68287, 99538, -218789, -249026, -210835, 283642, -38615, -97555, -236297, -23220, 205444, 94266, 349806, -180492, -59523, -409794, 244442, 180083, -98528, -380328, -213337, 158933, -80711, -323753, -131148, -72886, 286847, 61775, -104284, 162826, -270929, 23098, 20733, 191186, -149987, -32134, -376172, -131343, -203019, -127836, -170878, 89782, 127596, -261789, -447141, 116023, -246000, 93024]
9359f0854j44842O4016K666F4689h3496B085A4b71755J29635r5021a0126j69057
9347a79183C40353c84367A04033c46488J8431K9010A74187q2590a76533B98230
9336d6666n2900j43853l625b7295C6593M6020a51447L0993m3941G0238h5968j74876
9324b60844a15418l52776F737K47126b6017F2012b90694P1060M4286B99813G8420
9312B8397b37475A34022a50551l9199A94506b35598i0694B46534a00137E9081
9301a07304G3132a95654I3713a99238R613K5903m5286N4383E862K15356a17505
9289b06804r2366N6263m5174a30106j09028F3702b06621n435o3684g8483F0153
9277D8864b47019A4703i8417g013m9806l3503I1503a22617m7542e8673k72981
$$ y = [-60854, -205696, -141680, -139014, 64689, -83496, 2085, 14, -271755, -142120, -237141, -10126, -179183, 340353, -384367, 104033, -346488, -328057, -299047, 174187, 91597, -176533, 298230, -46666, -99566, -243419, -247044, -27295, 36593, 82613, -151447, -120454, -164395, 70238, -85968, -260844, -115418, -468194, 6737, 253863, -26017, 62012, -290694, -219634, -175348, 299813, 78420, 28397, -237475, 134022, -150551, -189750, 194506, -235598, -90694, 246534, -100137, 59081, -107304, 73132, -195654, 93713, -199238, -189625, -163722, -209008, -154625, 5862, 221218, -117505, -206804, -299170, -242907, -288081, -130106, -239134, 63702, -206621, -212056, -275740, -78483, 60153, 48864, -247019, 14703, -98417, -7013, -56819, -90322, 91503, -122617, -170159, -58673, -331654]
9266c31654J39345R453C29560c80730a80631j3968h2416j49291g1936b7367r4502
9255a21869A71405e02907a77453A22507b99590I2456f4672j94117a02716A4095
9244b0171A34757J33309g6897F0651a12465j23495B50094B7281c19628c3846C46293
9232A0885a30019E246a19815O001p626k2029O2525k06981F3435d28945K10291
9221b18654A280g9999B4194J35478p5499l1156J73257L0516e2459j03528A41997
9209b25216j27463a58768a0202D0219b47948A15885M8017d81188A53619c25057
9198b5475B5337a44843n5199O8111k46286h815k92112a05538F4482b85458M8415
9187b37043l5550g5636k67458A96026D6970i5127A69526c99835J81333I1897a55943
$$ y = [-331654, -192309, -182856, 329560, -380730, -180631, -194599, -82416, -231707, -71936, -27367, -121869, 171405, -502907, -177453, 122507, -299590, 92456, -64672, -258789, -102716, 14095, -20171, 134757, 268066, -76897, 60651, -112465, -235960, 250094, 27281, -319628, -33846, 346293, 10885, -130019, 5246, -119815, -113814, -121440, -143469, -80944, -287925, 63435, -428945, -218654, 1280, -79999, 24194, 159672, 84173, 53017, 226274, 256790, -52459, -155987, 141997, -225216, -352679, -158768, -10202, 40219, -247948, 115885, 163902, -481188, 153619, -325057, -25475, 25337, -144843, -200042, -131931, -378217, -8815, -300927, -105538, 64482, -285458, -237043, -272593, -75636, -343094, 196026, 46970, -95127, 169526, -399835, -218502, 91897, -155943]
9175C9199b12523G9906a52268A16313C3420J63354b60120N0941H8769e5093D4181
9163B12208a86942g9288p5531A39199K6299k9925a7114p5846A4784a01089g47
9151A38305B619Q5482d6273l33238e2684B29788a01654A41366F1129b04744B32736
9139a95557F348J30146b86532D44788a22707A3982a53701i064k32018K6707A26072
9127b4699B6013r676c85943C07285n7764K28101A77644p5063j9485c7973B8043
9115a82272B2186K24880A21383e5490A24487n6014M5427C4315a18402G3283f9279
9103c00990j32655a0504A26005C8470d60269G9361b39536i6658j39888N4586d9938
9091A07928f1655k07960E8474c15249R9979l5271R6552m6939l3934A72033J09604
$$ y = [39199, -212523, 79906, -152268, 116313, 33420, 196774, -260120, -209179, 88769, -55093, 44181, 212208, -186942, -79288, -154819, 139199, 165498, 135573, -17114, -92960, 14784, -101089, -747, 138305, 2619, 88101, -46273, -379511, -52684, 229788, -101654, 141366, 61129, -204744, 232736, -195557, 6348, 136494, -286532, 444788, -122707, 13982, -153701, -9064, -241082, -214375, 126072, -24699, 26013, 16337, -385943, 307285, 249521, 477622, 177644, 102581, 83096, -37973, 28043, -182272, 22186, 247066, 121383, -55490, 124487, 68473, 113900, 34315, -118402, 73283, -69279, -300990, -433645, -10504, 126005, 38470, -460269, 79361, -239536, -96658, -236546, -181960, -49938, 107928, -61655, -269615, 58474, -315249, -215270, -250541, -153989, -200928, -234862, 172033, 281637]
9080B81637b30751e4582E1011f1639A57126p4622P0903b03972A19729a80965L6712
9069a44253D4379J80138a26869r431d5079p3204b8183n5615a8994l8973A09546
9057E4942K22125a53494m52548b33750J13505H5674c52747i1314c0161F6125a71142
9045a74680J6040k71878a20109j23043a18758H3223e9309m4128R772A57348B424
9033c20860a13093d2271k15330I024a8284q7626j09878l1445D4292N8734a18702
9021D0419i9915j18717C72258e0615m8671A60854B7697a68754c2833I7402a47002
9009b41962A10288b11075j02516i6459A30096d45869a20091p7424B2068f7809
8998b23035n1885Q9074B06947b12858J02939B7259a93601K4944g6559j09936l3409
$$ y = [281637, -230751, -54582, 51011, -61639, 157126, 82504, 153407, -203972, 119729, -180965, -144253, 44379, 224517, -126869, -136300, -45079, -118283, -28183, -83798, -18994, -57967, 109546, 54942, 277067, -153494, -606042, -233750, -120245, 85674, -352747, -91314, -30161, 66125, -171142, -174680, -158640, -430518, -120109, -243152, -118758, 83223, -59309, -103437, -93665, 157348, 2424, -320860, -113093, -42271, -257601, 9024, -18284, -105910, -215788, -247233, 44292, 103026, -118702, 40419, -99915, -218632, 372258, -50615, -99286, 160854, 27697, -168754, -32833, 97402, -147002, -241962, 110288, -211075, -313591, -96459, 130096, -445869, -120091, -197515, 22068, -67809, -223035, -274920, -185846, 206947, -212858, -109919, 27259, -193601, -168657, -76559, -186495, -219904]
8987b19904c8348G5507b02350A45052l510l6229i5379d0244j79700J08084c0991
8975b49947A53314B5187R4975f0115m618B5462a32844F2097e2338k24899A6994
8963b5111p2172r2972G6532i8826A331b36985r916A34027h9800a2146n7183r6715
8951a66044q2738I0302J2890b74537F3996f9625j56026A3825L1425b24804Q3521
8940a41283l4960N0701A68764b41260O755R9874D183N0492a75162h0252B10627
8928A79479L0675i757j88117B56949R1193J062357L968110L776904A328609F02720
8917E30478A86585j9013K4014G2227f7673j09452m7817c196B95372E9788a08652
8905c70213a70925I1630d15489g1309J115Q016k45744B1384a13201A14572d19529
$$ y = [-219904, -38348, 75507, -202350, 145052, 141542, 105313, -95379, -40244, -219944, -111860, -30991, -249947, 153314, 25187, 120162, -60115, -64733, 25462, -132844, 62097, -52338, -277237, 16994, -25111, -97283, -190255, 76532, -98826, 1331, -236985, -246901, 134027, -89800, -12146, -69329, -166044, -248782, 90302, 103192, -274537, 63996, -69625, -225651, 13825, 45250, -224804, -141283, -176243, -125542, 168764, -241260, -234505, -134631, 4183, 54675, -175162, -80252, 210627, 179479, 210154, -9757, -197874, 256949, 348142, 1410499, 5378609, 9155513, 1328609, 602720, 530478, 186585, 167572, 191586, 72227, -67673, -177125, -224942, -3196, 295372, 59788, -108652, -370213, -170925, 91630, -415489, -71309, -70194, -62178, -307922, 21384, -113201, 114572, -419529]
8893I5266A6542b63976A83829a13878R266D7721a01140l5627j36426h9656A01411
8881b95770a47459E7751O7054j5760J56971o1246g4300r8272r4270D09704B1644
8869G1593R1091a90448j20951B091O9540a51014D109L21152b51993A07261a94041
$$ y = [95266, 16542, -263976, 183829, -113878, -104612, 47721, -101140, -136767, -273193, -89656, 101411, -295770, -147459, 57751, 124805, 109045, 266016, 204770, -74300, -172572, -266842, 409704, 21644, 71593, 162684, -190448, -311399, 2091, 71631, -151014, 4109, 325261, -251993, 107261, -194041]
$$ [...]
##END NTUPLES=NMR SPECTRUM
##END=
