
##TITLE=AC1306_DOMAH11118_6534518_o2wEnZixA4
##JCAMPDX= 6.0         $$ Bruker NMR JCAMP-DX V2.0
##DATA TYPE= NMR SPECTRUM
##DATA CLASS= NTUPLES
##ORIGIN= BRUKER
##OWNER= Administrator
$$ 1.72 TOPSPIN		Version 2.1
$$ 2012-07-16 23:27:50.343 -0500  Administrator@TOPSPIN
$$ Compression mode = diff/dup
##.OBSERVE FREQUENCY= 400.02188249412
##.OBSERVE NUCLEUS= ^1H
##.ACQUISITION MODE= SIMULTANEOUS (DQD)
##.ACQUISITION SCHEME= undefined
##.AVERAGES= 64
##.DIGITISER RES= 22
##SPECTROMETER/DATA SYSTEM= spect
##.PULSE SEQUENCE= noesygpps1d.comp
##.SOLVENT NAME= COFFEE_meoh
##.SHIFT REFERENCE= INTERNAL, COFFEE_meoh, 1, 14.96097
##AUDIT TRAIL= $$ (NUMBER, WHEN, WHO, WHERE, PROCESS, VERSION, WHAT)
$$ ##TITLE= Audit trail, TOPSPIN		Version 2.1
$$ ##JCAMPDX= 5.01
$$ ##ORIGIN= Bruker BioSpin GmbH
$$ ##OWNER= Administrator
$$ $$ C:\Bruker\TOPSPIN/data/COFFEE/nmr/AC1306_DOMAH11118_6534518_o2wEnZixA4/12/pdata/1/auditp.txt
$$ ##AUDIT TRAIL=  $$ (NUMBER, WHEN, WHO, WHERE, PROCESS, VERSION, WHAT)
(   1,<2012-07-16 23:27:44.828 -0500>,<Administrator>,<TOPSPIN>,<go>,<TOPSPIN 2.1>,
      <created by zg
	started at 2012-07-16 23:16:14.421 -0500,
	POWCHK enabled, PULCHK disabled,
       configuration hash MD5:
       6B 1B 68 BB D9 2E 58 E2 7F 35 AD 54 07 DF 0E 41
       data hash MD5: 64K
       18 B1 AE 46 B0 57 B5 6F ED F9 24 F6 E3 14 64 09>)
(   2,<2012-07-16 23:27:48.031 -0500>,<Administrator>,<TOPSPIN>,<proc1d>,<TOPSPIN 2.1>,
      <Start of raw data processing
       efp LB = 0.3 FT_mod = 6 PKNL = 1 PHC0 = 0 PHC1 = 0 SI = 128K 
       data hash MD5: 128K
       FC 04 6B BD 14 F3 AB 9F 68 F2 53 96 81 92 C1 ED>)
(   3,<2012-07-16 23:27:49.140 -0500>,<Administrator>,<TOPSPIN>,<proc1d>,<TOPSPIN 2.1>,
      <pk PHC0 = 2.059937 PHC1 = 0 
       data hash MD5: 128K
       7B 4D 23 39 8C 29 73 16 49 88 47 FF 8E 38 8C FB>)
(   4,<2012-07-16 23:27:49.812 -0500>,<Administrator>,<TOPSPIN>,<proc1d>,<TOPSPIN 2.1>,
      <abs ABSG = 1 
       data hash MD5: 128K
       B1 EA FB 08 FC BD 3E C7 B6 4F 17 AF 43 D4 40 C2>)
(   5,<2012-07-16 23:27:49.906 -0500>,<Administrator>,<TOPSPIN>,<proc1d>,<TOPSPIN 2.1>,
      <abs ABSG = 2 
       data hash MD5: 128K
       F6 2D 5D FD B9 2C 7D 59 72 31 2E B3 1B 7A FE 91>)
(   6,<2012-07-16 23:27:49.984 -0500>,<Administrator>,<TOPSPIN>,<proc1d>,<TOPSPIN 2.1>,
      <abs ABSG = 3 
       data hash MD5: 128K
       90 78 31 CA 83 7C 6C 3D 0C 1B 91 64 3C 39 7E 54>)
(   7,<2012-07-16 23:27:50.062 -0500>,<Administrator>,<TOPSPIN>,<proc1d>,<TOPSPIN 2.1>,
      <abs ABSG = 4 
       data hash MD5: 128K
       8D A3 EC 31 DF 7E 7B D7 20 2F 35 77 34 7B DF 18>)
(   8,<2012-07-16 23:27:50.265 -0500>,<Administrator>,<TOPSPIN>,<proc1d>,<TOPSPIN 2.1>,
      <abs ABSG = 5 
       data hash MD5: 128K
       2F 78 AB C7 7C 64 33 C5 6A 09 AA 44 41 87 3D 63>)
$$ ##END=
$$ 
$$ $$ hash MD5
$$ $$ 41 34 8C CD E4 5B 74 C8 53 AB DA 26 88 8C C9 70
##$RELAX= 
##$RELAX= 
##$RELAX= 
##$RELAX= 
##$RELAX= 
##$RELAX= 
##$RELAX= 
##$RELAX= 
$$ Bruker specific parameters
$$ [...]
##$TP07= 0
##$TPNAME0= <>
##$TPNAME1= <>
##$TPNAME2= <>
##$TPNAME3= <>
##$TPNAME4= <>
##$TPNAME5= <>
##$TPNAME6= <>
##$TPNAME7= <>
##$TPOAL= (0..7)
0.5 0.5 0.5 0.5 0.5 0.5 0.5 0.5
##$TPOFFS= (0..7)
0 0 0 0 0 0 0 0
##$TUNHIN= 0
##$TUNHOUT= 0
##$TUNXOUT= 0
##$USERA1= <user>
##$USERA2= <user>
##$USERA3= <user>
##$USERA4= <user>
##$USERA5= <user>
##$V9= 5
##$VALIST= <valist>
##$VCLIST= <CCCCCCCCCCCCCCC>
##$VD= 0
##$VDLIST= <DDDDDDDDDDDDDDD>
##$VPLIST= <PPPPPPPPPPPPPPP>
##$VTLIST= <TTTTTTTTTTTTTTT>
##$WBST= 2048
##$WBSW= 25
##$XGAIN= (0..3)
0 0 0 0
##$XL= 0
##$YL= 0
##$YMAX_a= 11618532
##$YMIN_a= -8736885
##$ZGOPTNS= <>
##$ZL1= 120
##$ZL2= 120
##$ZL3= 120
##$ZL4= 120
##$ABSF1= 14.96097
##$ABSF2= -5.597212
##$ABSG= 5
##$ABSL= 3
##$ALPHA= 0
##$AQORDER= 0
##$ASSFAC= 0
##$ASSFACI= 0
##$ASSFACX= 0
##$ASSWID= 0
##$AUNMP= <proc_prof1d_extract.lims>
##$AXLEFT= 0
##$AXNAME= <>
##$AXNUC= <1H>
##$AXRIGHT= 0
##$AXTYPE= 0
##$AXUNIT= <>
##$AZFE= 0.1
##$AZFW= 0.1
##$BCFW= 0
##$BC_mod= 0
##$BYTORDP= 0
##$COROFFS= 0
##$CY= 15
##$DATMOD= 1
##$DC= 0
##$DFILT= <>
##$DTYPP= 0
##$F1P= 0
##$F2P= 0
##$FCOR= 0.5
##$FTSIZE= 131072
##$FT_mod= 6
##$GAMMA= 0
##$GB= 0
##$INTBC= 1
##$INTSCL= 1
##$ISEN= 128
##$LB= 0.3
##$LEV0= 0
##$LPBIN= 0
##$MAXI= 10000
##$MC2= 0
##$MEAN= 0
##$ME_mod= 0
##$MI= 0
##$NCOEF= 0
##$NC_proc= -2
##$NLEV= 6
##$NOISF1= 0
##$NOISF2= 0
##$NSP= 0
##$NTH_PI= 0
##$NZP= 0
##$OFFSET= 14.96097
##$PC= 1
##$PHC0= 2.059937
##$PHC1= 0
##$PH_mod= 1
##$PKNL= yes
##$PPARMOD= 0
##$PPDIAG= 0
##$PPIPTYP= 0
##$PPMPNUM= 2147483647
##$PPRESOL= 1
##$PSCAL= 4
##$PSIGN= 0
##$PYNMP= <proc.py>
##$REVERSE= no
##$SF= 400.020009650459
##$SI= 131072
##$SIGF1= 0
##$SIGF2= 0
##$SINO= 400
##$SIOLD= 131072
##$SPECTYP= <>
##$SREGLST= <1H.CDCl3>
##$SSB= 0
##$STSI= 131072
##$STSR= 0
##$SW_p= 8223.68421052631
##$SYMM= 0
##$S_DEV= 0
##$TDeff= 65536
##$TDoff= 0
##$TI= <>
##$TILT= no
##$TM1= 0
##$TM2= 0
##$TOPLEV= 0
##$USERP1= <user>
##$USERP2= <user>
##$USERP3= <user>
##$USERP4= <user>
##$USERP5= <user>
##$WDW= 1
##$XDIM= 131072
##$YMAX_p= 456596599
##$YMIN_p= -13693
##$CURPLOT= <Network HP LaserJet P1505>
##$CURPRIN= <$Network HP LaserJet P1505>
##$DFORMAT= <normdp>
##$LAYOUT= <+/1D_H.xwp>
##$LFORMAT= <normlp>
##$PFORMAT= <normpl>
##$SURQMSG= 1
$$ End of Bruker specific parameters
$$ ---------------------------------
##NTUPLES= NMR SPECTRUM
##VAR_NAME=  FREQUENCY,     SPECTRUM/REAL,   SPECTRUM/IMAG
##SYMBOL=    X,             R,               I
##VAR_TYPE=  INDEPENDENT,   DEPENDENT,       DEPENDENT
##VAR_FORM=  AFFN,          ASDF,            ASDF
##VAR_DIM=   131072,        131072,          131072
##UNITS=     HZ,            ARBITRARY UNITS, ARBITRARY UNITS
##FACTOR=    0.0627417313425164, 1,          1
##FIRST=     8223.62146879497, 1815,         -56451
##LAST=      0,             4029,            -56040
##MIN=       0,             -13693,          0
##MAX=       8223.62146879497, 456596599,    0
$$ Real data points
##PAGE= N=1
##DATA TABLE= (X++(R..R)), XYDATA
$$ [...]
63947A263604J14202J30545J48235J66606J84790K01981K17540K31162K42799
63938B901464K52048K57848K59064K55135K45746K30241K08096J79941J47510
63929D937093J12346P5055L5964m005m3552q1863j18709j53645j85381k12119
63919D361184k32365k45498k51824k52466k48943k42392k32974k20284k04487
63910B229951j86775j68557j50544j33016j16605j02121q9661p8530o8185n8805
63900A077152n0702m3720l7591l2458k8561k5676k3311k1436k0423k0270k0318
63889G52686k0048j9791k0157k0910k0913j9430j7076j5019j3514j1847r657p522
63877E56802n925m341k001Q17L072M344N242O385P679Q833R968J1356J2903J4210
$$ plain form
63947 1263604 1377806 1508351 1656586 1823192 2007982 2209963 2427503 2658665 2901464
63938 2901464 3153512 3411360 3670424 3925559 4171305 4401546 4609642 4789583 4937093
63929 4937093 5049439 5124494 5160458 5156453 5112901 5031038 4912329 4758684 4573303 4361184
63919 4361184 4128819 3883321 3631497 3379031 3130088 2887696 2654722 2434438 2229951
63910 2229951 2043176 1874619 1724075 1591059 1474454 1372333 1282672 1204142 1135957 1077152
63900 1077152 1026450 982730 945139 912681 884120 858444 835133 813697 793274 773004 752686
63889 752686 732638 712847 692690 671780 650867 631437 614361 599342 585828 573981 564324 556802
63877 556802 550877 546536 544535 545352 548424 552768 558010 564395 572074 580907 590875 602231 615134 629344
63863F29344J4991J5195J4862J4050J2786J1107R238P605O377N113L234Q72j213
63850G43561k647l904n521p341q831r896j0950j2347j4095j5993j7797j9217k0002
63837E95020k0180k0092k0098k0198k0051j9473j8802j8495j8325j7500j5739
63826C86067j3845j2679j1997j0919r302p911p244o924o451n898n556n393n177
63813B76771m775m026k804j402n18n28j013j246r34l45J2k56j087j868k019j683
63797B52279j497j648j749j718k034k789l264k926k266k037k192k245k184k227
63783B21503k058j224j41K26k37n82k40J33k52j106j511j253r05p63m43K76P94
63766B12217L69q08j744j743j028k18L42N10J74n33j054r46l81J89P14J346J821
$$ plain form
63863 629344 644335 659530 674392 688442 701228 712335 721573 729178 735555 740668 743902 744774 743561
63850 743561 740914 737010 731489 724148 715317 705421 694471 682124 668029 652036 634239 615022 595020
63837 595020 574840 554748 534650 514452 494401 474928 456126 437631 419306 401806 386067
63826 386067 372222 359543 347546 336627 327325 319414 312170 305246 298795 292897 287341 281948 276771
63813 276771 271996 267970 265166 263764 263246 262718 261705 260459 259525 259180 259192 258936 257849 255981 253962 252279
63797 252279 250782 249134 247385 245667 243633 240844 237580 234654 232388 230351 228159 225914 223730 221503
63783 221503 219445 218221 218080 218306 218069 217487 217247 217380 217128 216022 214511 213258 212353 211590 211147 211423 212217
63766 212217 212586 211778 210034 208291 207263 207045 207387 207897 208071 207538 206484 205538 205157 205346 206060 207406 209227
63749B09227J602P13j74n27l63K17J216K341K964K857K501K354K285K023J741
63734B30977J779K079K312K309K146J981K005K288K492K188J620J635K568L682
63720B62061M204M321M596M853M494L616K964K721K196Q60q56k141k722k879k907
63705B85381k883k808k655k337j772j069m98k18r1J69O59J229J799K501L348M000
63689B84755M149M012M008M056L641K611J412M96j07m93o77q00j027j129o64K42
63673C04485Q41P73N51P04J001R94P89P97J103J505J795J596M32j528l244l910
63657C08684l921m165m780n235n267n077m729m117l354k677k042j332p03l05R1
63642B61071O54R93Q22O80J267K273K779K627K529K824L086L063L199L882M879
$$ plain form
63749 209227 210829 211542 211368 210841 210478 210695 211911 214252 217216 220073 222574 224928 227213 229236 230977
63734 230977 232756 234835 237147 239456 241602 243583 245588 247876 250368 252556 254176 255811 258379 262061
63720 262061 266265 270586 275182 280035 284529 288145 291109 293830 296026 296886 296030 293889 291167 288288 285381
63705 285381 282498 279690 277035 274698 272926 271857 271359 271141 271050 271219 271878 273107 274906 277407 280755 284755
63689 284755 288904 292916 296924 300980 304621 307232 308644 309140 309033 308540 307863 307063 306036 304907 304243 304485
63673 304485 305326 306099 306650 307354 308355 309349 310138 310935 312038 313543 315338 316934 317366 315838 312594 308684
63657 308684 304763 300598 295818 290583 285316 280239 275510 271393 268039 265362 263320 261988 261285 260980 261071
63642 261071 261725 262718 263540 264220 265487 267760 270539 273166 275695 278519 281605 284668 287867 291749 296628
63627B96628N781O454O836O865O842P347Q586J0132J1482J2474J3165J3760J4726
63614D21078J6415J8522K0404K2011K3938K6479K9240L1729L3699L4750L4356
63603G12621L2474K9512K5400J9506J1960M362j431m908o818p938q502q522q129
63590G89587p685p833r310j2349j6408k0647k4396k7098k8290k8012k6822k5106
63578E55631k2723j9672j6627j4265j2410j0413q175o113m323k401j84J911L474
63565D43710M594N575O473P156P622Q021Q458Q901R312R792J0593J1897J3563
63552E55667J5256J6964J9210K2568K6935L1492L5426L8470M0599M1278L9305
63541H83170L3664K4628J3944L775m503j0492j4104j5226j4141j1833r461p541
$$ plain form
63627 296628 302409 308863 315699 322564 329406 336753 345339 355471 366953 379427 392592 406352 421078
63614 421078 437493 456015 476419 498430 522368 548847 578087 609816 643515 678265 712621
63603 712621 745095 774607 800007 819513 831473 835835 834404 829496 822678 814740 806238 797716 789587
63590 789587 781902 774069 764759 752410 736002 715355 690959 663861 635571 607559 580737 555631
63578 555631 532908 513236 496609 482344 469934 459521 451346 445233 440910 438509 438325 440236 443710
63565 443710 448304 453879 460352 467508 475130 483151 491609 500510 509822 519614 530207 542104 555667
63552 555667 570923 587887 607097 629665 656600 688092 723518 761988 802587 843865 883170
63541 883170 916834 941462 955406 959181 954678 944186 930082 914856 900715 888882 879421 871880
63529H71880o004n075n744r010j4677k1144k6600l0349l2800l4400l4987l4239
63517F16851l2362k9980k7570k5242k2933k0548j8079j5770j3967j2646j1291
63506C86463r581p941o939o446n818m818l823l195k892k759k713k543k025j275
63492C23695o47k40O1J39k04n80k33Q66J779J834J488J532K027K550L049L681
63476C40797M102L722K652J717J352J077K80r32k011k717l205l561l718l794m043
63461C31718m350m096k933j435n87o15p33j91Q10J479J454J142J247K160L682
63446C28752N186O213P022Q251R899J1089J1237J0992J1439J2771J4428J6287
63434D53566J8844K2109K5046K6395K5583K2732J8417J3642R608P192O747Q245
$$ plain form
63529 871880 865876 860801 855057 846047 831370 810226 783626 753277 720477 686077 651090 616851
63517 616851 584489 554509 526939 501697 478764 458216 440137 424367 410400 397754 386463
63506 386463 376882 368941 362002 355556 349738 344920 341097 337902 335010 332251 329538 326995 324970 323695
63492 323695 323048 322808 322869 323008 322804 322224 321991 322857 324636 326470 327958 329490 331517 334067 337116 340797
63476 340797 344899 348621 351273 352990 354342 355419 355699 354767 352756 350039 346834 343273 339555 335761 331718
63461 331718 327368 323272 320339 318904 318317 317702 316969 316778 317588 319067 320521 321663 322910 325070 328752
63446 328752 333938 340151 347173 355424 365323 376412 387649 398641 410080 422851 437279 453566
63434 453566 472410 494519 519565 545960 571543 594275 612692 626334 635942 643134 649881 658126
63422F58126J1206J4594J7564K0386K4034K8760L3626L7670M0692M2585M2540
63411I71783L9565L3441K4824J4845M955l358r290j2998j4936j5252j4079j2023
63399A007477j0029r107j0293j4238k0315k6673l1684l5074l7247l8164l7527
63388G37126l5661l3370l1060k8632k6024k3259k0160j6676j3366j0857q889o616
63376D82556l891j507K5J261K989N212P315Q927J0152J1208J2233J3421J4990
63363E64891J6958J9157K1468K3917K6496K9006L1192L3058L4872L6813L8583
63352H76411L9412L8373L4727K8301J9835J0854K816l671q636j2048j3768j4096
63340I98510j3767j3255j2635j2272j3070j5616j9528k3958k8371l2415l5418
$$ plain form
63422 658126 669332 683926 701490 721876 745910 774670 808296 845966 886658 929243 971783
63411 971783 1011348 1044789 1069613 1084458 1089413 1086055 1076765 1063767 1048831 1033579 1019500 1007477
63399 1007477 997448 988341 978048 963810 943495 916822 885138 850064 812817 774653 737126
63388 737126 701465 668095 637035 608403 582379 559120 538960 522284 508918 498061 489172 482556
63376 482556 478665 477158 477183 478444 481433 486645 493960 502887 513039 524247 536480 549901 564891
63363 564891 581849 601006 622474 646391 672887 701893 733085 766143 801015 837828 876411
63352 876411 915823 954196 988923 1017224 1037059 1047913 1050729 1047058 1038422 1026374 1012606 998510
63340 998510 984743 971488 958853 946581 933511 917895 898367 874409 846038 813623 778205
63329G78205l6640l5883l3596l0490k7252k4228k1064j7007j1989p137l767k206
63317E26946k110l535o843j1501j5778j8054j8133j6992j5516j3782j1560r120
63305C84022p205o126n330m247l204k860k926k389j124k73n39j130j119r33j429
63290C43188k248k408k171k776m349n448n086l982l271k961k467j841j546j476
63276C01158j081l44J30J3k92k44K15P56J104J204J140J082J253J742K328K655
63260C12819K707K887L415L860L688L154L067L567L862L490L149L668M753N571
63246C63657O124P113Q582R770J0342J0912J2051J3533J4929J6293J7827J9379
63234E10512K0700K1840K2967K4077K5160K6305K7344K7746K7217K6133K5085
$$ plain form
63329 778205 741565 705682 672086 641596 614344 590116 569052 552045 540056 532919 529152 526946
63317 526946 524836 521301 514458 502957 487179 469125 450992 434000 418484 404702 393142 384022
63305 384022 376817 370691 365361 361114 357910 355050 352124 349735 348611 348338 347799 346669 345550 344617 343188
63290 343188 340940 338532 336361 333585 329236 323788 318702 314720 311449 308488 306021 304180 302634 301158
63276 301158 300077 299733 299863 299876 299584 299340 299555 300311 301415 302619 303759 304841 306094 307836 310164 312819
63260 312819 315526 318413 321828 325688 329376 332530 335597 339164 343026 346516 349665 353333 358086 363657
63246 363657 369781 376894 385476 395246 405588 416500 428551 442084 457013 473306 491133 510512
63234 510512 531212 553052 576019 600096 625256 651561 678905 706651 733868 760001 785086
63223G85086K4217K3318K2447K2025K2355K3227K4089K4543K4624K4497K3938
63212A044366K2331J9341J5324J0779N733Q7n806j1529j7283k3320k8851l2486
63200I98686l3945l4277l4119l2869l0136k6896k4173k1459j7664j3126r388p124
63188G13510n493l558j202J483M623P929J0587J2284J3630J5079J6245J6783J7146
63175H19046J7746J8052J7477J6607J6456J6744J6118J4172J2051J0726R638P595
63163I92428M272J43m434r298j4011j8120k1693k5086k8222l0620l2027l2546
63151G80786l2265l1251k9697k7660k4859k1268j7722j5189j3576j2004j0260
63140E45035r012q491p895o581n020l972l317k454j369n94k51J77J109K309L156
$$ plain form
63223 785086 809303 832621 855068 877093 899448 922675 946764 971307 995931 1020428 1044366
63212 1044366 1066697 1086038 1101362 1112141 1117874 1117961 1112155 1100626 1083343 1060023 1031172 998686
63200 998686 964741 930464 896345 863476 833340 806444 782271 760812 743148 730022 720634 713510
63188 713510 708017 704459 703257 704740 709363 717292 727879 740163 753793 768872 785117 801900 819046
63175 819046 836792 854844 872321 888928 905384 922128 938246 952418 964469 975195 984833 992428
63163 992428 996700 996843 992409 983111 969100 950980 929287 904201 875979 845359 813332 780786
63151 780786 748521 717270 687573 659913 635054 613786 596064 580875 567299 555295 545035
63140 545035 536023 527532 519637 513056 508036 504064 500747 498293 496924 496330 496079 496256 497365 499674 502830
63125E02830L348L364M116N866P591Q016P229O522O506O307N018L078J517O05
63111E71913Q4J9N24J089J134Q77Q43Q48L70l70o77m54j68L2K28O4p76j577j282
63092E72721j48M28j31r13j032o13J8R70K047K475K079J907K910M607N812O109
63076E99246N985N916N991O214O625P256Q173R320J0324J0843J1182J1961J3163
63063G12199J4260J5355J7234K0006K2726K4899K7232L0284L3426L6078L8976
63052I92675M3026M7603N1348N4152N6981N9998O2194O2988O2905O2505O1682
63041A618057O0431N9263N8446N7543N6281N5194N4911N5144N4958N3780N1721
63030B235729M9007M5325L9815L1663K0816Q097n498j9406l3250m6350n7983o7883
$$ plain form
63125 502830 506178 509542 513658 519524 527115 535131 542360 548882 555388 561695 566713 569791 571308 571913
63111 571913 571997 572016 572540 573629 574763 575640 576483 577331 577701 577331 576654 576200 576032 576064 576292 576356 575580 574003 572721
63092 572721 572573 573001 572870 571957 570925 570312 570330 571300 573347 575822 577901 579808 582718 587325 593137 599246
63076 599246 605231 611147 617138 623352 629977 637233 645406 654726 665050 675893 687075 699036 712199
63063 712199 726459 741814 759048 779054 801780 826679 853911 884195 917621 953699 992675
63052 992675 1035701 1083304 1134652 1188804 1245785 1305783 1367977 1430965 1493870 1556375 1618057
63041 1618057 1678488 1737751 1796197 1853740 1910021 1965215 2020126 2075270 2130228 2184008 2235729
63030 2235729 2284736 2330061 2369876 2401539 2422355 2430452 2424954 2405548 2372298 2325948 2267965 2200082
63018B200082p5938q1502q3754q2884q0137p6436p1537o4945n7120m9173m1649
63007A435007l4227k6548j8791j1369m471J948P916J3362J8112K1897K4524K6168
62995A453528K7386K8667K9976L0896L1201L1064L0702L0023K8845K7218K5252
62984A774758K2724J9225J4686R436L694k664r812j7767k6504l5802m4724n1790
62972A655460n6187n8558o0104o1057o0600n8195n4484n0608m7100m3724m0163
62961A064680l6557l3362l0859k8872k6904k4655k2382k0731k0055j9973j9657
62950G80673j8676j7433j6614j6318j6020j5386j4730j4401j4111j3324j2089
62939F11571j0901r888q720p412o507o261o190n774n119m505l744k544j252n95
$$ plain form
63018 2200082 2124144 2042642 1958888 1876004 1795867 1719431 1647894 1582949 1525829 1476656 1435007
63007 1435007 1400780 1374232 1355441 1344072 1339601 1341549 1349465 1362827 1380939 1402836 1427360 1453528
62995 1453528 1480914 1509581 1539557 1570453 1601654 1632718 1663420 1693443 1722288 1749506 1774758
62984 1774758 1797482 1816707 1831393 1840829 1844523 1841859 1832047 1814280 1787776 1751974 1707250 1655460
62972 1655460 1599273 1540715 1480611 1419554 1358954 1300759 1246275 1195667 1148567 1104843 1064680
62961 1064680 1028123 994761 963902 935030 908126 883471 861089 840358 820303 800330 780673
62950 780673 761997 744564 727950 711632 695612 680226 665496 651095 636984 623660 611571
62939 611571 600670 590782 582062 574650 568143 561882 555692 549918 544799 540294 536550 534006 532754 532159
62925E32159p30r95p25k8L99N6q00j403j305q61p35r90j123r60j042j867l164
62908E15886m236m723m711m423m097l959l992l906l572l152k643j709l59O85Q12
62893D71901M16L54O99O88j25j244j849j679j171r75j313j714j488n95K18M06
62877D62529L57P01J282J419R72M68K71K49K83M28M93J48m33o18l29l23j069j903
62859D64925j817q10J99O00O79R01J256J512J729K092K403K252J728J483J829
62844D80961K159J722O45l04q25j300j875k081j667j146j080j262j175p88m25
62829D71559p6M89J086J214P28Q6j19L63J325K256K737K870L080L444L634L619
62813D98295L838M345M547M270M301N137N918N639M857M967O150P308P891Q463
$$ plain form
62925 532159 531429 530434 529709 529681 530080 530136 529336 527933 526628 525767 525032 524042 522919 521959 520917 519050 515886
62908 515886 511650 506927 502216 497793 493696 489737 485745 481839 478267 475115 472472 470763 470404 471089 471901
62893 471901 472317 472671 473370 474058 473933 472689 470840 469161 467990 467015 465702 463988 462500 461905 462123 462529
62877 462529 462886 463587 464869 466288 467260 467728 467999 468248 468531 468959 469452 469600 469167 468549 468220 467897 466828 464925
62859 464925 463108 462298 462497 463097 463776 464677 465933 467445 469174 471266 473669 475921 477649 479132 480961
62844 480961 483120 484842 485487 485183 484358 483058 481183 479102 477435 476289 475209 473947 472772 471984 471559
62829 471559 471483 471972 473058 474272 475000 475086 474967 475330 476655 478911 481648 484518 487598 491042 494676 498295
62813 498295 502133 506478 511025 515295 519596 524733 530651 536290 541147 546114 552264 559572 567463 575926
62799E75926R377J0173J0597J1079J1787J2273J2540J3371J5091J7015J8819K1447
62787G39495K5738L1001L5946M0494M5652N1879N8567O5017P1086P6921Q2709
62776A324505Q8672R4645R9686J02655J03162J01540R7870R1618Q2301P0022N5293
62765B311969L8662K0742K279j6005l3532m9751o4099p6099q5464r2105r6163
62754A860434r8017r8118r6758r4016q9879q4544p8640p3052o8233o3703n8589
62743I56885n2730m6908m1902l7680l3695k9705k5919k2697k0253j8546j7205
62732F09645j5693j3807j1803r964q227o469m813l492k513j710r63k25M54R13
62718E31333J121J551K796M709O380P346Q283J0074J2629J5227J7612K0053K2588
$$ plain form
62799 575926 585303 595476 606073 617152 628939 641212 653752 667123 682214 699229 718048 739495
62787 739495 765233 796234 832180 872674 918326 970205 1028772 1093789 1164875 1241796 1324505
62776 1324505 1413177 1507822 1607508 1710163 1813325 1914865 2012735 2104353 2186654 2256676 2311969
62765 2311969 2350631 2371373 2373652 2357647 2324115 2274364 2210265 2134166 2048702 1956597 1860434
62754 1860434 1762417 1664299 1567541 1473525 1383646 1299102 1220462 1147410 1079177 1015474 956885
62743 956885 904155 857247 815345 777665 743970 714265 688346 665649 645396 626850 609645
62732 609645 593952 580145 568342 558378 550151 543682 538869 535377 532864 531154 530191 529966 530420 531333
62718 531333 532454 534005 536801 541510 547890 555236 563519 573593 586222 601449 619061 639114 661702
62705F61702K4986K7427L0435L4033L7580M0788M4251M8641N3772N8815O3183
62694A125613O6830O9873P2230P3548P3187P0436O4996N7266M7959L7398K5406
62683A784742J1990k128j5843k8493m0102n0698n9718o6310p0195p1919p2261
62672A319065p1682p0270o7930o4495n9982n4867m9929m5580m1655l7862l4211
62661G20602l0759k7410k4242k1709k0082j8873j7307j5221j3087j1289r858q866
62649E01899q499q576q475p793o803n967n260m334l201k371k202k392k283j628
62635D32115q24l66k39j14P5N7k46n52o78q10j022r87n28j74n13j183j107J94
62617D23098K097L777N011N858O189O037O006O680P789Q535Q681Q784R281R949
$$ plain form
62705 661702 686688 714115 744550 778583 816163 856951 901202 949843 1003615 1062430 1125613
62694 1125613 1192443 1262316 1334546 1408094 1481281 1551717 1616713 1673979 1721938 1759336 1784742
62683 1784742 1796732 1794604 1778761 1750268 1710166 1659468 1599750 1533440 1463245 1391326 1319065
62672 1319065 1247383 1177113 1109183 1044688 984706 929839 879910 834330 792675 754813 720602
62661 720602 689843 662433 638191 616482 596400 577527 560220 544999 531912 520623 510765 501899
62649 501899 493400 484824 476349 468556 461753 455786 450526 446192 442991 440620 438418 436026 433743 432115
62635 432115 431291 430925 430686 430572 430647 430704 430458 429906 429228 428418 427396 426409 425881 425707 425194 424011 422904 423098
62617 423098 425195 428972 433983 439841 446030 452067 458073 464753 472542 481077 489758 498542 507823 517772
62603E17772J0511J1294J2865J5255J8051K1054K4437K8192L1934L5379L8712
62592G65456M2178M5614M8577N0720N1762N1233M8720M4300L8448L1502K3508
62581A242018J4552M930n026j4902k3917l1179l6485m0558m4103m6898m8168m7670
62569I22594m5972m3690m0970l7821l4523l1394k8436k5541k2938k0995j9537
62558E70777j7825j5445j2971j1255j0240r044p278n666m953m747m082k864j971
62545D62436j945k332k437k072j355l22P93J412J234N88j25r65j924k327j408
62530D49251O41K751M038M418M343M472N393P151R067J0597J2211J4803J8251
62517E47387K1411K3657K5626K8120L1044L3963L6987M0344M3474M5383M5748
$$ plain form
62603 517772 528283 539577 552442 567697 585748 606802 631239 659431 691365 726744 765456
62592 765456 807634 853248 901825 952545 1004307 1055540 1104260 1148560 1187008 1218510 1242018
62581 1242018 1256570 1261500 1256474 1241572 1217655 1186476 1149991 1109433 1065330 1018432 970264 922594
62569 922594 876622 832932 791962 754141 719618 688224 659788 634247 611309 590314 570777
62558 570777 552952 537507 524536 513281 503041 493997 486719 481053 476100 471353 467271 464407 462436
62545 462436 460491 458159 455722 453650 452295 451973 452766 454178 455412 456000 455875 454910 452986 450659 449251
62530 449251 449892 452643 456681 461099 465442 469914 475307 482458 491525 502122 514333 529136 547387
62517 547387 568798 592455 618081 646201 677245 711208 748195 788539 832013 877396 923144
62506I23144M4956M3158M0033L5533L0142K4183J7465R951K311m603j0486j5360
62494A140427j8979k0882k0959j9483j6722j2907q493l983O47N897J1983J8369
62482A054915K4236K9167L3210L6574L9371M1346M1619L9067L3407K5706J7560
62471A416178R877K629m620j2460k1562l1962m2342n0605n5553n7664n8209n8026
62459A035681n7202n5421n2263m7618m2147l6970l2610k8613k4463k0423j6995
62448F20956j4016j0964p966n731m489l574k194j88K064M107N616O499O977P326
62434F04423P507P225O365N058L371J255j153l579o028q665j1200j2811j3033
62421E78735j2363j1666j1245j0817j0152r314q388p402o487n843n515n389n333
$$ plain form
62506 923144 968100 1011258 1051291 1086824 1116966 1141149 1158614 1168565 1170876 1166273 1155787 1140427
62494 1140427 1121448 1100566 1079607 1060124 1043402 1030495 1022002 1018019 1018666 1024563 1036546 1054915
62482 1054915 1079151 1108318 1141528 1178102 1217473 1258819 1300438 1339505 1372912 1398618 1416178
62471 1416178 1426055 1428684 1424064 1411604 1390042 1358080 1315738 1265133 1209580 1151916 1093707 1035681
62459 1035681 978479 923058 870795 823177 781030 744060 711450 682837 658374 637951 620956
62448 620956 606940 595976 588010 582279 577790 574216 572022 571834 573898 578005 583621 590120 597097 604423
62434 604423 611930 619155 625520 630578 633949 635204 634051 630472 624444 615779 604579 591768 578735
62421 578735 566372 554706 543461 532644 522492 513178 504790 497388 490901 485058 479543 474154 468821
62408D68821n187m782m199l782l644l311k341j034q9L37O16P85N42J85O59K109
62392D45685L213K796J530J037J629K040J476P90J199K639M026M580M451M288
62378D81379M705N858P186P867P764P645Q138Q984R681J0376J1448J2658J3458
62365E97147J4055J5361J7802K0857K3930K7140L0964L5477M0223M4615M8427
62354I15998N1950N5595N9105O1292O0873N7398N1120M2368L1729K0570J0520
62343A418518K161n140j2006j8269k3577k8146l2520l6949m1176m4497m5966m5084
62331A087349m2365l8792l4753l0195k5697k2353k0250j8217j5624j3540j3252
62320H12311j4460j5866j6915j7924j8941j9554j9688j9609j9269j8419j7270
$$ plain form
62408 468821 463634 458852 454653 450871 447227 443916 441575 440541 440452 440789 441405 442190 442732 442917 443576 445685
62392 445685 448898 451694 453224 454261 455890 457930 459406 460196 461395 464034 468060 472640 477091 481379
62378 481379 486084 491942 499128 506995 514759 522404 530542 539526 549207 559583 571031 583689 597147
62365 597147 611202 626563 644365 665222 689152 716292 747256 782733 822956 867571 915998
62354 915998 967948 1023543 1082648 1143940 1204813 1262211 1313331 1355699 1387428 1407998 1418518
62343 1418518 1420679 1415539 1403533 1385264 1361687 1333541 1301021 1264072 1222896 1178399 1132433 1087349
62331 1087349 1044984 1006192 971439 941244 915547 893194 872944 854727 839103 825563 812311
62320 812311 797851 781985 765070 747146 728205 708651 688963 669354 650085 631666 614396
62309F14396j6226j5061j3258j1099r433q282o665m158j712l71P9O55J831L263
62295E33959M473N291N737N951O158O464O715O729O507O144N681N176M722M266
62281F13973L604K653J597O60n7m64m72j97J25N05J260K461L692M627N590P209
62265F46766R609J2272J4742J7114J9830K3172K7107L1434L5980M0721M5760N1098
62253I75605N6294O0527O3186O4212O3628O0832N4925M5954L5338K4655J4380
62242A519536M324n127j3169j9970k6877l4751m2819m9696n4871n8524o0386n9836
62230A097834n7002n2948m8650m4361m0111l6148l2615k9234k5647k1940j8562
62219F90616j5835j3705j1872j0134q598p510o824o133n196m333m021m221m323
$$ plain form
62309 614396 598170 583109 569851 558752 549319 541037 534372 530214 528502 528131 528210 528865 530696 533959
62295 533959 538432 543723 549460 555411 561569 568033 574748 581477 587984 594128 599809 604985 609707 613973
62281 613973 617577 620230 621827 622487 622430 621966 621494 621297 621422 621927 623187 625648 629340 633967 639557 646766
62265 646766 656375 668647 683389 700503 720333 743505 770612 802046 838026 878747 924507 975605
62253 975605 1031899 1092426 1155612 1219824 1283452 1344284 1399209 1445163 1480501 1505156 1519536
62242 1519536 1523860 1518733 1505564 1485594 1458717 1423966 1381147 1331451 1276580 1218056 1157670 1097834
62230 1097834 1040832 987884 939234 894873 854762 818614 785999 756765 731118 709178 690616
62219 690616 674781 661076 649204 639070 630472 622962 616138 610005 604809 600476 596455 592234 587911
62206E87911l819k751j582p56l10K08J265K660L604L676L392L514M182N071O085
62191F12350P269Q303Q778Q929R452J0486J1372J1580J1379J1382J1770J2207
62179G35257J2258J1733J0757R641Q541P395O304N783O269P648R689J2624J6711
62166H60610K1388K5657K9369L3325L7878M2098M4685M5082M3304L9215L2714
62155A255325K4430J5689P651P40n186j0374j4966j9078k2954k6861l0774l4298
62143A139344l6985l8585l8839l7366l4246l0395k6836k3648k0162j6206j2488
62132H23588r657p588n858m470l726l732m254m836m937m265l078j837n44J181
62118G65987L273N000N729N435M183J736j800n360p512p700o541n069l967l576
$$ plain form
62206 587911 584092 581341 579759 579003 578693 578901 580166 582826 586430 590106 593498 597012 601194 606265 612350
62191 612350 619619 627922 636700 645629 655081 665567 676939 688519 699898 711280 723050 735257
62179 735257 747515 759248 770005 779646 788187 795582 801886 807669 813938 821586 831275 843899 860610
62166 860610 881998 907655 937024 970349 1008227 1050325 1095010 1140092 1183396 1222611 1255325
62155 1255325 1279755 1295444 1303095 1303835 1298649 1288275 1273309 1254231 1231277 1204416 1173642 1139344
62143 1139344 1102359 1063774 1024935 987569 953323 922928 896092 872444 852282 836076 823588
62132 823588 813931 806343 800485 796015 792289 788557 784303 779467 774530 770265 767187 765350 764806 765987
62118 765987 769260 774260 779989 785424 789607 791343 789543 784183 776671 768971 762430 757361 753394 749818
62104G49818m193o071q997j1955j3531j2966j0792q231o019m147k483j158k02
62091F59073P09J858L122M105M486M274L861L810M291M868N153N404O091P126
62077G18231Q153R335J1120J3302J5135J6379J7429J8360J8748J8661J8957K0192
62065I04002K2000K3908K5982K8288L0398L1887L2611L2159K9749K5182J9221
62054A205387J2651N790o94n638q896j2050j6509k1650k5915k9123l2378l6025
62042A034950l9069m0601m0666l9605l7622l5174l2926l1015k9029k6902k5097
62031F57244k3669k1939j9437j6634j4366j2856j1685j0431r104q030p443p167
62019D94483o756o058n482n468n887o231o219n899n371m744m163l616k866j878
$$ plain form
62104 749818 745625 739554 730557 718602 705071 692105 681313 673082 667063 662916 660433 659275 659073
62091 659073 659782 661640 664762 668867 673353 677627 681488 685298 689589 694457 699610 705014 711105 718231
62077 718231 726384 735719 746839 760141 775276 791655 809084 827444 846192 864853 883810 904002
62065 904002 926002 949910 975892 1004180 1034578 1066465 1099076 1131235 1160984 1186166 1205387
62054 1205387 1218038 1223828 1223134 1217496 1208600 1196550 1180041 1158391 1132476 1103353 1070975 1034950
62042 1034950 995881 955280 914614 875009 837387 802213 769287 738272 709243 682341 657244
62031 657244 633575 611636 592199 575565 561199 548343 536658 526227 517123 509093 501650 494483
62019 494483 487727 481669 476187 470719 464832 458601 452382 446483 441112 436368 432205 428589 425723 423845
62005D23845r79k91N67J780K791L040K839K816K874K540K150K552L705M447L947
61990D58623K598J209N0j060k264l665n258o671p386p462p579q088q489q119o936
61975C89503n385l862k612j818j487j416j479j722k064k207j959j450q39j65M87
61960C61525R25J109J220J314J231R42P13P87J072J339J495J593J682J794J944
61945C80685K152K557L389M650N929O780P236P629Q042Q264Q181P889P424O765
61931D67572O129N913O314P136P921Q075P165N386L505J944K71j911l988m993
61917E16439m964m801m853m583l672k480j204N21K805N053O724P909Q776R151
61903E30821R106R203R587R421P879N270K589L50j506k942l778m153m444m791
$$ plain form
62005 423845 422866 422575 423142 424922 427713 430753 433592 436408 439282 441822 443972 446524 450229 454676 458623
61990 458623 461221 462430 462480 461420 459156 455491 450233 443562 436176 428714 421135 413047 404558 396439 389503
61975 389503 384118 380256 377644 375826 374339 372923 371444 369722 367658 365451 363492 362042 361203 361038 361525
61960 361525 362450 363559 364779 366093 367324 368266 368979 369766 370838 372177 373672 375265 376947 378741 380685
61945 380685 382837 385394 388783 393433 399362 406142 413378 421007 429049 437313 445494 453383 460807 467572
61931 467572 473701 479614 485928 493064 500985 509060 516225 521611 525116 527060 527331 525420 521432 516439
61917 516439 511475 506674 501821 497238 493566 491086 489882 490403 493208 498261 504985 512894 521670 530821
61903 530821 539927 549130 558717 568138 576017 581287 583876 584226 582720 579778 576000 571847 567403 562612
61889E62612n079n225n138m592l601k711k488k833l183l304l538m324n726p339
61875E03531q465q603p944p140o475n643m486l443k795k093r12K96Q21Q49J211
61860D48709K108K925L305L689M597O009P584R003R934J0313J0779J2254J4764
61847E45973J7142J8267J8188J7664J7051J6116J4647J2701J0303P376M042O93
61835G00163k319m853o824q079q510q132p004n179k808j49K567N200P542R190
61821F70805R769R279Q099O588M777K520j32k892n498p853r824j1175j1764j1763
61807F50936j1544j1325j1027j0449r606q884q794r450j0277j0490r862q874q054
61794E22300p376o526n560m928m820m812m338l438k765k837l404l682l192k234
$$ plain form
61889 562612 557533 552308 547170 542578 538977 536266 533778 530945 527762 524458 520920 516596 510870 503531
61875 503531 495066 486463 478519 471379 464904 459261 454775 451332 448537 446444 445532 445828 446649 447498 448709
61860 448709 450817 453742 457047 460736 465333 471342 478926 487929 497863 508176 518955 531209 545973
61847 545973 563115 581382 599570 617234 634285 650401 665048 677749 688052 695428 699470 700163
61835 700163 697844 692991 686167 678088 669578 661446 654442 649263 646455 646306 648873 654073 661615 670805
61821 670805 680574 689853 697952 704540 709317 711837 711705 708813 703315 695462 685638 674463 662699 650936
61807 650936 639392 628067 617040 606591 596985 588101 579307 569857 559580 549090 539228 530354 522300
61794 522300 514924 508398 502838 497910 493090 488278 483940 480502 477737 474900 471496 467814 464622 462388
61780D62388j541j509j862j980j499o56l1N8j59k85l08m72o80m78J74O17L80m
61762D52153L77J576K717L130K987K800K837L152L675M040L749K781J724J107
61748D88805P99K63q67k521m186n094m838l957l440l545l598l118k597k650k984
61733D46472k827k052j255q84q72r74r80n94L41J463K114K033J584J299J375J568
61717D47811J400O80q0j09N65R72N94K19O91J325O59j351l139l709l784m299m855
61700D33590m563l641l142l408l803l794l489l098k630k227k230k639k971k896
61686C89059k655k639k826k862k545k042j715j791k135k337k092j484p85j67K29
61671C61213J51m70j227j590j578j571j522r00M25J712K173J891J598J744K099
$$ plain form
61780 462388 460847 459338 457476 455496 453997 453341 453310 453368 453209 452924 452616 452144 451464 450986 451160 451777 452157 452153
61762 452153 452530 454106 456823 459953 462940 465740 468577 471729 475404 479444 483193 485974 487698 488805
61748 488805 489604 489867 489000 486479 482293 477199 472361 468404 464964 461419 457821 454703 452106 449456 446472
61733 446472 443645 441593 440338 439454 438582 437608 436628 436034 436375 437838 439952 441985 443569 444868 446243 447811
61717 447811 449211 449891 449811 449702 450267 451239 451833 452052 452743 454068 454727 453376 450237 446528 442744 438445 433590
61700 433590 429027 425386 422244 418836 415033 411239 407750 404652 402022 399795 397565 394926 391955 389059
61686 389059 386404 383765 380939 378077 375532 373490 371775 369984 367849 365512 363420 361936 361151 360984 361213
61671 361213 361364 360894 359667 358077 356499 354928 353406 352506 352931 354643 356816 358707 360305 362049 364148
61656C64148K190J893J608J938K951L813L533K163Q03K50K22J77J89M50N92L03
61640C87223J33P22J548J537P93N35J245K015K041J608J128L51p65j387j034o79
61624C97014j465k891l432k761k104k373l052l270l018k770k560k034j192n25
61610C63567n00j088j885k579l201l813m090l603k591j960k188k693k771k604
61596C28001k740k998k793k270k185k616k732k116j460j512j977k071j643j262
61582B97626j314j493j224l88M52O24J66j71O9L78Q0o06q45m04K22P30J258J623
61564B96783J268K36n25l13N20J249J674J905J846J475J234J521K057K185J668
61549C14783Q45K23J38O02J173J288Q78M24K89L74N57R34J362J337O99J2k18k60
$$ plain form
61656 364148 366338 368231 369839 371777 374728 378541 382074 384237 385040 385290 385512 385689 385878 386328 386920 387223
61640 387223 387356 388078 389626 391163 391956 392491 393736 395751 397792 399400 400528 400879 400114 398727 397693 397014
61624 397014 395549 392658 389226 386465 384361 381988 378936 375666 372648 369878 367318 365284 364092 363567
61610 363567 363067 361979 360094 357515 354314 350501 346411 342808 340217 338257 336069 333376 330605 328001
61596 328001 325261 322263 319470 317200 315015 312399 309667 307551 306091 304579 302602 300531 298888 297626
61582 297626 296312 294819 293595 293207 293659 294283 294449 294278 294347 294725 294805 294199 293354 292950 293172 293902 295160 296783
61564 296783 298051 298287 297762 297449 297969 299218 300892 302797 304643 306118 307352 308873 310930 313115 314783
61549 314783 315628 315851 315989 316591 317764 319052 319930 320354 320643 321017 321574 322508 323870 325207 325906 325918 325700 325440
61531C25440o17j164j341r89m82k31l66p45r94p83l00j36n06r30r34o04j92K43
61513C14369M94J26p24j095l77P42J172Q06L50J99K56M53O82M64m27j338j487
61496C14665j028n93r4R03J979K248J943K255L370L940L102J790J318J617J773
61481C39188J649J887K654L318L320K721J894J171P82P01N54j1q92j666k060k081
61465C53129j847j481j140r25q83j167j877k650k750j909p86k02k07k85k53l32
61449C34435m67k34M46J010J001O54M63N04N64O72J082J774K389K608K354J709
61433C50964R46O12J039J766J864J053K3m92m89k46L13J254K054K123J684J508
61417C65976J881K483L107L708L834K916J334K91K66M17j09r99j523j688j907
$$ plain form
61531 325440 324823 323659 322318 321329 320847 320616 320250 319505 318511 317728 317428 317292 316786 315856 314922 314318 314126 314369
61513 314369 314863 314989 314265 313170 312793 313535 314707 315513 315863 316062 316318 316771 317453 317917 317490 316152 314665
61496 314665 313637 313044 312950 313853 315832 318080 320023 322278 325648 329588 332690 334480 335798 337415 339188
61481 339188 340837 342724 345378 348696 352016 354737 356631 357802 358584 359285 359839 359828 358936 357270 355210 353129
61465 353129 351282 349801 348661 347736 346853 345686 343809 341159 338409 336500 335714 335512 335305 335020 334767 334435
61449 334435 333968 333734 334180 335190 336191 336845 337308 337812 338376 339048 340130 341904 344293 346901 349255 350964
61433 350964 351910 352522 353561 355327 357191 358244 358267 357775 357286 357040 357353 358607 360661 362784 364468 365976
61417 365976 367857 370340 373447 377155 380989 383905 385239 385530 385796 386213 386104 385105 383582 381894 379987
61402C79987k096j890j381r16m24K78P69M45l96o76J13J314K008J991J658J330
61386C82114J017O34L26M89J405K714L561L488K918K540K505K580K706K924K990
61371D14911K632K073J764J741J617J090J06j253k618l359l240k763k416j966
61357D08319j122l64k47k07Q09K672M068M313M061L970L794L193K486K018J531
61342D39294Q36L70M90P86P63P36J261K063K317J814J149P80N67L30K58N62J029
61325D55405J198Q73L09o3k5L40Q99J687K691L659M359M983N937P201Q289Q915
61309E06657R357J0078J1224J2606J3930J4930J5497J5707J5514J4507J2303R195
61297F61505O008L308J129n85j832k889m274o124q012r511j0492j0857j0545r975
$$ plain form
61402 379987 377891 376001 374620 373704 373280 373558 374327 374772 374376 373700 373813 375127 377135 379126 380784 382114
61386 382114 383131 383765 384091 384580 385985 388699 392260 395748 398666 401206 403711 406291 408997 411921 414911
61371 414911 417543 419616 421380 423121 424738 425828 425934 424681 422063 418704 415464 412701 410285 408319
61357 408319 407197 406833 406586 406379 407188 409860 413928 418241 422302 426272 430066 433259 435745 437763 439294
61342 439294 440130 440500 440990 441776 442539 443275 444536 446599 448916 450730 451879 452659 453226 453556 453814 454376 455405
61325 455405 456603 457476 457785 457722 457697 458037 458936 460623 463314 466973 471332 476315 482252 489453 497742 506657
61309 506657 516014 526092 537316 549922 563852 578782 594279 609986 625500 640007 652310 661505
61297 661505 667513 670821 671950 671365 669533 666644 662370 656246 648234 638723 628231 617374 606829 596854
61283E96854r822j0077r982r183q236p565o653n011l258k338k065j388o3R28P44
61268E22885k33r92j070p85o01n34j41R78K616L997M562M514M396M285L785K702
61252E50364J368L06j28J15O97R56M43n42j262j345j049p30m86l60m72p78j015
61235E46082j020q80n87J01J195K238K842L253L945M829N439N778O421P541Q488
61220E95665Q702Q601Q947R619R805R357R148R749J0507J0421R465Q353P382O262
61206G21983N038M295M247M270L762L042K987L965N529P032Q207R231J0433J1885
61192H05906J3094J3194J1750R363P152N565M046K017j81j786k788l940n554o922
61178H50916p356p234p419q082q780r446j0379j1362j1705j1387j1207j1472j1442
$$ plain form
61283 596854 587032 576955 566973 557790 549554 541989 535336 530325 527067 524729 522664 521276 521213 522141 522885
61268 522885 522652 521660 520590 519805 519204 518670 518529 519507 522123 526120 530682 535196 539592 543877 547662 550364
61252 550364 551732 552038 551910 552025 552722 553678 554121 553579 552317 550972 549923 549193 548707 548347 547875 547097 546082
61235 546082 545062 544182 543595 543696 544891 547129 549971 553224 557169 561998 567437 573215 579636 587177 595665
61220 595665 604367 612968 621915 631534 641339 650696 659844 669593 680100 690521 699986 708339 715721 721983
61206 721983 727021 731316 735563 739833 743595 746637 749624 753589 759118 766150 774357 783588 794021 805906
61192 805906 819000 832194 843944 853307 860459 866024 870070 872087 871906 870120 867332 863392 857838 850916
61178 850916 843560 836326 828907 820825 812045 802599 792220 780858 769153 757766 746559 735087 723645
61165G23645j0642r864j0131j1230j2063j1960j0932r189p286o233o482o971o238
61152F04424m290k478j530p92M76J989K922K745J350r28l147m330m487m526m872
61137E82526m854l777k004m14P43J949L505N010N800N801N815O740Q468J0012
61123F25320J0934J2038J4060J6331J7704J8423J9849K2381K4876K6299K6838
61112H35053K7073K7122K7031K7044K6932K5921K3934K2032K1023K0292J8719
61101A102176J6185J3419J0773P949M717J301j850m356o072p233q213r109r840
61088A109847j0535j1332j1785j1211r728q157o770m981k607m55Q30J677K809
61075A037602M240N662P035Q236Q769Q573Q423Q845R216Q684P476O436N776N036
$$ plain form
61165 723645 713003 703139 693008 681778 669715 657755 646823 637634 630348 624115 617633 610662 604424
61152 604424 600134 597656 596126 595334 595810 597799 600721 603466 604816 603888 600741 596411 591924 587398 582526
61137 582526 577672 573895 571891 571477 572220 574169 577674 582684 588484 594285 600100 606840 615308 625320
61123 625320 636254 648292 662352 678683 696387 714810 734659 757040 781916 808215 835053
61112 835053 862126 889248 916279 943323 970255 996176 1020110 1042142 1063165 1083457 1102176
61101 1102176 1118361 1131780 1142553 1150502 1155219 1156520 1154670 1150314 1144242 1137009 1128796 1119687 1109847
61088 1109847 1099312 1087980 1076195 1064984 1055256 1047099 1040329 1035348 1032741 1032286 1033116 1034793 1037602
61075 1037602 1041842 1047504 1054539 1062775 1071544 1080117 1088540 1097385 1106601 1115285 1122761 1129197 1134973 1140009
61061A140009M037L033K154J311N15j80q83j541j759j394j000j198j782j919j068
61046A138335N98K477M025N159O273P641Q978J0007J1181J2987J4919J6221J7494
61033A256295K0073K3790K7034K9317L1947L5434L8157L8773L8268L8264L8930
61022A616282M0117M3025M8779N6479O4542P2994Q2644R3005J03194J14220J28459
61011B463740J47511J72463K05334K48016L00592L63222M39164N33630O50879
61002E524551P95925R77995J206401J479105J774153K046765K226414K221370
60994A8252679J952621J415999P23884P2539l55918m81607l41376m2899K80439
60985B1476361M86511M45296R3081n12582j201928j778862k119023k206124k098511
$$ plain form
61061 1140009 1144046 1147079 1149233 1150544 1151059 1150879 1149996 1148455 1146696 1145302 1144302 1143104 1141322 1139403 1138335
61046 1138335 1138933 1141410 1145435 1150594 1156867 1164508 1173486 1183493 1194674 1207661 1222580 1238801 1256295
61033 1256295 1276368 1300158 1327192 1356509 1388456 1423890 1462047 1500820 1539088 1577352 1616282
61022 1616282 1656399 1699424 1748203 1804682 1869224 1942218 2024862 2117867 2221061 2335281 2463740
61011 2463740 2611251 2783714 2989048 3237064 3537656 3900878 4340042 4873672 5524551
61002 5524551 6320476 7298471 8504872 9983977 11758130 13804895 16031309 18252679
60994 18252679 20205300 21621299 22345183 22417722 22061804 21580197 21238821 21195922 21476361
60985 21476361 21962872 22408168 22501249 21988667 20786739 19007877 16888854 14682730 12584219
60976A2584219j875587j606201j339637j103554r05673p42489o09072n01591m14927
60967C485488l43307k83831k36681k01504j75476j55099j38175j23725j11285
60958A716405j00603r1227q2207p2838o3431n4742m7025m0435l5697l3290l2319
60947A062591l1322l0015k9178k8951k8353k6586k3906k1025j8410j6408j5353
60936G93084j5194j5395j5359j4863j4137j3685j3761j3815j2913j1039r463r205
60924F34255r723r738q971q161p675p136o379n835n696n437m562l366k565k481
60910E46530k798k992k826k455k106j702j022k30P1m63j436k186k441k341k043
60895E19560j689j518j754k430l397m334m739m365l706l551l960m293m390m880
$$ plain form
60976 12584219 10708632 9102431 7762794 6659240 5753567 5011078 4402006 3900415 3485488
60967 3485488 3142181 2858350 2621669 2420165 2244689 2089590 1951415 1827690 1716405
60958 1716405 1615802 1524575 1442368 1369530 1306099 1251357 1204332 1163897 1128200 1094910 1062591
60947 1062591 1031269 1001254 972076 943125 914772 888186 864280 843255 824845 808437 793084
60936 793084 777890 762495 747136 732273 718136 704451 690690 676875 663962 652923 643460 634255
60924 634255 624532 614794 605823 597662 589987 582851 576472 570637 564941 559504 554942 551576 549011 546530
60910 546530 543732 540740 537914 535459 533353 531651 530629 530399 530470 530007 528571 526385 523944 521603 519560
60895 519560 517871 516353 514599 512169 508772 504438 499699 495334 491628 488077 484117 479824 475434 470554
60881D70554n935o555n871m488l706l909m469m809m716l951k507j105n46o35m79
60866D16873K74J207K023K790L429L814M389N713P189P272N390K889J517J587
60852D66356K135K361K200J799J180M79O9K45Q33J227Q17m29j823k620k808l061
60836D68960l810m785n543o069o543o849o714o202n697n356m950m270l460k808
60822C95904k404k173k086k223k602l122l583l692l208k344j839k251l170l571
60808C57636l086k463k489k923k949k329j523q99m59k87n28q81o69K67J221J431
60792C39070R09L04K20P37J345J353O91K24P95K031K758K578K277K365K174R75
60776C60806o89j584j380q93q83j220j307r15l54o1p3M5O70J514J807J106k94
$$ plain form
60881 470554 464619 458064 452193 447705 443999 440090 435621 430812 426096 422145 419638 418533 417987 417352 416873
60866 416873 417147 418354 420377 423167 426596 430410 434799 440512 447701 454973 460363 463252 464769 466356
60852 466356 468491 470852 473052 474851 476031 476510 476579 476824 477657 478884 479701 479272 477449 474829 472021 468960
60836 468960 465150 460365 454822 448753 442210 435361 428647 422445 416748 411392 406442 402172 398712 395904
60822 395904 393500 391327 389241 387018 384416 381294 377711 374019 370811 368467 366628 364377 361207 357636
60808 357636 354550 352087 349598 346675 343726 341397 339874 338975 338516 338229 337701 336820 336151 336418 337639 339070
60792 339070 339979 340283 340503 341240 342585 343938 344629 344853 345648 347679 350437 353015 355292 357657 359831 360806
60776 360806 360117 358533 357153 356260 355377 354157 352850 351935 351581 351520 351447 351492 352162 353676 355483 356589 356295
60759C56295j753k780l101k667j762q29j14L11L08o3k19L85J361J792J620J763
60743C50547K601L240K753J357k13j735l241m336m617m355m034l599k837k060
60729C29471j692j475q39P3N31K84r6k0N23J152J562J709J751J768J574J036N95
60712C37907Q79J677K019J522R51R17R71O50N82J463K532K335P26r85j831k026
60696C50289k015j716j071n19m69p70r97q91n04r5K9p5L3N38R39P88M72O90J388
60677C46044J872J846J695J828K269K839L195K897J977J181J018Q50k62k039l255
60662C63955l450l328l374l090j982n12M38N13J9m85m32M53J855L150M010M408
60646C62148M227L402K382J739J370O91l55j211j699k308l238l890l724l048k570
$$ plain form
60759 356295 354542 351762 348661 345994 344232 343403 343289 343600 343908 343845 343626 344011 345372 347164 348784 350547
60743 350547 353148 356388 359141 360498 360285 358550 355309 350973 346356 342001 337967 334368 331531 329471
60729 329471 327779 326304 325465 325538 326069 326353 326257 326237 326760 327912 329474 331183 332934 334702 336276 337312 337907
60712 337907 338786 340463 342482 344004 344955 345872 346843 347493 348075 349538 352070 354405 355131 354146 352315 350289
60696 350289 348274 346558 345487 344968 344499 343729 342732 341841 341337 341242 341271 341196 341229 341767 342706 343494 343966 344656 346044
60677 346044 347916 349762 351457 353285 355554 358393 361588 364485 366462 367643 368661 369511 369249 367210 363955
60662 363955 360505 357177 353803 350713 348731 348219 348657 349170 349189 348704 348272 348725 350580 353730 357740 362148
60646 362148 366375 369777 372159 373898 375268 375959 375604 374393 372694 370386 367148 363258 359534 356486 353916
60631C53916k551k631k211r21R59K467K857K416J931J478N77n88j081n88O5J68
60615C56263P1L22P06P57N69M43K47k01n46l96J6K43M24R62J650J802J164J99
60597C64695n28p62m78J34O34P64Q65J465K444L035K734J843R80M16Q6r7k00m10
60579C77620q55j276j191m71M43J177K005L445N246O464O682O705P528R010J0182
60564D32714J0607J0709J0793J0442R169P125M785K261o15l694o261p463p041
60551D73531n629m223l234k266r71K25P93J116K128L897N373N797N863O954R554
60536D98908J2838J5655J7582J8915J9925K0349J9702J7942J5424J2231P997K771
60524F80239k460o653r706j2012j3372j3208j1779j0212r141q128o706n224m229
$$ plain form
60631 353916 351365 348734 346523 345602 346561 349028 351885 354301 356232 357710 358287 357699 356618 356030 356095 356263
60615 356263 356334 356656 357362 358119 358688 359131 359378 359177 358631 358235 358251 358494 358918 359880 361530 363332 364496 364695
60597 364695 364167 363405 362927 363061 363695 364459 365324 366789 369233 372268 375002 376845 377825 378241 378327 378230 378030 377620
60579 377620 376765 375489 374298 373827 374270 375447 377452 380897 386143 392607 399289 405994 413522 422532 432714
60564 432714 443321 454030 464823 475265 484434 491559 496344 498605 497990 494296 488035 480572 473531
60551 473531 467902 463679 460445 458179 457208 457433 458226 459342 461470 465367 470740 476537 482400 489354 498908
60536 498908 511746 527401 544983 563898 583823 604172 623874 641816 657240 669471 677468 680239
60524 680239 677779 671126 661420 649408 636036 622828 611049 600837 591696 583568 576862 571638 567409
60511E67409l605k907k098j358m26J222L575N935P744R344J1655J5083J8939K2262
60497F52774K5027K8126L1969L5710L8218L9327L9437L8395L5650L1387K6592
60486A022612K1978J7592J3552J0240P494M329j50o061j3130k1068k9230l6549
60474I91609m2265m6308m8682m8989m6986m3186l8547l3815k9421k5593k2300
60463E65517j9359j6848j5031j3755j2364j0479q487o990o136n738n627n575n250
60450D33878m577l905l517l246k838k354k037j925j862j714j512j450j683j950
60436C99308j657p00Q5j21r28j208o67l5K16M16P40P01P9n26n73l06r7K26Q63
60417C95816J489J758J865K039K022J579J061Q40O98L34J06N86J674K685L128
$$ plain form
60511 567409 563804 560897 558799 557441 557015 558237 561812 567747 575491 584835 596490 611573 630512 652774
60497 652774 677801 705927 737896 773606 811824 851151 890588 928983 964633 996020 1022612
60486 1022612 1044590 1062182 1075734 1085974 1093468 1097797 1097647 1091586 1078456 1057388 1028158 991609
60474 991609 949344 903036 854354 805365 758379 715193 676646 642831 613410 587817 565517
60463 565517 546158 529310 514279 500524 488160 477681 469194 462204 456068 450330 444703 439128 433878
60450 433878 429301 425396 421879 418633 415795 413441 411404 409479 407617 405903 404391 402941 401258 399308
60436 399308 397651 396951 397036 396915 395987 394779 394112 394077 394293 394709 395449 396150 396229 395703 395130 394824 394727 394953 395816
60417 395816 397305 399063 400928 402967 404989 406568 407629 408469 409167 409501 409607 410193 411867 414552 417680
60402D17680K946K276J433R45J121J761K469K963L015K561K137K561L822M835
60388D52525M783M071L512L155K631K069J863J888J716J388J290J467J682K006
60374D86046K628L275L453L252L296L844M383M242L324K172J461J410J642J713
60360E26141J736K112K725L057L181L897N532P333Q455Q944R226R309R038Q511
60346F09197P615N823L126M84j412l142n398p488q119p208n803m556l498k956
60332E76665l372m143m039k944k094k296l028l658m419n551o430o297n256l946
60318E19192k703j605p57j9J199L209N487P325Q748J0177J1455J1941J1571J1098
60304E96318J1030J0889J0003Q658P806P578O805M368N80l301o668j0003j3653
$$ plain form
60402 417680 420626 422902 424335 425280 426401 428162 430631 433594 436609 439170 441307 443868 447690 452525
60388 452525 457308 461379 464891 468046 470677 472746 474609 476497 478213 479601 480891 482358 484040 486046
60374 486046 488674 491949 495402 498654 501950 505794 510177 514419 517743 519915 521376 522786 524428 526141
60360 526141 527877 529989 532714 535771 538952 542849 548381 555714 564169 573113 582339 591648 600686 609197
60346 609197 616812 622635 625761 626245 624833 621691 616293 608805 600686 593478 587675 583119 579621 576665
60332 576665 573293 569150 565111 562167 560073 557777 554749 551091 546672 541121 534691 528394 523138 519192
60318 519192 516489 514884 514127 514108 515307 518516 524003 531328 540076 550253 561708 573649 585220 596318
60304 596318 607348 618237 628240 636898 644704 652282 659087 663455 664035 660734 654066 644063 630410
60291F30410j6907j8588j8182j6058j3037j0052p855o572n691m720l645k685j952
60278E04466j557j636j999k133j891j739k016k429k580k568k603k551k297k144
60264D74323k327k570k650k871l453l886l634k957k378j780q42NP4l36j91Q47
60248D45374K095K898L240L255K987K653K486K222J442M66J26M60M64n79k058
60233D67531k739k096o57O60J335J547J779K099K082J640J438J941K608K679K489
60218D84336K948L965M465M087L773M352N452O315O925P670Q423Q625Q067P122
60204E66525O344O076O353O903P375P598P509O995O077N168M678M404L691K289
60190F47985N78j033k498l846m894n460n524n217m856m900n495o124o148n623
$$ plain form
60291 630410 613503 594915 576733 560675 547638 537586 529731 523159 517468 512748 509103 506418 504466
60278 504466 502909 501273 499274 497141 495250 493511 491495 489066 486486 483918 481315 478764 476467 474323
60264 474323 471996 469426 466776 463905 460452 456566 452932 449975 447597 445817 444975 444980 445054 444718 444527 445374
60248 445374 447469 450367 453607 456862 459849 462502 464988 467210 468652 469118 469244 469704 470168 469589 467531
60233 467531 464792 462696 462039 462699 464034 465581 467360 469459 471541 473181 474619 476560 479168 481847 484336
60218 484336 487284 491249 495714 499801 503574 507926 513378 519693 526618 534288 542711 551336 559403 566525
60204 566525 572869 578945 585298 592201 599576 607174 614683 621678 627755 632923 637601 642005 645696 647985
60190 647985 648563 647530 645032 641186 636292 630832 625308 620091 615235 610335 604840 598716 592568 586945
60176E86945n145m918m558l859l216l096l402l541k974j710m90k41j083k074k344
60161E44294k085j999k149k094j801j622j436q12P2N57O77J187K177K604J723
60146E39293K28o13m09K75Q51J186J453J885K550L157L310L081K991L308L730
60131E66276L948M054M194M205L862L273K760K497K335J972J339R64J571L029
60117F06279M087L790K843K758L780M654M460L664L038K522J742R48O66Q25Q03
60102F46859J84r56k249l268l726l738l640l584l455l249l072k816k285j758j842
60087F07405k567l190l160k813k755l007l129k904k525k300k437k938l547l937
60073E66196m090m284m649m978n020m768m371l979l725l660l753m025m522m994
$$ plain form
60176 586945 581800 576882 572324 568465 565249 562153 558751 555210 552236 550526 550036 549795 548712 546638 544294
60161 544294 542209 540210 538061 535967 534166 532544 531108 530296 530368 530925 531602 532789 534966 537570 539293
60146 539293 539521 538908 538499 538774 539625 540811 542264 544149 546699 549856 553166 556247 559238 562546 566276
60131 566276 570224 574278 578472 582677 586539 589812 592572 595069 597404 599376 600715 601679 603250 606279
60117 606279 610366 614156 616999 619757 623537 628191 632651 636315 639353 641875 643617 644565 645231 646056 646859
60102 646859 647043 646087 643838 640570 636844 633106 629466 625882 622427 619178 616106 613290 611005 609247 607405
60087 607405 604838 601648 598488 595675 592920 589913 586784 583880 581355 579055 576618 573680 570133 566196
60073 566196 562106 557822 553173 548195 543175 538407 534036 530057 526332 522672 518919 514894 510372 505378
60059E05378m903m107l177k678k460k144j805j556r03N86K241K883K427J983K367
60044D94132L333M287M907M988M503M000M106M581M566L845L046K531K004J311
60030E46140P41L40k25r85j639k320l494n011o212p067q117r211r422q564p572
60015D77382p002o378n476m953n078n003m068k791j821j035l50l50j188j950k005
60000D27934j989k418k489j432j16J31m17m29L87J206J765K683M027M898M660
59985D38401L774L117L073L313L081J881K85m25J07N53m53k447l797l808l186
59970D43469k698k401k161j984j705j078k54L59P07J042J351J367J068O80L31
59955D38093J02K18P14J149J049N29O9l4K66Q41J228R75N27R93K458L364K384
$$ plain form
60059 505378 500475 496368 493191 490513 488053 485909 484104 482548 481645 482231 484472 487355 489782 491765 494132
60044 494132 497465 501752 506659 511647 516150 520150 524256 528837 533403 537248 540294 542825 544829 546140
60030 546140 546881 547221 546996 546011 544372 542052 538558 533547 527335 520268 512151 502940 493518 484954 477382
60015 477382 470380 464002 458526 453573 448495 443492 439424 436633 434812 433777 433427 433077 431889 429939 427934
60000 427934 425945 423527 421038 419606 419490 419621 419204 418775 419162 420368 422133 424816 428843 433741 438401
59985 438401 442175 445292 448365 451678 454759 456640 456925 456500 456607 457160 456707 454260 450463 446655 443469
59970 443469 440771 438370 436209 434225 432520 431442 431188 431547 432254 433296 434647 436014 437082 437762 438093
59955 438093 438195 438413 439127 440276 441325 441854 441923 441889 442155 442996 444224 445199 445726 446719 449177 452541 454925
59938D54925K21j431k070k288k141j059O90J874J955J778K300L457M589N252N319
59923D73371M849M145L442K476Q46j190k780l423l267k565j421j43P39J053J178
59908D77310J510K037K423K302J532N03j0L53J040J258R58O76O78P71Q98J304
59892D95543K119L085L724L687L126K884L777N430O400N894M756M223M360M499
59878E53507M580N022N617N681N166M667M350L664K302O44q08j826k254k022j420
59863E86870r32p27o77o89o19j81O22J238J290J213J630K492L472M735O542Q447
59847F14726R690J0017R405P419L906n2k938m343m830m554l246j327J07M95m0
59832F34435j559m122o780q056p635o499n262l632j757o90r63j805k398k912l642
$$ plain form
59938 454925 455146 453715 451645 449357 447216 446157 446847 448721 450676 452454 454754 458211 462800 468052 473371
59923 473371 478220 482365 485807 488283 489129 487939 485159 481736 478469 475904 474483 474340 475079 476132 477310
59908 477310 478820 480857 483280 485582 487114 487617 487607 487960 489000 490258 491216 491892 492570 493341 494239 495543
59892 495543 497662 500747 504471 508158 511284 514168 517945 523375 529775 535669 540425 544648 549008 553507
59878 553507 558087 563109 568726 574407 579573 584240 588590 592254 594556 595200 594392 592566 590312 588290 586870
59863 586870 585938 585211 584534 583845 583226 583045 583667 584905 586195 587408 589038 591530 595002 599737 606279 614726
59847 614726 624416 634433 643838 651257 655163 655111 652173 647830 643000 638446 635200 633873 633980 634475 634435
59832 634435 632876 628754 621974 613918 606283 599784 594522 590890 589133 588443 587480 585675 583277 580365 576723
59817E76723m069l585k486j497q05j43N71J156J425J215M96l42p77q73j190j921
59801E63898k637l000l024k685j997j573k197l636m681m672m131l664l185k661
59787E20155k569k951k929j934p24l76q02j136j108j201j644k044j969j348l34
59772D97086P90J669K156K473K832L101L088K926K929L236L798M536N289N791
59758E41700N867N615N321N321N797O500O838O596O309O502O811O494N657N082
59744F26410M961M633L776K950K571K196J306K22l74l55j17J8K2nJ13M55P31N70
59726F50083J55J05N94J095J240J331J724K137K049J362L95n11j093j233j154
59711F58279j227j358r69K11J606K366K259J812J782K513L615M266M063L464L114
$$ plain form
59817 576723 572654 569069 566583 565086 564281 564138 564709 565865 567290 568505 569001 568659 567882 567009 565819 563898
59801 563898 561261 558261 555237 552552 550555 548982 546785 543149 538468 533796 529665 526001 522816 520155
59787 520155 517586 514635 511706 509772 509048 508672 507870 506734 505626 504425 502781 500737 498768 497420 497086
59772 497086 497876 499545 501701 504174 507006 510107 513195 516121 519050 522286 526084 530620 535909 541700
59758 541700 547567 553182 558503 563824 569621 576121 582959 589555 595864 602366 609177 615671 621328 626410
59744 626410 631371 636004 639780 642730 645301 647497 648803 649025 648651 648296 648179 648197 648219 648214 648327 648782 649513 650083
59726 650083 650238 650343 650937 652032 653272 654603 656327 658464 660513 661875 662270 661759 660666 659433 658279
59711 658279 657052 655694 654725 654936 656542 658908 661167 662979 664761 667274 670889 675155 679218 682682 685796
59696F85796L017K832K682K919L355L435L086K551J520n23l039m557m462l692
59682F94920l312l293l166l056l371m117n031n940o599o735o557o670p143p313
59668F22617o777n857m829l557k279j739j921j672l06J228J759J666K065K880
59654F03278L049K402K040K665L657M098L919L560L145K429J219m68k433m226
59640F28334n336n759o208p301q543q629p073n117m393m852m881l653k318k236
59626E52035k990l159k474j927k045k379k667l227l988m294m072m091m666n031
59612E05025m556l688l062k507j535k49Q49J557J950K043J823J374Q04L52M22
59597E00602J080J631J476J118J471K360K808K659K588K531J655J29o61k74K2
$$ plain form
59696 685796 688813 691645 694327 697246 700601 704036 707122 709673 711193 710670 707631 703074 698612 694920
59682 694920 691608 688315 685149 682093 678722 674605 669574 663634 657035 650300 643743 637073 629930 622617
59668 622617 615840 609983 605154 601597 599318 597579 595658 593986 593680 594908 596667 598333 600398 603278
59654 603278 606327 608729 610769 613434 617091 621189 625108 628668 631813 634242 635461 634993 632560 628334
59640 628334 622998 617239 611031 603730 595187 586558 579485 574368 569975 565123 560242 556589 554271 552035
59626 552035 549045 545886 543412 541485 539440 537061 534394 531167 527179 522885 518813 514722 510056 505025
59612 505025 500469 496781 493719 491212 489677 489428 490277 491834 493784 495827 497650 499024 499828 500180 500602
59597 500602 501682 503313 504789 505907 507378 509738 512546 515205 517793 520324 521979 522108 521447 521173 521195
59582E21195o70j555j732j707k169k619k411k043k117k120j471q55j105j679j590
59567D95352j123j175j549j414r29q85j111p16K30O90K90k57l88k31K7L76O28
59550D87815O89J011J933K796K750K161K197L162M343N339O534Q236J0391J3133
59536E52490J6605K0098K2116K1408J7351R894K29q700j3821j4439j2358r482
59524F01391o382l214o67P02J200J366J161L11j015k312l307m083m844n633o233
59509E68441o329n994n742n833n872n476m980m880m928m552l894l610l669l285
59495D99397k098p55l1O7J09N30J281J918K010J668J475J763K183K323K338K582
59479E16760L071L715M660N793O432O204N758N830N992N219L501J901J115Q56
$$ plain form
59582 521195 520525 518970 517238 515531 513362 510743 508332 506289 504172 502052 500581 499726 498621 496942 495352
59567 495352 494229 493054 491505 490091 489162 488277 487166 486450 486680 487370 487660 487403 487015 486784 486811 487187 487815
59550 487815 488504 489515 491448 494244 496994 499155 501352 504514 508857 514196 520730 528966 539357 552490
59536 552490 569095 589193 611309 632717 650068 659962 660191 651491 637670 623231 610873 601391
59524 601391 595009 591795 591128 591830 593030 594396 595557 595868 594853 592541 589234 585151 580307 574674 568441
59509 568441 562112 556118 550376 544543 538671 533195 528215 523335 518407 513855 509961 506351 502682 499397
59495 499397 497299 496544 496513 496580 496689 497219 498500 500418 502428 504096 505571 507334 509517 511840 514178 516760
59479 516760 519831 523546 528206 533999 540431 546635 552393 558223 564215 569434 572935 574836 575951 576807
59465E76807O61M60K66j1k51j44L65J065J855K717L486M139M993O159P085P204
59449F16856O814O590O511N986M888L703K721J716L60j434l495n288o143o019
59435F33766n650n459m904l502j876r83q14p40n64l26L93J877L425M265M970O829
59419F30707R923J3049J5406J7355J9588K2465K6082L0024L3191L4590L3870L0312
59407I16562K2350R741m289j4950j9949k0334j7662j2376n011K978J0179J5326
59395H82565J6194J0478j108j4132k3960k9052l0276k8589k4727k0011j5872j2845
59383G08665j0725r253q058o606m868l432k562j775q62l50n05o74l25J05J00j7
59367F58858K52P17J059J504K212K693K694L001M333O029O879O877P110Q074R187
$$ plain form
59465 576807 577468 577928 578194 578183 577932 577788 578153 579218 581073 583790 587276 591415 596408 602567 609652 616856
59449 616856 623670 630260 636771 642757 647645 651348 654069 655785 656145 654711 651216 645928 639785 633766
59435 633766 628116 622657 617753 614251 612375 611392 610578 609838 609274 608948 609341 611218 614643 618908 623878 630707
59419 630707 640630 653679 669085 686440 706028 728493 754575 784599 817790 852380 886250 916562
59407 916562 938912 948653 944364 929414 909465 889131 871469 859093 854082 857060 867239 882565
59395 882565 898759 909237 908129 893997 870037 840985 810709 782120 757393 737382 721510 708665
59383 708665 697940 688687 680629 674023 669155 665723 663161 661386 660524 660174 659669 658995 658670 658775 658875 658858
59367 658858 659110 659827 660886 662390 664602 667295 669989 672990 677323 683352 690231 697108 704218 712292 721479
59352G21479R929J0522J1208J1662J1657J1736J2618J4058J4890J4407J3319J2776
59340H70261J2664J1635R000N805L389J565q20m057p300r911j2005j3703j4876
59327H51647j5662j6320j6521j5765j4503j3813j3908j3987j3669j3326j2843
59316F91330j1436r198p513p189p347o943o254n931n507m087j880J12J590L254
59302F23001N691Q751J1836J4214J5049J3662R839L928l079r619j4253j6577j7072
59289F45371j6093j3636j0180o848m424k811j663q89k60O75J908K962L773M852
59275F02737O299P578Q612J0069J2072J3638J4085J4065J4423J4871J4654J3727
59263G46830J2387J0423P664M833K828J452j59k120l662m352m577m817n040m988
$$ plain form
59352 721479 731408 741930 753138 764800 776457 788193 800811 814869 829759 844166 857485 870261
59340 870261 882925 894560 903560 909365 912754 914319 913499 909442 902142 892231 880226 866523 851647
59327 851647 835985 819665 803144 787379 772876 759063 745155 731168 717499 704173 691330
59316 691330 679894 670696 663183 655994 648647 641704 635450 629519 624012 619925 618045 618157 619747 623001
59302 623001 628692 637443 649279 663493 678542 692204 702043 705971 702892 693273 679020 662443 645371
59289 645371 629278 615642 605462 598614 594190 591379 589716 588827 588567 589242 591150 594112 597885 602737
59275 602737 609036 616614 625226 635295 647367 661005 675090 689155 703578 718449 733103 746830
59263 746830 759217 769640 777304 782137 784965 786417 786258 784138 780476 776124 771547 766730 761690 756702
59249G56702m613m062l487k907k207j320m26K20O03Q38Q81P15O56R26J055L99
59233G43973q74k056k989m051n148n753o004o661p814q696r014r300r637r307
59219F56669q129o942o270n629m782m332m409m029k677j331r11q35k79K59p9p72
59203F05522o31L87J378K044K779L496L617L142K710K526K148J322M44Q3M25J128
59187F32520J494J142O08P33J356J370L16r97j868k606l450l711k897j759j234
59172F21017j110o65Q1O58J070J478J619J349J188J560K093K333K363K048P27
59157F37809j479l195l645l888n005o306o729o843p631q329p508n704m830n270
59143E61447n579n027m410m141l461k105j122j388k494l645m521m821m053k384
$$ plain form
59249 756702 752089 748027 744540 741633 739426 738106 737680 737900 738503 739341 740222 740937 741593 742519 743574 743973
59233 743973 743099 741043 738054 734003 728855 723102 717098 710437 702623 693927 684913 675613 665976 656669
59219 656669 648540 641598 635328 629699 624917 620585 616176 612147 609470 608139 607228 606393 606114 606373 606294 605522
59203 605522 604891 605278 606656 608700 611479 614975 618592 621734 624444 626970 629118 630440 630884 630967 631392 632520
59187 632520 634014 635156 635764 636497 637853 639223 639539 638542 636674 634068 630618 626907 624010 622251 621017
59172 621017 619907 619242 619323 619981 621051 622529 624148 625497 626685 628245 630338 632671 635034 637082 637809
59157 637809 636330 633135 629490 625602 620597 614291 607562 600719 593088 584759 577251 571547 566717 561447
59143 561447 555868 550841 546431 542290 538829 536724 535602 534214 531720 528075 523554 518733 514680 512296
59129E12296q33j50m2K06J017K442M079N039M805M126M275N480O890Q000R092
59114E66722J0243J0929J0912J0631J0453J0258R875R282Q299O782N193M243L966
59101F77788L765L313K643J519l36k416l717l978l824l658l292k750k475k505
59087F60077k309j695j197j238j563j775j891k143k674l539m581n291n297m874
59073F20010m533m259l716l043k733k862l098l386l963m729n210n115m478l422
59059E65463k353j936k305k597k067j192q71r91p95l18k62n88n07J86Q21J007
59043E50695J045J038O53j12p99j238j595j604p47O47J481J275O95N07P87J334
59027E54062K034K691L215M124N990Q361J0042J0616J0806J1210J1473J0980R623
$$ plain form
59129 512296 511463 511313 511271 511477 512494 514936 519015 524054 528859 532985 537260 542740 549630 557630 566722
59114 566722 576965 587894 598806 609437 619890 630148 640023 649305 657604 664386 669579 673822 677788
59101 677788 681553 684866 687509 689028 688692 686276 682559 678581 674757 671099 667807 665057 662582 660077
59087 660077 657768 656073 654876 653638 652075 650300 648409 646266 643592 640053 635472 630181 624884 620010
59073 620010 615477 611218 607502 604459 601726 598864 595766 592380 588417 583688 578478 573363 568885 565463
59059 565463 563110 561174 558869 556272 554205 553013 552142 551151 550356 550038 549776 549188 548681 548867 549688 550695
59043 550695 551740 552778 553431 553319 552520 551282 549687 548083 547336 547983 549464 550739 551434 551941 552728 554062
59027 554062 556096 558787 562002 566126 572116 580477 590519 601135 611941 623151 634624 645604 655227
59014F55227P639N371L296J698K54j446l028l743l629l369k990j829Q2J633K077
58999F57243K010K453L607M876N560N293M227L022K246J810J340Q65O04L24l19
58984F95161j035j265j123j103j079m56P57K018L244M791O537P971R121J0402
58970G33941J1666J2477J3216J4619J6259J6766J5729J4110J2627J1048R422Q526
58958H90406Q410P725N316J669j922m856p298r422j1284j3000j4608j6033j7226
58945H17877j8004j7854j6532j4663j3002j1328r056o722n613n818n924m917l299
58932F85145j981j147o46n14o24n88l26j36j09j24l41q72j180p93l44o57j166
58915F73597o77M40O73m0n5J267K611L121L802N412O842P005O923Q360J1227J3854
$$ plain form
59014 655227 662866 668237 671533 673231 673485 672039 669011 665268 661639 658270 655280 653451 653533 655166 657243
58999 657243 659253 661706 665313 670189 675749 681042 685269 688291 690537 692347 693687 694552 695156 695480 695161
58984 695161 694126 692861 691738 690635 689556 689100 689857 691875 695119 699910 706447 714418 723539 733941
58970 733941 745607 758084 771300 785919 802178 818944 834673 848783 861410 872458 881880 890406
58958 890406 898816 906541 911857 913526 911604 906748 899450 890028 878744 865744 851136 835103 817877
58945 817877 799873 782019 765487 750824 737822 726494 717438 710716 705103 699285 693361 688444 685145
58932 685145 683164 682017 681371 680857 680233 679645 679319 679183 679074 678950 678609 677737 676557 675764 675420 674763 673597
58915 673597 672920 673360 674033 673993 673938 675205 677816 680937 684739 690151 696993 703998 710921 719281 730508 744362
58899G44362J5186J5484J5303J4843J4066J2807J1077R594R343J0221J1000J1159
58887H94445J1765J3860J6761J8832J9167J7906J5534J2637R773O948L701Q6l052
58874A038363n203o856q588j0260j1503j2222j2240j1262r650q327p565o715n579
58861I22393m998n535o616p522q293r074r576r766j0223j1112j1776j1895j2034
58848H03973j2392j2162j0901r494q846q573p926p167p012p432p893q230q478
58835F87467q378p770p022o521o219o005n864n373l948j861p8J144K403L660M029
58820F39664L568L721N179O740P139O684O098N199L888L123L488L966L405K293
58806G04155J700J426N87p67k033l362n218p105p972p649o882o352o390p085p952
$$ plain form
58899 744362 759548 775032 790335 805178 819244 832051 843128 852722 862065 872286 883286 894445
58887 894445 906210 920070 936831 955663 974830 992736 1008270 1020907 1030680 1037628 1041329 1041415 1038363
58874 1038363 1033160 1026304 1017716 1007456 995953 983731 971491 960229 950579 942252 934687 927972 922393
58861 922393 917395 911860 905244 897722 889429 880355 870779 861013 850790 839678 827902 816007 803973
58848 803973 791581 779419 768518 759024 750178 741605 733679 726512 719500 712068 704175 695945 687467
58835 687467 679089 671319 664297 657776 651557 645552 639688 634315 630367 628506 628428 629572 631975 635635 639664
58820 639664 643232 646953 652132 658872 666011 672695 678793 683992 687880 691003 694491 698457 701862 704155
58806 704155 705855 707281 707868 707101 705068 701706 696488 689383 681411 673762 666880 660528 654138 647053 639101
58791F39101q126p521p065p115o761n390l815k859j974l84J492K887L940M897
58777F01307N165M424L641L598L479K273N11q59k265m470o708p662p591p656p726
58762E79461o802n097l896l557l385l207l357l305k098j63R51P73L68N24Q73J067
58746E49150J437K171K877L266L453L523L551L975N059O204O624O518O673P154
58732F11635P332P005O564O152N573M904M448M177L832L353K714J814J022J133
58718F71658K240L354L829M229N048N720N844O162P061P282N655L125J324Q6j921
58703G30696m726p159q923j0755j2768j4326j5365j6310j6851j6290j4878j3405
58691E78940j1865r915q195p530p249o084m391l634l864l695k771k311k930l702
$$ plain form
58791 639101 630975 623454 616389 609274 602513 597123 593308 590449 588475 588091 589583 592470 596410 601307
58777 601307 606472 610896 614537 618135 621614 623887 624398 623539 621274 616804 610096 602434 594843 587187 579461
58762 579461 572659 567562 563666 560109 556724 553517 550160 546855 544757 544594 545545 546318 546686 547210 548083 549150
58746 549150 550587 552758 555635 558901 562354 565877 569428 573403 578462 584666 591290 597808 604481 611635
58732 611635 618967 625972 632536 638688 644261 649165 653613 657790 661622 664975 667689 669503 670525 671658
58718 671658 673898 677252 681081 685310 690358 696078 701922 708084 715145 722427 728082 731207 732531 732617 730696
58703 730696 725970 718811 709888 699133 686365 672039 656674 640364 623513 607223 592345 578940
58691 578940 567075 557160 548965 541435 534186 528102 523711 520077 516213 512518 509747 507436 504506 500804
58677E00804l784l399k864k021j033m28j4R88K605M063N157O417P833Q761R219
58662E32304R887J0639J0460R030P088M981K156j510n109p738r174r309q111o342
58648E39252n252n185n393n278m940m486l771k957k383j902j241q16j135j587
58634D92926j094K07J125J210J119J261J347J363J675K040J653M07q91j611j707
58619E01030j122J36J381J849J862K373L478M417M913N397N979O222N902N139
58605E48956L910K344J045L47k06p91o24N22J218K93j160j421p90o03n75M98K057
58588E55020K488K150L069N469P238P307P090P946R325J0238J0611J0448R376
58575F47775P758O729O584O542O373O732P612Q153Q329R122J0793J2652J4764
$$ plain form
58677 500804 497020 493621 490757 488736 487703 487275 487261 488249 490854 494917 500074 506491 514324 523085 532304
58662 532304 542191 552830 563290 572320 579408 584389 586545 585035 579926 572188 563014 553705 545594 539252
58648 539252 534000 528815 523422 518144 513204 508718 504947 501990 499607 497705 496464 495648 494513 492926
58634 492926 491832 492039 493164 494374 495493 496754 498101 499464 501139 503179 504832 505239 504348 502737 501030
58619 501030 499908 500044 501425 503274 505136 507509 510987 515404 520317 525714 531693 537915 543817 548956
58605 548956 552866 555210 556255 556602 556396 555605 554981 555503 556721 557014 555854 554433 553643 553040 552465 552963 555020
58588 555020 557508 559658 562727 568196 575434 582741 589831 597777 607102 617340 627951 638399 647775
58575 647775 655533 662262 668846 675388 681761 688493 696105 704258 712587 721709 732502 745154 759918
58562G59918J7967K1890K4836K6090K6508K6401K4837K1587J7826J4180R959N056
58550I97055P38k240m595o705p680p114o128n693n438n100n699q152j1861j5577
58536I05811j8695k1046k2441k3000k2960k1910j9324j5940j3242j1439r507p323
58524F98984n961n676n369m568m087m220m075l301k739k760k629k137k073k528
58510F46861k470j660j199j517j619j077q68j389j460l51P99P14k53j003j064
58495F32444l64J097K596K962K189J600K026L026M104N283O320O893P647R348
58481F87171J1085J1280J0493J1005J3385J5828J7092J7662J7531J5504J1516
58470H39552P217L401p78n304q515r745j0275j0685r755p112m405k580m17K884
$$ plain form
58562 759918 777885 799775 824611 850701 877209 903610 928447 950034 967860 982040 991999 997055
58550 997055 997793 995553 990958 984253 976573 969459 963331 957638 952200 947100 941401 933249 921388 905811
58536 905811 887116 866070 843629 820629 797669 775759 756435 740495 727253 715814 706307 698984
58524 698984 693023 687347 681978 677410 673323 669103 665028 661727 658988 656228 653599 651462 649389 646861
58510 646861 644391 642731 641532 640015 638396 637319 636451 635062 633602 633251 634050 634764 634511 633508 632444
58495 632444 632080 633177 635773 638735 640924 642524 644550 647576 651680 656963 663283 670176 677823 687171
58481 687171 698256 709536 720029 731034 744419 760247 777339 795001 812532 828036 839552
58470 839552 846769 850170 849392 844088 835573 825828 815553 804868 795113 788001 783596 781016 780599 783483
58456G83483N994P738Q878J0284J1451J2052J2770J3381J2274R076N419J980k595
58443H92185q478j3163j4819j4698j4403j3398j1043q599p127n623l253j171j73
58430G76237J070L376M997M567L841M966P008P781P420P538Q225Q313P502O067
58416H58908L569j52l798o053p170p810p746p024o753p296p336o113m795m341
58402G86090l968l078k539k636j917K57K272K941L337M346M886M283L942M765
58388H02981N341M675M102M530M538L335K835M294N693N150M252N118O672O861
58374H70377O240O330O513N723N207O501Q413Q961Q669R158J0100J0335J0378
58361I72905J1241J2310J2744J3203J4064J3931J2102J0310R786R101P149N523
$$ plain form
58456 783483 789477 797215 806093 816377 827828 839880 852650 866031 878305 887381 892800 894780 892185
58443 892185 883707 870544 855725 841027 826624 813226 802183 793584 786457 780834 777581 776410 776237
58430 776237 777307 780683 785680 790247 794088 799054 806062 813843 821263 828801 837026 845339 852841 858908
58416 858908 862477 862325 858527 852474 845304 837494 829748 822724 815971 808675 801339 795226 790431 786090
58402 786090 782122 779044 776505 773869 771952 772209 774481 777422 780759 785105 789991 794274 798216 802981
58388 802981 808322 812997 817099 821629 826167 829502 832337 836631 842324 847474 851726 856844 863516 870377
58374 870377 876617 882947 889460 895183 900390 906891 915304 924265 932934 942092 952192 962527 972905
58361 972905 984146 996456 1009200 1022403 1036467 1050398 1062500 1072810 1082596 1091697 1098846 1104369
58349A104369N345M757K415N78J477L468M122M366O065Q141Q804R127J0745J2395
58335A186174J2405J2248J3930J6149J6815J6984J8499K0054J9436J7455J5928
58324A366077J4073J0738P717O949O860N363L966M817O333O024N062N791P253
58311A457023P579Q096J0515J2814J2614J1969J3909J6910J7825J7589J8842K0562
58299A626247K0399J9721K0841K1922K0287J8152J9209K2015K2840K2607K4652
58288A858892K7863K8616K7622K8367L0523L1289L1470L3805L6875L7153L5493
58277B207968L5394L6502L6101L5129L6382L8690L9294L9807M3246M7614M9319
58266B645446N0311N4555O0084O2275O2455O5213O9688P1759P2431P5466P9062
$$ plain form
58349 1104369 1109714 1114471 1116886 1117464 1118941 1122409 1126531 1130897 1136962 1145103 1153907 1163034 1173779 1186174
58335 1186174 1198579 1210827 1224757 1240906 1257721 1274705 1293204 1313258 1332694 1350149 1366077
58324 1366077 1380150 1390888 1398605 1405554 1412414 1417777 1421743 1426560 1432893 1438917 1443979 1449770 1457023
58311 1457023 1464602 1472698 1483213 1496027 1508641 1520610 1534519 1551429 1569254 1586843 1605685 1626247
58299 1626247 1646646 1666367 1687208 1709130 1729417 1747569 1766778 1788793 1811633 1834240 1858892
58288 1858892 1886755 1915371 1942993 1971360 2001883 2033172 2064642 2098447 2135322 2172475 2207968
58277 2207968 2243362 2279864 2315965 2351094 2387476 2426166 2465460 2505267 2548513 2596127 2645446
58266 2645446 2695757 2750312 2810396 2872671 2935126 3000339 3070027 3141786 3214217 3289683 3368745
58255C368745P8863P6926P8587Q2573Q3670Q3069Q6183R2218R6000R8384J04547
58244D329765J13563J20172J25233J33719J44110J50850J55600J64610J76639
58235E614261J85439J92386K04204K19771K32156K42281K57187K76236K92941
58226G716862L09042L32185L61023L87739M13942M48080M88513N26108N62444
58217A1545938O07701O61745P16266P74693Q49715R41563J040158J148513J281227
58208A9567519J439946J614990J812007K050956K337930K666928L051998L527773
58200C8070047M116088M825245N685008O745910Q041968R598635J1486389J3822170
58192A02391460J6711112K0235559K4488819K9500404L5021998M0362216M4388543
$$ plain form
58255 3368745 3447608 3524534 3603121 3685694 3769364 3852433 3938616 4030834 4126834 4225218 4329765
58244 4329765 4443328 4563500 4688733 4822452 4966562 5117412 5273012 5437622 5614261
58235 5614261 5799700 5992086 6196290 6416061 6648217 6890498 7147685 7423921 7716862
58226 7716862 8025904 8358089 8719112 9106851 9520793 9968873 10457386 10983494 11545938
58217 11545938 12153639 12815384 13531650 14306343 15156058 16097621 17137779 18286292 19567519
58208 19567519 21007465 22622455 24434462 26485418 28823348 31490276 34542274 38070047
58200 38070047 42186135 47011380 52696388 59442298 67484266 77082901 88569290 102391460
58192 102391460 119102572 139338131 163826950 193327354 228349352 268711568 313100111
58185C13100111M5618144M2434874L3684480J9578871K180119j5226618k9563708
58178D11806273l9098315m3601879m3842056m1046099l6540441l1454173k6516221
58171A49707089k2074662j8262220j5104519j2537439j0446129q737394p354659
58164E5190067o237250n314803m543660l909029l388682k947919k570059k258343
58156B4020322k004808j786159j591992j429293j296173j176493j063241r63582
58148A2708581q77673p94559p12178o40641n82297n27643m73967m29588l96570
58139G273465l66753l37983l17226l04360k89210k68403k49804k36634k22034
58130D681058k03304j87281j77197j67341j54981j45165j39587j32588j22249
$$ plain form
58185 313100111 358718255 401153129 434837609 454416480 456596599 441369981 411806273
58178 411806273 372707958 329106079 285264023 244217924 207677483 176223310 149707089
58171 149707089 127632427 109370207 94265688 81728249 71282120 62544726 55190067
58164 55190067 48952817 43638014 39094354 35185325 31796643 28848724 26278665 24020322
58156 24020322 22015514 20229355 18637363 17208070 15911897 14735404 13672163 12708581
58148 12708581 11830908 11036349 10324171 9683530 9101233 8573590 8099623 7670035 7273465
58139 7273465 6906712 6568729 6251503 5947143 5657933 5389530 5139726 4903092 4681058
58130 4681058 4477754 4290473 4113276 3945935 3790954 3645789 3506202 3373614 3251365
58121C251365j14243j10681j05985r7726r1083q8563q5362p8937p3662p1950o9744
58110B263429o4783o0829n9950n8552n4610n1280n0180m8411m5038m3188m3322
58099A683286m1769l8262l7356l9881m0723l7660l4864l4816l4242l1098k8249
58088A284366k7090k4494j9382j5603j5087j4634j2593j2247j5279j8167j8524
58077A091266j8903k0996k1986k0256j9010k0421k1583j9891j7560j7145j7238
58066H76277j6037j4824j4660j3798j1319r388r197q766p188o769q595j0210j0151
58053G35375j0427j2132j2968j1647j0397j0580j0145p994o447o806o749m853
58041F24230l444m207n161m830n133p167q292o702m921n436o553o048n348o516
$$ plain form
58121 3251365 3137122 3026441 2920456 2822730 2731647 2643084 2557722 2478785 2405123 2333173 2263429
58110 2263429 2198646 2137817 2077867 2019315 1964705 1913425 1863245 1814834 1769796 1726608 1683286
58099 1683286 1641517 1603255 1565899 1526018 1485295 1447635 1412771 1377955 1343713 1312615 1284366
58088 1284366 1257276 1232782 1213400 1197797 1182710 1168076 1155483 1143236 1127957 1109790 1091266
58077 1091266 1072363 1051367 1029381 1009125 990115 969694 948111 928220 910660 893515 876277
58066 876277 860240 845416 830756 816958 805639 796251 787054 778288 771100 764331 755736 745526 735375
58053 735375 724948 712816 699848 688201 677804 667224 657079 649085 642638 635832 629083 624230
58041 624230 620786 616579 611418 606588 601455 594288 585996 579294 574373 568937 562384 556336 550988 544472
58027E44472q245q452q019q633r454r071q360q440q136o303m388m028m275l638
58013D45030k767k853l371l462l475l423k368p85q16k597l353j862m84q43j038
57998D11533M09J339l52k876l529k886l001l751l894l717l876l478j765J03R96
57983C81255J539K090J415p11k109j576j019k016l056k589j954k573k939j413
57969C64344M39N06j70M89J788J752P15L48N41J93l17j65j55j175k076j667j213
57952C64177k342m008m269l654l881m557m056k578j570j020R6J494K207K721M077
57937C42837N692O245O021O239O827O869O488O319N944M663K927J393m19k919
57923D05126n133o249p099q415r175q520p674p904q179p078n415m667m286l077
$$ plain form
58027 544472 536227 527775 519756 511123 501669 492598 484238 475798 467662 461359 456971 452943 448668 445030
58013 445030 442263 439410 436039 432577 429102 425679 423311 422526 421710 419113 415760 413898 413414 412571 411533
57998 411533 411942 413281 412929 410053 406524 403638 400637 396886 392992 389275 385399 381921 380156 380259 381255
57983 381255 382794 384884 386299 385588 383479 381903 380884 378868 375812 373223 371269 368696 365757 364344
57969 364344 364783 365289 365119 365608 367396 369148 369863 370211 370752 370945 370628 370463 370308 369133 367057 365390 364177
57952 364177 361835 357827 353558 349904 346023 341466 337410 334832 333262 332242 332338 333832 336039 338760 342837
57937 342837 348529 354774 360795 367034 373861 380730 387218 393537 399481 404144 407071 408464 408045 405126
57923 405126 399993 393744 386645 378230 369055 360535 352861 344957 336778 329700 324285 319618 315332 312255
57909C12255j754j556j621m40J184J343K29n20p77j567k538k514j889j915k183
57894B95737j355R9M58k88m43N70J664K226K696L184L361L522M025M184L319K247
57878C25206J957J713N01o51p7J576K238J672J340J542J218L69J63O27N96q6m31
57861C39473l76p56j266p03O99J349R39R21J990L066L189K704K137J466Q81P80
57845C56493Q41L74m27q89j308k372l439l147j715p58p38m54O57J520J223L17
57829C46178k20j19M14J081J409J201J108J777K688K861K450K394K783K839K307
57814C71151J583O63q21k683m482o375q564j0334j0938j0812j0608r730p525n218
57800B85307m681n639o058n150m036l470k860j757o26J94Q03R46L87j7P90K161
$$ plain form
57909 312255 310501 308945 307324 306884 308068 309411 309640 309120 308343 306776 304238 301724 299835 297920 295737
57894 295737 294382 294481 294939 294651 294208 294778 296442 298668 301364 304548 307909 311431 315456 319640 322959 325206
57878 325206 327163 328876 329377 328726 328649 330225 332463 334135 335475 337017 338235 338604 338767 339394 339990 339904 339473
57861 339473 339097 338341 337075 336372 337071 338420 339359 340280 342270 345336 348525 351229 353366 354832 355713 356493
57845 356493 357334 357708 357281 356392 355084 352712 349273 346126 344411 343653 342915 342461 343118 344638 345861 346178
57829 346178 345958 345839 346253 347334 348743 349944 351052 352829 355517 358378 360828 363222 366005 368844 371151
57814 371151 372734 373397 372576 369893 365411 359036 350472 340138 329200 318388 307780 298050 290525 285307
57800 285307 280626 274987 268929 263779 259743 256273 253413 251656 251030 251224 252027 252973 253360 253343 254133 256294
57784B56294K399J405Q57J592K588K953L216M012M955N458N539N359M879M331
57770C05837M028L625K498Q76m13j245k180l239l817l749l409k943k414k283k654
57755B88518k509j033Q99J983K574L829N338N642M783M205M301M101L456L358
57741C29445L928M060L473L111L209K804J692R79J104J085K69p44j434k031k406
57726C48544j940r48n76q59n52N33R26p7j136q93K56J245J789J883J256J78m19
57709C49210l26l55p45o97n7Q7o61j043m7J575K663L284M010M662M869M881M823
57692C76133M028J979p21l042m521n165n165n080n354n444m397k547j261p61K99
57677C38981K598N079O868Q771J1854J5909K0409K5811L2765M0948M9556N8020
$$ plain form
57784 256294 258693 260098 260955 262547 265135 268088 271304 275316 280271 285729 291268 296627 301506 305837
57770 305837 309865 313490 315988 316864 316451 315206 313026 309787 305970 302221 298812 295869 293455 291172 288518
57755 288518 286009 284976 285875 287858 290432 294261 299599 305241 310024 314229 318530 322631 326087 329445
57741 329445 333373 337433 340906 344017 347226 350030 351722 352701 353805 354890 355159 354415 352981 350950 348544
57726 348544 346604 345656 345080 344221 343669 344202 345128 345051 343915 343022 343278 344523 346312 348195 349451 349629 349210
57709 349210 348884 348529 347784 347087 347030 347117 346456 345413 345366 346941 349604 352888 356898 361560 366429 371310 376133
57692 376133 380161 382140 381419 378377 373856 368691 363526 358446 353092 347648 343251 340704 339443 338682 338981
57677 338981 341579 346658 353526 362297 374151 390060 410469 436280 469045 509993 559549 617569
57665F17569O5193O8503O4889N2312L0598K273k6937n0214o3656o7947o5866n9589
57653E67128n0831m1687l3716k7054k1446j7289j4681j2630j0314q196o886n845
57641C16553m365k883k149j840j253o14n61q55p79k93J54N19Q82Q28K5r69j396
57624C01004j467j975l015l825l738k728j288j61J30k21n48o28p47q92o76j93
57608B79032no5L02J126J608J481J293J124L82o42o95K94O27o07k053k293j962
57591B78947k257k760k405j535j229j379j113m65j63k24j66j51n69r51o09J02
57575B63073L79L10M27L96l58j195r04L33J029M53n80j095r80n29O7N33N77L69
57557B62305L76P78J366J919K294K386K372K629L079L197K905K756K907K747K068
$$ plain form
57665 617569 682762 751265 816154 868466 899064 901337 874400 824186 760530 692583 626717 567128
57653 567128 516297 474610 440894 413840 392394 375105 360424 347794 337480 329284 322398 316553
57641 316553 312188 309305 307156 305316 304063 303449 302888 302033 301254 300961 301115 301634 302516 303344 303369 302400 301004
57624 301004 299537 297562 294547 290722 286984 284256 282968 282807 282937 282716 282168 281540 280793 279901 279225 279032
57608 279032 279027 278962 279264 280390 281998 283479 284772 285896 286278 285636 284941 285235 285862 285255 283202 280909 278947
57591 278947 276690 273930 271525 269990 268761 267382 266269 265804 265641 265417 265251 265100 264531 263580 262971 263073
57575 263073 263452 263762 264189 264585 264227 263032 262128 262461 263490 263943 263363 262268 261288 260759 260826 261359 261936 262305
57557 262305 262681 263459 264825 266744 269038 271424 273796 276425 279504 282701 285606 288362 291269 294016 296084
57542B96084J505J268O07o07j034J60J646J673N83N9N39R78P95M69L47J86j26
57525C05132m54q20j078n79Q45K108K175J612J609K085K128J789J914K488K756
57510C23710K728L076L610L445K689K410K762K683J790J058J121J271P60M8l6
57495C53125N11J084J309J148P13K78J36K61M34O06P51O30K65K82J038J888K120
57478C66579K151K698L248K669J149P5kJ19p3p0L92P09N00K60L36L81K96O95J836
57459C83948K973L441L532L713L673K934J861J308J589K227K574K374J915J835
57445D19897K449L325L843M014M234M410M138L624L515L741L503K709K429L364
57431D69195M736N327N051M819N194N779N845N144M159L622L709L799L298K573
$$ plain form
57542 296084 297589 298857 299464 298857 297823 297983 299629 301302 301885 301944 302483 303461 304256 304725 305072 305258 305132
57525 305132 304678 303858 302780 302201 303046 305154 307329 308941 310550 312635 314763 316552 318466 320954 323710
57510 323710 326438 329514 333124 336569 339258 341668 344430 347113 348903 349961 351082 352353 353113 353161 353125
57495 353125 353636 354720 356029 357177 357890 358168 358304 358565 358999 359605 360356 360986 361251 361533 362571 364459 366579
57478 366579 368730 371428 374676 377345 378494 378569 378567 378686 378613 378543 378935 379644 380144 380404 380740 381121 381417 382112 383948
57459 383948 386921 390362 393894 397607 401280 404214 406075 407383 408972 411199 413773 416147 418062 419897
57445 419897 422346 425671 429514 433528 437762 442172 446310 449934 453449 457190 460693 463402 465831 469195
57431 469195 473931 479258 484309 489128 494322 500101 505946 511090 515249 518871 522580 526379 529677 532250
57417E32250K562L516M681N263N225M983M882N057N429N684N572N283N115M925
57403F00427M335L453K844K785L043L383L805M310M871N586O405O888O726O319
57389F65180O233O339O162N928O354P440Q337Q532Q364Q205P904P302O683O356
57375G65319O281O271O225O034N705N526N692N842N472M713M170M123M434N058
57361H40865N963O727O955P053P714Q734R151Q602P828P671Q302R371J0347J0668
57347I55951J0246R761R795R960R592Q966Q784Q814Q304P544P637Q631R324R241
57333A082550R326J0110J0612R901Q676Q348R310J0877J2296J3112J3114J2519
57321A210751J1831J1159J0275R476R555J0604J1687J2151J2379J2770J2919J2475
$$ plain form
57417 532250 534812 538328 543009 548272 553497 558480 563362 568419 573848 579532 585104 590387 595502 600427
57403 600427 604762 608215 611059 613844 616887 620270 624075 628385 633256 638842 645247 652135 658861 665180
57389 665180 671413 677752 683914 689842 696196 703636 711973 720505 728869 737074 744978 752280 758963 765319
57375 765319 771600 777871 784096 790130 795835 801361 807053 812895 818367 823080 827250 831373 835807 840865
57361 840865 846828 853555 860510 867563 875277 884011 893162 901764 909592 917263 925565 934936 945283 955951
57347 955951 966197 975958 985753 995713 1005305 1014271 1023055 1031869 1040173 1047717 1055354 1063985 1073309 1082550
57333 1082550 1091876 1101986 1112598 1122499 1131175 1139523 1148833 1159710 1172006 1185118 1198232 1210751
57321 1210751 1222582 1233741 1244016 1253492 1263047 1273651 1285338 1297489 1309868 1322638 1335557 1348032
57309A348032J1942J1866J1923J1633J1318J1569J2292J2984J3522J3931J3905
57298A484917J3279J2654J2789J3613J4396J4722J4730J4672J4720J5036J5555
57287A641083J5889J5772J5418J5219J5309J5598J5925J5975J5489J4734J4361
57276A810772J4583J5011J5418J6121J7294J8488J9163J9288J9134J8967J9070
57265B003309J9595K0174K0309K0264K0777K1758K2125K1330K0200J9776K0109
57254B229726K0653K1078K1112K0435J9338J8856J9475K0360K0513K0065J9780
57243B451391J9835J9914J9997K0223K0351K0068J9586J9299J9139J8771J8194
57232B666768J7690J7468J7646J8213J8793J8988J9085J9770K0834K1243K0835
$$ plain form
57309 1348032 1359974 1371840 1383763 1395396 1406714 1418283 1430575 1443559 1457081 1471012 1484917
57298 1484917 1498196 1510850 1523639 1537252 1551648 1566370 1581100 1595772 1610492 1625528 1641083
57287 1641083 1656972 1672744 1688162 1703381 1718690 1734288 1750213 1766188 1781677 1796411 1810772
57276 1810772 1825355 1840366 1855784 1871905 1889199 1907687 1926850 1946138 1965272 1984239 2003309
57265 2003309 2022904 2043078 2063387 2083651 2104428 2126186 2148311 2169641 2189841 2209617 2229726
57254 2229726 2250379 2271457 2292569 2313004 2332342 2351198 2370673 2391033 2411546 2431611 2451391
57243 2451391 2471226 2491140 2511137 2531360 2551711 2571779 2591365 2610664 2629803 2648574 2666768
57232 2666768 2684458 2701926 2719572 2737785 2756578 2775566 2794651 2814421 2835255 2856498 2877333
57221B877333K0773K1643K2304K1662K0471K0019J9974J9035J7186J5630J4765
57210C090795J3839J2625J1927J2099J2364J2044J1533J1571J2305J3384J4419
57199C228905J5043J5101J4919J4929J5019J4847J4686J5200J6315J7100J6983
57188C399047J6468J6316J6593J6749J6292J5141J3726J2795J2747J3052J2794
57177C561720J1814J0846J0393J0053R151P684O266N404M944M240K827J094L3
57164C646469R5M91J85p38j258j004q70j825l712n602o997q238r868j1886j3637
57149C581605j4330j3745j2398j0981r713q390o863n186l320j137J250L428N087
57136C505307O242O964P156O632N283L102K66k711n148o735p738q547r061q682
$$ plain form
57221 2877333 2898106 2919749 2942053 2963715 2984186 3004205 3024179 3043214 3060400 3076030 3090795
57210 3090795 3104634 3117259 3129186 3141285 3153649 3165693 3177226 3188797 3201102 3214486 3228905
57199 3228905 3243948 3259049 3273968 3288897 3303916 3318763 3333449 3348649 3364964 3382064 3399047
57188 3399047 3415515 3431831 3448424 3465173 3481465 3496606 3510332 3523127 3535874 3548926 3561720
57177 3561720 3573534 3584380 3594773 3604826 3613977 3621661 3627927 3633331 3638275 3642515 3645342 3646436 3646469
57164 3646469 3646564 3647055 3647240 3646502 3645244 3644240 3643370 3641545 3637833 3632231 3625234 3616996 3607128 3595242 3581605
57149 3581605 3567275 3553530 3541132 3530151 3520438 3512048 3505185 3499999 3496679 3495542 3496792 3500220 3505307
57136 3505307 3511549 3518513 3525669 3532301 3537584 3540686 3540952 3538241 3533093 3526358 3518620 3510073 3501012 3492330
57122C492330o796l227J685P223J2534J7004K0504K3323K5912K8815L2823L8776
57110C690906M7103N7779P0827Q6453J04534J24511J46437J71745K02363K39533
57100D942191K84240L38523M05209M86468N83517O97527Q29477R79130J145236
57091A0691518J326519J520722J722693J924944K119668K298267K450369K566470
57083B6621170K637464K640350K522079K214744J689589J002622K76536l72318
57075C9232236q93385j299307j622670j883377k085620k227079k304554k317255
57067B4598989k270288k174711k043584j889077j722173j551960j384510j224006
57059A0338680j074702r40023q20443p14532o21884n43078m77212m21845l75297
$$ plain form
57122 3492330 3485534 3482307 3483992 3491215 3503749 3520753 3541257 3564580 3590492 3619307 3652130 3690906
57110 3690906 3738009 3795788 3866615 3953068 4057602 4182113 4328550 4500295 4702658 4942191
57100 4942191 5226431 5564954 5970163 6456631 7040148 7737675 8567152 9546282 10691518
57091 10691518 12018037 13538759 15261452 17186396 19306064 21604331 24054700 26621170
57083 26621170 29258634 31898984 34421063 36635807 38325396 39328018 39604554 39232236
57075 39232236 38338851 37039544 35416874 33533497 31447877 29220798 26916244 24598989
57067 24598989 22328701 20153990 18110406 16221329 14499156 12947196 11562686 10338680
57059 10338680 9263978 8323955 7503512 6788980 6167096 5624018 5146806 4724961 4349664
57050D349664l36960l05363k78080k53734k32301k13356j95709j78922j63527
57041B191712j49589j36554j24427j13610j03640r3568q3488p4149o5261n5684
57031A191742m5104l3948k2069r243L443J4304K2375K5831K0270K190k5151n2307
57019A092333p1158p9978q1054p6646o8733n9893n1896m4646l7860l2448k9008
57008D59013k6511k3832k1291j9425j7624j5322j3256j2111j1073r223p322o708
56996B75315p189p438o883n900m667k999j022R45K845M606N985P278R389J2347
56982B82612J4573J4454J1959Q038L202k244p364j1090j3156j3867j3444j2307
56970B61366j1258j0473r005o106k520M65K625M560O448Q091R805J2216J5259
$$ plain form
57050 4349664 4012704 3707341 3429261 3175527 2943226 2729870 2534161 2355239 2191712
57041 2191712 2042123 1905569 1781142 1667532 1563892 1470324 1386836 1312687 1247426 1191742
57031 1191742 1146638 1112690 1090621 1081378 1084821 1099125 1121500 1147331 1167601 1169791 1144640 1092333
57019 1092333 1021175 941197 860143 783497 714764 654871 602975 558329 520469 488021 459013
57008 459013 432502 408670 387379 367954 350330 335008 321752 309641 298568 289345 282023 275315
56996 275315 268126 260688 253805 247905 243238 240239 239217 240162 243007 247613 253598 260876 270265 282612
56982 282612 297185 311639 323598 331636 334838 332594 325230 314140 300984 287117 273673 261366
56970 261366 250108 239635 230630 224524 222004 222469 225094 229654 236102 244193 253998 266214 281473
56957B81473J8143K0115K0599J8856J4268P001j832j0510j7099k0325k0555j9407
56945B90727j8008j6168j3531j0592p945n351k330R31L994O947J0113J3573J7486
56932B69846K2174K7192L0874L1512K8429K1616J1287j266j3320k2341k7690l0086
56920C48227l0149k8278k5225k1748j8106j4643j2168j0942j0005q560p264p018
56908A54121p105n991l637j683j312k074k815k778j794k15J219K125K990M393
56894A35444N997P100P849R064J0992J3191J5481J8212K1381K4105K5072K3203
56882C17091J8197J0911L048l930r425j3097j4495j3776j2025j0079p650m402
56870B60368j094J417L662O854J1136J5728K0489K6065L2617L9526M6138N1688
$$ plain form
56957 281473 299616 319731 340330 359186 373454 380455 378623 368113 351014 330689 310134 290727
56945 290727 272719 256551 243020 232428 224483 219132 216802 217733 221727 228674 238787 252360 269846
56932 269846 292020 319212 350086 381598 410027 431643 442930 441664 428344 406003 378313 348227
56920 348227 318078 289800 264575 242827 224721 210078 197910 186968 176963 168403 161139 154121
56908 154121 147016 141025 137388 135705 134393 132319 129504 126726 124932 124717 125936 128061 131051 135444
56894 135444 141441 148541 156390 165454 176446 189637 205118 223330 244711 268816 293888 317091
56882 317091 335288 346199 349247 345317 335892 322795 308300 294524 282499 272420 264770 260368
56870 260368 259274 260691 264353 271207 282343 298071 318560 344625 377242 416768 462906 514594
56858E14594N4524N2534M4625L1168J3456o197k4169l6901m3085m3803m0614l4596
56846D81536k7076j9763j3445p419p68O529J4009K1601K9670L8760M9369O1336
56834F34339P3197Q2648Q7594Q6164P6085N5582K5771q368m0113o4170p8262q2803
56822H47664p9837p1984o1627n0590m0054l0403k1382j2825m973K256R799J8516
56810E04560K8062L7459M6420N5000O1873O4005N8387M3814K1349n707l2186n2771
56798H30265o4537o7940o5412n9421n1754m3617l5789k8759k2762j7490j2078
56787C60706n981L35O130J1600J7536K3883K9513L3316L4577L2268K5157J3261
56775E82301j432j6062k8300l6735m0850m1180l8978l5364l0991k6495k2571j9446
$$ plain form
56858 514594 569118 621652 666277 697445 710901 704704 680535 643634 600549 556746 516132 481536
56846 481536 454460 434697 421252 413833 413065 419594 433603 455204 484874 523634 573003 634339
56834 634339 707536 790184 877778 963942 1040027 1095609 1121380 1113012 1072899 1008729 930467 847664
56822 847664 767827 695843 634216 583626 543572 513169 491787 478962 473989 476245 486044 504560
56810 504560 532622 570081 616501 671501 733374 797379 855766 899580 920929 915222 883036 830265
56798 830265 765728 697788 632376 572955 521201 477584 441795 413036 390274 372784 360706
56787 360706 354725 355060 361190 372790 390326 414209 443722 477038 511615 543883 569040 582301
56775 582301 580869 564807 536507 499772 458922 417742 378764 343400 312409 285914 263343 243897
56763B43897j6854j4622j2806j1221r519p879o853o421n895m998m237l957l771
56750A34864l310k857k706k528j892j014m84m91p43q84p73n19n00j011j804k237
56734A11111k029j598j508j861k249k098j075N10J743J942J406J038J302J911
56720A08545K372K392J898J184Q85J235J578J197M55L47J072J835K054J928J767
56705A30744J606J572J909K377K357J701Q58K7j024k147k587j902n54O75J402
56690A37014J566J216N56j49p88j142o70Q08K399K954K551K234K361K198J286
56675A54394K27k97l99n23q70j526k385k757j885j70J002R80N28M58N30K83J0
56658A47600J25L28J12l54n69m93m77o42q08p54l55K87P20N85J78O5J66Qk14K13
$$ plain form
56763 243897 227043 212421 199615 188394 178875 170996 164143 157722 151827 146829 142592 138635 134864
56750 134864 131554 128697 125991 123463 121571 120557 120073 119582 118839 117955 117182 116663 116163 115152 113348 111111
56734 111111 109082 107484 105976 104115 101866 99768 98693 99203 100946 102888 104294 105332 106634 108545
56720 108545 110917 113309 115207 116391 117276 118511 120089 121286 121741 122088 123160 124995 127049 128977 130744
56705 130744 132350 133922 135831 138208 140565 142266 143124 143151 142127 139980 137393 135491 134937 135612 137014
56690 137014 138580 139796 140352 140203 139415 138273 137603 138411 140810 143764 146315 148549 150910 153108 154394
56675 154394 154621 154324 153925 153402 152532 151006 148621 145864 143979 143809 144811 145791 146319 146777 147307 147590 147600
56658 147600 147725 148053 148165 147811 147242 146749 146272 145630 144822 144068 143713 144000 144720 145305 145483 145548 145714 145722 145508 145721
56638A45721J149J508R09K76K62K03n69j403j279m02K34L57M74P36P06J99m24
56621A48657q51j152j454j672j638j357j097j154j365j091j00P48L92r33j828
56606A34105j480m82K36M37K92o5l53j59M44Q73Q63P19N89K83p7l9L23M14K16
56587A37139L78R98J340J126R97J202J107N41L97J054J452O77n34r86p16m32o6
56570A45674Q51J991K630K822L150L657M060M608N718P073P996Q510R197J0136
56556B18073J0641R940P688M202O42j652k533l184m362n266m881l631k725k497
56542B20455k433k341k421k564k510k407k397k023j019k27p02k101k969k559j481
56527A90301o56l67m28n39m49r6L29P16J048R89O1j394k213j929j535k002k833
$$ plain form
56638 145721 146870 148378 149287 149563 149825 150028 149459 148056 146777 146375 146609 146966 147440 148176 148882 149081 148657
56621 148657 147806 146654 145200 143528 141890 140533 139436 138282 136917 135826 135726 136474 136866 135933 134105
56606 134105 132625 132143 132379 132816 133108 133043 132690 132531 132975 133848 134711 135430 136019 136302 136225 136186 136509 136923 137139
56587 137139 137517 138515 139855 140981 141978 143180 144287 144828 145225 146279 147731 148408 147874 146888 146172 145740 145674
56570 145674 146525 148516 151146 153968 157118 160775 164835 169443 175161 182234 190230 198740 207937 218073
56556 218073 228714 238654 246342 250544 251186 249534 247001 243817 239455 234189 229308 225677 222952 220455
56542 220455 218022 215681 213260 210696 208186 205779 203382 201359 200340 200113 199411 197310 194341 191782 190301
56527 190301 189645 189278 188850 188311 187862 187766 188095 188811 189859 190848 190909 189515 187302 185373 183838 181836 179003
56510A79003k905k203j667j786k249k611k597k035j163n53k13O10K076L064K613
56495A67384J319K75n23j582k420k040n29J040K007K440K383J876J352J109P13
56480A74804j72r23q74m47k78M2J068K009J698N44n9J27K07O7M30J120J035J03
56462A80501m69k23j66r42j698j494n37N36J584K417K355J163k37o68O9J259K161
56445A85611K494K440K366K328J913R14j62p74j124j581j746j032J15O36L74J47
56429A92919L83O98Q88J257J731J627O40n72j052l85J100K462K720J827Q32N78
56413B07653P04N24K40L30M27K7l16J93R86Q40q2m90j15j6o57j227j159r05q40
56394B06117o38j80O6k0Q1N65R98J202J506J908J954J648J495J490J019J0p88
$$ plain form
56510 179003 176098 173895 172228 170442 168193 165582 162985 160950 159787 159234 159021 159631 161707 164771 167384
56495 167384 168703 168978 168455 166873 164453 162413 161884 162924 164931 167371 169754 171630 172982 174091 174804
56480 174804 174632 173709 172835 172388 172110 172152 173220 175229 176927 177471 177412 177539 177746 177813 178243 179363 180398 180501
56462 180501 180032 179809 179643 178701 177003 175509 174972 175508 177092 179509 181864 183027 182790 182122 182191 183450 185611
56445 185611 188105 190545 192911 195239 197152 198066 197904 197130 196006 194425 192679 191647 191762 192398 192772 192919
56429 192919 193302 194000 194888 196145 197876 199503 200143 199571 198519 198134 199234 201696 204416 206243 207075 207653
56413 207653 208357 208881 209121 209451 209878 209905 209589 209782 210768 211608 211526 211036 210921 210905 210248 209021 207862 206957 206117
56394 206117 205479 205299 205365 205345 205426 205991 206989 208191 209697 211605 213559 215207 216702 218192 219211 219221 218433
56377B18433q99o20l17l7J00j7mN64J318J594J546J791K191K145J775J632J507
56360B32702R29N32J320K705K998J934J022J160J666J902K209K696K729K174J716
56345B60394J517R43Q1m9P49J410J405J459J874J820J041O80J450K472K820K875
56329B82941L158L136K378J715K071L000L439L185K726K259J691J078N17N7j9
56314C13332M56Q59M64k05J07J327J960J442J041J877L471M911O056O860O892
56299C50850O343O248O892P203O488N530N126M842M093L347L315L900M758N897
56285D24832P035P461P270P604Q971J0364J0798J0593J0490J0590J0840J1493
56273E38341J2449J3147J3687J4864J6734J8408J9700K1387K3458K4813K5462
$$ plain form
56377 218433 217534 216914 216597 216560 216660 216643 216639 217203 218521 220115 221661 223452 225643 227788 229563 231195 232702
56360 232702 233631 234163 235483 238188 241186 243120 244142 245302 246968 248870 251079 253775 256504 258678 260394
56345 260394 261911 262854 262935 262886 263635 265045 266450 267909 269783 271603 272644 273324 274774 277246 280066 282941
56329 282941 286099 289235 291613 293328 295399 298399 301838 305023 307749 310008 311699 312777 313294 313351 313332
56314 313332 313788 314647 315111 314906 315013 316340 318300 319742 320783 322660 326131 331042 337098 343958 350850
56299 350850 357193 363441 370333 377536 384024 389554 394680 399522 403615 406962 410277 414177 418935 424832
56285 424832 431867 439328 446598 454202 463173 473537 484335 494928 505418 516008 526848 538341
56273 538341 550790 563937 577624 592488 609222 627630 647330 668717 692175 716988 742450
56262G42450K7097L0601L4701L8224M1943M6966N2940N9190O6235P4761Q4398
56251A299506R4755J06381J19399J32467J44371J55464J66370J76475J84823J91149
56241B771160J94832J94253J88482J78311J64367J45613J21097R1911O0007K6471
56231D136504p683m0367o9853r6186j19730j39408j53895j63504j69344j71702
56221C004832j70628j67091j62103j55637j47644j38983j30239j20942j11172
56212A700393j02468r5694q9449q2192p4520o7726o1628n5594n0243m6214m2531
56201I32134l8202l4133l1478k9310k6080k2319j9681j8145j6407j4311j2833
56190F69235j2099j1361j0503r867r129p869o631n991n314l889k402j860j959
$$ plain form
56262 742450 769547 800148 834849 873073 915016 961982 1014922 1074112 1140347 1215108 1299506
56251 1299506 1394261 1500642 1620041 1752508 1896879 2052343 2218713 2395188 2580011 2771160
56241 2771160 2965992 3160245 3348727 3527038 3691405 3837018 3958115 4050026 4110033 4136504
56231 4136504 4128821 4088454 4018601 3922415 3802685 3663277 3509382 3345878 3176534 3004832
56221 3004832 2834204 2667113 2505010 2349373 2201729 2062746 1932507 1811565 1700393
56212 1700393 1597925 1502231 1412782 1330590 1256070 1188344 1126716 1071122 1020879 974665 932134
56201 932134 893932 859799 828321 799011 772931 750612 730931 712786 696379 682068 669235
56190 669235 657136 645775 635272 625405 616276 608407 601776 595785 590471 586582 584180 582320 580361
56177E80361j876j672j537q70M61J238Q47O22J589K448J733N06P44K346L882N003
56161E95825O053O542O180O231P717R556J0478J1330J3218J4999J5194J4959J6383
56148G34665J9135K1610K4186K8333L3614L8551M3679N0759N9580O8214P5716
56137A198042Q1783Q4640Q2269P5322O6247N6348M6202L7924L3768L3008L3021
56126A828574L2698L2060K9613K3496J4770O329r39p913j4100j8388k2527l0167
56114A873506m2123n5589o7877p7891q4228q5345q1912p6091o8460n8514m7824
56103A127652l9370l3557k8085k1900j6354j2293q975o130m325l199j771m01M3
56090I51335L83J877L578L847L671N147P577Q534Q105Q382R395R435Q934R921
$$ plain form
56177 580361 578485 576813 575276 574406 574867 576105 576952 577574 579163 581611 583344 583850 584594 586940 590822 595825
56161 595825 601878 608420 614600 620831 628548 638104 648582 659912 673130 688129 703323 718282 734665
56148 734665 753800 775410 799596 827929 861543 900094 943773 994532 1054112 1122326 1198042
56137 1198042 1279825 1364465 1446734 1522056 1588303 1644651 1690853 1728777 1762545 1795553 1828574
56126 1828574 1861272 1893332 1922945 1946441 1961211 1967540 1966601 1958688 1944588 1926200 1903673 1873506
56114 1873506 1831383 1775794 1707917 1630026 1545798 1460453 1378541 1302450 1233990 1175476 1127652
56103 1127652 1088282 1054725 1026640 1004740 988386 976093 967118 960988 956663 953464 951693 951292 951335
56090 951335 951718 953595 957173 961020 964691 969838 977415 985949 994054 1002436 1011831 1021266 1030200 1040121
56076A040121J1875J2205J0818J0292J1468J2693J3384J4513J5635J5388J4829
56065A183221J6280J8947J9818J8712J8281J9104J9201J8439J8865K0458K0955
56054A392281K0090J9664J9501J7851J5720J5953J8050J8894J8602K0402K4465
56043A601473K7362K8068K9053L0847L1130K9907L0036L1745L2246L1469L2477
56032A935813L5393L6933L6815L8481M2376M4914M5343M7158N1042N3100N1979
56021B419347N1307N3033N4756N5591N8249O3089O6569O7783P0181P4783P8173
56010C112861P9317Q1629Q6365R0700R4223J00118J08063J13659J16807J22682
56000D106424J32267J40298J45014J51122J60447J68784J74972J83725J96234
$$ plain form
56076 1040121 1051996 1064201 1075019 1085311 1096779 1109472 1122856 1137369 1153004 1168392 1183221
56065 1183221 1199501 1218448 1238266 1256978 1275259 1294363 1313564 1332003 1350868 1371326 1392281
56054 1392281 1412371 1432035 1451536 1469387 1485107 1501060 1519110 1538004 1556606 1577008 1601473
56043 1601473 1628835 1656903 1685956 1716803 1747933 1777840 1807876 1839621 1871867 1903336 1935813
56032 1935813 1971206 2008139 2044954 2083435 2125811 2170725 2216068 2263226 2314268 2367368 2419347
56021 2419347 2470654 2523687 2578443 2634034 2692283 2755372 2821941 2889724 2959905 3034688 3112861
56010 3112861 3192178 3273807 3360172 3450872 3545095 3645213 3753276 3866935 3983742 4106424
56000 4106424 4238691 4378989 4524003 4675125 4835572 5004356 5179328 5363053 5559287
55991E559287K07534K16605K29088K46422K62810K76833K95088L20002L45429
55982G959098L68988L96868M31278M65615M97814N35629N82650O32508O83566
55973A2554014P45195Q22297R08360J001571J112309J246393J397769J567271
55965B1355179J771134K021047K315181K660522L083972L608959M243439N005278
55957D6064711N935562P072366Q441388J0094398J2129083J4649997J7741682
55950A22129187K1490740K5950885L0974845L6027941M0124766M1878112L9680228
55943C58256704L2229642J9427410L035307j3709066k7505284l6399762m0198410
55936B95136541l9903282l6921751l2572546k7868825k3429483j9518176j6194107
$$ plain form
55991 5559287 5766821 5983426 6212514 6458936 6721746 6998579 7293667 7613669 7959098
55982 7959098 8328086 8724954 9156232 9621847 10119661 10655290 11237940 11870448 12554014
55973 12554014 13299209 14121506 15029866 16031437 17143746 18390139 19787908 21355179
55965 21355179 23126313 25147360 27462541 30123063 33207035 36815994 41059433 46064711
55957 46064711 52000273 59072639 67514027 77608425 89737508 104387505 122129187
55950 122129187 143619927 169570812 200545657 236573598 276698364 318576476 358256704
55943 358256704 390486346 409913756 412949063 399239997 371734713 335334951 295136541
55936 295136541 255233259 218311508 185738962 157870137 134440654 114922478 98728371
55929I8728371j3440725j1197818r369902p869097o642004n645291m825383m139230
55921C5598921l569427l101953k709617k370707k082909j844672j640596j457582
55913A6821458j298331j166242j051834r45581q50335p70133o99149o31880n72503
55904H835470n24599m82407m41069m05024l77743l53164l25628k99094k78307
55895E348435k59709k38828k18626k02946j89110j73957j60091j49807j39687
55886C615674j27235j16004j08590j01531r2760q6964q7704r0818r1367r0620
55876B622081r0608q8331q1517p4160p0420o8388o5266o3189o4296o5319o2734
55865A827853n8506n5512n2039m6050m0235l7611l6469l4522l3640l5583l7444
$$ plain form
55929 98728371 85287646 74089828 64719926 56850829 50208825 44563534 39738151 35598921
55921 35598921 32029494 28927541 26217924 23847217 21764308 19919636 18279040 16821458
55913 16821458 15523127 14356885 13305051 12359470 11509135 10739002 10039853 9407973 8835470
55904 8835470 8310871 7828464 7387395 6982371 6604628 6251464 5925836 5626742 5348435
55895 5348435 5088726 4849898 4631272 4428326 4239216 4065259 3905168 3755361 3615674
55886 3615674 3488439 3372435 3263845 3162314 3069554 2982590 2894886 2804068 2712701 2622081
55876 2622081 2531473 2443142 2361625 2287465 2217045 2148657 2083391 2020202 1955906 1890587 1827853
55865 1827853 1769347 1713835 1661796 1615746 1575511 1537900 1501431 1466909 1433269 1397686 1360242
55854A360242l6332l4471l4726l5124l2718k9086k7095k5828k3500k1813k2714
55843A036835k4075k3223k1548k1271k0990j8834j6747j7065j7998j6997j5569
55832H22518j6165j7197j5871j3360j2487j2573j1109q585p300p213o913o954
55820F86791q443j0175j0625j0914j2430j3608j2495j0358r355q842p349n911
55808E66286n856n644l502j065o23r79K14K090K519K384L870O123O619N448M362
55793E82246L074K28l109m755n048n680o125m784k561j633j718j158q05l061p649
55778E37462j1674j3487j3355j1070o106K45N984J1195J6924K1854K3023J9383
55766E80378J2057J912j0187k1276k7683k8650k6337k2673j8382j4434j1757r884
$$ plain form
55854 1360242 1323910 1289439 1254713 1219589 1186871 1157785 1130690 1104862 1081362 1059549 1036835
55843 1036835 1012760 989537 967989 946718 925728 906894 890147 873082 855084 838087 822518
55832 822518 806353 789156 773285 759925 747438 734865 723756 715171 707871 700658 693745 686791
55820 686791 678348 668173 657548 646634 634204 620596 608101 597743 588388 579546 572197 566286
55808 566286 560430 554786 551284 550219 549596 548617 548831 550921 553440 555824 559694 565817 572436 577884 582246
55793 582246 585320 585548 582439 577684 572636 566956 560831 556047 553486 551853 550135 548977 548172 545111 537462
55778 537462 525788 512301 498946 487876 481770 482015 487999 499194 516118 537972 560995 580378
55766 580378 592435 594347 584160 562884 535201 506551 480214 457541 439159 424725 412968 403084
55754D03084q015o858p297q173p814o821o859p579p309o067n216m836l955k801
55740C13484k304j987q30M34L34p29j361j891l542n569o074n152m549m560m013
55725B71691k961k681l182l287l080l695m787m742l376k020r27R85L716N787O493
55710B53934O617O798O898O850O385M364L05l921n952o046o272p227p791p704
55696B47238p858q268p987o981o011m918l137j458j111j490j053J8L49J05O43
55681A98081J824K326K338L248M755N007L712K454J817Q13o25j317j240j733k836
55666B18624l026j999j219j212q12L46J088J077J443K432K736J949J325J372J020
55651B25144Ml45L72O67j76p10J13J009M91r16j895k332k759l215l743m805o235
$$ plain form
55754 403084 395069 388211 380914 372741 364927 358106 351247 343668 336359 330292 325076 320240 316285 313484
55740 313484 311180 309193 308363 308797 309131 308402 307041 305150 301608 296039 289965 284813 280264 275704 271691
55725 271691 268730 266049 262867 259580 256500 252805 248018 243276 239900 237880 236953 237938 241654 247441 253934
55710 253934 260551 267349 274247 281097 287482 291846 292151 288230 282278 276232 269960 262733 254942 247238
55696 247238 239380 231112 223125 216144 210133 205215 202078 200620 199509 198019 196966 196984 197333 197438 198081
55681 198081 199905 202231 204569 207817 212572 217579 221291 223745 225562 226375 225750 224433 223193 221460 218624
55666 218624 215598 213599 212380 211168 210356 210702 211790 212867 214310 216742 219478 221427 222752 224124 225144
55651 225144 225148 224803 225175 225842 225666 224956 225069 226078 226569 225653 223758 221426 218667 215452 211709 206904 200669
55634B00669o951o507n707n143m517l910m039m657m379k951j949k281k658j747
55620A43273k28N83P52J017J168N43o15j500j850j901j737j474j457j691j677
55605A33206j200o78m57m23n26q54j143j021p53q00q18k29M06%j198j873j769
55588A19870j906k539k629j669m13N69J436J931J430O02J075K920M271M183M044
55573A33175N169O795P631P891Q468R274R473Q564O482L559R23l04o66j958m665
55558A99811p245q524r075r513r199p736o127n230m434l109j999j898k127j672
55544A21923q25l96l07j60k59q15r83J1J480K189K029J710J448R76L68j54p53
55527A27482j554k125k097j733j431j217j294k161l563m193l258j572m38j27j56
$$ plain form
55634 200669 193718 187211 181504 176361 171844 167934 163895 159238 154859 151908 149959 147678 145020 143273
55620 143273 143045 143628 144380 145397 146565 147108 146493 144993 143143 141242 139505 138031 136574 134883 133206
55605 133206 132006 131328 130871 130448 129922 129068 127925 126904 126151 125351 124533 124304 124710 124710 123512 121639 119870
55588 119870 117964 115425 112796 111127 110714 111283 112719 114650 116080 116682 117757 120677 124948 129131 133175
55573 133175 138344 145139 152770 160661 169129 178403 187876 196440 202922 206481 207404 207100 206434 204476 199811
55558 199811 192566 184042 174967 165454 156255 148519 142392 137162 132728 129619 127620 125722 123595 121923
55544 121923 121098 120702 120395 120235 119976 119161 118178 118189 119669 121858 123887 125597 127045 128021 128389 128235 127482
55527 127482 125928 123803 121706 119973 118542 117325 116031 113870 110307 106114 102856 101284 100846 100719 100563
55512A00563k81m84n95n84p10r49r22p10q41j186q99J57J012J123J123J465J558
55495I8840R83L65K54J87k57n56k57J38J42R7K50M5p53j296r50l66l39n79n54
55476I5394n45q48r49n06k55p93j347q96K15Q17M93l35j182j585j143k51Ro10
55458H5683j024n85j66o78j572j868j597j196n35L77Q02N51O62J629K157J101
55442H3741m67p79L0N49N06P19J184J015Q2p82j100j063p28r9L12P4l42k79R9
55423H2672M10R45J807K038R42l96m07P36J600J667J537J400R52M62M29M39k16
55406I7017j089j203q22j066j994k657k805k911k697j364O20J646J175K58l02
55391H1806q30j475j534o86L88J121J644J930J462L32m96n04k86l51l44K0J56
$$ plain form
55512 100563 100282 99798 99203 98619 97909 96960 96038 95328 94487 93301 92402 92559 93571 94694 95817 97282 98840
55495 98840 99823 100188 100442 100629 100372 99816 99559 99697 99839 99936 100186 100231 99478 98182 97232 96866 96527 95948 95394
55476 95394 94849 94001 93052 92546 92291 91498 90151 89255 89470 90287 90780 90445 89263 87678 86535 86284 86293 85683
55458 85683 84659 84074 83908 83230 81658 79790 78193 76997 76462 76839 77641 78192 78854 80483 82640 83741
55442 83741 83274 82495 82525 83074 83580 84299 85483 86498 86580 85798 84698 83635 82907 82808 83120 83194 82852 82573 82672
55423 82672 83082 84027 85834 87872 88814 88418 88011 88747 90347 92014 93551 94951 95903 96365 96794 97233 97017
55406 97017 95928 94725 93903 92837 90843 88186 85381 82470 79773 78409 79029 80675 81850 82108 81806
55391 81806 80976 79501 77967 77281 77669 78790 80434 82364 83826 84158 83662 83158 82872 82521 82177 82197 82353
55374H2353m53j221j180k73P20J324J828K603L385L392K261P02j52q5J3m89j087
55357I3641j081o78m64m02j95p0l51p10p22p24j151j519j117l52k34p88j119q76
55339H1088n08k43J41N19N43M18N99P86L07o10j028p94p02j074j231o48L20J102
55321G8985J498J428Q35L2m71n42m01j68J3k41r23j216n54L42M29j25m26m09o36
55302G7450r21n34L19O82M00K01K55M3l28r2P07J152J037J114J452J046l99j610
55284H1974j413k15Q35J238J156Q16M59K35r8q02j424j260n67l15o59p23o4O85
55266G9858Q80N74k2p70j146o04L95P79L88J7p9l63o33j6J326J995J414O56N61
55247H5210N63O5l85k03J38O7j16o1q3l35l40j39o45j934k499j316M24R86M38
$$ plain form
55374 82353 81900 80679 79499 79226 79946 81270 83098 85701 89086 92478 94739 95441 95289 95204 95217 94728 93641
55357 93641 92560 91882 91418 91016 90821 90751 90400 89690 88968 88244 87093 85574 84457 84105 83871 83083 81964 81088
55339 81088 80580 80337 80478 80997 81540 81958 82557 83343 83650 83040 82012 81218 80516 79442 78211 77563 77883 78985
55321 78985 80483 81911 82746 82778 82307 81765 81364 81196 81209 80968 80045 78829 78275 78617 79046 78921 78495 78086 77450
55302 77450 76529 75995 76314 76996 77396 77597 77852 77895 77567 77475 78182 79334 80371 81485 82937 83983 83584 81974
55284 81974 80561 80346 81181 82419 83575 84391 84850 85085 84987 84185 82761 81501 80934 80619 79960 79237 79173 79858
55266 79858 80738 81312 81290 80520 79374 78770 79165 79944 80332 80349 80270 79907 79274 79258 80584 82579 83993 84649 85210
55247 85210 85773 85838 85453 85250 85388 85455 85339 85278 85195 84860 84520 84381 83736 81802 79303 77987 78411 79397 79835
55228G9835Q0L06N22N68Q03J064Q12J21m28o80r06j080r48n22R2R74J888K054
55210H4555J150O8k20K1p7m97m80R6N23L62r1l98m38k31P1J76k1j58J32O62R27
55189H6132O72k4q53j278r22j67J56m1K1O90J278J195Q24O38M07k6q1N71J181
55170I0373J049P89J272K031J843N54q30j575j711j340n34K45O05Q80J486J853
55154I6990J063o59k092k574k462k122j545j007j040j482j471o44L97J060J428
55139H3840J710J708J229N35J4k34l06l15m31p16q77n41J41N56L89k6j95k1K28
55120H6688K58J7l01m79n71p02o35pR09J275Q66M86P16R46M03m94p77m77m41p59
55100H6921n64M96J591J866J498J198J229J290J048N69L23P50J563J798R00m54
$$ plain form
55228 79835 79915 80221 80743 81311 82114 83178 83990 84111 83683 83003 82097 81017 80069 79547 79639 80613 82501 84555
55210 84555 85705 85773 85553 85574 85497 85000 84520 84616 85139 85501 85410 85012 84574 84343 84414 84590 84569 84411 84543 85205 86132
55189 86132 86804 86780 85927 84649 83727 83560 83716 83675 83696 84386 85664 86859 87683 88321 88728 88702 88621 89192 90373
55170 90373 91422 92211 93483 95514 97357 97911 97081 95506 93795 92455 91921 92166 92771 93651 95137 96990
55154 96990 98053 97394 95302 92728 90266 88144 86599 85592 84552 83070 81599 80955 81352 82412 83840
55139 83840 85550 87258 88487 89022 89036 88802 88496 88181 87750 87034 86157 85616 85757 86313 86702 86676 86481 86460 86688
55120 86688 86946 86963 86662 86183 85612 84910 84275 84268 85177 86452 87318 87804 88520 89466 89869 89375 88598 88121 87680 86921
55100 86921 86357 86853 88444 90310 91808 93006 94235 95525 96573 97142 97465 98215 99778 101576 102476 102022
55084A02022j169j045o48j88N65J373J507Q23Lm85q49j130p58M65J663J760P77
55067A04686l10p39n74l23l31n30o08m39l53p75j578k138k024j363m68M87J270
55050I3890J476R51J11m34m17o3J88kn88j079r96m40j1p5l90n30m27k46qL87Q36
55029I2133J069J057J158J620K025J559N5j538k078j498p55n24n57m81m86p77
55013I1982q66k07P82J074L72n19p65l70J62N36P63Q48P35M55K09K19M82O60M52
54994I7004J05K37R27J392R80J64n7M30P68M60O1K45P98R93O05P9j93k74l25k43
54974A04156J16N54O48K64k19l73k31j86m45q16r73o74J73J323K038J582J31j141
54956A05927j134Q0J334J427J71j407j901r49L50P41L50K24N88N51k63r91r39
$$ plain form
55084 102022 100853 99808 99160 98972 99537 100910 102417 103240 103243 102758 101909 100779 100021 100486 102149 103909 104686
55067 104686 104376 103637 103063 102740 102409 101879 101271 100832 100479 99704 98126 95988 93964 92601 92133 92620 93890
55050 93890 95366 96317 96428 95994 95577 95514 95702 95700 95112 94033 93037 92597 92586 92511 92121 91591 91164 90918 90910 91297 92133
55029 92133 93202 94259 95417 97037 99062 100621 100676 99138 97060 95562 94807 94283 93726 93245 92759 91982
55013 91982 91116 90909 91691 92765 93137 92618 91853 91483 91645 92181 92944 93792 94527 94982 95191 95410 95892 96552 97004
54994 97004 97109 97346 98273 99665 100645 100809 100752 101182 101950 102410 102471 102716 103514 104507 105112 105191 104998 104724 104399 104156
54974 104156 104272 104826 105474 105738 105519 105146 104915 104729 104284 103468 102495 101821 101994 103317 105355 106937 107068 105927
54956 105927 104793 104873 106207 107634 107805 106398 104497 103548 103898 104639 104989 105213 105801 106352 106089 105098 104159
54939A04159p20j124j689j357p6J254K048K343K133J342M17P0M14R91J569K235
54923A14009K779K791K462K568L504M819N826O244O177N832N326M478K918O18
54909A70351j845l846n209n896n744m970m369m404m567m273l786l491k934j671
54895A13346m40k48o60m64L57P53O06Q90J703J869J023L94P91J315J064P80J622
54878A24701L276M577N215N649N918N728N362N362N504N021L692J952R4j909l943
54863A76199n689o950p574p356o492n671n163m305k628r86n89j271j746j474j131
54848A17174j257j528j667j982k584k929k668k229j961j449l51O08N05k87m15
54833I6980N63J535J439P05N22J142J699J560J085Q90R53Q39L61l36j081j680
$$ plain form
54939 104159 103439 102315 100626 99269 99193 100447 102495 104838 106971 108313 108730 108800 109214 110205 111774 114009
54923 114009 116788 119579 122041 124609 128113 132932 138758 145002 151179 157011 162337 166815 169733 170351
54909 170351 168506 164660 159451 153555 147811 142841 138472 134068 129501 125228 121442 117951 115017 113346
54895 113346 112906 112658 111998 111534 111891 112644 113250 114140 115843 117712 118735 119129 119920 121235 122299 123079 124701
54878 124701 127977 132554 137769 143418 149336 155064 160426 165788 171292 176313 180005 181957 182051 180142 176199
54863 176199 170510 163560 155986 148630 142138 136467 131304 126999 124371 123385 122796 121525 119779 118305 117174
54848 117174 115917 114389 112722 110740 108156 105227 102559 100330 98369 96920 96569 97177 97682 97395 96980
54833 96980 97543 99078 100517 101222 101744 102886 104585 106145 107230 108120 109073 109912 110273 109937 108856 107176
54817A07176j819j401q41n96n51k64K53N57M69K69J23j18m32m90k09M3M2K7J77
54798A02415K58N6k03k31p9J46N13R16R35N25L23P55J233R47J25k16L15J062J328
54779A11123J089O71L28K85O31R75P91L48O33K002L481L955L646L752M837O246
54763A44793P071P110O729O281N871N342M321K534K59j840l455m898o359p328
54749A66431p151n999m746m022l731l496l078k369j466p90p20r90r94o87n98p84
54733A24810o29k4Q0q64j733j005J078K717K954K692L110M123M946N343N577N636
54717A58811N267M527L670K661J282l45j793k914l932m928n561n504m908m264
54703A42069l872l610l212k629k022j467r45o03p49j331j749j511r00n68n97n03
$$ plain form
54817 107176 105357 103956 103115 102519 101968 101704 101957 102514 102983 103252 103375 103257 102825 102335 102126 102169 102211 102238 102415
54798 102415 102673 102729 102526 102295 102216 102362 102875 103791 104726 105251 105574 106329 107562 108509 108634 108418 108733 109795 111123
54779 111123 112212 112883 113211 113496 114127 115102 115893 116241 116874 118876 122357 126312 129958 133710 138547 144793
54763 144793 151864 158974 165703 171984 177855 183197 187518 190052 190311 188471 185016 180118 173759 166431
54749 166431 159280 153281 148535 144513 140782 137286 134208 131839 130373 129583 128863 127873 126879 126192 125594 124810
54733 124810 124181 124157 124237 123373 121640 120635 121713 124430 127384 130076 133186 137309 142255 147598 153175 158811
54717 158811 164078 168605 172275 174936 176218 175873 174080 171166 167234 162306 156745 151241 146333 142069
54703 142069 138197 134587 131375 128746 126724 125257 124312 123709 122960 121629 119880 118369 117469 116901 116304 115801
54687A15801j69j13o00j047q12j82k2n67j140j080n17kK46M13N51L83k37r64j302
54668A08640j146p49k26M97J202J299N25n66j136r91o50n73o44m67J5L79J96l79
54650A05226p19n08j64j34r6M92J235J129J59m64q2M52K79j8M41J110P84l98j093
54631A07631p50j66k2j29k26m09n03q9N58N94l8m18j33Q3l13p55n96j27J08K16
54611A04516M44N13J40l15m00j87J51P62J512J683R31l8m26l80l52j88L17N87
54593A09270P0n89k89Q43J581J312O15Q6l86r72j420j504j390j208q33k60K05
54576A05131M28O81J178J629J549Q12j92q91r70n66j03J19Q7o2j41O8N96R99P57
54557A11109M0l33N1O40P45M42K59L66N11M82K32j85m64j64P24J608J991J908
$$ plain form
54687 115801 115632 115519 114919 113872 113060 112878 112856 112289 111149 110069 109552 109550 109796 110209 110760 111143 110906 109942 108640
54668 108640 107494 106745 106519 107016 108218 109517 110042 109476 108340 107349 106699 106126 105482 105015 105030 105409 105605 105226
54650 105226 104507 103999 103835 103701 103605 104097 105332 106461 106620 106156 106074 106526 106805 106787 107228 108338 109122 108724 107631
54631 107631 106881 106715 106693 106564 106338 105929 105426 105337 105895 106489 106451 106033 105900 105983 105670 104915 104319 104192 104300 104516
54611 104516 104960 105473 105613 105298 104898 104711 104862 105624 107136 108819 109750 109712 109286 108906 108554 108366 108683 109270
54593 109270 109340 108751 108462 109305 110886 112198 112813 112899 112513 111541 110121 108617 107227 106019 105186 104926 105131
54576 105131 105559 106240 107418 109047 110596 111408 111216 110325 109355 108789 108686 108805 108892 108830 108689 108757 109353 110352 111109
54557 111109 111149 110816 110867 111507 112252 112694 112953 113319 113830 114312 114544 114359 113895 113731 114455 116063 118054 119962
54539A19962J490O93k26o09k59J78K35K68M97K83p65j727j596r52j068j754j572
54522A13078j90J013J027N06M70Q03Q19M64J81P6p5k80l27j32J81M24L41j85q10
54503A17384r25l82K40L17j33n09k79N35J310J337N47l96q45p22j50R02K120K517
54485A22868J483j49r87q51p63j230j549j017J48J333K167K341J643N09k03l03
54469A25440l76n47j32J093K162K217J723J574J708J451P24N1l49o26p52o65p01
54452A33995j105j365q26J50N12m7p90j110j195j294j160o30j63k18n13m42K6
54435A23825L40J78j86l52k91k31k63k01J53P57J334J635J605J331R18N04L06
54418A31362M56P72Q37M13k49o14l91J69M95K69k64n00r7O62J150J071P70P48
$$ plain form
54539 119962 121452 122145 121919 121310 121051 121229 121464 121732 122229 122512 121747 120020 118424 117472 116404 114650 113078
54522 113078 112888 113901 114928 115434 115904 116707 117526 117990 118171 118247 118172 117892 117565 117433 117614 118038 118379 118194 117384
54503 117384 116459 116077 116317 116634 116501 115992 115713 116248 117558 118895 119442 119046 118201 117479 117329 118231 120351 122868
54485 122868 124351 124202 123215 122364 121601 120371 118822 117805 117953 119286 121453 123794 125437 125946 125743 125440
54469 125440 125064 124517 124385 125478 127640 129857 131580 133154 134862 136313 137037 137088 136739 136113 135361 134696 133995
54452 133995 132890 131525 130699 130849 131361 131314 130524 129414 128219 126925 125765 125135 124972 124754 124241 123799 123825
54435 123825 124165 124343 124157 123805 123514 123283 123020 122819 122972 123729 125063 126698 128303 129634 130552 131056 131362
54418 131362 131818 132590 133427 133840 133591 132977 132586 132755 133250 133519 133255 132755 132658 133320 134470 135541 136311 137059
54400A37059J044J237J119R59J043J158R01K86k35l66k10O2M61Q95J049P19Q5
54383A47266m80p40o99n92p66j267j570j055J12J067J365J497K016K663K817K450
54367A54084K149K409L231M188M562L785K145P45L05L18j82j396k735l583l560
54352A66465k492r00p6p79k127k645k213j960k380k759k575k303k331k172j418
54337A37335o24n27r28j080p94m92m03l29n8L70P71R31P44M78O16J233J743J542
54319A40528P15r7m11k11K07N06N17K93n2n50j233j824j888j365p06l96n50r00
54301A32583r99n29L58J047J109P95N36K57l33r89j156q07l70J30J018K033K358
54284A37041J780J050P70O14R1o32j029q70k30O10J059O57j79n12k47k69q60j015
$$ plain form
54400 137059 138103 139340 140459 141418 142461 143619 144520 144806 144571 144205 143995 144057 144518 145413 146462 147181 147266
54383 147266 146786 146046 145347 144755 143989 142722 141152 140097 140209 141276 142641 144138 146154 148817 151634 154084
54367 154084 156233 158642 161873 166061 170623 174408 176553 177298 177603 177921 177739 176343 173608 170025 166465
54352 166465 163973 163073 162997 162218 160091 157446 155233 153273 150893 148134 145559 143256 140925 138753 137335
54337 137335 136711 136184 135256 134176 133382 132890 132487 132158 132100 132470 133241 134172 134916 135394 136010 137243 138986 140528
54319 140528 141243 141146 140735 140524 140731 141237 141754 142047 141995 141445 140212 138388 136500 135135 134429 134033 133483 132583
54301 132583 131584 131055 131413 132460 133569 134364 134900 135157 134824 133835 132679 131872 131502 131632 132650 134683 137041
54284 137041 138821 139871 140641 141255 141346 140714 139685 138815 138585 139195 140254 140911 140732 140220 139973 139704 138844 137829
54266A37829JJ325J617Q53P9p8L05J127K221K893K472J283L17QlrP9K58K92J26
54246A52995q8l08m35r6P85J423R39l14j025n68L20P00N28L12K77K94K54P4m06
54227A55661j260k234k837k667j683l02Q06J179Q51J71m91p67m22K32M34j31q38
54210A45702r24n13k61l15k40J09L36J64k50p02j116j248q03K8O28O69M21K15
54192A41900J08J44M14O57L28o16j390j157N2J426K163J993J208L95k8j11q1J62
54174A47567Q69J759K030J295Q5q51j362j663j671j159l97o3m34j085j418j243
54158A42259p04oN81P03K38m15o32k01M55P59N66K08O2K04M11M29J64k59o41q92
54138A43289j033j037p99l77l8R5K63P06J280J654J741J587J073K43k76J46J132
$$ plain form
54266 137829 137830 139155 140772 141625 141704 141626 141931 143058 145279 148172 150644 151927 152244 152252 152249 152240 152319 152577 152869 152995
54246 152995 152907 152599 152164 152068 152853 154276 155215 154901 153876 153308 153628 154328 154856 155168 155445 155739 155993 156067 155661
54227 155661 154401 152167 149330 146663 144980 144678 145484 146663 147514 147685 147194 146427 146005 146237 146671 146540 145702
54210 145702 144778 144265 144004 143689 143449 143558 143894 144058 143808 143106 141990 140742 139939 139967 140595 141264 141685 141900
54192 141900 142008 142152 142566 143223 143551 142935 141545 140388 140440 141866 144029 146022 147230 147625 147597 147486 147405 147567
54174 147567 148436 150195 152225 153520 153605 152754 151392 149729 148058 146899 146502 146439 146005 144920 143502 142259
54158 142259 141555 141549 142130 142833 143071 142656 142024 141823 142278 143037 143603 143811 143873 144077 144488 144917 145081 144822 144181 143289
54138 143289 142256 141219 140420 140043 140005 140100 140363 141069 142349 144003 145744 147331 148404 148647 148371 148517 149649
54121A49649J576J129O43Q44J264J058K69l21k47L65J235K035K347K121J933K301
54105A68201K978L447L755M129M111K954R22p07j184j068j219j654j792j413r00
54090A80560p51j134j726j947j501p93n00p56j044r73p32o97q91j005p04J11J101
54073A66618J512Q66l62j091q25r8M09O58R11J050P64K25K6L78P46N03k63p99
54055A71228n78J33O52P22O51P47R52J137J357J627J833K066K645L473L813L265
54039A95723K547K720L878N176N963O227O140N863N686N681N307M123K764K275
54025B60073K588K630K040J600J681J543P43J00L01N48k82j843k802k706k263
54010B63951k092k279k986m345n724o152n579m909m624m330l779l352l140k572
$$ plain form
54121 149649 151225 152354 152997 153841 155105 156163 156432 156111 155864 156229 157464 159499 161846 163967 165900 168201
54105 168201 171179 174626 178381 182510 186621 189575 190497 189790 188606 187538 186319 184665 182873 181460 180560
54090 180560 179809 178675 176949 175002 173501 172708 172208 171452 170408 169435 168703 168006 167115 166110 165406 165517 166618
54073 166618 168130 168996 168634 167543 166718 166620 167029 167687 168598 169648 170412 170637 170663 171041 171787 172290 172027 171228
54055 171228 170650 170783 171435 172157 172808 173555 174507 175644 177001 178628 180461 182527 185172 188645 192458 195723
54039 195723 198270 200990 204868 210044 216007 222234 228374 234237 239923 245604 250911 255034 257798 260073
54025 260073 262661 265291 267331 268931 270612 272155 272898 272998 273299 273847 273565 271722 268920 266214 263951
54010 263951 261859 259580 256594 252249 246525 240373 234794 229885 225261 220931 217152 213800 210660 208088
53996B08088j532r23j401k225k188j222k72R1K0l64j128j853j717n76O93J241
53980A94732J252J441K046K675K986L101L415M210N464O848P920Q371Q014O643
53966B59118M114O87k927n880p497p479o226m859m347m422l918k383p41OR4L88
53950B13728R61J149P30K48J82N09J142K052K939L341L252L090L111L305L799
53935B43538M707N506N428M545L751L473L146K318J430J141J454J980K441K633
53921B87491K503K573L549N136O095N918N581O061O992P483P414P084O370N177
53907C65427M003L087J768k63j878j969j299j367k007j841q75p21j986l316l636
53892C53127l769m875o541p530p615p640q160q822q880p898o127m420l491l210
$$ plain form
53996 208088 206556 205633 204232 202007 199819 198597 198325 198416 198436 198072 196944 195091 193374 192798 193491 194732
53980 194732 195984 197425 199471 202146 205132 208233 211648 215858 221322 228170 236090 244461 252475 259118
53966 259118 263232 263919 260992 255112 247615 240136 233910 229051 224704 220282 216364 213981 213240 213246 213340 213728
53950 213728 214689 215838 216568 216816 216998 217507 218649 220701 223640 226981 230233 233323 236434 239739 243538
53935 243538 248245 253751 259179 263724 267475 270948 274094 276412 277842 278983 280437 282417 284858 287491
53921 287491 289994 292567 296116 301252 307347 313265 318846 324907 331899 339382 346796 353880 360250 365427
53907 365427 369430 372517 374285 374022 372144 370175 368876 367509 365502 363661 362786 362065 360079 356763 353127
53892 353127 349358 344483 337942 330412 322797 315157 306997 298175 289295 281397 275270 270850 267359 264149
53878B64149l003k830l067l539l579l160k981l165k930j972j162j252j809k091
53864B27609k208k488k494j686o57o36j829l075l232k345j281p03n84n87o89j202
53848B01913k066k487j825o05P5M4J42O94R27K90n36o58k69j94o33j057j079q27
53830A91849o34o76p56l55P22J709J580N24o2N44J415J434Q34N59P92J087J349
53813B01915J768K137K065J735J670J961K362K817L339L690L781M022M698N360
53799B43320N508N445N630N662M855L520K679K597K548K067J523J336J338J199
53785B89227R53Q04P96P35K63q52k263l218l507l813m672n645o038n929n680n100
53769B46061m016l212l535m398m430l480k711k627k421j556p31o51r11q03m44
$$ plain form
53878 264149 261146 258316 255249 251710 248131 244971 241990 238825 235895 233923 232761 231509 229700 227609
53864 227609 225401 222913 220419 218733 218076 217440 215611 212536 209304 206959 205678 204975 204391 203804 203115 201913
53848 201913 199847 197360 195535 194930 195005 195049 195191 195885 196812 197102 196566 195908 195639 195445 194812 193755 192676 191849
53830 191849 191215 190539 189783 189428 190150 191859 193439 193963 193901 194445 195860 197294 198128 198687 199479 200566 201915
53813 201915 203683 205820 207885 209620 211290 213251 215613 218430 221769 225459 229240 233262 237960 243320
53799 243320 248828 254273 259903 265565 270420 273940 276619 279216 281764 283831 285354 286690 288028 289227
53785 289227 290180 290984 291780 292515 292778 291926 289663 286445 282938 279125 274453 268808 262770 256841 251161 246061
53769 246061 242045 238833 235298 230900 226470 222990 220279 217652 215231 213675 212944 212293 211382 210579 210135
53754B10135l91p46j251j763k119j967j227l47K02L65J93l19q67p97Q5J146J669
53737B02001J553J007J13q53j214o28K94O84M84L66P19J234J403J060M25p5p9
53720B08494M60J234J896K254K188J676J001P01J074J815K315K204J629J096J065
53705B31102J508J891J809J491J419J600J693J725K127K970L727L951L762L454
53691B64229L168L058L250L390K760J230l74j151j071o88m04l95q24j550j955
53676B72673j576q31n20p72r56o86l25l35n63m85l5K12k05r60j238p58r1K09M17
53657B63175J104J990K119J197J49j27J13M2l82m15L07J252J776J906K064K347
53641B78617K432K107J590J313J521K157K953L541L538K813J667O04r7m98o66
$$ plain form
53754 210135 209744 208998 207747 205984 203865 201898 200671 200324 200526 200891 201084 200765 199898 199101 199186 200332 202001
53737 202001 203554 204561 204674 203821 202607 201979 202273 202957 203441 203807 204526 205760 207163 208223 208648 208573 208494
53720 208494 208954 210188 212084 214338 216526 218202 219203 219904 220978 222793 225108 227312 228941 230037 231102
53705 231102 232610 234501 236310 237801 239220 240820 242513 244238 246365 249335 253062 257013 260775 264229
53691 264229 267397 270455 273705 277095 279855 281085 280711 279560 278489 277801 277397 277002 276178 274628 272673
53676 272673 271097 270266 269746 268974 268018 267332 267007 266672 266109 265624 265589 265801 265596 264636 263398 262640 262549 262758 263175
53657 263175 264279 266269 268388 269585 269734 269607 269720 269762 269380 268965 269272 270524 272300 274206 276270 278617
53641 278617 281049 283156 284746 286059 287580 289737 292690 296231 299769 302582 304249 304853 304756 304258 303592
53626C03592n26j23K39L59M04O51J162J884K761L537L789L474L169L358L792L972
53610C35494L946M123M500M731M687M422L766K669J701J484J704J495Q53O80J320
53595C77575J960J777R10m7q16j298j358j159j165j412j362q22l77n44j080j518
53579C69264j811j981j812j340j099j328j548j426j370j731k021j681j051p60
53565C48305o73k66L26N66M98O43J008J095P67M10K40J70K03L77M81M67Q69J973
53547C57459K887K453J055L55J128K392K995L048L192L388L217K854K951L777
53533C93151M985O046O570O491O272O676P955R475J0461J0903J1376J2171J2935
53520E05467J3118J2617J2000J2169J3564J5614J7214J7898J8206J8828J9870
$$ plain form
53626 303592 303066 302943 303182 303541 303945 304596 305758 307642 310403 313940 317729 321203 324372 327730 331522 335494
53610 335494 339440 343563 348063 352794 357481 361903 365669 368338 370039 371523 373227 374722 375575 376255 377575
53595 377575 379535 381312 382222 382175 381359 380061 378703 377544 376379 374967 373605 372783 372406 371862 370782 369264
53579 369264 367453 365472 363660 362320 361221 359893 358345 356919 355549 353818 351797 350116 349065 348305
53565 348305 347632 347366 347692 348258 348756 349399 350407 351502 352269 352679 352919 353089 353292 353669 354150 354617 355486 357459
53547 357459 360346 362799 363854 364209 365337 367729 370724 373772 376964 380352 383569 386423 389374 393151
53533 393151 398136 404182 410752 417243 423515 430191 438146 447621 458082 468985 480361 492532 505467
53520 505467 518585 531202 543202 555371 568935 584549 601763 619661 637867 656695 676565
53509F76565K1226K3068K5369K7307K7921K7355K6696K6495K6102K4835K3094
53498I56033K1797K1027K0007J8399J6907J6344J6581J6839J6740J6565J6597
53487A153836J6694J6660J6646J6951J7589J8254J8619J8594J8335J8015J7522
53476A347715J6490J4772J2762J0931R166O959M219J358j416m292p169r408j0704
53463A391383j1617j2726j3741j4059j3805j3664j3955j4560j5485j6766j7998
53452A233007j8751j9309k0139k0765k0248j8845j8006j8334j8647j7792j6292
53441A025879j5188j4084j1739q218n063l264k267j309n54l58k77L14J212J851
53427I66935K372L441N078O547P473Q291R413J0671J1920J3558J5868J8337K0242
$$ plain form
53509 676565 697791 720859 746228 773535 801456 828811 855507 882002 908104 932939 956033
53498 956033 977830 998857 1018864 1037263 1054170 1070514 1087095 1103934 1120674 1137239 1153836
53487 1153836 1170530 1187190 1203836 1220787 1238376 1256630 1275249 1293843 1312178 1330193 1347715
53476 1347715 1364205 1378977 1391739 1402670 1411836 1418795 1423014 1424372 1422956 1418664 1411495 1402087 1391383
53463 1391383 1379766 1367040 1353299 1339240 1325435 1311771 1297816 1283256 1267771 1251005 1233007
53452 1233007 1214256 1194947 1174808 1154043 1133795 1114950 1096944 1078610 1059963 1042171 1025879
53441 1025879 1010691 996607 984868 976650 971587 968323 966056 964747 964193 963835 963558 963872 965084 966935
53427 966935 969307 972748 977826 984373 991846 1000137 1009550 1020221 1032141 1045699 1061567 1079904 1100146
53414A100146K1623K3028K4479K5440K5796K6179K7092K8368K9720L1257L3035
53403A396163L4641L5803L7004L8944M1508M3920M5825M7681M9954N2309N3881
53392A877633N4149N3510N3000N3426N4558N5293N4800N3315N1594M9861M7761
53381B458900M5171M2464L9839L6931L3324K9075K4513J9842J5196J0792O674
53370B762721K504k151p369j2999j9045k5624l2514l9001m4314m8061n0318n1443
53358B432386n1831n1731n1210n0381m9595m9146m8738m7587m5321m2590m0383
53347A903873l8883l7509l6140l5572l6310l7450l7537l6280l4594l3008l0948
53336A509642k7927k4575k1914k0127j8674j7176j5555j3614j1303r313q736r985
$$ plain form
53414 1100146 1121769 1144797 1169276 1194716 1220512 1246691 1273783 1302151 1331871 1363128 1396163
53403 1396163 1430804 1466607 1503611 1542555 1584063 1627983 1673808 1721489 1771443 1823752 1877633
53392 1877633 1931782 1985292 2038292 2091718 2146276 2201569 2256369 2309684 2361278 2411139 2458900
53381 2458900 2504071 2546535 2586374 2623305 2656629 2685704 2710217 2730059 2745255 2756047 2762721
53370 2762721 2765225 2763074 2755705 2742706 2723661 2698037 2665523 2626522 2582208 2534147 2483829 2432386
53358 2432386 2380555 2328824 2277614 2227233 2177638 2128492 2079754 2032167 1986846 1944256 1903873
53347 1903873 1864990 1827481 1791341 1755769 1719459 1682009 1644472 1608192 1573598 1540590 1509642
53336 1509642 1481715 1457140 1435226 1415099 1396425 1379249 1363694 1350080 1338777 1329464 1320728 1310743
53324A310743j2410j4921j6597j6914j5973j4611j3653j3025j2025j0497r060
53313A161057q125p342o318n197m146k882j269R1N78N84J191K904N272P672R906
53298A153976J1922J3582J4925J6318J8048J9999K1927K3747K5401K6622K7171
53287A373638K7122K6638K5610K3834K1527J9317J7583J5993J3884J0964P540
53276A583650M118R79j949m902p987j1001j3580j5535j7011j8307j9680k1322
53264A457473k3262k5101k6149k6140k5665k5582k6057k6598k6884k7066k7226
53253A171743k7109k6617k6078k5714k5263k4459k3568k3060k2940k2825k2494
53242I01616k1980k1299k0453j9628j9053j8665j8168j7387j6364j5132j3652
$$ plain form
53324 1310743 1298333 1283412 1266815 1249901 1233928 1219317 1205664 1192639 1180614 1170117 1161057
53313 1161057 1152932 1145590 1139272 1134075 1129929 1127047 1125778 1125869 1126447 1127031 1128222 1131126 1136398 1144070 1153976
53298 1153976 1165898 1179480 1194405 1210723 1228771 1248770 1270697 1294444 1319845 1346467 1373638
53287 1373638 1400760 1427398 1453008 1476842 1498369 1517686 1535269 1551262 1565146 1576110 1583650
53276 1583650 1587768 1588747 1586798 1581896 1573909 1562908 1549328 1533793 1516782 1498475 1478795 1457473
53264 1457473 1434211 1409110 1382961 1356821 1331156 1305574 1279517 1252919 1226035 1198969 1171743
53253 1171743 1144634 1118017 1091939 1066225 1040962 1016503 992935 969875 946935 924110 901616
53242 901616 879636 858337 837884 818256 799203 780538 762370 744983 728619 713487 699835
53231F99835j1955j0195q592p335o466n826n343n372o347q065r705j0805j1734
53218E92095j2922j4142j4908j5136j4925j4233j3257j2554j2169j1228r286p477
53206D39858p139p738p516o169n358o175p574q071p839q056q890r330q757p631
53192C33615o741o369o299o190n814n319n084n192n252m909m298l696l094k445
53178B62913k009k029k272k318k121j935j861j823j858j990j964j466o21P1K42
53163B38959o3n86j048j215j036o78l07R6N09O81M31l7l48m14m38n15n13l49j89
53144B32940k98p51j260j350q69k69j05l12l13P5L73K54L5L8J3k54k86M81J690
53125B29832K455K592K676K909K776K013J222J084J479J796J737J405R59N42L88
$$ plain form
53231 699835 687880 677685 669093 661758 655292 649466 644123 638751 632404 624339 614634 603829 592095
53218 592095 579173 565031 550123 534987 520062 505829 492572 480018 467849 456621 447335 439858
53206 439858 432719 424981 417465 411296 405938 399763 392189 384118 376279 368223 359333 350003 341246 333615
53192 333615 326874 320505 314206 308016 302202 296883 291799 286607 281355 276446 272148 268452 265358 262913
53178 262913 260904 258875 256603 254285 252164 250229 248368 246545 244687 242697 240733 239267 238646 238717 238959
53163 238959 238896 238310 237262 236047 235011 234333 234026 234122 234631 235312 235743 235706 235358 234944 234506 233991 233478 233129 232940
53144 232940 232642 231891 230631 229281 228412 228143 228038 227726 227413 227488 227861 228115 228150 228188 228201 227947 227661 228142 229832
53125 229832 232287 234879 237555 240464 243240 245253 246475 247559 249038 250834 252571 253976 254935 255477 255865
53110B55865N66P05L16n89j491j966k076k139k262k297k073j614j062n50j82n2
53094B39099j58l36m16m88p84j253j462j169p38p08j057j276j179j179j575j941
53078B23380j642p77j57l20q47r32l06N82J213J412J211O53o4n86p39p04o61n07
53060B20209k01j09n38j119j171o56k35k54k78J30P57J182J423J658J715J327
53044B23840P05K88J04j46m54m98k81k20n17q03o53j21M10O42M98P1m00o29n46
53025B21290l43j88o3J09L35O05R04J082Q75K90k46k41K95R01J158J101R98R16
53007B29778O60J44l24l74j02j0l07n57k58L84O11O0p54j056n94K78J112J625
52989B30316J613J074M16K73Q30J559J838J691J556J558J439J213J283J689J801
$$ plain form
53110 255865 256431 257136 257452 256863 255372 253406 251330 249191 246929 244632 242559 240945 239883 239333 239151 239099
53094 239099 238941 238605 238189 237701 236917 235664 234202 233033 232295 231587 230530 229254 228075 226896 225321 223380
53078 223380 221738 220961 220804 220484 219637 218705 218399 218981 220194 221606 222817 223470 223406 222820 222081 221377 220716 220209
53060 220209 220008 219899 219361 218242 217071 216415 216180 215926 215648 215778 216535 217717 219140 220798 222513 223840
53044 223840 224545 224833 224937 224791 224337 223839 223558 223338 222821 222018 221365 221244 221654 222296 222794 222865 222465 221836 221290
53025 221290 220947 220759 220696 220805 221140 221745 222649 223731 224606 224896 224650 224409 224704 225605 226763 227864 228862 229778
53007 229778 230438 230582 230258 229884 229782 229772 229465 228908 228650 229034 229645 229705 228951 227895 227301 227579 228691 230316
52989 230316 231929 233003 233419 233692 234522 236081 237919 239610 241166 242724 244163 245376 246659 248348 250149
52974B50149J181L46L8P7l21j148j413n72O13J133J053J147J517J404L77q72j286
52957B53423o94M3N1o80j467j785j695j564j592j765j962j980j631j008m71j74
52941B35049J54O53R60P69L99L13L16o5o02o00j00K6o22j384j482r05n3P66J168
52922B34760P23l97j386j756j705j377o04K77L22n41r77mJ514K097J599Q51J28
52905B33524p45j309r15o7P4o16j230j419j583j568o45Q65J465N74n15m56M73
52888B25907J237J512J527J239O57L16N73R03P15L34M64J019J301J050O79O37
52872B40070J113K049K933K952J900O53J91M63Q63J307K037K684K494J493N16
52857B63718J6m09j180k179l196m253n153n328m515l220k176j689j671j935k239
$$ plain form
52974 250149 251330 251676 251714 251791 251470 250322 248909 248337 248950 250083 251136 252283 253800 255204 255581 254709 253423
52957 253423 252729 252772 252823 252143 250676 248891 247196 245632 244040 242275 240313 238333 236702 235694 235223 235049
52941 235049 235203 235856 236816 237585 237984 238297 238613 238548 237946 237346 237246 237272 236650 235266 233784 232879 232826 233592 234760
52922 234760 235483 235086 233700 231944 230239 228862 228258 228535 228857 228316 227339 227335 228849 230946 232545 233396 233524
52905 233524 232779 231470 230555 230488 230562 229946 228716 227297 225714 224146 223501 224366 225831 226405 225890 225434 225907
52888 225907 227144 228656 230183 231422 232079 232395 232968 233871 234586 234920 235384 236403 237704 238754 239433 240070
52872 240070 241183 243232 246165 249117 251017 251670 251861 252324 253187 254494 256531 259215 261709 263202 263718
52857 263718 263734 263325 262145 259966 256770 252517 247364 242036 237521 234301 232125 230436 228765 226830 224591
52842B24591k364k378k476k486j969r82j66J51L46O12M16n15j263p90M71J184
52826B12382J107J281J976J935L45j495j699l17Q97Q61J23m84q40r09k52J167
52810B16078K454K755K257J636J043K17p18j306j438j416j442j450j418j409j365
52795B14478j153p46k06L22N27J34o14j059r54p73q45p97k62L44M52K52K68M04
52777B09772K12j87l08j80j74j37L73J056J033J57p02q82o08l28j01J22K51L18
52759B09687M39M65K89L45J001J590J144N3k32O17J296R71N09Q25J339J155P46
52742B22239J156K216K841K718K455K381K210J866J580J280P03J18J29O82R96
52727B45570O03j45o56p28n41m65q47j625k210k104j532j069q16m40Q3L14j0n43
$$ plain form
52842 224591 222227 219849 217373 214887 212918 211936 211770 211921 212267 212879 213295 212780 211517 210727 211198 212382
52826 212382 213489 214770 216746 218681 219026 217531 215832 215515 216412 217273 217396 216912 216072 215163 214911 216078
52810 216078 218532 221287 223544 225180 226223 226440 225722 224416 222978 221562 220120 218670 217252 215843 214478
52795 214478 213325 212579 212373 212695 213222 213356 212742 211683 210729 209956 209111 208314 208052 208396 208848 209100 209368 209772
52777 209772 209984 209797 209489 209309 209135 208998 209371 210427 211460 211617 210915 210033 209425 209097 208996 209118 209369 209687
52759 209687 210126 210591 210880 211225 212226 213816 214960 215013 214781 215398 216694 217665 218174 218999 220338 221493 222239
52742 222239 223395 225611 228452 231170 233625 236006 238216 240082 241662 242942 243645 243763 243892 244574 245570
52727 245570 246173 246028 245372 244644 244103 243638 242791 241166 238956 236852 235320 234251 233435 232995 233078 233392 233382 232839
52709B32839p25l74R9R6m66q74l98O56J191P04j70o94q59q07l08N97J195J054
52691B32756P61Q79Q96J84o67o50k8O3n09p32k09J93k44j081j500j324q77m79
52673B27432l53m97n36j68K61K32p9j1N36J098J498J853J886J255N49P59J740
52656B37455K281J979J778K284K758K473J831J394P69n36j996k743k770k527j965
52641B42465q98R6K05m23q43n47J39P77J184J268J096J094J639K584L549M426
52625B57811N050M741K912P6k487m025m727m879m352l125j777j037j063j382j388
52610B40348q12R1P83R52Q05P66R63J134J007O04K33K08N32Q25P27L41Nk53o27
52591B48632r15o09J85N63j4r17j157o30M7N30R20J224J287J184J082Q21J70n63
$$ plain form
52709 232839 232114 231740 231839 231935 231469 230595 230197 230853 232044 232748 232578 231884 231025 230218 229910 230507 231702 232756
52691 232756 233517 234396 235292 235476 234809 234159 234131 234194 233685 232953 232744 232937 232693 231612 230112 228788 227911 227432
52673 227432 227079 226582 226046 225878 226139 226371 226292 226281 226817 227915 229413 231266 233152 234407 234956 235715 237455
52656 237455 239736 241715 243493 245777 248535 251008 252839 254233 255002 254466 252470 249727 246957 244430 242465
52641 242465 241567 241663 241868 241445 240602 240055 240194 240971 242155 243423 244519 245613 247252 249836 253385 257811
52625 257811 262861 267602 270514 270590 268103 264078 259351 254472 250120 246995 245218 244181 243118 241736 240348
52610 240348 239536 239627 240410 241362 242167 242933 243896 245030 246037 246641 246874 247082 247614 248439 249166 249507 249512 249259 248632
52591 248632 247717 247108 247293 247856 247842 246925 245768 245138 245185 245715 246635 247859 249146 250330 251412 252233 252403 251840
52573B51840p48l00K11K86j1l67n40l80M5L10M6n15q46r08j071j266r54r2N06
52554B45246K63l22m42j27mj82j55K44N06K70j10j55M3R7L4J44L20J69k02j09
52534B45528O76J371J128K11l46j02L35K78j85n01m01p4J61J68P1P3J70J58M3
52515B48762K10Q50J469J540J380J709K416K631K125J703J922K240J983J313O34
52500B72887k46j562k777l228l136l162l210k669j648j024j250j851k232k249
52486B42643j882j073j10M15L39J77M20R55J389J598J713J802J701J198L26l94
52470B51217l12O05J561J852J664J644J967K314K481K449K112J543J316J752K165
52455B76330J572J01j245k083k901l726l744k696j575j333j621j593j248j217
$$ plain form
52573 251840 251092 250792 251003 251289 251278 250911 250371 249991 250036 250346 250392 249877 249031 248123 247052 245786 244832 244740 245246
52554 245246 245509 245187 244745 244618 244614 244432 244277 244521 245027 245297 245187 245032 245075 245172 245206 245350 245670 245839 245637 245528
52534 245528 246204 247575 248703 248914 248568 248466 248801 249079 248894 248393 247992 247918 248079 248247 248318 248391 248561 248719 248762
52515 248762 248972 249822 251291 252831 254211 255920 258336 260967 263092 264795 266717 268957 270940 272253 272887
52500 272887 272641 271079 268302 265074 261938 258776 255566 252897 251249 250225 248975 247124 244892 242643
52486 242643 240761 239688 239578 239993 240332 240509 240929 241884 243273 244871 246584 248386 250087 251285 251611 251217
52470 251217 250905 251510 253071 254923 256587 258231 260198 262512 264993 267442 269554 271097 272413 274165 276330
52455 276330 277902 278003 276758 274675 271774 268048 264304 261608 260033 258700 257079 255486 254238 253021
52441B53021j606j867j634j080n46k47k14k80k24j47m10r56j114m20O77J295J086
52424B45334M20j50l27j51P7J28K27P68J581J976J722J455J725K225K420K475
52408B61905K962M027N450P198R216J0837J1033R320O059K000k048n256p022p287
52394C08394o438n058l885l500l721l633k718j588j101j173j104p14l41P1R71
52379B74462K273L199L190K469J627J211J585K559L326L420L533M541N902O187
52365C19484N211M328M184L599J515j055k239j756r38o58n17j6N39O32L21M5J53
52348C32832P48J646K347K431K071J884K203K846L561M264M787M866M624M665
52334C75775N453O754P992Q905R708J0673J1798J2860J3650J4215J4874J5960
$$ plain form
52441 253021 251415 249548 247914 246834 246288 246041 245827 245547 245323 245176 244766 243810 242696 242276 242953 244248 245334
52424 245334 245754 245604 245277 245126 245203 245331 245558 246326 247907 249883 251605 253060 254785 257010 259430 261905
52408 261905 264867 268894 274344 281542 290758 301595 312628 321948 328007 330007 327959 322703 315681 308394
52394 308394 301956 296898 293013 289513 285792 282159 279441 277853 276752 275579 274475 273761 273420 273491 274462
52379 274462 276735 279934 283124 285593 287220 288431 290016 292575 295901 299321 302854 307395 313297 319484
52365 319484 324695 329023 333207 336806 338321 337266 335027 333271 332333 331675 331158 331142 331681 332313 332634 332679 332832
52348 332832 333580 335226 337573 340004 342075 343959 346162 349008 352569 356833 361620 366486 371110 375775
52334 375775 381228 387982 395974 404879 414587 425260 437058 449918 463568 477783 492657 508617
52322E08617J7464J8966J9964K0220J9860J9248J8795J8769J9144J9651J9995
52311G20693K0050J9906J9757J9681J9440J8685J7433J6257J5749J5756J5431
52300I18838J4126J2077J0058Q535P354O165M897L600K079p0k913n927q437j0237
52286I60145j1501j2182j1908j0623q975p684o714n463l769k179j144l11R92K885
52272H81569M921O833Q813J0935J2701J3519J3466J3254J3373J3558J3276J2618
52260A018836J2347J3010J4230J5038J4846J3904J2886J2238J1974J1842J1422
52249A162573J0241Q036N010J722j339m020o396q578j0648j2579j4085j4765j4646
52236A100526j4448j4949j6062j6845j6563j5427j4127j2969j1806j0659r849
$$ plain form
52322 508617 526081 545047 565011 585231 605091 624339 643134 661903 681047 700698 720693
52311 720693 740743 760649 780406 800087 819527 838212 855645 871902 887651 903407 918838
52300 918838 932964 945041 955099 963634 970988 977153 982050 985650 987729 987659 984746 978819 970382 960145
52286 960145 948644 936462 924554 913931 904956 897272 890558 885095 881326 879147 878003 877692 878684 881569
52272 881569 886490 893323 902136 913071 925772 939291 952757 966011 979384 992942 1006218 1018836
52260 1018836 1031183 1044193 1058423 1073461 1088307 1102211 1115097 1127335 1139309 1151151 1162573
52249 1162573 1172814 1180850 1185860 1187582 1186243 1182223 1175827 1167249 1156601 1144022 1129937 1115172 1100526
52236 1100526 1086078 1071129 1055067 1038222 1021659 1006232 992105 979136 967330 956671 946822
52225I46822r522r327q805p812o476m985l517k271j391r03p52o90k61Q74K449
52210H93433L768M506N035N693O104N585M081K373J378J528K594L833M443M297
52196I48651M079M349M647M139L042K661L695N233N869N292M222L170J981M99
52182A001529j026k313l477m779o216p455q091q032p655p553p836p882p010n357
52168I16847l744k749k218j710j030k23O39J455K129K742L453M143M381L910L003
52153I31028K165J628J274Q90L77j24k43L20J383K378K904K994K780K284J704
52138I53742J477J700J871J646J579K440M001N262N886O738Q724J1694J4918J8050
52124A039728K1102K3831K5782K7010K8089K9323L0351L0691L0380K9759K8903
$$ plain form
52225 946822 937300 927973 919168 911356 904880 899895 896378 894107 892716 891813 891061 890371 890110 890984 893433
52210 893433 897201 901707 906742 912435 918539 924124 928205 930578 931956 933484 936078 939911 944354 948651
52196 948651 952730 957079 961726 965865 968907 971568 975263 980496 986365 991657 995879 999049 1001030 1001529
52182 1001529 1000503 998190 994713 989934 983718 976263 968172 960140 952485 944932 937096 929214 922204 916847
52168 916847 913103 910354 908136 906426 905396 905173 905812 907267 909396 912138 915591 919734 924115 928025 931028
52153 931028 933193 934821 936095 936985 937362 937238 936995 937315 938698 941076 943980 946974 949754 952038 953742
52138 953742 955219 956919 958790 960436 962015 964455 968456 973718 979604 986342 995066 1006760 1021678 1039728
52124 1039728 1060830 1084661 1110443 1137453 1165542 1194865 1225216 1255907 1286287 1316046 1344949
52113A344949K7574K5750K3869K2337K0959J9066J6252J2796R336O327M008K650
52101A535873K344K480J918R8k205l725m348n429q163j2000j5191j6855j7916
52088A456881j9672k1938k3270k2841k1334j9768j8192j6036j3240j0313p536
$$ plain form
52113 1344949 1372523 1398273 1422142 1444479 1465438 1484504 1500756 1513552 1522888 1529215 1533223 1535873
52101 1535873 1538217 1540697 1542615 1542713 1540508 1536783 1532435 1527006 1518843 1506843 1491652 1474797 1456881
52088 1456881 1437209 1415271 1392001 1369160 1347826 1328058 1309866 1293830 1280590 1270277 1262741
$$ [...]
##END NTUPLES=NMR SPECTRUM
##END=
