
##TITLE=AC1307_DOMAH11119_6615730_f1TJ7XtrV2
##JCAMPDX= 6.0         $$ Bruker NMR JCAMP-DX V2.0
##DATA TYPE= NMR SPECTRUM
##DATA CLASS= NTUPLES
##ORIGIN= BRUKER
##OWNER= Administrator
$$ 1.72 TOPSPIN		Version 2.1
$$ 2012-08-02 23:26:03.781 -0500  Administrator@TOPSPIN
$$ Compression mode = diff/dup
##.OBSERVE FREQUENCY= 400.02188249412
##.OBSERVE NUCLEUS= ^1H
##.ACQUISITION MODE= SIMULTANEOUS (DQD)
##.ACQUISITION SCHEME= undefined
##.AVERAGES= 8
##.DIGITISER RES= 22
##SPECTROMETER/DATA SYSTEM= spect
##.PULSE SEQUENCE= zg30
##.SOLVENT NAME= COFFEE_meoh
##.SHIFT REFERENCE= INTERNAL, COFFEE_meoh, 1, 14.98509
##AUDIT TRAIL= $$ (NUMBER, WHEN, WHO, WHERE, PROCESS, VERSION, WHAT)
$$ ##TITLE= Audit trail, TOPSPIN		Version 2.1
$$ ##JCAMPDX= 5.01
$$ ##ORIGIN= Bruker BioSpin GmbH
$$ ##OWNER= Administrator
$$ $$ C:\Bruker\TOPSPIN/data/COFFEE/nmr/AC1307_DOMAH11119_6615730_f1TJ7XtrV2/10/pdata/1/auditp.txt
$$ ##AUDIT TRAIL=  $$ (NUMBER, WHEN, WHO, WHERE, PROCESS, VERSION, WHAT)
(   1,<2012-08-02 23:25:56.609 -0500>,<Administrator>,<TOPSPIN>,<go>,<TOPSPIN 2.1>,
      <created by zg
	started at 2012-08-02 23:24:50.140 -0500,
	POWCHK enabled, PULCHK disabled,
       configuration hash MD5:
       6B 1B 68 BB D9 2E 58 E2 7F 35 AD 54 07 DF 0E 41
       data hash MD5: 64K
       8C 4B 14 23 30 31 4F C5 22 CB 30 8B CB 10 2E A9>)
(   2,<2012-08-02 23:25:59.531 -0500>,<Administrator>,<TOPSPIN>,<proc1d>,<TOPSPIN 2.1>,
      <Start of raw data processing
       efp LB = 0 FT_mod = 6 PKNL = 1 PHC0 = 0 PHC1 = 0 SI = 32K 
       data hash MD5: 32K
       D9 80 31 AD 5A 8C B0 DD 54 9F 95 B1 8E 3A 58 A3>)
(   3,<2012-08-02 23:25:59.890 -0500>,<Administrator>,<TOPSPIN>,<proc1d>,<TOPSPIN 2.1>,
      <pk PHC0 = 177.5885 PHC1 = 0 
       data hash MD5: 32K
       7E 07 D0 18 BE 08 FF 84 8B 36 5B C4 B7 F0 61 35>)
(   4,<2012-08-02 23:25:59.968 -0500>,<Administrator>,<TOPSPIN>,<proc1d>,<TOPSPIN 2.1>,
      <abs ABSG = 1 
       data hash MD5: 32K
       66 3F 88 93 8D AC F8 04 B8 75 C1 FF 34 1E F6 5C>)
(   5,<2012-08-02 23:26:00.015 -0500>,<Administrator>,<TOPSPIN>,<proc1d>,<TOPSPIN 2.1>,
      <abs ABSG = 2 
       data hash MD5: 32K
       35 D9 7E 2D DE 45 DE B1 5F A8 D2 6A 9D 15 4C B8>)
(   6,<2012-08-02 23:26:00.046 -0500>,<Administrator>,<TOPSPIN>,<proc1d>,<TOPSPIN 2.1>,
      <abs ABSG = 3 
       data hash MD5: 32K
       D5 D7 F6 4F FA 34 58 4C EA 81 36 5A F6 7E 4E 6B>)
(   7,<2012-08-02 23:26:00.078 -0500>,<Administrator>,<TOPSPIN>,<proc1d>,<TOPSPIN 2.1>,
      <abs ABSG = 4 
       data hash MD5: 32K
       2C 10 4B B6 A6 1F 80 AF 3F A5 5D E0 1A 9F 97 6C>)
(   8,<2012-08-02 23:26:00.109 -0500>,<Administrator>,<TOPSPIN>,<proc1d>,<TOPSPIN 2.1>,
      <abs ABSG = 5 
       data hash MD5: 32K
       C4 CF D9 EE BF 2C 28 7A B1 7C 6C CE 8B 23 02 A6>)
$$ ##END=
$$ 
$$ $$ hash MD5
$$ $$ 24 41 21 9E 00 43 66 F8 50 0A 12 4E 4F 2C 4B 43
##$RELAX= 
##$RELAX= 
##$RELAX= 
##$RELAX= 
##$RELAX= 
##$RELAX= 
##$RELAX= 
$$ Bruker specific parameters
$$ --------------------------
$$ [...]
##$TP= (0..7)
150 150 150 150 150 150 150 150
##$TP07= 0
##$TPNAME0= <>
##$TPNAME1= <>
##$TPNAME2= <>
##$TPNAME3= <>
##$TPNAME4= <>
##$TPNAME5= <>
##$TPNAME6= <>
##$TPNAME7= <>
##$TPOAL= (0..7)
0.5 0.5 0.5 0.5 0.5 0.5 0.5 0.5
##$TPOFFS= (0..7)
0 0 0 0 0 0 0 0
##$TUNHIN= 0
##$TUNHOUT= 0
##$TUNXOUT= 0
##$USERA1= <user>
##$USERA2= <user>
##$USERA3= <user>
##$USERA4= <user>
##$USERA5= <user>
##$V9= 5
##$VALIST= <valist>
##$VCLIST= <CCCCCCCCCCCCCCC>
##$VD= 0
##$VDLIST= <DDDDDDDDDDDDDDD>
##$VPLIST= <PPPPPPPPPPPPPPP>
##$VTLIST= <TTTTTTTTTTTTTTT>
##$WBST= 1024
##$WBSW= 4
##$XGAIN= (0..3)
0 0 0 0
##$XL= 0
##$YL= 0
##$YMAX_a= 447323
##$YMIN_a= -584701
##$ZGOPTNS= <>
##$ZL1= 120
##$ZL2= 120
##$ZL3= 120
##$ZL4= 120
##$ABSF1= 14.98509
##$ABSF2= -5.573092
##$ABSG= 5
##$ABSL= 3
##$ALPHA= 0
##$AQORDER= 0
##$ASSFAC= 0
##$ASSFACI= 0
##$ASSFACX= 0
##$ASSWID= 0
##$AUNMP= <proc_prof1d_extract_pilot.lims>
##$AXLEFT= 0
##$AXNAME= <>
##$AXNUC= <1H>
##$AXRIGHT= 0
##$AXTYPE= 0
##$AXUNIT= <>
##$AZFE= 0.1
##$AZFW= 0.1
##$BCFW= 0
##$BC_mod= 0
##$BYTORDP= 0
##$COROFFS= 0
##$CY= 15
##$DATMOD= 1
##$DC= 0
##$DFILT= <>
##$DTYPP= 0
##$F1P= 0
##$F2P= 0
##$FCOR= 0.5
##$FTSIZE= 32768
##$FT_mod= 6
##$GAMMA= 0
##$GB= 0
##$INTBC= 1
##$INTSCL= 1
##$ISEN= 128
##$LB= 0
##$LEV0= 0
##$LPBIN= 0
##$MAXI= 10000
##$MC2= 0
##$MEAN= 0
##$ME_mod= 0
##$MI= 0
##$NCOEF= 0
##$NC_proc= -8
##$NLEV= 6
##$NOISF1= 0
##$NOISF2= 0
##$NSP= 0
##$NTH_PI= 0
##$NZP= 0
##$OFFSET= 14.98509
##$PC= 1
##$PHC0= 177.5885
##$PHC1= 0
##$PH_mod= 1
##$PKNL= yes
##$PPARMOD= 0
##$PPDIAG= 0
##$PPIPTYP= 0
##$PPMPNUM= 2147483647
##$PPRESOL= 1
##$PSCAL= 4
##$PSIGN= 0
##$PYNMP= <proc.py>
##$REVERSE= no
##$SF= 400.02
##$SI= 32768
##$SIGF1= 0
##$SIGF2= 0
##$SINO= 400
##$SIOLD= 32768
##$SPECTYP= <>
##$SREGLST= <1H.CDCl3>
##$SSB= 0
##$STSI= 32768
##$STSR= 0
##$SW_p= 8223.68421052631
##$SYMM= 0
##$S_DEV= 0
##$TDeff= 65536
##$TDoff= 0
##$TI= <>
##$TILT= no
##$TM1= 0
##$TM2= 0
##$TOPLEV= 0
##$USERP1= <user>
##$USERP2= <user>
##$USERP3= <user>
##$USERP4= <user>
##$USERP5= <user>
##$WDW= 1
##$XDIM= 32768
##$YMAX_p= 421692022
##$YMIN_p= -781144
##$CURPLOT= <Network HP LaserJet P1505>
##$CURPRIN= <$Network HP LaserJet P1505>
##$DFORMAT= <normdp>
##$LAYOUT= <+/1D_H.xwp>
##$LFORMAT= <normlp>
##$PFORMAT= <normpl>
##$SURQMSG= 1
$$ End of Bruker specific parameters
$$ ---------------------------------
##NTUPLES= NMR SPECTRUM
##VAR_NAME=  FREQUENCY,     SPECTRUM/REAL,   SPECTRUM/IMAG
##SYMBOL=    X,             R,               I
##VAR_TYPE=  INDEPENDENT,   DEPENDENT,       DEPENDENT
##VAR_FORM=  AFFN,          ASDF,            ASDF
##VAR_DIM=   32768,         32768,           32768
##UNITS=     HZ,            ARBITRARY UNITS, ARBITRARY UNITS
##FACTOR=    0.250966925370066, 1,           1
##FIRST=     8223.43324360094, 103657,       81901
##LAST=      0,             28956,           -133122
##MIN=       0,             -781144,         0
##MAX=       8223.43324360094, 421692022,    0
$$ Real data points
##PAGE= N=1
##DATA TABLE= (X++(R..R)), XYDATA
$$ [...]
19494d7567B17476I7865a80663k8575j25359J58261A58948p4142b9788F9488a09373
$$ -47567 217476 97865 -180663 -209238 -334597 -176336 158948 84806 -29788 69488 -109373
19482A1618g253p5794k4746r264H6780G605a30760r5975Q0410r4167A04377b29908
$$ 11618 -7253 -83047 -107793 -117057 86780 7605 -130760 -226735 -146325 -240492 104377 -229908
19469C19449a72776k0411N4937m1040H107a0305E6722M871J82212a56217N1527
$$ 319449 -172776 -193187 -138250 -179290 8107 -10305 56722 61593 243805 -156217 -104690
19458a04690j24112f1291A6180a49315l4732j5641R8627o2852D3110K54318b36191
$$ -104690 -228802 -61291 16180 -149315 -184047 -199688 -101061 -163913 43110 297428 -236191
19446a02333L7610B1146b53251e0700E4445L8561b5560C7814c15350g7161j23132
$$ -102333 -64723 21146 -253251 -50700 54445 93006 -25560 37814 -315350 -77161 -200293
19435b00293m242q0825g4442j53523L2452A8300c34565J37119A46213o7114A1014
$$ -200293 -204535 -285360 -74442 -227965 -195513 18300 -334565 -197446 146213 79099 11014
19423c30938i9089k7180I2226k0682h9002p3871B6513e00616a86772L6166c5552
$$ -330938 -99089 -126269 92226 71544 -89002 -162873 26513 -500616 -186772 -150606 -35552
19411F2729i6426j09948L6183O6111d4895j90979a0856A37429n3166a81346P8679
$$ 62729 -96426 -206374 -170191 -104080 -44895 -235874 -10856 137429 84263 -181346 -102667
19400a02667i374B34145C1539b35844a13266r1380A0963a55618r9612H7464J64211
$$ -102667 -9374 234145 31539 -235844 -113266 -204646 10963 -155618 -255230 87464 251675
19389B51675D3074c39898G3034a80525d1882m7001D738J10524g1550E7604b4795
$$ 251675 43074 -339898 73034 -180525 -41882 -88883 4738 115262 -71550 57604 -24795
19377a31232A65507B132K9822a68144c447j9334k10789j7227a08277j040F9537
$$ -131232 165507 2132 31954 -168144 -3447 -22781 -233570 -250797 -108277 -109317 69537
19365d6057A29929k4095i2344D9376L1355c7583Q43B15552C7950h2108A24841
$$ -46057 129929 105834 -92344 49376 80731 -37583 -36740 215552 37950 -82108 124841
19353g3272H945b55185A93708b91735A36839b13149M1094g588l07236a29942l9648
$$ -73272 8945 -255185 193708 -291735 136839 -213149 -172055 -7588 -314824 -129942 -169590
19342a69590f6621a0755q5181k11657a06908G6856D831J48967c4214A26794b54505
$$ -169590 -66621 -10755 -95936 -307593 -106908 76856 4831 153798 -34214 126794 -254505
19330b30627A12020a92166P1234m6114g4970c897G3265M9331a38832Q463L7729
$$ -230627 112020 -192166 -120932 -167046 -74970 -3897 73265 122596 -138832 -130369 -92640
19319i2640k95754D4349A8701N6395i1657j01053L6773J0926C6644a02478c2798
$$ -92640 -388394 44349 18701 75096 -91657 -192710 -155937 -145011 36644 -102478 -32798
19307C21548h5725r6225a0226j18974A73617b36768G1554c73341e9581B7941c7137
$$ 321548 -85725 -181950 -10226 -129200 173617 -236768 71554 -373341 -59581 27941 -37137
19295G9104l8547a4121l09602D2748a3965j2652j24246m6912N6444j5546j01312
$$ 79104 40557 -14121 -323723 42748 -13965 -26617 -150863 -197775 -141331 -156877 -258189
19284b58189e6816j89562i2065D1653M1937a16075j90985Q177a19857k39827J46234
$$ -258189 -56816 -246378 -92065 41653 83590 -116075 -307060 -298883 -119857 -359684 -213450
19273b13450n3995b090j75813j17345J37751A61425l5216a89108A01960b28179
$$ -213450 -267445 -2090 -177903 -295248 -157497 161425 126209 -189108 101960 -228179
19262E264f2323j19369i226G5914J3603c00473J20198F7445N242d33058a76827
$$ 5264 -62323 -181692 -9226 75914 89517 -300473 -180275 67445 72687 -433058 -176827
19250a94332M6501q4250e6570J054C91230a50806j67490B4793i0480K4378C868
$$ -194332 -147831 -232081 -56570 -55516 391230 -150806 -318296 24793 -90480 -66102 3868
19238A4076K25801b78726f7702k09115J02880j86256B39722r0035m2814a29797
$$ 14076 239877 -278726 -67702 -276817 -173937 -360193 239722 149687 106873 -129797
19227f0578m8469k42874A01651G25K1564M4137J19321d4247r4654B21241c3650
$$ -60578 -109047 -351921 101651 725 22289 66426 185747 -44247 -138901 221241 -33650
19215B84953a69623C23676j39490a36064A32251b26989a08337A40751a35998k29545
$$ 284953 -169623 323676 184186 -136064 132251 -226989 -108337 140751 -135998 -365543
19205c65543n6566k6951c6451A50690A4924f8816k7284k3492I0006j5275b9018
$$ -365543 -422109 -449060 -36451 150690 14924 -68816 -96100 -119592 90006 74731 -29018
19193b88975J35813E3534J33502b58348r8647g6029k36140a01727B16846A3129
$$ -288975 -153162 53534 187036 -258348 -356995 -76029 -312169 -101727 216846 13129
19182A40018a91420C6611j5733a80189A35801m7818c28706G265a38654r0375A07309
$$ 140018 -191420 36611 20878 -180189 135801 87983 -328706 7265 -138654 -229029 107309
19170b10565j27880A52800d51300C60287L0155A23366a41570E6449a06631o2520
$$ -210565 -338445 152800 -451300 360287 390442 123366 -141570 56449 -106631 -169151
19160a69151r3768g6914j70200Q0987q8131C22172a81113I8773a98955G8196b09228
$$ -169151 -262919 -76914 -247114 -166127 -254258 322172 -181113 98773 -198955 78196 -209228
19148A52098a74119k53018b0217A67730c0906k31104f3482O62H5875b71777G2778
$$ 152098 -174119 -427137 -20217 167730 -30906 -262010 -63482 -62820 85875 -271777 72778
19136A76910c88598A37302m0344b6875q5075C70296C7575C22a8183k13264C16434
$$ 176910 -388598 137302 96958 -26875 -111950 370296 37575 322 -18183 -231447 316434
19124c12543M1759B44558b10870a896l12954E8259P3446C9607j7087L3881e6702
$$ -312543 -270784 244558 -210870 -1896 -314850 58259 131705 39607 22520 56401 -56702
19112b31476A52696h5317b1339j54511d5360k48286j9804A44517D961c9808l29498
$$ -231476 152696 -85317 -21339 -175850 -45360 -293646 -313450 144517 4961 -39808 -369306
19101c69306i5216B56339c72754G02J2339b09381k0714B96444b62615J14289P1865
$$ -369306 -95216 256339 -372754 702 13041 -209381 -230095 296444 -262615 -148326 -76461
19090g6461A08040c09926F8886b47543Q1929A61382J5380E4918e4226k80760k6818
$$ -76461 108040 -309926 68886 -247543 -165614 161382 176762 54918 -54226 -334986 -361804
19079c61804a61518c656l7545D0699b23039H993c19322A61227J44629j12070G9490
$$ -361804 -161518 -3656 -41201 40699 -223039 8993 -319322 161227 305856 193786 79490
19067A94214p9972a91177C969b06390Q0139D8422b33041J6000A06063H699d59462
$$ 194214 114242 -191177 3969 -206390 -126251 48422 -233041 -217041 106063 8699 -459462
19055e926j44924d3336o0207j15790J07292j347r2364M1492C26J42857a59387
$$ -5926 -150850 -43336 -103543 -219333 -112041 -113388 -205752 -164260 326 143183 -159387
19043b08957j06664B12654b98454a33490O3225r3687G9142b0526A20532a16570
$$ -208957 -315621 212654 -298454 -133490 -70265 -163952 79142 -20526 120532 -116570
19032a34443A24434A0262N79g8361j70486J00877A31001K03487a09470A79447
$$ -134443 124434 10262 10841 -78361 -248847 -147970 131001 334488 -109470 179447
19021a41943K741j4200A28139a00892A23309l0557a91389N6211j83595a41789
$$ -141943 -139202 -153402 128139 -100892 123309 92752 -191389 -135178 -318773 -141789
19010d9519J163A45663d6159A55103o2353N9894b51066F1045a44162A60817a27287
$$ -49519 -48356 145663 -46159 155103 92750 152644 -251066 61045 -144162 160817 -127287
18998d22871A16865D4089a61932P2324j83444C40186h307k72251J32215j03819
$$ -422871 116865 44089 -161932 -89608 -273052 340186 -8307 -280558 -148343 -252162
18988b52162c0228j44590n9031B27737q472b31643A95572m0890a80070h5184b9294
$$ -252162 -30228 -174818 -233849 227737 219265 -231643 195572 154682 -180070 -85184 -29294
18976D16381b2841j02540A31877a41182B90670J65629p5620A20091J63296a25941
$$ 416381 -22841 -125381 131877 -141182 290670 456299 380679 120091 283387 -125941
18965b99113d3496B08655a26477q1645m8636B242P7175R4502i4410A52697K8980
$$ -299113 -43496 208655 -126477 -208122 -256758 2242 79417 173919 -94410 152697 181677
18954A81677b15442B3850c28090a26524k762A159L3546a87743A09623c6002A59192
$$ 181677 -215442 23850 -328090 -126524 -129286 1159 34705 -187743 109623 -36002 159192
18942a66133P6653B55914j00131b9309p6824b2407k06295k23358a7109F5664a10279
$$ -166133 -89480 255914 155783 -29309 -106133 -22407 -228702 -452060 -17109 65664 -110279
18930F4028A2317J11572b91356h3437b4368r6022k65107A6009c46524A8589a02826
$$ 64028 12317 123889 -291356 -83437 -24368 -120390 -385497 16009 -346524 18589 -102826
18918a56426I7498b66560i5723J9995B33722c3329I2978K0521J5347k3604M83522
$$ -156426 97498 -266560 -95723 -75728 233722 -33329 92978 113499 128846 105242 588764
18907E88764q5492J43693C10614a58493f8570C59110e7076A61222b31539O1508
$$ 588764 503272 646965 310614 -158493 -68570 359110 -57076 161222 -231539 -170031
18897a70031j33460E0816K2435C5388Q2135K38241g5637n0493j74525A18459e8152
$$ -170031 -303491 50816 73251 35388 117523 355764 -75637 -126130 -300655 118459 -58152
18885D7550a17127A72458J78212d9187B6777a69791d3183A67874D0678J76492
$$ 47550 -117127 172458 350670 -49187 26777 -169791 -43183 167874 40678 217170
18875B17170m2658a73070D1923K749a33267j12720a18773j74191a01109J4642
$$ 217170 174512 -173070 41923 44672 -133267 -245987 -118773 -292964 -101109 -86467
18865h6467q07k27507f6209K6240B2152a50222A61087b4388G0023b11953Q6774
$$ -86467 -87274 -314781 -66209 -39969 22152 -150222 161087 -24388 70023 -211953 -125179
18854a25179B1597I042P7611a67930K7975k47792J87987B27576b51189a16128
$$ -125179 21597 9042 86653 -167930 -139955 -387747 -199760 227576 -251189 -116128
18843a90818M171A74574G7226b69291R9753A74822a62417B66655a05658C5091
$$ -190818 -186647 174574 77226 -269291 -169538 174822 -162417 266655 -105658 35091
18832B45887a25038d7084A79463n6317a97813A1359J07588k7481Q8540a81571
$$ 245887 -125038 -47084 179463 123146 -197813 11359 118947 91466 180006 -181571
18821e8626m67383e970j39891f617j93134D3467a3885j27708C81341A53416h7355
$$ -58626 -526009 -5970 -145861 -6617 -199751 43467 -13885 -141593 381341 153416 -87355
18809G7030p902a25373A56353C216J17221j5022b72236e7204B17073C9283f8252
$$ 77030 69128 -125373 156353 3216 120437 105415 -272236 -57204 217073 39283 -68252
18797e1544j09771k72493a50685f1250B7272K19796b57221d2966n477A22503a60915
$$ -51544 -161315 -433808 -150685 -61250 27272 247068 -257221 -42966 -48443 122503 -160915
18785A46727J91466c3150m1223J3177H1116L651d6186r044j73718A12691c89112
$$ 146727 338193 -33150 -74373 -61196 81116 84767 -46186 -55230 -228948 112691 -389112
18773a00234p2224A83508l9320F3972L05257a92194R2118A1947b25837C08059
$$ -100234 -172458 183508 144188 63972 369229 -192194 -100076 11947 -225837 308059
18762G415P2357C2933J43433b00703R9478A24976j0743g4549G3730b16349j98918
$$ 7415 79772 32933 176366 -200703 -101225 124976 114233 -74549 73730 -216349 -415267
18751d15267a54067Q45N622C08895C3709K03499b35890N2534M5128O7744A14447
$$ -415267 -154067 -153222 -147600 308895 33709 237208 -235890 -183356 -138228 -70484 114447
18739b18469Q9347a7909A01880i3186J1889j32023C32723a03848k51962N1580
$$ -218469 -129122 -17909 101880 -93186 -81297 -213320 332723 -103848 -355810 -304230
18729c04230o6502a11241I7912f3965J24r6016A86342a13859A23306N884l3365
$$ -304230 -370732 -111241 97912 -63965 -63841 -159857 186342 -113859 123306 129190 95825
18718I5825b15154b3881o1240E570K15748D9684K7156b43390e8907A86232i7533
$$ 95825 -215154 -23881 -85121 5570 221318 49684 76840 -243390 -58907 186232 -97533
18706a04136j8720A15236B568c8305j20120A76338C0982i0267l49763a81789q2665
$$ -104136 -122856 115236 2568 -38305 -158425 176338 30982 -90267 -440030 -181789 -264454
18695b64454O2072c3894k16173E5742a41672A55046g7856L0205G0552B779e881
$$ -264454 -202382 -33894 -250067 55742 -141672 155046 -77856 -47651 70552 2779 -5881
18683A97837k8762d9710j62674F3543b75663J15893A59114a75257g9723j63318
$$ 197837 169075 -49710 -212384 63543 -275663 -159770 159114 -175257 -79723 -243041
18673b43041A4585J47806K5135b82385a05726A48456A9624J52794P5037b8262
$$ -243041 14585 162391 187526 -282385 -105726 148456 19624 172418 247455 -28262
18662b37068L4026c7603B19156j01322a79650h5154A36225a14105c2729c481j38377
$$ -237068 -203042 -37603 219156 117834 -179650 -85154 136225 -114105 -32729 -3481 -141858
18651a41858A47386C6094a53232j91847J26342g6145A67259b10018k17855J90242
$$ -141858 147386 36094 -153232 -345079 -218737 -76145 167259 -210018 -427873 -237631
18641b37631A7978a42140B35706a40831G5235d75558g2652A74905a05022j93042
$$ -237631 17978 -142140 235706 -140831 75235 -475558 -72652 174905 -105022 -298064
18631b98064I0767j3689c82571A24142g5155c6870l19191J77722n7219A079h4765
$$ -298064 90767 77078 -382571 124142 -75155 -36870 -356061 -178339 -235558 1079 -84765
18619a63897B4928e6058B32198e76504A91151a22832j43213j0041c6942C0840
$$ -163897 24928 -56058 232198 -576504 191151 -122832 -266045 -276086 -36942 30840
18608d22770a25840L8588C044a10874m0014A43969I122k07P4910c10742A81208
$$ -422770 -125840 -87252 3044 -110874 -150888 143969 9122 8915 83825 -310742 181208
18596B0260b83032j70136E0359N3380i9757C111L034a01280B42132a57046c9591
$$ 20260 -283032 -453168 50359 103739 -99757 3111 6145 -101280 242132 -157046 -39591
18584f7812D06723C7960j7625N6660a1603p9782M1865B8150J24363i2177a7327
$$ -67812 406723 37960 20335 76995 -11603 -91385 -49520 28150 152513 -92177 -17327
18572g5863b8216j89449R9447h271j79240c4956j58197A84635a4123k87053f9794
$$ -75863 -28216 -217665 -118218 -8271 -187511 -34956 -193153 184635 -14123 -301176 -69794
18560b00450j9318P2471C4368j2467b55125C4131j1029K6073c50694B05413a92016
$$ -200450 -219768 -147297 34368 21901 -255125 34131 23102 49175 -350694 205413 -192016
18548E4887a10590j739J8851F7640c7762k3022B50191j240F1803a19911H4923
$$ 54887 -110590 -112329 -93478 67640 -37762 -60784 250191 248951 61803 -119911 84923
18536A9603O4183c9242A6466H062b10342M717a01985A59366b5086m599j72688
$$ 19603 83786 -39242 16466 8062 -210342 -205625 -101985 159366 -25086 -29685 -202373
18525b02373B29064c42948a33495F5386d55182E9349i3535B45691F7518K4597
$$ -202373 229064 -342948 -133495 65386 -455182 59349 -93535 245691 67518 92115
18515I2115L27606b889k62428j87956G5655C6716a37467E957b3030E2791O7436
$$ 92115 419721 -2889 -265317 -453273 75655 36716 -137467 5957 -23030 52791 120227
18504A20227G940c21583b4272k65889K2863e3883k21083h9788k02206b9601G7050
$$ 120227 7940 -321583 -24272 -290161 -267298 -53883 -274966 -89788 -291994 -29601 77050
18492B30545K5476a24295L9707B79470f738A07222a85482h5284C57623I5648L97019
$$ 230545 256021 -124295 -84588 279470 -6738 107222 -185482 -85284 357623 95648 492667
18481D92667a22347A27239l2166g0378E826O9915a39250e6352E6927J67022a13152
$$ 492667 -122347 127239 95073 -70378 5826 75741 -139250 -56352 56927 223949 -113152
18469g4674l4533b7788J0500j73697h3129J448A24294a58512B70124c4429a237
$$ -74674 -109207 -27788 -17288 -190985 -83129 -81681 124294 -158512 270124 -34429 -1237
18457b37551Q0882n5157I3956A2200c3907F3134q124b64993Q243c8948p9664N8150
$$ -237551 -156669 -211826 93956 12200 -33907 63134 55010 -264993 -256750 -38948 -118612 -60462
18445f0462k33242D7047N3516k9917i7633K5887D1845J8765i5564n7073H1360
$$ -60462 -293704 47047 100563 70646 -97633 -71746 41845 60610 -95564 -152637 81360
18433A4792a7023E3082g3535A25787g6659I7966B381O0383a15173n3216N0946
$$ 14792 -17023 53082 -73535 125787 -76659 97966 2381 62764 -115173 -168389 -117443
18422a17443c3683k57480l5489F6302b53975A27744b24073c2596B26725h8857
$$ -117443 -33683 -291163 -326652 66302 -253975 127744 -224073 -32596 226725 -88857
18411d698A3368d3178j91058B51814a43334j59864A029b1440D1776b65774A21269
$$ -4698 13368 -43178 -234236 251814 -143334 -303198 1029 -21440 41776 -265774 121269
18399d20529B18156a03867D2878J22269E0584R6685b62585a10323r0697K5172
$$ -420529 218156 -103867 42878 165147 50584 147269 -262585 -110323 -201020 -175848
18389a75848M7138j09790K1796F2236d8990J3001C1613c24733F4290N8811a30912
$$ -175848 -128710 -238500 -216704 62236 -48990 -35989 31613 -324733 64290 123101 -130912
18377G3439a8598j03052G6336a3260k52443J6302h180B13146B3509K459K75249
$$ 73439 -18598 -121650 76336 -13260 -265703 -249401 -8180 213146 23509 25968 301217
18366C01217G2440J55685G332R1310a37685K6480G1135B8076K6744a07058C77000
$$ 301217 72440 228125 7332 98642 -137685 -111205 71135 28076 54820 -107058 377000
18354A09129a19270B99986d4864E5627b87714J34617C89257A54650d08726A76172
$$ 109129 -119270 299986 -44864 55627 -287714 -153097 389257 154650 -408726 176172
18343E3693P0043G950c08546B01584a13361A5408g5898A71796g449F5636L2240
$$ 53693 123736 7950 -308546 201584 -113361 15408 -75898 171796 -7449 65636 97876
18332I7876D2210a70804Q3870B1548b94291A56014b67692A49193a5796l57437
$$ 97876 42210 -170804 -86934 21548 -294291 156014 -267692 149193 -15796 -373233
18322c73233b9342G2710P4116E9623d4506G7754K1306K61356c25656G784N8744
$$ -373233 -29342 72710 146826 59623 -44506 77754 99060 360416 -325656 7784 66528
18311F6528K34302a60702N6813g716k9218k51338a11759b3373B00809M7595I4776
$$ 66528 300830 -160702 -103889 -7716 -36934 -288272 -111759 -23373 200809 248404 94776
18299B30370b94497B84503c1712m14495C3523e5005A22061c2992A03879L1716
$$ 230370 -294497 284503 -31712 -446207 33523 -55005 122061 -32992 103879 135595
18289A35595J29634B6709a05085m8242k97366a59099c6176j11985j81734A15140
$$ 135595 265229 26709 -105085 -153327 -450693 -159099 -36176 -148161 -329895 115140
18278h2198A57781a9647n0317C99469j12541F9856J3438a37392D8245a1226G6483
$$ -82198 157781 -19647 -69964 399469 286928 69856 83294 -137392 48245 -11226 76483
18266F5948b01555A01732b32031F2865f0308J549B5128c24288f4109j11155F7323
$$ 65948 -201555 101732 -232031 62865 -60308 -58759 25128 -324288 -64109 -175264 67323
18254b02049d2242a0324A59622a31996j97572A99548i9393A49766f2398E3832
$$ -202049 -42242 -10324 159622 -131996 -329568 199548 -99393 149766 -62398 53832
18243A63795B8123a997k51698B13618b9114B34651G6235k4463b05172A25165d4206
$$ 163795 28123 -1997 -253695 213618 -29114 234651 76235 51772 -205172 125165 -44206
18231D7205J3518F385J37326J2774F9900d5243r3266d7065j47458o0361d5444
$$ 47205 60723 6385 143711 156485 69900 -45243 -138509 -47065 -194523 -254884 -45444
18219G9273i8430B13711e0334A30032b3505H5428K14058k4267a03605j59325o137
$$ 79273 -98430 213711 -50334 130032 -23505 85428 299486 275219 -103605 -262930 -269067
18208b69067c6821A9344J1725a5255B67157B7210d7927a717C12510A08412c06538
$$ -269067 -36821 19344 31069 -15255 267157 27210 -47927 -1717 312510 108412 -306538
18196b59420B65311H7844N2106L3884F4340P6100c48752C6914c15713f4979o2873
$$ -259420 265311 87844 139950 173834 64340 140440 -348752 36914 -315713 -64979 -127852
18185a27852a6860B94071i5383B13872E3537b48097R6019O4976r7624b2295l2476
$$ -127852 -16860 294071 -95383 213872 53537 -248097 -152078 -87102 -184726 -22295 -54771
18174e4771j18640F9899a09352B0564c0029A20045B992a67744f4482K3766H1978
$$ -54771 -173411 69899 -109352 20564 -30029 120045 2992 -167744 -64482 -40716 81978
18162a32537b1684A29494a31766A22939m9472b11116M5622P1534K5218j03182
$$ -132537 -21684 129494 -131766 122939 73467 -211116 -165494 -93960 -68742 -171924
18152a71924J8470A79375a49211B73720H0668i9059n5132p9135L6426d3918p8855
$$ -171924 -153454 179375 -149211 273720 80668 -99059 -154191 -233326 -196900 -43918 -122773
18141a22773N6697H1781e1441C0559Q1141O119a47337A9925a48062C29692f9940
$$ -122773 -66076 81781 -51441 30559 111700 117819 -147337 19925 -148062 329692 -69940
18129b50878K8814K9909G8147K12649B4298d58160C26288A15929K46476k6184
$$ -250878 -222064 -192155 78147 290796 24298 -458160 326288 115929 362405 336221
18119C36221C6137K1962j152J63002c95816A51499a55751R892D29573c34887h360
$$ 336221 36137 58099 56947 219949 -395816 151499 -155751 -145859 429573 -334887 -8360
18107h4571E3396b46795D9197i3540A34018b27272N9642j23550Q0895B9802L9370
$$ -84571 53396 -246795 49197 -93540 134018 -227272 -167630 -291180 -210285 29802 69172
18096F9172i1520H519J84834f2166B1859b43731A20460g3141B90897A8326c02723
$$ 69172 -91520 8519 193353 -62166 21859 -243731 120460 -73141 290897 18326 -302723
18084A04287c7984B4145h8686p4263q0492g4530C8538b02674h4612A70641i0789
$$ 104287 -37984 24145 -88686 -162949 -243441 -74530 38538 -202674 -84612 170641 -90789
18072g3870k20875f0491A33010d51984A81611a03784c4306D0028d4678A22316
$$ -73870 -294745 -60491 133010 -451984 181611 -103784 -34306 40028 -44678 122316
18061a1990j44278A42376e2293m5643G5854k2781j3375a31620C00577H9871g1881
$$ -11990 -156268 142376 -52293 -97936 75854 53073 39698 -131620 300577 89871 -71881
18049b11500Q4065H3922A5740o53e1450C2855R3116j7029n2062L2240J48609a02434
$$ -211500 -127435 83922 15740 15087 -51450 32855 125971 108942 56880 89120 237729 -102434
18036a9188H9228o905k7960h0126A48864E8624Q0721b6191E164P5591K9426E1701
$$ -19188 89228 82323 54363 -80126 148864 58624 139345 -26191 5164 80755 110181 51701
18023D5117a16061A53239C7467a14637B31591A14195F514K28198b2977q0227A62363
$$ 45117 -116061 153239 37467 -114637 231591 114195 6514 234712 -22977 -103204 162363
18011c4058A20998j0740a38924J367C05496j20556b11752A07743J68820E4200
$$ -34058 120998 110258 -138924 -137557 305496 184940 -211752 107743 276563 54200
18000E5088a62657d9117A91706K36954F5320f430j05079q8612g7707k37408g9146
$$ 55088 -162657 -49117 191706 428660 65320 -6430 -111509 -200121 -77707 -315115 -79146
17988I8234K44044a04029r344B61938D8895b25609j27439A23714C3659a26202
$$ 98234 342278 -104029 -113373 261938 48895 -225609 -353048 123714 33659 -126202
17977A19804c23329A2622d37345b3365d201r6743C07746E3831J00651a87931A85266
$$ 119804 -323329 12622 -437345 -23365 -4201 -100944 307746 53831 154482 -187931 185266
17965C10216A9942b79840d2016j12076h537j60675k6650A03621J31781g3056A48156
$$ 310216 19942 -279840 -42016 -154092 -8537 -169212 -195862 103621 235402 -73056 148156
17953B31788H2216L45748E7635k1770R3467i6608L5378H7146b29015h5082L6759
$$ 231788 82216 427964 57635 35865 129332 -96608 -61230 87146 -229015 -85082 -48323
17942d8323m80523c7299l5150J2381p7584A7349a66031a5942j51608e8197A32747
$$ -48323 -528846 -37299 -72449 -60068 -137652 17349 -166031 -15942 -167550 -58197 132747
17930h476j10394C146J46997J86543h7242A37909c4854p3450C27535g7800F6977
$$ -8476 -118870 3146 150143 336686 -87242 137909 -34854 -108304 327535 -77800 66977
17918A61329c08701a7347E5269J45911J33527b74685h8048r0460p8961B10936
$$ 161329 -308701 -17347 55269 201180 334707 -274685 -88048 -178508 -257469 210936
17907b3624F5248B0014K59646b1343o0117k2438c6307C24325b65377b5887G8362
$$ -23624 65248 20014 279660 -21343 -81460 -103898 -36307 324325 -265377 -25887 78362
17895F1869L63550G7303g6269A50898F6520b28735F5204J47486F0528L17946E0981
$$ 61869 425419 77303 -76269 150898 66520 -228735 65204 212690 60528 378474 50981
17883A56041o5867d5159A2967a74246I1292c16202m0438P5932g653l29781h6535
$$ 156041 90174 -45159 12967 -174246 91292 -316202 -356640 -280708 -7653 -337434 -86535
17871a41405A33309a07156H5495k7345K89792H4209Q3202m1323b93818A56261
$$ -141405 133309 -107156 85495 58150 347942 84209 167411 126088 -293818 156261
17860A07741D2934e2014A87583k9092a40677A75855o7939J40000j11669F0326
$$ 107741 42934 -52014 187583 158491 -140677 175855 107916 247916 136247 60326
17849h8775B1770b0308o1222c2419A71810J33839g119p559A92995a00411d4230
$$ -88775 21770 -20308 -81530 -32419 171810 305649 -7119 -14678 192995 -100411 -44230
17837A03704m9379J71693b4589F1663N0166h5206E3175Q7774D8286O7292g6830
$$ 103704 54325 226018 -24589 61663 111829 -85206 53175 140949 48286 115578 -76830
17825B3660h4733k5249M9320a6326j45326a0777j48319j4375D9099e5372j990
$$ 23660 -84733 -109982 -60662 -16326 -161652 -10777 -159096 -173471 49099 -55372 -57362
17814e7362C31078C2264b35692R9867A08514b6516B04208j0601E7941K05219o9305
$$ -57362 331078 32264 -235692 -135825 108514 -26516 204208 193607 57941 263160 193855
17803A93855k1560M1567c16547C0775b2140k57239e1274E1701a58416E1645f5255
$$ 193855 172295 213862 -316547 30775 -22140 -279379 -51274 51701 -158416 51645 -65255
17791b87998a20148n6213A8857c6722B24248b00281c4230B74653A9637b5992j11355
$$ -287998 -120148 -176361 18857 -36722 224248 -200281 -34230 274653 19637 -25992 -137347
17780a37347p3858O1072B34051a56289c0538I9126O4093b39336E8910B5603J62763
$$ -137347 -211205 -150133 234051 -156289 -30538 99126 163219 -239336 58910 25603 188366
17769A88366F2346b1522B17380E5073a70257d8785A39197b1710L999k01547D39471
$$ 188366 62346 -21522 217380 55073 -170257 -48785 139197 -21710 -17711 -219258 439471
17757b72385A19175C1239M6637O3880J1778A7397K6584a25682C1693N7872N6334
$$ -272385 119175 31239 77876 141756 153534 17397 43981 -125682 31693 89565 145899
17746A45899m8190O0255J24530A13221b53049D7109M0066c8242A58996L7386F9686
$$ 145899 97709 157964 282494 113221 -253049 47109 87175 -38242 158996 196382 69686
17734I972a36488b822D37243i6377j699D9542a52331A24279M204g0285k9879B34756
$$ 9972 -136488 -2822 437243 -96377 -98076 49542 -152331 124279 128483 -70285 -100164 234756
17721d7430B11266q8068k5632J79677j27717p3226e024C08859o1852F9633b65599
$$ -47430 211266 123198 97566 277243 149526 76300 -5024 308859 247007 69633 -265599
17709a45743A96250J01471b7988A23036L86270D9212Q8910J1335a03358B66000
$$ -145743 196250 297721 -27988 123036 509306 49212 138122 149457 -103358 266000
17698C686N829L59807r7095J09889j80660A00339j2913I301K38653P5937i0786
$$ 3686 9515 369322 272227 382116 201456 100339 87426 9301 247954 323891 -90786
17686h0936B88963F4907R8135F66K19333d5588r0083d4256l7151J4683n4438C44783
$$ -80936 288963 64907 163042 666 219999 -45588 -135671 -44256 -81407 -66724 -121162 344783
17673A22693E3565R4609J53723k9901j05392k2571m7693A7231b15729L3094B3339
$$ 122693 53565 148174 301897 271996 166604 144033 96340 17231 -215729 -182635 23339
17661a43473B56273j14484N6046g1591a4101I7140K00655A38731l3326I468K27188
$$ -143473 256273 141789 197835 -71591 -14101 97140 297795 138731 105405 9468 236656
17650B36656R4989j16957D6964e8065D67862j68171B0880H166f618o7123C09254
$$ 236656 331645 214688 46964 -58065 467862 299691 20880 8166 -6618 -73741 309254
17638E7918j3801J44046k6028b17927g5630c4701B11999F2728b40302B16946A07546
$$ 57918 44117 188163 162135 -217927 -75630 -34701 211999 62728 -240302 216946 107546
17626D01831B4498J7542L34885c997J201j5946o8406A82259E8401M8555a5690
$$ 401831 24498 42040 376925 -3997 -2796 -18742 -87148 182259 58401 106956 -15690
17614A47455M6963J67997D7433a89617b0244B69888f9202b9021r4706C28532j53287
$$ 147455 194418 362415 47433 -189617 -20244 269888 -69202 -29021 -123727 328532 175245
17603A75245B5352K59122A35811a16752A60099j3883b1838p9257A89329P3072
$$ 175245 25352 284474 135811 -116752 160099 146216 -21838 -101095 189329 262401
17593B62401A09849j9319d3711C21187E0637J43845e58238A46082f8439l283B77989
$$ 262401 109849 90530 -43711 321187 50637 194482 -558238 146082 -68439 -71722 277989
17581B30788n0761Q6510q4554q2001Q0813J17750A26521a979A47643J40353K9667
$$ 230788 180027 266537 181983 99982 180795 298545 126521 -1979 147643 287996 317663
17570C17663J0748a87208A16236G263L04136D7038L70309c1446F1575J45311g328
$$ 317663 328411 -187208 116236 7263 311399 47038 417347 -31446 61575 206886 -7328
17558D0583L57196m1456q4333G7944j3144K33533A26793J08596o5707g3682H4164
$$ 40583 397779 356323 271990 77944 64800 298333 126793 235389 169682 -73682 84164
17546A96047E4274R6828P0482a14592F3012L64023B01757m1251J29070J71402
$$ 196047 54274 151102 221584 -114592 63012 427035 201757 160506 289576 460978
17536D60978A70598O1652J23412A43690J73755p0673j13341L20818J02125j56235
$$ 460978 170598 232250 355662 143690 317445 246772 133431 454249 556374 400139
17526D00139J36423J3175J95191l6459j7956k14250K02137K5236A52933B9939
$$ 400139 536562 549737 744928 708469 690513 476263 678400 703636 152933 29939
17515B06753J63645Q9092j75742k1295J89010M76758l59723K04152K18990p7859
$$ 206753 370398 459490 283748 262453 451463 928221 568498 772650 991640 913781
17505I13781l32957K6736a43118E88258j62518A28610k037J30609J59848j0791
$$ 913781 580824 607560 -143118 588258 425740 128610 126573 257182 417030 406239
17495D06239A01105L8951M5580G3014J23355F3427L58781k4361p9376j23514C7772
$$ 406239 101105 140056 185636 73014 196369 63427 422208 397847 318471 194957 37772
17483B68408q7930J40617A26429L41769j05666j16007O4981p3369j07875Q0230
$$ 268408 180478 321095 126429 468198 362532 246525 311506 238137 130262 210492
17473B10492J5983L82286q037j55371k04335i9286C68524o2454A39925K1221O2038
$$ 210492 226475 608761 600724 445353 241018 -99286 368524 306070 139925 161146 223184
17462B23184D4957M18918A89734a1828A20184J15582K43395q3050A18382J68318
$$ 223184 44957 463875 189734 -11828 120184 235766 479161 396111 118382 286700
17452B86700F4116J45728K239K16289K8334j80159A3309O76189j6701B46432J50712
$$ 286700 64116 209844 212083 428372 456706 276547 13309 689498 672797 246432 397144
17441C97144J00828k14140o7892J87429A72893K04433q7194J84540E2298M75597
$$ 397144 497972 283832 215940 403369 172893 377326 290132 474672 52298 527895
17431E27895j69206I2406L2614K24360B632K24359d8258A77787C1560N79331j06970
$$ 527895 358689 92406 125020 349380 2632 226991 -48258 177787 31560 610891 503921
17420E03921A72909p2950m8030K90803J64454J41135A53417K6421J23605M5856
$$ 503921 172909 99959 51929 342732 507186 648321 153417 179838 303443 349299
17410C49299j37143k5175A3365J58961L0998O9826j30594M9407G0668R8828o8640
$$ 349299 212156 186981 13365 172326 203324 273150 142556 191963 70668 169496 100856
17399A00856a40829B25128A10936L21852A75693E348K54500b3186B84627j14048
$$ 100856 -140829 225128 110936 432788 175693 5348 259848 -23186 284627 170579
17389A70579p4012k235K43191O3971A31317J23902K85661q4507j54583L9953n3447
$$ 170579 96567 94332 337523 401494 131317 255219 540880 456373 301790 341743 288296
17378B88296H5887L16240A70306a91480B41876M11m5453r4477R6599l7300k0148
$$ 288296 85887 402127 170306 -191480 241876 242287 196834 102357 198956 161656 141508
17367A41508L05007J06135B76178H5636K9484Q0556j5395K2344J94116J21884
$$ 141508 446515 552650 276178 85636 115120 195676 180281 202625 396741 518625
17357E18625A33212C987P4730K00631m6771J68392A1156L52851J59116j24610
$$ 518625 133212 3987 78717 279348 232577 400969 11156 364007 523123 398513
17347C98513L878A88429l2378B964R9876K17053A19824j9117O187O3359M7712
$$ 398513 402391 188429 156051 2964 102840 319893 119824 100707 106894 170253 217965
17336B17965L0961J20990D2284O27886B26495P0781j25680J89332j60543K05168
$$ 217965 248926 369916 42284 670170 226495 297276 171596 360928 200385 405553
17326D05553p4494J32221A98997J37168b0450j97576B83103A28828M6166J63660
$$ 405553 331059 463280 198997 336165 -20450 -218026 283103 128828 174994 338654
17316C38654q3106A22873M27582B03065j3980L5247I6979K72923R3819r2686r5005
$$ 338654 255548 122873 550455 203065 189085 224332 96979 369902 463721 371035 276030
17305B76030m994R4799f5287D28160A28764K91892j24915a4732C21498B8606K88081
$$ 276030 271036 365835 -65287 428160 128764 420656 295741 -14732 321498 28606 316687
17294C16687K3644j56459K78687B15075p8210l8020K50845j14052N4371a4218
$$ 316687 340331 183872 462559 215075 136865 98845 349690 235638 290009 -14218
17283A72801L04304a11541A65424J73559n6111L5344K04965A82979J5007K18097
$$ 172801 477105 -111541 165424 338983 282872 318216 523181 182979 197986 416083
17273D16083A33485N0581a47262C22542J27822J46651j46245A04383I244L24723
$$ 416083 133485 184066 -147262 322542 450364 597015 450770 104383 9244 333967
17263C33967J55420K4665N362a35442B64553J1299A23411K26566l1846K10926
$$ 333967 489387 514052 519414 -135442 264553 275852 123411 349977 318131 529057
17253E29057k38747P8750A45916L93411k9819j12432A26348M17290B64480j02009
$$ 529057 290310 369060 145916 539327 509508 397076 126348 543638 264480 162471
17243A62471N4313J85526j83045P3747q6518R3344J0588j23602K0434R9587m7185
$$ 162471 216784 402310 219265 293012 206494 299838 310426 186824 207258 306845 259660
17232B59660K34489A66699D856N44054m0944B00019J80053G2961K83416J49572
$$ 259660 494149 166699 4856 548910 507966 200019 380072 72961 356377 505949
17222E05949k26015J35989j07811J64830A22155N42899B48034O0219K1859L24752
$$ 505949 279934 415923 308112 472942 122155 665054 248034 308253 330112 654864
17212F54864B93380g153D13971m4971J27682k35730D4366N05733k41939J00430
$$ 654864 293380 -7153 413971 369000 496682 260952 44366 550099 308160 408590
17202D08590J84356B50685r0340K21115A44419J26152J79579J37255j69288A65237
$$ 408590 592946 250685 160345 381460 144419 270571 450150 587405 418117 165237
17191C45403K144K19831A50181M20664J68588C18773J05163K43859k69110J05507
$$ 345403 347547 567378 150181 570845 739433 318773 423936 667795 398685 504192
17181E04192P3807k70674M1815N6280L8761j86097R6038A64585J43887J76937
$$ 504192 577999 307325 349140 405420 444181 258084 354122 164585 308472 485409
17171D85409A25427M81800k82337K99227J49120p0823A91569J3311L07397B32695
$$ 485409 125427 607227 324890 624117 773237 702414 191569 204880 512277 232695
17160C75733r0652L60059l12061J33821O0597K30847k43858k6594r0146J24018
$$ 375733 285081 645140 333079 466900 527497 758344 514486 487892 397746 521764
17150E21764B44736J56302m3200n7287K06213j68604K8950m6810L09963J1304
$$ 521764 244736 401038 357838 300551 506764 338160 367110 320300 630263 641567
17140F41567O4572k87676k5951j72062L82783B96492K25892l6875L2961B16289
$$ 641567 706139 418463 392512 220450 603233 296492 522384 485509 518470 216289
17129B48168L32867j00246J48090J13891o9350j95700J29956k60141L04412j6791
$$ 248168 581035 480789 628879 742770 673420 477720 607676 347535 651947 635156
17119F35156j15090R8305M6748k06268J303B27766J34691K52994o6018B23515
$$ 635156 520066 618371 665119 458851 460154 227766 362457 615451 549433 223515
17108D88277J21259K2305L19337C75902J41989R6957B45972M11478J1393k32467
$$ 488277 609536 631841 951178 375902 517891 614848 245972 657450 668843 436376
17098D36376K78697k61710q5005K1787J12093J76793N4445k42138B42726K41006
$$ 436376 715073 453363 368358 390145 502238 679031 733476 491338 242726 483732
17088D83732J83229k90871j467J13535j93691M05822j23080J82545P0721l44025
$$ 483732 666961 376090 374623 488158 294467 700289 577209 759754 830475 486450
17078D86450J49791j46643O7953L34449C50768R9844L49612j91603N8203j25660
$$ 486450 636241 489598 557551 892000 350768 450612 800224 608621 666824 541164
17068E41164M60647l48220P198L21389j35786K42582m18316J36637l90566J73110
$$ 541164 1001811 653591 660789 982178 846392 1088974 670658 807295 416729 589839
17058E89839K16621N8351k9862j05295J57856k11308M98784n20046J60882J82286
$$ 589839 806460 864811 834949 729654 887510 676202 1174986 654940 815822 998108
17048I98108j76276M9176K5287J27679k54769Q5314m93K6006J705k81744n4615
$$ 998108 821832 871008 896295 1023974 769205 854519 854026 880032 881737 599993 545378
17037E45378J57740J24664R5967l5151j62528J25461K67426j66363Q2041r8765
$$ 545378 703118 827782 923749 888598 726070 851531 1118957 952594 1034635 935870
17027I35870j85495L23633q093l06504K75919k31346j11442J60243j47047K28829
$$ 935870 750375 1074008 1065915 759411 1035330 803984 692542 852785 705738 934567
17017I34567K473J97032k83230J03711J87655j18845j17836K34570j58291j90365
$$ 934567 937040 1134072 850842 954553 1142208 1023363 905527 1140097 981806 791441
17007G91441J23867k7942O1270j70790N11440j95451p8822L22611l1872n15245
$$ 791441 915308 887366 948636 777846 1289286 1093835 1015013 1337624 1305752 790507
16997G90507J72910j4948L42144l13869J53709J09432P4745n15709R9867O2689
$$ 790507 963417 948469 1290613 976744 1130453 1239885 1314630 798921 898788 961477
16987I61477M53375O7524j61350K84983n51627L27032J39037l60349J5720l187
$$ 961477 1414852 1482376 1321026 1606009 1054382 1381414 1520451 1160102 1175822 1172635
16977A172635J35915j10641J23529k73221L37054J31735j90308j46731L67488
$$ 1172635 1308550 1197909 1321438 1048217 1385271 1517006 1326698 1179967 1547455
16968A547455l14340L37648J88587m50711R6173L8461l343k16310L26133r4479
$$ 1547455 1233115 1570763 1759350 1308639 1404812 1443273 1439930 1223620 1549753 1455274
16958A455274J22627O7115k69963L54020k91206M35895m37918L25223l00481J23636
$$ 1455274 1577901 1645016 1375053 1729073 1437867 1873762 1435844 1761067 1460586 1584222
16948A584222J19563J70027n36978M44440j04936n836J59125J42814l38689M8476
$$ 1584222 1703785 1873812 1336834 1781274 1676338 1670502 1829627 1972441 1633752 1682228
16938A682228j7131N9746J13212J90672l62428N1681m7007M7686J70245J31903
$$ 1682228 1665097 1724843 1838055 2028727 1666299 1717980 1670973 1718659 1888904 2020807
16928B020807K7301R0411k34422j22921J37109m6857R9911J5009M70965j71961
$$ 2020807 2048108 2138519 1904097 1781176 1918285 1871428 1971339 1986348 2457313 2285352
16918B285352j23691K52930n19073M91850m29515K53873K82100k9971k24812j4314
$$ 2285352 2161661 2414591 1895518 2387368 1957853 2211726 2493826 2463855 2239043 2224729
16908B224729L02904k92764K56504J15699j24756J14817l79223N97151j15145
$$ 2224729 2527633 2234869 2491373 2607072 2482316 2597133 2217910 2815061 2699916
16899B699916J23428l44656K03579K200K05467j83997J3138J84143R5008k14883
$$ 2699916 2823344 2478688 2682267 2684467 2889934 2705937 2719075 2903218 2998226 2783343
16889B783343N13373j86464j56735K64519K26212l61931L16406K98498n48464
$$ 2783343 3296716 3110252 2953517 3218036 3444248 3082317 3398723 3697221 3148757
16880C148757K17241j33900L13361k81853O2925L76203j63550q3290J02467J96186
$$ 3148757 3365998 3232098 3545459 3263606 3326531 3702734 3539184 3455894 3558361 3754547
16870C754547L78227j89730j26540k4536j58694L72758M9702l9978K45343j09167
$$ 3754547 4132774 3943044 3816504 3791968 3633274 4006032 4055734 4015756 4261099 4151932
16860D151932j81204M65945o3051N4878M3313L26321j80480j29992N15041J50052
$$ 4151932 3970728 4436673 4373622 4428500 4471813 4798134 4617654 4487662 5002703 5152755
16850E152755k47544K54390R8669k58248N10519m04786Q7696K88346M1257j63382
$$ 5152755 4905211 5159601 5258270 5000022 5510541 5105755 5193451 5481797 5523054 5359672
16840E359672J35754K40504L15164j42244K05391j1104N51961m73195L92264L3384
$$ 5359672 5495426 5735930 6051094 5908850 6114241 6103137 6655098 6181903 6574167 6607551
16830F607551J3995J67531J83231J27889O978o9319P64877k66146J02185L16159
$$ 6607551 6621546 6789077 6972308 7100197 7107175 7037856 7802733 7536587 7638772 7954931
16820G954931J24983N1107L74012P9391R2935K20766k1071O62946l37922N84971
$$ 7954931 8079914 8131021 8505033 8584424 8677359 8898125 8877054 9540000 9202078 9787049
16810I787049K60193r7655J6689M98148K67286L49032M2964K19122L58524K35273
$$ 9787049 10047242 9949587 9966276 10464424 10731710 11080742 11123706 11342828 11701352 11936625
16800A1936625K16798M77121l9550L12800M10163N18754N35525q3826N39818L26457
$$ 11936625 12153423 12630544 12590994 12903794 13313957 13832711 14368236 14284410 14824228 15150685
16790A5150685J71189P16264N31331Q3836N03152K81262P46775J39861R35706
$$ 15150685 15321874 16038138 16569469 16653305 17156457 17437719 18184494 18324355 19260061
16781A9260061P41835J27520P11677O51607M56117O95821P56315L46079J078532
$$ 19260061 20001896 20129416 20841093 21492700 21948817 22644638 23400953 23747032 24825564
16772B4825564P65080L71446J319389R21298N49024J083209Q71680J241142R29555
$$ 24825564 25590644 25962090 27281479 28202777 28751801 29835010 30706690 31947832 32877387
16763C2877387R47658J555899J163069J193891J276441J312702J267254J692045
$$ 32877387 33825045 35380944 36544013 37737904 39014345 40327047 41594301 43286346
16755D3286346J820102J538015J627776J609243K160360J793129K041967K003271
$$ 43286346 45106448 46644463 48272239 49881482 52041842 53834971 55876938 57880209
16747E7880209K156685K246887K400201K222201K191903L036082K451047K484711
$$ 57880209 60036894 62283781 64683982 66906183 69098086 72134168 74585215 77069926
16739G7069926K667928K890393K494922K843234K621807K354311K699362K674123
$$ 77069926 79737854 82628247 85123169 87966403 90588210 92942521 95641883 98316006
16731I8316006K484415J759106K734112J484249K062058J130200J517214J042368
$$ 98316006 100800421 102559527 105293639 106777888 108839946 109970146 111487360 112529728
16723A12529728N91293N79264K76052l58260m93779q67308j138160j237991j354993
$$ 112529728 113121021 113700285 113976337 113618077 113124298 112256990 111118830 109880839 108525846
16714A08525846k153340j615181k208770k567861k303791k223561k764781l149786
$$ 108525846 106372506 104757325 102548555 99980694 97676903 95453342 92688561 89538775
16706H9538775k423875k939056k505268k978722k087835l019389k713784k730632
$$ 89538775 87114900 84175844 81670576 78691854 76604019 73584630 70870846 68140214
16698F8140214k294039k266107k109759k627247j943031k152936j553025k611075
$$ 68140214 65846175 63580068 61470309 58843062 56900031 54747095 53194070 50582995
16690E0582995j507887j607868j762887k014159j469289j279682j611878j372697
$$ 50582995 49075108 47467240 45704353 43690194 42220905 40941223 39329345 37956648
16682C7956648j469687q94483j167907j660477o70074j080696j102003o10811
$$ 37956648 36486961 35592478 34424571 32764094 32094020 31013324 29911321 29300510
16674B9300510j182638j106982q16389p53146o57903r95189l66059n88044q21824
$$ 29300510 28117872 27010890 26194501 25441355 24783452 23788263 23422204 22834160 22012336
16665B2012336o08340p85967m00752q11263m33236m09116m55543n50789l94019
$$ 22012336 21403996 20618029 20217277 19406014 18972778 18563662 18108119 17557330 17163311
16656A7163311n25398l31638p45239J55424p41442o74510j20257l59635j01334
$$ 17163311 16637913 16306275 15561036 15716460 14975018 14300508 14180251 13820616 13719282
16647A3719282n41097k74949l42772m98183m2607j68278k34750o25397j85364
$$ 13719282 13178185 12903236 12560464 12062281 12019674 11851396 11616646 10991249 10805885
16638A0805885Q0882k82400l29680m02453L51493m47803k48564O6860o90601J06787
$$ 10805885 10886767 10604367 10274687 9872234 10223727 9775924 9527360 9594220 8903619 9010406
16628I010406m13834l4689R3358m69733J04549m55715l3462k85554J3836k78860
$$ 9010406 8596572 8561883 8655241 8185508 8290057 7834342 7800880 7515326 7529162 7250302
16618G250302M8445k95746m4549q3648m6239j03448j36913k14703k87377J10848
$$ 7250302 7298747 7003001 6958452 6874804 6828565 6725117 6588204 6373501 6086124 6196972
16608F196972L5216k56532j53284q7759m42593L78811r4389k28471J06445k69510
$$ 6196972 6232188 5975656 5822372 5734613 5292020 5670831 5576442 5347971 5454416 5184906
16598E184906k88593K09328j43759N3522l90420L46768j95265k62600m79488N22749
$$ 5184906 4896313 5105641 4961882 5015404 4624984 4971752 4776487 4513887 4034399 4557148
16588D557148P131k4387j07482q7895R6986k31401l74323J34844J55444J44537
$$ 4557148 4564279 4539892 4432410 4344515 4441501 4210100 3835777 3970621 4126065 4270602
16578D270602o13563O882J83061J52817j43903l04598n5319K31291k12070j13965
$$ 4270602 3657039 3663921 3846982 3999799 3855896 3551298 3495979 3727270 3515200 3401235
16568C401235m8726J51353k81389j72806l9333L82748r3952l22050J33472N6830
$$ 3401235 3352509 3503862 3222473 3049667 3010334 3393082 3299130 2977080 3110552 3167382
16558C167382j62234j35882L29197n79570O74388l68283n3905M8822k83903J79729
$$ 3167382 3005148 2869266 3198463 2618893 3293281 2924998 2871093 2919915 2636012 2815741
16548B815741p2028j00876j88803K20667j32944L9082O885j06768L40279l48586
$$ 2815741 2743713 2642837 2454034 2674701 2541757 2580839 2587724 2480956 2821235 2472649
16538B472649j06344J24854P1288K13689o39899L87795n1886m88652M41543q4197
$$ 2472649 2366305 2491159 2562447 2776136 2136237 2524032 2472146 1983494 2425037 2340840
16528B340840q702J35491k37046R7378k75444o072j30184L13657j91902q2759
$$ 2340840 2332138 2467629 2230583 2327961 2052517 2046445 1916261 2229918 2038016 1955257
16518A955257J2853r6233J41981M4651l4704l51989J10594J14693k92103K31875
$$ 1955257 1968110 1871877 2013858 2058509 2023805 1671816 1782410 1897103 1605000 1836875
16508A836875k42348K78059q0004j51866J76807N236J03294j16109j30373k41479
$$ 1836875 1594527 1872586 1792582 1640716 1817523 1822759 1926053 1809944 1679571 1438092
16498A438092O09209l31849k37687M90835o42191M00672l70813K88291k3028K77997
$$ 1438092 2047301 1715452 1477765 1968600 1326409 1727081 1356268 1644559 1621531 1899528
16488A899528m17676K37738j3799k40261q9156j4432L91367m01605O7344K05488
$$ 1899528 1481852 1719590 1705791 1465530 1376374 1361942 1753309 1351704 1419048 1624536
16478A624536j60334M2924k8760R2165l72847k56104K14015j16253M29318J7340
$$ 1624536 1464202 1507126 1478366 1570531 1197684 941580 1155595 1039342 1468660 1486000
16468A486000R9326k57931k21859K52351J53532k58032M32019m18795k14677L58595
$$ 1486000 1585326 1327395 1105536 1357887 1511419 1253387 1685406 1266611 1051934 1410529
16458A410529k36689K98076l00787K170j70399J83159j21108J15973J08778j09683
$$ 1410529 1173840 1471916 1171129 1173299 1002900 1186059 1064951 1180924 1289702 1180019
16448A180019J10625j84336L92795l85403J81343k85188L05086m03682K80159
$$ 1180019 1290644 1106308 1499103 1113700 1295043 1009855 1314941 911259 1191418
16439A191418k96737L89040k67277j84344K2970P5988J30606l8895K05523l63774
$$ 1191418 894681 1283721 1016444 832100 855070 931058 1061664 1022769 1228292 864518
16429H64518L24347m06914o7418K02783J16609l02762L20238j15765L3353n6742
$$ 864518 1188865 781951 714533 917316 1033925 731163 1051401 935636 968989 912247
16419I12247J89619K2206r2437n07060N17958j39912l10603K69285J37N1044P5872
$$ 912247 1101866 1124072 1031635 524575 1042533 902621 592018 861303 861440 912484 988356
16408I88356l04565j39242L46777p3394J54195O2430l05280J14565l5388O3900
$$ 988356 683791 544549 891326 817932 972127 1034557 729277 843842 808454 872354
16398H72354J0449j43413L47532k23100k5992l38466K73340q0561j36014K36681
$$ 872354 882803 739390 1086922 863822 837830 499364 772704 692143 556129 792810
16388G92810P7524j17370j28180J17639j31652O3734K29684J09504k93529M0265
$$ 792810 870334 752964 624784 742423 610771 674505 904189 1013693 720164 760429
16378G60429J54761j48712K04833k68195l06829K23814N3411K22580k71685j36258
$$ 760429 915190 766478 971311 703116 396287 620101 673512 896092 624407 488149
16368D88149Q0885J17948P5907M9908O3090p9580l16594K00047P3216m1251J94808
$$ 488149 569034 686982 762889 812797 875887 796307 479713 679760 752976 711725 906533
16357I06533j73010q0655J50673k92055Q5099B87672L98922J18415l57299B17666
$$ 906533 733523 652868 803541 511486 596585 287672 686594 805009 447710 217666
16346E31029m9813j41828L69380O5801j04301R2345q0027J13605k67627J57781
$$ 531029 481216 339388 708768 774569 670268 762613 682586 796191 528564 686345
16336F86345k29041K67392m4039k0264B88291L32943L26649l00268o7668L51715
$$ 686345 457304 724696 680657 660393 288291 621234 947883 647615 579947 931662
16326I31662m41570J11263j2973J31387k77871j39085J32540o2591K84133m5661
$$ 931662 490092 601355 588382 719769 441898 302813 435353 372762 656895 611234
16316F11234k75505K55165j12839L8617L68806l86233J92309j93983j31648q768
$$ 611234 335729 590894 478055 516672 885478 499245 691554 497571 365923 357155
16306C57155P1128j71179L18474J84811k56924J91157j54945B30055K71709j17013
$$ 357155 428283 257104 575578 760389 503465 694622 539677 230055 501764 384751
16296C84751P9760L6457j06335n1023N1875L01930l6860j35214n1146B00083K40928
$$ 384751 464511 500968 394633 343610 395485 697415 660555 525341 474195 200083 441011
16285D41011R8656B64438K986J57063N03563k47536B74700p9505K20091j4428
$$ 441011 539667 264438 267424 424487 928050 680514 274700 195195 415286 400858
16275D00858K68552B39729L87985k69115K39232m9498k13973K02138j18332r9416
$$ 400858 669410 239729 627714 358599 597831 548333 334360 536498 418166 318750
16265C18750L36439P7370l10592j6393M8372L4792M142M242I5798M40183j57186
$$ 318750 655189 732559 421967 405574 453946 488738 492880 497122 95798 535981 378795
16254C78795r8599a8575A94123L03954I9287P4106M26287k23960O1295J7806B12116
$$ 378795 280196 -18575 194123 498077 99287 173393 599680 375720 437015 454821 212116
16242B38953J99622k13383A07735K21538J65221A74000K10053r5509K00956j75781
$$ 238953 438575 225192 107735 329273 494494 174000 384053 288544 489500 313719
16232C13719j6813r16K6839A0462M55004k17681d5651A94880O842J20134I3918
$$ 313719 296906 295990 322829 10462 465466 247785 -45651 194880 201722 321856 93918
16220C50272J6911J15413k16337J88696j42002A49441a8099C14133j08289K80265
$$ 350272 367183 482596 266259 454955 312953 149441 -18099 314133 205844 486109
16210D86109B5704J77148l6081J81814f2921D68878j13318n670J57279A34388
$$ 486109 25704 202852 166771 348585 -62921 468878 355560 349890 507169 134388
16199E21199o2208B26493d0325B00745d8594B34852J3320O2468B9365N25815E1380
$$ 521199 458991 226493 -40325 200745 -48594 234852 248172 310640 29365 555180 51380
16187C52263F3716N2196K73362d3952B45001P3225j10150I1860J28844k0787J03675
$$ 352263 63716 115912 389274 -43952 245001 318226 208076 91860 220704 199917 303592
16176C03592J01967A62116J6154l6229K91932A13099m7484K30325A11428N90728
$$ 303592 405559 162116 178270 142041 433973 113099 65615 295940 111428 702156
16166G02156B15337M36389c3058j8682B51722B1559a38916A20765J24423o5260
$$ 702156 215337 651726 -33058 -51740 251722 21559 -138916 120765 245188 179928
16156A79928l3621K95153m9147j06102K18565B28536L92n8036e84H2068j2984
$$ 179928 146307 441460 392313 286211 504776 228536 228928 170892 -584 82068 69084
16145F9084O8778b6626C33033j21125a25074L1212j700B90347J35384j64424d7941
$$ 69084 137862 -26626 333033 211908 -125074 -93862 -95562 290347 425731 261307 -47941
16133C83492j27373C3800K43035H1604K13389g0705B53309L46984D5636Q9892
$$ 383492 256119 33800 276835 81604 294993 -70705 253309 600293 45636 135528
16123A35528F0853J20639K53934l9699A59343a68963e4676C6831J2479J67924
$$ 135528 60853 181492 435426 395727 159343 -168963 -54676 36831 49310 217234
16113B17234b4246l0730F4987J60199A1532K97319N5465A58664J04902a8622H4216
$$ 217234 -24246 -54976 64987 225186 11532 308851 364316 158664 263566 -18622 84216
16101I0054J00815J97676r4679E8214J80606A10176b17801C71663A9008J86885
$$ 90054 190869 388545 293866 58214 238820 110176 -217801 371663 19008 205893
16091B05893B5373K29297E3952R3152D0497h8791E2503Q6882k6384K29709A03498
$$ 205893 25373 254670 53952 147104 40497 -88791 52503 139385 113001 342710 103498
16079A10884a6082B03658r3849J07125Q8556j15104b07456B05266G8328j1107
$$ 110884 -16082 203658 109809 216934 305490 190386 -207456 205266 78328 67221
16069F7221J37843a7761G4686K2485J51558k9079D8381a85959Q8042I7958b63729
$$ 67221 205064 -17761 74686 97171 248729 219650 48381 -185959 -97917 97958 -263729
16057G5244c28175A44043J9963J3801L6779M9332j08122e7541C94142A58583b64131
$$ 75244 -328175 144043 164006 177807 214586 263918 155796 -57541 394142 158583 -264131
16045b6326E9964K06547j20566A8735M45760E5868c7206J6303k44502A31205k8826
$$ -26326 59964 266511 145945 18735 464495 55868 -37206 -20903 -265405 131205 102379
16034A02379f2622l3478p80d7490A34866h6176A60207b37464A08446L14641A79085
$$ 102379 -62622 -96100 -96880 -47490 134866 -86176 160207 -237464 108446 423087 179085
16022b6794B36445m8995r2256J1598c9692A07102h3862c5500J1982D02134A94298
$$ -26794 236445 187450 95194 106792 -39692 107102 -83862 -35500 -23518 402134 194298
16010C8911Q9640M8628A9286f1042C07022A16030a3083A44698b8888F3479B981
$$ 38911 128551 177179 19286 -61042 307022 116030 -13083 144698 -28888 63479 2981
15998A48139J42308b89967A82080B3240J56838g0278B70147F3642g5654F1912
$$ 148139 290447 -289967 182080 23240 180078 -70278 270147 63642 -75654 61912
15987B41253K7071M83010J36527k30537M26404m71939n4230B64167J0351A13809
$$ 241253 268324 751334 887861 657324 1083728 611789 557559 264167 274518 113809
15976c8818E2803b1259q9357d6633B64883j07703K10598F3353J06847c06056d4037
$$ -38818 52803 -21259 -110616 -46633 264883 157180 367778 63353 170200 -306056 -44037
15964f2760B54056j21344m502a8045f378q6918D0689c2578A38121j2818J29246
$$ -62760 254056 132712 128210 -18045 -6378 -93296 40689 -32578 138121 125303 254549
15953B54549d1665m27794F2065a31471j01123C5982P4270g0162A13799D9259K292
$$ 254549 -41665 -469459 62065 -131471 -232594 35982 110252 -70162 113799 49259 51551
15942E1551b54050h6952J8449c3619E3169a35774I4232k4483g0535K8188A20384
$$ 51551 -254050 -86952 -68503 -33619 53169 -135774 94232 69749 -70535 -42347 120384
15930b23319k9952D0736N9030a19648j03347R9188J5783m2199j2349j20774B8762
$$ -223319 -253271 40736 99766 -119648 -222995 -123807 -108024 -150223 -162572 -283346 28762
15918D1771J81346c65503H1955a47900b4523l2004F337b3636p8303J3257A61492
$$ 41771 223117 -365503 81955 -147900 -24523 -56527 6337 -23636 -101939 -88682 161492
15906I6368b51009p304G8868J3119A6391K2081a42419j84306e8648A00898p070
$$ 96368 -251009 -258313 78868 91987 16391 38472 -142419 -326725 -58648 100898 93828
15895I3828a41022K6484A70990b30000A55651b4347B18450j6911n6734q528N342
$$ 93828 -141022 -114538 170990 -230000 155651 -24347 218450 201539 144805 136277 141619
15884A41619c8729A33968a07538B04857C7278J36083F555M8210d0437L732r6684
$$ 141619 -38729 133968 -107538 204857 37278 173361 6555 54765 -40437 -36705 -133389
15873a33389H4519N6108a45766A61038m6814a75149B06530a19808j0004b0207
$$ -133389 84519 140627 -145766 161038 114224 -175149 206530 -119808 -129812 -20207
15862G9962E254J32641N4354b93009d9552p9095B19733c50945C74816c70844b7689
$$ 79962 5254 137895 192249 -293009 -49552 -128647 219733 -350945 374816 -370844 -27689
15850h5960G3946c19260A35096a0332A95698e7577q5642A66648d8566k59441E8659
$$ -85960 73946 -319260 135096 -10332 195698 -57577 -143219 166648 -48566 -308007 58659
15838B2173b12959B01177H4129K46739A14158f6040I8074l6845J78625b60470
$$ 22173 -212959 201177 84129 330868 114158 -66040 98074 61229 239854 -260470
15827B24611f046A08165i6842A34667f2535A59587D2128d6356F8702e1265H5966
$$ 224611 -6046 108165 -96842 134667 -62535 159587 42128 -46356 68702 -51265 85966
15815F205e8850E2941J30482C4762c58322B02140a58514A39525j7243c11872A93076
$$ 6205 -58850 52941 183423 34762 -358322 202140 -158514 139525 122282 -311872 193076
15803a845j1510E9552B7397a77678b3023l38280M5403h9921j02380C5097a84696
$$ -1845 -13355 59552 27397 -177678 -23023 -361303 -315900 -89921 -192301 35097 -184696
15791f1460k9084B8818f0484k63448a1681o6250K3638p0707c3720B21081F9708
$$ -61460 -90544 28818 -60484 -323932 -11681 -77931 -54293 -125000 -33720 221081 69708
15779E2676A3067b5079d32k72342A9005a0686p6927c9053J7339j66799m8066a8759
$$ 52676 13067 -25079 -432 -272774 19005 -10686 -87613 -39053 -21714 -188513 -236579 -18759
15766H1912b09375m9305D8807A4072K53505g1218A76475a09869m8184C64523G7860
$$ 81912 -209375 -258680 48807 14072 267577 -71218 176475 -109869 -158053 364523 77860
15754A73079f5423E9965b40423f3223i229j24013B64270A3240h3413q4020F6855
$$ 173079 -65423 59965 -240423 -63223 -9229 -133242 264270 13240 -83413 -167433 66855
15742d2076H0803d9834H3716a19670c1890G637J70147a77420B26859j01316a99619
$$ -42076 80803 -49834 83716 -119670 -31890 7637 177784 -177420 226859 125543 -199619
15730a38792G9525a39834F2823f3215j44775m0467A85189d27006a37148M6366
$$ -138792 79525 -139834 62823 -63215 -207990 -248457 185189 -427006 -137148 -90782
15720i0782q5149h288B27597b42328B53489n4234K2537o983a25986I0908F217
$$ -90782 -175931 -8288 227597 -242328 253489 199255 221792 214809 -125986 90908 6217
15708G0540K01354A31876A6603C47e0685A48702n9155a41294b5280C3045a56103
$$ 70540 271894 131876 16603 347 -50685 148702 89547 -141294 -25280 33045 -156103
15696a85077R1957k4108M8330B2652K28902o6900k4878a72111B01764l0059B9554
$$ -185077 -93120 -117228 -68898 22652 251554 184654 159776 -172111 201764 171705 29554
15684A6827K4153N7066b55617a11026K1508Q25k513o6092A04750a3738C45878
$$ 16827 40980 98046 -255617 -111026 -89518 -88693 -91206 -157298 104750 -13738 345878
15672C78841a97869E5413J7528J35648R4196r1934g1564C9385J05812a88102f2129
$$ 378841 -197869 55413 72941 208589 302785 210851 -71564 39385 145197 -188102 -62129
15660g4482b4557E005J84783a71150H1730d0665m7646H4007l2596J40319a39785
$$ -74482 -24557 5005 189788 -171150 81730 -40665 -88311 84007 51411 191730 -139785
15648a78952j23795M4667B34705a97211A87471a47874G649J8305Q2104O8258c2494
$$ -178952 -302747 -258080 234705 -197211 187471 -147874 7649 25954 108058 176316 -32494
15636C0590b77005l1871a13305C08074g0340c957k63343b5475J0067j96796d6938
$$ 30590 -277005 -308876 -113305 308074 -70340 -3957 -267300 -25475 -15408 -212204 -46938
15624c16554b5720A50368K3261B1278O7952a21922r6360I4580N2706b77429b2968
$$ -316554 -25720 150368 173629 21278 89230 -121922 -218282 94580 147286 -277429 -22968
15612b14872H5807l9467K92379a29401a4359j48712f4388H5825a19416C0045e0305
$$ -214872 85807 46340 338719 -129401 -14359 -163071 -64388 85825 -119416 30045 -50305
15600B0931K6515b31561a07058r3402b3203a628F5997f5203l2847G6572a59104
$$ 20931 47446 -231561 -107058 -200460 -23203 -1628 65997 -65203 -98050 76572 -159104
15588B74339a84225B77444D5143J89156R7948a86705j76618A25738J57171d7770
$$ 274339 -184225 277444 45143 234299 332247 -186705 -363323 125738 282909 -47770
15577d11319b509A55622a31062B95517a22498k92446K02122f2571o5167M7435
$$ -411319 -2509 155622 -131062 295517 -122498 -414944 -212822 -62571 -127738 -80303
15567h0303k93935O5315h2910l40347A6369b85674e9030j96232C4713a01976k52369
$$ -80303 -374238 -308923 -82910 -423257 16369 -285674 -59030 -255262 34713 -101976 -354345
15556c54345a67942c2439A45825b48561A78664k3267a32312I5573J4624b7872
$$ -354345 -167942 -32439 145825 -248561 178664 155397 -132312 95573 110197 -27872
15545c23771A54369a27962C4936d3352I0738f0710A43496P880D1606K3551K36789
$$ -323771 154369 -127962 34936 -43352 90738 -60710 143496 151376 41606 65157 301946
15534C01946h6406C06139j11446H4736J39317b21410J02705A84432l4811K1929
$$ 301946 -86406 306139 194693 84736 224053 -221410 -118705 184432 149621 171550
15524A71550L1273B3935a71298D9593M45027A61285L1124b71142E6282L1823J29082
$$ 171550 202823 23935 -171298 49593 494620 161285 192409 -271142 56282 88105 217187
15513B17187o7129j9890f57C65985j75701f6509l894A28893b9435B15773B8780
$$ 217187 150058 130168 -657 365985 190284 -66509 -70403 128893 -29435 215773 28780
15501C3505J69685N6205a20708L7579a6983C9334a0492B73350i6593K2715j40711
$$ 33505 203190 259395 -120708 -83129 -16983 39334 -10492 273350 -96593 -73878 -214589
15490b14589E7194a92809K2174g3466d647G8835B9890j1463f8159B28115n947
$$ -214589 57194 -192809 -170635 -73466 -4647 78835 29890 18427 -68159 228115 222168
15479B22168r2900K06134c25855A92610L8804J36396L32977B98166L8746j13567
$$ 222168 129268 335402 -325855 192610 231414 367810 700787 298166 336912 223345
15469B23345C8921m181a34544d8758L8A73978a58989m706C22760a03580D7397
$$ 223345 38921 34740 -134544 -48758 -48720 173978 -158989 -163695 322760 -103580 47397
15457a75109B8739R1542n5462r974J71987J99231k02906K7444r1645k1990h6478
$$ -175109 28739 120281 64819 54845 226832 426063 223157 250601 158956 136966 -86478
15445F3556j2410J25388l562K66947J11173K94345j19512j98619o6240b7698Q961
$$ 63556 51146 176534 172972 439919 551092 845437 725925 527306 461066 -27698 -18737
15434a8737E4632a1479C06255A11080f46H7145Q3501A0098M2181b96387R5803
$$ -18737 54632 -11479 306255 111080 -646 87145 170646 10098 52279 -296387 -200584
15423b00584k3547R4390C34047A12154K30770a32442A04449D5315P515J35953
$$ -200584 -224131 -129741 334047 112154 342924 -132442 104449 45315 52830 188783
15413A88783o6557J93542c0510l251A83167o4858a7269D75460A9090P8987O0225
$$ 188783 122226 315768 -30510 -33761 183167 118309 -17269 475460 19090 98077 158302
15402A58302B27L5948K6581a27120E2757b34534h6946a2223j19687C1586L03525
$$ 158302 227 36175 62756 -127120 52757 -234534 -86946 -12223 -131910 31586 335111
15391C35111l9290a51699N6447D884b24044J06970B08661i1821B9689f8615I0559
$$ 335111 295821 -151699 -95252 4884 -224044 -117074 208661 -91821 29689 -68615 90559
15379I6475k369C7352L7014a02184F1025J24283m218L03682j29058j31423k3622
$$ 96475 94106 37352 74366 -102184 61025 185308 181090 484772 355714 224291 200669
15368B00669r4438O6450J83482c78258H7305O0522l59L39620D486f3789E4892
$$ 200669 106231 172681 356163 -378258 87305 147827 147468 487088 4486 -63789 54892
15356E16554A4636a01387B43852n4551o5663j8314J59927G4848A5841L19348a04594
$$ 516554 14636 -101387 243852 189301 123638 105324 265251 74848 15841 335189 -104594
15344A95669K6928j4239K20936A2018J38387J48384F4335b8534B37807a07171
$$ 195669 222597 208358 429294 12018 150405 298789 64335 -28534 237807 -107171
15333A25053i181A73511a66242j1995B21731A08253g3644B0706c5134A20056J49090
$$ 125053 -9181 173511 -166242 -178237 221731 108253 -73644 20706 -35134 120056 269146
15322B69146K124A3948K8246R0967d3715A66700g1332A31292R036Q7052K7721
$$ 269146 271270 13948 42194 133161 -43715 166700 -71332 131292 140328 227380 255101
15311B55101j18313a8697B83668M1660b77823A08583M431D3202J397K49268C6635
$$ 255101 136788 -18697 283668 325328 -277823 108583 113014 43202 44599 293867 36635
15299A12479A5638J83632f2591K6651A7147a60311a5039D76665A3849J87972E8662
$$ 112479 15638 199270 -62591 -35940 17147 -160311 -15039 476665 13849 201821 58662
15287i241H3369g4899k6688I6124H762M5660O5378j6317E1299B0891c0912n8373
$$ -9241 83369 -74899 -101587 96124 8762 54422 119800 103483 51299 20891 -30912 -89285
15275h9285c0731I8576C759b79708B48872F7188e104j25050B2851a88751a0981
$$ -89285 -30731 98576 3759 -279708 248872 67188 -5104 -130154 22851 -188751 -10981
15263G929b37196B58897J02139j38562J9492e0729q4879E3503R202L0957J1894
$$ 7929 -237196 258897 361036 222474 241966 -50729 -135608 53503 62705 93662 105556
15252A05556a07980E8592j7710b036p8766C06488A32051L2302M73758M83720M79287
$$ 105556 -107980 58592 40882 -2036 -80802 306488 132051 164353 638111 1121831 1601118
15241A601118l18228K2420K09768F29561h170A35144E0804i3501C74769J36252
$$ 1601118 1282890 1305310 1515078 629561 -8170 135144 50804 -93501 374769 511021
15231E11021g8303D6071J04304E9607J4238J27664o9135e2773A80531D3007a55995
$$ 511021 -78303 46071 150375 59607 73845 201509 132374 -52773 180531 43007 -155995
15219I8188f3190G7901J20574B7556p094b135n9585A41449f1917I1938C89J59655
$$ 98188 -63190 77901 198475 27556 20462 -2135 -61720 141449 -61917 91938 389 160044
15207A60044B2914e793A56532c17330a15923A18412a2444j39606B38146C6662
$$ 160044 22914 -5793 156532 -317330 -115923 118412 -12444 -152050 238146 36662
15196a00066p3558M6539L9113k5884F8802a55235A13138j8485J11688G8704J4728
$$ -100066 -173624 -127085 -87972 -113856 68802 -155235 113138 94653 206341 78704 93432
15185I3432N0068l7702C1165J74948a32782H5749J50674A2128K6171d5499H1948
$$ 93432 143500 105798 31165 206113 -132782 85749 236423 12128 38299 -45499 81948
15173B25024b68875F9760K59139A34717J93197g6899H3472M88816j85916A82681
$$ 225024 -268875 69760 328899 134717 327914 -76899 83472 572288 386372 182681
15162A76137N000K49834F7955c4077k49636A21818a24233A17427K9854J4594Q631
$$ 176137 181137 430971 67955 -34077 -283713 121818 -124233 117427 147281 161875 170506
15151A70506m7013L15981q8305c69269A00304B3702N5776l8771K85930a61381
$$ 170506 123493 439474 351169 -369269 100304 23702 79478 40707 326637 -161381
15140B44753C8091a94035E2070i146C3211g3423C4634Q7401J2274a42180J9331
$$ 244753 38091 -194035 52070 -9146 33211 -73423 34634 122035 134309 -142180 -122849
15129a22849B65894o965p0731b2773A35982g0068A79677a06592C90134q1187A07992
$$ -122849 265894 258929 188198 -22773 135982 -70068 179677 -106592 390134 308947 107992
15117C50186k9218b7510B42675K0001J99294k09524j5408m0623R5634A10118d1860
$$ 350186 320968 -27510 242675 262676 461970 252446 237038 196415 292049 110118 -41860
15105A85924k4053c9036a0217B00277O0206a35919H9817l114L861a05694B21263
$$ 185924 161871 -39036 -10217 200277 260483 -135919 89817 86703 90564 -105694 221263
15093D01559C9721K25018b9246m3582p9052b0479A11115m3573J22097C1588L82353
$$ 401559 39721 264739 -29246 -72828 -151880 -20479 111115 67542 189639 31588 413941
15082D13941j14060A17413l2365Q1788j6307m0782K60039C5807J16530o9777K36776
$$ 413941 299881 117413 85048 166836 150529 109747 369786 35807 152337 82560 319336
15071C19336p9299f1170E07828A83483O4218c90480A82396J36052J04646B0460
$$ 319336 240037 -61170 507828 183483 247701 -390480 182396 318448 423094 20460
15060c7312A7791O0925N62066I2194k4862K59641N5213f1625F4103J05959P3246
$$ -37312 17791 78716 640782 92194 67332 326973 382186 -61625 64103 170062 243308
15049B43308j19333K73401A02663M64912n4593p4870j94739K8662D5614L27755
$$ 243308 123975 397376 102663 567575 512982 438112 243373 272035 45614 373369
15039C73369Q3736j23847J70589j86167m3020K65155j78911J52050j41434N1693
$$ 373369 457105 333258 503847 317680 274660 539815 360904 512954 371520 423213
15029D23213K85611j52039q1095J13684K52391l84118A77301k4796J73936J08551
$$ 423213 708824 556785 475690 589374 841765 457647 177301 152505 326441 434992
15019D34992K47120k88009J5187j00594k9155N06R0035A83741K14785L4276K64766
$$ 434992 682112 394103 409290 308696 279541 280047 370082 183741 398526 432802 697568
15008F97568B96885K48962B60395j24122P0713Q221K29935m2255l0051J46424
$$ 697568 296885 545847 260395 136273 206986 215207 445142 402887 372836 519260
14998E19260K25391j76581j03758j74026L00132l5414B65303L14654k10989n7122
$$ 519260 744651 568070 464312 290286 590418 555004 265303 579957 368968 311846
14988C11846L24412b6314D10428J87150j17418J19097P1318C16484K52913N3953
$$ 311846 636258 -26314 410428 597578 480160 599257 670575 316484 569397 623350
14978F23350j57618Q9855B44417L14352k24257N4205p5954m195L12371k66129
$$ 623350 465732 555587 244417 558769 334512 388717 312763 308568 620939 354810
14968C54810j14159K88662e6404C03872J5847J18305A53030k3394K6630P1573
$$ 354810 240651 529313 -56404 303872 319719 438024 153030 129636 156266 227839
14958B27839J07658A16384K14724H1942K05214J77349B2073M03878k03123K61633
$$ 227839 335497 116384 331108 81942 287156 464505 22073 425951 222828 484461
14948D84461N9521k6297D8590M58224K2338k41409L65439k7023C11991K60516
$$ 484461 543982 517685 48590 506814 529152 287743 653182 626159 311991 572507
14938E72507o9245K96628C08831L52565k43650M6527k01002N67031N4232J49188
$$ 572507 503262 799890 308831 661396 417746 464273 263271 830302 884534 1033722
14928A033722l38380M09770K74946k6456K87347l82607l68172J73156L43481M871
$$ 1033722 695342 1105112 1380058 1353602 1640949 1258342 890170 1063326 1406807 1411678
14918A411678J42161k09730J50481N83412n25591o23111J7128J50191l09007k09651
$$ 1411678 1553839 1344109 1494590 2078002 1552411 929300 946428 1096619 787612 577961
14908E77961M5804k14243J09294A63802J77705Q7647L45587l31358j5783F1387
$$ 577961 623765 409522 518816 163802 341507 429154 774741 443383 427600 61387
14897B82510J46337r0924N3886j2214A18193Q0340L02002M9425p5305L89423k46047
$$ 282510 428847 337923 391809 379595 118193 198533 500535 549960 474655 864078 618031
14886F18031J54786j43884j15706R9186J94499p3833p0065J19519J23508j88746
$$ 618031 772817 628933 513227 612413 806912 733079 663014 782533 906041 717295
14876G17295l5509C37422J31033O0799n7114J76032k22920l1233J98338k30967
$$ 717295 681786 337422 468455 529254 472140 648172 425252 394019 592357 361390
14866C61390L56965j71252M83931k49663l65045M1809R5127J05060C03016o9402
$$ 361390 718355 547103 1031034 781371 416326 458135 553262 658322 303016 233614
14856B33614L98428B77744L01795j84356Q9829j09123m4075L87175j58667k03015
$$ 233614 632042 277744 579539 395183 485012 375889 331814 718989 560322 357307
14846C57307M2217J66114L54358j1930D53021O71806j71409j13174K45090E23605
$$ 357307 399524 565638 919996 908066 453021 1124827 953418 840244 1085334 523605
14835D29150P02258l06626j15540l0262j16658J90735m7602C22474K09593j6752
$$ 429150 1131408 824782 709242 678980 562322 753057 705455 322474 532067 515315
14825E15315k27937J15477J59123L14666j05137j65039n7865J20026L5050N8898
$$ 515315 287378 402855 561978 876644 771507 606468 548603 668629 703679 762577
14815G62577l6370k19511J37243K2337K37931l51483B43782O3257J36541K76838
$$ 762577 726207 506696 643939 666276 904207 552724 243782 307039 443580 720418
14805G20418n1856j1587J29499J59945j5673l21299J57437J55613m07352j84912
$$ 720418 668562 656975 786474 946419 930746 609447 766884 922497 515145 330233
14795C30233K49760o5566K67319j49219j42291J72210k61886L63136k95090M31715
$$ 330233 579993 514427 781746 632527 490236 662446 400560 763696 468606 900321
14785I00321l56120P7221o8104q2940N386J56759J810j86581J8537M90828J2548
$$ 900321 544201 621422 553318 470378 475764 632523 634333 447752 466289 957117 969665
14774I69665l11245L08521n4490l7673M9649l97474P02412m32144r8658C48453
$$ 969665 658420 966941 912451 874778 924427 526953 1229365 797221 698563 348453
14763D76842J2169J87200j06879B73757L96838O729j82773r3399O1981O6205j29113
$$ 476842 489011 676211 569332 273757 670595 677324 494551 401152 463133 529338 400225
14752D00225K50486J72053k04982R8828k94924M29909L7931j23657N4584l57786
$$ 400225 650711 822764 617782 716610 421686 851595 889526 765869 820453 462667
14742D62667J97093j526j6304K55565J44515D89860k4142P01208l26923L0607
$$ 462667 659760 658234 641930 897495 1042010 489860 465718 1166926 840003 870610
14732H70610K6406J0803J06091D85423N81907R4244M44139K3184k12170j56382
$$ 870610 897016 907819 1013910 485423 1067330 1161574 1605713 1628897 1416727 1260345
14722A260345K3154m55931J87776l16285J77513l02641m5123L07024N8688l39726
$$ 1260345 1283499 827568 1015344 699059 876572 573931 528808 835832 894520 554794
14712E54794M947L7751O86294F33413O04547k76056l10726N51709o9401k09937
$$ 554794 559741 597492 1283786 633413 1237960 961904 651178 1202887 1133486 923549
14702I23549J51716K09762K58084j06680J40272j41891o24015K78319M7195m58176
$$ 923549 1075265 1285027 1543111 1436431 1576703 1434812 810797 1089116 1136311 678135
14692F78135K86050O2442k15455J32203k36470M03757j35989j566l44108J93290
$$ 678135 964185 1026627 811172 943375 706905 1110662 974673 973107 628999 822289
14682H22289K36810l6951l92006L10762J15520j52493J81830j90861J680o2661
$$ 822289 1059099 1022148 630142 940904 1056424 903931 1085761 894900 896580 833919
14672H33919O3060L54906j36493j50569K6941R6172k69963L04535j73934K615
$$ 833919 896979 1251885 1115392 964823 991764 1087936 817973 1122508 948574 951189
14662I51189K17752k5888j26803N5493q2282K63700j06766p9848L4982k4537K05958
$$ 951189 1168941 1143053 1016250 1071743 989461 1253161 1146395 1066547 1101529 1076992 1282950
14651A282950J73317j96937J82079k81041K24761k91110m9199l6499K8921L17182
$$ 1282950 1456267 1259330 1441409 1160368 1385129 1094019 1044820 1008321 1037242 1354424
14641A354424r2643m1897M542O9687m35109L62658j34863l3757K30818j51641
$$ 1354424 1261781 1219884 1224426 1294113 859004 1221662 1086799 1053042 1283860 1132219
14631A132219K63996j31596J50378k79059O5258P5112j52286R3211O3939J22267
$$ 1132219 1396215 1264619 1414997 1135938 1201196 1276308 1124022 1217233 1281172 1403439
14621A403439N2923l5666l53264L38558J07966j74158J14321M0111o3792j46581
$$ 1403439 1456362 1420696 1067432 1405990 1513956 1339798 1454119 1494230 1430438 1283857
14611A283857M5356n475R3673L4871J48548o6880j0430K13118j46412j02716Q2785
$$ 1283857 1329213 1323738 1417411 1452282 1600830 1533950 1523520 1736638 1590226 1487510 1570295
14600A570295J45931k77139K50178r5861o5007j16530J76224J27132q9382L4377
$$ 1570295 1716226 1439087 1689265 1593404 1528397 1411867 1588091 1715223 1625841 1660218
14590A660218J74588k12349J76355k70489J30271K00035P801J86450n1019j03175
$$ 1660218 1834806 1622457 1798812 1528323 1658594 1858629 1866430 2052880 2001861 1898686
14580A898686l44692J1750M20933O4082N97k3246j77175J07185k06103K23974
$$ 1898686 1553994 1565744 1986677 2050759 2051356 2028110 1850935 1958120 1752017 1975991
14570A975991K06773l8636j27114R0782k04352L87648J91751r0215M00855j64807
$$ 1975991 2182764 2144128 2017014 2107796 1903444 2291092 2482843 2392628 2793483 2628676
14560B628676M0058J06332q7454j87406N54672K35257j59732Q20617P7605O16674
$$ 2628676 2668734 2775066 2687612 2500206 3054878 3290135 3130403 3951020 4028625 4645299
14550D645299J115760K125997L442573P410586J4316305N537800A9052570G669033
$$ 4645299 5761059 7887056 11329629 18740215 33056520 38594320 19052570 7669033
14541D697310j294032m32405R11745P18934r52390j337299m48635K21854j08042
$$ 4697310 3403278 2970873 3882618 4601552 3649162 2311863 1863228 2085082 1977040
14532A977040K57816m92733n834J29480M56733j98790J7431J64444l43060N05856
$$ 1977040 2234856 1742123 1736289 1865769 2322502 2123712 2141143 2305587 1962527 2468383
14522B468383k12090M24034n57641N44434k55444j81521J13788J25500j39109
$$ 2468383 2256293 2680327 2122686 2667120 2411676 2230155 2343943 2469443 2330334
14513B330334L38104k32538J85219J9749o2548K77977l0121j87870r1230j4838
$$ 2330334 2668438 2435900 2621119 2640868 2578320 2856297 2826176 2638306 2547076 2532238
14503B532238M44251l6216K92577m97039J61152P9413J31023l15232K53110k8672
$$ 2532238 2976489 2940273 3232850 2735811 2896963 2976376 3107399 2792167 3045277 3016605
14493C016605L47628j48608O6784k88423m4747L39712L58033m19088L84343J21215
$$ 3016605 3364233 3215625 3282409 2993986 2949239 3288951 3646984 3227896 3612239 3733454
14483C733454k62876N5455J08957K21613j16616j9739J56015m97114O14881L904
$$ 3733454 3470578 3526033 3634990 3856603 3739987 3720248 3876263 3379149 3994030 3997934
14473C997934k05988K63213K01129m89166J86046j7870L38175J44176j50541k42222
$$ 3997934 3791946 4055159 4256288 3767122 3953168 3935298 4273473 4417649 4267108 4024886
14463D024886M75463j02684p6394o8150K88586q7931L64456k16475K21606j07635
$$ 4024886 4500349 4397665 4321271 4253121 4541707 4453776 4818232 4601757 4823363 4715728
14453D715728j02341M36660J6956M170R2641J99581k34320M5749J01934K47852
$$ 4715728 4613387 5050047 5067003 5071173 5163814 5363395 5129075 5174824 5276758 5524610
14443E524610j32614K55711M4766n5473K50685j16564L28303N617j52232L16778
$$ 5524610 5391996 5647707 5692473 5637000 5887685 5771121 6099424 6105041 5952809 6269587
14433F269587k71467M52826L77465j50818k72154N74374J0462p06821N65534J24806
$$ 6269587 5998120 6450946 6828411 6677593 6405439 6979813 6990275 6283454 6848988 6973794
14423F973794K78591L62480j64083K65582M5860L83402L4495J12115N3163l04932
$$ 6973794 7252385 7614865 7450782 7716364 7762224 8145626 8180121 8292236 8345399 8040467
14413H040467L7096J96601J57196K87323N3302L58037m394L81425n3635M07480
$$ 8040467 8077563 8274164 8431360 8718683 8771985 9130022 9125628 9507053 9453418 9860898
14403I860898L9911P2144J64605j67008K95412J34304K20810J89382J38436p4013
$$ 9860898 9900809 9972953 10137558 9970550 10265962 10400266 10621076 10810458 10948894 10874881
14393A0874881J15523L83421m3760L55558K67718K171N89894l6526M08504M28901
$$ 10874881 10990404 11373825 11330065 11685623 11953341 11955512 12545406 12508880 12917384 13346285
14383A3346285N8550N8056M56661K11177L3879P22574J54311J18598K30406N10279
$$ 13346285 13404835 13462891 13919552 14130729 14164608 14887182 15041493 15160091 15390497 15900776
14373A5900776R1544O90693P6475N63005l9530N29588L51667L41783M23824K44121
$$ 15900776 15992320 16683013 16759488 17322493 17282963 17812551 18164218 18506001 18929825 19173946
14363A9173946P70868M44814k90362N83339J104045j29456L97954P42600N19049
$$ 19173946 19944814 20389628 20099266 20682605 21786650 21657194 22055148 22797748 23316797
14354B3316797P87728K48031M98094R45342L2070J066756O01999N16848O74963
$$ 23316797 24104525 24352556 24850650 25795992 25828062 26894818 27496817 28013665 28688628
14345B8688628O52974J042523Q00917R42177N84071J317049P38347J249073O80739
$$ 28688628 29341602 30384125 31185042 32127219 32711290 34028339 34766686 36015759 36696498
14336C6696498R92756J261757R11230J014977J665864J126094J803384J333895
$$ 36696498 37689254 38951011 39862241 40877218 42543082 43669176 45472560 46806455
14328D6806455J418305J174905J738015J614105K003379J994427K034593J963756
$$ 46806455 48224760 49399665 51137680 52751785 54755164 56749591 58784184 60747940
14320F0747940K007528K167597K547229K592730K601259K416242L041569L028838
$$ 60747940 62755468 64923065 67470294 70063024 72664283 75080525 78122094 81150932
14312H1150932L585829L050257L806596L993021L749191M048644M536631M848704
$$ 81150932 84736761 87787018 91593614 95586635 99335826 103384470 107921101 112769805
14304A12769805N248671N099387N627702N714834O600855O838012O742371P516997
$$ 112769805 118018476 123117863 128745565 134460399 141061254 147899266 154641637 162158634
14296A62158634P899272Q273375Q922609R389308R764640J0386725J0628567J1340398
$$ 162158634 170057906 178331281 187253890 196643198 206407838 216794563 227423130 238763528
14288B38763528J1915753J2112223J2527009J2991015J3407580J3034194J3717281
$$ 238763528 250679281 262791504 275318513 288309528 301717108 314751302 328468583
14281C28468583J3135636J3599901J2689016J2692455J1149580J0701344Q783320
$$ 328468583 341604219 355204120 367893136 380585591 391735171 402436515 411219835
14274D11219835N711885K655681J203391M60073K06618K34539k643291n770527
$$ 411219835 416931720 419587401 420790792 421250865 421457483 421692022 419048731 413278204
14266D13278204p237925q195684r539464j1149085j2316771j2991795j3795773
$$ 413278204 406040279 397844595 388305131 377156046 364839275 351847480 338051707
14259C38051707j3807659j4175607j4096451j4322772j3274421j3236917j2616134
$$ 338051707 324244048 310068441 295971990 281649218 268374797 255137880 242521746
14252B42521746j2300773j1399213j1155171r775900q466485r975769r214808
$$ 242521746 230220973 218821760 207666589 197890689 189424204 179448435 170233627
14245A70233627p867516p645211p282591o954798o663644n755770o074499n250126
$$ 170233627 162366111 154720900 147438309 140483511 133819867 128064097 121989598 116739472
14237A16739472n012124m925498m223087m721356m163942l590052l295182l510422
$$ 116739472 111727348 106801850 102578763 97857407 93693465 90103413 86808231 83297809
14229H3297809k945495l547062k854930k956385k527945k371059k346823k523575
$$ 83297809 80352314 76805252 73950322 70993937 68465992 66094933 63748110 61224535
14221F1224535j758481k355414j519929k124855j739230j494147j592591j094379
$$ 61224535 59466054 57110640 55590711 53465856 51726626 50232479 48639888 47545509
14213D7545509j548354j515823j673464j267316p95804j413345o76338q89535
$$ 47545509 45997155 44481332 42807868 41540552 40744748 39331403 38655065 37765530
14205C7765530j323057j190450j002692q85540o89259o48933r91883j106239m33702
$$ 37765530 36442473 35252023 34249331 33363791 32674532 32025599 31033716 29927477 29493775
14196B9493775p97609p24054o95588n00077o65358j101100l98651l02494n52792
$$ 29493775 28696166 27972112 27276524 26776447 26111089 25009989 24611338 24308844 23756052
14187B3756052p58114o96610o02412o67981k82309n15558K7800o96052k50351
$$ 23756052 22997938 22301328 21698916 21030935 20748626 20233068 20260868 19564816 19314465
14178A9314465o29972q5969n60427n14466n9301n21908j62822o65521j72673j94326
$$ 19314465 18684493 18598524 18038097 17523631 17464330 16942422 16779600 16114079 15941406 15747080
14168A5747080k25296k30608m62471k32712l12882j40198j92669l61885l35980
$$ 15747080 15521784 15291176 14828705 14595993 14283111 14142913 13950244 13588359 13252379
14159A3252379r4486o27673M04875k49180m48622m41037k09571J61821j16602
$$ 13252379 13157893 12530220 12935095 12685915 12237293 11796256 11586685 11748506 11631904
14150A1631904n63596j48517l84221M16078o17707R9280o34187L38630l06210
$$ 11631904 11068308 10919791 10535570 10951648 10333941 10433221 9799034 10137664 9831454
14141I831454m44000M255k02556J84742l36505L0428j73357Q7796j20378p24696
$$ 9831454 9387454 9391709 9189153 9373895 9037390 9067818 8894461 8982257 8861879 8137183
14131H137183M26985p27267j6976L40014j78803j03718k57356K22213l14016k10104
$$ 8137183 8564168 7836901 7819925 8159939 7981136 7877418 7620062 7842275 7528259 7318155
14121G318155M4540k74206m166J51634l58276j28297K52285m31583j47433K4782
$$ 7318155 7362695 7088489 7084323 7235957 6877681 6749384 7001669 6570086 6422653 6447435
14111F447435j52214N8691k75758K88999j88017p0791j14467k42300k62400O57033
$$ 6447435 6295221 6353912 6078154 6367153 6179136 6108345 5993878 5751578 5489178 6146211
14101F146211o10700j97689J55650r2885M4229j88764K07471j04674k79197n0377
$$ 6146211 5535511 5337822 5493472 5400587 5444816 5256052 5463523 5358849 5079652 5029275
14091E029275j53655K81935j88248o0589J54637l93135R8768k90434J37354k27330
$$ 5029275 4875620 5157555 4969307 4908718 5063355 4670220 4768988 4478554 4615908 4388578
14081D388578K26682k8757l90891J46537J02848k2609l80555K2576M974J71680
$$ 4388578 4615260 4586503 4195612 4342149 4444997 4422388 4041833 4064409 4069383 4241063
14071D241063j95818J97158k81783k1027K09547n0019m75075K89021R751k63535
$$ 4241063 4045245 4242403 3960620 3939593 4149140 4099121 3624046 3913067 3922818 3659283
14061C659283L90031r0773n1372k19420K8828k5186n9148j73757J56447j13975
$$ 3659283 4049314 3958541 3907169 3687749 3716577 3691391 3632243 3458486 3614933 3500958
14051C500958K04655j06906j38619k00956J02352j86909q0136k34419L3959M9325
$$ 3500958 3705613 3598707 3460088 3259132 3361484 3174575 3094439 2860020 2893979 2943304
14041B943304L80174K28878q00234K42396k32717K99155j69863L7775J21378m40855
$$ 2943304 3323478 3552356 2752122 2994518 2761801 3060956 2891093 2928868 3050246 2609391
14031B609391K77868K58198j65172k47608R216J10810k07035j47453q692J03962
$$ 2609391 2887259 3145457 2980285 2732677 2741893 2852703 2645668 2498215 2489523 2593485
14021B593485J00730M581k45115K13338j53790J84747j19191j02082j11982j8494
$$ 2593485 2694215 2698796 2453681 2667019 2513229 2697976 2578785 2476703 2364721 2346227
14011B346227k98710K97410j47739j86933j2747N2241j17545K46520k84854K33137
$$ 2346227 2047517 2344927 2197188 2010255 1997508 2049749 1932204 2178724 1893870 2127007
14001B127007p3332j44302K38267j89883L69274m68277L40736l75961j69876L62940
$$ 2127007 2053675 1909373 2147640 1957757 2327031 1858754 2199490 1823529 1653653 2016593
13991B016593K53566R03921J527372K187687O075242J3129750J3264433j3914563
$$ 2016593 2270159 3174080 4701452 6889139 12964381 26094131 39358564 25444001
13983B5444001j2143153n366508k261008j245288o96491m06093m79670K82446
$$ 25444001 13300848 7934340 5673332 4428044 3731553 3325460 2845790 3128236
13975C128236l79572m08273K57847n2364k72179M26559p07098M4604j65426N93458
$$ 3128236 2748664 2340391 2598238 2545874 2273695 2700254 1993156 2037760 1872334 2465792
13965B465792q9442j15401m20996M65138l36536J39720k63334J08520l23444J85417
$$ 2465792 2376350 2260949 1839953 2305091 1968555 2108275 1844941 1953461 1630017 1815434
13955A815434P7442K00522J24874n46634J8143j26296K92964k06442j08281J51619
$$ 1815434 1892876 2093398 2218272 1671638 1689781 1563485 1856449 1650007 1541726 1693345
13945A693345J5115k43180L17569j61439K80015o20689L57397k69580Q5193K23783
$$ 1693345 1708460 1465280 1782849 1621410 1901425 1280736 1638133 1368553 1453746 1677529
13935A677529j73761L00282k11405L18474m03001R9804j35455J16157q304n8962
$$ 1677529 1503768 1804050 1592645 1911119 1508118 1607922 1472467 1588624 1580320 1521358
13925A521358J95482k92147R251J66403m57201N05931j67926k670o3675j57637
$$ 1521358 1716840 1424693 1433944 1600347 1143146 1649077 1481151 1478481 1414806 1257169
13915A257169p4076j47786K97888J00351J7264l13091J87557P2847j40731M25352
$$ 1257169 1183093 1035307 1333195 1433546 1450810 1137719 1325276 1398123 1257392 1682744
13905A682744n32721J28430R4525K74018k90756j25310P6216k19425L46962l07040
$$ 1682744 1150023 1278453 1372978 1646996 1356240 1230930 1307146 1087721 1434683 1127643
13895A127643q6836J19440K2540l5948q6080L37379l70891J11373J3929k14668
$$ 1127643 1040807 1160247 1182787 1146839 1060759 1398138 1027247 1138620 1152549 937881
13885I37881L38354k76261K61289k72331J25466L14729k57473j95311N6944J06816
$$ 937881 1276235 999974 1261263 988932 1114398 1429127 1171654 976343 1033287 1140103
13875A140103k2005j96356M4823k9513J76375j04728j47279P2627J83817j20759
$$ 1140103 1118098 921742 966565 937052 1113427 1008699 861420 934047 1117864 997105
13865I97105j45094n9220L81706q7772j42724K52708n14227M31329l91660K98975
$$ 997105 852011 792791 1174497 1086725 944001 1196709 682482 1113811 722151 1021126
13855A021126R4361j74766K99570n29343K41429P8528k7495m61497M05766j6937
$$ 1021126 1115487 940721 1240291 710948 952377 1030905 1003410 541913 947679 930742
13845I30742J09302O2739l46079M74257l79128K8171J07298k23303K06779j25117
$$ 930742 1040044 1102783 756704 1230961 851833 880004 987302 763999 970778 845661
13835H45661o6595Q7358M41097m60711L57579m07636k63986M29784j56552j40484
$$ 845661 779066 866424 1307521 846810 1204389 796753 532767 962551 805999 665515
13825F65515J28671Q4270J50435k98344L1490O1562k24368J17549L3285q66J02385
$$ 665515 794186 878456 1028891 730547 762037 823599 599231 716780 750065 749199 851584
13814H51584P2272k90822J07822M3348K8356m3792o7730j87426O12871D65517
$$ 851584 923856 633034 740856 784204 812560 768768 701038 513612 1126483 465517
13803F10138L94074p5207n4735l35000K00638l13904M02699l06396K44112Q9741
$$ 610138 1004212 929005 874270 539270 739908 426004 828703 522307 766419 856160
13793H56160j06935B28481N73948k4825K04698j69321C69358K06816o1827j13437
$$ 856160 749225 228481 802429 777604 982302 812981 369358 576174 514347 400910
13783D00910j38395N15767k4703K01884D49105K35380l6200J43006j29284o5821
$$ 400910 262515 778282 753579 955463 449105 684485 648285 791291 662007 596186
13773E96186K20795O8919m07416L04698j03441k88730K27307M02257l64947M0962
$$ 596186 816981 885900 478484 783182 679741 391011 618318 1020575 655628 696590
13763F96590j57617j22755j8473L13260j47298j81933K83740k77147K75843j59541
$$ 696590 538973 416218 397745 711005 563707 381774 665514 388367 664210 504669
13753E04669l9917K27969k23268j68242M30524C21594K12165B08049N24123l43629
$$ 504669 464752 692721 469453 301211 731735 321594 533759 208049 732172 388543
13743C88543O4515L03130m1146j07169L1140j16114P097Q547L06774C51457J59222
$$ 388543 453058 756188 715042 607873 639013 522899 529996 538543 845317 351457 510679
13732E10679l7208q7707L70171j8331m014j71818j15717M13797k97046J46560
$$ 510679 473471 385764 755935 737604 733590 561772 446055 859852 562806 709366
13722G09366m9201M0627k36086J66490m1523j17745k06982L70966A83151O84304
$$ 709366 660165 700792 464706 631196 589673 471928 264946 635912 183151 867455
13712H67455A79566O41041C89071A46824K16672K02522j31540N0155n3178P8625
$$ 867455 179566 820607 389071 146824 363496 566018 434478 484633 431455 510080
13702E10080l1292l1834J54283B11160L64122j10329J17989K52415l55074m2423
$$ 510080 478788 446954 601237 211160 575282 464953 582942 835357 480283 437860
13692D37860j7613J81774o2658K90405C41818l6616L17157j69267K8155q7485
$$ 437860 420247 602021 539363 829768 341818 305202 622359 453092 481247 393762
13682C93762A35462L80327J2j20828j09246L04166O1901B2087J57275G8533K56492
$$ 393762 135462 515789 515801 394973 285727 589893 651794 22087 179362 78533 335025
13671C35025K81994j99599J20997k47704A33790M72184o7139j91225K59993B66876
$$ 335025 617019 417420 538417 290713 133790 605974 538835 347610 607603 266876
13660F73699A98613K02628O031Q0161A58105K45668K71286Q7271B96808L17196
$$ 673699 198613 401241 407272 487433 158105 403773 675059 762330 296808 614004
13650F14004O2194k31478J20494A44141N36533j47826k34959h9370C05979K37232
$$ 614004 676198 444720 565214 144141 680674 532848 297889 -89370 305979 543211
13640E43211j94866O2834J25875A20430P0645J65678r4479K5495F7907L81119
$$ 543211 348345 411179 537054 120430 191075 356753 262274 287769 67907 449026
13630D49026j32137J72793N8491p1473l0097j84383R3885L7737N11337C34341
$$ 449026 316889 489682 548173 476700 446603 262220 356105 393842 905179 334341
13619B45171L99464B04224N7468B5883M06977D4003l03N10207B20508G1920L10097
$$ 245171 644635 204224 261692 25883 432860 44003 43700 553907 220508 71920 382017
13608C82017p5880K5263K20116B06048K98023M8484e8042E56538B42936r1596
$$ 382017 306137 331400 551516 206048 504071 552555 -58042 556538 242936 151340
13598A51340L96815A76367M06647F5130K07453L26116a32773A19219M60220B73133
$$ 151340 548155 176367 583014 65130 272583 598699 -132773 119219 579439 273133
13587B57672j8173e0362A60618K39599h4112B69358J69907l1316A51433J61537
$$ 257672 239499 -50362 160618 400217 -84112 269358 439265 407949 151433 312970
13577C12970j41310a5587E34989e7726B46797O6021j29849j0362J45288A51463
$$ 312970 171660 -15587 534989 -57726 246797 312818 182969 172607 317895 151463
13566A90574J97267e9829m0759E73026A45011K00128j62848K30024l9350a17103
$$ 190574 387841 -59829 -100588 573026 145011 345139 182291 412315 372965 -117103
13555A61046J7753K07751A3423J10580J09401J89960k07397c8651A88120K09138
$$ 161046 178799 386550 13423 124003 233404 423364 215967 -38651 188120 397258
13545C97258q1520L0172n6533A02145P0585K76757A19155M67137B67903f4937
$$ 397258 315738 345910 289377 102145 172730 449487 119155 586292 267903 -64937
13534G0516l4253O2105J14279K71043k18883K2570Q555J08567A3284J06540R3744
$$ 70516 36263 98368 212647 483690 264807 287377 295932 404499 13284 119824 213568
13523B13568P9081Q4137j08941j5725L33233B66163J60719C1608L00334R8060
$$ 213568 292649 376786 267845 252120 585353 266163 426882 31608 331942 430002
13513D30002j95996H3768K98514R0333A69392J37527A16162K37228J31350R6954
$$ 430002 234006 83768 382282 472615 169392 306919 116162 353390 484740 581694
13503E81694k07587j65764J805P2216A29199M64449j68900b00405B72252N6805
$$ 581694 374107 208343 210148 282364 129199 593648 424748 -200405 272252 329057
13493C29057l07p4093K4489J15784j38859e3378D02960A05499a9514E2122B0760
$$ 329057 328750 254657 279146 394930 256071 -53378 402960 105499 -19514 52122 20760
13481A80504m994F9487J22292J7977D9255R6006Q4044j00846K40481j62921J49640
$$ 180504 175510 69487 191779 209756 49255 145261 229305 128459 368940 206019 355659
13470C55659k2801H4148a68868H5528J01715Q4006K86630A51880J24650p2709
$$ 355659 332858 84148 -168868 85528 187243 271249 557879 151880 276530 203821
13460B03821h609A75437P8051J60915j7360l9662h6335C03535a28085A11412a78044
$$ 203821 -8609 175437 253488 414403 397043 357381 -86335 303535 -128085 111412 -178044
13448F3896O9421J71450L8258A8506K47306J7512j5001k4235J97714A8044M3000
$$ 63896 133317 304767 343025 18506 265812 283324 268323 244088 441802 18044 61044
13437F1044b071F2447J33713J91451A17625L51463c7363A50478J59028J9362b28529
$$ 61044 -2071 62447 196160 387611 117625 469088 -37363 150478 309506 328868 -228529
13425A05342k9819A1065N00662j01278B8248K27866r5977K96933A3361R9793N4022
$$ 105342 75523 11065 511727 410449 28248 256114 160137 457070 13361 113154 167176
13414A67176i9354A44746N6850b28540f9530A24869a6848C99454p5864A3311K48520
$$ 167176 -99354 144746 201596 -228540 -69530 124869 -16848 399454 323590 13311 261831
13403B61831r520K10739c3719E7521a14079A31235J59015C0125K9289d8444A73657
$$ 261831 252311 463050 -33719 57521 -114079 131235 290250 30125 59414 -48444 173657
13391B69419B2506L96594A2320K55334b74066A21364K14282A51459C6010J61618
$$ 269419 22506 419100 12320 267654 -274066 121364 335646 151459 36010 197628
13381A97628L14524B45360j0080N9627A23548i96E2017a14220b8378C06813o3714
$$ 197628 512152 245360 235280 294907 123548 -996 52017 -114220 -28378 306813 243099
13370B43099A1623N8521K26253A31856o2672q725K43566E0767N9601C5800N16623
$$ 243099 11623 70144 296397 131856 69184 60459 304025 50767 110368 35800 552423
13359E52423B32503a4264a45A99196j4639b5122D2663J32495K4229F6712K75862
$$ 552423 232503 -14264 -145 199196 184557 -25122 42663 175158 199387 66712 342574
13348C42574a094C48141a4653A1514J63462J02490L79358D4609K55192R9826p5538
$$ 342574 -1094 348141 -14653 11514 174976 277466 656824 44609 299801 399627 324089
13337C24089j57351J35152a3102C38165a83917C5942L28186j57197O4350j30002
$$ 324089 166738 301890 -13102 338165 -183917 35942 364128 206931 271281 141279
13327A41279a09858m839P270C19015i5709A12633L0527J10738q8292p0943B5483
$$ 141279 -109858 -114697 -107427 319015 -95709 112633 143160 253898 165606 94663 25483
13315A79909O86J19333n7145I9947i8223C6304j2785c8893A94710H1793A0890
$$ 179909 180595 299928 242783 99947 -98223 36304 23519 -38893 194710 81793 10890
13303B15092J09581I1740K70405I1768L9480l6161e1768B56244J0d3601L14L111
$$ 215092 324673 91740 362145 91768 131248 95087 -51768 256244 256254 -43601 -43287 -40176
13291d0176j76288I6658J3592J12074k6089L2861p4119h1889B93097r9985J96285
$$ -40176 -216464 96658 110250 222324 196235 229096 154977 -81889 293097 193112 389397
13280C89397h5450H2227P0605j2852J76385f5662A04563b40102e767G7099J41465
$$ 389397 -85450 82227 152832 139980 316365 -65662 104563 -240102 -5767 77099 218564
13269B18564g8118k18139B81243C2094K55753m7919A14432L40967D1477a20124
$$ 218564 -78118 -296257 281243 32094 287847 239928 114432 455399 41477 -120124
13258A29122n2452a93058B08092R9275c0389C29250A51738a02366a3694B9086
$$ 129122 76670 -193058 208092 307367 -30389 329250 151738 -102366 -13694 29086
13247A2405J42665P3638l1217a06754k37450A336h0857A74787a245A21410d883
$$ 12405 155070 228708 197491 -106754 -344204 1336 -80857 174787 -1245 121410 -4883
13235C23387n2145E3516J52147r5632K8784k0927J10439m2791a67481D4887Q3910
$$ 323387 271242 53516 205663 110031 138815 117888 228327 185536 -167481 44887 128797
13224A28797E7953h6288B5036K01605l0648K59417A11531E3850J63706j5763a603
$$ 128797 57953 -86288 25036 226641 195993 455410 111531 53850 217556 201793 -1603
13212a05995l0508J4860A64358p1306d9353l1827B69747j14858N5134M8440f7180
$$ -105995 -136503 -121643 164358 93052 -49353 -81180 269747 154889 210023 258463 -67180
13200A2995K50907o0181A7107P0496J96044B120f2220E31738H4555k1017P4767
$$ 12995 263902 203721 17107 87603 283647 2120 -62220 531738 84555 63538 138305
13189A38305a63213D6445L60417a56143A75365J02621a38446C5865e3018m1828
$$ 138305 -163213 46445 406862 -156143 175365 277986 -138446 35865 -53018 -94846
13179i4846A28712D5442K03113A05078B5750h4421F4516j0548h0510r8291A17588
$$ -94846 128712 45442 248555 105078 25750 -84421 64516 53968 -80510 -178801 117588
13167c8568o671H6729b04907D48357a10730N1951C23485b25030A67666c5701C9862
$$ -38568 -45239 86729 -204907 448357 -110730 -58779 323485 -225030 167666 -35701 39862
13155b25345e1939m1928F3303a00919C58691j78280b050A09312a71335A89841
$$ -225345 -51939 -93867 63303 -100919 358691 180411 -2050 109312 -171335 189841
13144a91040B25909D4235J31744E7225b04784m8990A79994d6455k7396p8010A94907
$$ -191040 225909 44235 175979 57225 -204784 -253774 179994 -46455 -73851 -151861 194907
13132D58404B7213P6890J1875O1305d3158j31116K4787l2258c7031A05418J35295
$$ 458404 27213 104103 115978 177283 -43158 -174274 -149487 -181745 -37031 105418 240713
13121B40713L8220E8997g9599D44416a5466A4787e5734l53835I5310O7343K90600
$$ 240713 278933 58997 -79599 444416 -15466 14787 -55734 -409569 95310 162653 453253
13110D53253A32532P1297a39210D3223A9558l801O0094a98466A49317C1781O4342
$$ 453253 132532 203829 -139210 43223 19558 15757 75851 -198466 149317 31781 96123
13099I6123c47667A18572J34556F1225J3003f1723p5342B15697J58329P597a29007
$$ 96123 -347667 118572 253128 61225 74228 -61723 -137065 215697 374026 381623 -129007
13087i820A21232i4759b7028j93325l2132B30036h9201k98418a03228C82771d5886
$$ -9820 121232 -94759 -27028 -220353 -252485 230036 -89201 -387619 -103228 382771 -45886
13075H360M3770h4432A72927p6616O3597R8725J6665d0998k5583B68749c4653
$$ 8360 52130 -84432 172927 96311 159908 258633 275298 -40998 -66581 268749 -34653
13063c1864E2102K82547C2908i024A88915D8336P6145J17322k0016p7466A3097
$$ -31864 52102 334649 32908 -9024 188915 48336 124481 241803 221787 144321 13097
13051a07286B50153d4777B37567b6994D51006B05391b39816A54123a30727c1509
$$ -107286 250153 -44777 237567 -26994 451006 205391 -239816 154123 -130727 -31509
13040A78574f7932C90519A84745m2039b9404j4182B46567e4148j5037A72518a40806
$$ 178574 -67932 390519 184745 142706 -29404 -43586 246567 -54148 -69185 172518 -140806
13028A26706i1795D8334J95470a52834A02428L71654A03721m9369M078R3185B0917
$$ 126706 -91795 48334 243804 -152834 102428 474082 103721 54352 58430 151615 20917
13016a38605B10190d52421H0286N0136a15882r5347A88014R8664o8554b7499j3851
$$ -138605 210190 -452421 80286 130422 -115882 -211229 188014 286678 218124 -27499 -41350
13005d1350q4280e9559B10736a1785A78306n5527J46877b21648h3051J4571b9797
$$ -41350 -125630 -59559 210736 -11785 178306 122779 269656 -221648 -83051 -68480 -29797
12993B65170m0934A3203a63915C80947d3758p6270A76375c9521I4182I059a96679
$$ 265170 224236 13203 -163915 380947 -43758 -120028 176375 -39521 94182 9059 -196679
12981d312q6820C0562K56419D6663K4133a31381k26259A22286d5807C98610j53289
$$ -4312 -91132 30562 286981 46663 70796 -131381 -357640 122286 -45807 398610 245321
12970B45321b35452B08248H7198K5296b45487c4239B51237l7282p1947d759A02580
$$ 245321 -235452 208248 87198 112494 -245487 -34239 251237 213955 142008 -4759 102580
12958i910A05222a56750G5047b05706d115k76359a8006B28272J32235D0750P6668
$$ -9910 105222 -156750 75047 -205706 -4115 -280474 -18006 228272 360507 40750 117418
12947A17418D1926J39491n9158d4176j03941A37175d3370j71083F9537J24294
$$ 117418 41926 181417 122259 -44176 -148117 137175 -43370 -214453 69537 193831
12937A93831J64674J6627I9170j0869B5342B184K26251E6207N6940A6394Q5752
$$ 193831 358505 375132 99170 88301 25342 2184 228435 56207 113147 16394 102146
12926A02146a10975l8274B78121a22068B54471H1749i7464c4994G7547a56684
$$ 102146 -110975 -149249 278121 -122068 254471 81749 -97464 -34994 77547 -156684
12915E1157f2392j06857B78707a28625A13850A5486L2514K33161c49622a01460
$$ 51157 -62392 -169249 278707 -128625 113850 15486 48000 281161 -349622 -101460
12904A44073C1476a25527C62808a23595l63125E9946a4083l322m5816J0499l46106
$$ 144073 31476 -125527 362808 -123595 -486720 59946 -14083 -17405 -63221 -52722 -398828
12893c98828a55231C24340c91058J43580m0876a42501A26921E7571K19616G1967
$$ -398828 -155231 324340 -391058 -247478 -288354 -142501 126921 57571 277187 71967
12882A94702i2720B97884a52216N9033k15375L4602B30211a490E6521Q8218K272
$$ 194702 -92720 297884 -152216 -93183 -308558 -273956 230211 -1490 56521 144739 147011
12871A47011J37126a85668A57668J60043A38009f4703P178G5071c15603J16731
$$ 147011 284137 -185668 157668 317711 138009 -64703 -57525 75071 -315603 -198872
12861a98872Q3443e7396B0260h2207a9147m593k8629J8344k95911I9664J7372
$$ -198872 -115429 -57396 20260 -82207 -19147 -23740 -52369 -34025 -329936 99664 117036
12850A17036K3517k1266a41562C7680Q4374g4215j21497A91858q0030a3466n3621
$$ 117036 140553 119287 -141562 37680 122054 -74215 -195712 191858 111828 -13466 -67087
12839f7087I3956a30173j43091A33448D3021g9621D737a36808N2289l2503A8808
$$ -67087 93956 -130173 -273264 133448 43021 -79621 4737 -136808 -84519 -117022 18808
12827A56600f5509A91355a03355m7006C6818b64052a6859B32386j6358A04660
$$ 156600 -65509 191355 -103355 -150361 36818 -264052 -16859 232386 216028 104660
12816a45861A31176a27422b4219E2969L0401D989a10137a7871j5228H016c99755
$$ -145861 131176 -127422 -24219 52969 83370 4989 -110137 -17871 -33099 8016 -399755
12804e8139B4659c24664i2189E8487b19491i4105K1215j96299A75508q5216O4831
$$ -58139 24659 -324664 -92189 58487 -219491 -94105 -72890 -269189 175508 90292 155123
12793A55123l7714c07705j7434i5364B9094M2599M408M9289a96050A03132J6543
$$ 155123 117409 -307705 -325139 -95364 29094 71693 76101 125390 -196050 103132 119675
12782A19675B225d1268F1662a19602A6477K04315a32647e3363k97442J35166I6831
$$ 119675 2225 -41268 61662 -119602 16477 220792 -132647 -53363 -350805 -215639 96831
12770a65932K1058A97108d48186A43162E2314a38803d7513B82735B7604a94584
$$ -165932 -144874 197108 -448186 143162 52314 -138803 -47513 282735 27604 -194584
12759h8879a9438k57700i5516A6471j785f053p5858G1162J66496C0283a390I9646
$$ -88879 -19438 -277138 -95516 16471 14686 -6053 -81911 71162 237658 30283 -1390 99646
12746g7235A30242a64920f0847n632j61643A8175K38958O4207a48606A81963C9941
$$ -77235 130242 -164920 -60847 -66479 -228122 18175 257133 321340 -148606 181963 39941
12734B57774g0135k09202D67271I1549A236M0184J36538P8310e2520A69953i4787
$$ 257774 -70135 -279337 467271 91549 1236 41420 177958 256268 -52520 169953 -94787
12722a46287g0411B8839K634f4146p1974B26036k9899B9907d5886F1488l0376
$$ -146287 -70411 28839 31473 -64146 -136120 226036 196137 29907 -45886 61488 31112
12711C1112b09492a2729e156j20049d2511C8274L60000a5894B68175l520A15810
$$ 31112 -209492 -12729 -5156 -125205 -42511 38274 398274 -15894 268175 264655 115810
12699c6029k35583A13546O9959a45728A16173J29014Q5625b60198c5675m6950
$$ -36029 -271612 113546 183505 -145728 116173 245187 330812 -260198 -35675 -82625
12689h2625B56771a66795a3049A37788a7301C28998j45618k8894E2140a28705
$$ -82625 256771 -166795 -13049 137788 -17301 328998 183380 154486 52140 -128705
12678h6871A49385J74239b41080B68042Q3000A4419K60758A1110P3898K6665l0359
$$ -86871 149385 323624 -241080 268042 351042 14419 275177 11110 85008 111673 81314
12667H1314C0726a18688I7399c78113A04580J481a085D9669a1650C50490j12050
$$ 81314 30726 -118688 97399 -378113 104580 106061 -1085 49669 -11650 350490 238440
12656B38440m4631J849O6422n2015E7342R301P6418J94860i5754p7508A81225
$$ 238440 193809 195658 262080 210065 57342 66643 143061 337921 -95754 -173262 181225
12644c77000E9475O1132m8193e8050A9J40225H783e712C3158A564J9591C329b36780
$$ -377000 59475 120607 72414 -58050 19 140244 8783 -5712 33158 1564 21155 3329 -236780
12630B22015b22495A08308A4533J59300B6788J70585F8213B828K05171k9058E3047
$$ 222015 -222495 108308 14533 173833 26788 197373 68213 2828 207999 178941 53047
12618H9032k7639M6201a92792A29699D511a06062B35255a23479B80536b54121
$$ 89032 61393 107594 -192792 129699 4511 -106062 235255 -123479 280536 -254121
12607A4188b07261A16721J11860A00310a52993A62166N3526q3053K7459c91997
$$ 14188 -207261 116721 228581 100310 -152993 162166 215692 132639 160098 -391997
12596B07909r0295l9159b01104G191f7877a948o4254l253A38600J13628D0621
$$ 207909 117614 78455 -201104 7191 -67877 -1948 -66202 -69455 138600 252228 40621
12584a04166B27468a27623h21l91039B66578j02782a7021p1077K1279b7578C21739
$$ -104166 227468 -127623 -821 -391860 266578 163796 -17021 -88098 -66819 -27578 321739
12572A29989b51285F4566J17472a31315M4780B23015a46295f3092A50780l8666
$$ 129989 -251285 64566 182038 -131315 -86535 223015 -146295 -63092 150780 112114
12562A12114g5588A13182J11898c2282I6264l7897b84904K0792a12896a1561j80320
$$ 112114 -75588 113182 225080 -32282 96264 58367 -284904 -264112 -112896 -11561 -191881
12551a91881g3110k80679P4417A68365a02207q9792B52144d22067a61137j09994
$$ -191881 -73110 -353789 -279372 168365 -102207 -191999 252144 -422067 -161137 -271131
12541b71131p750a1273A80050a92122M5386F3687i4223m903A86780b25981C6427
$$ -271131 -278881 -11273 180050 -192122 -146736 63687 -94223 -99126 186780 -225981 36427
12529A60325f8632I70J93946F1218Q893a78253j40991E7709a11686E1269J35365
$$ 160325 -68632 970 194916 61218 70111 -178253 -319244 57709 -111686 51269 186634
12518A86634e4121K5211B05273R0498b39824h8514A22103D690a31217m7152B96697
$$ 186634 -54121 -28910 205273 295771 -239824 -88514 122103 4690 -131217 -178369 296697
12506b10098Q044H8447l5350Q2119b74457J10394j1470p0478f9386j73476a53
$$ -210098 -202054 88447 53097 135216 -274457 -164063 -175533 -246011 -69386 -242862 -153
12494d02296b3912n7717j50146A4731c36671E1941a944A04440Q1338a56932A32476
$$ -402296 -23912 -81629 -231775 14731 -336671 51941 -1944 104440 185778 -156932 132476
12482a59824N3445A75065D9717b71080a07148A48031b18477D22294I4772i7677
$$ -159824 -106379 175065 49717 -271080 -107148 148031 -218477 422294 94772 -97677
12471c32662E6225c67717A23225c98840a87361I4284b9431A71726a86656B96576
$$ -332662 56225 -367717 123225 -398840 -187361 94284 -29431 171726 -186656 296576
12460A27638L72754g6230r4064J5071b7703D1237a69024M8909E1008b20909B66842
$$ 127638 500392 -76230 -170294 -155223 -27703 41237 -169024 -120115 51008 -220909 266842
12448E77707i23r8684E4697J54557n2682o3486R97f1644n9406o4550G9073g7402
$$ 577707 -923 -99607 54697 209254 156572 93086 94083 -61644 -121050 -185600 79073 -77402
12435A98054R9630e6038M64F2152R1079D1252j7077G503i41C5768d9941o0980
$$ 198054 297684 -56038 -55574 62152 153231 41252 24175 7503 -941 35768 -49941 -110921
12423a10921h293n80136b9418B18436q2923J20233g7814j11182F3606c01789E9024
$$ -110921 -8293 -588429 -29418 218436 135513 255746 -77814 -188996 63606 -301789 59024
12411e43I8719d7111o5278l3092j58258f9177j97614A94842G3862J04043a24148
$$ -543 98719 -47111 -112389 -145481 -303739 -69177 -266791 194842 73862 177905 -124148
12399h9911A58307f5322B90027d2115n7886r8890j14935O7828N0957L6803B49020
$$ -89911 158307 -65322 290027 -42115 -100001 -198891 -313826 -245998 -195041 -158238 249020
12387a71345k01641J82936j0283B19024B5091b57317e0798p5638A22121J47339
$$ -171345 -372986 -190050 -200333 219024 25091 -257317 -50798 -126436 122121 269460
12377B69460a06675B96181G8321f2910g556B8280f0258E3472K80620A6856P9299
$$ 269460 -106675 296181 78321 -62910 -7556 28280 -60258 53472 334092 16856 96155
12366I6155K4359i8316A66459K3160b29908A3997a78077J7188K5658k2822F732
$$ 96155 120514 -98316 166459 189619 -229908 13997 -178077 -160889 -135231 -158053 6732
12354d3829k78106J14031E7714K80167m4001C7155R3893P0417K2986h4786d1703
$$ -43829 -321935 -207904 57714 337881 293880 37155 131048 201465 224451 -84786 -41703
12342g9270J9688E5800a26792A29361K86781A67990e1535j31692A69762a28411
$$ -79270 -59582 55800 -126792 129361 416142 167990 -51535 -183227 169762 -128411
12331G9687l7053J12821l470Q2996l6629p5300c21150a56327B53673J90284A2833
$$ 79687 42634 155455 151985 234981 198352 123052 -321150 -156327 253673 443957 12833
12319C07659j11092K11499A3802L47222j10487c1157B30877J59655I0339a19078
$$ 307659 196567 408066 13802 361024 250537 -31157 230877 390532 90339 -119078
12308A60648a32872E0430b74500J29133E5417b39818B5900l68J17840H156J81495
$$ 160648 -132872 50430 -274500 -145367 55417 -239818 25900 25532 143372 8156 189651
12297A89651d52446A35391K20540H9286N5781f5675m242L3318E0093J5095J96506
$$ 189651 -452446 135391 355931 89286 145067 -65675 -69917 -36599 50093 65188 261694
12286B61694a80045D3048j2211J77283r2610l146O3906G3919d6402C40431I1938
$$ 261694 -180045 43048 30837 208120 115510 112364 176270 73919 -46402 340431 91938
12274B76552F3554a35426B06848N0661c03336a0350F00348e8337F5371E938P1040
$$ 276552 63554 -135426 206848 257509 -303336 -10350 600348 -58337 65371 5938 76978
12263G6978J89187I7200N3626c56731E1107N9889c3153C17558h3932A67294F9425
$$ 76978 266165 97200 150826 -356731 51107 110996 -33153 317558 -83932 167294 69425
12251A77326C5670b82049E8808K26778A33498g8610B31663j0421a05934A65311
$$ 177326 35670 -282049 58808 285586 133498 -78610 231663 221242 -105934 165311
12240C96531r6593J287J3196h250D680P2939g7012n3114I7986j2318c667H5140
$$ 396531 299938 301225 314421 -8250 4680 77619 -77012 -130126 97986 85668 -3667 85140
12227A76417Q8588L2502A06490K02391C0332J42868C6601L64321I6619C4203K45490
$$ 176417 265005 297507 106490 308881 30332 173200 36601 400922 96619 34203 279693
12216B79693I5203L90323A42819m7980l4790K28955E9131L09102C7508J48744
$$ 279693 95203 485526 142819 94839 60049 289004 59131 368233 37508 186252
12206A86252N479h9981j66598A47416c31951B13526L8834K05133j49203J09049
$$ 186252 191731 -89981 -256579 147416 -331951 213526 252360 457493 308290 417339
12196D17339A20509l2745K08787j30195J10612N6092f4175B01063k6017o4931
$$ 417339 120509 87764 296551 166356 276968 333060 -64175 201063 175046 110115
12186A10115b24666I9467a10832A94301q4606K17395M5191F7605J13040J26324
$$ 110115 -224666 99467 -110832 194301 109695 327090 372281 67605 180645 306969
12176C06969E5816K11552R121O9080A52712R680E7077J66469E8216a7506G2016
$$ 306969 55816 267368 276489 345569 152712 162392 57077 223546 58216 -17506 72016
12164A54275G6264b5189B58146q5718c01711B00171r9705P2972b4187H8454g7647
$$ 154275 76264 -25189 258146 172428 -301711 200171 100466 173438 -24187 88454 -77647
12152A34400g6917B45962p761f81540A72507E9505A4416h1064B38371L058F2651
$$ 134400 -76917 245962 238201 -681540 172507 59505 14416 -81064 238371 241429 62651
12140d6594J8059I8928d6805A28727d09174a22854a0632B4472f6531A44538J12041
$$ -46594 -28535 98928 -46805 128727 -409174 -122854 -10632 24472 -66531 144538 256579
12129B56579E817d0681A4211M3562J23275c3214B3847J38664G3245Q597L580J34038
$$ 256579 5817 -40681 14211 57773 181048 -33214 23847 162511 73245 81842 85422 219460
12117B19460J75232j58903k2049J64805E1380J86360D8573K32222i1673E7597
$$ 219460 394692 235789 213740 378545 51380 237740 48573 280795 -91673 57597
12106C12401h7736o983A62702a22400b9020l10842B41328a33643K2471A5633a5980
$$ 312401 -87736 -94719 162702 -122400 -29020 -339862 241328 -133643 -111172 15633 -15980
12094f3703B08967L8084o5309b33142B27061P4983j3166j32689l9816K84022G3850
$$ -63703 208967 247051 181742 -233142 227061 302044 288878 156189 116373 400395 73850
12082A13701K85278o2340A08516c9611A22461n2464a32873A35564b4157B66817
$$ 113701 398979 336639 108516 -39611 122461 69997 -132873 135564 -24157 266817
12071H1230L14980C3458K5145J02036D0823o140N8010l6462K6122J83339a32897
$$ 81230 396210 33458 58603 160639 40823 34683 92693 56231 82353 265692 -132897
12059c85355C03194o8685L3491B2052a45092h053B44124d70242h9528k15245J47834
$$ -385355 303194 234509 268000 22052 -145092 -8053 244124 -470242 -89528 -304773 -156939
12048a56939d3110r1572C10084b48645f7978j28625f3702m7156B28730a97158
$$ -156939 -43110 -134682 310084 -248645 -67978 -196603 -63702 -110858 228730 -197158
12037b05651A4230M20267B08996a22143A05b88361b8974B47270q1381m0315J1478
$$ -205651 14230 434497 208996 -122143 105 -288361 -28974 247270 165889 125574 137052
12026A37052g8108j33471K4545O2194C4830N5483c20310C4841b93935A67836c3799
$$ 137052 -78108 -211579 -187034 -124840 34830 90313 -320310 34841 -293935 167836 -33799
12014a8480r3112J2499B09634r6109g7732A9996K92531g1110B81872a29801A07497
$$ -18480 -111592 -99093 209634 113525 -77732 19996 312527 -71110 281872 -129801 107497
12002a70319b6896k53465d2495C70217c06977A70867a55397J0281B22661b41679
$$ -170319 -26896 -280361 -42495 370217 -306977 170867 -155397 -145116 222661 -241679
11991A31098L24829a33893A11050C2301g2110j44983A43377a3526A12490a30828
$$ 131098 455927 -133893 111050 32301 -72110 -217093 143377 -13526 112490 -130828
11980a29663F2138M728c7068B5146a95360A77253a74287K0132D9320J09834b85279
$$ -129663 62138 66866 -37068 25146 -195360 177253 -174287 -154155 49320 159154 -285279
11968A09919c8631j36161p5111C26238b2678l2203k44048A39387E1746a17475
$$ 109919 -38631 -174792 -249903 326238 -22678 -54881 -298929 139387 51746 -117475
11957B59446F6297a08096q1807A42071l0339J9676c55579a45707N9889D9613b43245
$$ 259446 66297 -108096 -189903 142071 111732 131408 -355579 -145707 -85818 49613 -243245
11945i2617k34196M9866C13825b9880o8927K1559k5696J3909k447D8376b52083
$$ -92617 -326813 -276947 313825 -29880 -98807 -77248 -102944 -89035 -91482 48376 -252083
11933E83a14466n0001a5026r1679A5455d7789G8833C1472c61768D7978c05815
$$ 583 -114466 -164467 -15026 -106705 15455 -47789 78833 31472 -361768 47978 -305815
11921C67648B0234c0861l7275J8424k51527f7002A3432c74700f0994A54451a02840
$$ 367648 20234 -30861 -68136 -49712 -301239 -67002 13432 -374700 -60994 154451 -102840
11909a54381j1900N8353b690r9611j08318C23252j9086e4096k0279B94345a24919
$$ -154381 -166281 -107928 -2690 -102301 -210619 323252 304166 -54096 -74375 294345 -124919
11897a52543r6705a7641c704O95B90430a50314l2118P5116D6133K24742a0300
$$ -152543 -249248 -17641 -3704 -3009 290430 -150314 -182432 -107316 46133 270875 -10300
11885b44535A03381a17527C9644d1886l8506B17495q2291n4483b22454K2475A03663
$$ -244535 103381 -117527 39644 -41886 -80392 217495 135204 80721 -222454 -199979 103663
11873B2306h4865A91455I2225J10660a01465j28933I1051M7770C3192f6033p1308
$$ 22306 -84865 191455 92225 202885 -101465 -230398 91051 138821 33192 -66033 -137341
11862a37341k0239p2562g8913B3947J30376a36175I4560c76964B0695c59939A34278
$$ -137341 -157580 -230142 -78913 23947 154323 -136175 94560 -376964 20695 -359939 134278
11850i083q3692m26433c1737m3537A13882b00670q9573O4277f236p8862C3471
$$ -9083 -92775 -519208 -31737 -75274 113882 -200670 -290243 -225966 -6236 -85098 33471
11838a10139K6443B71832a35552c1421B62280A11693a48697b8913F7604J01346
$$ -110139 -83696 271832 -135552 -31421 262280 111693 -148697 -28913 67604 168950
11828A68950b32346F4682f8748E4013c6129k89164d365r0090b9145A24866R692
$$ 168950 -232346 64682 -68748 54013 -36129 -325293 -4365 -94455 -29145 124866 134558
11817A34558c12273a43318A28613R8925b3556I9366a83675c2359j25284e127D8980
$$ 134558 -312273 -143318 128613 227538 -23556 99366 -183675 -32359 -157643 -5127 48980
11805a63570E29671a89690a4761k18367A18758a39765A9783a47460A1830c28138
$$ -163570 529671 -189690 -14761 -233128 118758 -139765 19783 -147460 11830 -328138
11794A25614a07887F3333R9420C599d0059D8669a5510C1038J02844d12231a05074
$$ 125614 -107887 63333 162753 3599 -40059 48669 -15510 31038 133882 -412231 -105074
11782a89191i3342r3943I7631l4537L8209b5054C6877F581a23068A31069a6167
$$ -189191 -93342 -187285 97631 63094 101303 -25054 36877 6581 -123068 131069 -16167
11770c07576J40654j39405a23776h863k924B966b34409D548a41077j83676F5300
$$ -307576 -166922 -306327 -123776 -8863 -11787 2966 -234409 4548 -141077 -324753 65300
11758a38972H1087B0931J08218i1018j33482d2174C88256d10854a65403O8885
$$ -138972 81087 20931 129149 -91018 -224500 -42174 388256 -410854 -165403 -96518
11748i6518j07723e1312C02956b99460C31328a45779H6767c5123n6727A5965b5052
$$ -96518 -204241 -51312 302956 -299460 331328 -145779 86767 -35123 -91850 15965 -25052
11736B22212L7365D1274a67326e9797j19782G7821J53577C8621c8969i379I1878
$$ 222212 259577 41274 -167326 -59797 -179579 77821 231398 38621 -38969 -9379 91878
11724A74978a1547B02492a77672B74862K029j33815e4537B67762f1114H4336K04767
$$ 174978 -11547 202492 -177672 274862 276891 143076 -54537 267762 -61114 84336 289103
11713B89103a08534B63551A04635g71j34439O562B29117C4856a70855L7888A49902
$$ 289103 -108534 263551 104635 -771 -135210 -128648 229117 34856 -170855 -132967 149902
11701a12990j2113p4951d8287j0053o2851p2931c5788C40879a18377j09951f4443
$$ -112990 -125103 -200054 -48287 -58340 -121191 -194122 -35788 340879 -118377 -228328 -64443
11689h8520G5709J7688B5334b06336a6799j43635D29763a28734b2697A13544c8359
$$ -88520 75709 93397 25334 -206336 -16799 -160434 429763 -128734 -22697 113544 -38359
11677F4360J50195F2692K1127L2798J5035c4586j57442R1661D1110e8998D9755
$$ 64360 214555 62692 83819 116617 131652 -34586 -192028 -100367 41110 -58998 49755
11665d0420k57535D1772N5182a4951A7645a19267B35587g2788A39406j3505i4676
$$ -40420 -297955 41772 96954 -14951 17645 -119267 235587 -72788 139406 125901 -94676
11653a7915j2266F6140b25488B15960n3368h0384q6710o2356I5291K7158B4460
$$ -17915 -30181 66140 -225488 215960 162592 -80384 -167094 -229450 95291 122449 24460
11641b73811J32552A23828P8978a03970d810B80132j16882c27106f0539j56502
$$ -273811 -141259 123828 202806 -103970 -4810 280132 163250 -327106 -60539 -217041
11631b17041o3967P3931n4622A69586a04676A15562b2531A14999K14253H3602
$$ -217041 -281008 -207077 -261699 169586 -104676 115562 -22531 114999 329252 83602
11620C1122i1569F8467b56396J23780A53028b7300C53115b89203a6728B92752
$$ 31122 -91569 68467 -256396 -132616 153028 -27300 353115 -289203 -16728 292752
11609A68232N2434B5259i0494B69017a22408D02737B1708J38057b81997J9562
$$ 168232 220666 25259 -90494 269017 -122408 402737 21708 159765 -281997 -262435
11599b62435C9150h5608B8948d265p948B5212b893j12785l9828a1848B90167A31708
$$ -262435 39150 -85608 28948 -4265 -12213 25212 -2893 -115678 -155506 -11848 290167 131708
11586c5767B23921Q8438J14909e9163A11313C136K86108i4349C00337i1536H2375
$$ -35767 223921 312359 427268 -59163 111313 3136 289244 -94349 300337 -91536 82375
11574c3203C8143M6947a91788h4434c2337A14709R5554a44395A7408L39052A66315
$$ -33203 38143 85090 -191788 -84434 -32337 114709 210263 -144395 17408 356460 166315
11562b03998F3848a65245k6075A5318R2541D7434d8450k50171B99977D1697L22538
$$ -203998 63848 -165245 -191320 15318 107859 47434 -48450 -298621 299977 41697 364235
11551C64235j00348c8785C92740A07085b46656F7809K15896i1596B84709c03139
$$ 364235 263887 -38785 392740 107085 -246656 67809 283705 -91596 284709 -303139
11540b19845R0743A36080j2203c4101J893B28855a02603g278k839l74944G0863
$$ -219845 -129102 136080 123877 -34101 -32208 228855 -102603 -7278 -10117 -385061 70863
11528I6678J4197J41205A3335J50555c2212B16949b02347c2961C58198a48692
$$ 96678 110875 252080 13335 163890 -32212 216949 -202347 -32961 358198 -148692
11517a24513A12852D5165J38267D2342J98993A19967J12855A7560b56453P0494
$$ -124513 112852 45165 183432 42342 241335 119967 232822 17560 -256453 -185959
11507a85959C24028j61468f132B89417b43742A58772J32648G9936e5747a635m4491
$$ -185959 324028 162560 -6132 289417 -243742 158772 291420 79936 -55747 -1635 -46126
11496d6126A93574D5667b1126A63601N8417o8484B4926O5978K24771d2782A23369
$$ -46126 193574 45667 -21126 163601 222018 153534 24926 90904 315675 -42782 123369
11484B0357J28749m004A0075J9254K29979A0566J58096B2299a40954B72787b07176
$$ 20357 149106 145102 10075 29329 259308 10566 168662 22299 -140954 272787 -207176
11472f1977k51698A46804J7322l2407J4233K2166G2148l886f3285C40207O9923
$$ -61977 -313675 146804 164126 131719 145952 168118 72148 68262 -63285 340207 410130
11461D10130D8145N80696B45968l3287b4932j29892j31403B53874F1067R5110
$$ 410130 48145 628841 245968 212681 -24932 -154824 -286227 253874 61067 156177
11451A56177g6590G0596J68888j9445n696a04488B34036J00905b1657j57879B82008
$$ 156177 -76590 70596 239484 220039 214343 -104488 234036 334941 -21657 -179536 282008
11439b87989h1847A3542a13511C78470A6375a02137n8238j42184j0103J27828
$$ -287989 -81847 13542 -113511 378470 16375 -102137 -160375 -302559 -312662 -184834
11429a84834H1433L8652M5180p4095M07378a02754j93803I6568B1336g1258j49181
$$ -184834 81433 120085 165265 91170 498548 -102754 -296557 96568 21336 -71258 -220439
11418b20439B875J02669N2159B4558M07264A34041e998o4341l396A96854l136
$$ -220439 2875 105544 157703 24558 431822 134041 -5998 -70339 -73735 196854 193718
11407A93718J3704l2165a00831H5225f9625I6138B889b09678i4342E6102J46888
$$ 193718 207422 175257 -100831 85225 -69625 96138 2889 -209678 -94342 56102 202990
11396B02990M007G7308d7641D7574L6029Q0900a23160B71330b99911H7412c22056
$$ 202990 206997 77308 -47641 47574 83603 164503 -123160 271330 -299911 87412 -322056
11384F2503A7997P2602c02264e3741O258k5879J7975q1160g618j52560I2663J86609
$$ 62503 17997 90599 -302264 -53741 -47483 -73362 -55387 -136547 -7618 -160178 92663 279272
11372B79272j37604a47809A17693F865J25670A1504J25863a14236D6224a33774
$$ 279272 141668 -147809 117693 6865 132535 11504 137367 -114236 46224 -133774
11361c2628B72345a0391l2273a0324i77D6716a78038l155Q9197B20308r4350D6534
$$ -32628 272345 -10391 -42664 -10324 -977 46716 -178038 -181193 -91996 220308 125958 46534
11348H324J48040E0767m396c2800H9565b0869j07559J8029j95497Q0243D4210
$$ 8324 156364 50767 46371 -32800 89565 -20869 -128428 -110399 -305896 -225653 44210
11336a00100l8408a6574j33263M5034B54298a0140C1498b11412g6996G5443b3094
$$ -100100 -138508 -16574 -149837 -104803 254298 -10140 31498 -211412 -76996 75443 -23094
11324H000b74514d1080j25245f3714E919J28355a34084k43032A61165a01219B04423
$$ 8000 -274514 -41080 -166325 -63714 5919 134274 -134084 -377116 161165 -101219 204423
11312B18534a43588A03892b44552l2222j58166h4093a5726m7571j06987N0467
$$ 218534 -143588 103892 -244552 -276774 -434940 -84093 -15726 -63297 -170284 -119817
11302a19817O991j34662A70618E5865R9513a52681d4601C2206b69378G91R8654
$$ -119817 -112826 -247488 170618 55865 155378 -152681 -44601 32206 -269378 791 99445
11291I9445c6703j97545B4309J80759a18968I3817d69847g9459A966J36893M4904
$$ 99445 -36703 -234248 24309 205068 -118968 93817 -469847 -79459 1966 138859 183763
11280A83763h6685A20808a27547l3116p7926A04250a7365p1448E7470B2854h332
$$ 183763 -86685 120808 -127547 -160663 -238589 104250 -17365 -88813 57470 22854 -8332
11268a02664H6692a15999A16981a30598P913B34611a47452c5403j9638A18421
$$ -102664 86692 -115999 116981 -130598 -122685 234611 -147452 -35403 -55041 118421
11257a43405c4894k33069k0161o5770A0495c9149k11011a18782L904p1626f1620
$$ -143405 -34894 -267963 -288124 -353894 10495 -39149 -250160 -118782 -114878 -186504 -61620
11245a31169A29865J21796D137N7509a4030E9217i8901p1372G5249a43006M1494
$$ -131169 129865 251661 4137 61646 -14030 59217 -98901 -170273 75249 -143006 -101512
11234a01512l05666A30738d62498i9673n3175c4256a1973l85291a17194c9979
$$ -101512 -407178 130738 -462498 -99673 -152848 -34256 -11973 -397264 -117194 -39979
11223a47980h337k5961j19165K3918q8383A03241L8141C6895i6811A72743c23579
$$ -147980 -8337 -34298 -153463 -129545 -217928 103241 141382 36895 -96811 172743 -323579
11211B8719b72046a2125l71102J50424A63193b10902B7149b19407A39426c01096
$$ 28719 -272046 -12125 -383227 -232803 163193 -210902 27149 -219407 139426 -301096
11200A58096h4480A65263b52071e7058k40997B9727R0916c26152A40243k4684
$$ 158096 -84480 165263 -252071 -57058 -298055 29727 120643 -326152 140243 115559
11190A15559a70195j17517I254K5912j5243K41522a90611B83467o0367j2209l0715
$$ 115559 -170195 -287712 9254 35166 19923 261445 -190611 283467 223100 210891 180176
11179A80176c58380a70910A61197m698c13131G8409J72251a62695j15166C4885
$$ 180176 -358380 -170910 161197 156499 -313131 78409 250660 -162695 -277861 34885
11168a53177j3053A66432g8103G1967P5057l2564D9261a59859C19098d20636J25471
$$ -153177 -166230 166432 -78103 71967 147024 114460 49261 -159859 319098 -420636 -295165
11157b95165a0252A6703a68994P8879J8521A75057j0303N8515a41001M1427B55868
$$ -295165 -10252 16703 -168994 -90115 -71594 175057 164754 223269 -141001 -99574 255868
11145h9529j9086A21508d76246i4380l5677a5578j40920H5732b67858B5065d53071
$$ -89529 -108615 121508 -476246 -94380 -130057 -15578 -156498 85732 -267858 25065 -453071
11133b94371J1864G3179I270a57265A07256D2866a21517E7426b9489D5074M43723
$$ -294371 -282507 73179 9270 -157265 107256 42866 -121517 57426 -29489 45074 488797
11122D88797A07149a17297C0482a43612N7076D6395Q3129j7586i2383A97911b00239
$$ 488797 107149 -117297 30482 -143612 -86536 46395 129524 111938 -92383 197911 -200239
11110B01413g1088A96492E1157b95915C8845j4959Q814h2363C20992c5788A83034
$$ 201413 -71088 196492 51157 -295915 38845 23886 32700 -82363 320992 -35788 183034
11098B22595q4626m4809A4003a6237j50114c4095I1513k4783K36577j03617g6654
$$ 222595 137969 93160 14003 -16237 -166351 -34095 91513 66730 303307 199690 -76654
11086A77491m7512J5417o1719L01920e585C03710d8418F671K26777J94303j18476
$$ 177491 129979 145396 83677 385597 -5585 303710 -48418 6671 233448 427751 309275
11075C09275F6271J22125g9374B1533J99321F9047k553H782L64005j07134J77545
$$ 309275 66271 188396 -79374 21533 220854 69047 66494 8782 372787 265653 443198
11064D43198k09975K8929J65135P7368p1411K38061l02621J12319m5881K54367
$$ 443198 233223 262152 427287 504655 433244 671305 368684 481003 435122 689489
11054F89489j6801k40205o3378J27224L10304k11646O2021J30825l68663K31732
$$ 689489 672688 432483 369105 496329 806633 594987 657008 787833 419170 650902
11044F50902J89426k41608K49921r9253C39444L20433j45169L2219m0941J84735
$$ 650902 840328 598720 848641 749388 339444 659877 514708 546927 505986 690721
11034F90721j415m1552A87922L01032L40685l79505K4769k4223N194p1242J21386
$$ 690721 689306 647754 187922 488954 829639 450134 474903 450680 455874 384632 506018
11023E06018J89464n9998l1338k41446J02265J8530J26287P6032C07277L74290
$$ 506018 695482 635484 604146 362700 464965 483495 609782 685814 307277 681567
11013F81567C07995Q4061K25808K13520C74343p5144M9436K13355Q9553N5356
$$ 681567 307995 392056 617864 831384 374343 299199 348635 561990 651543 706899
11003G06899C46952K60478j99720K0985N0478A03913M24787J3410N3047l8788
$$ 706899 346952 607430 407710 428695 479173 103913 528700 542110 595157 556369
10993E56369L8036k59197K99256p5480J44912l28231J58869Q552K29880J0237
$$ 556369 594405 335208 634464 558984 703896 375665 534534 543086 772966 783203
10983G83203k19361P8011q854K76746J17907j78458L25428K3407j18016J71450
$$ 783203 563842 641853 632999 909745 1027652 849194 1174622 1198029 1080013 1251463
10973A251463N5320J46214M57937J03687J54034K31352j33664l11617J32803j63529
$$ 1251463 1306783 1452997 1910934 2014621 2168655 2400007 2266343 1954726 2087529 1924000
10963A924000O199K3131n74342J2329J0247J42526j86623P1338J0766R2972P2466
$$ 1924000 1930199 1953330 1378988 1391317 1401564 1544090 1357467 1428805 1439571 1532543 1605009
10952A605009o93834O75688o27245n3590j27985k86961L58732l96200n4017R6547
$$ 1605009 911175 1586863 959618 906028 778043 491082 849814 453614 399597 496144
10942D96144j61951A52048L2248n7469k9493h7406B76747e562A15077L25186f4257
$$ 496144 334193 152048 184296 126827 97334 -87406 276747 -5562 115077 440263 -64257
10930D509J84238p0282E7034J68970f511k1478A47776E7690a06485k33233H8543
$$ 4509 188747 118465 57034 226004 -6511 -27989 147776 57690 -106485 -339718 88543
10918A01346A5776a15149B22816b77855O7830E7784b26893e4351A01840a87619
$$ 101346 15776 -115149 222816 -277855 -210025 57784 -226893 -54351 101840 -187619
10907D1717d4599A13553a12297k19027B05605L8807o6849d3323j55640E2831h9724
$$ 41717 -44599 113553 -112297 -331324 205605 244412 177563 -43323 -198963 52831 -89724
10895A13943c5148C31702E1207k5589O7449A0991a51752c0555A50273c16931j48599
$$ 113943 -35148 331702 51207 25618 93067 10991 -151752 -30555 150273 -316931 -465530
10884d65530e7054K1205F2014f0904B06832e5893F9608L2551b25566M0148k58777
$$ -465530 -57054 -35849 62014 -60904 206832 -55893 69608 102159 -225566 -185418 -444195
10873d44195A57563f8452A98091g2815j32260l3459j46447J58083A07837B6421
$$ -444195 157563 -68452 198091 -72815 -205075 -238534 -384981 -226898 107837 26421
10862B71677B1859a04750B58227j6933j09613i7169k64342h0104j60027G5737
$$ 271677 21859 -104750 258227 241294 131681 -97169 -361511 -80104 -240131 75737
10851G4381a61858Q0682k14208j70890C01906c2225C19777B2821a54058m2542
$$ 74381 -161858 -81176 -295384 -466274 301906 -32225 319777 22821 -154058 -196600
10841a96600A18706K06740A42680b48282i4113n7796k16563J27881j4602Q9259
$$ -196600 118706 325446 142680 -248282 -94113 -151909 -368472 -240591 -255193 -165934
10831a65934h0863c6950q5113K3282F8407O3478b3614F0445a84966j8435n7245
$$ -165934 -80863 -36950 -122063 -98781 68407 131885 -23614 60445 -184966 -203401 -260646
10820b60646A16059J05824j09985a22229a6660A8180a31674B48561a76480N0328
$$ -260646 116059 221883 111898 -122229 -16660 18180 -131674 248561 -176480 -126152
10810a26152b1247B543e6096j51160A62853a22335p6281A02162J84045b59394
$$ -126152 -21247 2543 -56096 -207256 162853 -122335 -198616 102162 286207 -259394
10799E3969Q4937B1720h598j95081a4614j3694j67632g2776A53138E977d54431
$$ 53969 138906 21720 -8598 -203679 -14614 -28308 -195940 -72776 153138 5977 -454431
10787b99146A03198c03645B0444a86863Q2339A85983D7969b06283m49584G6014
$$ -299146 103198 -303645 20444 -186863 -104524 185983 47969 -206283 -655867 76014
10776b34275d8126r8840J7398I8371d8432A98621o1892b39126E8890B4451a78429
$$ -234275 -48126 -146966 -129568 98371 -48432 198621 136729 -239126 58890 24451 -178429
10764b65892J09314B23858b34990G2859a16162j22991K9868D4737a81585b4920
$$ -265892 -156578 223858 -234990 72859 -116162 -239153 -209285 44737 -181585 -24920
10753A85759C3981g5020B78625J8542m0604a84572O3609N6045k09145i3238K098
$$ 185759 33981 -75020 278625 297167 256563 -184572 -120963 -64918 -274063 -93238 -91140
10742i1140L2478Q785B61983q0916G6492a14862C7874M2623d2267K906a3252B22203
$$ -91140 -58662 -49877 261983 181067 76492 -114862 37874 80497 -42267 -39361 -13252 222203
10729B72966r2487f6818K466k24093P5484b1953p032A2706C570a6314k1154A52734
$$ 272966 180479 -66818 -64352 -288445 -212961 -21953 -28985 12706 3570 -16314 -37468 152734
10716c93405a29540M2122c9442D0106P1286a54378k48132J97556o106j44474J59507
$$ -393405 -129540 -87418 -39442 40106 111392 -154378 -402510 -204954 -211060 -355534 -196027
10705a96027j46557B32009b05136B68422A27194a2962B81051C0069N9874a69287
$$ -196027 -342584 232009 -205136 268422 127194 -12962 281051 30069 89943 -169287
10694a56747e8089q7398M5176J9830k1563d9062F8469a27790b9034l5732j89397
$$ -156747 -58089 -145487 -100311 -80481 -102044 -49062 68469 -127790 -29034 -64766 -254163
10683b54163D750N4759j325O3639n6151P3804l626E8418j2570g7665F6155R2796
$$ -254163 4750 59509 58184 121823 65672 139476 135850 58418 45848 -77665 66155 158951
10671A58951Q2965B6268e0492k48267B39461b79170d3094k95205R6946A49427
$$ 158951 241916 26268 -50492 -298759 239461 -279170 -43094 -338299 -241353 149427
10660a70608J6474b4236j17452A8117L42436b80789R1869A18685a8271q3730D6178
$$ -170608 -154134 -24236 -141688 18117 360553 -280789 -188920 118685 -18271 -102001 46178
10648c6692F8395h5115j67569E8832a8971A10646m2114h1414p4069m7534i0753
$$ -36692 68395 -85115 -252684 58832 -18971 110646 68532 -81414 -155483 -203017 -90753
10636a15593F9768a12408j5888G5629a64120D04650A77217a16433M5526k64756
$$ -115593 69768 -112408 -128296 75629 -164120 404650 177217 -116433 -70907 -335663
10626c35663F4917J7992b77112A38700c40809a39369k97271b09854C09838a29463
$$ -335663 64917 82909 -277112 138700 -340809 -139369 -436640 -209854 309838 -129463
10615C6917K63344a00634J0927l18624a28996B46371a00897c4490J6894l13169
$$ 36917 300261 -100634 -89707 -408331 -128996 246371 -100897 -34490 -17596 -330765
10605c30765G0586e7020A20362a68785M7385p1646f5124a2840l99m9801k25655
$$ -330765 70586 -57020 120362 -168785 -121400 -193046 -65124 -12840 -13239 -63040 -288695
10594b88695a08129q8384Q7492E7486c03002a49961m132B8446J04430i7878j89096
$$ -288695 -108129 -196513 -109021 57486 -303002 -149961 -154093 28446 132876 -97878 -286974
10583b86974A15888J5584b76484J28180A68879a59753f4873A55278a11741j68193
$$ -286974 115888 131472 -276484 -148304 168879 -159753 -64873 155278 -111741 -279934
10573b79934B77536F4224Q6830a03724A49957r143m8876K4182k0007N5622a27447
$$ -279934 277536 64224 151054 -103724 149957 140814 91938 116120 96113 151735 -127447
10561A70683j7684a19496k4102a1989j42331D8912a0881j97436a03598k76765
$$ 170683 152999 -119496 -143598 -11989 -154320 48912 -10881 -208317 -103598 -380363
10551c80363A73694a15097h438A0696b2060A72436c27506a531l87971a34440B16244
$$ -380363 173694 -115097 -8438 10696 -22060 172436 -327506 -1531 -389502 -134440 216244
10539E7657a67701K6094f5545I5029A0860g0908D2273b60966B9429L3851K09765
$$ 57657 -167701 -141607 -65545 95029 10860 -70908 42273 -260966 29429 63280 273045
10528B73045a87879G6315i098B3514a32300A2423c60199D6350g6086D863a59529
$$ 273045 -187879 76315 -9098 23514 -132300 12423 -360199 46350 -76086 4863 -159529
10516g977n32674a74449d3311m1379o1261o5693d0377J8259I5236a77105c8330
$$ -7977 -540651 -174449 -43311 -84690 -145951 -211644 -40377 -22118 95236 -177105 -38330
10504h5228D6736b6227j26399A62268A5001b6694A1991J05476b3632q036B40709
$$ -85228 46736 -26227 -152626 162268 15001 -26694 11991 117467 -23632 -31668 240709
10492a36887a0451k67812i4576A83840G604M9318P2316b9722B89768a56175B0135
$$ -136887 -10451 -278263 -94576 183840 7604 56922 129238 -29722 289768 -156175 20135
10480e833l12753A18409K45062K64215k37940c5699D32220A85344K9406R0381
$$ -5833 -318586 118409 363471 627686 389746 -35699 432220 185344 214750 305131
10470C05131k456a8174B3595J36595A4391a87649B88407b25728P0047B73522A24861
$$ 305131 302675 -18174 23595 160190 14391 -187649 288407 -225728 -155681 273522 124861
10458e2825C0628b49514D3119b40224m2165J16255k16428d4828l01022a70229
$$ -52825 30628 -249514 43119 -240224 -282389 -166134 -382562 -44828 -345850 -170229
10447B0941K30865c88827f0580l84337B324K21601h6168k85831f4532p6971j69737
$$ 20941 251806 -388827 -60580 -444917 2324 223925 -86168 -371999 -64532 -141503 -311240
10436c11240A41298c2502k6379r2718k84142a70872G2033a00629k40325I6017
$$ -311240 141298 -32502 -58881 -151599 -435741 -170872 72033 -100629 -340954 96017
10425b02657e3890l66685C4304i8645B6911K7859M1612C692b1189j23245A21778
$$ -202657 -53890 -420575 34304 -98645 26911 54770 96382 3692 -21189 -144434 121778
10413a55721k5440k02804E8221a69880C741b93592B44658E1419j844a08585d7048
$$ -155721 -181161 -383965 58221 -169880 3741 -293592 244658 51419 49575 -108585 -47048
10401c2117H8676M36234C8495J31092o7285K8968c1743l164A41596c82119B39495
$$ -32117 88676 524910 38495 169587 102302 131270 -31743 -34907 141596 -382119 239495
10389B40000a42516b3053A42143D8144N9833i1674A88526d553A48877c9994p9849
$$ 240000 -142516 -23053 142143 48144 107977 -91674 188526 -4553 148877 -39994 -119843
10378a19843A40760b03047A09416k5574B4123K72860m8189j15419b7012C41546
$$ -119843 140760 -203047 109416 83842 24123 296983 248794 133375 -27012 341546
10367I9381L7004m957P181M29372B8501M92655B55574L31297k21075j52625K6649
$$ 99381 136385 131428 138609 567981 28501 521156 255574 586871 365796 213171 239820
10356B39820J13672n2042B6458J66391Q8101M253H8048M3371J20006j0163J18054
$$ 239820 353492 301450 26458 192849 280950 285203 88048 131419 251425 241262 359316
10345C59316j22449K69109j72921L51503k52471m1169B7479K58256j33142g0249
$$ 359316 236867 505976 333055 684558 432087 390918 27479 285735 152593 -70249
10334B0111K72612j27085m5344K21929A42107B2568K52942j34638k9226e8105
$$ 20111 292723 165638 120294 342223 142107 22568 275510 140872 111646 -58105
10323B54415A26159a77555A42784i9229A17614J85175b26035D96349j99334k6246
$$ 254415 126159 -177555 142784 -99229 117614 302789 -226035 496349 297015 270769
10313B70769j08776d0466l1398B35735h5556C47497A58693b28941Q6207A01990
$$ 270769 161993 -40466 -71864 235735 -85556 347497 158693 -228941 -142734 101990
10302f60208h9663B05636b84186a01805n2235d4261n1048J6596B02635a87664
$$ -660208 -89663 205636 -284186 -101805 -154040 -44261 -95309 -78713 202635 -187664
10291B16746C2867h6956j59012B81666d67514d0497l5807C7303C73a0810K481
$$ 216746 32867 -86956 -245968 281666 -467514 -40497 -76304 37303 373 -10810 -8329
10280h329B22338e616l8326C27656a5755k06049O5628k90960d0869k84391J15110
$$ -8329 222338 -5616 -43942 327656 -15755 -221804 -156176 -447136 -40869 -325260 -210150
10269b10150P4101B51776r6485a1830A40173A8995d63782b15185d7365k0973l5086
$$ -210150 -136049 251776 155291 -11830 140173 18995 -463782 -215185 -47365 -68338 -103424
10258a03424B74275f7276j12905A39908N8987K15726k4986K5494A5989K99783
$$ -103424 274275 -67276 -180181 139908 198895 414621 389635 415129 15989 315772
10248C15772j16060F4444a07736c8671J9240j81992N9028m8917j01172J6315A24674
$$ 315772 199712 64444 -107736 -38671 -19431 -201423 -142395 -191312 -292484 -276169 124674
10236i4223J8960j27568q2079g7947q2142N1640k59501f758l69517k00432C2922
$$ -94223 -75263 -202831 -284910 -77947 -160089 -108449 -367950 -6758 -376275 -576707 32922
10224d1110B47589b58405L6594a8665A05584e22196e9727A62033a92290j2341
$$ -41110 247589 -258405 -221811 -18665 105584 -522196 -59727 162033 -192290 -204631
10214b04631E962a47566d6074C30523c41431h6D5197a51607j63291A05987d9790
$$ -204631 5962 -147566 -46074 330523 -341431 -86 45197 -151607 -314898 105987 -49790
10202a9588H0724a43019O255O0507A85285e9734J6209r1105a8714j48916k3794
$$ -19588 80724 -143019 -136764 -76257 185285 -59734 -43525 -134630 -18714 -167630 -191424
10191a91424B99635a34503F9345m619B5762a08688k34219J12365B53041G6561
$$ -191424 299635 -134503 69345 64726 25762 -108688 -342907 -230542 253041 76561
10180a26418p3689O2042k97556A0449L212b1668A3554E173N8111c8655o4068j06167
$$ -126418 -200107 -138065 -435621 10449 13661 -21668 13554 5173 63284 -38655 -102723 -208890
10168b08890M9905A90075m0194N5443a18887j18347M9850l7692h6326I6203f8601
$$ -208890 -158985 190075 149881 205324 -118887 -237234 -187384 -225076 -86326 96203 -68601
10156a88845E1807j2649a8703A95907c59896i925n6470j27017H3176K14422F2636
$$ -188845 51807 39158 -18703 195907 -359896 -9925 -66395 -193412 83176 297598 62636
10144A13103a16686j69089b7358p9109J7322j14891Q0496c6748k2126D3331R0058
$$ 113103 -116686 -285775 -27358 -106467 -89145 -204036 -123540 -36748 -58874 43331 133389
10133A33389a86381j61j46905a54707j80934B53662B2048B46g1731j18743f5419
$$ 133389 -186381 -186542 -333447 -154707 -335641 253662 22048 246 -71731 -190474 -65419
10121b49914C687Q3407d7270j58843F114b88775a15019d2123F3494d5211j04124
$$ -249914 3687 87094 -47270 -206113 6114 -288775 -115019 -42123 63494 -45211 -149335
10110a49335B65440M1993A3855K16066D4735i7946a3862j44570B5110a21383B60393
$$ -149335 265440 307433 13855 229921 44735 -97946 -13862 -158432 25110 -121383 260393
10098a23405j84303J23447K1235a2414A84729a43960A51697b04755J7747K9416
$$ -123405 -307708 -184261 -163026 -12414 184729 -143960 151697 -204755 -187008 -157592
10088a57592e5230j58435I0444a71558k60340C2671b9504j01827A17500b76763
$$ -157592 -55230 -213665 90444 -171558 -431898 32671 -29504 -131331 117500 -276763
10077b89548b0071k48888f8355l8618K0296o6416B08867J95372j50515i5882j6467
$$ -289548 -20071 -268959 -68355 -106973 -86677 -153093 208867 404239 253724 -95882 -112349
10066a12349j9422k64887f6112r0009j06586B15108g8573B20084c10836I5664
$$ -112349 -131771 -396658 -66112 -156121 -262707 215108 -78573 220084 -310836 95664
10055a17995k0957B59639g4291j38580A10867a28222k28877g7298j91389g9183
$$ -117995 -138952 259639 -74291 -212871 110867 -128222 -357099 -77298 -268687 -79183
10044h7009F9915D022a20108B48983b3121n5295k78841A13528a77896N0545l6878
$$ -87009 69915 4022 -120108 248983 -23121 -78416 -357257 113528 -177896 -127351 -164229
10033a64229q8594a01263j40576G7063H520J09766b41516A12144M5168A0927a31288
$$ -164229 -252823 -101263 -241839 77063 8520 118286 -241516 112144 157312 10927 -131288
10021b03505q190O9468k7348H0810a46339n4710P2348f3155j62331O7174A89102
$$ -203505 -211695 -142227 -169575 80810 -146339 -201049 -128701 -63155 -225486 -158312 189102
10009b28876a00993J8173l547C00793B046R9416a04125D7354a40584j23881K7517
$$ -228876 -100993 -82820 -86367 300793 2046 101462 -104125 47354 -140584 -264465 -236948
9998b36948A51784b05600c6546m0529N924K5618r7924N4086r6431B91233F7704
$$ -236948 151784 -205600 -36546 -77075 -71151 -45533 -143457 -89371 -185802 291233 67704
9986C29328c17699b6221j80452H4520A4781J40351j8094a681E5600h021D6549
$$ 329328 -317699 -26221 -206673 84520 14781 155132 137038 -1681 55600 -8021 46549
9974b07992A04357k6253a52248j0590j44034B23636a46546B61627H126e8256j65543
$$ -207992 104357 78104 -152248 -162838 -306872 223636 -146546 261627 8126 -58256 -223799
9963b23799h663A61372b30325D2593G723a77025r4196c0381j78851b5281f223
$$ -223799 -8663 161372 -230325 42593 7723 -177025 -271221 -30381 -209232 -25281 -6223
9951A04355b64865A27934c9266k34700N0948A24154b18042P2657r6329g6921l6465
$$ 104355 -264865 127934 -39266 -273966 -223018 124154 -218042 -145385 -241714 -76921 -113386
9940a13386d1782B44404a04608j85826A50615c32146P2831N0473M4377k3164f5168
$$ -113386 -41782 244404 -104608 -290434 150615 -332146 -259315 -208842 -164465 -187629 -65168
9928b39605B7759R3410D622K58179r4300a75634N396N2960q5082M1431e7288G0796
$$ -239605 27759 121169 4622 262801 168501 -175634 -170238 -117278 -202360 -160929 -57288 70796
9915a05158j55201a1974l31839D3913b92048A08744i8541j37550i8901c1045r8687
$$ -105158 -260359 -11974 -343813 43913 -292048 108744 -98541 -236091 -98901 -31045 -129732
9904a29732O1656j55697J06017o758F899K02196a36650l21132a28584j5975M3667
$$ -129732 -68076 -223773 -117756 -124514 6899 209095 -136650 -457782 -128584 -144559 -100892
9893a00892A88430b94708Q5317A13222E0488j5924K2818K25414a0439k09230I714
$$ -100892 188430 -294708 -209391 113222 50488 34564 57382 282796 -10439 -219669 9714
9881b29582D669J32374J00172e4384k51793a37233f473j29033B00445d0735R499
$$ -229582 4669 137043 237215 -54384 -306177 -137233 -6473 -135506 200445 -40735 -31236
9870c1236k84065j06754a23031e3844p2538M6474a1233j44831H9732b55992g9030
$$ -31236 -315301 -422055 -123031 -53844 -126382 -79908 -11233 -156064 89732 -255992 -79030
9858b00660H1415P5933B8634i6524q0173G8025D655K19484b73468g5303J6101
$$ -200660 81415 157348 28634 -96524 -176697 78025 4655 224139 -273468 -75303 -59202
9847e9202j37301A11837a06576b9377k40312a3958G0437c82370B12974g3631A84933
$$ -59202 -196503 111837 -106576 -29377 -269689 -13958 70437 -382370 212974 -73631 184933
9835B31334a17173m3500G6421c89840J04825B917a01951E1182f0194n14r3958
$$ 231334 -117173 -160673 76421 -389840 -285015 2917 -101951 51182 -60194 -60708 -154666
9824a54666d9841j68533L8512N7983e0550k0913m80068A70938E9018d21419J88100
$$ -154666 -49841 -218374 -179862 -121879 -50550 -71463 -551531 170938 59018 -421419 -233319
9813b33319b8481C17400e1203j40264n1537B33599A8564i8773l21138J61565a7247
$$ -233319 -28481 317400 -51203 -191467 -243004 233599 18564 -98773 -419911 -258346 -17247
9801E2242J64567j02599c7880A58479b02662G588J4586b49551C11511f3295j40090
$$ 52242 216809 114210 -37880 158479 -202662 7588 22174 -249551 311511 -63295 -203385
9790b03385f7305j906m2731a9441l670D39085d03251A28646k4182a00152B0832
$$ -203385 -67305 -69211 -111942 -19441 -23111 439085 -403251 128646 104464 -100152 20832
9778F6969d8605B9336e1167A81387O3813b01136B1430q172K4074h0528P274l05899
$$ 66969 -48605 29336 -51167 181387 245200 -201136 21430 13258 37332 -80528 -73254 -379153
9766c79153A10414a18748J5031A8906f921p757D3886J09214c22921a3063C8743
$$ -379153 110414 -118748 -103717 18906 -6921 -14678 43886 153100 -322921 -13063 38743
9754A20628c3862n4067A54254i2488A19510o521f5726j17201F1101a74210D8778
$$ 120628 -33862 -87929 154254 -92488 119510 112989 -65726 -182927 61101 -174210 48778
9742a36910j11963h8572j44888C5660d2637B08273n3732c3025k45330k2541f2606
$$ -136910 -248873 -88572 -233460 35660 -42637 208273 154541 -33025 -278355 -300896 -62606
9730b58102a656C99947a84967C50302A65389a90672J5547f792j30359k54326a01757
$$ -258102 -1656 399947 -184967 350302 165389 -190672 -175125 -6792 -137151 -391477 -101757
9718F326b87811J42366l154E4728d54454b21827E6900d60554a10118H2111a18664
$$ 6326 -287811 -145445 -148599 54728 -454454 -221827 56900 -460554 -110118 82111 -118664
9706b38156P1130G4775J4578a68978c2190I2816J68728b14928P9809N9539j7578
$$ -238156 -167026 74775 89353 -168978 -32190 92816 261544 -214928 -135119 -75580 -93158
9695i3158B46188b25783A6895a14973j2408E7183O4510K7266B3917a32758k79077
$$ -93158 246188 -225783 16895 -114973 -127381 57183 121693 148959 23917 -132758 -411835
9684d11835J54016h3173B5002a03948M2441I2799b7003k03933a7777B20323a02702
$$ -411835 -257819 -83173 25002 -103948 -61507 92799 -27003 -230936 -17777 220323 -102702
9672a3902j77588c8110C6183f888n80p4671l9646A00434N7779D1823L6219B1271
$$ -13902 -191490 -38110 36183 -6888 -7468 -82139 -121785 100434 158213 41823 78042 21271
9659a64701G5788a4122l6197q6501K6410j21311Q9612n5321C52179a55708d495
$$ -164701 75788 -14122 -50319 -136820 -110410 -231721 -142109 -197430 352179 -155708 -4495
9647a16503E8784B6682a22209k1063j88298J34801A55258j5488A036h7040D7568
$$ -116503 58784 26682 -122209 -143272 -331570 -196769 155258 139770 1036 -87040 47568
9635A94924q5448O8427a69026N498j3980A36193l8077j9484j1859A4425b7590
$$ 194924 109476 177903 -169026 -163528 -177508 136193 98116 78632 66773 14425 -27590
9623d0079A47273b38788R2704E6640a35175A53691l8649a58863d5860b2004m02550
$$ -40079 147273 -238788 -146084 56640 -135175 153691 115042 -158863 -45860 -22004 -424554
9612d24554B81903c9900j86263A0912f8567A53896e5254k01105A98378i3048H7707
$$ -424554 281903 -39900 -226163 10912 -68567 153896 -55254 -256359 198378 -93048 87707
9600b33185m2496c1568H4046c6181D2670i891C0716J04432d95875a87945b1058
$$ -233185 -275681 -31568 84046 -36181 42670 -9891 30716 135148 -495875 -187945 -21058
9588B88251A2352b48926D8248K38703f288D07584b66907k3656J22267B32385c91776
$$ 288251 12352 -248926 48248 286951 -6288 407584 -266907 -290563 -168296 232385 -391776
9576a74378A52313a8070l31362O2988C56179j67044g7329j26390i5719F6068i8294
$$ -174378 152313 -18070 -349432 -286444 356179 189135 -77329 -203719 -95719 66068 -98294
9564c0510j67283q4851Q6419N8324M0628b7873M646j45655j4887J4789N3288A28121
$$ -30510 -197793 -282644 -196225 -137901 -97273 -27873 -23227 -168882 -183769 -168980 -115692 128121
9551A46594a34695o0926A09716b34787J6185c0521N206l3270H4983a37259q0724
$$ 146594 -134695 -195621 109716 -234787 -218602 -30521 -25315 -58585 84983 -137259 -217983
9540b17983R1009d3745A74855a20992j20171R0234E0120J03602n0185b18335g3852
$$ -217983 -126974 -43745 174855 -120992 -241163 -150929 50120 153722 103537 -218335 -73852
9528c12974e1645Q027D2070f2637j13703g8318j06787A98918a96405B4584d6363
$$ -312974 -51645 -43618 42070 -62637 -176340 -78318 -185105 198918 -196405 24584 -46363
9516a09596a4933j2029G7144b61525a24457r0366A25018K7272b52063a08992l3292
$$ -109596 -14933 -26962 77144 -261525 -124457 -214823 125018 152290 -252063 -108992 -142284
9505a42284m3876j1335j9486E3892J60515f883m9834e653j66197m0004O2860A71343
$$ -142284 -186160 -197495 -216981 53892 214407 -6883 -56717 -5653 -171850 -211854 -148994 171343
9492c60690h3284k2322b2020j37224b6045A65203h0461k2044A81657b36792e2791
$$ -360690 -83284 -105606 -22020 -159244 -26045 165203 -80461 -102505 181657 -236792 -52791
9480A61227E6243a67696P2998o7455a0895B50099i1415A74810f842q2329A75553
$$ 161227 56243 -167696 -94698 -162153 -10895 250099 -91415 174810 -6842 -89171 175553
9468I314a81808k01660F6405c35934a9569j43218C2289a57107C6554H574i7717
$$ 9314 -181808 -383468 66405 -335934 -19569 -162787 32289 -157107 36554 8574 -97717
9456a09858N3106A7732K9399a5927C68216a36407A7909e394A19001c20660B7411
$$ -109858 -56752 17732 47131 -15927 368216 -136407 17909 -5394 119001 -320660 27411
9444H1919e6483B51864b82779G989M7237L82384c75633F8718G838Q5192d0765
$$ 81919 -56483 251864 -282779 7989 55226 437610 -375633 68718 7838 93030 -40765
9432B89157C4710K9498d43263I2743b938D7055b33065l8123J9672n2399K3048
$$ 289157 34710 64208 -443263 92743 -2938 47055 -233065 -271188 -251516 -303915 -280867
9421b80867H5936i5876r5660K2375A07165a26824A36176L7732a8625j38427k13775
$$ -280867 85936 -95876 -191536 -169161 107165 -126824 136176 173908 -18625 -157052 -370827
9410c70827J05666a07663L5378j41834g1676j63379I3461a81765j23798c142j06588
$$ -370827 -265161 -107663 -72285 -214119 -71676 -235055 93461 -181765 -305563 -3142 -109730
9399a09730A19467n6983b05725B67508A15171f1192B11925c1353H8394b3795B43127
$$ -109730 119467 62484 -205725 267508 115171 -61192 211925 -31353 88394 -23795 243127
9387a95712F3781a52009B58362B5287Q9753b91064G9249b12571j54509d0721B9288
$$ -195712 63781 -152009 258362 25287 115040 -291064 79249 -212571 -367080 -40721 29288
9375A14779J33195c3117l1576G9416a12510A19982b1895n27899K23443Q8744N8673
$$ 114779 247974 -33117 -64693 79416 -112510 119982 -21895 -549794 -326351 -237607 -178934
9364a78934f43D07890c76418i5466A1086d56933A40348c2989l9469k55945j47045
$$ -178934 -643 407890 -376418 -95466 11086 -456933 140348 -32989 -72458 -328403 -475448
9353d75448A32686c01242G7575J17214D2310b53734i7120C522R8370L4668d96226
$$ -475448 132686 -301242 77575 194789 42310 -253734 -97120 3522 101892 136560 -496226
9341A07038N1892M038d1343r0030m8366D3860h6664a6841A02916b6556m2711C0598
$$ 107038 158930 162968 -41343 -131373 -179739 43860 -86664 -16841 102916 -26556 -69267 30598
9328a24124C208a15159k0306c8740j77566i0843E1976a65844D1352b90796D08735
$$ -124124 3208 -115159 -135465 -38740 -216306 -90843 51976 -165844 41352 -290796 408735
9316a39827r7795A79771b56052C35802d1821l6326j22857r7829A36786b48819
$$ -139827 -237622 179771 -256052 335802 -41821 -78147 -201004 -298833 136786 -248819
9305G6318J99879a41693q5682J03515b7740j2342k20452m0342a32022K4613k52308
$$ 76318 276197 -141693 -227375 -123860 -27740 -40082 -260534 -300876 -132022 -107409 -359717
9294c59717N5734K1953J292B11277b12411A59240a51731e1633Q161D7906a03548
$$ -359717 -303983 -282030 -280738 211277 -212411 159240 -151731 -51633 -43472 47906 -103548
9282a1406e405F755b90857J05881B61073B669O8815i2296r2769M4151l0371k2652
$$ -11406 -5405 6755 -290857 -184976 261073 2669 71484 -92296 -185065 -140914 -171285 -193937
9270a93937Q6395B03798A0472a94242a2835C78830A83418j3957B1998J33280b19045
$$ -193937 -107542 203798 10472 -194242 -12835 378830 183418 169461 21998 155278 -219045
9258b17799h9656A16631K8981K7608a39059f1562j71317B11803k1218e2246k4662
$$ -217799 -89656 116631 145612 173220 -139059 -61562 -232879 211803 190585 -52246 -76908
9247g6908Q133A06668c1270p9829c8039k3694j95926c2680B06838e224k3128C1985
$$ -76908 -68775 106668 -31270 -111099 -38039 -61733 -257659 -32680 206838 -5224 -28352 31985
9234a38742f4745o9622A03185b36598j21515H9507K966a42705j2262E7555A4175
$$ -138742 -64745 -134367 103185 -236598 -358113 89507 92473 -142705 -154967 57555 14175
9222c76549a55603L019B57782a11226j01453b6806j67363G5497b2049A50448B0639
$$ -376549 -155603 -152584 257782 -111226 -212679 -26806 -194169 75497 -22049 150448 20639
9210d9034p9383K6218j21430A87516c51265a37938b6696l5431A62378M4627e7375
$$ -49034 -128417 -102199 -223629 187516 -351265 -137938 -26696 -62127 162378 207005 -57375
9198a2150B2897J41477g6227m0435a9985F4723h5014l44131J49450B94744a77484
$$ -12150 22897 164374 -76227 -116662 -19985 64723 -85014 -429145 -279695 294744 -177484
9186A43841D1508c90742C33476q0054a75933A4241e4285A89150O0484M100g6783
$$ 143841 41508 -390742 333476 253422 -175933 14241 -54285 189150 249634 253734 -76783
9174c70532G1766a99395h3114A67023D1216g4570A01160g9560k06900Q0656e3919
$$ -370532 71766 -199395 -83114 167023 41216 -74570 101160 -79560 -286460 -205804 -53919
9162b90968O5519D81681B217K3183K32480a93158p7012Q7323j8709J5477A48727
$$ -290968 -225449 481681 2217 25400 257880 -193158 -270170 -182847 -201556 -186079 148727
9150B18285a08871D0707c2274j90796k973B2600K6964a86110l5095i9157l5215
$$ 218285 -108871 40707 -32274 -223070 -226043 22600 49564 -186110 -221205 -99157 -134372
9139a34372A47562O1001g7361c3320j29677a4118A27915e0411B8685b54721A44138
$$ -134372 147562 208563 -77361 -33320 -162997 -14118 127915 -50411 28685 -254721 144138
9127A3199b54424M948J23764d8768B0494h1962j72704B30636c12848B7729d9477
$$ 13199 -254424 -249476 -125712 -48768 20494 -81962 -254666 230636 -312848 27729 -49477
9115a8948j7054j71824f5417A59146a61020P6355B40266b08208j15115D3856A1828
$$ -18948 -36002 -207826 -65417 159146 -161020 -84665 240266 -208208 -323323 43856 11828
9103H4444c098j30153n779d7338j00200j79286o6908b2157B9774b37606l1512
$$ 84444 -3098 -133251 -139030 -47338 -147538 -326824 -393732 -22157 29774 -237606 -269118
9092b69118p4288r5846B24421c7821r5942l3326B2544J03054c6955A61083c95190
$$ -269118 -343406 -439252 224421 -37821 -133763 -167089 22544 125598 -36955 161083 -395190
9080b03241B24739E0J11872b07303J0782a3007k66988k5465H5027c41874F5209
$$ -203241 224739 50 111922 -207303 -196521 -13007 -279995 -305460 85027 -341874 65209
9068C19988a80927A91324J08592c26503J54744C25592c51487J12071H9363a93277
$$ 319988 -180927 191324 299916 -326503 -171759 325592 -351487 -239416 89363 -193277
9057A93537a37843B38119i6392C8807L59308A77083c15348D2143e1803j01221
$$ 193537 -137843 238119 -96392 38807 398115 177083 -315348 42143 -51803 -153024
9047a53024O9338A56845d8432j32205Q0439B3317J29496B6024e371A16582f2990
$$ -153024 -83686 156845 -48432 -180637 -100198 23317 152813 26024 -5371 116582 -62990
9035a55135A25016H169M7500b06442b2627q3494D7072e192C457a46733A23513
$$ -155135 125016 8169 55669 -206442 -22627 -106121 47072 -5192 3457 -146733 123513
9023a36579A76409F7987j1967a43096C8001a33831d6688K1134j66150f2558j4240
$$ -136579 176409 67987 56020 -143096 38001 -133831 -46688 -25554 -191704 -62558 -76798
9012g6798A37271d27694h1001o4439k42514J24757J5115A7316d8137M111A39516
$$ -76798 137271 -427694 -81001 -145440 -387954 -263197 -248082 17316 -48137 -44026 139516
9000B7283h2838j1380k2945d3996h998r1397K7188A0707a77059J3822E9450b83147
$$ 27283 -82838 -94218 -117163 -43996 -8998 -100395 -73207 10707 -177059 -163237 59450 -283147
8987A15579m0903f442o2074j38022e5872m24138g6342j59653j18651f5634l2683
$$ 115579 74676 -6442 -68516 -206538 -55872 -480010 -76342 -235995 -354646 -65634 -98317
8976i8317p9866D3664O5694g1228A57341b15776o4284A13436d01512A47126N8592
$$ -98317 -178183 43664 109358 -71228 157341 -215776 -280060 113436 -401512 147126 205718
8965B05718a56269P1309C2129l449b74021I0267J27070N3625b37794f7056k48399
$$ 205718 -156269 -84960 32129 28680 -274021 90267 217337 270962 -237794 -67056 -315455
8954c15455R6811C86939b27689j38443a64592j09462h8767r9153P2686p759A48036
$$ -315455 -218644 386939 -227689 -366132 -164592 -274054 -88767 -187920 -115234 -122993 148036
8942E6814d31786g9593o7133B17318a44662J0065B34645e5262D3632K57124H5744
$$ 56814 -431786 -79593 -146726 217318 -144662 -134597 234645 -55262 43632 300756 85744
8930c45439H1532g0443G4573J73103a27791a4976A05017K30811K95556M84073
$$ -345439 81532 -70443 74573 247676 -127791 -14976 105017 335828 631384 1115457
8920A115457K412477L424325B862493F78114p2858A3753l291a4861r6626K0775
$$ 1115457 3527934 6952259 2862493 678114 605256 13753 10462 -14861 -111487 -90712
8910i0712a583j09740J3588D8674J74609D0823j5243d1653j33607r5037J9362
$$ -90712 -1583 -111323 -97735 48674 223283 40823 25580 -41653 -175260 -270297 -250935
8899b50935K5950I8788a97615k4169k5640D30305A81873n5504c49237d4617q0854
$$ -250935 -224985 98788 -197615 -221784 -247424 430305 181873 126369 -349237 -44617 -125471
8888a25471G856O80b84704B5988a50356E6130B2802f9626m2229A24997g936j90768
$$ -125471 7856 8536 -284704 25988 -150356 56130 22802 -69626 -111855 124997 -7936 -198704
8876a98704P7250j05995C2107a66978A25835j0170G263a09874M8410j73666k7086
$$ -198704 -121454 -227449 32107 -166978 125835 115665 7263 -109874 -61464 -235130 -262216
8865b62216b4357j68022b2321j66471c4192j43959E7005P074c20441H4271N5056
$$ -262216 -24357 -192379 -22321 -188792 -34192 -178151 57005 64079 -320441 84271 139327
8854A39327a43239D8113J00988a59985B1139i8167C5093i2376I7008B9906b73680
$$ 139327 -143239 48113 149101 -159985 21139 -98167 35093 -92376 97008 29906 -273680
$$ [...]
##END NTUPLES=NMR SPECTRUM
##END=
