
##TITLE=AC1307_DOMAH11119_6615730_f1TJ7XtrV2
##JCAMPDX= 6.0         $$ Bruker NMR JCAMP-DX V2.0
##DATA TYPE= NMR SPECTRUM
##DATA CLASS= NTUPLES
##ORIGIN= BRUKER
##OWNER= Administrator
$$ 1.72 TOPSPIN		Version 2.1
$$ 2012-08-02 23:39:06.812 -0500  Administrator@TOPSPIN
$$ Compression mode = diff/dup
##.OBSERVE FREQUENCY= 400.02188249412
##.OBSERVE NUCLEUS= ^1H
##.ACQUISITION MODE= SIMULTANEOUS (DQD)
##.ACQUISITION SCHEME= undefined
##.AVERAGES= 64
##.DIGITISER RES= 22
##SPECTROMETER/DATA SYSTEM= spect
##.PULSE SEQUENCE= noesygpps1d.comp
##.SOLVENT NAME= COFFEE_meoh
##.SHIFT REFERENCE= INTERNAL, COFFEE_meoh, 1, 14.9624
##AUDIT TRAIL= $$ (NUMBER, WHEN, WHO, WHERE, PROCESS, VERSION, WHAT)
$$ ##TITLE= Audit trail, TOPSPIN		Version 2.1
$$ ##JCAMPDX= 5.01
$$ ##ORIGIN= Bruker BioSpin GmbH
$$ ##OWNER= Administrator
$$ $$ C:\Bruker\TOPSPIN/data/COFFEE/nmr/AC1307_DOMAH11119_6615730_f1TJ7XtrV2/12/pdata/1/auditp.txt
$$ ##AUDIT TRAIL=  $$ (NUMBER, WHEN, WHO, WHERE, PROCESS, VERSION, WHAT)
(   1,<2012-08-02 23:39:01.984 -0500>,<Administrator>,<TOPSPIN>,<go>,<TOPSPIN 2.1>,
      <created by zg
	started at 2012-08-02 23:27:31.625 -0500,
	POWCHK enabled, PULCHK disabled,
       configuration hash MD5:
       6B 1B 68 BB D9 2E 58 E2 7F 35 AD 54 07 DF 0E 41
       data hash MD5: 64K
       27 90 43 9C BC 5A 9C 3D 4B 13 21 28 AF B1 15 7C>)
(   2,<2012-08-02 23:39:04.734 -0500>,<Administrator>,<TOPSPIN>,<proc1d>,<TOPSPIN 2.1>,
      <Start of raw data processing
       efp LB = 0.3 FT_mod = 6 PKNL = 1 PHC0 = 0 PHC1 = 0 SI = 128K 
       data hash MD5: 128K
       9B 7E C9 73 E3 2C ED A6 5F 4D C4 F0 DA 24 46 F6>)
(   3,<2012-08-02 23:39:05.890 -0500>,<Administrator>,<TOPSPIN>,<proc1d>,<TOPSPIN 2.1>,
      <pk PHC0 = 0.5987549 PHC1 = 0 
       data hash MD5: 128K
       5F 73 FC B3 F8 59 D0 73 B2 64 2A E3 8D 2B DA 39>)
(   4,<2012-08-02 23:39:06.484 -0500>,<Administrator>,<TOPSPIN>,<proc1d>,<TOPSPIN 2.1>,
      <abs ABSG = 1 
       data hash MD5: 128K
       E9 55 F3 F3 E8 C5 F8 F9 37 C7 A9 91 79 0D 07 06>)
(   5,<2012-08-02 23:39:06.546 -0500>,<Administrator>,<TOPSPIN>,<proc1d>,<TOPSPIN 2.1>,
      <abs ABSG = 2 
       data hash MD5: 128K
       64 80 68 AA C6 4D FD 3F A5 C1 94 3B 56 B0 13 4E>)
(   6,<2012-08-02 23:39:06.609 -0500>,<Administrator>,<TOPSPIN>,<proc1d>,<TOPSPIN 2.1>,
      <abs ABSG = 3 
       data hash MD5: 128K
       C4 97 9F 22 1E C0 A4 C4 D6 4F C7 DD 17 D0 91 9E>)
(   7,<2012-08-02 23:39:06.656 -0500>,<Administrator>,<TOPSPIN>,<proc1d>,<TOPSPIN 2.1>,
      <abs ABSG = 4 
       data hash MD5: 128K
       C5 A0 03 83 99 8A 7C AB AB 68 60 8A 27 BF 83 2C>)
(   8,<2012-08-02 23:39:06.718 -0500>,<Administrator>,<TOPSPIN>,<proc1d>,<TOPSPIN 2.1>,
      <abs ABSG = 5 
       data hash MD5: 128K
       E0 07 A7 CD E2 9B F8 EB 36 80 8A FD E7 8B 4A 27>)
$$ ##END=
$$ 
$$ $$ hash MD5
$$ $$ AA 8C FD C7 54 BE F4 90 A2 78 8E 8F 34 F9 D0 E9
##$RELAX= 
##$RELAX= 
##$RELAX= 
##$RELAX= 
##$RELAX= 
##$RELAX= 
##$RELAX= 
##$RELAX= 
$$ Bruker specific parameters
$$ [...]
150 150 150 150 150 150 150 150
##$TP07= 0
##$TPNAME0= <>
##$TPNAME1= <>
##$TPNAME2= <>
##$TPNAME3= <>
##$TPNAME4= <>
##$TPNAME5= <>
##$TPNAME6= <>
##$TPNAME7= <>
##$TPOAL= (0..7)
0.5 0.5 0.5 0.5 0.5 0.5 0.5 0.5
##$TPOFFS= (0..7)
0 0 0 0 0 0 0 0
##$TUNHIN= 0
##$TUNHOUT= 0
##$TUNXOUT= 0
##$USERA1= <user>
##$USERA2= <user>
##$USERA3= <user>
##$USERA4= <user>
##$USERA5= <user>
##$V9= 5
##$VALIST= <valist>
##$VCLIST= <CCCCCCCCCCCCCCC>
##$VD= 0
##$VDLIST= <DDDDDDDDDDDDDDD>
##$VPLIST= <PPPPPPPPPPPPPPP>
##$VTLIST= <TTTTTTTTTTTTTTT>
##$WBST= 1024
##$WBSW= 4
##$XGAIN= (0..3)
0 0 0 0
##$XL= 0
##$YL= 0
##$YMAX_a= 15412565
##$YMIN_a= -9399143
##$ZGOPTNS= <>
##$ZL1= 120
##$ZL2= 120
##$ZL3= 120
##$ZL4= 120
##$ABSF1= 14.9624
##$ABSF2= -5.595781
##$ABSG= 5
##$ABSL= 3
##$ALPHA= 0
##$AQORDER= 0
##$ASSFAC= 0
##$ASSFACI= 0
##$ASSFACX= 0
##$ASSWID= 0
##$AUNMP= <proc_prof1d_extract.lims>
##$AXLEFT= 0
##$AXNAME= <>
##$AXNUC= <1H>
##$AXRIGHT= 0
##$AXTYPE= 0
##$AXUNIT= <>
##$AZFE= 0.1
##$AZFW= 0.1
##$BCFW= 0
##$BC_mod= 0
##$BYTORDP= 0
##$COROFFS= 0
##$CY= 15
##$DATMOD= 1
##$DC= 0
##$DFILT= <>
##$DTYPP= 0
##$F1P= 0
##$F2P= 0
##$FCOR= 0.5
##$FTSIZE= 131072
##$FT_mod= 6
##$GAMMA= 0
##$GB= 0
##$INTBC= 1
##$INTSCL= 1
##$ISEN= 128
##$LB= 0.3
##$LEV0= 0
##$LPBIN= 0
##$MAXI= 10000
##$MC2= 0
##$MEAN= 0
##$ME_mod= 0
##$MI= 0
##$NCOEF= 0
##$NC_proc= -2
##$NLEV= 6
##$NOISF1= 0
##$NOISF2= 0
##$NSP= 0
##$NTH_PI= 0
##$NZP= 0
##$OFFSET= 14.9624
##$PC= 1
##$PHC0= 0.5987549
##$PHC1= 0
##$PH_mod= 1
##$PKNL= yes
##$PPARMOD= 0
##$PPDIAG= 0
##$PPIPTYP= 0
##$PPMPNUM= 2147483647
##$PPRESOL= 1
##$PSCAL= 4
##$PSIGN= 0
##$PYNMP= <proc.py>
##$REVERSE= no
##$SF= 400.02000907598
##$SI= 131072
##$SIGF1= 0
##$SIGF2= 0
##$SINO= 400
##$SIOLD= 131072
##$SPECTYP= <>
##$SREGLST= <1H.CDCl3>
##$SSB= 0
##$STSI= 131072
##$STSR= 0
##$SW_p= 8223.68421052631
##$SYMM= 0
##$S_DEV= 0
##$TDeff= 65536
##$TDoff= 0
##$TI= <>
##$TILT= no
##$TM1= 0
##$TM2= 0
##$TOPLEV= 0
##$USERP1= <user>
##$USERP2= <user>
##$USERP3= <user>
##$USERP4= <user>
##$USERP5= <user>
##$WDW= 1
##$XDIM= 131072
##$YMAX_p= 399633771
##$YMIN_p= -11781
##$CURPLOT= <Network HP LaserJet P1505>
##$CURPRIN= <$Network HP LaserJet P1505>
##$DFORMAT= <normdp>
##$LAYOUT= <+/1D_H.xwp>
##$LFORMAT= <normlp>
##$PFORMAT= <normpl>
##$SURQMSG= 1
$$ End of Bruker specific parameters
$$ ---------------------------------
##NTUPLES= NMR SPECTRUM
##VAR_NAME=  FREQUENCY,     SPECTRUM/REAL,   SPECTRUM/IMAG
##SYMBOL=    X,             R,               I
##VAR_TYPE=  INDEPENDENT,   DEPENDENT,       DEPENDENT
##VAR_FORM=  AFFN,          ASDF,            ASDF
##VAR_DIM=   131072,        131072,          131072
##UNITS=     HZ,            ARBITRARY UNITS, ARBITRARY UNITS
##FACTOR=    0.0627417313425164, 1,          1
##FIRST=     8223.62146879497, -3920,        -55030
##LAST=      0,             -2503,           -57213
##MIN=       0,             -11781,          0
##MAX=       8223.62146879497, 399633771,    0
$$ Real data points
##PAGE= N=1
##DATA TABLE= (X++(R..R)), XYDATA
$$ [...]
67500 82631 81029 79785 79392 79863 80888 82143 83301 83917 83706 82959 82415 82575 83335 84303 85182 85728 85708 85199
67482 85199 84736 84812 85268 85418 84820 83721 82730 82215 82082 82032 81888 81681 81524 81541 81885 82677 83804 84911 85756
67463 85756 86483 87357 88263 88723 88487 87921 87740 88441 89942 91586 92535 92355 91405 90521 90308 90737 91342 91648
67445 91648 91460 90951 90441 90024 89538 89071 89145 90015 91016 91223 90722 90601 91562 93168 94667 95932 97256 98711
67427 98711 100170 101538 102496 102427 101095 99181 97662 96859 96451 96116 95663 94859 93737 92950 93182 94240 95313
67410 95313 96045 96797 97848 99001 100083 101184 102144 102396 101713 100709 100234 100531 101273 102116 102856 103315 103465
67393 103465 103553 103860 104416 105133 105983 106813 107252 107147 106949 107258 108024 108515 108128 106887 105182 103370 101805 100907
67375 100907 100859 101300 101590 101446 101194 101386 102236 103470 104647 105538 106207 106824 107491 108207 108918 109534 109975 110271
67357 110271 110607 111216 112148 113143 113780 113851 113649 113795 114648 115868 116689 116655 116022 115390 115053 114824 114452 114047 113992
67338 113992 114518 115489 116645 117963 119673 121883 124295 126338 127542 127808 127452 127086 127256 127978 128597 128366
67322 128366 127221 125868 125018 124779 124862 125110 125526 125973 126275 126657 127661 129413 131281 132520 133045 133230 133143
67305 133143 132475 131226 129977 129283 129120 129209 129545 130205 130798 130674 129761 128872 128969 130292 132349 134545 136569
67288 136569 138233 139215 139211 138361 137383 137084 137643 138450 138742 138344 137748 137591 138126 139107 140049 140678 141214 142044 143067
67269 143067 143611 143224 142315 141700 141754 142321 143200 144218 145029 145456 145992 147269 148952 149891 149576 148753 148220 147800
67251 147800 147062 146459 146871 148340 150017 151285 152290 153398 154728 156273 157953 159473 160632 161792 163584
67236 163584 166032 168368 169845 170369 170239 169731 169120 168781 168986 169772 171068 172703 174244 175111 175079 174486 173901
67219 173901 173763 174245 175154 175989 176460 176972 178168 179941 181461 182342 183206 184707 186573 188122 189275 190388
67203 190388 191351 191657 191378 191401 192379 193973 195408 196468 197571 199024 200538 201499 201619 201275 201260 202120 203686
67186 203686 205250 206219 206549 206597 206753 207266 208270 209797 211795 214155 216719 219264 221604 223740 225785 227750
67170 227750 229535 231238 233173 235330 237009 237463 236935 236602 237304 238706 240041 241277 243013 245440 248065
67155 248065 250514 252972 255535 257642 258623 258560 258205 258210 258756 259719 260832 261812 262670 263845 265686 267879 269775
67138 269775 271215 272634 274342 276161 277901 279753 281912 284178 286233 288139 290231 292563 294791 296648
67124 296648 298273 299963 301739 303367 304764 306171 307776 309385 310745 312149 314290 317392 320834 323881
67110 323881 326480 329037 331713 334381 337052 339856 342646 345141 347421 349821 352294 354345 355742 356885
67096 356885 358335 360294 362668 365268 367864 370438 373466 377463 382054 385959 388202 389034 389475 390388 392306
67081 392306 395553 399938 404556 408515 411837 415296 419441 424132 428905 433354 437217 440478 443500 446798
67067 446798 450580 454632 458569 462088 465073 467713 470418 473418 476524 479478 482406 485690 489526 493860
67053 493860 498586 503515 508277 512635 516819 521212 525721 529933 533933 538477 544080 550245 555935 560660
67039 560660 564826 569169 574090 579521 585092 590296 594736 598548 602528 607542 613666 620068 625912 631174
67025 631174 636398 641923 647722 653822 660360 667229 674157 681247 688929 697215 705507 713349 720805 727826
67011 727826 733937 739098 744316 750654 758001 765641 773692 783004 793614 804230 813532 821323 828232 834981
66997 834981 842287 850776 860446 870554 880450 890213 900220 910478 920752 930987 941176 951114 960803
66984 960803 970809 981694 993223 1004647 1015766 1027079 1038760 1050047 1060095 1069190 1078634 1089422
66972 1089422 1101359 1113575 1125647 1137957 1151095 1165191 1179887 1194647 1208925 1222276 1234625
66961 1234625 1246411 1258304 1270797 1284199 1298812 1314718 1331383 1347816 1363323 1378028 1392655
66950 1392655 1407914 1424006 1440513 1456810 1472772 1488974 1505932 1523293 1540190 1556246 1571735
66939 1571735 1586795 1601156 1614866 1628621 1643016 1657966 1673251 1689072 1705496 1721816 1737239
66928 1737239 1752007 1767101 1782880 1798698 1813983 1829029 1844484 1860531 1876870 1893151 1909098
66917 1909098 1924474 1939205 1953429 1967250 1980609 1993502 2006143 2018742 2031243 2043405 2054970
66906 2054970 2065721 2075630 2085118 2094886 2105227 2115680 2125571 2134721 2143314 2151300 2158352 2164441 2170001
66893 2170001 2175332 2180117 2183778 2186231 2188077 2190014 2192081 2193575 2193736 2192566 2190793 2188958 2186784 2183737
66879 2183737 2180031 2176514 2173519 2170366 2166283 2161316 2155893 2149892 2142819 2134708 2126136 2117265 2107542 2096599
66865 2096599 2084904 2073164 2061539 2049866 2038270 2026976 2015711 2003844 1991121 1977801 1964071
66854 1964071 1949784 1934971 1920190 1906045 1892460 1878693 1864052 1848460 1832353 1816123 1799763
66843 1799763 1783063 1766073 1749153 1732527 1715996 1699266 1682363 1665497 1648622 1631516 1614273
66832 1614273 1597411 1581344 1565921 1550567 1534729 1518189 1501179 1484231 1467762 1451727 1435838
66821 1435838 1420072 1404716 1389883 1375263 1360523 1345698 1330986 1316349 1301581 1286701 1272028
66810 1272028 1257801 1243865 1229831 1215526 1201163 1187041 1173163 1159321 1145541 1132130 1119178
66799 1119178 1106313 1093182 1079979 1067154 1054787 1042624 1030543 1018570 1006552 994366 982442
66788 982442 971487 961523 951715 941407 930901 920894 911476 901972 891623 880227 868388 857233
66776 857233 847594 839264 831315 823123 814680 805949 796687 787143 778122 769843 761437 752256 743046 734947
66762 734947 727844 720778 713681 707510 702548 697691 691807 684973 677898 670830 663527 655833 647770 639454
66748 639454 631269 623779 617101 610707 604226 598062 592798 588318 584005 579559 575049 570294 564816 558563
66734 558563 552226 546566 541638 536902 531948 526877 521920 516922 511453 505476 499590 494391 489787 485319
66720 485319 480986 477210 473910 470226 465505 460119 454948 450353 446091 442009 438294 435055 432075 429025
66706 429025 425657 421823 417579 413275 409353 405999 403089 400382 397610 394528 391129 387695 384453 381304
66692 381304 378077 374855 371774 368747 365742 363119 361196 359628 357698 355186 352392 349377 345834 341876
66678 341876 338249 335453 333227 331245 329751 328961 328252 326632 323934 321033 318927 317871 317283 316182 313910
66663 313910 310773 307807 305613 303674 301180 298194 295387 292919 290319 287487 284991 283205 281827 280540
66649 280540 279515 278873 278116 276560 274028 270833 267433 264383 262141 260520 258716 256372 254232 253169 252888
66634 252888 252276 250861 249265 248204 247706 247408 247040 246359 245091 243269 241329 239617 237997 236154 234105
66619 234105 232227 230839 229846 228781 227299 225698 224682 224392 223934 222351 219858 217588 216213 215410 214643
66604 214643 213769 212686 211183 209472 208251 207769 207391 206535 205471 204700 204100 203388 202895 202983 203025 201938 199732
66587 199732 197599 196334 195450 194111 192181 189988 187703 185452 183595 182380 181638 181184 181185 181654 181909 181125
66571 181125 179367 177523 176207 175222 174200 173249 172607 171993 170789 168905 167089 166185 166195 166281 165660 164337 162934
66554 162934 162000 161648 161728 162058 162439 162610 162427 162025 161666 161367 160763 159478 157612 155729 154268 153075 151683
66537 151683 149971 148297 147005 146093 145377 144680 143772 142512 141300 140996 141973 143435 144113 143557 142377 141307
66521 141307 140540 139985 139710 139837 140234 140508 140259 139350 138132 137312 137346 137948 138457 138594 138563 138457 138038 137215 136305
66502 136305 135623 135104 134537 133916 133386 133064 133018 133164 133057 132154 130473 128715 127497 126755 126106 125496 125149 125091
66484 125091 125104 125054 124991 124932 124728 124116 122889 121197 119732 119277 119915 120946 121735 122284 122759 122903 122373 121367
66466 121367 120458 119970 119841 119885 119826 119370 118652 118364 118912 119689 119787 119198 118634 118287 117609 116342 114990 113994 113224
66447 113224 112631 112679 113586 114659 115006 114565 113900 113256 112409 111284 110129 109016 107700 106104 104624 103762 103626
66430 103626 103903 104191 104272 104087 103537 102418 100716 98917 97756 97531 97861 98222 98468 98680 98821 98894 99175 99857
66412 99857 100572 100734 100413 100377 101093 102013 102163 101258 99941 98946 98305 97542 96464 95463 94911 94496 93572 92139
66394 92139 91054 90992 91516 91633 91066 90493 90506 90835 90855 90441 90002 89847 89906 90021 90191 90432 90615 90618 90544 90637 90957
66373 90957 91252 91197 90727 90066 89517 89313 89555 90033 90074 88937 86612 84128 82753 82896 83952 85069 85764 85877
66355 85877 85405 84581 83811 83274 82786 82217 81827 81903 82222 82231 81756 81221 81065 81210 81239 80962 80588 80408 80470 80605 80665
66334 80665 80661 80717 80961 81396 81759 81543 80389 78562 76903 76128 76242 76790 77452 78171 78778 78991 78924 79223 80354
66315 80354 81947 83086 83185 82395 81348 80723 80926 81807 82675 82839 82225 81338 80655 80251 79959 79647 79295 78983
66297 78983 78864 78981 79104 78925 78447 77968 77649 77319 76809 76287 76045 76055 75945 75437 74718 74323 74604 75345 75975
66278 75975 76232 76389 76689 76799 76230 75193 74570 74884 75688 76180 76077 75692 75447 75622 76317 77271 77841 77488 76297
66259 76297 74858 73691 72988 72723 72761 72906 73098 73461 73985 74291 73970 73042 71805 70383 68751 67135 65966
66242 65966 65397 65203 65221 65559 66329 67457 68832 70310 71465 71717 70902 69489 68089 67044 66660 67367 69190
66225 69190 71269 72417 72281 71661 71616 72449 73661 74664 75311 75818 76393 77002 77344 76985 75699 73892 72516
66208 72516 72174 72287 71622 69809 67885 66995 67040 67202 67370 68200 69815 71341 71989 71900 71573 71040 70046 68662
66190 68662 67293 66414 66516 67885 70035 71798 72448 72422 72599 73244 74107 75076 76111 76926 77400 78027 79226
66173 79226 80422 80615 79732 78613 77698 76634 75322 74403 74312 74588 74598 74313 73914 73202 72027 70875 70414 70692
66155 70692 71211 71535 71410 70571 68973 67021 65151 63371 61670 60560 60569 61270 61506 60724 59555 58945 59166
66138 59166 59916 60934 62095 63126 63581 63150 61932 60362 58957 57999 57440 57125 57022 57168 57570 58353 59829
66121 59829 62080 64528 66294 67040 67134 66983 66554 65682 64425 62870 60987 59011 57669 57578 58470 59377 59572
66104 59572 59130 58639 58641 59325 60502 61770 62842 63649 64043 63663 62426 61034 60449 60779 61132 60763 59947 59481
66086 59481 59702 60414 61379 62384 63025 62992 62601 62528 62972 63498 63784 64003 64358 64736 65074 65532 65958 65692 64463
66067 64463 63062 62474 62620 62644 62321 62318 63010 63903 64551 65259 66394 67621 68486 69270 70464 71718 72078 71256
66049 71256 69956 68883 68074 67400 67061 67238 67663 67918 67900 67673 67126 66083 64627 63067 61707 60816 60600
66032 60600 60940 61328 61286 60749 59886 58837 57837 57357 57712 58683 59862 61162 62560 63582 63740 63495 64066
66015 64066 65964 68250 69614 69791 69551 69675 70384 71475 72447 72576 71416 69358 67422 66418 66390 66738 66648
65998 66648 65572 63705 61948 61091 61069 61305 61585 62134 62883 63297 63108 62748 62808 63408 64285 65084 65357 64708 63304
65979 63304 61936 61260 61234 61507 61968 62495 62602 61901 60752 59925 59676 59596 59270 58689 58094 57822 58194 59112 59884
65960 59884 59941 59633 59790 60534 61154 61174 60910 60805 60818 60764 60686 60576 60199 59531 58949 58723 58747 59048 59924 61203 61929
65939 61929 61474 60524 60301 61052 62024 62700 63317 64191 65217 66142 66779 66884 66326 65417 64628 63986 63285 62862 63370
65920 63370 64589 65248 64523 63170 62613 63319 64576 65520 65778 65297 64273 63295 63064 63762 64968 66236 67414
65903 67414 68319 68459 67430 65455 63362 61963 61519 61713 62087 62437 62745 62820 62258 60972 59583 58990 59421
65886 59421 60138 60220 59543 58807 58631 58855 58909 58709 58851 59799 61144 61988 61993 61696 61752 62203 62667 62909 62936 62683 62042
65865 62042 61244 60893 61384 62380 63069 62993 62564 62605 63360 64161 64189 63383 62313 61312 60255 59181 58503 58305 57996
65846 57996 57163 56385 56547 57624 58805 59687 60522 61255 61198 60082 58730 58111 58151 58079 57658 57409 57721 58300 58634
65827 58634 58606 58528 58796 59584 60700 61727 62437 63013 63726 64569 65409 66293 67249 67929 67931 67526 67596 68678 70366
65808 70366 71778 72336 72035 71286 70704 70773 71483 72415 73236 73831 73956 73267 72014 71222 71725 73188 74557 75311
65790 75311 75821 76567 77509 78276 78646 78721 78836 79295 79988 80378 80139 79680 79644 79949 79821 78756 76962 74776 72273
65771 72273 69711 67772 66842 66462 65996 65529 65567 66016 66118 65385 64059 62586 61152 59922 59221 59165 59435 59695
65753 59695 59986 60335 60222 58961 56670 54474 53537 54083 55448 56863 57909 58374 58151 57452 56882 56955 57617
65736 57617 58423 59097 59610 59774 59278 58344 57914 58703 60209 61150 60889 59987 59254 58693 57677 55920 53978 52822
65718 52822 53090 54621 56519 57733 57798 57061 56177 55540 55244 55330 55748 56164 56203 55936 55825 56020 55991 55128 53576
65699 53576 52168 51555 51648 52012 52515 53342 54470 55472 56002 56244 56626 57119 57157 56425 55469 55212 55940 57113
65681 57113 58173 59149 60230 61140 61398 61069 60823 61134 61801 62343 62527 62307 61574 60358 59119 58460 58493 58710
65663 58710 58555 58021 57670 58118 59427 60919 61682 61385 60562 59985 59870 59825 59402 58527 57493 56755 56623 56911
65645 56911 57059 56824 56704 57259 58262 59039 59548 60422 61816 62904 62895 62000 60995 60292 59928 60057 60799 61723
65627 61723 62040 61272 59496 57142 54915 53612 53470 53795 53744 53363 53351 53886 54325 54156 53640 53306 53284 53346 53275
65608 53275 52951 52406 51965 52033 52577 53065 53047 52515 51665 50659 49727 49113 48717 48135 47239 46374 45829 45478 45126
65589 45126 44830 44678 44652 44981 46142 48132 50156 51504 52350 53169 53708 53211 51539 49429 47677 46582 46200
65572 46200 46525 47260 47895 48260 48713 49606 50824 51967 52754 53167 53416 53817 54523 55340 55963 56314 56367 55828 54436
65553 54436 52615 51298 50961 51275 51874 52931 54580 56261 57231 57554 57969 58800 59480 59312 58287 56951 55747
65536 55747 54807 54175 53817 53389 52379 50722 49058 48135 48059 48489 49449 51373 54125 56524 57357 56621 55256
65519 55256 53846 52259 50536 49341 49131 49428 49433 49084 49039 49739 50906 51921 52330 51976 51027 49970 49424 49760
65501 49760 50927 52550 54084 55050 55408 55748 56802 58575 60068 60109 58490 56229 54637 54160 54193 53963 53364
65484 53364 52847 52709 52827 53010 53259 53567 53712 53468 52867 52122 51425 50922 50736 50898 51367 52158 53231 54243
65466 54243 54742 54771 54920 55487 55926 55534 54433 53404 52903 52758 52802 53258 54324 55755 57047 57761 57630 56689
65448 56689 55469 54733 54804 55293 55580 55378 54759 53900 52978 52149 51440 50779 50172 49745 49593 49756 50270 50951 51221
65429 51221 50571 49230 47981 47242 46835 46755 47478 49092 50751 51610 51934 52659 54160 56043 57897 59464 60246
65412 60246 59810 58634 57886 58102 58591 58422 57477 56316 55517 55476 56330 57671 58689 59053 59337 60228 61579 62662
65394 62662 63099 63125 63134 63393 64014 64780 65071 64418 63143 62084 61696 61799 62178 62943 64143 65421 66350 66967 67775
65375 67775 69212 71234 73395 75388 77460 80125 83336 86253 88177 89581 91795 95644 100797 106494
65361 106494 112451 118770 125315 131557 136983 141358 144574 146362 146231 143737 138949 132700 126281 120746
65347 120746 116398 112833 109323 105292 100637 95688 90807 86116 81691 77849 74917 72826 71210 69865
65333 69865 68764 67730 66504 65215 64327 63962 63649 62909 61706 60160 58307 56454 55311 55247 55648 55487
65317 55487 54429 52977 51664 50507 49217 47571 45619 43892 43307 44426 46721 48907 50116 50468 50492
65302 50492 50446 50377 50471 50950 51706 52354 52666 52756 52777 52587 51898 50774 49827 49730 50553 51707 52542 52757 52282 51146
65282 51146 49666 48445 47843 47626 47414 47249 47373 47627 47555 47000 46215 45413 44655 44150 44189 44710 45363 46125 47383
65263 47383 49220 51063 52306 52868 52867 52196 50908 49761 49784 51215 53248 54878 55705 55841 55404 54411 53032
65246 53032 51642 50510 49609 48868 48449 48511 48746 48542 47796 47216 47495 48447 49343 49839 50114 50228 49988 49511 49328
65227 49328 49769 50649 51678 52622 52947 51945 49643 47080 45266 44279 43740 43636 44136 44992 45851 46846 48219
65210 48219 49525 49937 49342 48465 47846 47337 46698 46099 45735 45465 45163 45045 45354 45963 46599 47183 47702 47941 47667
65191 47667 47020 46473 46386 46727 47231 47739 48322 49045 49688 49869 49539 49115 48972 48989 48877 48719 48793 49019 49062 48992 49280
65170 49280 50049 50808 51128 51148 51158 51079 50728 50308 50248 50672 51320 51881 52182 52124 51660 50835 49795 48826 48309 48314 48255
65149 48255 47401 45951 45107 45747 47364 48768 49517 50116 51000 51955 52598 52900 53056 53171 53261 53324 53312 53220 53231 53563
65129 53563 54118 54495 54365 53676 52556 51265 50202 49656 49524 49532 49701 50224 50902 51216 51065 50964 51272 51719 52064
65110 52064 52744 54256 56145 57291 57250 56780 56885 57765 58922 59951 60902 62037 63582 65676 68377 71563
65094 71563 74888 77871 80189 82020 84050 86870 90322 93625 96284 98640 101328 104425 107422 109943
65080 109943 112071 113955 115525 116762 117881 118894 119243 118287 116074 113237 110095 106338 101769 96945 92701
65065 92701 89292 86351 83598 81141 79084 77205 75186 72892 70384 67896 65894 64823 64515 64067 62632
65050 62632 60272 57842 56120 55290 55126 55300 55441 55227 54662 54054 53578 52998 52032 50891 50168 50168 50499 50439 49639
65031 49639 48433 47584 47799 49305 51623 53737 54771 54709 54381 54551 55134 55489 55315 54917 54596 54272 53905 53836
65013 53836 54305 54948 55228 55207 55354 55687 55719 55357 55253 55914 56875 57152 56260 54498 52466 50702 49655 49579 50383
64994 50383 51734 53294 54766 55901 56693 57403 58147 58594 58303 57279 56037 55210 55242 56138 57284 57824 57557
64977 57557 57166 57173 57095 56220 54855 53935 53599 53131 52365 52074 52594 53049 52571 51546 50943 50991 51223 51326 51141 50271
64957 50271 48564 46798 46052 46485 47411 48422 49611 50757 51205 50797 50180 49945 50069 50376 50886 51380 51285 50450
64939 50450 49545 49244 49419 49541 49510 49614 49912 50120 49931 49245 48321 47889 48709 50630 52465 53174 52886 52333 51725
64920 51725 50790 49618 48684 48080 47422 46612 46118 46321 47102 48189 49441 50573 51085 50773 50024 49368 49056 49209
64902 49209 49936 50949 51502 51214 50722 50971 51945 52685 52577 52064 51848 51913 51777 51416 51352 51855 52597 53281 54125
64883 54125 55355 56503 56788 56146 55387 55214 55518 55830 55992 56009 55652 54802 53990 53927 54493 54789 54366 53830 53896
64864 53896 54370 54517 54109 53532 53041 52484 51736 50888 49914 48671 47484 47242 48436 50343 51666 51981 52070 52687
64846 52687 53415 53168 51642 49836 48968 49249 50020 50903 52267 54361 56447 57325 56672 55364 54371 53788 53254
64829 53254 52865 53026 53562 53682 53063 52421 52606 53484 54163 54126 53690 53393 53351 53312 53028 52460 51805 51424 51550 52041
64809 52041 52547 52875 52991 52745 51951 50801 49888 49687 50227 51294 52640 53906 54712 54982 54915 54554 53801 53016
64791 53016 53033 54102 55244 55220 53908 52222 50895 49981 49442 49495 50180 51086 51733 51967 51919 51896 52339 53474 54925
64772 54925 56015 56548 56921 57452 58047 58610 59224 59709 59571 58699 57644 56872 56199 55345 54526 53955 53172 51626
64754 51626 49734 48656 48986 50204 51464 52401 53031 53362 53372 53170 53019 53268 54132 55277 55819 55188 53930
64737 53930 53200 53447 54113 54657 55245 56195 57297 58157 58796 59465 60090 60349 60116 59503 58629 57685 57044 56906 56920
64718 56920 56569 55888 55394 55381 55670 56097 56824 57964 59233 60176 60528 60224 59352 58293 57641 57704 58165 58480 58518
64699 58518 58563 58776 58952 58894 58751 58822 59125 59355 59267 58970 58790 58879 59081 59189 59237 59413 59703 59777 59352 58542 57752
64678 57752 57222 56802 56239 55587 55206 55381 55981 56600 56973 57197 57478 57780 57852 57650 57585 58210 59598 61122 61913
64659 61913 61608 60679 60026 60222 61107 62057 62522 62266 61272 59702 57999 56797 56513 57017 57799 58388 58586 58412
64641 58412 58016 57613 57364 57238 57100 56945 56961 57383 58337 59770 61341 62409 62404 61397 60208 59768 60386 61637
64623 61637 62805 63307 62882 61701 60321 59312 58804 58547 58409 58568 59074 59487 59314 58747 58648 59608 61256 62658
64605 62658 63287 63379 63456 63779 64338 65044 65710 66019 65775 65159 64536 64047 63626 63392 63628 64220 64400 63445 61545
64586 61545 59706 58812 59015 59961 61214 62287 62599 61891 60626 59735 59825 60768 62020 63197 64252 65253 66138
64569 66138 66719 66900 66835 66757 66518 65504 63304 60462 58199 57205 57041 56992 57178 58300 60426 62639 64006
64552 64006 64398 64136 63386 62297 61352 60965 60916 60704 60408 60654 61646 62791 63521 63994 64626 65260 65264 64347 62862
64533 62862 61304 59831 58400 57067 56007 55340 55113 55388 56174 57219 58001 58121 57739 57470 57746 58380 58892
64516 58892 59082 59077 58975 58814 58868 59534 60740 61846 62335 62376 62463 62746 62979 62960 62696 62247 61676 61153 60949 61278
64496 61278 62129 63118 63584 63179 62427 62248 62736 62925 62155 61117 60928 61556 61990 61747 61324 61093 60720 59978 59345
64477 59345 59256 59303 58795 57778 57000 57066 58035 59642 61495 63185 64503 65525 66258 66443 65996 65412 65327 65781
64459 65781 66298 66663 67207 68245 69514 70339 70223 69273 68120 67431 67433 67903 68562 69222 69521 68952 67496 65988
64441 65988 65365 65635 65936 65611 64850 64250 64135 64443 65004 65706 66514 67412 68196 68384 67632 66383 65815 66865
64423 66865 69373 72341 74934 77069 79138 81441 83930 86316 88248 89550 90457 91637 93713 96641 99635
64408 99635 101841 103025 103515 103677 103614 103262 102452 100927 98605 95821 93018 90286 87569 85234 83826 83122
64392 83122 82114 80313 78457 77411 76885 75935 74363 72808 71686 70868 70326 70230 70249 69616 68237 67078 67064
64375 67064 68062 69319 70369 71107 71454 71442 71310 71098 70440 69167 67770 66808 66188 65631 65503 66425 68149 69581
64357 69581 70113 70236 70549 70756 70100 68430 66294 64247 62587 61709 62150 63978 66425 68439 69643 70566
64341 70566 71955 73974 76097 77656 78377 78463 78310 78198 78121 77879 77424 77110 77499 78796 80620 82427 84026
64324 84026 85497 86756 87524 87773 87889 88241 88829 89606 90943 93369 96820 100476 103479 105578 106939 107632
64308 107632 107659 107277 106837 106265 105123 103296 101268 99560 98270 97342 96863 96764 96631 96328 96514 97891 100042
64291 100042 101741 102446 102791 103465 104394 105468 107330 110615 114689 117972 119554 119950 120226 120972 122248 123989
64275 123989 126001 127826 129048 129715 130256 130982 131775 132241 132045 131156 129839 128374 126713 124497 121545 118332
64259 118332 115806 114633 114681 115233 115598 115475 114944 114356 114127 114305 114301 113369 111532 109703 108692 108412 108437 108945
64241 108945 110454 112746 114812 116108 117245 119052 121439 123717 125650 127594 129729 131797 133727 135980
64227 135980 138989 142495 145729 148218 150177 152073 153882 154973 154829 153715 152313 150679 148082 144213
64213 144213 140181 137712 137332 137767 137274 135288 132689 130822 130505 131709 133829 136168 138371 140542 143050
64198 143050 146158 149745 153318 156379 158902 161424 164556 168384 172352 175685 177903 179111 179905 180831 181770
64183 181770 181908 180550 177863 174731 171976 169894 168385 167165 165867 164252 162474 161033 160438 160966 162585
64168 162585 164866 167111 168913 170562 172652 175290 178108 181027 184561 189174 194737 200876 207536 214870
64154 214870 222833 231266 240277 250190 261143 272985 285583 298996 313287 328280 343493 358195
64142 358195 371585 383008 392037 398371 401816 402520 401023 397810 392826 385665 376220 364953 352508
64129 352508 339312 325694 312146 299231 287256 276208 266006 256694 248364 241061 234818 229710
64117 229710 225714 222551 219771 217039 214343 211973 210340 209764 210281 211571 213062 214150 214419 213908 213333
64102 213333 213824 216046 219526 223164 226434 229741 233532 237674 242016 247020 253164 260050 266863 273606
64088 273606 281066 289453 297860 305349 311815 317324 321312 323227 323512 323143 322303 320283 316683 311973 306732
64073 306732 301032 294869 288637 282714 276940 270969 264901 259197 254122 249731 246297 244294 243883 244685 246147
64058 246147 247886 249674 251402 253211 255393 258057 261163 264897 269665 275476 281756 288134 295099 303313
64044 303313 312516 321763 330756 340252 350960 362656 374778 387308 400463 413868 426685 438503
64032 438503 449519 459894 469460 478199 486448 494393 501739 508197 514142 520546 528273 537458 547423 557163
64018 557163 566106 574410 582438 590033 596536 601344 604062 604246 601671 597063 591968 587398 583040 578207
64004 578207 573220 569203 566662 564998 563569 562690 563289 565914 570421 576402 583534 591522 600032 608926 618508
63989 618508 629441 642315 657303 674235 692976 713671 736619 761946 789446 818764 849764
63978 849764 882781 918428 957174 999149 1044427 1093299 1146113 1203037 1264361 1330937 1404018
63967 1404018 1484639 1573554 1671911 1781607 1904875 2043900 2201112 2379534 2582562 2813754
63957 2813754 3077172 3377650 3720110 4108523 4545599 5032992 5571078 6158322 6791262
63948 6791262 7465081 8173765 8909585 9662838 10422131 11174311 11903648 12591655 13218879
63939 13218879 13767853 14224996 14580468 14827056 14959537 14974733 14871584 14651085 14316679
63930 14316679 13875250 13337848 12719220 12036385 11307295 10549875 9780932 9014909 8263393
63921 8263393 7535838 6840641 6185429 5576576 5018652 4514043 4062692 3662208 3308718
63912 3308718 2997992 2726017 2488871 2282487 2102691 1945478 1807360 1685586 1577990
63903 1577990 1482605 1397603 1321603 1253636 1192540 1136737 1084987 1037026 992889 951754 912111
63892 912111 873094 835059 798663 763862 730047 696789 664184 632773 603302 576245 551290
63881 551290 527613 504846 483466 463964 446010 428882 412479 397364 383811 371303 359151
63870 359151 347313 336354 326676 318014 309763 301716 294340 288218 283386 279386 275898 272947 270480 268187
63856 268187 266049 264726 264921 266448 268325 269863 271279 273114 275369 277487 279081 280358 281733 283189
63842 283189 284158 284020 282601 280149 276959 273149 268763 263910 258683 252978 246545 239286 231551 224033 217233
63827 217233 211027 204905 198647 192511 186685 180933 175124 169806 165728 162836 160327 157777 155629 154271
63813 154271 153133 151202 148167 144578 141028 137683 134613 132121 130507 129713 129345 128989 128440 127726 126955 126135
63797 126135 125193 124199 123398 122884 122323 121251 119640 117968 116643 115501 114058 112185 110369 109210 108797 108759
63781 108759 108879 109298 109987 110371 109916 108862 107853 106922 105452 103309 101357 100435 100316 100165 99675 99195 98973
63764 98973 98888 98890 99143 99702 100449 101421 102777 104388 105797 106671 107002 106857 106325 105725 105460 105529 105589 105652 106287 107902
63744 107902 110189 112613 115063 117671 120243 122350 123931 125426 127370 130129 133967 138973 144815 150840
63730 150840 156643 162447 168857 176331 184894 194240 203937 213468 222152 229198 234076 236856 237984 237658
63716 237658 235594 231602 226162 220188 214277 208492 202863 197796 193830 191085 189045 186858 183875 180032
63702 180032 175756 171459 167172 162761 158380 154444 151158 148281 145489 142821 140634 139238 138675 138764 139222
63687 139222 139766 140217 140597 141158 142340 144626 148248 152942 158025 162842 167169 171326 176016 181975 189526
63672 189526 198308 207519 216468 224805 232269 238481 243100 245891 246508 244493 239831 233323 226036 218490
63658 218490 210688 202759 195062 187687 180468 173631 167919 163735 160582 157731 155095 153013 151461 150043
63644 150043 148638 147512 146762 146183 145824 146213 147693 149844 151916 153755 156025 159500 164305 169921 175852
63629 175852 182158 189252 197247 205744 214383 223339 233003 243366 254098 265252 277492 291536 307667
63616 307667 325798 345656 366724 388303 409829 430839 450411 467021 479377 487347 491770 493364
63604 493364 492108 487717 480540 471884 463375 455972 449604 443900 439016 435323 432214 427848 420509 409993
63590 409993 397378 383861 370288 357408 345718 334994 324583 314389 305055 297043 290013 283488
63578 283488 277645 272960 269275 265745 261824 257983 255285 254321 254684 255526 256542 258265 261356 265874 271476
63563 271476 278142 286244 295959 307081 319544 333594 349204 365803 383055 401606 422402 445263
63551 445263 468621 490717 510674 528309 543321 555093 563224 568074 570752 572566 574380 576455 578925
63538 578925 582279 587055 593022 598979 603565 606062 606244 603698 597687 587635 573448 555401 534128
63525 534128 510819 486902 463122 439130 414407 389542 366175 345600 327821 312036 297595
63514 297595 284200 271655 259999 249773 241551 235150 229741 224858 220765 217606 214721 211358 207768
63501 207768 204955 203338 202195 200597 198509 196802 196485 198119 201595 206143 210751 215006 219486 225109
63487 225109 232141 240088 248444 257179 266430 276073 285763 295174 304012 311939 318608 323684 326761 327483
63473 327483 325850 322223 316882 309766 300876 290751 280364 270638 262201 255335 249853 245132 240665 236602
63459 236602 233491 231555 230482 229824 229255 228494 227399 226262 225655 225827 226478 227182 227747 228199 228839 230438 233858
63442 233858 239181 245577 252337 259703 268336 278360 289377 301211 314126 328434 344261 361684
63430 361684 380671 400952 422297 444881 469072 494901 522039 550210 579157 608171 636045
63419 636045 661600 683916 701985 714570 720833 721038 716490 708834 699399 689041 678377 668047 658609
63406 658609 650099 641847 632883 622422 609813 594334 575493 553639 529973 505895 482380 459845
63394 459845 438334 417886 398930 382221 368147 356278 345931 336960 329533 323315 317612 312375
63382 312375 308407 306381 306176 307503 310555 315542 322001 329171 336908 345776 356223 368033 380673 393985
63368 393985 408476 424969 443950 465244 488314 512707 538011 563502 588250 611551 632896
63357 632896 651462 666042 675643 679943 679226 674307 666565 657484 647981 638450 629407 621375 613975 605927
63343 605927 596386 585652 574144 561394 546728 530343 512953 494810 475893 456724 438080 420060
63331 420060 402307 385126 369533 356101 344468 334117 324922 316737 309145 301998 295717 290727 286953
63318 286953 284061 281799 279902 278055 276220 274723 273764 273139 272639 272446 272915 274119 275734 277247 278191 278378
63302 278378 277971 277222 276242 275131 274122 273244 272063 270304 268551 267683 267601 267191 265705 263582 261739 260651
63286 260651 260402 260960 261982 262799 263070 263152 263535 264263 265138 266006 266575 266516 266149 266450 267856 269563 270603 271132
63268 271132 271957 273249 274551 275829 277561 279844 282249 284644 287400 290544 293371 295250 296370 297431
63254 297431 298970 301167 303959 307137 310614 314707 319834 325888 332316 338841 345659 352855 360227 367969
63240 367969 376853 387216 398283 409125 420039 432295 446573 462309 478693 495724 513903 533201
63228 533201 552822 571966 590537 608943 627429 645744 663463 680393 696697 712777 729076
63217 729076 745718 762219 777847 792530 807060 821945 836299 848577 858315 866356 873063 877128
63205 877128 876710 871206 861249 847400 829795 808991 786317 763080 740001 717623 696737 677993
63193 677993 661504 647237 635525 626863 621417 619200 620547 625860 634806 646280 659468 674618 692467
63180 692467 713107 735824 759901 785114 811306 837925 864362 890506 916594 942572 968037
63169 968037 992785 1016931 1040305 1062157 1081828 1099414 1115224 1128644 1138001 1141745 1139430 1131405
63157 1131405 1117843 1098510 1073477 1043738 1010896 976206 940106 902738 864793 827589 792263
63146 792263 759152 728195 699664 674149 651882 632480 615451 600650 588083 577485 568317 560083
63134 560083 552525 545609 539475 534350 530399 527638 525967 525185 524964 524906 524697 524208 523531 523055 523331 524578
63118 524578 526365 528092 529752 531809 534301 536572 538144 539388 540931 542773 544501 546074 547873 550086
63104 550086 552539 555127 557918 560810 563544 566149 568926 571869 574520 576551 578119 579391 580102 579952 579272
63089 579272 578897 579362 580414 581381 581915 582345 583337 585249 587923 591091 594767 599101 604114 609843 616491 624038
63073 624038 631950 639820 648134 657706 668406 679277 690131 702105 716097 731412 746703 761730
63061 761730 777301 793845 811010 828632 847257 867492 889490 913310 939171 967064 996554
63050 996554 1027347 1059727 1094153 1130598 1168529 1207312 1246449 1285570 1324406 1362705 1400126
63039 1400126 1436369 1471481 1505790 1539463 1572322 1604380 1636410 1669644 1704723 1740946 1776615
63028 1776615 1810096 1840374 1866583 1887311 1900995 1907001 1905736 1897341 1880850 1855302 1821356 1781088
63016 1781088 1736355 1688224 1638036 1588089 1540744 1497407 1458745 1425341 1397560 1375165 1357784
63005 1357784 1345688 1339703 1340387 1347635 1360939 1379670 1403152 1430892 1462760 1498693 1538201 1580383
62993 1580383 1624382 1669584 1715398 1761210 1806628 1851559 1895813 1938744 1979425 2017218 2052095
62982 2052095 2084288 2113384 2137697 2154672 2162165 2159400 2146674 2124262 2091770 2048621 1995029 1932429
62970 1932429 1862862 1788026 1709078 1627398 1545207 1464979 1388302 1315635 1247147 1183239 1124153
62959 1124153 1069631 1019426 973818 933167 897169 864985 835964 809830 786278 764848 745292
62948 745292 727665 711919 697618 684196 671390 659388 648575 639074 630395 621702 612534 603111
62936 603111 593789 584473 574858 564988 555187 545596 536259 527566 520098 513970 508692 503717 498722 493383
62922 493383 487401 480956 474710 469165 464355 460257 456978 454314 451665 448827 446414 444993 444109 442773
62908 442773 440685 438393 436371 434578 432996 431880 431212 430467 429371 428546 428928 430671 432975 434884 435878
62893 435878 435774 434545 432451 430043 427773 425663 423501 421198 418782 416147 413115 409771 406560 403897
62879 403897 401834 400233 399168 398937 399589 400587 401127 400879 400299 400045 400152 400009 399235 398298 397920 398018 397642 396097
62861 396097 393779 391693 390371 389491 388392 386641 384143 381006 377450 373765 370253 367163 364594 362435
62847 362435 360479 358607 356715 354504 351685 348512 345735 343765 342216 340669 339507 339372 339987 340319 340000
62832 340000 339848 340628 341910 342648 342468 341842 341291 341031 341250 342092 343267 344113 344243 343810 343110 342250 341397 340994
62814 340994 341447 342718 344440 346291 348090 349714 351191 352863 355121 357927 360822 363586 366732 371088
62800 371088 376924 383743 390977 398573 406704 415184 423706 432666 443218 456121 470835 486202 501880
62787 501880 518652 537294 557696 579416 602723 628573 657620 689646 724106 760977 800944
62776 800944 844922 893513 946772 1004287 1065447 1129676 1196309 1264283 1332173 1398737 1463224
62765 1463224 1524751 1581362 1630110 1668319 1694655 1708889 1710975 1700839 1678971 1646732 1605780
62754 1605780 1557418 1502662 1442740 1379145 1313232 1246038 1178583 1112143 1048078 987472 930969
62743 930969 878794 830804 786697 746352 709902 677227 647538 619826 593803 570052 549163
62732 549163 531043 515301 501854 490664 481089 472183 463754 456612 451513 448189 445717 443519 441691
62719 441691 440571 440423 441570 444425 449225 455775 463551 472050 481155 491232 502834 516259 531525
62706 531525 548750 568341 590660 615788 643897 675641 711781 752397 796797 844319 895137
62695 895137 950213 1010552 1076463 1147452 1222840 1302417 1386161 1473048 1560490 1645362 1725476
62684 1725476 1799588 1866095 1922411 1965892 1994902 2008734 2007018 1989809 1957966 1912886 1855826
62673 1855826 1787967 1711254 1628745 1543753 1458663 1374666 1292387 1212547 1136033 1063642 995877
62662 995877 932904 874612 820808 771488 726822 686735 650608 617646 587517 560410 536402
62651 536402 515049 495662 477685 460715 444538 429428 416054 404646 394489 384677 375147 366470
62639 366470 358772 351493 344229 337202 330711 324713 319216 314556 310840 307458 303676 299537 295764 292833
62625 292833 290465 288043 285316 282645 280672 279690 279263 278613 277473 276396 276117 276834 278249 280119 282483
62610 282483 285461 289074 293249 297872 302908 308482 314765 321728 329189 337190 346057 356065 367323 380172
62596 380172 395255 412857 432440 453251 475253 499113 525490 554722 587032 622349 659790
62585 659790 697758 734901 770756 805266 837817 866955 891019 908955 920487 925628 924198 916047
62573 916047 901718 882493 859537 833243 803757 771926 739242 706858 675147 644355 615266
62562 615266 588905 565700 545186 526427 508642 491519 475181 459930 446048 433762 423194
62551 423194 414119 405795 397277 388025 378212 368504 359598 351882 345270 339369 333882 328867 324488 320675
62537 320675 317272 314473 312791 312522 313420 314986 316900 319162 322034 325929 331131 337454 344377 351700 359969
62522 359969 370025 382137 395740 410050 424806 440374 457279 475878 496525 519832 546477
62511 546477 576745 610441 647322 687407 730772 777160 825813 875547 924961 972777 1017972
62500 1017972 1059351 1095037 1122918 1141802 1151655 1152592 1144335 1127195 1102821 1073069 1038574 999444
62488 999444 957027 913677 870692 827818 785229 744716 707977 674678 643385 613966 587901
62477 587901 566287 548467 532757 517886 503641 490688 479957 471770 465395 459682 454023 448387
62465 448387 442697 436797 431065 426370 423168 421086 419562 418554 418447 419654 422441 426649 431451 435812
62451 435812 439568 443631 448844 455013 461445 467973 474833 481764 487851 492292 494849 495528 494275 491082
62437 491082 485961 478739 469243 457847 445522 433194 421317 410145 399950 390701 381936 373353 365307
62424 365307 358323 352361 347029 342456 339337 338017 337968 338428 339176 340413 342178 344296 346792 349966 354047
62409 354047 358990 364583 370544 376535 382388 388483 395619 404281 414068 424055 433674 443024 452239 460873
62395 460873 468270 474435 479987 485009 488383 488824 486451 482750 478925 474886 470069 464589 459022 453517
62381 453517 447950 442829 439278 437873 438075 439125 441081 444641 450271 457974 467775 480005 495028 512952
62367 512952 533735 557540 584847 616147 651387 689773 730316 772683 817412 865112 915495
62356 915495 967129 1017972 1066034 1109708 1147664 1178558 1201042 1214332 1218797 1215702 1206180 1190671
62344 1190671 1169440 1143323 1113535 1080821 1045194 1006649 965908 924377 883475 844104 806693
62333 806693 771598 739346 710420 684870 662259 641997 623635 606831 591264 576682 562928
62322 562928 549899 537679 526788 517941 511279 506107 501654 497960 495680 495159 496051 497725 499584 501019
62308 501019 501612 501631 501925 503018 504506 505531 505587 504619 502630 499583 495679 491374 487061 482923 479095 475772
62292 475772 473152 471406 470695 471040 472173 473721 475548 477805 480646 484087 488080 492493 496953 501039 504841
62277 504841 509070 514358 520593 527253 534288 542293 551811 562889 575407 589488 605237 622357 640457
62264 640457 659739 681079 705387 733064 764138 798634 836588 877732 921310 966233 1011316
62253 1011316 1055295 1096575 1133079 1162621 1183652 1195702 1199173 1194914 1184040 1167797 1147071 1121970
62241 1121970 1092223 1058147 1021044 982595 944066 906125 869138 833446 799566 768384 741032
62230 741032 718303 700106 685508 673300 662568 653043 645057 639065 635014 632290 630363 629239 629059
62217 629059 629507 629983 630324 630947 632184 633758 635132 636209 637424 639120 640987 642316 642832 643143 644184 646361
62201 646361 649470 653461 658814 665939 674558 684051 694230 705459 718225 732964 750120 769837 791562
62188 791562 814351 837594 861039 884197 906299 926924 946053 963247 977393 987787 995064 1000636
62176 1000636 1005561 1010501 1016395 1024373 1034937 1047847 1063042 1081218 1103263 1129317 1158530 1189489
62164 1189489 1220785 1251385 1280630 1307795 1331695 1350964 1364812 1373344 1377186 1377041 1373614 1367572
62152 1367572 1359346 1349159 1337373 1324596 1311273 1297415 1282932 1268174 1254012 1241520 1231559 1224413
62140 1224413 1219651 1216535 1214666 1214083 1214744 1216329 1218680 1221933 1225938 1230072 1234156 1239117 1246031 1254773
62126 1254773 1264392 1274669 1286403 1300032 1314899 1330235 1346047 1362549 1379522 1396921 1415553
62115 1415553 1436222 1458548 1481487 1504869 1529506 1555673 1582384 1608510 1633936 1659242 1684831
62104 1684831 1710947 1738134 1767003 1797562 1829221 1861547 1894770 1929564 1966540 2005931 2047537
62093 2047537 2090854 2135215 2179755 2223322 2264786 2303797 2341176 2378384 2416668 2456840 2499512
62082 2499512 2544960 2592557 2640679 2687488 2731818 2773365 2812385 2849423 2885161 2920179 2954785
62071 2954785 2989181 3023759 3059105 3095704 3133789 3173418 3214492 3256624 3299109 3341037 3381289
62060 3381289 3418482 3451319 3479288 3502865 3522739 3538966 3551206 3559616 3565027 3568097 3568739 3566578
62048 3566578 3561623 3554185 3544436 3532491 3518837 3504339 3489810 3475717 3462179 3449005 3435869 3422763
62036 3422763 3410190 3398698 3388312 3378781 3370188 3362855 3356576 3350503 3343981 3337131 3330377 3323754 3317028
62023 3317028 3310244 3303735 3297627 3291735 3286018 3280888 3276888 3274081 3271922 3269762 3267446 3265324 3263740 3262709
62009 3262709 3262188 3262398 3263654 3266017 3269323 3273380 3277868 3282243 3286164 3289873 3293703 3297208 3299229 3298764 3295262
61994 3295262 3288084 3276411 3259920 3238957 3213682 3183694 3149002 3110876 3071103 3030666 2989695
61983 2989695 2948437 2907610 2867877 2829529 2792641 2757040 2722143 2687426 2653180 2620381 2589599
61972 2589599 2560394 2531995 2504324 2478056 2453701 2430808 2408242 2385260 2362178 2339801 2318347
61961 2318347 2297389 2276799 2257103 2238599 2220741 2202915 2185336 2168616 2152865 2137937 2124146
61950 2124146 2111843 2100519 2089264 2078091 2067861 2058890 2050709 2043433 2038194 2035518 2034235 2032817 2031219
61937 2031219 2030573 2031573 2034084 2038041 2043743 2051241 2060241 2070769 2083323 2098216 2115249 2134242 2155458
61924 2155458 2179357 2206310 2236785 2271603 2311878 2358920 2414131 2478614 2552690 2636231 2729751
61913 2729751 2835031 2954531 3090472 3244734 3419275 3616181 3837383 4084809 4360875
61904 4360875 4668483 5010309 5388268 5803511 6256146 6744021 7261295 7797728 8338404
61895 8338404 8863113 9346081 9757792 10069255 10256910 10306256 10213801 9987403 9644666 9209433
61885 9209433 8707904 8165821 7606615 7049852 6510329 5998423 5520971 5081618 4681068
61876 4681068 4318232 3991607 3699349 3438415 3204820 2995201 2807571 2640284 2490988
61867 2490988 2357102 2236814 2129012 2032625 1946506 1869667 1801093 1739612 1684407 1635389 1592566
61856 1592566 1555326 1522877 1495039 1471867 1452703 1436425 1422641 1411811 1404022 1398315 1393516 1389117
61844 1389117 1384976 1380761 1376186 1371388 1366565 1361477 1355763 1349604 1343737 1338961 1335937 1335184 1336741 1339889
61830 1339889 1343655 1347719 1352522 1358459 1365238 1372035 1377954 1382229 1384401 1384698 1384104 1383714 1383916 1384329 1384533
61815 1384533 1384798 1386034 1389122 1394334 1401453 1410381 1421532 1435588 1453041 1474102 1498928 1527690 1560382
61802 1560382 1596841 1637054 1681290 1729887 1783117 1841373 1905186 1974810 2050060 2130862 2217890
61791 2217890 2312331 2415221 2527419 2650136 2784977 2933413 3096823 3277315 3478014 3702116
61781 3702116 3951944 4229324 4536654 4877276 5255136 5674611 6140599 6658220 7232244
61772 7232244 7866806 8565231 9329287 10158010 11046645 11985259 12956367 13932543 14876028
61763 14876028 15740926 16477003 17034633 17371498 17460177 17293525 16885365 16267032 15481853
61754 15481853 14578860 13606437 12607296 11616070 10659110 9755014 8915247 8145215 7445854
61745 7445854 6815106 6248882 5741762 5287764 4881126 4516897 4190995 3899742 3639300
61736 3639300 3405719 3195580 3006403 2836362 2683733 2546656 2423242 2311774 2211007
61727 2211007 2120293 2039123 1966327 1899995 1838396 1780742 1726839 1676311 1628519 1583085 1540032
61716 1540032 1499385 1460906 1424284 1389376 1356216 1324900 1295455 1267810 1241940 1218030 1196262
61705 1196262 1176390 1157821 1140214 1123672 1108139 1093058 1077976 1063152 1049102 1035847 1023074
61694 1023074 1010858 999541 988980 978529 967830 957098 946490 935801 925023 914705 905334
61683 905334 896599 887649 878010 868040 858646 850657 844264 838816 833265 827050 820531 814485 809219 804332
61669 804332 799291 794074 789107 784564 779925 774486 768284 762179 756875 752158 747422 742655 738470 735302
61655 735302 733059 731524 730549 729755 728554 726770 724981 723951 723919 724617 725751 727273 729270 731758 734512
61640 734512 737085 739121 740641 741831 742665 743111 743731 745580 749211 754028 758867 763042 766701 770394 774480
61625 774480 778770 782568 785298 787083 788408 789107 788172 784900 779752 773672 766954 759358 751034 742649 734605
61610 734605 726796 719123 711723 704547 697346 690302 684075 678860 673834 668101 661909 656393 652176 648664
61596 648664 644828 640351 635952 632768 631458 631692 632469 633110 633882 635540 638355 641959 646039 650696 656005
61581 656005 661742 667916 675091 683641 692930 701987 710962 721255 733912 748403 763419 778537 794671
61568 794671 813024 833967 856896 880833 905056 929312 953537 977477 1000741 1023218 1045142
61557 1045142 1066605 1087321 1107062 1126042 1144539 1162303 1178730 1193539 1207004 1219596 1231589
61546 1231589 1242846 1252683 1260085 1264471 1266191 1265952 1263900 1259594 1252749 1243503 1232043 1218549 1203574
61533 1203574 1188038 1172785 1158568 1146358 1136956 1130149 1124886 1120618 1117902 1117437 1119207 1123055 1129489
61520 1129489 1139221 1152360 1168746 1188767 1213109 1241865 1274664 1311719 1354112 1402962 1458910
61509 1458910 1522531 1594602 1675708 1765989 1865622 1975233 2095683 2227751 2372243 2529956
61499 2529956 2701012 2884205 3077100 3276470 3478224 3676875 3865361 4035569 4179345
61490 4179345 4289622 4361411 4392411 4383085 4336385 4257247 4151846 4026700 3888019 3741497
61480 3741497 3592204 3444365 3301255 3165467 3039178 2923954 2820368 2728095 2646584 2575623
61470 2575623 2515330 2465785 2426754 2397660 2377738 2366334 2363137 2368014 2380520 2399690 2424490 2454320
61458 2454320 2488785 2527035 2567692 2609598 2652364 2695920 2739714 2782688 2824002 2863580 2901959
61447 2901959 2939848 2977826 3016189 3054913 3093854 3132986 3172346 3211719 3250577 3288377 3324781
61436 3324781 3359510 3392102 3421932 3448440 3471283 3490309 3505322 3515869 3521294 3521113 3515198 3503484
61424 3503484 3485769 3462222 3434089 3403391 3371719 3339490 3306475 3272744 3239041 3206622 3176995
61413 3176995 3151479 3130585 3113864 3100589 3090433 3083315 3078798 3076031 3074197 3072657 3070654 3067189 3061341
61400 3061341 3052601 3040932 3026757 3010981 2994844 2979541 2965984 2954954 2947445 2944852 2948797 2960783
61388 2960783 2982050 3013775 3057228 3113517 3183305 3267091 3365738 3480315 3611336 3758613 3921936
61377 3921936 4101308 4295970 4503449 4719908 4940966 5161465 5374677 5572521 5746799
61368 5746799 5890087 5996138 6060875 6083676 6067131 6015050 5930935 5818346 5681709 5525733
61358 5525733 5354227 5170143 4976637 4777439 4576113 4375485 4177876 3985403 3799842
61349 3799842 3622519 3454541 3296906 3150288 3015023 2891376 2779559 2679363 2590171 2511535
61339 2511535 2443424 2385675 2337636 2298713 2268902 2248194 2235749 2230387 2231828 2240619 2256645 2278480
61327 2278480 2304646 2334794 2369024 2406626 2446321 2487386 2529647 2572355 2614016 2653553 2690933
61316 2690933 2726289 2759076 2788572 2814807 2838469 2860197 2880303 2898863 2915570 2929561 2939853
61305 2939853 2945921 2947639 2944843 2937255 2924768 2907483 2885568 2859365 2829582 2797085 2762521 2726256
61293 2726256 2688503 2649231 2608132 2565085 2520682 2476055 2432312 2390403 2351307 2315861 2284407
61282 2284407 2256966 2233714 2214861 2200057 2188425 2179257 2172223 2166761 2161808 2156451 2150479 2143957 2136580
61269 2136580 2127863 2117725 2106569 2094958 2083558 2073217 2064667 2058085 2053194 2049775 2047860 2047647 2049578
61256 2049578 2054630 2064162 2079403 2101256 2130613 2168486 2215637 2272310 2338521 2414338 2499532 2592991
61244 2592991 2692674 2796006 2899958 3000691 3093459 3173002 3233956 3271149 3280410 3259902 3210773
61233 3210773 3136271 3040417 2927796 2804050 2675265 2546161 2419272 2296205 2179179 2070638
61223 2070638 1971666 1881625 1799504 1725025 1658277 1598837 1545781 1498344 1456203 1419134 1386594
61212 1386594 1357725 1331721 1308273 1287667 1270398 1256702 1246573 1240107 1237534 1238846 1243656 1251562
61200 1251562 1262407 1276013 1291878 1309221 1327063 1344048 1358491 1369091 1375663 1378987 1380029 1379491
61188 1379491 1377904 1375605 1372483 1368055 1361962 1354193 1344779 1333561 1320429 1305471 1288742 1270195 1250218
61175 1250218 1229909 1210289 1191320 1172129 1152209 1131881 1111574 1091266 1070954 1051179 1032535
61164 1032535 1014885 997458 979635 961351 942964 925127 908592 893616 879646 866095 853385
61153 853385 842588 833855 825734 816313 804609 790649 774764 757405 739331 721361 703902 687038
61141 687038 671028 656346 643250 631613 621284 612346 604904 598840 593954 590322 588287 588083 589569
61128 589569 592467 596741 602437 609105 615773 621829 627587 633590 639747 645786 652301 660359 669945 679703
61114 679703 688567 696862 705332 713971 722554 731574 741535 751613 760043 765800 769076 770116 768528 764007
61100 764007 757045 748585 739403 730039 720921 712293 704337 697456 692061 687960 684318 680456 676449 672829
61086 672829 669958 667727 665584 662764 658821 654017 649019 644171 639313 634247 629029 623809 618813 614506
61072 614506 611392 609488 608331 607600 607458 608174 609712 611752 613798 615267 615918 616312 617451 619723 622470
61057 622470 624740 626220 627316 628671 630765 633669 637021 640408 643854 647674 651853 655990 659931 664030
61043 664030 668620 673595 678698 683813 688792 693461 698169 703878 711244 719837 728719 737630 747200 758071
61029 758071 770204 783023 795907 808495 820903 833840 848299 864816 882971 901737 920363
61018 920363 938819 957395 976190 995301 1015329 1037165 1061210 1087291 1115465 1146337 1180324
61007 1180324 1217283 1257353 1301587 1350945 1405035 1462581 1522887 1586217 1653204 1724974 1803788
60996 1803788 1892624 1993933 2109369 2240547 2389199 2556702 2744441 2954918 3191956 3460307
60986 3460307 3766219 4118419 4527637 5005682 5566590 6228555 7013044 7942307 9040934
60977 9040934 10342004 11890491 13736246 15912690 18398875 21072109 23683723 25903809
60969 25903809 27442729 28184881 28240989 27884821 27431326 27137877 27153404 27485879 27976568
60960 27976568 28321646 28178101 27315744 25716599 23555845 21094719 18573695 16164011
60952 16164011 13969149 12040010 10386954 8992811 7827997 6860568 6059061 5393973
60944 5393973 4840650 4379916 3995131 3670125 3390647 3146146 2929125 2733906 2556733
60935 2556733 2395727 2249492 2116247 1994656 1884453 1785412 1696369 1615856 1542798 1475825
60925 1475825 1412617 1350922 1289954 1230258 1172596 1117528 1065625 1017369 972870 932047 894916
60914 894916 861479 831610 805160 781808 760695 740798 721871 704488 688908 674490 660627
60903 660627 647624 636148 626264 617499 609471 602039 595154 589000 584015 580385 577790 575910 574893 575086
60889 575086 576577 579171 582457 585710 588242 590165 592348 595294 598493 601097 602730 603286 602535 600455 597486
60874 597486 593922 589464 583892 577866 572440 567962 563887 559466 554264 548300 542185 536922 533172 530816
60860 530816 529416 528732 528515 528288 527855 527704 528464 530284 533208 537748 544383 552711 561764 571094 581081 592242
60844 592242 604738 618468 633186 648502 664027 679304 693390 704926 713226 719015 723613 727676
60832 727676 731311 734979 739317 744033 747861 749772 749671 747813 744300 739463 734136 729144 724870 721403
60818 721403 718649 716102 713064 709435 705867 702798 699730 695863 691085 685865 680379 674307 667454 660180
60804 660180 653086 646522 640475 634771 629275 624020 619206 615050 611661 609122 607630 607403 608419 610365
60790 610365 612933 616107 620085 625050 631187 638766 647868 657926 667919 677329 686676 696810 707854
60777 707854 719188 730271 740969 751150 760562 769268 777677 785910 793527 800112 805765 810805 815348
60764 815348 819361 822799 825425 826919 827410 827533 827673 827597 827103 826509 826064 825360 823959 822246 820942 819993 818638
60747 818638 816595 814520 813215 812785 812672 812070 810267 806951 802389 797194 791906 786841 782103 777518 772829
60732 772829 768211 764290 761320 758687 755724 752730 750612 749721 749628 749878 750322 750810 751212 751749 752697 753768
60716 753768 754397 754629 755017 755513 755184 753319 750197 746435 742103 736941 731089 725155 719697 714911 710650
60701 710650 706620 702678 698985 695715 692639 689308 685575 681566 677275 672691 668261 664491 660980 656515
60687 656515 650457 643428 636293 629051 621264 613054 605025 597405 589888 582232 574544 567037 559895 553387
60673 553387 547862 543550 540480 538481 537124 535887 534626 533818 534121 535786 538587 542158 546197 550478 554876
60658 554876 559371 563953 568587 573310 578170 583056 587769 592337 596991 601754 606309 610404 614183 617974
60644 617974 622000 626328 630779 634768 637614 639325 640837 643222 646862 651532 657008 663321 670606 678955
60630 678955 688246 697983 707604 717104 727045 737646 748251 758102 767299 776499 785825 794603 802146 808337
60616 808337 813420 817624 821070 823718 825256 825280 823710 820905 817394 813651 810142 807321 805434 804350 803567
60601 803567 802304 799679 795025 788160 779374 769165 757988 746177 734096 722435 712223 704270 698550
60588 698550 694419 691475 689844 689561 690195 691425 693559 696946 701101 704981 708085 710777 713557 716449 719209
60573 719209 721716 723980 726094 728354 731167 734587 738133 741292 744108 747021 750169 753120 755442 757320
60559 757320 759265 761103 761699 760029 756344 751804 747086 741965 736343 730950 726635 723561 721616 721103 722361
60544 722361 725096 728909 734282 742164 752625 764867 778852 796092 818255 845523 876753 910736
60532 910736 946511 982576 1016399 1044975 1065683 1076782 1077537 1068238 1050267 1026062 998728 971103
60520 971103 944941 921117 900618 884881 874880 870272 869945 873225 879988 889623 900526 911042 920570
60507 920570 929446 937965 946113 954286 963737 975862 991190 1009469 1030788 1056264 1087495 1125669
60495 1125669 1171449 1225441 1288319 1360538 1442278 1533743 1635131 1746204 1866336 1995490
60485 1995490 2135257 2288997 2461113 2656262 2878747 3131724 3415981 3728335 4060016
60476 4060016 4395677 4714074 4990840 5202384 5329381 5359171 5287486 5119547 4869664 4558686
60466 4558686 4210141 3846618 3487211 3146002 2831591 2547888 2295736 2074259 1881401
60457 1881401 1714251 1569673 1444769 1336696 1242448 1159431 1086247 1022465 967510 920166
60447 920166 879163 843733 813278 786959 763983 743969 726611 711188 696812 683007 669666
60436 669666 656651 643974 632186 621918 612848 603645 593288 582157 571601 562690 555585 549767
60424 549767 544475 539055 533327 527752 523092 519819 517876 516959 516888 517620 519014 520748 522567 524595 527226
60409 527226 530682 534779 539129 543354 547027 549752 551653 553534 556167 559455 562679 565539 568525 572238
60395 572238 576797 581989 587573 593220 598586 603726 609100 614867 620493 625327 629275 632520 634845 635760
60381 635760 635189 633599 631460 628932 626144 623333 620580 617685 614491 611169 608109 605591 603622 602039
60367 602039 600760 600014 600187 601304 602780 603990 604982 606311 608191 610212 612027 613979 616763 620660 625376
60352 625376 630513 635952 641729 647761 653863 660016 666463 673416 680598 687306 693061 698099 702998 707910
60338 707910 712443 716215 719189 721398 722813 723669 724563 725952 727820 730120 733244 737686 743482 750400 758393
60323 758393 767229 775789 782433 786244 787334 785771 780963 772717 762345 751933 742559 733870 725319 717163
60309 717163 710062 704263 699509 695434 691788 688523 685878 684185 683395 683064 683049 683888 686138 689545 693282
60294 693282 696877 700436 703952 706864 708548 708948 708533 707840 707234 706959 707194 708033 709488 711470 713812 716500
60278 716500 719806 723960 728590 732787 735905 738137 740149 742356 744799 747537 750821 754842 759564 764833
60264 764833 770574 776904 784145 792614 802301 812910 824496 837839 853796 872310 892486 913771
60252 913771 936661 962098 990577 1022182 1057141 1095834 1138347 1184502 1234471 1289031 1349035
60241 1349035 1414787 1486081 1562665 1644429 1731206 1822601 1918060 2016939 2118251 2220326 2320829
60230 2320829 2417224 2507278 2589216 2661651 2723609 2774549 2814082 2841616 2856476 2858590 2848926 2829144
60218 2829144 2800929 2765846 2725763 2683091 2640432 2599916 2562891 2530261 2503153 2483147 2471752
60207 2471752 2469769 2477463 2495313 2524164 2564448 2615690 2677143 2748536 2829687 2919598 3016478 3118508
60195 3118508 3223843 3329782 3432736 3529492 3618038 3696793 3763513 3815599 3851269 3869919 3871519
60184 3871519 3856292 3825051 3779337 3720937 3651540 3573068 3488263 3400747 3314480 3232913 3158395
60173 3158395 3092343 3036080 2991425 2960258 2943576 2941232 2952608 2977178 3014327 3062896 3121145
60162 3121145 3187001 3258154 3331979 3405550 3475806 3539776 3594935 3639530 3672653 3693953 3703314
60151 3703314 3700891 3687370 3664162 3633328 3597421 3559379 3522415 3489696 3463831 3446575 3439141 3442797
60139 3442797 3459094 3489590 3535579 3598099 3677895 3775308 3890616 4024705 4179078 4354879
60129 4354879 4552194 4770616 5010076 5270499 5550736 5848267 6159707 6480942 6806855
60120 6806855 7131685 7449901 7756233 8044878 8309460 8544174 8744483 8906511 9026512
60111 9026512 9101503 9129946 9111266 9045103 8931716 8773063 8573173 8337764 8073895 7789605
60101 7789605 7493125 7192276 6894643 6607756 6338317 6091188 5869469 5675388 5510663
60092 5510663 5376347 5272955 5200671 5158850 5145469 5157806 5193646 5251072 5326916 5416183 5513307
60081 5513307 5613342 5711683 5803381 5883438 5947585 5992584 6016408 6018667 6000478 5963362 5908470
60070 5908470 5837174 5751765 5654582 5546601 5427664 5298238 5160322 5016560 4869225 4720510
60060 4720510 4573212 4430394 4294457 4167028 4049740 3944648 3853621 3777581 3716622 3670828
60050 3670828 3640725 3626814 3628876 3645987 3677277 3722519 3781891 3855207 3941418 4038699 4144782
60039 4144782 4256973 4371777 4484679 4590714 4685613 4766400 4830789 4876369 4900942 4903592 4884791
60028 4884791 4845194 4784934 4704583 4606424 4494201 4371840 4242952 4111301 3980827 3854920
60018 3854920 3736134 3626710 3528720 3443381 3370832 3311161 3265333 3234627 3219495 3219545 3234439
60007 3234439 3264165 3308556 3367366 3441079 3530869 3637194 3758699 3892921 4037719 4191383
59997 4191383 4351355 4513393 4672163 4822387 4959396 5079112 5178164 5254204 5306034 5333181
59987 5333181 5335199 5311428 5261703 5187443 5091807 4978533 4850881 4712151 4566992 4421348
59977 4421348 4280756 4149156 4029604 3925283 3838930 3771467 3722155 3690230 3675724 3678508 3697389
59966 3697389 3730802 3777925 3838397 3911071 3993724 4084056 4180421 4281293 4384340 4486376 4584089
59955 4584089 4674760 4756534 4828338 4889590 4939930 4979287 5008266 5028235 5040879 5047867 5051257 5054076
59943 5054076 5060063 5072705 5094786 5129042 5178906 5248261 5340536 5458247 5603236 5776935 5980289
59932 5980289 6213682 6476981 6769237 7087893 7428149 7783082 8144187 8501513 8843361
59923 8843361 9156178 9425315 9636617 9778325 9842675 9826633 9731762 9563687 9331571 9047449
59913 9047449 8725093 8378540 8020813 7663151 7314669 6982487 6672270 6388753 6135566
59904 6135566 5914527 5725515 5567502 5439862 5342581 5275442 5237446 5227153 5243219 5284386
59894 5284386 5349277 5436549 5544939 5672552 5815907 5969886 6128501 6285326 6433251 6564506
59884 6564506 6671404 6746983 6785054 6780581 6730928 6636788 6501572 6330099 6128134 5902604
59874 5902604 5661105 5410773 5157880 4908319 4667587 4439827 4227305 4031138 3852180
59865 3852180 3691039 3547755 3421961 3313097 3220119 3141254 3074416 3017690 2969184 2926765
59855 2926765 2888353 2852333 2817379 2782245 2746235 2709820 2674403 2641501 2612307 2587673 2567971
59844 2567971 2553034 2542607 2536608 2534413 2533937 2532068 2526158 2514829 2497492 2473871 2444321 2410116
59832 2410116 2372979 2334477 2295970 2258823 2224334 2193618 2167714 2147524 2133396 2124873 2121063 2121131
59820 2121131 2124327 2129787 2136776 2145347 2156701 2172778 2195295 2224957 2261373 2303517 2350040 2399212
59808 2399212 2449038 2497884 2544913 2589633 2631194 2668502 2700932 2728341 2750284 2765793 2774365
59797 2774365 2777033 2776155 2774233 2773039 2773681 2777177 2784921 2798671 2820158 2850766 2891583 2943629 3007957
59784 3007957 3085712 3178320 3287458 3414624 3560981 3728066 3918533 4135622 4381632 4656982
59774 4656982 4960180 5287290 5630034 5973866 6297912 6577342 6787533 6909056 6931999 6857989
59764 6857989 6699163 6474956 6208046 5920416 5630414 5351554 5092937 4860154 4655951
59755 4655951 4480889 4334118 4213937 4118104 4044320 3990722 3955742 3937594 3934431 3945192 3969865
59744 3969865 4008744 4061789 4128790 4209616 4304101 4412248 4534860 4673427 4829077 5002139
59734 5002139 5193129 5403520 5635035 5888814 6165994 6468578 6798862 7158294 7547680
59725 7547680 7968177 8421054 8906288 9421958 9964596 10528886 11106753 11687718 12260835
59716 12260835 12816140 13344779 13839549 14296839 14718071 15108944 15477693 15834305 16190180
59707 16190180 16556529 16941892 17350817 17784216 18239847 18711871 19190306 19661539 20109802
59698 20109802 20518768 20872934 21158893 21366587 21490367 21529714 21489420 21379011 21211553 21002350
59688 21002350 20767983 20525551 20291709 20081532 19907851 19781452 19711540 19705771 19769950 19908175
59678 19908175 20123570 20418874 20796370 21257399 21801781 22427020 23127214 23892057 24706155
59669 24706155 25548484 26391985 27203791 27946309 28578916 29060574 29354143 29431951 29280408
59660 29280408 28901782 28313422 27545531 26637586 25633440 24576558 23507017 22459854 21463268
59651 21463268 20536771 19690718 18927154 18240240 17615760 17031595 16460865 15877020 15258991
59642 15258991 14595238 13885910 13142045 12381629 11624364 10887719 10185246 9526339 8916476
59633 8916476 8357729 7849589 7389869 6975426 6602690 6268127 5968549 5701041 5462553
59624 5462553 5249639 5058862 4887628 4734551 4598905 4479789 4375852 4285554 4207460 4140310
59614 4140310 4082910 4033726 3990457 3950300 3910996 3871452 3830952 3787894 3739934 3685468 3624548
59603 3624548 3558150 3486996 3411427 3332198 3250959 3169856 3090836 3015364 2944616 2879582 2820788
59592 2820788 2768030 2720847 2679415 2644642 2617090 2596176 2580825 2570616 2565723 2565946 2570507 2578865
59580 2578865 2591065 2607047 2626115 2647286 2669740 2692751 2715680 2738417 2761421 2785051 2809199
59569 2809199 2833895 2859885 2888217 2919586 2954523 2993949 3039033 3090561 3148904 3214616 3288718
59558 3288718 3372298 3466073 3570364 3685433 3811841 3950532 4102381 4267571 4445665 4636379
59548 4636379 4839881 5055983 5283261 5519245 5761134 6005810 6249423 6487696 6716935
59539 6716935 6934520 7138513 7327156 7498612 7650560 7779831 7883104 7958590 8007228 8032312
59529 8032312 8038211 8029390 8009989 7983778 7954582 7927009 7906543 7898628 7907662 7937044 7989718 8067885
59517 8067885 8171805 8298918 8443961 8599442 8755883 8902250 9027021 9119400 9170065 9171525
59507 9171525 9118519 9008358 8841030 8619255 8348678 8037726 7696597 7335939 6966122 6597047
59497 6597047 6237724 5895464 5575498 5281300 5014856 4776540 4565233 4379135 4216631
59488 4216631 4076406 3957159 3857615 3776749 3713782 3668000 3638740 3625373 3627149 3643314 3673707
59477 3673707 3718994 3779899 3856297 3947520 4053425 4174584 4311301 4462950 4628528 4807288
59467 4807288 4998234 5199019 5405639 5613062 5815821 6008032 6183252 6334629 6455283
59458 6455283 6538766 6579802 6575294 6525055 6431467 6298332 6130051 5931933 5710819 5474558
59448 5474558 5230389 4983835 4739022 4499538 4268612 4048813 3842097 3649998 3473357
59439 3473357 3311922 3164621 3030283 2907972 2796891 2696480 2606529 2526753 2456213 2393640
59429 2393640 2338379 2290629 2250569 2217587 2190455 2167986 2149467 2134870 2124783 2119837 2119936 2124221
59417 2124221 2131808 2142332 2155787 2172337 2192485 2216925 2245612 2276726 2306626 2331119 2347491
59406 2347491 2356180 2360749 2365903 2375204 2390566 2413340 2444968 2486326 2536899 2594782 2657089 2720506
59394 2720506 2782550 2843222 2905339 2972945 3049519 3137622 3239439 3356857 3491240 3643697
59384 3643697 3815563 4008376 4223590 4462662 4727297 5019418 5341018 5694030 6079769
59375 6079769 6498058 6946906 7422859 7920823 8433110 8949419 9458574 9950311 10415493
59366 10415493 10846020 11236128 11583846 11890338 12157804 12388616 12585960 12753704 12894802
59357 12894802 13010083 13098573 13158139 13185541 13176714 13127741 13035495 12897478 12712070 12479724
59347 12479724 12203741 11889490 11543055 11170727 10778876 10373215 9958004 9536400 9111600
59338 9111600 8687408 8267966 7857491 7460256 7080184 6720139 6381811 6066369 5774904
59329 5774904 5508072 5265673 5046971 4851263 4677823 4525403 4392266 4276843 4178133 4095298
59319 4095298 4027216 3972682 3930825 3900980 3882267 3873665 3874495 3884488 3903266 3930013 3963652 4003045
59307 4003045 4046885 4093708 4142146 4190877 4238217 4282132 4321028 4354312 4381869 4403096 4416812
59296 4416812 4422149 4419411 4410072 4396048 4378836 4359309 4338404 4317917 4300382 4288111 4282660 4285194
59284 4285194 4296864 4318623 4351179 4395418 4452398 4522486 4604913 4698665 4803469 4919350 5045449
59273 5045449 5179669 5318934 5458814 5592954 5713905 5815118 5892278 5943333 5968274 5969033
59263 5969033 5948705 5910229 5855971 5788511 5711208 5627691 5541155 5454221 5368880 5286223 5206694
59252 5206694 5130851 5059381 4992120 4927676 4864559 4802291 4740919 4679829 4617857 4554550 4490797
59241 4490797 4428190 4368162 4311814 4260134 4214203 4175384 4145382 4125932 4118425 4124051 4144309 4181179
59229 4181179 4236716 4312663 4410436 4531268 4676220 4846240 5042355 5265601 5516415 5793843
59219 5793843 6095166 6415998 6750315 7090059 7424778 7741936 8028124 8270495 8457733
59210 8457733 8580442 8631436 8606322 8504252 8328388 8085711 7786237 7442060 7066556 6673533
59200 6673533 6276020 5884955 5508552 5152667 4821443 4517473 4241659 3993421 3771321
59191 3771321 3573563 3398088 3242558 3104528 2981754 2872436 2775256 2689194 2613273 2546424
59181 2546424 2487547 2435662 2390108 2350729 2317714 2290974 2269681 2252776 2239967 2231801 2228585 2229716
59169 2229716 2234463 2242953 2255833 2273106 2293928 2317559 2344046 2373940 2407768 2445848 2488209 2534500
59157 2534500 2584280 2637498 2694369 2754637 2817330 2881490 2946876 3013582 3081053 3147743 3211728
59146 3211728 3271379 3325466 3372982 3413268 3446203 3471900 3489992 3499498 3499716 3491186 3475499 3454314
59134 3454314 3428910 3400557 3370687 3340529 3311062 3283552 3259685 3240963 3228424 3223149 3226368 3238604
59122 3238604 3259388 3288517 3327092 3376517 3436864 3507108 3586777 3676354 3776050 3885118 4002678
59111 4002678 4128512 4262756 4405371 4556194 4715053 4881611 5055391 5235932 5422414
59102 5422414 5613084 5805476 5996977 6184303 6362216 6523437 6660225 6765639 6833573 6858850
59092 6858850 6838309 6771577 6660568 6508821 6321665 6106186 5869991 5619833 5361473 5100206
59082 5100206 4840835 4587281 4342595 4109096 3888165 3680230 3485409 3303919 3135597
59073 3135597 2979506 2834559 2700271 2576443 2462377 2356935 2259195 2168583 2084592 2006852
59063 2006852 1935345 1870040 1810339 1755252 1704010 1656144 1611230 1569031 1529739 1493494 1459722
59052 1459722 1427510 1396667 1367790 1341146 1316103 1291980 1269000 1247923 1228958 1211486 1194867
59041 1194867 1179177 1165051 1153041 1143325 1135948 1130983 1128295 1127380 1127763 1129522 1133126 1138764 1146209 1155367
59027 1155367 1166476 1179462 1193508 1207638 1221513 1235205 1248364 1260071 1269563 1276736 1281860 1285120
59015 1285120 1286640 1286772 1286206 1285712 1285825 1286762 1288655 1291780 1296375 1302261 1308871 1315783 1323011 1330602 1338014
59000 1338014 1344056 1347429 1347333 1343740 1337233 1328561 1318283 1306864 1294995 1283603 1273520 1265235 1258825
58987 1258825 1253919 1249913 1246649 1244762 1244973 1247069 1250148 1253882 1258839 1265347 1272759 1280326 1288259 1297370
58973 1297370 1308069 1320239 1333842 1349005 1365610 1383307 1401968 1421815 1443058 1465578 1488913
58962 1488913 1512443 1535796 1559146 1582826 1606577 1629633 1651822 1674008 1697058 1720877 1745055
58951 1745055 1770009 1796771 1825902 1857335 1891173 1927879 1967686 2010499 2056566 2106653 2161354
58940 2161354 2220666 2284432 2352795 2426049 2504429 2588332 2678508 2775758 2880532 2992994 3113483
58929 3113483 3242914 3382744 3534437 3698914 3876734 4068929 4277360 4504006 4750217
58920 4750217 5016998 5305741 5618253 5956255 6321351 6715233 7139310 7594141 8079728
58911 8079728 8596241 9143611 9719984 10320780 10939081 11566093 12190676 12798794 13373941
58902 13373941 13898187 14353073 14720614 14984968 15134392 15162460 15068232 14855938 14534723 14118328
58892 14118328 13624186 13071645 12479765 11865758 11244530 10628769 10028854 9452597 8905292
58883 8905292 8390055 7908197 7459820 7044591 6662054 6311067 5989224 5693325 5420509
58874 5420509 5168715 4936192 4721057 4521522 4336325 4164807 4006619 3861259 3727676
58865 3727676 3604368 3490096 3384407 3287245 3198193 3116415 3041246 2972404 2909606 2852388 2800476
58854 2800476 2754078 2713584 2679120 2650428 2627060 2608662 2595167 2586706 2583257 2584514 2590346 2601205
58842 2601205 2617728 2639974 2667347 2699373 2736292 2778819 2827495 2882378 2943281 3010315 3084200
58831 3084200 3165875 3255708 3353351 3458582 3572061 3694977 3828286 3972770 4129628 4300389
58821 4300389 4486186 4687629 4905610 5141902 5398838 5678712 5983613 6315478 6675975
58812 6675975 7066413 7487850 7941148 8426649 8943625 9489745 10060741 10650352 11250314
58803 11250314 11849981 12435767 12991284 13498524 13939258 14295908 14552490 14696361 14720086
58794 14720086 14622181 14406802 14083253 13665345 13169958 12615181 12019102 11399295 10771947
58785 10771947 10150419 9544440 8960713 8404251 7879173 7388414 6932931 6511541 6122018
58776 6122018 5762554 5431973 5128641 4849925 4593094 4356124 4137038 3933156 3741971
58767 3741971 3562555 3395207 3239807 3095301 2960652 2835317 2718677 2609989 2509166
58758 2509166 2416673 2332220 2254426 2182366 2116679 2058407 2007215 1961604 1920551 1884018 1851854
58747 1851854 1823003 1796197 1770960 1747574 1726294 1706957 1689302 1673251 1658645 1644880 1631067
58736 1631067 1616496 1600713 1583285 1563993 1543355 1522425 1501759 1480953 1459540 1437885 1416713
58725 1416713 1396108 1375558 1354696 1333393 1311286 1287934 1263456 1238476 1213433 1188438 1163825
58714 1163825 1140237 1118025 1096920 1076419 1056202 1036194 1016568 997671 979704 962554 946169
58703 946169 930833 916778 903861 891986 881358 871720 861832 850508 837912 825111 812735 800904
58691 800904 790029 780457 771487 762043 752419 744197 738248 733933 730494 728036 726741 726295 726720 728720
58677 728720 732499 737059 741306 745102 748623 751529 753519 755010 756472 757617 757932 757529 756846 756066 755360
58662 755360 755188 755610 755772 754739 752444 749284 745271 740314 734864 729562 724547 719822 716052 714268 714847
58647 714847 717268 720739 724678 728885 733823 740555 749917 761805 775497 790393 806148 822531 839628
58634 839628 857875 877484 898217 920176 944442 972330 1004305 1040094 1079599 1123168 1171190
58623 1171190 1224012 1282166 1346260 1416720 1493905 1578270 1670254 1770405 1879934 2000642 2133745
58612 2133745 2279040 2435531 2602389 2778617 2962015 3148933 3334723 3513810 3679470
58603 3679470 3824219 3940669 4022251 4063987 4063632 4022306 3943815 3833495 3697761 3543921 3379278
58592 3379278 3209958 3040648 2875109 2716406 2566693 2427156 2298181 2179507 2070518
58583 2070518 1970774 1880201 1798671 1725745 1660926 1603805 1553730 1509694 1470760 1436259 1405481
58572 1405481 1377680 1352474 1329656 1308494 1288012 1268200 1250083 1234122 1219414 1205034 1191261
58561 1191261 1178693 1166800 1154184 1139775 1123067 1103880 1082781 1061169 1040051 1019162 998021
58550 998021 977304 958195 940921 924991 910426 897590 886036 874758 863599 853428 844870 837768
58538 837768 831896 827289 823675 820359 816906 813399 810032 806947 804371 802287 800093 797193 793702 789919
58524 789919 785294 778821 770393 760938 751158 740884 729824 718284 706952 696438 687050 678547 670212
58511 670212 661662 653509 646732 641561 637565 634503 632324 630504 628332 625965 624464 624542 625850 627565 629175
58496 629175 630585 631978 633666 635741 637873 639828 642002 644972 648690 652582 656248 659593 662512 665041
58482 665041 667546 670137 672140 672807 672359 671614 670803 669592 668183 667471 667941 669090 670121 670721 671060 671472
58466 671472 672168 672913 673042 672107 670311 668021 665171 661588 657495 653209 648701 643955 639314 634985 630748
58451 630748 626736 623809 622340 621299 619539 617489 616516 617024 618249 619560 620925 622415 624309 627374 631942
58436 631942 637003 641344 645254 649906 655322 660261 663928 666379 667333 666072 662840 659092 656061 653967
58422 653967 652716 652264 652211 652106 652377 654024 657300 661611 666641 672565 679221 686207 693768 702496 712179
58407 712179 722064 732162 742971 753954 763658 771509 778122 783727 787604 789355 789376 787851 784597 780209
58393 780209 775970 772258 768383 764428 761826 761473 762430 763219 763428 763520 764006 765343 767815 771046 774331 777588
58377 777588 781218 785128 788973 793274 798958 805697 812049 817506 823034 829343 835985 842447 848822 855074
58363 855074 861017 867329 875172 884514 894153 903603 913356 923047 931249 937719 944097 951512 959084 965726
58349 965726 971957 978934 986801 994794 1001928 1007114 1009895 1011583 1014280 1018343 1022283 1025512 1029244 1034051
58335 1034051 1038611 1042067 1045812 1051568 1059136 1067355 1075946 1085171 1094918 1105316 1117117 1130404 1144037
58322 1144037 1157366 1171252 1186444 1202222 1217701 1233183 1249183 1265304 1281139 1297149 1313693
58311 1313693 1330259 1346479 1362685 1378718 1393522 1406739 1419375 1432154 1444716 1457102 1470344
58300 1470344 1484671 1498875 1512456 1526698 1542650 1559874 1578147 1598410 1620696 1643077 1664129
58289 1664129 1684821 1706684 1729881 1754371 1781004 1809916 1839625 1869250 1899921 1932610 1966435
58278 1966435 2000601 2036078 2073841 2113399 2154613 2198739 2245921 2293799 2340534 2387254 2435596
58267 2435596 2485007 2534480 2584833 2637004 2690144 2743654 2799176 2858327 2920372 2984323 3051278
58256 3051278 3122401 3196665 3272958 3352353 3435852 3522059 3609663 3700187 3795729 3896076 4000557
58245 4000557 4110507 4227271 4350028 4478231 4613839 4758409 4910500 5068902 5235790
58236 5235790 5413648 5601731 5798759 6006417 6226926 6460032 6705830 6967510 7247594
58227 7247594 7544583 7857256 8189286 8545727 8928369 9338789 9782318 10264236 10785493
58218 10785493 11347070 11955152 12617446 13338731 14125497 14990818 15949027 17010375 18187413
58209 18187413 19502132 20980642 22647037 24531319 26679367 29147833 31994916 35284034
58201 35284034 39089313 43487586 48553651 54379015 61095781 68880037 77949725 88578727
58193 88578727 101104234 115903525 133380489 154007089 178359002 207002825 240140902
58186 240140902 277039033 315412262 351165732 379005143 394047731 393717351 378710617
58179 378710617 352398142 319224981 283266394 247585873 214210703 184289175 158265969
58172 158265969 136101962 117495126 102020059 89203643 78597444 69832051 62613615
58165 62613615 56696100 51883185 48041066 45079369 42923805 41526509 40893056 41073219
58157 41073219 42114067 43997601 46548357 49323648 51607457 52624949 51890054 49422330
58149 49422330 45667464 41224434 36609402 32172315 28118163 24546746 21480905 18891596
58141 18891596 16722787 14910062 13391021 12110408 11022517 10091919 9292323 8603346
58133 8603346 8007164 7487608 7030769 6624488 6257510 5920619 5608053 5316194 5041499
58124 5041499 4781307 4535570 4305471 4090865 3890936 3706451 3538840 3387482 3250150
58115 3250150 3125669 3013731 2912176 2816678 2723333 2630135 2536380 2442495 2350269 2261655 2177438
58104 2177438 2097995 2024287 1956607 1893418 1833128 1775984 1722590 1671935 1622995 1577006 1535761
58093 1535761 1498601 1463438 1429824 1398437 1368347 1337642 1306398 1276409 1248149 1220451 1192976
58082 1192976 1166445 1140423 1113415 1085458 1058297 1032693 1007692 982971 959675 938303 917757
58071 917757 897295 877872 860694 845685 832021 819175 806982 795580 785478 776924 769264 761783
58059 761783 754841 749177 744414 739372 733482 726709 718625 709002 698885 689580 680932 672113 663719 657275
58045 657275 652811 648656 643704 638317 632979 627689 622826 619048 616083 613013 609958 608139 608095 609107 610502
58030 610502 612152 613571 613890 613054 611843 610543 608760 606620 604852 603501 601798 599440 596789 593720 589636
58015 589636 584798 580272 576288 571999 567182 562771 559206 555548 550869 545445 539979 534602 529304 524486
58001 524486 520459 517025 513956 511307 508982 506643 504250 502153 500549 499466 499158 499730 500473 500497 499938 499577
57985 499577 499359 498443 496759 495286 494568 494099 493500 493167 493349 493630 493758 494084 494741 495239 495325 495479 496113 496929
57967 496929 497379 497186 496214 494524 492791 491971 492369 493597 495418 497831 500314 501894 502113 501114 498760 494700
57951 494700 489475 484499 480565 477292 474353 472285 471686 472513 474605 478085 482753 487762 492312 496144 499210
57936 499210 501557 503670 505993 507818 507542 504330 498702 491205 481535 469497 455976 442349 429579
57923 429579 418205 408425 399691 391037 382413 375029 369919 366820 364954 364148 364591 366139 368559 371954
57909 371954 376371 381375 386580 392202 398648 405873 413528 421321 428923 435901 442088 447651 452580 456577
57895 456577 459620 462007 463551 463403 461053 456988 451934 446040 439225 431853 424536 417651 411417 406069
57881 406069 401533 397292 392952 388747 385238 382856 381835 382173 383403 384801 386089 387640 389897 393042
57867 393042 397288 402973 410096 418158 426560 434812 442398 449034 455063 460918 466112 469432 470297 469238
57853 469238 466970 463710 459554 454706 449133 442701 435873 429444 423431 417118 410445 404361 399402 394931
57839 394931 390328 385968 382423 379615 377434 376272 376091 375695 373880 370781 367318 363884 360399 357037 353816
57824 353816 349821 343916 336244 328277 321327 315532 310221 304728 298887 293121 287962 283381 278855 274349
57810 274349 270709 268680 267986 267866 268107 269019 270771 273291 276587 280626 285158 290144 296175 303998 313689
57795 313689 324546 335550 345653 353973 360150 364430 367316 369384 371469 374430 378404 382705 386680
57782 386680 390204 393191 395319 396561 397253 397146 395062 390164 383038 374947 366502 357707 348819 340428 332870
57767 332870 326144 320232 315122 310790 307388 305079 303456 301762 300037 299347 300348 302315 304187 305935
57753 305935 308137 310881 313877 317136 320710 324239 327549 331211 335582 339771 342621 344397 346455 349370
57739 349370 352443 355023 357313 359648 361824 363482 364711 366127 368668 373015 378723 384146 387946 390553
57725 390553 393603 398153 404102 411044 418762 426797 434430 441335 447811 454246 460873 468027 476177 485625
57711 485625 496513 508974 522825 537375 552086 567288 583655 601191 619408 638348 658768
57700 658768 681397 706640 734895 766427 801030 838574 879870 926273 978402 1036038 1099375
57689 1099375 1169553 1247788 1334698 1430825 1537205 1655063 1785339 1928670 2085377 2255271
57679 2255271 2437712 2631717 2835308 3044567 3253793 3456760 3647575 3820733 3971624
57670 3971624 4097842 4199973 4280800 4343242 4387402 4407430 4390775 4322605 4193887 4007115
57660 4007115 3775341 3516443 3247751 2983525 2734270 2506569 2303457 2125412 1971328
57651 1971328 1838999 1725478 1627819 1543971 1472936 1413942 1365535 1325746 1293159 1267384 1248321
57640 1248321 1235371 1227686 1224862 1226880 1233594 1244731 1260366 1281090 1307719 1340989 1381268 1428342
57628 1428342 1481751 1541628 1608933 1684571 1768778 1861785 1964523 2077944 2201939 2335446
57618 2335446 2477081 2624694 2774434 2921119 3059459 3184160 3289068 3367408 3413421 3423563
57608 3423563 3396596 3333786 3239466 3120371 2983580 2835056 2679896 2522957 2368520 2219665
57598 2219665 2078323 1945710 1822481 1708764 1604262 1508358 1420337 1339917 1267377 1202667
57588 1202667 1144633 1091719 1043323 999728 960869 925991 894484 866069 840039 815421 792298
57577 792298 771974 755183 740874 727439 714532 702906 692927 684079 675744 667780 660321 653516 647617
57564 647617 643054 640224 639115 639118 639382 639724 641049 644466 650020 656789 664161 672384 681754 691944 702434
57549 702434 713118 724258 736325 750139 766685 786385 808801 833193 859087 886305 915064
57538 915064 946252 981113 1020439 1064463 1113492 1167917 1227502 1291643 1360779 1436693 1520818
57527 1520818 1612873 1711790 1817284 1929541 2047717 2169493 2291822 2411115 2522676 2620767
57517 2620767 2699726 2754974 2783286 2782944 2754099 2698887 2620943 2524754 2415275 2297739 2177288
57506 2177288 2058207 1943208 1833565 1730242 1634682 1548157 1470577 1400642 1337294 1280493
57496 1280493 1230464 1186809 1148674 1115406 1086779 1062884 1043898 1029599 1019129 1011704 1007548 1007437
57484 1007437 1011233 1017749 1026345 1037803 1053070 1071907 1093473 1117697 1145348 1177136 1213446 1254687
57472 1254687 1301235 1353180 1410632 1474203 1544861 1623377 1710012 1804361 1905273 2011303 2121400
57461 2121400 2234541 2348288 2458227 2559153 2646138 2714134 2757721 2772673 2757755 2714496
57451 2714496 2645688 2554967 2447298 2328454 2203570 2076647 1951211 1830517 1716848 1611247
57441 1611247 1514110 1425580 1345356 1272775 1207323 1148677 1096205 1048903 1006054 967563 933532
57430 933532 903752 877693 854708 834161 815587 798835 783909 770709 758979 748436 738795 729896
57418 729896 721925 715252 709824 704961 700032 695052 690433 686548 683859 682904 683506 684328 683948 682342 680747
57403 680747 680190 680691 681821 683334 685111 687012 689036 691291 693683 695984 698257 700885 704083 707645 711296
57388 711296 715097 719383 724372 729818 735066 739621 743745 748205 753347 758753 764059 769641 776074 783214
57374 783214 790332 796932 803018 808761 814331 819860 825196 829952 834238 839032 845178 852192 858738 864251
57360 864251 869507 875562 882692 890453 898300 905931 913420 921166 929500 938367 947532 956936 966484 975726
57346 975726 984207 992071 999879 1007866 1015842 1023802 1032134 1041144 1050767 1060803 1071132 1081644 1092220
57333 1092220 1102860 1113606 1124400 1135190 1146062 1157090 1168275 1179845 1192282 1205649 1219178
57322 1219178 1232041 1244384 1257092 1270701 1284993 1299570 1314304 1329233 1344351 1359575 1374737
57311 1374737 1389813 1405326 1422073 1440140 1458679 1477138 1496171 1516606 1538021 1559269 1580121
57300 1580121 1601442 1623851 1647141 1671000 1695376 1720100 1745029 1770761 1798395 1828365 1860136
57289 1860136 1893187 1927599 1963525 2000796 2039273 2078961 2119598 2160638 2201740 2242720 2283003
57278 2283003 2321824 2358983 2394676 2428455 2459134 2485795 2508109 2525653 2537979 2545705 2550615 2554168
57266 2554168 2556631 2558054 2559253 2561285 2564668 2569688 2576795 2586150 2597310 2609867 2623866 2639245 2655518
57253 2655518 2672569 2691114 2711820 2734538 2758901 2785024 2812967 2842059 2871441 2900863 2930357
57242 2930357 2959649 2988506 3017212 3046021 3074566 3102406 3129640 3156315 3181833 3205905 3229670
57231 3229670 3254810 3281637 3308960 3335776 3362341 3389626 3418556 3449787 3483368 3518315 3553138
57220 3553138 3587039 3620216 3653016 3685321 3716815 3747291 3776510 3804305 3830972 3857218 3883573
57209 3883573 3910245 3937595 3966281 3996704 4028706 4062043 4096857 4133463 4171881 4211756 4252591
57198 4252591 4293963 4335662 4377658 4419791 4461550 4502433 4542535 4582507 4622833 4663330 4703421
57187 4703421 4742658 4780911 4818304 4855231 4892365 4930455 4969965 5010741 5051983 5092662 5132115
57176 5132115 5170211 5207003 5242480 5276827 5310588 5344216 5377565 5410137 5441792 5472898 5503819
57165 5503819 5534601 5565135 5595255 5624602 5652722 5679601 5705838 5731968 5757613 5781519 5802569
57154 5802569 5820626 5836309 5850031 5861461 5870041 5875871 5879823 5882707 5884526 5884637 5882470 5877954 5871406
57141 5871406 5863306 5854227 5844757 5835414 5826704 5819281 5813904 5811089 5810770 5812369 5815151 5818471 5821734 5824320
57127 5824320 5825749 5826031 5825886 5826808 5830903 5840323 5856364 5878867 5906454 5937219 5969138 6000425 6030464
57114 6030464 6060807 6095033 6137586 6192909 6265348 6358865 6476385 6620090 6792877 6999348
57104 6999348 7245460 7538313 7887218 8304832 8807040 9412429 10142493 11021943 12078551
57095 12078551 13343481 14852262 16644363 18760456 21239372 24115818 27416718 31155444
57087 31155444 35327363 39908804 44856535 50106505 55575598 61164356 66747358 72146095
57079 72146095 77108498 81330664 84523387 86482207 87117850 86443819 84548766 81574458
57071 81574458 77699455 73123536 68054022 62695108 57237266 51846064 46654630 41762048
57063 41762048 37234885 33109597 29397013 26089254 23166174 20599482 18356000 16401088
57055 16401088 14700980 13223461 11938504 10819516 9843604 8990472 8241717 7581408 6996423
57046 6996423 6475665 6009500 5590157 5211783 4869358 4557767 4272163 4008773 3764941
57037 3764941 3538629 3328080 3131773 2948558 2777908 2619810 2474088 2340006 2216831
57028 2216831 2104391 2002534 1910336 1826464 1750071 1680713 1617693 1560323 1508595 1462668 1421741
57017 1421741 1384335 1349745 1318524 1291590 1269711 1253748 1244476 1242156 1247175 1261103 1286131 1323495
57005 1323495 1373687 1438559 1522264 1629960 1766198 1932891 2124056 2319016 2482522 2577289
56995 2577289 2581848 2499741 2353750 2172060 1977704 1786085 1607341 1448300 1312360 1199264
56985 1199264 1106527 1031466 971761 924556 886010 852082 819481 785915 750150 712134 672655
56974 672655 632635 593054 555521 522205 494701 473146 456615 444141 435294 430231 429380 432842
56962 432842 439952 449758 461984 477223 496153 518802 544284 570558 594318 611809 620206 618366
56950 618366 606758 587406 563652 538873 514993 492620 472505 455924 443527 434785 429000 426116
56938 426116 426184 428886 434214 442996 456073 473484 494940 520533 550105 581917 612284 636441 649912
56925 649912 650012 636933 613461 583312 549703 515151 481689 450734 423085 399300 379621 363438
56913 363438 349514 337199 326869 318757 312041 305660 299512 294226 290109 286878 284182 281909 280256
56900 280256 279812 281156 284013 287273 290283 293652 298340 304559 312209 321854 334369 349808 367441 386910
56886 386910 408731 433435 460360 487057 509689 524529 529867 526697 517566 505004 491022 477225
56874 477225 464632 453700 445048 439797 438636 441025 446074 454021 466143 483401 505947 533974 568298
56861 568298 609820 658721 714017 773113 831224 881547 916756 931437 924268 898526 860290 815600
56849 815600 768948 723847 683600 650795 626470 610483 602618 602960 611576 628443 653660 687450
56837 687450 730272 783251 848090 925775 1015044 1111636 1207974 1293036 1353995 1380468 1368870
56826 1368870 1323322 1252855 1167812 1077512 989159 907587 835763 775395 726974 689850 663059
56815 663059 646127 638783 640410 650555 669792 699302 739581 790102 849814 916557 985275 1047373
56803 1047373 1092702 1112980 1104609 1069671 1014682 947601 875154 802321 733274 671503 618838
56792 618838 575208 539849 512346 492408 479410 472683 471951 477148 488162 505106 528451 558289
56780 558289 593223 629953 663769 689505 702666 700546 682952 652196 612378 568157 523427 480643
56768 480643 441097 405611 374777 348690 326753 307885 290994 275502 261624 249992 240856 233786
56756 233786 228198 223841 220570 217985 215626 213329 211130 209052 207216 205792 204614 203212 201585 200419
56742 200419 200073 199791 198541 196267 193664 191075 188383 185737 183545 181780 180059 178391 177151 176289 175236
56727 175236 173674 171773 169651 167303 165183 164113 164347 165227 165917 166010 165317 163786 161937 160828 161186 162793
56711 162793 164838 166537 167299 166845 165433 163712 162172 160980 160251 160032 160017 159800 159497 159552 159874 159803 159119 158415
56693 158415 158185 158162 157983 157880 158147 158372 157940 157040 156499 156709 157266 157792 158517 159839 161661 163532 165250 166950
56675 166950 168594 169771 170228 170365 170878 171991 173396 174899 176642 178567 180140 180899 180927 180481 179505 177819
56659 177819 175562 173164 171080 169717 169183 168944 168193 166878 165796 165364 164966 164019 162919 162261 161779 160939
56643 160939 159921 159026 157739 155590 153457 152623 152709 151985 149768 147165 145243 143872 142759 142303 142730 143445
56627 143445 143903 144325 144931 145325 145266 145304 145974 146922 147431 147290 146641 145529 144154 143098 142778 143028 143545 144274
56609 144274 145052 145437 145323 145230 145591 146241 146943 147836 148949 149840 150162 150087 149772 149028 147968 147370 147796 148808
56591 148808 149661 150285 150991 151620 151655 150975 149982 149141 148777 149049 149747 150417 151028 152162 154213 156755 159049 160862
56573 160862 162438 164075 166096 168836 172280 175991 179687 183487 187380 191006 194250 197490 200889 204084
56559 204084 206996 210258 214229 218220 221458 224298 227690 231792 235815 239024 241243 242612 243444 244135 244679
56544 244679 244549 243503 242129 241078 240165 238899 237442 236301 235355 233997 232113 230101 228028 225517 222559
56529 222559 219806 217892 216884 216425 216069 215556 215025 214845 214880 214265 212320 209403 206349 203374 200090 196387
56513 196387 192642 189194 186223 184033 182836 182266 181590 180424 178835 176950 174928 173148 171866 170802 169602
56498 169602 168585 168399 169005 169624 169718 169459 169202 169027 168881 168680 168248 167597 167352 168365 170801 173943 176995
56481 176995 179689 182116 184433 186863 189624 192634 195495 197846 199604 200879 201892 202858 203776 204440 204942
56466 204942 205966 208235 211752 215872 219894 223250 225409 226283 226738 228094 230893 234402 237417 239247 239950
56451 239950 240006 239984 240282 240971 241805 242346 242087 240716 238478 236124 234322 233183 232450 231874 231245 230359 229232
56434 229232 228126 227184 226257 225266 224423 223867 223471 223246 223526 224428 225490 226190 226554 226934 227579 228638 230088
56417 230088 231303 231279 229734 227472 225180 222549 219218 215866 213424 211708 209861 207861 206512 206068 205858
56402 205858 205268 204221 202652 200499 198369 197354 197832 199041 200055 200620 200880 200960 201147 201993 203809 206274
56386 206274 208671 210378 211178 211414 211844 213033 214924 217140 219450 221674 223494 224857 226233 227943 229571
56371 229571 230695 231797 233694 236250 238597 240497 242595 245269 248167 251056 254212 257633 260595 262448
56357 262448 263326 263746 264042 264595 266039 268670 271847 274437 275873 276596 277484 278977 280766 282316 283610 285106
56341 285106 286970 288777 290233 291736 293831 296484 299358 302444 305871 309422 312858 316493 320853 325940
56327 325940 331413 337250 343638 350441 357381 364526 371887 378826 384634 389618 394871 401045 407975 415331
56313 415331 422912 430339 437223 443527 449169 453484 455887 456924 457791 458885 459635 459608 458905 457631 455973
56298 455973 454792 454978 456076 456620 456134 455793 456821 459174 462244 465898 470264 475250 480877 487545 495494
56283 495494 504515 514595 526264 539809 554657 570073 586209 604025 624288 646942 671424 697474
56271 697474 725677 757063 792152 830735 872893 919714 972436 1031308 1095995 1166732 1244250
56260 1244250 1328864 1420528 1519657 1626966 1742523 1865697 1995866 2132244 2273063 2415828
56250 2415828 2558244 2697954 2831505 2954791 3064718 3159502 3237363 3296110 3334375 3352325
56240 3352325 3350935 3331515 3296219 3248009 3189639 3123240 3050922 2974904 2896841 2817777 2738798
56229 2738798 2660907 2584129 2507622 2430612 2352461 2272034 2188342 2101924 2014480 1927055 1839724
56218 1839724 1753047 1668371 1586401 1506862 1429978 1356957 1288516 1224205 1163739 1107753 1056689
56207 1056689 1010099 967614 929468 895471 864602 836265 810893 788750 769141 751361 735358
56196 735358 720922 707334 694419 682910 673226 664874 657450 651059 645376 639673 634366 631061 630286
56183 630286 630547 630440 630410 631498 633710 636673 640634 645727 651297 657042 663801 672210 681646 691458 702147
56168 702147 714241 727074 739822 752740 766231 779680 792282 804097 815185 824743 832368 839259
56156 839259 846861 855118 863237 871379 880426 890833 902943 917716 935949 957509 982455 1012181
56144 1012181 1048304 1091157 1140590 1197525 1263599 1339971 1427779 1529061 1645799 1778183 1924435
56133 1924435 2081429 2244197 2405514 2557484 2693912 2811366 2909510 2991560 3063177 3129002
56123 3129002 3189941 3243868 3287603 3317516 3330175 3324644 3303747 3271811 3231699 3184714 3131537
56112 3131537 3070970 2998571 2908925 2799716 2672833 2532432 2383683 2232936 2087058 1951755
56102 1951755 1830775 1725998 1637352 1563240 1502077 1452981 1414407 1383309 1356880 1334237 1315251
56091 1315251 1298714 1283007 1267612 1252640 1237740 1222810 1208840 1196583 1185304 1174230 1164307
56080 1164307 1156967 1152100 1148748 1146876 1146813 1147942 1149662 1152829 1158559 1166351 1175083 1184967 1196769 1209932
56066 1209932 1223255 1236704 1250814 1265096 1278865 1292879 1308357 1325036 1341880 1358916 1376663
56055 1376663 1394677 1412443 1430831 1450783 1471495 1491797 1512331 1534405 1557675 1581050 1604914
56044 1604914 1630306 1656891 1683910 1712136 1742588 1774246 1805460 1836732 1869732 1904518 1940153
56033 1940153 1977168 2016784 2058557 2101320 2145637 2192797 2242286 2292878 2345299 2401106 2459831
56022 2459831 2520026 2582168 2647682 2716034 2785737 2857260 2931960 3009150 3087409 3167750 3252163
56011 3252163 3339998 3429166 3519956 3614191 3711741 3811580 3915270 4025449 4141812 4262640
56001 4262640 4389361 4525355 4670994 4824237 4985386 5156760 5338356 5528595 5728912
55992 5728912 5942832 6170849 6410980 6663994 6933239 7219784 7522876 7844856 8190422
55983 8190422 8561389 8957576 9382460 9842336 10340237 10876529 11455252 12083941 12767900
55974 12767900 13511382 14324350 15221590 16215697 17318134 18547050 19927011 21482296 23239510
55965 23239510 25237646 27528340 30167624 33216497 36747898 40842141 45576920 51036287
55957 51036287 57335037 64630633 73121237 83052696 94728997 108500173 124745673 143902594
55949 143902594 166521960 193241336 224551379 260302076 299022492 337375570 370320478
55942 370320478 392381525 399633771 391237699 369512982 338640968 303033626 266309215
55935 266309215 231017511 198733575 170227706 145669220 124854623 107389841 92799209
55928 92799209 80602353 70375299 61769416 54493582 48302874 43004556 38452822 34527475
55920 34527475 31123958 28159893 25573852 23311633 21321480 19562044 18003261 16616821
55912 16616821 15374267 14255088 13247238 12337816 11510966 10755701 10067402 9439740 8862339
55903 8862339 8327840 7834330 7379195 6956958 6564699 6203368 5871859 5565235 5280269
55894 5280269 5017410 4775729 4551005 4340466 4144780 3963735 3794223 3634063 3483902
55885 3483902 3343961 3212471 3088370 2972028 2862468 2757354 2656581 2562442 2475521 2393657
55875 2393657 2315523 2241825 2172474 2106150 2043369 1986446 1935519 1887772 1841393 1797174 1755474
55864 1755474 1714941 1675245 1638054 1604278 1573183 1545093 1522043 1504544 1490144 1476028 1460533
55853 1460533 1441483 1416062 1383804 1347420 1309558 1270779 1231502 1193503 1158227 1125501 1094967
55842 1094967 1067157 1042421 1020468 1001508 986129 973636 962267 951383 941618 932603 922691 911291
55830 911291 899427 887466 874327 859460 843696 827645 811139 794616 779063 764042 747778
55819 747778 729767 711448 693902 676822 660250 645228 632051 619802 608256 598486 590970 584890
55807 584890 579864 576593 575281 575231 576558 580401 586800 594191 601564 609272 617049 623137 626171 626140 622844
55792 622844 615336 603866 590729 578148 566700 556315 547143 538727 530061 521285 513835 508344 504066
55779 504066 500778 499142 498317 495355 488197 477578 465022 450878 435556 420693 407431 395004 382566
55766 382566 371102 362035 355118 349095 343329 337461 330532 321927 312393 302989 293825 284794 276492 269242
55752 269242 262199 254653 247467 242067 238658 236398 234575 232667 230032 226548 222970 219825 216659 213031
55738 213031 209420 206403 203849 201756 200921 201871 203956 206359 209143 212393 215129 216102 215069 212496 208740
55723 208740 204265 199904 196011 192053 187754 183840 180885 178294 175329 172348 170093 168483 167038 165861
55709 165861 165345 165552 166644 169301 173840 179521 185393 191161 196574 200773 203096 203804 203334 201664 199162
55694 199162 197083 196243 195961 195295 194556 194670 195836 197828 200842 204920 209204 212898 216346 220144 223838
55679 223838 226666 228934 231360 233581 234679 234850 235133 235673 235590 234649 233847 234068 235125 236382 237617 239056
55663 239056 241087 244015 247648 251154 253753 255486 256985 258747 260994 263834 267023 269897 272020 273639
55649 273639 275066 276049 276191 275503 273979 271092 266393 260275 253533 246445 238803 230528 221774 212757 203913
55634 203913 195810 188523 181558 174716 168370 162479 156150 148826 141299 134793 129597 125179 120998 116553
55620 116553 111381 105844 101281 98567 97077 95770 94555 93715 92779 91140 89217 87832 86936 85994 85209
55605 85209 85122 85378 85108 84345 83891 83841 83385 82083 80354 78735 77503 76936 77033 77022 76110 74689 73857 73822 73726
55586 73726 73102 72485 72351 72300 71632 70146 68201 66423 65330 64709 63554 61248 58675 57369 57629 58211 57878
55569 57878 56516 54712 53035 51895 51501 51663 52015 52376 52605 52403 51816 51602 52349 53468 53882 53586 53635 54586
55551 54586 55828 56601 56948 57386 58229 59438 60715 61678 62323 63282 65158 67717 70169 72125 73801 75549
55535 75549 77697 80630 84360 88210 91541 94556 97755 100949 103631 106089 109165 112999 116858 120153
55521 120153 122768 124439 124829 124321 123902 123957 123897 123058 121327 118800 115568 111950 108231 104121 99127 93493
55505 93493 88068 83292 79065 75555 73160 71546 69700 67197 64620 62505 60638 58668 56593 54346
55491 54346 51668 48754 46324 44738 43630 42647 41837 41105 40039 38605 37321 36380 35279 33604 31505
55476 31505 29091 26142 22777 19640 16920 13922 10193 6446 3778 2464 2081 2366 3339 4899 6768
55461 6768 8630 10109 11019 11842 13379 15596 17389 17885 17396 16636 15680 14340 13070 12702 13468 14867 16312
55444 16312 17461 18089 18075 17433 16114 14129 12053 10907 11063 11694 11828 11563 11668 12321 13007 13451 13897 14416
55426 14416 14619 14264 13704 13491 13754 14109 14021 13226 11963 10789 10079 9789 9776 10099 10773 11440 11665 11535 11645
55407 11645 12491 14113 16292 18788 21231 23025 23637 23042 21781 20489 19406 18412 17484 16875 16697 16561
55391 16561 15950 14834 13622 12560 11506 10389 9530 9355 9937 10949 11897 12345 12112 11379 10550 9897 9364
55374 9364 8708 7749 6560 5446 4685 4248 3858 3336 2665 1770 590 -539 -1048 -818 -315 200 991 2073
55356 2073 2834 2964 3079 3647 3934 3053 1595 1068 1888 3083 3940 4783 5947 7132 8087 8923 9375 8698
55338 8698 6828 4847 3731 3303 2881 2315 1946 2071 2842 4123 5122 4888 3579 2579 2847 3781 4196
55321 4196 3802 3193 2939 3248 4024 4755 4837 4479 4707 5989 7508 8335 8603 8855 8965 8607 8216 8399 8788
55302 8788 8438 7234 5978 5242 5014 5363 6448 7771 8332 7817 6899 6119 5154 3574 1809 880 1397
55285 1397 3081 5080 6521 6976 6595 5822 5023 4485 4659 5994 8405 11076 13022 13900 14191 14500 14707
55268 14707 14056 12265 10257 9262 9327 9276 8201 6412 4799 3946 4148 5568 7768 9614 10277 10052 9767
55251 9767 9751 9833 9900 9886 9584 9063 8976 9863 11424 13067 14771 16748 18577 19549 19716 19736 19692 18931 17265 15513
55231 15513 14561 14410 14460 14268 13799 13320 13280 13952 15047 15957 16425 16635 16669 16363 15823 15532 15700 15881 15542 14749
55211 14749 14039 13814 14119 14781 15531 16061 16221 16170 16283 16844 17793 18655 18847 18219 17268 16684 16690 16979 17186 17256
55191 17256 17377 17734 18308 18793 18786 18203 17464 17151 17561 18610 20001 21301 22086 22206 21838 21203 20444 19826 19672
55172 19672 19845 19649 18617 17098 15717 14534 13193 11707 10590 10281 10801 11882 13074 13890 14193 14360
55156 14360 14701 14994 14969 14946 15390 16104 16561 16909 17838 19344 20396 20188 19134 18239 17944 17943 17780 17259 16500
55137 16500 15892 15852 16370 16925 17021 16689 16347 16318 16634 17140 17675 18220 18953 20097 21705 23675 25863 28019
55119 28019 29694 30539 30759 31020 31826 33116 34505 35710 36665 37363 37702 37497 36720 35728 35067 34878 34673 33914
55101 33914 32679 31515 30812 30572 30703 31167 31841 32522 33100 33547 33734 33484 32801 31944 31340 31421 32338 33735
55083 33735 35071 36269 37678 39258 40354 40648 40753 41311 41953 41936 41415 41247 41689 42141 42201 42158 42313 42547
55065 42547 42682 42642 42153 40932 39341 38155 37515 36803 35828 35362 36068 37502 38707 39325 39614 39820 40046 40492
55047 40492 41248 41944 41974 41031 39286 37240 35548 34704 34692 35104 35680 36449 37320 38053 38797 40181 42475 45029
55029 45029 46923 47859 48180 48320 48602 49214 49981 50370 50103 49546 49155 48812 48170 47473 47512 48712 50606 52298
55011 52298 53270 53746 54418 55757 57515 58968 59629 59558 58953 57836 56341 54907 53858 53041 52247 51728 51893
54994 51893 52604 53188 53128 52483 51702 51296 51534 52125 52265 51369 49766 48318 47384 46567 45602 44997 45390 46548
54976 46548 47506 47669 47361 47185 47329 47763 48740 50470 52484 53970 54877 56083 58211 60844 63330 65775
54960 65775 68682 72042 75498 79097 83139 87500 91901 96700 102587 109552 117075 125373 135400 147389
54946 147389 160366 173486 186822 200295 212791 223128 231014 236199 237477 233769 225722 215145
54934 215145 203054 189411 174641 160174 147122 135300 124000 113112 103162 94703 88025 83058
54922 83058 79353 76388 74090 72730 72231 72003 71661 71617 72699 75351 79274 83701 87966 92077 96800 102997
54906 102997 110763 119414 128313 137556 147828 159757 173275 187267 199858 209372 215186 217565 216741
54893 216741 212502 204691 193813 180968 167348 153805 140732 128299 116872 107068 99151 92592
54881 92592 86594 81042 76524 73420 71384 69801 68299 66663 64716 62623 60944 60010 59471 58795 58000
54866 58000 57498 57358 57156 56587 55841 55230 54739 54120 53185 51820 49937 47716 45808 44920 45083 45536 45525 45007
54848 45007 44422 43997 43561 42986 42452 42164 42050 41826 41194 39968 38204 36301 34700 33453 32329 31415 31238
54831 31238 32078 33528 35048 36665 38704 41004 42871 43877 44371 45118 46638 48845 51127 52756 53429
54816 53429 53483 53501 53785 54347 55172 56210 57237 58052 58798 59802 61141 62665 64425 66664 69398 72399 75776
54799 75776 80161 86028 93113 100858 109222 118671 129417 141133 153507 166637 180566 194635 207780
54786 207780 219360 229149 236375 239432 237187 230289 220621 209670 198115 186744 176611 167850 159324
54773 159324 150217 141283 133753 127622 122072 117240 114220 113241 113019 112423 111816 112100 113196 114335 115403
54758 115403 117083 119774 123149 126940 131539 137563 145191 154246 164684 176664 190248 205325 221780
54745 221780 239385 257288 273827 287132 296006 300109 299405 293805 283524 269530 253341 236422
54733 236422 219761 203819 188634 174123 160526 148433 138240 129741 122433 116048 110510 105630
54721 105630 101179 97164 93681 90625 87888 85699 84322 83503 82671 81641 80653 79716 78457 76714 74812
54706 74812 73069 71476 70026 68950 68431 68416 68900 70011 71638 73328 74698 75599 75754 74806 72994 71273
54690 71273 70363 70089 70008 70232 71098 72414 73615 74408 74722 74246 72717 70655 69217 69191 70479 72480 74559
54673 74559 76200 77235 78059 79220 80763 82395 84248 86872 90266 93463 95457 96198 96361 96513 96949 98014
54657 98014 99975 102496 104628 105546 105202 104316 103876 104641 106817 110016 113565 116967 120181 123557 127566 132483
54641 132483 138193 144326 150720 157778 166184 176136 186866 197092 206005 213736 220720 226678 230481 231123
54627 231123 228694 224158 218277 211002 202019 191679 181126 171485 162999 155030 146897 138674 131184 125247
54613 125247 120979 117756 114723 111414 108048 105331 103813 103261 102828 101929 100780 99816 98770 96801 93535
54598 93535 89625 86134 83699 82468 82405 83213 84136 84282 83263 81320 78922 76457 74275 72665 71657 71018
54582 71018 70476 69763 68479 66293 63457 60861 59239 58428 57623 56318 54789 53663 53247 53329 53510 53582 53632
54565 53632 53868 54342 54810 54863 54267 53238 52401 52314 52945 53682 54003 53999 54058 54182 54056 53792 54043 55052 56003 55816
54545 55816 54444 52890 52060 52046 52572 53599 55271 57602 60480 63775 67267 70589 73387 75501 77020
54530 77020 78414 80520 84006 88721 93856 98861 103829 108852 113477 117121 119633 121043 121043 119220 115695
54515 115695 111158 106365 101924 98272 95356 92458 88909 84972 81493 78668 75765 72240 68517 65343
54501 65343 62881 60852 59192 58040 57296 56688 56214 56099 56311 56507 56480 56359 56319 56386 56649 57372 58699 60399
54483 60399 62059 63465 64675 65800 66844 67780 68662 69640 70864 72330 73796 74906 75410 75308 74804 74236
54467 74236 74015 74423 75310 76101 76348 76225 76283 76708 77115 77144 76952 76845 76662 75937 74624 73302 72572 72472 72600
54448 72600 72517 71901 70551 68535 66245 64198 62754 62005 61725 61399 60599 59532 58956 59319 60155 60621 60457
54431 60457 60147 60265 60967 62016 62881 62860 61543 59315 57098 55495 54397 53501 52890 52887 53609 54914 56626
54414 56626 58542 60361 61887 63300 65007 67177 69552 71734 73521 74946 76172 77467 79150 81384
54400 81384 84004 86665 89162 91471 93462 94811 95428 95801 96594 97837 98783 98687 97594 96249 95384 95115
54384 95115 94851 93687 91210 88071 85526 84194 83522 82680 81678 81107 81053 80864 80021 78700 77293 75830
54368 75830 74182 72488 71066 70051 69387 69026 68918 68907 68863 68884 69150 69596 69905 69879 69702 69767 70276 71076 71861
54349 71861 72533 73342 74639 76443 78281 79511 79917 79991 80574 82143 84495 87057 89323 90864 91265 90450
54333 90450 88990 87705 86910 86378 85926 85522 84802 83191 80843 78841 77901 77332 75860 73220 70309 68008
54317 68008 66481 65458 64562 63341 61575 59632 58086 56991 55996 55026 54279 53584 52488 51115 50239 50241 50523
54300 50523 50309 49543 48657 47848 46954 45852 44714 43948 43889 44367 44649 44202 43414 43129 43571 44278 44982 45821 46599
54281 46599 46796 46525 46649 47468 48128 47916 47412 47601 48448 49146 49408 49698 50419 51561 53000 54552 55785 56329
54263 56329 56235 55749 54994 54310 54423 55657 57286 58363 58857 59258 59411 58728 57449 56671 56964 57768 58405 58897
54245 58897 59485 60056 60477 60987 61768 62438 62342 61184 59289 57478 56674 57211 58445 59404 59879 60436 61420 62605
54227 62605 63926 65752 67986 69550 69421 67845 65995 64694 63996 63735 63842 64095 64124 63843 63655 64059 65170
54210 65170 66594 67657 67836 67100 65877 64647 63644 62931 62448 61914 60947 59533 58217 57562 57518 57538 57228
54193 57228 56731 56532 57019 58077 58995 59000 58124 57329 57433 58044 57971 56639 54732 53314 52734 52601 52520 52509 52785
54174 52785 53400 54079 54270 53476 51782 50062 49369 49980 51174 52052 52379 52529 52817 53197 53555 53962 54487 54955
54156 54955 55099 54893 54599 54466 54394 53934 52739 51098 49879 49692 50195 50456 49957 48871 47438 45657 43820
54139 43820 42753 42998 44031 44876 45319 45985 47226 48533 49194 49114 48721 48366 48030 47546 46927 46455 46454 46896 47401
54120 47401 47681 47838 48000 47972 47589 47173 47104 47114 46630 45812 45527 46074 46662 46542 46097 46308 47519 49259 50904
54101 50904 51933 51846 50575 48951 48093 48201 48518 48568 48846 49975 51705 53215 54073 54453 54589 54553 54536 54860
54083 54860 55545 56169 56365 56214 55968 55635 55093 54447 53966 53694 53417 53005 52562 52206 51985 52102 52941 54574 56396
54064 56396 57538 57708 57461 57558 58177 58828 59016 58847 58903 59612 60896 62434 64003 65445 66555 67321 68108 69229
54046 69229 70450 71322 71999 73175 75132 77372 79458 81669 84440 87562 90505 93262 96355 100062 104096
54031 104096 108029 111760 115606 120153 125809 132181 138043 142326 145045 146969 148639 150138 151632 153444
54017 153444 155533 157371 158555 159243 159911 160915 162279 163615 164277 163898 162782 161428 159781 157327 153942
54002 153942 150210 146837 144067 141721 139498 137137 134570 131975 129567 127462 125881 125089 124740 123748 121431
53987 121431 118549 116440 115345 114441 113335 112464 111959 111324 110620 110838 112379 114089 114645 114227 113949 114150 114230
53970 114230 113897 113609 113764 114115 114177 113809 113273 112953 112959 112934 112461 111743 111488 111891 112234 111778 110601 109194 107791
53951 107791 106625 106263 107015 108362 109628 110919 112659 114549 115841 116591 117806 120298 123980 128371 133158
53936 133158 138168 143337 148848 154797 160690 165707 169527 172472 174870 176716 177913 178332 177636 175680 173193
53921 173193 171501 171383 172586 174505 176826 179408 182093 184908 188035 191420 194817 198314 202335 206981
53907 206981 211859 216744 221853 227145 231881 235297 237372 238542 238979 238532 237149 235016 232419 229714 227224
53892 227224 224970 222663 220115 217438 214689 211685 208326 204742 200879 196352 191046 185522 180471 175984
53878 175984 171760 167733 164074 160768 157660 154813 152338 149924 146965 143250 139192 135323 131831 128655
53864 128655 125756 123162 120861 118685 116280 113326 109935 106732 104331 102788 101710 100811 100113 99746 99763
53849 99763 100069 100283 99785 98226 95961 93701 91779 90066 88555 87591 87389 87668 87962 88074 88016 87710 86925
53832 86925 85471 83390 81124 79534 79454 80951 83154 85071 86504 87949 89665 91166 91746 91346 90630 90234
53816 90234 90150 90033 89956 90485 91876 93533 94621 95058 95483 96332 97483 98881 100914 103810 107144 110445 113954
53799 113954 118120 122549 126175 128609 130685 133512 137451 142232 147477 152674 157057 160144 162266 164158
53785 164158 166119 167936 169453 170743 171758 172253 172211 172000 171998 172252 172569 172697 172424 171704 170727 169643 168252
53768 168252 166260 163817 161505 159782 158710 158150 157821 157177 155727 153620 151472 149506 147399 145178 143552
53753 143552 142905 142515 141438 139812 138542 137906 137201 135807 133900 132021 130498 129496 129121 129143 128948 128089
53737 128089 126669 125008 123171 121104 119085 117712 117296 117343 116765 114789 111813 109234 108237 108791 109940 110910
53721 110910 111594 112138 112567 112941 113465 114198 114946 115611 116379 117367 118353 119229 120461 122634 125527 128029 129181
53704 129181 129152 129057 129958 132059 134708 136967 138311 139061 140211 142594 146073 149729 152951 156052 159527 162971
53688 162971 165352 166359 166905 167984 169501 170647 171068 171202 171620 172588 174197 176431 178956 181192 182780
53673 182780 183818 184629 185408 186073 186308 185797 184617 183322 182487 182278 182594 183338 184260 184800 184606 184100 184068 184688
53655 184688 185392 185655 185461 184971 184304 183761 183766 184229 184323 183226 181026 178781 177774 178623 180785 182894 183855 183699
53637 183699 183168 182710 182323 182175 182622 183468 183986 183911 183762 183841 183599 182540 181171 180382 180357 180859 182286 185540
53619 185540 190718 196548 201344 204259 205646 206575 208066 210450 213346 216298 219270 222336 225196 227416
53605 227416 229056 230683 232818 235677 239313 243625 248260 252907 257681 262829 268049 272544 275875 278447
53591 278447 281017 284042 287610 291673 296052 300415 304434 307935 310823 313024 314615 315879 317080 318244
53577 318244 319302 320386 321858 323914 326209 327987 328701 328478 327881 327393 327294 327829 328960 329933 329744 328296
53561 328296 326629 325613 324959 323966 322711 321733 320894 319520 317647 316245 316059 316923 318388 320231 322079 323328
53545 323328 323895 324448 325398 326242 326492 326685 327722 329585 331421 332673 333425 333842 334102 334810 336664 339542 342627
53528 342627 345633 349249 354082 359802 365754 371796 378094 384529 390940 397594 404840 412551 420512 429123
53514 429123 439018 450039 461315 472484 484200 497206 511467 526503 542061 558053 574290 590706
53502 590706 607581 625161 643345 662126 682027 703524 726223 749169 771967 795091 819072
53491 819072 843858 869073 894465 919890 945104 969732 993314 1015514 1036631 1057819 1080265
53480 1080265 1104033 1128112 1151658 1174751 1197830 1220984 1244154 1267517 1291158 1314590 1337018
53469 1337018 1357937 1377316 1395455 1412929 1430279 1447302 1462964 1476428 1487987 1498600 1508683
53458 1508683 1517811 1525335 1530746 1533624 1533879 1532107 1529136 1525105 1519434 1511767 1502423 1491772 1479718 1466128
53444 1466128 1451384 1436076 1420327 1403752 1385975 1366946 1346827 1325812 1304058 1281665 1258730
53433 1258730 1235465 1212218 1189352 1167147 1145800 1125434 1106103 1087933 1071229 1056301 1043176
53422 1043176 1031565 1021043 1011156 1001514 992162 983841 977560 973773 972143 972143 973590 976517 980891 986666
53408 986666 993897 1002562 1012432 1023294 1035237 1048581 1063613 1080454 1098975 1118766 1139473 1161401
53396 1161401 1185560 1212776 1242788 1274509 1307159 1340950 1376631 1414599 1454592 1496158 1539281
53385 1539281 1584457 1632128 1682048 1733285 1784925 1836775 1889376 1943333 1998626 2054501 2110027
53374 2110027 2164782 2218957 2272831 2326273 2378840 2430157 2479927 2527661 2572692 2614469 2652539
53363 2652539 2686282 2715193 2739613 2760781 2779741 2796334 2809507 2818376 2822614 2822090 2816689 2806606
53351 2806606 2792371 2774385 2752672 2727130 2697754 2664483 2627182 2586030 2541714 2494951 2446073
53340 2446073 2395426 2344051 2293444 2244405 2196390 2148262 2099609 2051144 2003869 1958038 1912970
53329 1912970 1867738 1821987 1776169 1731106 1687340 1644839 1603294 1562653 1523416 1486400 1452187
53318 1452187 1420682 1391228 1363250 1336828 1312512 1290495 1270113 1250294 1230355 1210241 1190207
53307 1190207 1170661 1152325 1136065 1122235 1110356 1099727 1090283 1082642 1077308 1074053 1072137 1071015
53295 1071015 1070771 1071882 1074636 1078814 1083952 1089809 1096502 1104237 1113163 1123521 1135730 1150148 1166819
53282 1166819 1185525 1206022 1228166 1251897 1277068 1303203 1329449 1355062 1380022 1404954 1430267
53271 1430267 1455549 1479903 1502680 1523734 1543195 1561175 1577524 1591681 1602965 1611232 1617133 1621607
53259 1621607 1625289 1628413 1630789 1631605 1629713 1624573 1616757 1607180 1596158 1583554 1569366 1553525 1535449
53246 1535449 1514678 1491818 1468078 1443878 1418685 1392264 1365204 1337969 1310370 1282410 1254839
53235 1254839 1228206 1202007 1175548 1149180 1123813 1099392 1074670 1048670 1021808 995444 970639
53224 970639 947488 925310 903365 881524 860301 840217 821297 803319 786326 770564 756066
53213 756066 742590 729862 717560 705116 691949 678024 663927 650240 636983 623761 610332
53202 610332 596873 583699 570821 558003 545326 533492 523236 514457 506218 497678 488682 479437
53190 479437 470062 460659 451427 442357 433200 423975 415106 406671 397999 388610 379198 370878 363645 356384
53176 356384 348462 340478 333242 326776 320770 315386 310942 307110 303011 298054 292366 286528 281194 276795
53162 276795 273251 270007 266634 263344 260668 258679 256780 254253 250742 246315 241431 236921 233609 231684
53148 231684 230548 229440 228102 226750 225600 224661 223869 223174 222466 221605 220582 219529 218560 217691 216889 216063
53132 216063 215025 213626 211950 210248 208668 207261 206203 205704 205539 205049 203878 202446 201432 200977 200785
53117 200785 200733 200845 200760 199885 198192 196354 194844 193366 191547 189763 188852 189117 190019 190775 190988 190755 190385
53100 190385 190094 189905 189875 190298 191407 192841 193795 193855 193392 192898 192333 191431 190257 189011 187567 185715 183682
53083 183682 181852 180075 177833 175171 172865 171484 170665 169519 167473 164579 161353 158515 156550 155206
53069 155206 153588 151007 147672 144469 142156 140898 140417 140340 140398 140397 140137 139467 138525 137781 137613 137843 137891 137412
53051 137412 136597 135764 134883 133679 132105 130496 129222 128293 127432 126559 126068 126434 127594 128937 129931 130464 130478
53034 130478 129718 128190 126483 125208 124274 123170 121773 120382 119146 117991 117079 116643 116287 115152 113005
53019 113005 110618 108766 107429 106323 105700 106038 107206 108474 109230 109339 108989 108536 108385 108672 109154 109626 110241
53002 110241 111152 112107 112746 113120 113531 113984 114170 113940 113444 112865 112298 111870 111663 111589 111568 111717 112123 112571 112834
52983 112834 113045 113368 113497 112992 112070 111553 111920 112873 113883 114729 115378 115827 116276 117041 118090 118946 119298 119426
52965 119426 119878 120978 122703 124753 126635 128107 129631 131924 134922 137800 140229 142906 146313 149706
52951 149706 152113 153821 155897 158454 160469 161415 162083 163453 165505 167601 169434 171078 172469 173384 173748
52936 173748 173647 173178 172480 171636 170336 168041 164823 161749 160052 160059 161203 162763 164128 164684 164093 162783
52920 162783 161651 161119 160779 160107 159231 158878 159691 161634 163922 165609 166423 166982 167981 169319 170321 170690 170791
52903 170791 170981 171162 171214 171416 172071 172902 173175 172417 170889 169340 168397 168164 168391 168973 170070 171586 172836
52886 172836 173194 172939 172984 173721 174766 175908 177633 180196 182717 183898 183481 182445 181841 181910 182280 182506 182256
52869 182256 181360 179987 178662 177950 178108 178936 179895 180472 180645 180907 181688 182893 184162 185335 186333 186765 186273
52852 186273 185308 185034 186168 188244 190287 191918 193396 194782 195649 195781 195771 196531 198228 200042 201143 201641
52836 201641 202269 203239 203874 203532 202520 201741 201672 202099 202729 203610 204760 205772 206093 205608 204742 203946 203154 201811
52818 201811 199503 196516 193605 191149 188771 185968 182900 180209 178164 176368 174354 172128 169988 168061
52804 168061 166245 164473 162846 161490 160348 159114 157446 155328 153148 151285 149704 148129 146525 145120
52790 145120 143983 142885 141638 140327 139111 138012 136983 136001 134939 133594 131978 130451 129414 128964 128917
52775 128917 128959 128639 127458 125273 122586 120171 118413 117152 116085 115063 113967 112574 110816 109023 107628
52760 107628 106585 105307 103306 100696 97992 95626 93833 92694 91927 90850 89079 87166 85977 85408 84478
52745 84478 82881 81726 82126 83625 84698 84445 83122 81349 79570 78191 77459 77112 76739 76416 76416 76383 75590
52728 75590 74078 72751 72130 71772 71265 71026 71591 72709 73698 74284 74585 74621 74351 73991 73853 73993 74289 74643
52710 74643 74915 74892 74586 74266 74042 73766 73523 73694 74243 74497 74095 73638 73866 74620 75232 75573 76014 76648 77210
52691 77210 77627 77987 78117 77851 77617 78085 79245 80485 81533 82702 84125 85466 86515 87473 88456 89295 90029
52674 90029 90963 91979 92369 91751 90674 89902 89540 89304 89204 89353 89368 88697 87467 86458 86067 85853 85305 84606
52656 84606 84205 83927 83117 81661 80322 79772 79716 79455 79027 79099 79714 79922 78998 77431 76173 75388 74626 73943
52638 73943 73944 74697 75401 75439 75216 75572 76740 78306 79927 81630 83382 84755 85214 84714 83871 83429 83572 83851
52620 83851 83777 83209 82141 80466 78296 76248 74992 74621 74753 75095 75495 75642 75268 74625 74285 74445 74790 75005
52602 75005 74978 74597 73926 73586 74287 75891 77525 78817 80309 82367 84387 85667 86482 87682 89543 91614
52586 91614 93451 94947 96047 96647 96824 96829 96932 97420 98568 100266 101926 103070 103872 104783 105839 106725 107334
52569 107334 107832 108318 108895 109959 111910 114547 117181 119382 121230 122796 123911 124596 125295 126389 127795
52554 127795 129291 130931 132820 134663 135962 136621 137023 137443 137672 137427 136955 136934 137718 138920 139911 140560 141285
52537 141285 142445 143957 145464 146679 147569 148384 149502 150901 151841 151515 150169 149101 149254 150153 150582 149983
52521 149983 148788 147692 147093 147101 147601 148309 149147 150401 152124 153537 153632 152390 150867 149959 149602 149348 149183
52504 149183 149408 149985 150410 150114 148885 147045 145310 144235 143716 143265 142848 143020 144052 145328 145976 145820 145409
52487 145409 145361 146012 147468 149494 151433 152688 153292 153705 154123 154393 154606 155260 156609 158208 159428 160170 160803
52470 160803 161550 162234 162575 162445 161833 160871 159966 159668 160207 161247 162232 162914 163387 163724 163793 163485 162958 162532 162454
52451 162454 162802 163448 164019 164065 163518 162885 162703 162846 162701 162105 161707 162113 162962 163282 162659 161574 160577 159600 158388
52432 158388 157182 156532 156537 156739 156814 156986 157555 158382 159103 159673 160316 161027 161452 161360 161004 160917 161522 162959 164995
52413 164995 166961 168038 167881 166881 165633 164325 162922 161785 161601 162554 163889 164612 164473 164029 163815 163761
52397 163761 163488 162989 162773 163310 164417 165327 165403 164749 164113 164244 165352 167020 168456 168999 168680 168347 168897 170251
52379 170251 171363 171494 171202 171664 173202 174914 175843 176003 176083 176571 177552 179044 181055 183335 185520 187557
52363 187557 189682 191955 194183 196354 198771 201563 204347 206685 208641 210677 213183 216310 219958 223643
52349 223643 226606 228548 230122 232250 235018 237740 240085 242524 245461 248521 251063 253061 255005 257194
52335 257194 259499 261667 263514 264977 266321 268106 270532 272924 274343 274749 275129 276416 278654 281379 284407
52320 284407 287947 292122 296667 301084 304944 308179 311230 314877 319760 325985 333146 340665 348156 355597
52306 355597 363264 371455 380332 390035 400740 412394 424493 436461 448273 460417 473188 486333
52294 486333 499557 513070 527356 542544 558209 573669 588384 602311 616056 630433 645594
52283 645594 660752 675090 688758 702569 716768 730564 742959 753700 763231 772126 780790 789426
52271 789426 797851 805382 811215 815085 817531 819504 821698 824148 826319 827652 828091 828088 828101 828207 828338 828678
52255 828678 829573 830982 832254 832654 832121 831425 831554 832978 835524 838845 842833 847498 852671 858141 864120
52240 864120 871232 879855 889644 899951 910531 921557 933045 944647 956054 967258 978331 989214
52228 989214 999890 1010468 1020864 1030579 1039034 1046006 1051609 1056051 1059655 1062896 1066024 1068705 1070420
52215 1070420 1071196 1071488 1071256 1069654 1066013 1060893 1055702 1051330 1047380 1042786 1036894 1029842 1022117 1014097 1006115
52200 1006115 998713 992477 987499 983244 979193 975508 972790 971293 970708 970707 971232 972107 972821 973057 973139 973558 974260
52183 974260 974809 975089 975335 975476 975019 973784 972331 971331 970783 970173 969191 967922 966411 964424 961793 958763
52167 958763 955819 953250 950935 948498 945568 941986 937905 933684 929594 925590 921453 917165 912999 909161
52153 909161 905504 901769 898040 894687 891894 889449 887046 884488 881485 877605 872719 867385 862445 858320
52139 858320 854813 851509 848108 844492 840762 837139 833612 829774 825329 820658 816455 812789 808984 804554
52125 804554 799782 795151 790659 786066 781463 777136 773064 769052 765278 762279 760378 759471 759362 759959 761108
52110 761108 762630 764654 767563 771461 775998 780962 786714 793753 802078 811350 821603 833335 846825
52097 846825 861708 877418 893806 911086 929327 948291 967748 987687 1008100 1028781 1049465
52086 1049465 1069990 1090107 1109274 1126958 1143186 1158503 1173296 1187397 1200432 1212235 1222614
52075 1222614 1231068 1237212 1241425 1244587 1247124 1248735 1249133 1248488 1246838 1243652 1238587 1232424 1226531 1221412
52061 1221412 1216392 1210800 1204854 1199069 1193338 1187182 1180687 1174644 1169743 1166020 1163177 1161066 1159698 1158983
52047 1158983 1158709 1158760 1159210 1160164 1161519 1162954 1164222 1165478 1167206 1169783 1173141 1176918 1180764 1184411 1187578
52032 1187578 1190042 1191794 1192995 1193761 1194146 1194286 1194415 1194625 1194614 1193739 1191458 1187923 1184069 1180734 1177594 1173386
52016 1173386 1167449 1160626 1154176 1148162 1141571 1133758 1124913 1115122 1103904 1091108 1077514 1063937 1050118
52003 1050118 1035027 1017986 999082 978832 957913 936971 916154 894942 872789 849778 826340
51992 826340 802656 778804 755196 732218 709560 686510 662916 639316 616138 593375 571093
51981 571093 549669 529343 509971 491385 473608 456587 440174 424553 410211 397293 385345
51970 385345 373917 363012 352784 343171 334103 325597 317438 309202 300967 293572 287642 282658 277564
51957 277564 272132 267209 263540 260833 258158 254948 251438 248190 245411 242786 239984 237099 234416 231838
51943 231838 228938 225602 222263 219358 216843 214364 211645 208637 205646 203374 202319 201942 200953 198752 196091
51928 196091 193960 192365 190756 189146 188027 187477 187118 186821 186747 186697 186142 184959 183503 181911 179905 177447
51912 177447 175064 173255 172019 171096 170264 169273 167912 166327 164934 163878 162917 161891 160854 159674 158038
51897 158038 156082 154493 153675 153190 152344 151007 149561 148368 147559 147062 146498 145349 143509 141509 139920 138754
51881 138754 137649 136380 134976 133625 132697 132575 133204 134049 134726 135294 135714 135561 134767 134228 134990 137002 139194
51864 139194 140710 141575 142279 143247 144634 146165 147192 147392 147354 147962 149250 150445 151185 152015 153440 155152
51848 155152 156495 157274 157632 157556 156970 156155 155610 155525 155708 155989 156423 157059 157751 158295 158603 158713 158644 158413 158222
51829 158222 158533 159715 161542 163285 164468 165324 166311 167424 168389 169271 170399 171706 172683 173013 172794 172107
51813 172107 171004 170013 169982 170974 171897 171717 170618 169454 168536 167633 166864 166751 167364 168110 168529 168793 169263 169955
51795 169955 170584 170771 170142 168664 167032 166278 166703 167530 167888 167803 167903 168434 169085 169665 170397 171419 172386 172889
51777 172889 173064 173427 174148 174829 175164 175545 176646 178436 179998 180436 179714 178565 177870 178308 180140 182899 185559
51760 185559 187488 189099 191138 193610 196047 198605 202014 206299 210448 213765 216762 220107 223432 226013
51746 226013 228134 230758 233987 236817 238502 239299 239648 239426 238476 237268 236458 236159 236138 236450 237356 238790 240385
51729 240385 242016 243900 246105 248280 249943 250934 251555 252419 253994 256110 258017 259158 259762 260394 261103 261382
51713 261382 260938 259998 258800 257232 255220 253066 251112 249391 247894 246749 245725 243913 240618 236491 233077
51698 233077 231121 229883 228395 226763 225763 225614 225774 225764 225674 225894 226817 228782 231764 235036 237601 239201
51682 239201 240630 242893 246316 250518 254816 258382 260450 260832 260128 259147 258284 257647 257446 257744 258024 257589
51666 257589 256531 255862 256525 258490 260960 263219 265145 267069 269248 271386 272654 272350 270456 267345 263122
51651 263122 257670 251343 245041 239335 233994 228643 223504 219046 215189 211375 207323 203235 199354 195751
51637 195751 192614 190312 188959 188220 187682 187223 186870 186545 186140 185695 185298 184842 184060 182792 181165 179509 178085
51620 178085 176895 175763 174632 173734 173390 173652 174227 174681 174714 174335 173913 174005 174934 176496 178187 179628 180731
51603 180731 181570 182327 183316 184749 186470 188090 189448 190710 192052 193488 195045 196854 199016 201598 204780
51588 204780 208616 212625 216022 218610 221034 223845 226738 229114 231020 232938 234846 236168 236646 236642 236436
51573 236436 235801 234479 232624 230492 228183 225972 224443 223782 223264 222014 220215 219042 219378 220978 222963
51558 222963 224768 226425 228267 230526 233109 235629 237748 239594 241641 244167 246949 249571 251844 253871
51544 253871 255802 257617 258999 259414 258578 256937 255406 254440 253652 252665 252044 252848 255286 258320 260750 262253
51528 262253 263154 263630 263656 263449 263399 263487 263218 262344 261296 260640 260273 259488 257790 255402 252967 250926 249262 247668
51510 247668 245835 243630 241133 238503 235788 232918 229987 227460 225991 225881 226764 227857 228526 228580 228122 227288
51494 227288 226174 224847 223327 221689 220336 219978 220971 222680 223897 224051 223734 223874 224756 226138 227951 230292
51478 230292 232854 235039 236767 238701 241445 244906 248669 252584 256662 260757 264794 268992 273420 277530
51464 277530 280657 282935 285164 287759 290322 292321 293770 295013 296206 297223 297847 297856 297232 296403 296082 296654
51448 296654 297902 299375 300712 301543 301517 300799 300206 300388 300990 300985 299773 297682 295399 293277 291210 288985 286596
51431 286596 284210 281819 279007 275287 270787 266320 262596 259611 256989 254587 252406 250212 247758 245299
51417 245299 243398 242238 241514 240980 240643 240402 240083 240012 241026 243475 246485 248643 249382 249375 249638 250475 251388 251764
51399 251764 251461 250715 249712 248470 247079 245678 244097 241799 238444 234227 229428 223971 217964 212354 208322
51384 208322 205913 203882 201062 197434 193711 190429 187736 185599 183763 181817 179626 177509 175762 174241
51370 174241 172616 170774 168744 166527 164217 162014 159856 157396 154566 151783 149317 146888 144340 142283
51356 142283 141435 141546 141604 141066 140330 140053 140494 141548 142893 144014 144438 144084 143195 142017 140881 140406 141115
51339 141115 142791 144661 146242 147561 148531 148737 148123 147478 147858 149637 152245 154628 155962 156283 156560 157829
51323 157829 160066 162237 163602 164631 166377 169245 172652 175718 177932 179250 179798 179556 178365 176335 174137
51308 174137 172478 171181 169177 165693 161180 156807 153267 150416 147854 145426 143196 141240 139527 137894
51294 137894 136143 134305 132646 131273 129900 128262 126635 125574 125227 125203 125130 125062 125226 125622 125996 126071 125727
51277 125727 125088 124522 124419 124830 125363 125483 124929 123935 123120 123080 123885 124968 125651 125812 125841 125947 125846 125344 124925
51258 124925 125337 126622 127965 128650 128838 129123 129607 129804 129409 128762 128437 128608 128994 129208 129035 128536 128014 127763
51240 127763 127717 127445 126640 125499 124535 124165 124582 125740 127226 128364 128773 128698 128503 128025 126872 125274 124161
51223 124161 124261 125441 127016 128419 129488 130470 131802 133634 135488 136679 137124 137281 137286 136697 135372 134026
51207 134026 133456 133583 133827 134111 134853 136091 137240 137830 137998 138125 138424 138994 139798 140393 140109 138878 137575
51190 137575 137135 137496 137803 137539 136909 136140 135056 133735 133005 133602 134954 135577 134807 133520 132814 132570 131906
51173 131906 130600 129285 128356 127500 126446 125520 125076 124918 124657 124311 124125 124029 123686 122963 122056 121175 120302 119208
51155 119208 117641 115645 113786 112816 112925 113578 114234 114934 115901 116919 117557 117849 118268 119037 119894 120558 121092
51138 121092 121650 122106 122152 121723 121268 121546 123005 125203 126940 127158 125701 123244 120664 118618 117490 117379
51122 117379 118108 119365 120760 121735 121724 120688 119314 118428 118312 118757 119488 120185 120379 119846 119064 118821 119342 120133
51104 120133 120695 121033 121472 122297 123592 125138 126492 127534 128859 131134 134024 136237 136852 136210 135357 134980
51088 134980 135118 135512 135909 136250 136822 138062 140019 142221 144162 145630 146395 146072 144677 143045 142159 142229 142789
51071 142789 143507 144441 145551 146532 147209 147713 148139 148416 148647 149196 150163 151154 151826 152351 152935 153216 152730 151870
51053 151870 151701 152689 154236 155702 157281 159292 161169 161985 161811 161757 162541 163755 164738 165480 166259 167009 167617
51036 167617 168461 169991 171911 173273 173362 172200 170385 168779 168085 168309 168769 168987 169306 170149 171032 171051 170254
51019 170254 169714 170121 170977 171441 171318 170940 170634 170665 171308 172571 174154 175927 178066 180496 182710 184541 186685
51002 186685 189922 194086 198309 202079 205528 208834 211968 215167 219107 224298 230497 237021 243570 250580
50988 250580 258699 268033 277993 287889 297535 307197 317178 327744 339296 352205 366473 381931 398816
50975 398816 417714 438899 462267 488086 517250 550369 587074 626616 668671 713062 759193
50964 759193 806620 855992 908535 964401 1022141 1079952 1136827 1192217 1245210 1294690 1340125
50953 1340125 1381649 1419296 1452519 1480675 1503870 1523079 1539368 1553173 1564551 1574007 1582627 1591253
50941 1591253 1599996 1608828 1618263 1628796 1639836 1649824 1657468 1662299 1663805 1660530 1650561 1632763 1607354
50928 1607354 1575417 1538051 1495827 1448703 1396437 1339229 1278051 1214390 1149728 1085233 1021781
50917 1021781 960208 901550 846952 797105 751791 710258 672152 637833 607674 581351 558115
50906 558115 537556 519717 504559 491644 480413 470532 461935 454763 449311 445710 443486 441781 440246
50893 440246 439474 440090 441520 442178 441100 438991 437393 437124 437917 439381 441681 445123 449501 454258 459179
50878 459179 464617 470995 478292 486122 494289 503046 512703 523073 533651 544472 556481 570808 587837
50865 587837 607289 628920 652630 678060 704842 733510 765612 802550 844697 891938 944580
50854 944580 1003216 1068127 1139436 1217651 1303382 1396484 1496069 1601507 1712908 1830357 1952998
50843 1952998 2079066 2206551 2333571 2458242 2578410 2691565 2795084 2886805 2965463 3030601
50833 3030601 3082259 3121060 3148546 3166993 3178652 3185405 3189245 3192786 3198920 3209968 3227256 3251243
50821 3251243 3281575 3316744 3353842 3388919 3417770 3436466 3441402 3429387 3398243 3347383 3277484
50810 3277484 3189454 3083982 2962246 2826724 2681010 2529042 2374671 2221519 2072524 1929611
50800 1929611 1794218 1668026 1552655 1448606 1355155 1271529 1197685 1133673 1078775 1031826
50790 1031826 992070 959256 933069 912916 898099 887740 880604 875504 871915 869762 868510 866952
50778 866952 864182 860330 855959 850970 844617 836551 827336 817750 807892 797248 785440 772630 759340
50765 759340 746183 733807 722797 713439 705622 698953 692921 687116 681629 677317 675364 676390 680129
50752 680129 686063 694105 704447 717047 731598 747916 766091 786294 808713 833544 860809 890200
50740 890200 921476 955036 991899 1033028 1078842 1129343 1184493 1244394 1309238 1379081 1453479
50729 1453479 1531393 1611547 1692743 1773583 1852139 1926354 1994795 2056573 2110435 2154421 2186732
50718 2186732 2206724 2214950 2212568 2201019 2182080 2157888 2130859 2103590 2078630 2058117 2043531 2035648
50706 2035648 2034477 2039238 2048746 2061923 2077717 2094431 2109430 2119661 2122260 2114622 2094431 2060104
50694 2060104 2011241 1948585 1873908 1790106 1700895 1609804 1519368 1431380 1347567 1269593 1198547
50683 1198547 1134823 1078419 1029031 986018 948768 917112 891062 870289 854375 843591 838816
50672 838816 840368 847285 858088 871932 888679 908069 929259 951220 973275 995099 1016313 1036254
50660 1036254 1054287 1070355 1085099 1099287 1113208 1126739 1139811 1152446 1164406 1175389 1185829
50649 1185829 1197148 1210762 1226949 1244992 1264239 1284754 1307035 1331502 1358289 1387204 1417847
50638 1417847 1450066 1484321 1521198 1560343 1600162 1638789 1675104 1708608 1738710 1764701 1786328
50627 1786328 1803873 1817458 1826669 1831100 1831096 1827821 1822769 1817339 1812682 1809646 1808915 1811269 1817542 1828115
50613 1828115 1842463 1859383 1877644 1896302 1914477 1931054 1944703 1954148 1958456 1957178 1950229 1937551
50601 1937551 1918855 1893701 1861783 1823118 1778028 1726985 1670418 1608734 1542767 1474280 1405717
50590 1405717 1339150 1275528 1215071 1158106 1105159 1056367 1011304 969561 931241 896717 866041
50579 866041 838727 814099 791898 772576 756845 744814 735719 728622 723143 719284 716925 716039 717209
50566 717209 721245 728159 737136 747687 760258 775394 792849 811943 832398 854218 877059 900400
50554 900400 924448 950354 979240 1011227 1045601 1081796 1119897 1160069 1201666 1243247 1283639
50543 1283639 1322740 1361036 1398626 1435169 1470770 1506396 1543307 1582487 1624613 1670006 1718328
50532 1718328 1768826 1821259 1876222 1934274 1995182 2058465 2124276 2193185 2265305 2340083 2416701
50521 2416701 2494138 2571085 2646394 2719562 2790148 2856660 2916501 2967070 3006571 3033896 3048412
50510 3048412 3050053 3039122 3015649 2979329 2930321 2869864 2799967 2722903 2641284 2558248 2477080
50499 2477080 2400612 2331129 2270669 2221047 2183488 2158291 2144855 2142024 2148553 2163293 2184903 2211343
50487 2211343 2239827 2267293 2290797 2307418 2314098 2307924 2286772 2249762 2197253 2130608 2052052 1964560
50475 1964560 1871486 1775835 1679756 1584833 1492746 1405313 1323771 1248436 1179300 1116613 1060582
50464 1060582 1010852 966794 928135 894773 866139 841332 819956 802280 788489 778215 770892
50453 770892 766114 763497 762697 763779 767204 773176 781330 791206 802641 815489 829404 844239 860294
50440 860294 877816 896590 916392 937559 960635 985611 1011915 1039060 1066976 1095802 1125644
50429 1125644 1156448 1187831 1219146 1249959 1280354 1310529 1340338 1369516 1398161 1426616 1455049
50418 1455049 1483588 1512731 1543067 1574653 1607141 1640582 1675578 1712499 1751011 1790464 1830365
50407 1830365 1870199 1909230 1946770 1982351 2015409 2045088 2070643 2091699 2107731 2117581 2119940 2114279
50395 2114279 2100882 2080021 2051466 2014814 1969964 1917180 1857019 1790444 1718977 1644681 1569965
50384 1569965 1497194 1428216 1364231 1306217 1255285 1212284 1177242 1149657 1129428 1116987 1112384
50373 1112384 1114687 1122561 1134971 1150842 1168431 1185585 1200540 1211948 1218261 1217746 1209315 1193024
50361 1193024 1169762 1140868 1108018 1072824 1036225 998613 960741 923964 889298 856706 825813
50350 825813 796912 770670 747138 725757 706260 688877 673592 659874 647421 636650 628002 621130
50338 621130 615218 609931 605638 602725 601079 600396 600743 602532 606004 611000 617385 625468 635665 647755
50324 647755 660832 674095 687465 701229 715454 730004 744893 760254 776218 793172 811853
50313 811853 832604 854664 876758 898304 919489 940277 960211 979314 998269 1017247 1035230
50302 1035230 1051111 1064949 1077480 1088819 1098335 1105564 1110523 1113248 1113707 1112251 1109558 1105991 1101379
50289 1101379 1095465 1088115 1079075 1068025 1055002 1040361 1024222 1006429 987286 967788 948743 930004
50277 930004 910984 891678 872691 854348 836243 817805 799034 780569 763208 747389 733021
50266 733021 719758 707539 696879 688457 682351 677817 673979 670698 668649 668523 670274 673226 676787 680858
50252 680858 685485 690358 694916 698925 702659 706425 710086 713289 715978 718379 720429 721583 721376 720010
50238 720010 718112 715946 713153 709271 704274 698552 692580 686721 681070 675319 668985 662091 655500 650250
50224 650250 646554 643746 641207 639051 637827 637839 638908 640607 642624 645107 648705 654028 660914 668467 675966
50209 675966 683403 690939 698175 704351 709074 712427 714472 715083 714256 712174 708878 704236 698367 691778 684837
50194 684837 677306 668611 658512 647386 635997 625075 614974 605568 596481 587486 578633 570025 561644
50181 561644 553442 545425 537596 530013 523019 517137 512553 508836 505431 502347 500095 499078 499268 500345
50167 500345 501808 502994 503439 503349 503275 503086 501688 498166 492929 487249 481803 476234 470162 464033 458690 454449
50151 454449 450913 447481 443811 439993 436515 433912 432224 430884 429317 427429 425357 423029 420355 417641
50137 417641 415439 414045 413489 413845 415101 416763 418173 419331 420942 423465 426597 429949 433862 439044 445574
50122 445574 452632 459230 465019 470399 476000 481979 487841 493015 497548 501949 506321 510062 512609 514191
50108 514191 515587 517378 519707 522499 525582 528706 531741 534777 537826 540601 542852 544806 546965 549590
50094 549590 552665 556242 560466 565354 570887 577285 584762 592906 600704 607466 613531 619827 626842 634193
50080 634193 641218 647772 654315 661292 668635 676026 683432 691152 699387 708107 717322 727037 736859 746151
50066 746151 754900 764037 774472 786129 798290 810540 822827 834888 846373 857550 869257 881959
50054 881959 895370 909098 923148 937539 951863 965598 978601 991065 1003186 1015108 1027007
50043 1027007 1038944 1050703 1061962 1072672 1083277 1094628 1107596 1122561 1139279 1157457 1177393
50032 1177393 1199744 1224639 1251408 1279271 1307908 1337015 1365518 1391588 1413534 1430592 1442999
50021 1442999 1451577 1457361 1461508 1465217 1469411 1474367 1479808 1485432 1491094 1496305 1499779 1499762 1494710 1483498
50007 1483498 1465396 1440335 1409077 1372743 1332280 1288780 1243991 1199797 1157114 1115829 1075782
49996 1075782 1037230 1000396 965367 932636 902984 876427 851859 828136 805021 782716 761120
49985 761120 740112 720094 701607 684684 669049 654634 641439 629140 617461 606775 597805 590777
49973 590777 585213 580423 575908 571544 567713 564997 563346 561856 559815 557617 556038 554951 553477 551267
49959 551267 548785 546331 543544 540077 536065 531737 527164 522708 519183 517134 516250 515756 515093 514088 512852
49944 512852 511798 511458 512005 513147 514596 516397 518693 521532 525101 529771 535654 542434 549903 558334 568020
49929 568020 578727 590089 602392 616535 633219 652477 674002 697690 723879 753323 786982
49918 786982 825627 869457 918104 970973 1027524 1087242 1149366 1212612 1275167 1335079 1390779
49907 1390779 1441278 1486048 1525079 1559126 1589534 1617481 1643494 1667786 1690750 1712712 1733241
49896 1733241 1750993 1764167 1770849 1769119 1757472 1735571 1704354 1665153 1618909 1566487 1509506 1450254
49884 1450254 1390572 1331061 1271556 1212147 1153573 1096815 1042639 991479 943428 898272 855788
49873 855788 816114 779684 746734 717040 690168 665731 643351 622710 603941 587609 573964
49862 573964 562338 551668 541537 532306 524243 516900 509509 501760 494066 487175 481517 476739 471922
49849 471922 466480 460801 455770 451708 448082 444194 439715 434596 429028 423720 419645 417056 415031 412457
49835 412457 409292 406464 404641 403501 402299 400800 399491 398977 399249 399600 399327 398469 397675 397361 397394 397745 398994
49818 398994 401709 405533 409400 412739 416132 420674 426917 434501 442558 450368 457751 464963 472331 480156
49804 480156 489021 499874 513418 529534 547576 567210 588656 612209 637940 665942 696521 729953
49792 729953 766290 805450 847149 890525 934051 976016 1014885 1049156 1077315 1098526 1113352
49781 1113352 1123493 1130745 1136355 1141191 1146010 1151297 1157010 1162611 1167143 1169053 1166116 1156016 1137351
49768 1137351 1110094 1075164 1033784 987417 937981 887578 837809 789654 744058 702240 665047
49757 665047 632297 603177 577198 554404 534798 518091 504034 492511 483039 474659 466593 458825
49745 458825 451806 445870 441139 437599 434902 432333 429415 426451 424154 422864 422433 422729 423768 425410 427295
49730 427295 429167 430926 432376 433275 433619 433541 433012 432083 431363 431594 432513 432750 431272 428518 425721 423534 421788
49713 421788 420260 419027 418148 417491 416924 416346 415639 414931 414715 415290 416264 417141 418229 420286 423224 425909 427447
49696 427447 428006 428132 427975 427696 427966 429345 431505 433744 435976 438495 440942 442345 442350 441716 441365 441494 441919
49679 441919 442793 444429 446645 448761 450236 451029 451388 451537 451716 452310 453757 456184 459181 462104 464700 467268
49663 467268 470057 472704 474621 475832 476997 478553 480296 481981 483840 486106 488361 489932 490818 491726 493111
49648 493111 494616 495660 496291 497132 498574 500261 501442 501767 501699 502139 503639 506042 508816 511573 514152 516404
49632 516404 518211 519716 521286 523139 525144 527075 528969 531137 533908 537337 541106 544742 548075 551529
49618 551529 555779 561051 566924 572865 578706 584437 589811 594478 598558 602765 607926 614458 622256 630901
49604 630901 639948 649230 658976 669534 680959 693005 705520 718612 732352 746525 760874 775423
49592 775423 790359 805696 821326 837379 854295 872425 891641 911477 931604 952157 973560
49581 973560 996065 1019525 1043701 1068774 1095322 1123645 1153239 1183163 1212935 1242903 1273676
49570 1273676 1305313 1337147 1368406 1399018 1429709 1461180 1493145 1524407 1554046 1582365 1610424
49559 1610424 1638762 1666817 1693559 1718390 1741388 1762889 1782928 1801012 1816501 1829337 1840196
49548 1840196 1849670 1857507 1863080 1866425 1868241 1868948 1868479 1867163 1865991 1865475 1864822 1862868 1859479 1855523 1851849
49533 1851849 1848976 1847422 1847490 1848697 1850224 1852066 1855095 1859802 1865667 1872148 1879696 1889183 1900595 1912890
49519 1912890 1925166 1937534 1950715 1965005 1979915 1994777 2009504 2024500 2039764 2054337 2066784
49508 2066784 2076093 2081905 2084143 2082850 2078327 2070988 2060919 2047889 2031877 2013337 1992824 1970614
49496 1970614 1946718 1921027 1893338 1863525 1831878 1799100 1765900 1732690 1699647 1666771 1633866
49485 1633866 1600790 1567816 1535472 1503904 1472697 1441423 1410151 1379321 1349459 1321136 1294798
49474 1294798 1270383 1247288 1224881 1202888 1181226 1159837 1138860 1118712 1099769 1082199 1066170
49463 1066170 1051855 1039049 1027125 1015611 1004506 993951 984008 974943 967173 960533 954107 947247
49451 947247 940403 934496 929813 926039 922999 920758 919170 917967 917204 917086 917383 917454 916834 915558 914168 913742
49435 913742 915467 919538 924756 929916 935351 942398 951547 962062 973369 985909 1000530 1017990 1039174
49422 1039174 1064520 1092376 1118632 1138809 1150462 1153591 1149785 1141822 1133250 1126982 1123923 1123452 1125084
49409 1125084 1129099 1135728 1144533 1154837 1166252 1178556 1191407 1204492 1217823 1231644 1246103 1261061
49397 1261061 1276199 1291298 1306416 1321748 1337387 1353330 1369607 1386089 1402132 1416865 1430072
49386 1430072 1442508 1455046 1467812 1480475 1493071 1506017 1519353 1532523 1545057 1557207 1569714
49375 1569714 1583165 1597651 1612970 1628979 1645728 1663263 1681382 1699795 1718493 1737792 1757901
49364 1757901 1778706 1800096 1822255 1845400 1869422 1894018 1919050 1944593 1970834 1998119 2026881
49353 2026881 2057165 2088432 2120165 2152534 2186088 2220966 2256848 2293630 2331580 2370760 2410845
49342 2410845 2451739 2493903 2537695 2582727 2628240 2673914 2719963 2766533 2813487 2860736 2908373
49331 2908373 2956287 3003934 3050699 3096268 3140509 3183208 3224279 3264018 3302679 3339726 3374023
49320 3374023 3404970 3433035 3458781 3481757 3500996 3516369 3528728 3538697 3546107 3550849 3553494 3554477
49308 3554477 3553306 3549340 3543085 3535967 3528908 3521760 3514179 3506415 3499072 3492610 3487312 3483308 3480356 3477890
49294 3477890 3475606 3473808 3472933 3472970 3473610 3474879 3477334 3481549 3487546 3494815 3502862 3511642 3521361 3531829 3542149
49279 3542149 3551210 3558459 3564126 3568826 3573046 3576755 3579152 3578860 3574797 3567025 3556512 3543955 3529014
49266 3529014 3510781 3488744 3463104 3434367 3402914 3369029 3333138 3295822 3257526 3218369 3178435
49255 3178435 3138201 3098271 3058573 3018198 2976536 2934372 2893419 2854810 2818443 2783681 2750081
49244 2750081 2717325 2685091 2653445 2622997 2594238 2566858 2540017 2513182 2486487 2460457 2435605
49233 2435605 2412132 2389781 2368030 2346609 2325690 2305503 2285976 2266979 2248668 2231353 2215174
49222 2215174 2200242 2186918 2175611 2166326 2158701 2152418 2147308 2143049 2139202 2135602 2132488 2130132 2128553
49209 2128553 2127697 2127614 2128316 2129626 2131399 2133749 2136957 2141210 2146546 2152932 2160201 2167966 2175837 2183793 2192198
49194 2192198 2201400 2211466 2222406 2234459 2247901 2262567 2277779 2292874 2307687 2322453 2337407
49183 2337407 2352676 2368507 2385325 2403420 2422674 2442741 2463449 2484928 2507242 2530036 2552800
49172 2552800 2575556 2598961 2623347 2647799 2670644 2690943 2709130 2726127 2742417 2758351 2774745
49161 2774745 2792457 2811607 2831812 2853027 2875453 2898778 2922338 2946199 2971301 2998208 3026278
49150 3026278 3054452 3082360 3110334 3138860 3168379 3199080 3230278 3260300 3287554 3311617 3333136
49139 3333136 3353029 3372166 3391265 3410455 3429087 3446498 3462794 3478517 3493931 3509131 3524405
49128 3524405 3539736 3554245 3566970 3578111 3588638 3598754 3607693 3615165 3622024 3629081 3636078 3642358
49116 3642358 3647901 3653102 3658042 3662558 3666681 3670491 3673922 3677245 3681404 3687308 3694904 3703436 3712374 3721597
49102 3721597 3730929 3740168 3749520 3759354 3769267 3777937 3784239 3788371 3791686 3795501 3800034 3804343 3807286 3808672
49088 3808672 3809506 3811026 3813682 3817212 3821376 3826075 3830834 3834819 3837738 3840369 3843820 3848352 3853176 3857377
49074 3857377 3860823 3864092 3867627 3871073 3873544 3874538 3874412 3873811 3872748 3870524 3866464 3860444 3852697 3843431 3832779
49059 3832779 3820813 3807338 3791860 3774035 3754095 3732730 3710597 3688005 3664919 3641094 3616357
49048 3616357 3590899 3565108 3538996 3512066 3484159 3456209 3429649 3405018 3381580 3358405 3335326
49037 3335326 3312688 3290741 3269770 3250414 3233175 3217687 3203027 3188825 3175663 3164315 3155024
49026 3155024 3147630 3141920 3137632 3134451 3132272 3131181 3131024 3131424 3132519 3135169 3139884 3145856 3151735 3157179
49012 3157179 3162922 3169333 3175660 3180963 3185097 3188426 3191148 3193401 3195527 3197544 3198612 3197710 3194814 3190817
48998 3190817 3186228 3180542 3173114 3164158 3154480 3144526 3134052 3122653 3110230 3096976 3083162 3069007
48986 3069007 3054604 3039865 3024539 3008319 2990941 2972305 2952559 2931990 2910781 2888972 2866753
48975 2866753 2844654 2823171 2802276 2781553 2760819 2740350 2720440 2701099 2682381 2664628 2648011
48964 2648011 2632076 2616282 2600882 2586746 2574229 2562750 2551749 2541619 2533351 2527565 2524233 2523001
48952 2523001 2523338 2524586 2526359 2528865 2532550 2537551 2543905 2552073 2562631 2575376 2589332 2603809 2619008
48939 2619008 2635342 2652639 2670336 2688157 2706253 2724919 2744497 2765377 2787827 2811826 2837142
48928 2837142 2863375 2889892 2916085 2941978 2968369 2996126 3025529 3056459 3088863 3122738 3157900
48917 3157900 3194231 3231920 3271091 3311378 3352362 3394423 3438627 3485655 3535219 3586666 3639862
48906 3639862 3695256 3753230 3813554 3875459 3938240 4001846 4066755 4133175 4200505 4267766 4334408
48895 4334408 4400404 4465720 4530067 4593150 4654767 4714569 4772041 4826843 4878938 4928319 4974825
48884 4974825 5018253 5058296 5094289 5125344 5151010 5171658 5188008 5200402 5208619 5212265 5211195 5205680
48872 5205680 5196265 5183352 5166828 5146226 5121328 5092528 5060561 5026016 4989163 4950115 4909061
48861 4909061 4866354 4822350 4777066 4730083 4681024 4630134 4578155 4525640 4472698 4419460 4366440
48850 4366440 4314174 4262723 4211815 4161346 4111554 4062797 4015329 3969246 3924454 3880789 3838301
48839 3838301 3797372 3758437 3721615 3686707 3653504 3622055 3592724 3566065 3542523 3522096 3504278
48828 3504278 3488335 3473667 3460098 3448073 3438484 3431992 3428471 3427409 3428832 3433378 3441341 3452183 3465245
48815 3465245 3480476 3497953 3517121 3537228 3558397 3581596 3607417 3635420 3664777 3695055 3726116
48804 3726116 3757721 3789628 3821844 3854378 3886912 3919024 3950690 3982259 4013952 4045616 4076983
48793 4076983 4107937 4138416 4168244 4197203 4225235 4252471 4279113 4305347 4331314 4357040 4382351
48782 4382351 4406993 4430992 4454873 4479359 4504734 4530500 4555757 4579993 4603442 4626590 4649298
48771 4649298 4670607 4689595 4706333 4721617 4735619 4747200 4754867 4758145 4757540 4753351 4745106 4732241
48759 4732241 4714738 4692846 4666696 4636567 4603163 4567157 4528721 4487861 4444963 4400564 4354775
48748 4354775 4307495 4259096 4210402 4162004 4114014 4066529 4019856 3974218 3929744 3886947 3846770
48737 3846770 3809917 3776428 3746050 3718682 3694260 3672675 3654151 3639338 3628622 3621562 3617409 3615939
48725 3615939 3617371 3621669 3628488 3637689 3649295 3662858 3677410 3692321 3707729 3723858 3740341 3756725
48713 3756725 3773483 3791910 3812928 3836194 3860446 3884493 3907864 3930845 3954074 3977952 4002250
48702 4002250 4026345 4049898 4073231 4096923 4121249 4146169 4171728 4198199 4225802 4254551 4284461
48691 4284461 4315722 4348517 4382786 4418323 4455048 4493029 4532249 4572382 4612823 4652873 4692024
48680 4692024 4730189 4767579 4804222 4839652 4873212 4904604 4933900 4960959 4985101 5005535 5022009
48669 5022009 5034856 5044488 5050994 5054159 5053595 5048794 5039287 5024945 5006070 4982988 4955649 4923797 4887532
48656 4887532 4847442 4804075 4757516 4707721 4655149 4600741 4545257 4488872 4431546 4373467 4314955
48645 4314955 4256108 4196931 4137785 4079346 4021984 3965379 3908926 3852348 3795694 3739049 3682636
48634 3682636 3627207 3573738 3522452 3472423 3422554 3372771 3323941 3276783 3231324 3187324 3144587
48623 3144587 3102750 3061384 3020671 2981492 2944403 2908884 2873996 2839433 2805361 2771667 2738153
48612 2738153 2705321 2674096 2644654 2616289 2588609 2562133 2537383 2514034 2491397 2469237 2447759
48601 2447759 2427257 2408186 2391090 2375967 2362114 2349018 2336901 2325903 2315342 2304578 2294195
48590 2294195 2285432 2278606 2273029 2268368 2265110 2263478 2262825 2262553 2262957 2264677 2267765 2271758 2276279 2281176 2286309
$$ [...]
##END NTUPLES=NMR SPECTRUM
##END=
