
##TITLE=AC1307_DOMAH11119_6534107_NLFMx5iIHR
##JCAMPDX= 6.0         $$ Bruker NMR JCAMP-DX V2.0
##DATA TYPE= NMR SPECTRUM
##DATA CLASS= NTUPLES
##ORIGIN= BRUKER
##OWNER= Administrator
$$ 1.72 TOPSPIN		Version 2.1
$$ 2012-07-18 03:25:50.015 -0500  Administrator@TOPSPIN
$$ Compression mode = diff/dup
##.OBSERVE FREQUENCY= 400.02188249412
##.OBSERVE NUCLEUS= ^1H
##.ACQUISITION MODE= SIMULTANEOUS (DQD)
##.ACQUISITION SCHEME= undefined
##.AVERAGES= 8
##.DIGITISER RES= 22
##SPECTROMETER/DATA SYSTEM= spect
##.PULSE SEQUENCE= zg30
##.SOLVENT NAME= COFFEE_meoh
##.SHIFT REFERENCE= INTERNAL, COFFEE_meoh, 1, 14.98509
##AUDIT TRAIL= $$ (NUMBER, WHEN, WHO, WHERE, PROCESS, VERSION, WHAT)
$$ ##TITLE= Audit trail, TOPSPIN		Version 2.1
$$ ##JCAMPDX= 5.01
$$ ##ORIGIN= Bruker BioSpin GmbH
$$ ##OWNER= Administrator
$$ $$ C:\Bruker\TOPSPIN/data/COFFEE/nmr/AC1307_DOMAH11119_6534107_NLFMx5iIHR/30/pdata/1/auditp.txt
$$ ##AUDIT TRAIL=  $$ (NUMBER, WHEN, WHO, WHERE, PROCESS, VERSION, WHAT)
(   1,<2012-07-18 03:25:43.046 -0500>,<Administrator>,<TOPSPIN>,<go>,<TOPSPIN 2.1>,
      <created by zg
	started at 2012-07-18 03:24:36.484 -0500,
	POWCHK enabled, PULCHK disabled,
       configuration hash MD5:
       6B 1B 68 BB D9 2E 58 E2 7F 35 AD 54 07 DF 0E 41
       data hash MD5: 64K
       37 78 86 A3 D4 8D 69 CD 40 0E 2B E0 10 DB 66 AB>)
(   2,<2012-07-18 03:25:45.640 -0500>,<Administrator>,<TOPSPIN>,<proc1d>,<TOPSPIN 2.1>,
      <Start of raw data processing
       efp LB = 0 FT_mod = 6 PKNL = 1 PHC0 = 0 PHC1 = 0 SI = 32K 
       data hash MD5: 32K
       7B 31 C6 C9 2E EF B0 05 A8 8D C9 25 98 C4 FD 7B>)
(   3,<2012-07-18 03:25:46.046 -0500>,<Administrator>,<TOPSPIN>,<proc1d>,<TOPSPIN 2.1>,
      <pk PHC0 = 178.6377 PHC1 = 0 
       data hash MD5: 32K
       57 59 30 A8 5D E5 EC 17 63 A9 06 36 1A F1 41 52>)
(   4,<2012-07-18 03:25:46.140 -0500>,<Administrator>,<TOPSPIN>,<proc1d>,<TOPSPIN 2.1>,
      <abs ABSG = 1 
       data hash MD5: 32K
       3C A6 FF A7 B8 01 90 73 89 F3 7A F6 0A 53 D6 42>)
(   5,<2012-07-18 03:25:46.171 -0500>,<Administrator>,<TOPSPIN>,<proc1d>,<TOPSPIN 2.1>,
      <abs ABSG = 2 
       data hash MD5: 32K
       98 B4 49 24 6C CC 35 94 F0 B3 E6 1D 80 2E 53 3E>)
(   6,<2012-07-18 03:25:46.187 -0500>,<Administrator>,<TOPSPIN>,<proc1d>,<TOPSPIN 2.1>,
      <abs ABSG = 3 
       data hash MD5: 32K
       44 B6 02 20 31 51 E6 2B E6 4F 43 D4 18 DB 28 59>)
(   7,<2012-07-18 03:25:46.218 -0500>,<Administrator>,<TOPSPIN>,<proc1d>,<TOPSPIN 2.1>,
      <abs ABSG = 4 
       data hash MD5: 32K
       5D 54 A1 70 69 DA 6F B9 CB EC 43 1A EE 99 2B D7>)
(   8,<2012-07-18 03:25:46.250 -0500>,<Administrator>,<TOPSPIN>,<proc1d>,<TOPSPIN 2.1>,
      <abs ABSG = 5 
       data hash MD5: 32K
       9B 82 17 98 0C 5F 08 E9 3A E5 8B AF 3B D3 D3 C3>)
$$ ##END=
$$ 
$$ $$ hash MD5
$$ $$ 62 07 0F 41 A7 A2 59 22 A8 2B 47 9C EC 2E CA CF
##$RELAX= 
##$RELAX= 
##$RELAX= 
##$RELAX= 
##$RELAX= 
##$RELAX= 
##$RELAX= 
$$ Bruker specific parameters
$$ --------------------------
$$ [...]
150 150 150 150 150 150 150 150
##$TP07= 0
##$TPNAME0= <>
##$TPNAME1= <>
##$TPNAME2= <>
##$TPNAME3= <>
##$TPNAME4= <>
##$TPNAME5= <>
##$TPNAME6= <>
##$TPNAME7= <>
##$TPOAL= (0..7)
0.5 0.5 0.5 0.5 0.5 0.5 0.5 0.5
##$TPOFFS= (0..7)
0 0 0 0 0 0 0 0
##$TUNHIN= 0
##$TUNHOUT= 0
##$TUNXOUT= 0
##$USERA1= <user>
##$USERA2= <user>
##$USERA3= <user>
##$USERA4= <user>
##$USERA5= <user>
##$V9= 5
##$VALIST= <valist>
##$VCLIST= <CCCCCCCCCCCCCCC>
##$VD= 0
##$VDLIST= <DDDDDDDDDDDDDDD>
##$VPLIST= <PPPPPPPPPPPPPPP>
##$VTLIST= <TTTTTTTTTTTTTTT>
##$WBST= 2048
##$WBSW= 25
##$XGAIN= (0..3)
0 0 0 0
##$XL= 0
##$YL= 0
##$YMAX_a= 458390
##$YMIN_a= -586922
##$ZGOPTNS= <>
##$ZL1= 120
##$ZL2= 120
##$ZL3= 120
##$ZL4= 120
##$ABSF1= 14.98509
##$ABSF2= -5.573092
##$ABSG= 5
##$ABSL= 3
##$ALPHA= 0
##$AQORDER= 0
##$ASSFAC= 0
##$ASSFACI= 0
##$ASSFACX= 0
##$ASSWID= 0
##$AUNMP= <proc_prof1d_extract_pilot.lims>
##$AXLEFT= 0
##$AXNAME= <>
##$AXNUC= <1H>
##$AXRIGHT= 0
##$AXTYPE= 0
##$AXUNIT= <>
##$AZFE= 0.1
##$AZFW= 0.1
##$BCFW= 0
##$BC_mod= 0
##$BYTORDP= 0
##$COROFFS= 0
##$CY= 15
##$DATMOD= 1
##$DC= 0
##$DFILT= <>
##$DTYPP= 0
##$F1P= 0
##$F2P= 0
##$FCOR= 0.5
##$FTSIZE= 32768
##$FT_mod= 6
##$GAMMA= 0
##$GB= 0
##$INTBC= 1
##$INTSCL= 1
##$ISEN= 128
##$LB= 0
##$LEV0= 0
##$LPBIN= 0
##$MAXI= 10000
##$MC2= 0
##$MEAN= 0
##$ME_mod= 0
##$MI= 0
##$NCOEF= 0
##$NC_proc= -8
##$NLEV= 6
##$NOISF1= 0
##$NOISF2= 0
##$NSP= 0
##$NTH_PI= 0
##$NZP= 0
##$OFFSET= 14.98509
##$PC= 1
##$PHC0= 178.6377
##$PHC1= 0
##$PH_mod= 1
##$PKNL= yes
##$PPARMOD= 0
##$PPDIAG= 0
##$PPIPTYP= 0
##$PPMPNUM= 2147483647
##$PPRESOL= 1
##$PSCAL= 4
##$PSIGN= 0
##$PYNMP= <proc.py>
##$REVERSE= no
##$SF= 400.02
##$SI= 32768
##$SIGF1= 0
##$SIGF2= 0
##$SINO= 400
##$SIOLD= 32768
##$SPECTYP= <>
##$SREGLST= <1H.CDCl3>
##$SSB= 0
##$STSI= 32768
##$STSR= 0
##$SW_p= 8223.68421052631
##$SYMM= 0
##$S_DEV= 0
##$TDeff= 65536
##$TDoff= 0
##$TI= <>
##$TILT= no
##$TM1= 0
##$TM2= 0
##$TOPLEV= 0
##$USERP1= <user>
##$USERP2= <user>
##$USERP3= <user>
##$USERP4= <user>
##$USERP5= <user>
##$WDW= 1
##$XDIM= 32768
##$YMAX_p= 421864645
##$YMIN_p= -778319
##$CURPLOT= <Network HP LaserJet P1505>
##$CURPRIN= <$Network HP LaserJet P1505>
##$DFORMAT= <normdp>
##$LAYOUT= <+/1D_H.xwp>
##$LFORMAT= <normlp>
##$PFORMAT= <normpl>
##$SURQMSG= 1
$$ End of Bruker specific parameters
$$ ---------------------------------
##NTUPLES= NMR SPECTRUM
##VAR_NAME=  FREQUENCY,     SPECTRUM/REAL,   SPECTRUM/IMAG
##SYMBOL=    X,             R,               I
##VAR_TYPE=  INDEPENDENT,   DEPENDENT,       DEPENDENT
##VAR_FORM=  AFFN,          ASDF,            ASDF
##VAR_DIM=   32768,         32768,           32768
##UNITS=     HZ,            ARBITRARY UNITS, ARBITRARY UNITS
##FACTOR=    0.250966925370066, 1,           1
##FIRST=     8223.43324360094, -193790,      -55023
##LAST=      0,             -70696,          -157654
##MIN=       0,             -778319,         0
##MAX=       8223.43324360094, 421864645,    0
$$ Real data points
##PAGE= N=1
##DATA TABLE= (X++(R..R)), XYDATA
$$ [...]
19540b58810a22082B83891F308d67870h0413J539l07491B46226a17575L5728A2835
19528a89401D3915j9511R9049d3345j36400A38951c5368l646k73941M9851A13361
19516d27k6336k85286M0191g8528E6870J03622a1391A27791D6756b8429D3749
19504c24169J40209p5450A08683c74122D5388a55104N5405Q283B83190A6478O3777
19493H0255b8915k9111Q03K4870C64952M0971A49249d870k17170Q2647A2900a11542
19480c82287A55751a67159L0409K0308D0615K40449a42459c511j75333A2667M659
19469A7326h7173p3806H0015a7197A42617F1207e6871A2551P6971B862b04347
19457A2382J76098b05111m2445B2399J14324j3741b6937A77357a58938A0228d6869
$$ plain form
19540 -258810 -122082 283891 6308 -467870 -80413 -78874 -386365 246226 -117575 -81847 12835
19528 -189401 43915 24404 123453 -43345 -179745 138951 -35368 -39014 -312955 -263104 113361
19516 -427 -26763 -312049 -271858 -78528 56870 160492 -11391 127791 46756 -28429 43749
19504 -324169 -183960 -259410 108683 -374122 45388 -155104 -99699 -91416 283190 16478 80255
19493 80255 -28915 -58026 -57223 -32353 364952 405923 149249 -4870 -222040 -139393 12900 -111542
19480 -382287 155751 -167159 -136750 -116442 40615 281064 -142459 -3511 -178844 12667 17326
19469 17326 -87173 -160979 80015 -17197 142617 61207 -56871 12551 89522 2862 -204347
19457 12382 188480 -205111 -247556 22399 136723 122982 -26937 177357 -158938 10228 -46869
19445e8416A45328B3646N9541e8710n0353K3779r270A51306d0659A58341b10265
19433I9908C1446f1646C2234K90386c29831B07475B4740a40460J7394i122m5249
19422e4371J3828o4589l4075m7063k7334J01287D8132f8478J9394A16671N576
19411A22247g7607B15572f31339a39867G5703i4979j86149a17588p5538a8655
19400G5128I854J5847c3055A6861b98972E6444a36114F6409P5628a79767L017
19389a76750B91181c0277E5106d2860B4629Q208c23238A78288K06128j40064b71108
19377b28221B06943A6911a30460k56067Q0541a44882j33864A58710c09609Q5717
19367b23892m43471c6107I8922l7759A0568a95541O4042A8100J89517C3138a77611
$$ plain form
19445 -58416 145328 23646 83187 -58710 -109063 -85284 -94554 151306 -40659 158341 -210265
19433 99908 31446 -61646 32234 322620 -329831 207475 24740 -140460 -123066 -9122 -54371
19422 -54371 -40543 -105132 -139207 -186270 -213604 -112317 48132 -68478 -49084 116671 122247
19411 122247 -77607 215572 -631339 -139867 75703 -94979 -281128 -117588 -193126 -18655
19400 75128 9854 25701 -33055 16861 -298972 56444 -136114 66409 142037 -179767 -176750
19389 -176750 291181 -30277 55106 -42860 24629 32837 -323238 178288 384416 244352 -271108
19377 -228221 206943 16911 -130460 -386527 -305986 -144882 -278746 158710 -309609 -223892
19367 -223892 -667363 -36107 98922 61163 10568 -195541 -131499 18100 207617 33138 -177611
19355F061a33599k50067A61572B2294K42504q0208C4055f5285A01923H667a06321
19343f2434K5945j53043j29944J46067D271a38415A78641A3126c81309B29237
19332d71320h6375a5741l85079J78586j41911a62594l1067j68752H7733i6623
19321g3154k08539a23090k7878D44940F9014K08872A31588E6227b6519j08804
19311a35323k97642a07196k76839A5566b94417p4321H8729a63750A65061a34248
19300A2756e00466a73882C0215b59754g3205B78117b5263j32281j55963g4349
19289a64117j64058Q3206d3392C39546b20291C915d23949i8993p2616j43797A36079
19277b67199e5257F6236R0667n3392a39003J8493b6073j71411c5440A23245K04987
$$ plain form
19355 6061 -133599 -383666 161572 22294 264798 184590 34055 -65285 101923 8667 -106321
19343 -62434 -36489 -189532 -319476 -173409 4271 -138415 178641 13126 -381309 229237
19332 -471320 -86375 -15741 -400820 -222234 -364145 -162594 -193661 -362413 87733 -96623
19321 -73154 -281693 -123090 -150968 444940 69014 277886 131588 56227 -26519 -135323
19311 -135323 -432965 -107196 -384035 15566 -294417 -368738 88729 -163750 165061 -134248
19300 12756 -500466 -173882 30215 -259754 -73205 278117 -25263 -157544 -313507 -74349
19289 -164117 -328175 -244969 -43392 339546 -220291 3915 -423949 -98993 -171609 -315406 136079
19277 -267199 -55257 66236 156903 103511 -139003 -120510 -26073 -197484 -35440 123245 328232
19266C28232e8415A51085K5926c02739g0403r1177d6463j15591G8770o771K0819
19255I2818b08318C87655b39971d4501A49578d07739B6634H584d09597a74778
19244a26350A19433A8869L3394L55753a27506a6002j68142K6122e6946j88448
19234b45394B96587a84038O9166D8916d5104m453A3819J09204K2176a70184j1812
19223a81996d6106m8906j12577P668e5198j55037O9113A53589J15643E8177j9244
19212C8933e8230A11698J5039K99730G409a8933j93655A62950A9088d7090G2544
19200A9023h6202B34212a68811B7357b2983k03768A14779b9851k387j88595K4865
19189a95968D3881h9421b2462j50088A15246J5932C4648f5418j28197R0797K0244
$$ plain form
19266 328232 -58415 151085 177011 -302739 -70403 -161580 -46463 -162054 78770 71999 92818
19255 92818 -208318 387655 -239971 -44501 149578 -407739 26634 8584 -409597 -174778
19244 -126350 119433 18869 52263 408016 -127506 -16002 -184144 -158022 -56946 -245394
19234 -245394 296587 -184038 -114872 48916 -45104 -49557 13819 123023 145199 -170184 -181996
19223 -181996 -46106 -95012 -207589 -199921 -55198 -210235 -141122 153589 269232 58177 38933
19212 38933 -58230 111698 126737 426467 7409 -18933 -212588 162950 19088 -47090 72544
19200 19023 -86202 234212 -168811 27357 -22983 -226751 114779 -29851 -32238 -220833 -195968
19189 -195968 43881 -89421 -22462 -172550 115246 131178 34648 -65418 -193615 -102818 -82574
19178h2574K6982h991A19647f9532a5976k00438B08067I7400e37555a70341B37516
19166a31409K4573a0353j00180p3140L9633f0839G7624a22148A22093b45017a14049
19154a28176B3g5922j51124A3652a38463k0900A1517P5204c6565A47856K1619
19143A69475b2629A22123a44361P0030A95141I664a00031l8636A39668F8134J30830
19132A98964G1816a53123L636n6230N4504B55291I3197K3902L7623a9983A69314
19120A68005b38111J02496B63595d60325B29774c10525k106A99808a19359M6110
19110g3249B5168M5531j2398c3556m28341J84693C4862c52378D755L3126b99961
19098d1748A41086a14307A440b73321A25903d5930j77767M139j2809O0031B24042
$$ plain form
19178 -82574 -55592 -8991 119647 -69532 -15976 -216414 208067 97400 -537555 -170341 237516
19166 -131409 -106836 -10353 -110533 -183673 -144040 -60839 77624 -122148 122093 -245017 -114049
19154 -128176 23 -75922 -227046 13652 -138463 -159363 11517 86721 -36565 147856 169475
19143 169475 -22629 122123 -144361 -74331 195141 9664 -100031 -138667 139668 68134 198964
19132 198964 71816 -153123 -149487 -205717 -151213 255291 93197 117099 154722 -19983 169314
19120 168005 -238111 -135615 263595 -460325 229774 -310525 -312631 199808 -119359 -73249
19110 -73249 25168 70699 58301 -33556 -461897 -277204 34862 -352378 4755 37881 -299961
19098 -41748 141086 -114307 1440 -273321 125903 -45930 -223697 -219558 -232367 -172336 224042
19086H1083a39733D907d115A36847a67661a0079A4113Q946a79179c6067H1117
19074a45471A4868d5517k74373A32142a93363b9l41455R6203A04753D3323a34114
19062A66409c14645i5414H7060a01024j357j75393a16313c9417o8859A56490c16879
19050b67141d1486k3651A10747M4564a87660b0667q2468m9901k67277Q2950N9195
19039b78168A43433a31839k00640E9771m711b27252c1276j06913B35334b08524
19028a58877B73035a00542a3175G6380B5945J9083j6570b20047A24325b65334
19017a18165L2624B57930E8998a01182p2597A30735c5366k36016M1637q4131G5110
19005c8882k1387J6344k2187J5606j92219A63365o0173b04604E0934a20675j30668
$$ plain form
19086 81083 -139733 4907 -4115 136847 -167661 -10079 14113 23059 -179179 -36067 81117
19074 -145471 14868 -45517 -319890 132142 -193363 -29 -341484 -245281 104753 43323 -134114
19062 166409 -314645 -95414 87060 -101024 -102381 -277774 -116313 -39417 -108276 156490 -316879
19050 -267141 -41486 -65137 110747 155311 -187660 -20667 -103135 -153036 -420313 -337363 -278168
19039 -278168 143433 -131839 -332479 59771 55060 -227252 -31276 -138189 235334 -208524
19028 -158877 273035 -100542 -13175 76380 25945 45028 28458 -220047 124325 -265334
19017 -118165 -85541 257930 58998 -101182 -173779 130735 -35366 -271382 -229745 -313876 75110
19005 -38882 -60269 -43925 -66112 -50506 -242725 163365 103192 -204604 50934 -120675 -251343
18994b51343j73941C06409h4419k37535A93403b82795d3581k9680J5066B84767
18983b70508M2592c492q7471k46180H9447k6612O7774b51331E3642g6285r2127
18972a68412A09211f3993A16538a9701E5658Q1790M1780a43605j04818B04566
18961C5574J50370e9766q8676B34504j03794b63754j4042H5863L8335a48677c3582
18949C6428J80739e2366G697b1679C52762A43448b3970l13389g2239B73196f0928
18937a2441B04869a04977j16898e6091B69619b3994m55849J14994e0969D05379
18926b29817p5625E3281J01211b5836A45092b85253J10189m6920B7839K08111
18916B35950m8640i6403A51027p3257a26026i677j50060D4877J10624l9047c79548
$$ plain form
18994 -251343 -425284 306409 -84419 -321954 193403 -282795 -43581 -73261 -58195 284767
18983 -270508 -227916 -3492 -90963 -337143 89447 62835 130609 -251331 53642 -76285 -168412
18972 -168412 109211 -63993 116538 -19701 55658 137448 179228 -143605 -248423 204566
18961 35574 185944 -59766 -148442 234504 130710 -263754 -277796 85863 124198 -148677 -33582
18949 36428 217167 -52366 7697 -21679 352762 143448 -23970 -337359 -72239 273196 -60928
18937 -12441 204869 -104977 -221875 -56091 269619 -23994 -479843 -364849 -50969 405379
18926 -229817 -305442 53281 154492 -25836 145092 -285253 -175064 -221984 27839 235950
18916 235950 187310 -96403 151027 77770 -126026 -9677 -159737 44877 155501 116454 -379548
18904A5547a88163j26437a8596m971B68000c0926A07432c58613a02234B90258
18893b19615n3503B3563b6383q8836j7290J1251H5502O2348A9106b61369g7809
18881E6218a12812A5588Q0224a5522l40436A37905b6103A00342f2361j06179k28177
18870c96717P4556A69588c3123B8731p426d51552E3961g5294l3850H6714c74989
18858e0889A85279a94757J1036Q3401j7140k07832B11671d7707A54643o5292J22352
18847B11703d9261p6418I1505a76137B00288D1710a99292A35479d9439k78690
18837c28129a17512m3695P6609I7507J28716a09011n15320D7166J8519a9305l77191
18826c96496J21294A81788a64004M6791A05703N6783N5326j05437K71841A25045
$$ plain form
18904 15547 -188163 -314600 -18596 -23567 268000 -30926 107432 -358613 -102234 290258
18893 -219615 -273118 23563 -26383 -115219 -132509 -121258 85502 147850 19106 -261369 -77809
18881 56218 -112812 15588 95812 -15522 -355958 137905 -26103 100342 -62361 -168540 -396717
18870 -396717 -322161 169588 -33123 28731 21305 -451552 53961 -75294 -109144 86714 -374989
18858 -50889 185279 -194757 -183721 -100320 -117460 -325292 211671 -47707 154643 89351 211703
18847 211703 -49261 -125679 91505 -176137 200288 41710 -199292 135479 -49439 -328129
18837 -328129 -117512 -161207 -84598 97507 226223 -109011 -624331 47166 65685 -19305 -396496
18826 -396496 -275202 181788 -164004 -117213 105703 162486 217812 112375 384216 125045
18815d8117A323J53818i7283j48911I1895A5777a75736G832J93635b06405q2542
18804b88947g1461r1666a0683j09256r2944A09065d3928m5001c0016j47115A69815
18792b19863B71953G8102f615I9357K4386O2572k5119b50193A75595R6967A733
18780a23631j55472A59976h6769j36997a690l30317d2640l58720b7247j37066
18770a64313E3024r765L6624p089J36966a2775A02250b555k356A20324j5829c9252
18757a39212k81079a9758j34281b3161k34037l5296J28261A07835J57435C0846
18746B71879L4746a64935A8775J9494J80355c2513o4473j67655a26629M3433j7944
18735a01140K5986j72680C1773g5657c2931A31114a53203a318k13593R4461A36182
$$ plain form
18815 -48117 1323 155141 -97283 -246194 91895 15777 -175736 7832 201467 -206405 -288947
18804 -288947 -71461 -163127 -10683 -119939 -212883 109065 -43928 -88929 -30016 -177131 169815
18792 -219863 271953 78102 -6615 99357 123743 186315 161196 -250193 175595 272562 1733
18780 -123631 -279103 159976 -86769 -223766 -1690 -332007 -42640 -401360 -27247 -164313
18770 -164313 53024 43259 79883 72794 209760 -12775 102250 -2555 -4911 120324 104495 -39252
18757 -139212 -420291 -19758 -154039 -23161 -257198 -292494 -164233 107835 265270 30846
18746 271879 306625 -164935 18775 38269 218624 -32513 -96986 -264641 -126629 -83196 -101140
18735 -101140 -75154 -247834 31773 -75657 -32931 131114 -153203 -1318 -214911 -120450 136182
18723a04594j41398A69336h9693j19467q9390R7653d4967j34958b7188l85106
18713d12294B15994q1902c7575A5610J54881c40405A77543A054a21018A31105
18702D1261a22391k67949A74746c44770i3830m9535p9537G5525A2123n658K1289
18691B7754c24048A22728e8873l19377a13476A48796b29213M106C1919i2659j74266
18680b66925e696l60852i2082B4532b35179R0623F5007a32047D6374b81906p3742
18669c55648A41225K41167A35317a41382O7328A04728a57222K8769k36294A92390
18658A57738n2098a14650M1604D2430a31068G9483Q6450c31471A63494a47224
18647b5596B513a15702A30439b30993Q904b5445j03178k81464B73848d2566n9413
$$ plain form
18723 -104594 -245992 169336 -89693 -209160 -298550 -200897 -44967 -179925 -27188 -412294
18713 -412294 215994 134092 -37575 15610 170491 -340405 177543 1054 -121018 131105
18702 41261 -122391 -390340 174746 -344770 -93830 -143365 -222902 75525 12123 6465 27754
18691 27754 -324048 122728 -58873 -378250 -113476 148796 -229213 -225107 31919 -92659 -266925
18680 -266925 -5696 -366548 -92082 24532 -235179 -144556 65007 -132047 46374 -281906 -355648
18669 -355648 141225 382392 135317 -141382 -74054 104728 -157222 -128453 -364747 192390
18658 157738 105640 -114650 -73046 42430 -131068 79483 165933 -331471 163494 -147224
18647 -25596 2513 -115702 130439 -230993 -222089 -25445 -128623 -410087 273848 -42566 -101979
18636a01979a5252F9320i256n6256l57757a63475O6530j83120A13804a83415N2726
18625a30689j52672A62780J05674d0642a1971A49497j6369a41417D1132f6661
18614a27979j57360J05780D4659j5259O5377N6079b810j03452H3587B9094a82320
18602a76368K302c5656A3925h3545j37383A28739R5202a4264B0434L4621b00702
18590a05435A62193g3367J4995B85143L5405a14124K635M5310n0534A24107M6615
18579A70722b11121A04205a62560A00063a15002a1180k6625j00897n5148q5677
18569b79527i4011c3965A60539k9959g4511I1064E65a93555h5802b6518H0073
18557a27701C19774o3031c7379A00997d0421B43956D4131E201b98332J36868D02223
$$ plain form
18636 -101979 -15252 69320 -9256 -65512 -423269 -163475 -96945 -280065 113804 -183415 -130689
18625 -130689 -283361 162780 268454 -40642 -11971 149497 133128 -141417 41132 -66661
18614 -127979 -285339 -179559 44659 29400 94777 150856 -2810 -106262 83587 29094 -182320
18602 -176368 -174066 -35656 13925 -83545 -220928 128739 223941 -14264 20434 55055 -200702
18590 -105435 162193 -73367 -58372 285143 320548 -114124 -111489 -66179 -116713 124107 170722
18579 170722 -211121 104205 -162560 100063 -115002 -11180 -37805 -138702 -193850 -279527
18569 -279527 -94011 -33965 160539 130580 -74511 91064 565 -193555 -85802 -26518 80073
18557 -127701 319774 256743 -37379 100997 -40421 243956 44131 5201 -298332 -161464 402223
18545C18334c3335j50386d5445k34709j52802c709l5615I5468K24157o8791a85898
18533A46087b41724a19222G715b17193K7287I1643d0930A51921B5915a32594p942
18522a40536f7333A44741b08596A07852l2583a69861l7264i8355c7165B64164
18511E3185a92094i5621F3470b04966A51084a05720E370e3623j24039A11702C9406
18499c5240A13420J41140a18625j74398a07123k87458b2840k00A08925M0224c61465
18487b56965A6269b02672M0209D15861a23294n7037j20842a18142C28190f398
18476A38401e2581j26189J0305a7026p076n14489A62328a32673f3602H748J25294
18465A34042A4278J23369b51889A97032q5234a5536B14016b89501j34086a57914
$$ plain form
18545 318334 -33335 -183721 -45445 -280154 -432956 -3709 -39324 95468 319625 250834 -185898
18533 146087 -241724 -119222 7715 -217193 -189906 91643 -40930 151921 25915 -132594 -140536
18522 -140536 -67333 144741 -208596 107852 75269 -169861 -207125 -98355 -37165 264164
18511 53185 -192094 -95621 63470 -204966 151084 -105720 5370 -53623 -177662 111702 39406
18499 -35240 113420 254560 -118625 -293023 -107123 -394581 -22840 -23040 108925 149149 -361465
18487 -256965 16269 -202672 -162463 415861 -123294 -180331 -301173 -118142 328190 -6398
18476 138401 -52581 -178770 -168465 -17026 -24102 -538591 162328 -132673 -63602 8748 134042
18465 134042 14278 137647 -251889 197032 111798 -15536 214016 -289501 -423587 -157914
18454e3308F284b22934a1124k35702A85878d70416A36729J23109a59847j03981
18444b63828E4794l330B2446b00798C96368f1712n61735H2202a15957a2470C3579
18432b64602B56196c2756j55466k44181G275J75753J9525o501e12440a28299n2743
18421a81042Q1464H8904c41186C4860c82134C78221A20725Q0178a01744l8612
18411a40356p1417m1628B41646b33153j19455G7477K10880A27741d58408d9599
18400A01554M0564a98370j41759d3468B25658b05740C6040i6446j78854A01570
18389c73476A35715a60452A53649c52926C8567b492n197k6686B13588f3991k09274
18378b73265A03497Q2793a57022D3559G421N3013f5209F8976O6736B0168M2357
$$ plain form
18454 -53308 6284 -222934 -11124 -246826 185878 -470416 136729 259838 -159847 -263828
18444 -263828 54794 51464 22446 -200798 396368 -61712 -623447 82202 -115957 -12470 33579
18432 -264602 256196 -32756 -188222 -432403 7275 183028 202553 196052 -512440 -128299 -181042
18421 -181042 -99578 88904 -341186 34860 -382134 378221 120725 200903 -101744 -140356
18411 -140356 -211773 -253401 241646 -233153 -352608 77477 288357 127741 -458408 -49599
18400 101554 142118 -198370 -340129 -43468 225658 -205740 36040 -96446 -275300 101570
18389 -373476 135715 -160452 153649 -352926 38567 -2492 -7689 -34375 213588 -63991 -273265
18378 -273265 103497 186290 -157022 43559 7421 60434 -65209 68976 135712 20168 62525
18367F2525g9386L078j74515J06764Q822o328a4789A02319i9815d4592p1433A48786
18354A38432K4090F2153O8538e3862J5494j11872G7294l877d92374J32711j4426
18343c74089B2607b0771l18573Q9243J06820A11294a9383F6783c03236H7882O1681
18332A49563a37467d208n6589F3874M5150J79951F0154K06529k9383K142a75396
18320a61118c8086k78649I6408d24720B0261K3225E451b19630F4899g8745o3527
18309a42272e4928j61415M4896j75821B48139G9982a84126j5210k28110C00034
18298A7621J96261f5148j6698j51639E3351A9028J01957J86965c7630B07605b81223
18286H2056P3138G813a03121B21730j03307O5128i4679o9014B3476a25664j11680
$$ plain form
18367 62525 -79386 -76308 -250823 -144059 -135237 -141565 -14789 102319 -99815 -44592 -116025 148786
18354 138432 162522 62153 130691 -53862 -38368 -150240 77294 73417 -492374 -359663 -374089
18343 -374089 22607 -20771 -339344 -250101 -143281 111294 -19383 66783 -303236 87882 149563
18332 149563 -137467 -4208 -60797 63874 109024 288975 60154 266683 237300 239442 -175396
18320 -161118 -38086 -316735 96408 -424720 20261 43486 5451 -219630 64899 -78745 -142272
18309 -142272 -54928 -216343 -171447 -347268 248139 79982 -184126 -199336 -427446 300034
18298 17621 213882 -65148 -81846 -233485 53351 19028 120985 307950 -37630 207605 -281223
18286 82056 155194 7813 -103121 221730 118423 183551 -94679 -163693 23476 -125664 -237344
18275b37344O0044H4492e4323A45485a03946L8224A3925O0050K60006b71480f1947
18263E263b79149A90962a22413A78749N7837d042F5233b63556N6658q3059D28500
18251A09955f4654A10662b33971G957i1973j47734O5980B6719M3198d09235a84497
18239a00885J7235j23348A48777C1072a63884E0824a26156l01946b12891J6328
18229a96563g0255j75441K9287I4227J8072g3674k75478F088a14364K8425A4094
18217i6932E8759c3230G4164a34602e6055I8402a90311H8701a62227b2947D84535
18205A3045K70328b14429J0062F9997a08003C2654r433d9605m7090C1487P7663
18194A09150a82465m0025B17036b26952f5868k06656I8908B0392a25372p9490
$$ plain form
18275 -237344 -177300 84492 -54323 145485 -103946 -65722 13925 73975 333981 -271480 -61947
18263 5263 -279149 190962 -122413 178749 236586 -4042 65233 -263556 -206898 -289957 428500
18251 109955 -64654 110662 -233971 7957 -91973 -239707 -173727 26719 69917 -409235 -184497
18239 -100885 -83650 -206998 148777 31072 -163884 50824 -126156 -428102 -212891 -196563
18229 -196563 -70255 -245696 -216409 94227 112299 -73674 -349152 6088 -114364 -85939 14094
18217 -96932 58759 -33230 74164 -134602 -56055 98402 -190311 88701 -162227 -22947 484535
18205 13045 283373 -214429 -204367 69997 -108003 32654 23221 -49605 -96695 31487 109150
18194 109150 -182465 -222490 217036 -226952 -65868 -272524 98908 20392 -125372 -204862
18184b04862M1317M8060j56536J3512B51284c13989e2097l6121B33120D9048a48218
18172I7864d2520r0479N7735C9841o414K0594M3129a43680A32147b37807g4237
18160A10647b8776j9899B8978I117L54710E5666a99308I8375e0135n4048b8350
18148A3727d0096r8530A75175B0615K60237H408i0701L7304j21261K5572C5063
18136a78089O7984j00526O0681P4028A67540c74996A45083p291J58510d9476A126
18124i7880H3911e8337I5911C3687a73718r9258d9094A25374J20129a60058A77677
18112E5377c57235D9424a59721C320J54442b18285b0844n29982b29883J12164
18102a17719L3546c3440j24022o2791F3703b38964Q0262p7699o2032f4622A20071
$$ plain form
18184 -204862 -163545 -115485 -272021 -258509 251284 -313989 -52097 -88218 233120 49048 -148218
18172 97864 -42520 -132999 -75264 39841 33427 54021 97150 -143680 132147 -237807 -74237
18160 110647 -28776 -48675 28978 9117 363827 55666 -199308 98375 -50135 -104183 -28350
18148 13727 -40096 -138626 175175 20615 280852 8408 -90701 -53397 -174658 -149086 35063
18136 -178089 -110105 -210631 -149950 -75922 167540 -374996 145083 137792 296302 -49476 1126
18124 -97880 83911 -58337 95911 33687 -173718 -272976 -49094 125374 245503 -160058 177677
18112 55377 -357235 49424 -159721 3320 157762 -218285 -20844 -550826 -229883 -117719
18102 -117719 -84173 -33440 -157462 -220253 63703 -238964 -158702 -236401 -298433 -64622 120071
18090b10977f3029j9425L7412B86454C091a25602q9168f0908B00819c68683B3546
18078a53864N0744I5267L60793g0008m84258h7677n4115l25238H4479C2731J83492
18067B16223c6648C22607a18467j08164A24457c05279G562K51235r0022l118a69540
18055f0768G4394c61141J74500B7396a50738r0825j08493D916J21018a16936B29130
18043h2241b7181p3633B7110K13006c97748J43335A74406B700J4196h0123j19606
18032a99729A67671A3006N8164c69536a25653B93643a40274O0433b1799I6997
18021E4402a77575a3000F2718B8599o991J6952L9892M0117J1190d4170A96283
18009i6525q3730a4377F9206a11606k4984K4820j9975K7150B02910n5065D281
$$ plain form
18090 -210977 -63029 -82454 -45042 286454 3091 -125602 -214770 -60908 200819 -368683 23546
18078 -153864 -103120 95267 456060 -70008 -554266 -87677 -141792 -467030 84479 32731 216223
18067 216223 -36648 322607 -118467 -226631 124457 -305279 7562 258797 168775 165657 -169540
18055 -60768 74394 -361141 -186641 27396 -150738 -241563 -350056 4916 125934 -116936 229130
18043 -82241 -27181 -100814 27110 240116 -397748 -254413 174406 2700 16896 -80123 -199729
18032 -199729 167671 13006 71170 -369536 -125653 293643 -140274 -79841 -21799 96997
18021 54402 -177575 -13000 62718 28599 21608 38560 78452 118569 129759 -44170 196283
18009 -96525 -180255 -14377 69206 -111606 -136590 -111770 -131745 -104595 202910 147845 4281
17997D58a02339l09131d5433C8174J21990d7317A54929d89974A96977a47031F0971
17985g691l9310m17687g689B06353e0223A01964e33869f4439k61437a40413j08316
17974b48729J5906D5862J64582g4862C141c64478M7068A9120J31445a43074H3547
17962b8577A514N8355d0631A55629f4576m3690m1554A8090b3047B47404A21414
17950a92638k24994A11143J8142a06111C0347b17895A35622a07080K618b8579
17939e7769E1050k4366c13764a22135k8672M5739A04666c1121k78390B17767o3533
17928A54234A3591a50226m9864k49719a28006N5856j50875f2415j26490b953j51711
17917a54664j44280A11425B8670R3505G451a91733E689f7950b6481d797q4189
$$ plain form
17997 458 -102339 -411470 -45433 38174 160164 -47317 154929 -489974 196977 -147031 60971
17985 -7691 -47001 -464688 -7689 206353 -50223 101964 -533869 -64439 -325876 -140413 -248729
17974 -248729 -232823 45862 210444 -74862 3141 -364478 -317410 19120 150565 -143074 83547
17962 -28577 1514 59869 -40631 155629 -64576 -108266 -149820 18090 -23047 247404 121414
17950 -192638 -417632 111143 129285 -106111 30347 -217895 135622 -107080 -104462 -28579
17939 -57769 51050 26684 -313764 -122135 -150807 -105068 104666 -31121 -309511 217767 154234
17928 154234 13591 -150226 -200090 -449809 -128006 -72150 -223025 -62415 -188905 -2953 -154664
17917 -154664 -298944 111425 28670 122175 7451 -191733 5689 -67950 -26481 -4797 -88986
17906h8986j08656M7765H7408L1017a11353J1055A73920A7825b48146h9930B8460
17894B87577b85792h1387J9057a7946I9263a31807E38984F6981K00282j25781
17884A41482a86829b3305A50368c7139j62524i2528B21844c04541J3245E8739
17873A87846n0452K5686A2744K76616r0185c69561i9766B713L78210K15923c89867
17861a0088j54721j79693F287a38627L0114E2602J12550M2740d17376h6072n2678
17850a38750A46281g2754I2623a06159d1982G8800b08726B01939a05668r5918
17840b01586J299B92496c69980d9073A92316I0557d9447j00028C2231h9333l05657
17829c94990A243a34960e0905B29304d28385A43964j332h9909N244a0672B55790
$$ plain form
17906 -88986 -197642 -149877 87408 118425 -111353 -100298 173920 17825 -248146 -89930 28460
17894 287577 -285792 -81387 -62330 -17946 99263 -131807 538984 66981 267263 141482
17884 141482 -186829 -23305 150368 -37139 -199663 -92528 221844 -304541 -291296 58739
17873 187846 137394 163080 12744 289360 199175 -369561 -99766 2713 380923 596846 -389867
17861 -10088 -164809 -344502 6287 -138627 -108513 52602 165152 207892 -417376 -86072 -138750
17850 -138750 146281 -72754 92623 -106159 -41982 78800 -208726 201939 -105668 -201586
17840 -201586 -200287 292496 -369980 -49073 192316 90557 -49447 -149475 32231 -89333 -394990
17829 -394990 1243 -134960 -50905 229304 -428385 143964 142632 -89909 -84665 -10672 255790
17817i7914N698o5075C34165c5957C51212H8262c94879B05226d36043h0182A5474
17805B69836K0082A26422a27898C37067d5670j69662A31825P4325H2728a70070
17794f5941B0609J073P2414b73216a08634C8808P6650P7244d2865k08439j5121
17783b66425I9454i2641a0830m720m07800a08488p8599A65935g1286D339J50995
17772A55334F0649a07425C267a7278A45599N311J59446d35522d5340D3179P9488
17761A22667d9175A12678b63202A5474a36391r1669d9274n2912A00624K60372
17751C60996A14971M8944o4994a00637k03916B02624I9901a6463A48655C2673
17740d6842k28567C30174d8899k9196l5626A80983H188J81878c81496a68106A85631
$$ plain form
17817 -97914 -92216 -157291 334165 -35957 351212 88262 -394879 205226 -436043 -80182 15474
17805 269836 289918 126422 -127898 337067 -45670 -215332 131825 206150 82728 -170070
17794 -65941 20609 21682 94096 -273216 -108634 38808 115458 192702 -42865 -251304 -266425
17783 -266425 99454 -92641 -10830 -15550 -423350 -108488 -187087 165935 -71286 4339 155334
17772 155334 60649 -107425 3267 -17278 145599 150910 310356 -435522 -45340 43179 122667
17761 122667 -49175 112678 -263202 15474 -136391 -228060 -49274 -102186 100624 360996
17751 360996 114971 163915 98921 -100637 -304553 202624 99901 -16463 148655 32673
17740 -46842 -275409 330174 -48899 -78095 -113721 180983 8188 190066 -381496 -168106 185631
17728a03811l6186H4509a3073k30502c33j14656p8486C0652L08092E7838e3492
17716A70335c0988A07405a61871L49G629M4984p94K6866B0234b80709B73277a08244
17703a2341k78071G4937M281e0031k350j77997B34697b52423B09932d7072A63292
17691f0171a7948j25276D21198k10174l4689h6324F5062b06540P9620I9749h4874
17679c37315d4350B2910O46j0898M1776j7838a37584I7917l0795a99386a4555
17667H5878b36417f8521L2331A68276J5943L2045J71250k3216a44054I6868a33278
17655b5602h599C9296b25742c4052A33864d714n9410n9435A72054a38985A63081
17643I3339f0261l02790C55852A54998c67592c5937J0381A24922b1698B34659
$$ plain form
17728 -103811 -139997 84509 -13073 -243575 -333 -114989 -193475 30652 338744 57838 -53492
17716 170335 -30988 107405 -161871 -161522 7629 52613 51819 78685 20234 -280709 273277 -108244
17703 -12341 -290412 74937 79218 -50031 -52381 -230378 234697 -252423 209932 -47072 163292
17691 -60171 -17948 -143224 421198 211024 176335 -86324 65062 -206540 -126920 99749 -84874
17679 -337315 -44350 22910 23556 12658 54434 36596 -137584 97917 67122 -199386 -14555
17667 85878 -236417 -68521 -36190 168276 184219 216264 387514 364298 -144054 96868 -133278
17655 -25602 -8599 39296 -225742 -34052 133864 -4714 -64124 -123559 172054 -138985 163081
17643 93339 -60261 -363051 355852 154998 -367592 -35937 -25556 124922 -21698 234659
17632a0092i31j41386B24484B2871N3857P7913a08107B6240M43981A78105a47592
17620i1913j98072H5517Q6004c8417A30572c8735j83943e0150A28268a1614j47723
17609a59337E08798H3131J40244o6007J86713F8770c92431I8300C4084M383f4269
17597A7426a82628M4410G2720L729J48053a0483A90138L1080m4240h9862r7242
17586a87104H5427J68856a60853A87546c10440c1746H5723k3229b18156J01552
17576a16604B2601K01864a7101E3506K4837a04006l30969f5302A87464n0345K36199
17565C73318f7932l6566n2418A78739p8e56146K19709d6035D71814g6029k468
17554g8497l84252e0336j19527J8659d7786D5690d7590B34638I2301a21556G5061
$$ plain form
17632 -10092 -931 -142317 224484 22871 76728 154641 -108107 26240 470221 178105 -147592
17620 -91913 -289985 85517 171521 -38417 130572 -38735 -222678 -50150 128268 -11614 -159337
17609 -159337 508798 83131 223375 157368 344081 68770 -392431 98300 34084 38467 -64269
17597 17426 -182628 -138218 72720 76449 224502 -10483 190138 221218 176978 -89862 -187104
17586 -187104 85427 254283 -160853 187546 -310440 -31746 85723 62494 -218156 -116604
17576 -116604 22601 224465 -17101 53506 78343 -104006 -434975 -65302 187464 137119 373318
17565 373318 -67932 -104498 -156916 178739 178661 -556146 -336437 -46035 471814 -76029 -78497
17554 -78497 -462749 -50336 -169863 -151204 -47786 45690 -47590 234638 92301 -121556 75061
17542b6819A62712k6495R5466c75970D091J68651f883C12164e1614A41328c528
17530B96484c45626M2588E8928d7734B30324J37604B7462K55515E5074f0655I2421
17518D7932b24264i4825k51492I8565D2166J68021r5567e869C605L03214k6402
17507B80417i6858B6776K02256G3899K17483b59000A48657N2602a89766A6329
17496b29037C02588C813K31632C1115J07917b47629B06211a40696r690A86600
17485c9449B19288F6030b3038B25058C2387a31405D8271K5185J74443a67159H0378
17473A00769i429j4987C25570c2300A92932A7895a43138N8597b0631A18627m7673
17462G0954c6473A46846a93029C29440C30J17791l6315B989a13951D44132E7204
$$ plain form
17542 -26819 162712 136217 231683 -375970 4091 172742 -6883 312164 -51614 141328 -3528
17530 296484 -345626 -303038 58928 -47734 230324 367928 27462 282977 55074 -60655 92421
17518 47932 -224264 -94825 -346317 98565 42166 210187 114620 -5869 3605 306819 280417
17507 280417 -96858 26776 229032 73899 291382 -259000 148657 201259 -189766 16329
17496 -229037 302588 3813 235445 31115 139032 -247629 206211 -140696 -150386 186600
17485 -39449 219288 66030 -23038 225058 32387 -131405 48271 73456 247899 -167159 80378
17473 100769 -9429 -24416 325570 -32300 192932 17895 -143138 -84541 -20631 118627 70954
17462 70954 -36473 146846 -193029 329440 330 118121 81806 2989 -113951 444132 57204
17450B62361J0397j12331n0619K94506j78433J611c2792H4627M13648A64982n8491
17439A06491N0367N3934J4921J6206L6501d9854B03120N7014J58626H8449Q8591
17428A77040d6107C30765J02442a11500B71476N4473A11603J06120p1948m3763
17418A02012L0822J58852f5113E20222k31348P1356J78640A57794L26502k27156
17408B57140j0276H2929a11297A87124r417k0015c14314C16491I6564H101J71749
17397A79850a4295J489r895j68633E6954L35997j81969q6369J75693O9734A02924
17385f9129G2866k623J12268p5931h3979A68417K46526e8651A17102K78790a39777
17373e3896r8033C97639a42063D5916J03073J54882A09411L75745j75466a59245
$$ plain form
17450 262361 272758 160427 109808 404314 225881 227492 -32792 84627 498275 164982 106491
17439 106491 156858 210792 225713 241919 278420 -49854 203120 260134 418760 88449 177040
17428 177040 -46107 330765 433207 -111500 271476 325949 111603 217723 145775 102012
17418 102012 132834 291686 -65113 520222 288874 360230 538870 157794 484296 257140
17408 257140 246864 82929 -111297 187124 177707 157692 -314314 316491 96564 8101 179850
17397 179850 -14295 -12806 -22701 -191334 56954 392951 210982 124613 300306 370040 102924
17385 -69129 72866 70243 182511 106580 -83979 168417 414943 -58651 117102 395892 -139777
17373 -53896 -151929 397639 -142063 45916 148989 303871 109411 485156 309690 -159245
17362C2847b20365I3405h2265A98484B3976a17816C487K15109F0984c02452A64857
17350A27946C3294J97230r7686A6606J07443h7375B20212a74156b6912A39036
17339b33610A1094N1445L0261J82996k5400A10719K47743A4037J81561J11926
17329C07524j30918a25328c438D7370j9233J28834J9640J67801I5199N06432f2
17317B86942g1433A22549n9220K72053G9827A7399J49700K3333a46904B62852
17306I1102l3932P4962r541D0106L07392A33961O664n6398J4122N9956R3761F470
17293i3179B89770r4197a90741E3023b48088A64558F743L19444A38000j7213N537
17282A26324D7864K44475n2635H35N27775k47656K6230p6948K32847j63013p389
$$ plain form
17362 32847 -220365 93405 -82265 198484 23976 -117816 3487 218596 60984 -302452 164857
17350 127946 33294 230524 132838 16606 124049 -87375 220212 -174156 -26912 139036
17339 -233610 11094 62539 92800 275796 250396 110719 358462 14037 195598 307524
17329 307524 176606 -125328 -3438 47370 28137 156971 176611 344412 95199 601631 -62
17317 286942 -71433 122549 63329 335382 79827 17399 167099 190432 -146904 262852
17306 91102 57170 132132 122591 40106 347498 133961 140625 84227 98349 158305 252066 6470
17293 -93179 289770 195573 -190741 53023 -248088 164558 6743 326187 138000 120787 126324
17282 126324 47864 292339 239704 835 528610 280954 307184 230236 463083 300070 292681
17271B92681A34369l4316G702L2472b1842D5420e3549C504K52623O5890b86997
17259C46146e0454B81430J2188m9646J13700G8615J75869b9348a45k48947B4809
17247B8752c0273A74685M7552b3525B63944a530A29943n3815b58654B69694d0510
17235D60803A23801k5780M8177c5986A66639E8974L99510A73481J36144C8934
17224a47982B87868Q0073a9052D64529i7370A2015N43680C5334O7369N8791B6126
17212B45710J56868p0330b63507B90699b2976B31373m0176a73785C50019l0798
17202C19221M3601l3947j00357M3912n2776J34179B4784M94227k14155r95o2046
17191B41815a22022D3658M13441k27166I2473J90913d2616D0677J25971E0009
$$ plain form
17271 292681 134369 100053 7702 40174 -21842 45420 -53549 3504 256127 322017 -286997
17259 346146 -50454 281430 293618 243972 357672 78615 254484 -29348 -145 -249092 24809
17247 28752 -30273 174685 222237 -23525 263944 -1530 129943 76128 -258654 269694 -40510
17235 460803 123801 98021 146198 -35986 166639 58974 458484 173481 309625 38934
17224 -147982 287868 367941 -19052 464529 -97370 12015 555695 35334 102703 161494 26126
17212 245710 402578 332248 -263507 290699 -22976 231373 191197 -173785 350019 319221
17202 319221 362822 328875 228518 272430 219654 353833 24784 519011 304856 303861 241815
17191 241815 -122022 43658 457099 229933 92473 283386 -42616 40677 166648 50009
17180A02002J45586K15790k08551K18977E9402J88378o6294J15117A22332k971
17170A19361A4297O23733k69811A28612L05205r8573O348r9936N0622c5815E32647
17158D41125j53806l9246L8423A42536L6935K1911j00190J12927J52246b75823
17147B06885j2109J30737j0319I1262J17969N5880j00590L27019B10104k0979
17137A89125L8166G4306J55969L75486a9197B86627F7866J4562J40664M15854
17127F38946B33857P1665J30616A36327J08084J32964Q9356B12145H3230K74010
17117C57240M1637A34663K1084K67506J71963A29512M25645n6085j00456d1666
17106C97310m8032j59360K20644A37342J24473L62360k47350J40918k39377m7290
$$ plain form
17180 102002 247588 463378 254827 473804 59402 247780 181486 296603 122332 119361
17170 119361 14297 638030 368219 128612 433817 335244 341592 241656 292278 -35815 532647
17158 441125 287319 248073 286496 142536 179471 201382 101192 214119 366365 -275823
17147 206885 194776 325513 315194 91262 209231 265111 164521 491540 210104 189125
17137 189125 227291 74306 230275 605761 -19197 286627 67866 82428 223092 638946
17127 638946 233857 305522 436138 136327 244411 377375 466731 212145 83230 357240
17117 357240 398877 134663 155747 423253 595216 129512 555157 499072 398616 -41666
17106 397310 349278 189918 410562 137342 261815 624175 376825 517743 278366 231076
17096B31076n0236M03178B68216R1708K68852B09165F5019K99818o3571K6798
17086C28064m0221R2314M5053o0626q9846K45321j50558R5410L2760j83287N1404
17075C65788J9466J41564B28394L04191j60652L05385l25107l1307j39555K74463
17065D55812m2768J57706k48631k4590l1693O6415l0966r754N2012P5881J11574
17054E30998A00975L05253j21206k1432K57688j08166A91075J17784Q2852J28416
17044E20127A89616L73999k08326K48565J27716j5744B89096R3642P1028k12622
17034B41144J59652J37070P840J46520j70240J6390Q2624L628o3595K46724l96958
17023D10799l9367q6612M55920j39659j33972n153K2996J96920l2252K61767D51935
$$ plain form
17096 231076 180840 584018 268216 359924 628776 209165 65019 364837 301266 328064
17086 328064 287843 380157 425210 364584 274738 520059 369501 464911 497671 314384 365788
17075 365788 385254 526818 228394 532585 371933 677318 352211 320904 181349 455812
17065 455812 413044 570750 322119 297529 265836 332251 301285 291531 343543 419424 530998
17054 530998 100975 406228 285022 263590 521278 413112 191075 308859 391711 520127
17044 520127 189616 563615 355289 603854 731570 715826 289096 382738 453766 241144
17034 241144 400796 537866 545706 692226 521986 538376 621000 624628 561033 807757 410799
17023 410799 371432 284820 740740 601081 467109 461956 484952 681872 649620 911387 451935
17011E91751J98158M3690M1123j53804J52998j43698j17004M6619j03078K01446
17001G58201L9311j96033O4917j23257K37368k6300l00335N83910m02773P6574
16991G11583n1248P8188n0667J17527j14853n5294L31106m37773M91445J40365
16981A160379E05633K22228M64898l54407j17437k90191O06835j04998j14503
16972H18058J12090J12192k1579j30325P3611r8399j9083M6260k05052L546j96083
16961D95236L4655M31588k49498O7050J48696J4886O8580k63840M83833l80860
16951H50326L26352j14443j86428k04576K91355J4079J74591k62114L04228l86588
16941H06782M56473n8308j87346K69065l05924K15056j31675k9408R3934l1137
$$ plain form
17011 591751 789909 833599 874722 720918 873916 730218 613214 659833 556755 758201
17001 758201 797512 601479 666396 543139 780507 754207 453872 1037782 635009 711583
16991 711583 660335 738523 687856 805383 690530 635236 966342 528569 1020014 1160379
16981 1160379 505633 727861 1192759 838352 720915 430724 1037559 932561 818058
16972 818058 930148 1042340 1020761 890436 964047 865648 846565 892825 687773 691319 495236
16961 495236 529891 961479 711981 779031 927727 942613 1011193 747353 1231186 850326
16951 850326 1176678 1062235 875807 671231 962586 976665 1151256 889142 1193370 806782
16941 806782 1263255 1204947 1017601 1286666 980742 1195798 1064123 1034715 1128649 1097512
16931A097512M32068m4763n56294M32884K05032l57655j0498N2054j28560L83148
16921A504928R3220l13210m09699O92476m33689K12012j16999j24753J60333R9823
16911A364442k53446M31836j33092Q0648j14332k33155k3509K24268P5561O6204
16901A485425j44456m9768L44381k78001M04713o1524J95947j75697p348J76584
16891A890256m47387O45641l81606j06245J27232K63591j88017R8894j48137J59469
16881A913691K66344k01563k4697K14149K11352k81822l0361l0858L75500J97039
16871B608774l29768J13281p8971O8070m98657L17959J9922K06087L88266m42837
16861B372126M6674L66047k31187P9464J48527j06318L23521l41511K39823k13695
$$ plain form
16931 1097512 1529580 1484817 928523 1361407 1566439 1208784 1198286 1250340 1121780 1504928
16921 1504928 1598148 1284938 875239 1567715 1134026 1346038 1229039 1104286 1264619 1364442
16911 1364442 1110996 1542832 1409740 1490388 1376056 1142901 1119392 1343660 1419221 1485425
16901 1485425 1340969 1291201 1635582 1357581 1762294 1700770 1896717 1721020 1713672 1890256
16891 1890256 1442869 2088510 1706904 1600659 1727891 1991482 1803465 1902359 1754222 1913691
16881 1913691 2180035 1978472 1953775 2167924 2379276 2097454 2067093 2036235 2411735 2608774
16871 2608774 2279006 2392287 2313316 2381386 1882729 2200688 2220610 2426697 2814963 2372126
16861 2372126 2418800 2784847 2553660 2633124 2781651 2675333 2998854 2657343 2897166 2683471
16851B683471L95987k34722j96649O56183r2459J17374j42085L8655L4173k7848
16841C232080J88514K03924K6652j84698K38548J35873N7177k69699N12308j2
16831D140667K25035j05270m2183J59273o5681j05707N93597m62368L84454n8649
16821D663168N26023p37382R61730m76705J04495N54776K6169k26442M12886q933
16811E799785M41597k14255J08198L3333L48302P8528K93321R6681j77157N29827
16801G338160j33604M45732J30242N8546o1554N43061M42594k29189K18144J43495
16791H895627K53302N81917L51417P1215K56403J18915N34779M76635Q3399J63493
16781A1787102O99573J04609O62008L71269L22390N00809K15734O73531M36249
$$ plain form
16851 2683471 3079458 2844736 2648087 3304270 3211811 3329185 3187100 3225755 3259928 3232080
16841 3232080 3420594 3624518 3651170 3466472 3705020 3840893 3898070 3628371 4140679 4140667
16831 4140667 4365702 4260432 4218249 4377522 4311841 4206134 4799731 4337363 4721817 4663168
16821 4663168 5189191 4451809 5413539 4936834 5041329 5596105 5622274 5395832 5808718 5799785
16811 5799785 6241382 6027127 6135325 6168658 6516960 6595488 6888809 6985490 6808333 7338160
16801 7338160 7204556 7650288 7780530 7839076 7777522 8320583 8763177 8533988 8752132 8895627
16791 8895627 9148929 9730846 10082263 10153478 10409881 10528796 11063575 11540210 11623609 11787102
16781 11787102 12486675 12591284 13253292 13624561 13946951 14447760 14663494 15337025 15773274
16772A5773274M39934O68424O18318M26516N65762Q78956P58345Q70587Q50624
16763B1850740O87607J001163R92659P13732J242339J013676J267342J346214
16755C0115472J412287J189969J688079J452984J916128J522270J985137K061145
16747D3343471K238753K334551K720076K323001L077582L268164L110115L600325
16739F6016038L966083L866385M259258M787150M801821M907323N784551N464566
16731A03853175O052344N852740P173491O203769O743784O325243O817817O048180
16723A55070543N638100N028064M627080L509225K307730J748018l98689j80000
16715A77350071j920292l315308m182920m626557n769159n686466o700992o436230
$$ plain form
16772 15773274 16213208 16881632 17499950 17926466 18492228 19371184 20129529 21000116 21850740
16763 21850740 22538347 23539510 24532169 25245901 26488240 27501916 28769258 30115472
16755 30115472 31527759 32717728 34405807 35858791 37774919 39297189 41282326 43343471
16747 43343471 45582224 47916775 50636851 52959852 56037434 59305598 62415713 66016038
16739 66016038 69982121 73848506 78107764 82894914 87696735 92604058 98388609 103853175
16731 103853175 109905519 115758259 122931750 129135519 135879303 142204546 149022363 155070543
16723 155070543 160708643 165736707 170363787 173873012 176180742 177928760 177530071 177350071
16715 177350071 175429779 172114471 167931551 163304994 157535835 151849369 145148377 138712147
16707A38712147o928452o134119p040100o542633o023167o073080n795431n470939
16699H8704226n094032m753956m397761m385211m103186l356195l644099l099369
16691E5870417k822952l085054k290728k340402k276623k294731k008340k108968
16683C6642619j547660j338332j651346j453198j282064j428630j027058j332028
16675B5582303p52239r10258j466855p18491q40148r37691o68760o62000p66459
16666A7859402k22247o30226p93776l92088m47619n74860n64860l58216m83728
16657A3391782o48222j13362m95974l68791j49808p69858K70125o92921l56051
16648A0066920j22732l51927L3229o90959N8375n45963J29077j72925k47819l92606
$$ plain form
16707 138712147 131783695 125649576 118609476 112066843 106043676 99970596 94175165 88704226
16699 88704226 83610194 78856238 74458477 70073266 65970080 62613885 58969786 55870417
16691 55870417 53047465 49962411 47671683 45331281 43054658 40759927 38751587 36642619
16683 36642619 35094959 33756627 32105281 30652083 29370019 27941389 26914331 25582303
16675 25582303 24830064 23919806 22452951 21734460 20894312 19956621 19287861 18625861 17859402
16666 17859402 17637155 17006929 16213153 15821065 15373446 14798586 14233726 13875510 13391782
16657 13391782 12743560 12630198 12134224 11765433 11615625 10845767 11115892 10422971 10066920
16648 10066920 9944188 9592261 9625490 8934531 8992906 8446943 8576020 8403095 8155276 7762670
16638G762670n4622l36854l67988Q1364j01099k55771k75424l05214j85998J85782
16628F146846J71018n09625k10090J38820K39712p26618j42700L9313j27687j77435
16618D841554J47351n69340o3402J6295k68827K50058k70610k80302M07767L8766
16608D249310k15686j32895j65070r3076j85884K31051k76294m0438R3004k38525
16598C225497l8572J09051k67764q8227K18195k9352m6977j49306J40787k07415
16588B865917N5002k40571o7763N9273M0139q0733j81218J86924j43279p4898
16578B418793m41934K22866j39314J38369P4491j1389O2563n65375K21151K88658
16568B268879R7410j98114j62898k72157K55045p6256o1965J02704q0200j73303
$$ plain form
16638 7762670 7708048 7371194 7003206 7084570 6983471 6727700 6452276 6147062 5961064 6146846
16628 6146846 6317864 5808239 5598149 5736969 5976681 5250063 5107363 5146676 5018989 4841554
16618 4841554 4988905 4419565 4356163 4372458 4103631 4353689 4083079 3802777 4210544 4249310
16608 4249310 4033624 3900729 3735659 3642583 3456699 3687750 3411456 3371018 3464022 3225497
16598 3225497 3186925 3295976 3028212 2939985 3158180 3128828 3081851 2932545 3073332 2865917
16588 2865917 2920919 2680348 2612585 2671858 2711997 2631264 2450046 2636970 2493691 2418793
16578 2418793 1976859 2199725 2060411 2198780 2273271 2261882 2324445 1759070 1980221 2268879
16568 2268879 2366289 2168175 2005277 1733120 1988165 1911909 1849944 1952648 1872448 1699145
16558A699145J92519j26470k46485K95055m90032K42116J1530J25084k92891K81452
16548A691023k20801n7029p690P2180M51821o95929L88246l88693M08969m63873
16538A178224K07478k57908K83777l01552K54617j56101n8670k63692P16491k99461
16528A303203j50308K73791j48988K4284J9653k79838q1932J24056P2686l27452
16518H29155M66109j27308M6858j65277k2178l9916J62239r2348m29053L15235
16508I43516K89408j63320j91383N5378j46831j02279O15442m33042J31932k87098
16498G11723P2227O6382j30818Q4029J89526n8126j21364j24617q4752M7756q7898
16487E64068L15504L1523m6696J26281k75287J41537J1511n1938J05119q2811
$$ plain form
16558 1699145 1891664 1765194 1518709 1813764 1323732 1565848 1577378 1702462 1409571 1691023
16548 1691023 1470222 1413193 1405503 1477683 1929504 1233575 1621821 1233128 1642097 1178224
16538 1178224 1385702 1127794 1411571 1110019 1364636 1208535 1149865 886173 1602664 1303203
16528 1303203 1152895 1426686 1277698 1301982 1321635 1041797 959865 1083921 1156607 829155
16518 829155 1295264 1167956 1214814 1049537 1027359 987443 1149682 1057334 628281 943516
16508 943516 1232924 1069604 878221 933599 786768 684489 1299931 866889 998821 711723
16498 711723 783950 850332 719514 803543 993069 934943 813579 688962 604210 651966 564068
16487 564068 879572 911095 864399 990680 715393 856930 868441 816503 921622 838811
16477H38811J818J6735j7307n4412r529k92482K95179P4088L4978k81538M884
16466F11225L15817k38160k72140L57729C79098J61439J3995K08921o2771j88114
16456E12568M10013l69816J873P6176K37603k73331r4141Q8782o5886K45859n5826
16445G13874p7461j29518J41344j63955J25365r0538M1220B44702K33866J80769
16435F59337q7031j49558j45520K7357J10070k7997K00676g1692D96903j8873
16425D78030K49770o5995k67813K91632l7735n4920r6416l2658j47046L23028
16415F39877k13097A64246J72441N7338j43221K68169m2401J72154k67728K20832
16405F01830B22809G2283L32403j8107m8130n9015J17120j46386n9672L11439
$$ plain form
16477 838811 840629 857364 840057 785645 776116 483634 778813 852901 887879 606341 611225
16466 611225 927042 688882 416742 774471 379098 540537 554532 763453 700682 512568
16456 512568 922581 552765 554638 630814 868417 595086 500945 589727 523841 769700 713874
16445 713874 636413 506895 648239 484284 609649 519111 560331 244702 478568 659337
16435 659337 572306 422748 277228 304585 414655 386658 587334 -71692 496903 478030
16425 478030 727800 661805 393992 685624 647889 592969 496553 463895 316849 639877
16415 639877 426780 164246 336687 394025 250804 518973 476572 648726 380998 601830
16405 601830 222809 72283 404686 386579 338449 279434 396554 250168 190496 501935
16395E01935r3514K02943E4228N37797j51152K84214k48114r6991J23983j74001
16385C29964J53687R4929o4165B13408K89770p9430r2224K33461k49304A41852
16374C94362j63509B7163K52568r8582o8314L61699j73527J21247J01930h0283
16363C13249H426O703J0330K43188K1507J01601A75741g4317A51196K33107a29798
16351D76298b1809A13662J70538k5545m071r6972A7219N7113K184M6023Q5100
16340B07639l3301J51684J92172j25032C9953M72373j84844A05185J15262K9141
16330B49588K15071A2533O0140J46757j0981k2130m93M4941N6859j09632q4520
16319I3474a22547D39427j41409I7165J32552l3736N4387B988R5863K26975E9541
$$ plain form
16395 501935 408421 611364 54228 592025 440873 725087 476973 379982 503965 329964
16385 329964 483651 578580 514415 213408 503178 423748 331524 564985 315681 141852
16374 394362 230853 27163 279731 181149 112835 474534 301007 422254 524184 -80283
16363 313249 8426 15129 25459 268647 290154 391755 175741 -74317 151196 384303 -129798
16351 476298 -21809 113662 284200 258655 254584 157612 17219 74332 76516 122539 207639
16340 207639 174338 326022 518194 393162 39953 512326 327482 105185 220447 249588
16330 249588 464659 12533 72673 219430 208449 186319 185826 230767 287626 177994 93474
16319 93474 -122547 439427 298018 97165 229717 195981 250368 2988 98851 325826 59541
16307d9082A61961J31253A35263R3945A6987R5232l784J23330f014A43231m2547
16296A00684K41900F2780K16974A7578K17224j04207k9346k0006N4532K44255
16286C80030J27132L293A51689M0331q7798b1208A9304J89940J01374j1323O9659
16275C68954A19820g3678A84199O844B1033L13043q2893A03676B0904G903L26435
16264C34338F9667J56899a39154A14258J65072i5111B23017n9343e659A18518
16253B49159l0809h440B01612H9340J39781k4559J880P8485k8850o4328B8632
16241B32971L295b1163A89508Q127E9393h4237C26845A43878n204J25982R6017
16230C60673A06307F950J25890f4686j66773E0986Q72K05750N4408k121J75602
$$ plain form
16307 -49082 161961 293214 135263 229208 16987 112219 108435 231765 -6014 143231 100684
16296 100684 342584 62780 279754 17578 234802 130595 101249 81243 135775 380030
16286 380030 507162 510455 151689 192020 104222 -21208 19304 209244 310618 299295 368954
16275 368954 119820 -73678 184199 191043 21033 334076 251183 103676 20904 7903 334338
16264 334338 69667 226566 -139154 114258 279330 -95111 223017 163674 -5659 118518
16253 249159 218350 -8440 201612 89340 229121 204562 206442 284927 256077 191749 28632
16241 232971 236266 -21163 189508 197635 59393 -84237 326845 143878 138674 264656 360673
16230 360673 106307 6950 132840 -64686 -231459 50986 51858 257608 312016 309895 485497
16219D85497a33507B02104e7804A77670P7535b26993B3244K53733j08724r483
16209A58770J68090a12534k44374J24792N2200B57913a16980j54070f6933C69384
16198C03897A30323f9791q3307A27928J3432J01938H141J184P5900b57966G2820
16186A16857M8312E2869L751P8534i9727k1582h176H7786K20394F2241p831a09704
16173c10341A16710Q8579B3697h5153k7449m7736O8092c1068I0487b8600B64876
16161a0893C52801B4251a98449B15666a00835A31057N053J17272a09926j21783
16151b31709A14797A1118O7214a4205B2909J66970i8992J0180m5562A76446n7146
16140A19300d2079n0445B72915a99332M2550d7368C49317b42582m1092E5189B4634
$$ plain form
16219 485497 -133507 202104 -57804 177670 255205 -226993 23244 276977 168253 158770
16209 158770 326860 -112534 -356908 -232116 -179916 257913 -116980 -271050 -66933 369384
16198 303897 130323 -69791 -153098 127928 141360 243298 8141 9325 85225 -257966 72820
16186 116857 165169 52869 56620 135154 -99727 -121309 -8176 87786 308180 62241 54410 -109704
16173 -310341 116710 205289 23697 -85153 -112602 -160338 -92246 -31068 90487 -28600 264876
16161 -10893 352801 24251 -198449 215666 -100835 131057 136110 253382 -109926 -231709
16151 -231709 114797 11118 78332 -14205 22909 189879 -98992 -88812 -134374 176446 119300
16140 119300 -42079 -92524 272915 -199332 -156782 -47368 349317 -242582 -283674 55189 24634
16128f2722B1683a88922B53524a4209B22510B9114a6015q3445I9166J43425c07839
16116A40310b3605F3549A9590K7892e0339I720a72291a4973k502A7175g6051F3622
16103a5789m8721H9234J41174a86636A1502L07440a59484A71623C8068R8984J95288
16092C32340a30508h850j47362B47431c4833A71509J49108b15456a6573A01309
16081B37260F3038a98l91424a013j35732l7602j89084H1570a71582f7760B4588
16069A22091a78718j01550e0252K778j50290A47160C5812O582a13791a5714A96460
16057E8913L03714A62749f7256p483b1563j08385m4857j65251a30611B18296o2014
16046A56282a16723A8493a7761A83540b81514A69260a12291a8806j2416A40546
$$ plain form
16128 -62722 21683 -188922 253524 -14209 222510 29114 -16015 -99460 99166 242591 -307839
16116 140310 -23605 63549 19590 47482 -50339 9720 -172291 -14973 -17475 17175 -76051 63622
16103 -15789 -64510 89234 230408 -186636 11502 318942 -159484 171623 38068 137052 332340
16092 332340 -130508 -8850 -156212 247431 -34833 171509 320617 -215456 -16573 101309
16081 237260 63038 -198 -391622 -1013 -136745 -174347 -363431 81570 -171582 -67760 24588
16069 122091 -178718 -280268 -50252 -47474 -197764 147160 35812 42394 -113791 -15714 196460
16057 58913 362627 162749 -67256 -74739 -21563 -129948 -174805 -340056 -130611 218296 156282
16046 156282 -116723 18493 -17761 183540 -281514 169260 -112291 -18806 -31222 140546
16035A87935a78693O6041C95537A04671J11173E350f9696A33652a06254C1146
16024B04233d6342B69041K3796I3524L40172a2768r0995F8944h8433C0755J39088
16013A69843n3448g2885j77369J23000b9623B57433A24498E8794a99886A98416
16002a48686j26846O4940l0422o7937g0007m2463K5764j20229A87044b3273k8252
15991e1525G9472J62223a39818I4674c8159n0562D15J28977K42740j07182K825
15980B67775q1766K2563b16649A26360d1686E4501c36122H8954c33640C05347
15969b40845e4753B20625c36821h8353j12884r0645f6562k24140F6621p936J2044
15958G0729J84345a50080d290A5876O3615b12914D0481a32140k14376P8511j3993
$$ plain form
16035 187935 -178693 -112652 395537 104671 215844 5350 -69696 133652 -106254 31146
16024 204233 -46342 269041 292837 93524 433696 -12768 -103763 68944 -88433 30755 169843
16013 169843 116395 -72885 -250254 -127254 -29623 257433 124498 58794 -199886 198416
16002 -148686 -275532 -210592 -241014 -308951 -70007 -112470 -86706 -206935 187044 -23273 -51525
15991 -51525 79472 241695 -139818 94674 -38159 -88721 415 129392 372132 264950 267775
15980 267775 186009 208572 -216649 126360 -41686 54501 -336122 88954 -333640 305347
15969 -240845 -54753 220625 -336821 -88353 -201237 -291882 -66562 -290702 66621 58685 70729
15958 70729 255074 -150080 -4290 15876 79491 -212914 40481 -132140 -346516 -268005 -281998
15947b81998i9439k36616Q0097A54017a46529C5421A4314i6955a0309j09693k26702
15936c46704J00244Q1239j70197I2028j3721c60869h1700j2023k4888G9112d20850
15924B7011i4913A46840C2838b43024B9413a72063B24820a4428C1032f6627n3638
15913a20265D4907n782i9456C92377h7965A93462c92424C3893d44212f945k86963
15902b93908o9589C88756A12153a54607C417a53467n2321B88620a92693I4745
15891A49339b1975B1088b56805F8713b19440D8252B1011a5872k14635E7647b12869
15879B26419A7657c69058a6550j25680l9458G8012F653N8014J60759F7941J508
15868F9449e9617j65397b1607k5655D43136b93820a04565D0125n300b06688j92183
$$ plain form
15947 -281998 -99439 -336055 -255958 154017 -146529 35421 14314 -96955 -10309 -120002 -346704
15936 -346704 -246460 -165221 -335418 92028 78307 -360869 -81700 -93723 -118611 79112 -420850
15924 27011 -94913 146840 32838 -243024 29413 -172063 224820 -14428 31032 -66627 -120265
15913 -120265 44907 39125 -99456 392377 -87965 193462 -392424 33893 -444212 -6945 -293908
15902 -293908 -363497 388756 112153 -154607 3417 -153467 -205788 288620 -192693 94745
15891 149339 -21975 21088 -256805 68713 -219440 48252 21011 -15872 -230507 57647 -212869
15879 226419 17657 -369058 -16550 -142230 -181688 78012 6653 64667 225426 67941 69449
15868 69449 -59617 -225014 -21607 -47262 443136 -293820 -104565 40125 34825 -206688 -398871
15857c98871A02911J30270a63662k3995A79709B8404h8111j12614F895O9450B6298
15845c9821E424g3359k71441A53938c5285l1945j16686j24924J35093M0213A18956
15833A73891b09856a8043j7394A98945o6464b17078A7969M5329b9022l06281J61887
15822a73416m4445G4538a97430R4048e569k06565f754o9828A26067a23622j28440
15811b52062G3816c56732A93002K11776b29941a11244h455k27904I4693f5661
15800A92814D0240a54807b5579A12798R5886a70751e2909A56365D7861P271Q9401
15789A44533g934B3215a50635k4193g3695B1921b32314C6051d4033k91707a36213
15777b54144B66725b12560j3586B5150K99423a70327H6254K11049c5924B6862
$$ plain form
15857 -398871 102911 233181 -163662 -187657 179709 28404 -88111 -200725 6895 76345 26298
15845 -39821 5424 -73359 -344800 153938 -35285 -67230 -183916 -308840 -173747 -133534 118956
15833 173891 -209856 -18043 -35437 198945 132481 -217078 17969 63298 -29022 -335303 -173416
15822 -173416 -217861 74538 -197430 -103382 -5569 -212134 -6754 -76582 126067 -123622 -252062
15811 -252062 73816 -356732 193002 404778 -229941 -111244 -8455 -236359 94693 -65661
15800 192814 40240 -154807 -25579 112798 208684 -170751 -52909 156365 47861 55132 144533
15789 144533 -7934 23215 -150635 -174828 -73695 21921 -232314 36051 -44033 -335740 -136213
15777 -254144 266725 -212560 -226146 25150 324573 -170327 86254 297303 -35924 26862
15766C38404E7314a08154r9858G0287L4701b12220B45695G6079a1337D0039g8986
15754D748M1628j5865a44743c6752l36134B08603a28437K7888B53685f0056I5247
15742c54010C5781K12210n7597b88853A63472F8435j6415b76486G375a74593j8150
15731a92743Q363a9905A9255b32559B26316a06901C4404K20709E1557J528J73048
15720B26133a22833B4947a75726P7455D7781a42223A36377d77719A17143b6231
15709c71112g1585A21079a46117B60814b17973g3089e882k42649R8102B23187
15698G299h3421l8031j35354a18047j36772A20457J50899n9189G9444a53233C14
15686a40769B33452b17030G2119o238B5007r22L05374A34683i3264c1961m0748
$$ plain form
15766 338404 57314 -108154 -208012 70287 104988 -212220 245695 76079 -11337 40039 -78986
15754 4748 46376 30511 -144743 -36752 -372886 208603 -128437 -100549 253685 -60056 95247
15742 -354010 35781 247991 190394 -288853 163472 68435 52020 -276486 7375 -174593 -192743
15731 -192743 -184380 -19905 19255 -232559 226316 -106901 34404 255113 51557 53085 226133
15720 226133 -122833 24947 -175726 -98271 47781 -142223 136377 -477719 117143 -26231
15709 -371112 -71585 121079 -146117 260814 -217973 -73089 -5882 -248531 -150429 223187
15698 7299 -83421 -121452 -256806 -118047 -254819 120457 271356 212167 79444 -153233 314
15686 -140769 233452 -217030 72119 65881 25007 24085 329459 134683 -93264 -31961 -72709
15675g2709f098D1295a6873A87405J45537a18044A43608m4589a17265j43925G0916
15663A17181B5730b6931J0202l96011a7264j55337C81209a33465B5789J90229
15653B16018n2581p5534a6999j6719o9063l68300A28921Q1268h4048b3117A54698
15641f4521B4556d4151A29661J87994a03782l8419J8482m4375q1088P6512j11
15630a72781C8830n78m336e0386I4961a27018A76858c90474a12698A32165m1173
15619I0992n242c4944k02583N8371A57538m368H585b10176a2137k32161f7955
15607B14767i0033E3137g5157A16865j3439M0982a52313o8308L4267Q1872B9223
15595d59873f4820j62310B94382e8430j72797A20303c29360A40100b3229j02137
$$ plain form
15675 -72709 -6098 41295 -16873 187405 332942 -118044 143608 99019 -117265 -261190 70916
15663 117181 25730 -26931 -16729 -412740 -17264 -172601 381209 -133465 25789 216018
15653 216018 163437 87903 -16999 -33718 -102781 -471081 128921 210189 -84048 -23117 154698
15641 -64521 24556 -44151 129661 317655 -103782 -142201 -123719 -168094 -249182 -172670 -172781
15630 -172781 38830 38252 33916 -50386 94961 -127018 176858 -390474 -112698 132165 90992
15619 90992 85750 -34944 -237527 -179156 157538 153170 8585 -210176 -12137 -244298 -67955
15607 214767 -90033 53137 -75157 116865 103426 144408 -152313 -220621 -186354 -104482 29223
15595 -459873 -64820 -227130 294382 -58430 -231227 120303 -329360 140100 -23229 -125366
15585a25366G0249g8958j3984A3370b65064j775B54298J12934r2946c62807C6812
15573a36093B58895p4689a24671F4962j508b96504K7694a24534p0225L6368A93642
15561F0851p383j4882h3489A052b71798O3644A23662H375J56883a36004R898q087
15549a34193M9934a8439l230j5954l1355m8297I4245b5755A47021o1495a91307
15537A14457d3461B16657A01308b46294F1240L39126b38648b3307o8924B09307
15526C6083L14879j48074b32883R9696f1466j23480j67061h0375k9826I3448f9006
15514c9470A00060b40328R8331B0071a16921b9801B74734h6775k99684A6507O4981
15503H1488J1995M4658J08164e9500K0539C04371i6721b7142k48401a34583A11718
$$ plain form
15585 -125366 70249 -78958 -92942 13370 -265064 -266839 254298 367232 274286 -362807 36812
15573 -136093 258895 184206 -124671 64962 63454 -296504 -268810 -124534 -194759 -158391 193642
15561 60851 53468 38586 -83489 1052 -271798 -208154 123662 8375 165258 -136004 -126106 -134193
15549 -134193 -84259 -18439 -21669 -37623 -68978 -117275 94245 -25755 147021 85526 -191307
15537 114457 -43461 216657 101308 -246294 61240 400366 -238648 -23307 -92231 209307
15526 36083 350962 202888 -232883 -133187 -61466 -184946 -352007 -80375 -110201 93448 -69006
15514 -39470 100060 -240328 -141997 20071 -116921 -29801 274734 -86775 -386459 16507 81488
15503 81488 93483 138141 246305 -59500 -38961 304371 -96721 -27142 -275543 -134583 111718
15491A35189l5301K76302j45697B7233a24384k2395F3929O1196c29344J33989
15481a95355p370p091B02886d30140c6802B56783d45490B85299D3904h9767B319
15469a2633k79294I9271i3244l44485J43641a14788n2028b638j31991D65551j64124
15458C01427j15088b3423k53808H5709M4431J44796A03698j4300L8776C0971R7901
15447A28872D1543a67178A14561K3315P7052b62821b0186B38511a55698E7167
15436B59007F5433J03882k7755i9474C9484c92593A2728J0542a21461A9463a4822
15424C66865a68385a7927B07643a26296C46904A09628J94984E4327J06376a97796
15413F8789J80995J04929c50663h3122c9953l1959k4861A18878a20091H2381a08983
$$ plain form
15491 135189 99888 376190 230493 27233 -124384 -146779 63929 125125 -329344 -195355
15481 -195355 -202725 -209816 202886 -430140 -36802 256783 -445490 285299 43904 -89767 2319
15469 -12633 -291927 99271 -93244 -437729 -294088 -114788 -166816 -2638 -134629 465551 301427
15458 301427 186339 -23423 -277231 85709 130140 274936 103698 89398 128174 30971 128872
15447 128872 41543 -167178 114561 137876 214928 -262821 -20186 238511 -155698 57167
15436 259007 65433 169315 141560 -99474 39484 -392593 12728 23270 -121461 19463 -14822
15424 366865 -168385 -17927 207643 -126296 346904 109628 304612 54327 160703 -197796
15413 68789 249784 354713 -350663 -83122 -39953 -71912 -96773 118878 -120091 82381 -108983
15401A2103d8303j22445l5069G7437J63703b9002C77147a2115j50456j99932J0877
15390c51626h3059q1616e4290B35443b7418A7499J43468h8645j30734A4370a61315
15378A92938f1189E9954a1474H1847b1269H3713I142N7063N098b5027B14283G987
15365A09397M2367h2459j10228P1590a0371A26421a21009M1431f024C3707Q871
15354D2578J64426p1181K8385B8158b6283A60357b17535j87691B28296e339j39466
15343a44805k6054B74767A9729L36591j36895g2476j43165b2127A20020a17065
15332B3721J67367A1515Q0772h8088E5681i9482F4396a83008N356A88064m9911
15321A38153j0830O8261a45595C4964b24229j62596A5420b46647E6875a77488
$$ plain form
15401 12103 -48303 -170748 -205817 77437 241140 -29002 377147 -12115 -162571 -362503 -351626
15390 -351626 -83059 -164675 -54290 235443 -27418 17499 160967 -88645 -219379 14370 -161315
15378 192938 -61189 59954 -11474 81847 -21269 83713 9142 66205 71303 -25027 214283 7987
15365 109397 151764 -82459 -192687 -121097 -10371 126421 -121009 -79578 -6024 33707 42578
15354 42578 207004 135823 164208 28158 -26283 160357 -217535 -405226 228296 -5339 -144805
15343 -144805 -170859 274767 19729 356320 219425 -72476 -215641 -22127 120020 -117065
15332 23721 191088 11515 92287 -88088 55681 -99482 64396 -183008 -177652 188064 138153
15321 138153 127323 195584 -145595 34964 -224229 -386825 15420 -246647 56875 -177488
15310a43396K0531A35127c6625r6694H9907j1856b3249I9062b60749A99776b9114
15298G5071k8996a92662n5873H7867l5497h9032E957K33476J20146b60316B36238
15286a48665j2427C58574B2280a20250B46180C615L8763d48306a25134e517j58550
15275a64067C58125f100k7268l3465j44219o941C45815b3225l7944H5849N7501
15264A43350F5663M6545J8911i365A30779e085F7207M04776j80662J53780I3346
15252C38896E7531K3427L32013O27733n7850L13108l4357E27151A04206J1600
15242A15806L20434M8356B37941P65A0523e8726C40891a86892A69239a7870C63907
15230a54759A74054a0428j31201N8012B27656L268a43205B96655j32877g5012
$$ plain form
15310 -143396 -122865 135127 -36625 -133319 89907 78051 -23249 99062 -260749 199776 -29114
15298 75071 46075 -192662 -248535 87867 52370 -89032 5957 239433 359579 -260316 236238
15286 -148665 -161092 358574 22280 -120250 246180 3615 42378 -448306 -125134 -5517 -164067
15275 -164067 358125 -6100 -33368 -66833 -211052 -217993 345815 -23225 -61169 85849 143350
15264 143350 65663 112208 131119 -9365 130779 -5085 67207 471983 291321 445101 93346
15252 338896 57531 80958 412971 1040704 982854 1295962 1261605 527151 104206 115806
15242 115806 436240 484596 237941 238706 10523 -58726 340891 -186892 169239 -17870 363907
15230 -154759 174054 -10428 -141629 -83617 227656 230924 -143205 296655 163778 -75012
15219C39377G4759K7559K79433h4322A6922c7219j14156B29684a88452A54400
15208B12906a10513C69483j80672a10129B34523p702e5914C59576a3806B28981
15197A81744D0241c96814J89477C28542b39622J01402A57158a64281p5267a6033
15186I7975K91474A23071n3868g507j83090I4641g7996A5699d445l9326r2529
15175a36300e4482p1048A6019f2311j49946R8135E6947L65538B05796M6789l3604
15164B18981j5490d3087B8109L9714f4879A35602D3032h33q2462C11757I0728
15152D41442A67217J56240j57232a2909F8149K51115J87101a12536B8048J49718
15142A77766B1496a98979g71A22108j7681K50694a88090f2223m5928B07969M5653
$$ plain form
15219 339377 74759 102318 381751 -84322 16922 -37219 -151375 229684 -188452 154400
15208 212906 -110513 369483 188811 -110129 234523 226821 -55914 359576 -13806 228981
15197 181744 40241 -396814 -207337 328542 -239622 -138220 157158 -164281 -239548 -16033
15186 97975 389449 123071 69203 -7507 -190597 94641 -77996 15699 -4445 -43771 -136300
15175 -136300 -54482 -125530 16019 -62311 -212257 -114122 56947 422485 205796 252585 218981
15164 218981 203491 -43087 28109 67823 -64879 135602 43032 -833 -83295 311757 90728
15152 441442 167217 323457 166225 -12909 68149 319264 506365 -112536 28048 177766
15142 177766 21496 -198979 -771 122108 104427 355121 -188090 -62223 -108151 207969 253622
15131B53622b1812C6634b22520C49620A21413L7843p3643E427b73159A92029a18263
15119I4713m5718K11903j05096J06655b51882B2318L5217j7382P0198b9740I8408
15107C6497L0532l870J62782A0114K79862a3719B0113J12473o3945K87394K8948
15096C84983r5078c9442n661d617B73902m3730r8379c9694A64705F747L54206
15085C60953H5231B7336J59575C523a99381g8415K4572H5236P3772J0540K1911
15074A91459j3230K17397A03131J47963o9575c8934A88688J10818a28027B77100
15063D2894N8325e8647b2238D78505B28952c34731A57525a36876E6692c35896
15052B23461k1551a184j56660A96135J61307C5763J99415F6379J00159Q7245j7525
$$ plain form
15131 253622 -21812 36634 -222520 349620 121413 159256 85613 5427 -273159 192029 -118263
15119 94713 48995 260898 155802 262457 -251882 22318 57535 40153 110351 -29740 98408
15107 36497 67029 63159 225941 10114 289976 -13719 20113 132586 68641 356035 384983
15096 384983 289905 -39442 -45103 -4617 273902 230172 131793 -39694 164705 6747 360953
15085 360953 85231 27336 186911 3523 -199381 -78415 -53843 85236 159008 169548 191459
15074 191459 178229 395626 103131 251094 181519 -38934 188688 299506 -128027 277100
15063 42894 101219 -58647 -22238 478505 228952 -334731 157525 -136876 56692 -335896
15052 223461 201910 -1184 -157844 196135 357442 35763 235178 66379 166538 253783 236258
15041B36258B3716M6158K32630j16376J64680A71971e8065p7167A16962J55732
15031B72694I4877L76974j43115e8726D8491J79592F4576K90165a43412B28690
15020D42284d9219F7136J72727a4009B14153n4265k1922j9214L8334F4079L48154
15009D12233A44063L4299K60481H4530P4739o2000j5539d7659B00545p605q2693
14998A10247J6596D335R1417m1880a06354I2979J36247J1725A17955K71255j61473
14987B27737C9975J06278L8247f4129B08101R0411A31053J60886D7887J75956
14977B23843K69854p5665p0652H9306K80408F5982K61373A57619A9723f9765A03650
14965H5296l9960M92707A74147K74118A20925J07210D5492P5490k0771h8858F43211
$$ plain form
15041 236258 23716 69874 302504 186128 350808 171971 -58065 -135232 116962 272694
15031 272694 94877 471851 328736 -58726 48491 228083 64576 354741 -143412 228690
15020 442284 -49219 67136 239863 -14009 214153 159888 137966 118752 157086 64079 412233
15009 412233 144063 178362 438843 84530 159269 97269 81730 -47659 200545 192940 110247
14998 110247 126843 4335 95752 53872 -106354 92979 229226 240951 117955 389210 227737
14987 227737 39975 146253 184500 -64129 208101 298512 131053 291939 47887 223843
14977 223843 493697 418032 347380 89306 369714 65982 327355 157619 19723 -69765 103650
14965 85296 45336 538043 174147 448265 120925 228135 45492 120982 100211 -88858 643211
14953D53002k04791J58543I7242R372K97322j28333l2475A2734J69256l9881J49732
14942B91841F5022O28237H1171L73541j95875N177J20265A27218n9068J52804
14932B20954j9962J09879n7685J70134o2853m1665A04533J09816D7223M62581
14922E09804L9170A52941l7094K18807j19887j03448K48255q1298K08519j76325
14912C10470n6000D9953J53820K82563G5789J10291i337B88156M3565P8095j17048
14901B92768r7799L39078k4784B16776J19255R6722j39341K18766B07000K7880
14891B34880O9644J45554j95864J53657K00034B12454L32887k61162Q7047A23861
14880B48851M4334O5643K0068A83358L42397L2345j63370j16743K09185O7232
$$ plain form
14953 453002 248211 406754 97242 106614 403936 275603 243128 12734 181990 142109 291841
14942 291841 65022 693259 81171 454712 258837 264014 384279 127218 68150 220954
14932 220954 200992 310871 253186 423320 360467 318802 104533 214349 47223 509804
14922 509804 548974 152941 115847 334654 214767 111319 359574 278276 486795 310470
14912 310470 254470 49953 203773 486336 75789 186080 -9337 288156 331721 409816 292768
14901 292768 194969 534047 509263 216776 336031 432753 293412 512178 207000 234880
14891 234880 304524 450078 254214 407871 607905 212454 545341 284179 371226 123861
14880 248851 293185 358828 378896 183358 525755 558100 394730 277987 487172 554404
14870E54404L9893k35125J95418k0081g2657B3485Q8507Q374L68594L43073A29028
14858B81365J1275o2021J87941O4660p3502J9203o7852l2994J37962q5098P0601
14847D51540P1783k12375M03068k44592j46137R7865J43991A84386L08690q092
14837D84984J67703l07939l2116N9369R0982r4191k5197L23654l6674j90509K55107
14826F95173C44455L54237j92093m7421G2049K07218J55713j44002Q17137I8359
14815F9106K84625j24530L15574j06936J31911k80409P4543L1936K7151J44202
14805E67173J73880k30878J71682j63491J20221k17439K09114k74931R3676L3810
14795D82817J67452o7043n58N1527B25253L15875J65765j98379J01867L5815k41246
$$ plain form
14870 554404 594297 359172 554590 534509 -72657 23485 111992 120366 488960 832033 129028
14858 281365 292640 230619 418560 483220 409718 428921 361069 328075 466037 380939 451540
14847 451540 523323 310948 714016 469424 323287 421152 565143 184386 493076 484984
14837 484984 652687 344748 312632 372001 462983 368792 343595 667249 630575 440066 695173
14826 695173 344455 698692 506599 459178 72049 279267 434980 290978 1108115 98359
14815 69106 353731 229201 544775 437839 569750 289341 363884 395820 422971 567173
14805 567173 741053 510175 681857 518366 638587 421148 630262 355331 449007 482817
14795 482817 650269 583226 582668 634195 225253 541128 706893 508514 610381 646196 404950
14784D04950j30194L23782O783l00063M12317C48862L17032r7286K10212l35990
14774D42830p090Q1949j36082K178L48931j22228k91848J83824M46344k50320
14764F98488n1844p1708N1124k62702J98987B58757M50812j18070B42797L05335
14754E48132L05049m01622j03362M81336l69753L71783j02794p8790J75165j50657
14744F74487j51742J77445J11939K59462l64793o8228K01524j21706C24720M17078
14734G41798j88117K23924k68080J80001j28655P8417J29404j74540J21360Q8399
14724H03911L014k14659j25405R7911J21724L69287l96124R9010q4936L62580
14714A036313j58104o9496j79679P0229k52407L10126j98116Q4485K28929o7856
$$ plain form
14784 404950 274756 598538 605321 305258 717575 348862 665894 568608 778820 442830
14774 442830 435740 517689 381607 383785 732716 610488 318640 502464 948808 698488
14764 698488 646644 574936 626060 363358 562345 258757 709569 591499 242797 548132
14754 548132 853181 451559 348197 829533 459780 831563 728769 649979 825144 674487
14744 674487 522745 700190 812129 1071591 706798 638570 840094 718388 324720 741798
14734 741798 553681 777605 509525 689526 560871 639288 768692 594152 715512 803911
14724 803911 806925 592266 466861 564772 686496 1055783 659659 758669 673733 1036313
14714 1036313 878209 808713 629034 699263 446856 756982 558866 643351 872280 804424
14704H04424q1089J09218k16593r1755K07363J14421j88166L90581j87821j82206
14694F78377M12452l66129Q0402M74671o08163L18302k51820L1885n3562K90971
14684A007386J29542j35786K5108j70346l21007M62446j33150J34118l04121L84155
14674A078345j00676p4759K06915k42455R9412k16738P5941q1264O2023J0960
14664H17704K39935o8877J24110j29415L620j36892K98821k21916M05389l92490
14654I39989J6416j28647J07055L31657K27005G11184J18839K11479j32755M8811
14644I57558p0992K08458j50030J37785J62823m3714O8959K9150l41853L93602
14634A351746q8984L90L3043k49884J0643Q5970J86726l0821L71095m75901K66567
$$ plain form
14704 804424 723335 832553 615960 524205 731568 845989 657823 1048404 860583 678377
14694 678377 1090829 724700 805102 1279773 671610 989912 738092 769977 716415 1007386
14684 1007386 1136928 1001142 1026250 855904 534897 997343 864193 998311 694190 1078345
14674 1078345 977669 902910 1109825 867370 966782 750044 825985 744721 806744 817704
14664 817704 1057639 988762 1112872 983457 987077 850185 1149006 927090 1332479 939989
14654 939989 956405 827758 934813 1266470 1493475 711184 830023 1041502 908747 957558
14644 957558 886566 1095024 944994 1082779 1245602 1201888 1270847 1299997 958144 1351746
14634 1351746 1262762 1263152 1296195 1046311 1056954 1142924 1329650 1298829 1669924 1194023 1460590
14623A460590j64416j46848j32545J87081N41104m01214J0991Q2571k24180P1763
14613A284897k6968l1715N93664l3113l29222p2136J27743J38924K24692o08750
14603A268016J78303n1341L40927k96249K1073K32467p8253J7897l59594M47844
14593A721090n3437k67856K29846p5709o6993J80445J62759n78285N90934k77733
14583A565061j43251N31848j35383J55948J4543L61674l15366j94648M9679l345
14573A886760j73748K54928L72589q5233r0837J10595k48277J47195M63905m46249
14563B191628K58264p5209J08018M2277m8177O54021l89618K21697j54355L49834
14553C158380M71403M80728P24549O45373J955196L615204Q290200J5409044M913318
$$ plain form
14623 1460590 1296174 1149326 1016781 1203862 1744966 1343752 1354743 1437314 1213134 1284897
14613 1284897 1257929 1226214 1819878 1786765 1457543 1385407 1513150 1652074 1876766 1268016
14603 1268016 1446319 1394978 1735905 1439656 1460729 1693196 1614943 1632840 1273246 1721090
14593 1721090 1667653 1399797 1629643 1553934 1486941 1667386 1830145 1251860 1842794 1565061
14583 1565061 1421810 1953658 1818275 1974223 1988766 2350440 2035074 1840426 1890105 1886760
14573 1886760 1713012 1967940 2340529 2255296 2164459 2275054 2026777 2173972 2637877 2191628
14563 2191628 2449892 2374683 2482701 2524978 2476801 3130822 2741204 2962901 2808546 3158380
14553 3158380 3629783 4110511 4835060 5480433 7435629 11050833 19341033 34750077 39663395
14544C9663395j9398761I719162m566297j418949j025048o43445O6275J34578
14536B266276o93288N93869k67664J38356J89522k82550N47083n60620J16397
14527B047381J4718M18448k82752L18671j85013n6123O8736J55259P716l87614
14517B119427K62646L20015k38057L82709l28314R5467k15927L40964m06709M72661
14507B804882k61122J41671L19426j20626J02598r0058M3701J61383Q1924N7754
14497C241533M0684k90102j95069K69066j33865L62422J64429j54788k6029M97099
14487C775380l34742j95965M30294p1598j08578K66815j84100P071L35741L7758
14477C958076l79842J54098O1722k61186M28525J5401K35235k0046J94508l49411
$$ plain form
14544 39663395 20264634 9719162 5152865 3733916 2708868 2065423 2131698 2266276
14536 2266276 1572988 2166857 1899193 2037549 2227071 1944521 2491604 1930984 2047381
14527 2047381 2062099 2480547 2197795 2516466 2331453 2275330 2344066 2499325 2507041 2119427
14517 2119427 2382073 2702088 2464031 2846740 2518426 2613893 2397966 2738930 2332221 2804882
14507 2804882 2543760 2685431 3004857 2884231 2986829 2896771 2940472 3101855 3183779 3241533
14497 3241533 3282217 2992115 2797046 3066112 2932247 3294669 3459098 3304310 3278281 3775380
14487 3775380 3440638 3244673 3674967 3603369 3494791 3761606 3577506 3584577 3920318 3958076
14477 3958076 3578234 3732332 3794054 3532868 3961393 3976794 4212029 4191983 4386491 4037080
14467D037080N7081j6578J31443K08830o6988J47637k7729M82019K9036m11800
14457D570031J86986J12286l3722K01819K98299j18862p7905J62072j65094L31628
14447E467538j63843O1715L5785K45385K58001j93081O0761J56525q182J60223
14437F080827k28429L81160n2705L72955m10540K04924K32382Q8290K90396l3044
14427F926216Q4477k07523K34016J75521K71626k92927N67547j40178J10789m7090
14417G682474L98076N4980J93552J05539q2630k34909J91452J37060J76079M03558
14407I025231J12383K57828K10835L5748j98985N97846J29874k22906L94594j34119
14397A0208329N87856r8456J06608O39958m4472j56408P20998R2267K97582Q5058
$$ plain form
14467 4037080 4094161 4077583 4209026 4417856 4350868 4498505 4470776 4952795 4981831 4570031
14457 4570031 4757017 4869303 4835581 5037400 5335699 5216837 5138932 5301004 5135910 5467538
14447 5467538 5303695 5365410 5401195 5646580 5904581 5711500 5772261 5928786 5920604 6080827
14437 6080827 5852398 6233558 6180853 6553808 6143268 6348192 6580574 6668864 6959260 6926216
14427 6926216 7010693 6803170 7037186 7212707 7484333 7191406 7758953 7618775 7729564 7682474
14417 7682474 8080550 8135530 8329082 8434621 8351991 8117082 8308534 8445594 8621673 9025231
14407 9025231 9137614 9395442 9606277 9642025 9443040 10040886 10170760 9947854 10342448 10208329
14397 10208329 10796185 10697729 10804337 11444295 11399823 11243415 11964413 12056680 12354262 12439320
14387A2439320J70390J36K63083J58784J62339M42465K22265K83818K07866K77884
14377A4628350M15572O0193O58304p2298M63256O16420k95328P61924N59782k07528
14367A7588647O01567L13671L99659J37530Q64906K91869N24798M57133L75545
14358B1555325P80866q5604R60750L40547O45725M87927N23212O03825R83767
14349B6796340N60287K92759P99379J096670L05990P56516R30723P63160R46288
14340C3248112Q09448J046861R64010P06486J272181J205476Q86662J425989J068291
14331D2633516J279260J552561J169304J492827J824324J730435J541634J839922
14323E5063783J713953J833294K052338K252535K247784K200236K811927K448422
$$ plain form
14387 12439320 12609710 12609846 12872929 13031713 13194052 13636517 13858782 14142600 14350466 14628350
14377 14628350 15043922 15104115 15762419 15690121 16153377 16769797 16474469 17236393 17796175 17588647
14367 17588647 18190214 18503885 18903544 19041074 19905980 20197849 20722647 21179780 21555325
14358 21555325 22336191 22250587 23211337 23551884 24197609 24685536 25208748 25812573 26796340
14349 26796340 27356627 27649386 28448765 29545435 29851425 30607941 31538664 32301824 33248112
14340 33248112 34057560 35104421 36068431 36774917 38047098 39252574 40139236 41565225 42633516
14331 42633516 43912776 45465337 46634641 48127468 49951792 51682227 53223861 55063783
14323 55063783 56777736 58611030 60663368 62915903 65163687 67363923 70175850 72624272
14315G2624272K795316K831924K869457L456284L288315L492930L792901M012023
14307I9163422M039691M484850M830952N021330N287063N566590O221251N651567
14299A40266716O889412O775245P102423Q108562Q597304Q381966R045360R594823
14291B04761811J0013687J0643029J0860366J1903910J1789673J2209713J2975847
14284B85158036J2805246J3302469J3454987J3191715J3218544J2753009J1965373
14277C75849379J1638388J0400607Q961923P549368N124231K340749n5409j130679
14269D20678557j963779l398390m516512m916932p482402q704546j0386330j1375779
14261C67933887j2271171j2845977j3318341j3904285j3845796j3223316j3057563
$$ plain form
14315 72624272 75419588 78251512 81120969 84577253 87865568 91358498 95151399 99163422
14307 99163422 103203113 107687963 112518915 117540245 122827308 128393898 134615149 140266716
14299 140266716 147156128 153931373 161033796 169142358 177739662 186121628 195166988 204761811
14291 204761811 214775498 225418527 236278893 248182803 259972476 272182189 285158036
14284 285158036 297963282 311265751 324720738 337912453 351130997 363884006 375849379
14277 375849379 387487767 397888374 406850297 414399665 419523896 421864645 421809236 420678557
14269 420678557 418714778 415316388 410799876 405882944 398400542 389695996 379309666 367933887
14261 367933887 355662716 342816739 329498398 315594113 301748317 288525001 275467438
14254B75467438j2684104j2511483j2287096j1625815j0795735j0355668j0151692
14247A95055845r530433q614052q248798p638657p408184p088961o784422o129562
14239A33612776o119742n518508m792501n087565m810953m254792m704798l706678
14231I4617239l478990l488891l586239l402178k671425l071860k672515k532162
14223F9712979k589557k399359k535182j535166k187089j801390j948099j878810
14215E2838327j778638j097629j109442k246902j067695j821903j244547q91571
14207D1580000q14311j001002j093283j120750j562555o22748q57934p23848j102971
14198C2680598j209183o55685p19522q00528o02825m97425o86804r13609p38279
$$ plain form
14254 275467438 262783334 250271851 237984755 226358940 215563205 205207537 195055845
14247 195055845 185525412 176911360 168662562 161023905 153615721 146526760 139742338 133612776
14239 133612776 127493034 121974526 117182025 112094460 107283507 103028715 98323917 94617239
14231 94617239 91138249 87649358 84063119 80660941 77989516 74917656 72245141 69712979
14223 69712979 67123422 64724063 62188881 60653715 58466626 56665236 54717137 52838327
14215 52838327 51059689 49962060 48852618 46605716 45538021 43716118 42471571 41580000
14207 41580000 40765689 39764687 38671404 37550654 35988099 35365351 34507417 33783569 32680598
14198 32680598 31471415 30815730 30096208 29295680 28692855 28195430 27508626 26595017 25856738
14189B5856738l69923q30306m10817j90129r55759o33002l39670j60124q92383
14180B1074625k93101p53874j06353j86342q58240j88234m25126l50278j13926
14171A7799151o80039q8700m81158q76519K03446m12083j32735J07352n54499
14162A4884216k98877k17951l16952l84240j49853j86396j77261l10718k24054
14153A2617914l3621l36457j20659m26541j10384q5643K7866n95984K20736p45942
14143A0411285K20421j60553j65387j48337l77207Q6708k39029q1982O9328j21099
14133I494148l42900o1351m9389l54906M5016l52816m342N7281n6389m59662K4737
14122G939427j2208m7327l34452j0928k57177j77193J74159l12649J04189p765
$$ plain form
14189 25856738 25486815 24656509 24245692 24055563 23099804 22466802 22127132 21967008 21074625
14180 21074625 20781524 20027650 19921297 19734955 18876715 18688481 18263355 17913077 17799151
14171 17799151 17119112 17030412 16549254 15672735 15876181 15464098 15331363 15438715 14884216
14162 14884216 14585339 14367388 14050436 13666196 13516343 13329947 13152686 12841968 12617914
14153 12617914 12584293 12247836 12127177 11700636 11590252 11504609 11532475 10936491 11157227 10411285
14143 10411285 10631706 10471153 10305766 10157429 9780222 9866930 9627901 9545919 9615247 9494148
14133 9494148 9151248 9089897 9040508 8685602 8730618 8377802 8373460 8430741 8374352 7914690 7939427
14122 7939427 7927219 7879892 7545440 7534512 7277335 7100142 7274301 6961652 7065841 7058076
14112G058076l52372K75946p3154m90120J85486k47701M05592n86181O7243p2367
14102F170448l7210l06015K73850m11223l9599N1680l50331R8857q0602J58611
14092E528466P4544m90336L06895l26985M9801K91171l25806j49986P3191L27103
14082E358058l88869j10906j38157J50223k87194K5885j34399n4345K48708j74445
14072D494559j78765o9916J02048k68120j14712L05931k964m96840K72269m4974
14062C998516R4172P8801m94330J00968P9992M5679R5662k33811N0830k72131
14052C544348J29906k52993K69230m79762M42139l20754k1636M29126n65221L76249
14042C550632j51728r3670l27383K43041k80712J48165J22545j60743q4992L43770
$$ plain form
14112 7058076 6705704 6981650 6908496 6418376 6603862 6356161 6761753 6175572 6242815 6170448
14102 6170448 6133238 5827223 6101073 5689850 5650251 5701931 5351600 5450457 5369855 5528466
14092 5528466 5603010 5112674 5419569 5092584 5142385 5433556 5107750 4957764 5030955 5358058
14082 5358058 4969189 4858283 4720126 4870349 4583155 4609040 4474641 4420296 4669004 4494559
14072 4494559 4315794 4245878 4347926 4079806 3965094 4271025 4268061 3771221 4043490 3998516
14062 3998516 4092688 4171489 3677159 3778127 3858119 3903798 3999460 3765649 3816479 3544348
14052 3544348 3674254 3421261 3690491 3210729 3652868 3332114 3310478 3739604 3174383 3550632
14042 3550632 3398904 3305234 2977851 3220892 2940180 3088345 3210890 3050147 2965155 3308925
14032C308925k69058l27793J17614O7507J19470j16290o2858l61639M23116j55383
14022B743611k2132J29581m20640J25000M9468J92137l35909N8790k26039M99790
14012B793657p78414L72203J04549r6871j59180L6541J16272j62395j36019L18419
14002B408762n6075j6014N2039j09614K30650m39376j26725J89619k52448M24443
13992B305261k8278N43962K30799O21190K665655O525102J4796875J1510365j4429826
13983B4741105j0393395n574319k292906j408166p39914l97518o08493m2610l08127
13974B975657k29008M7959p8312j21182k81466k2571l40374M78988k25585Q8719
13964B292825l05457M6201K58044m50208M83186k83855K31249j68610n1129n9480
$$ plain form
14032 3308925 3039867 2712074 2829688 2897195 3016665 2900375 2837517 2475878 2898994 2743611
14022 2743611 2721479 2851060 2430420 2555420 2604888 2797025 2461116 2519906 2293867 2793657
14012 2793657 2015243 2387446 2491995 2395124 2235944 2272485 2388757 2226362 2090343 2408762
14002 2408762 2352687 2336673 2388712 2279098 2509748 2070372 1943647 2133266 1880818 2305261
13992 2305261 2276983 2820945 3051744 3672934 6338589 12863691 27660566 39170931 24741105
13983 24741105 14347710 8773391 6480485 5072319 4332405 3934887 3326394 3283784 2975657
13974 2975657 2746649 2794608 2716296 2595114 2313648 2291077 1950703 2429691 2204106 2292825
13964 2292825 1987368 2033569 2291613 1841405 2324591 2040736 2271985 2103375 2052246 1992766
13954A992766Q2948K32900l68155O7460L5195j46623J01289m61217K83868j67078
13944A653353Q4698j61074L46781j72352J6954J06313j46043k60861K13863M3240
13934A724872j48282K21911J21491k33725P6570l04052M12168j30789k01609j88642
13924A349913J69642J39598k16429J00360J13744k33156L03274l46987n4307o8757
13914A256895N21347l49326O5587p8376K07856J1045m04906J52432k67343K86237
13904A401448J39240k00518J30186k53463Q3914j49190K81577l50466q2171R9230
13894A099787J85525j07890j03994K88617j96361M16743l48135J57642j28989
13885A262945j82270K11347r4853K44384j21111k86363k34061N67997P7178n60218
$$ plain form
13954 1992766 2075714 2308614 1940459 2007919 2043114 1896491 1997780 1536563 1820431 1653353
13944 1653353 1738051 1576977 1923758 1751406 1768360 1874673 1728630 1467769 1681632 1724872
13934 1724872 1576590 1798501 1919992 1686267 1762837 1458785 1870953 1740164 1538555 1349913
13924 1349913 1519555 1659153 1442724 1543084 1656828 1423672 1726946 1379959 1325652 1256895
13914 1256895 1778242 1428916 1494503 1416127 1623983 1635028 1230122 1382554 1115211 1401448
13904 1401448 1540688 1340170 1470356 1216893 1300807 1151617 1433194 1082728 1000557 1099787
13894 1099787 1285312 1177422 1073428 1362045 1165684 1582427 1234292 1391934 1262945
13885 1262945 1080675 1292022 1197169 1441553 1320442 1034079 800018 1368015 1445193 884975
13875H84975N23758M3386j65002O8933n4946l27631J17845J58913l92678L24000
13865A181553J0109k4763n16699N60821m1409j04012J74953l63214K70486j84075
13855I63750K15104j95937J98509l72219M95153m58834J18300o3238j67972M07598
13845A140214n8895J79815n37496J33769J15661k06879M10782k89830K35932O1443
13835A184516k61957r2699K52956D73697N20607j64251K55525q6621j79512L196
13825H22641J97779L7655m62808M00557M4565L9884k92066K04182k29699K90509
13815A053199J3867m03716j02992N34349k46329m5728P0310l02990M7017J66865
13805G83852K09322j18575k16387K89100q2049J61908m29992L76318l43499K02611
$$ plain form
13875 884975 1408733 1452119 1287117 1356050 1301104 973473 1091318 1250231 857553 1181553
13865 1181553 1191662 1166899 650200 1211021 1169612 1065600 1240553 877339 1147825 963750
13855 963750 1178854 982917 1181426 809207 1304360 845526 963826 900588 732616 1140214
13845 1140214 1081319 1261134 723638 857407 973068 766189 1176971 887141 1123073 1184516
13835 1184516 922559 829860 1082816 473697 994304 830053 1085578 998957 819445 822641
13825 822641 1020420 1058075 595267 995824 1040389 1080273 788207 992389 762690 1053199
13815 1053199 1067066 663350 560358 1094707 848378 802650 872960 569970 616987 783852
13805 783852 993174 874599 658212 947312 865263 1027171 597179 973497 629998 832609
13795H32609M0690J63066l5752k79831O5358o671J73840j21740j04604M03730
13785A130695m36721K4341L4639K80656l27733J75707j70976N576K62545k06106
13775G72623n9363B51374R16869D97255L02806l30549K19532K80416j62440C74412
13764D19640L14045C13688N97788M7297l93839m8251j4758P9761J13209K8481
13754G23376J24479m4734C40013J18043J24510L42528j58159j70098L32225C83882
13743F42101l272j86744L3268j41147R3202L83645B77611J7002L27360J11754
13733G33727l07745J08203B46176K74684N9994k62291L71617j58187m1962R3128
13723E83159k15790J57700j00711Q2161K83639j52749J82985C66489M59857A40877
$$ plain form
13795 832609 873299 1036365 1000613 720782 786140 779469 953309 831569 726965 1130695
13785 1130695 693974 718315 752954 1033610 705877 881584 710608 716184 978729 772623
13775 772623 713260 251374 1168243 497255 800061 469512 689044 969460 807020 374412
13764 419640 733685 313688 911476 958773 564934 516683 501925 581686 694895 723376
13754 723376 847855 803121 340013 458056 582566 925094 766935 596837 929062 383882
13743 642101 638829 452085 485353 344206 437408 821053 277611 294613 621973 733727
13733 733727 425982 534185 246176 520860 580854 318563 690180 531993 490031 583159
13723 583159 367369 525069 424358 506519 790158 637409 820394 366489 826346 140877
13712D49228J2676J36569J66126J8461k46718K06925j46096J13507K8255C17734
13701D41737k6457q8203L74927j06983j44119m4678K23458N5567J21774j22253
13691F84770L16628m23540B85050J38770K38336p8047k49099j20567K07285L74125
13681G95853B59778L04836K6838j19782j99147L02077k09257L13674j80552Q851
13671E07316A97783M59579A50387M53878j85053M13406l61504j47758J08162j25685
13661C05833J85416M3164m4483L0157j00533J56358O0140J78078m05639m6699
13651C61792K5931n8483P5962j05776j21586J75040R5486p9705l4863L4068j55448
13640B12418K31849k8946k0j46743J55441j0968k0222K13540j89975o5624J2865
$$ plain form
13712 449228 461904 598473 764599 783060 536342 743267 597171 710678 738933 317734
13701 441737 415280 327077 702004 595021 450902 406224 629682 685249 807023 684770
13691 684770 1001398 577858 285050 423820 662156 584109 335010 214443 421728 795853
13681 795853 259778 564614 591452 471670 272523 574600 365343 679017 498465 507316
13671 507316 197783 657362 150387 604265 419212 832618 471114 323356 431518 305833
13661 305833 491249 534413 489930 520087 419554 575912 636052 814130 408491 361792
13651 361792 387723 329240 405202 299426 177840 352880 448366 368661 333798 367866 212418
13640 212418 444267 415321 415301 268558 423999 413031 392809 606349 416374 350750 363615
13629C63615J56778p5782K44263d9451C14075l7289p9511J09037n1767K03196
13619D57741m182k09474J86997j8189j14643n9486C3940N21244B27930B0184P13828
13608G34012C42942k129q1021q6934N21491B65493j5575P7925K53789k61325K2968
13597C43275j41054K81555C6626L4948J71775q3675J22927A08121J1704P7473
13587A97298k5369K43410R9444q5153j53024K41551A42796L06470A17206K23864
13577C41070M2314a9170B30986L08324B53288M8980A42774Q2691J61797j82220
13567B05042N43030l73417I3643K32324J15668q2283r8821L00406j44156j21540
13557B95241J34834j55043P0250D2220N18545k16527K46507k51588r8205J59408
$$ plain form
13629 363615 520393 444611 688874 -49451 314075 276786 197275 306312 254545 457741
13619 457741 453559 244085 431082 412893 298250 238764 33940 555184 227930 20184 734012
13608 734012 342942 340813 259792 172858 694349 265493 249918 327843 581632 320307 343275
13597 343275 202221 483776 36626 71574 243349 159674 282601 108121 119825 197298
13587 197298 171929 415339 514783 429630 276606 518157 142796 449266 117206 341070
13577 341070 383384 -19170 230986 539310 253288 302268 142774 225465 387262 205042
13567 205042 748072 374655 93643 325967 441635 359352 260531 560937 416781 295241
13557 295241 430075 275032 345282 42220 560765 344238 590745 339157 240952 400360
13547D00360J48253q7984N4943o4308j6389M3226L9350k01026a67834C99818G2275
13535D41909m6398j73708J24637N1747J62334j70374N4042q0593A70987l8661
13525A32326J07707J608J00369M3328J76162r4509C9614N76438k90206A51101
13514E11647k09338l4067O2918B674J1919N6597N14537j63970B4817M80255G4425
13502C95419N178L5206l7545A71512K14834j39101k1086I7550k0571P271L15578
13491C99828A34935L77408A04049O2854K94510j87076K27620m1580p7627A73927
13480C3832O6731K2044J00263j00738J79226q5097I1163L0856L09897l6645i8225
13468A86188J52111B5661O5656i4199A30429e9957A70183J59581o9367J91297
$$ plain form
13547 400360 548613 460629 515572 451264 434875 478101 517451 316425 -167834 399818 72275
13535 441909 395511 221803 346440 398187 560521 390147 444189 363596 170987 132326
13525 132326 240033 241641 342010 385338 561500 466991 39614 616052 325846 151101
13514 511647 302309 268242 331160 2674 14593 71190 585727 421757 24817 505072 74425
13502 395419 400597 435803 398258 171512 386346 247245 226159 97550 76979 84250 399828
13491 399828 134935 512343 104049 166903 461413 274337 501957 460377 382750 173927
13480 33832 100563 122607 222870 122132 301358 216261 91163 122019 431916 395271 -98225
13468 186188 338299 25661 91317 -94199 130429 -59957 170183 329764 260397 451694
13458D51694B09472d2950B08211K04243F7139O59141k46197k19271m9367K68574
13448D80019j87826H2282L8695N23547A45265L86027B64607q3942j3279B48L29116
13437C29364A25374J69218H0276J99240j25007h508C87174c5075B7716K30388
13427B58104D9186J65123N107d6947A93419L9983j12036J64971J61507j26994
13417C20850A43496J89515g0781C57130j13961p7536b1612A74195M1876J27490
13407C43561m3564D634K60610K33141j00076A80451K89024j87589p1722K5536
13397B35700J14992j31229g9087A48411J58255c25221A47736A123K77242a28967
13386G3243g8241C06018j4876I8707o447L27803B03408q6847J71087j0116o4370
$$ plain form
13458 451694 209472 -42950 208211 412454 67139 726280 480083 260812 211445 480019
13448 480019 292193 82282 120977 644524 145265 531292 264607 180665 167386 248 329364
13437 329364 125374 294592 80276 279516 154509 -8508 387174 -35075 27716 258104
13427 258104 49186 214309 219416 -46947 193419 233402 121366 286337 447844 320850
13417 320850 143496 333011 -70781 357130 243169 165633 -21612 174195 216071 343561
13407 343561 299997 4634 265244 498385 398309 180451 469475 281886 210164 235700
13397 235700 350692 219463 -79087 148411 306666 -325221 147736 1123 278365 -128967
13386 73243 -78241 306018 291142 98707 92260 420063 203408 116561 287648 277532 213162
13375B13162J05586n4760c766B24448K47825C3794L72508A13607J44048P9091
13365C36746L7242A72963J81649A60826Q6702K3703A27257g0099A80526q8553
13355I1973J58464a47465B82329A9977K43365B5799J01423O5175C4701d851A53991
13343B85965J91294J13367j93022P2904a71809C15271A7427K53937l7076K46731
13333D81019a46576B63735m0070L99052c6836B68501k4900A11872K92765G6816
13322A31005K97272a52748A89353J5702o3462J54231A21693C0498L99459H2235
13311C00674j23759J71530B3376J21668f953A30937h2817a0566B33419a11196
13300G2505L64179C5110J93061H3426d0992o7268I6720E23J44843a39908C60696
$$ plain form
13375 213162 318748 263988 -3766 224448 472273 33794 406302 113607 257655 336746
13365 336746 373988 172963 354612 160826 247528 271231 127257 -70099 180526 91973
13355 91973 250437 -147465 282329 19977 263342 25799 127222 192397 34701 -4851 153991
13343 285965 477259 590626 397604 470508 -171809 315271 17427 271364 234288 481019
13333 481019 -146576 263735 223665 622717 -36836 268501 243601 111872 404637 76816
13322 131005 428277 -152748 189353 205055 141593 295824 121693 30498 429957 82235
13311 300674 176915 348445 23376 145044 -6953 130937 -82817 -10566 233419 -111196
13300 72505 436684 35110 228171 83426 -40992 -108260 96720 523 145366 -139908 360696
13288A92156I5957J4439a11731d1627a2988r130G5075e3193C11962j50793H154
13276B3137J8044a55519B99727A15986l8842l3739a20561C23268A29816J00664
13266B30480r8388a611A9126L24920a74188B86884j01437K27641a37777j24911
13256b62688f1074E0721J86279F4330K27818g4338E5977b49518H3867B2138d9594
13244a94831I7399L10647q283J3594A03318L0114J35220M3425j29513j6210F2382
13232a33845K7350A44736b20321D8916o572f3132C58851k6541A06301m0786C272
13220E974J34400K49189c9532E9202K34455A46431Q7383E7454f3542A02167a4432
13208a9130A87535E1660b70336F6028M89122k71460C0163Q1236J18052j02523
$$ plain form
13288 192156 95957 110396 -111731 -41627 -12988 -22118 75075 -53193 311962 161169 8154
13276 23137 41181 -155519 299727 115986 77144 43405 -120561 323268 129816 230480
13266 230480 132092 -1611 19126 344046 -174188 286884 185447 413088 -137777 -262688
13256 -262688 -61074 50721 237000 64330 292148 -74338 55977 -249518 83867 22138 -49594
13244 -194831 97399 408046 399763 413357 103318 133432 268652 312077 182564 166354 62382
13232 -133845 -106495 144736 -220321 48916 42344 -63132 358851 332310 106301 65515 3272
13220 5974 140374 389563 -39532 59202 293657 146431 233814 57454 -63542 102167 -14432
13208 -19130 187535 51660 -270336 66028 555150 283690 30163 111399 229451 126928
13198A26928n9674K64421F1887J40109l678O0121j03410c8155A78568k9797a06958
13186B18210p9675J33063j27941f8974C4631L39060D8286b05060A78720a47251
13175A90355a2476j02894J4990k4727C0193J55408J14144b1232m00911C8576K18161
13164B56737L23983e9050A00208J75701P8602A13361E3436K56614p1152K0995
13154B59893A06189a11262B19238K351J57677j0387A39360b160o9044E27352A79749
13142A90809B4939L91451A77513o1508d142r0383K0677I5454O2449a16487g939
13130c0123A40958g9999c8023I0289a28414C15962A38644l8318C0887K18200a8074
13118a3318b355j43867B97809e9626r0001a6558B28475I1755a5328j66758C9066
$$ plain form
13198 126928 67254 331675 61887 201996 198318 258439 155029 -38155 178568 148771 -106958
13186 218210 138535 271598 143657 -68974 34631 373691 48286 -205060 178720 -147251
13175 190355 -12476 -115370 -100380 -125107 30193 185601 299745 -21232 -422143 38576 256737
13164 256737 580720 -59050 100208 275909 354511 113361 53436 310050 238898 259893
13154 259893 106189 -111262 219238 221589 379266 368879 139360 -2160 -71204 527352 179749
13142 190809 24939 416390 177513 116005 -4142 -94525 -73848 95454 157903 -116487 -7939
13130 -30123 140958 -79999 -38023 90289 -128414 315962 138644 100326 30887 249087 -18074
13118 -13318 -2355 -146222 297809 -59626 -149627 -16558 228475 91755 -15328 -182086 39066
13106D0720h2280c4249a0567j3826C1939J56509c9404a9164A45423h7314G2503
13094A32358F3264J39584B0842M3722a28188m7086A71146b82388E8033L76122
13084D34155G1262E589g7104L6758B25342a05620B07134e3562C00918G2726a13957
13072A74416d5243E8645P0856a810A62029C1914L48067E9756J34746M8959L2020
13061B75481a09549C2836R2428f3962A23672k0986L51797d0792F9831b1185A47974
13049B00651l7534K62670A71845j0853l8089O4496m7961l1083B7993J99334j12074
13038A15253K58472G9957l745J96782F5992J59672a49556A46330k8573c34097
13027A40L91752D8866h3705C3524m931K60368j40278J17544i3338G9351K04040
$$ plain form
13106 40720 -82280 -34249 -10567 -24393 31939 188448 -39404 -19164 145423 -87314 72503
13094 132358 63264 202848 20842 64564 -128188 -175274 171146 -282388 58033 434155
13084 434155 71262 5589 -77104 -40346 225342 -105620 207134 -53562 300918 72726 -113957
13072 174416 -45243 58645 129501 -1810 162029 31914 379981 59756 194502 243461 275481
13061 275481 -109549 32836 125264 -63962 123672 102686 454483 -40792 69831 -21185 147974
13049 200651 163117 425787 171845 160992 122903 187399 139438 108355 27993 227327 115253
13038 115253 373725 79957 76212 272994 65992 225664 -149556 146330 117757 -334097
13027 140 391892 48866 -83705 33524 28593 288961 148683 266227 -93338 79351 283391
13016B83391B1315J9446e1832C18426i0599E2246Q2464k0298a02807j20046D11108
13004b4317j70578A20691O712c05829C42351H7428b0708H3961a55990B12404i2057
12992B70164G4990e6141B78566j33213l4587C2978c7154B4999a02390c3973C23943
12980B67670a209B41063i6597m285A80555J19519A12061k8184a37628D00209A84829
12968G9833K47953A55959F8836J62861e6341j20188A15552b3157A01772g7828
12957A9479P1114a50661M8867C6978J12948e4991A41820C3721Q5070a48204J1611
12946a36593B34099b70915C75113a68116C9624c1929A72259J27249A00735L3468
12936A34203a5859q6407k33605b5891A79427L4866k739b17175A35210P6689D7113
$$ plain form
13016 283391 21315 40761 -51832 318426 -90599 52246 134710 114412 -102807 -222853 411108
13004 -24317 -194895 120691 127403 -305829 342351 87428 -20708 83961 -155990 212404 -92057
12992 270164 74990 -56141 278566 145353 110766 32978 -37154 24999 -102390 -33973 323943
12980 267670 -1209 241063 -96597 -100882 180555 300074 112061 83877 -137628 400209 184829
12968 79833 327786 155959 68836 231697 -56341 -176529 115552 -23157 101772 -77828
12957 19479 90593 -150661 -101794 36978 149926 -54991 141820 33721 118791 -148204 -136593
12946 -136593 234099 -270915 375113 -168116 39624 -31929 172259 299508 100735 134203
12936 134203 -15859 -102266 -335871 -25891 179427 214293 211554 -217175 135210 211899 47113
12924G3898b53081B5047N5180a32291M1386A05906b27141B54933d0365B63123
12913d1457B0055P0020P077N3418m1982e4592j37850J8719B89139E8652j5530
12902D3122e9823F4490J82729q887A05839l4474c03420A73647Q9719A20444J9203
12891A39647a13236F9401L92651a94566E9919O1814k9137e4793j4193A18220C1593
12879a1163A45615c0987B43157a90169D6024N248b47098B029O5030a12789A06439
12867a10443C39933A27556M52770B49156q5770b02525e4908j25316Q0411A67393
12856a45998j62959J20942A33091M676J49692I9328g6257K3076J0489B46761a37122
12844C5060J32423h2244L1077B33012b49124e132k19886B02575a06043j95752
$$ plain form
12924 73898 -253081 25047 80227 -132291 -90905 105906 -227141 254933 -40365 263123
12913 -41457 20055 90075 97152 150570 108588 -54592 -192442 -173723 289139 58652 43122
12902 43122 -59823 64490 247219 238332 105839 71365 -303420 173647 263366 120444 139647
12891 139647 -113236 69401 462052 -194566 59919 121733 92596 -54793 -68986 118220 31593
12879 -11163 145615 -30987 243157 -190169 46024 51272 -247098 2029 67059 -112789 106439
12867 -110443 339933 127556 580326 249156 163386 -202525 -54908 -180224 -99813 167393
12856 -145998 -308957 -188015 133091 137767 287459 99328 -76257 -53181 -42692 246761 -137122
12844 35060 167483 -82244 -51167 233012 -249124 -5132 -225018 202575 -106043 -301795
12834c01795E3040M17319f0432f8q0778K8528B82149j09618P23D6937J0809h2187
12821C12694a26871J9004B91152b89070a08826k49945A88813a61860c1919C8582
12810B09237l8829B2872a20651A44541A9798a54051A69256F6736K44509j5931
12800B95314D8358h3993A88487G9493J81255a74687H2203K4372i314G715f9760
12788C33384b53925C13245C982b96819a20262H2734J12541b42812A0524J04203
12778A14727L3526k3272b50742B24475j02656a11124A60664a77430F617K09952
12768B16569K86039A2888b7943C1418K42252G188a93311A7719L2404b3896j27683
12757a51579B48266a20255k32465b0786O761B32057d6079A48204L4297a19553
$$ plain form
12834 -301795 53040 470359 -60432 -68 -80846 -52318 282149 172531 173254 46937 57746 -82187
12821 312694 -126871 -107867 291152 -289070 -108826 -358771 188813 -161860 -31919 38582
12810 209237 170408 22872 -120651 144541 19798 -154051 169256 66736 311245 295314
12800 295314 48358 -83993 188487 79493 260748 -174687 82203 106575 -9314 7715 -69760
12788 333384 -253925 313245 3982 -296819 -120262 82734 195275 -242812 10524 114727
12778 114727 148253 124981 -250742 224475 121819 -111124 160664 -177430 6617 216569
12768 216569 502608 12888 -27943 31418 273670 7188 -193311 17719 50123 -23896 -151579
12757 -151579 248266 -120255 -352720 -20786 -14025 232057 -46079 148204 182501 -119553
12746B63317G2306C3809b57051K9266B09715O7262e2287A93509d6490B26688e723
12734G3554K1550J11404e6598j42840Q6487B8993L20741B5482J46289J43662j07280
12723B08153c1969A59653D1135b17784H1153d7571H7188a74696c4122B6659B111
12711B70100j11215J77700A59373J74665E2241M28282H6381M49366j81351J11945
12701D66341G3480J99850I5555J5466b77149B43850A2618K21712H650a73798N0994
12690a22804B2210b15344A52655j7990a98438E4738L13058b71428a7725C77125
12679d4358A24719K19812A68342b8722A38390B0279L6310L16918r191H2669b05338
12667A80707a46262d2217C2847a72547N5803A07621b58498O1522N7655c2989A70506
$$ plain form
12746 263317 72306 33809 -257051 -227785 209715 276977 -52287 193509 -46490 226688 -5723
12734 73554 95104 206508 -56598 -199438 -112951 28993 349734 25482 171771 315433 208153
12723 208153 -31969 159653 41135 -217784 81153 -47571 87188 -174696 -34122 26659 2111
12711 270100 158885 336585 159373 334038 52241 480523 86381 535747 354396 466341
12701 466341 73480 273330 95555 111021 -277149 243850 12618 234330 8650 -173798 -122804
12690 -122804 22210 -215344 152655 134665 -198438 54738 367796 -271428 -17725 377125
12679 -44358 124719 344531 168342 -28722 138390 20279 56589 373507 364316 82669 -205338
12667 180707 -146262 -42217 32847 -172547 -116744 107621 -258498 -196976 -139321 -32989 170506
12655A5651J48671J6015J27902A38748R3111a14465k5423D72470A86168l3536
12645A52632J9171k0213d7117m3638D0652f9346A36665J16046E3250J93414J32849
12634C79513a11038D2679K80705G9951k9351K01804g1988D58037b58986A59117
12623G926L34467a19817j39948I3803B8993J70851E9277O4456n9399e9187A59507
12611f0210j80272A6743K41309C131J42254L0346l6663g8551k0471I5026L9996
12600A35022b09724H3850K60464n2874j23373b32278A19371g6013B52974b12547
12589F4790a80571j31003I8317K04168b88285d703k19125e153E6134R9984g3328
12577a6672B19277a58887f0346H4787h8526B73689b64943B25970i9573I068P4364
$$ plain form
12655 15651 164322 180337 308239 138748 231859 -114465 -139888 472470 186168 152632
12645 152632 171803 151590 -47117 -90755 40652 -69346 136665 252711 53250 246664 379513
12634 379513 -111038 42679 323384 79951 50600 252404 -71988 458037 -258986 159117
12623 7926 342393 -119817 -259765 93803 28993 199844 59277 123733 64334 -59187 159507
12611 -60210 -240482 16743 258052 3131 145385 175731 139068 -78551 -99022 95026 135022
12600 135022 -209724 83850 344314 291440 168067 -232278 119371 -76013 252974 -212547
12589 64790 -180571 -311574 98317 302485 -288285 -4703 -223828 -5153 56134 156118 -73328
12577 -16672 219277 -158887 -60346 84787 -88526 273689 -264943 225970 -99573 9068 83432
12566H3432J18472a63893A35297A3828Q9943M07400c15685A37375H658J41103
12556A49761a84422j07741C0546R7064e7875J0832A26149m7401P2083e27874a35708
12544A84990b00227d8859A11890J56879b15257J3931o2373B01626b12600I9069
12533B47891A0042b22671B36388b83657e9327F0824J39408m521o5956D2138Q6446
12522A28584N8712J61363A8390J56115C9467e803D8830M6113R9526r3058a6656
12510D4712N6196P0800F5934K53516J8358B4196H148J35973O3192h5174C81002
12498F2000n347j474b52843A12904N7134a987q3329a3496m61231A8764e3495k26441
12486b79936i3346I409i5864l23027a65321F4306M7899b44349o3276e8606A03208
$$ plain form
12566 83432 201904 -163893 135297 13828 103771 511171 -315685 137375 8658 149761
12556 149761 -184422 -292163 30546 127610 -57875 -47043 126149 78748 150831 -527874 -135708
12544 184990 -200227 -48859 111890 268769 -215257 -201326 -263699 201626 -212600 99069
12533 247891 10042 -222671 236388 -283657 -59327 60824 200232 195711 129755 42138 128584
12522 128584 187296 348659 18390 174505 39467 -5803 48830 94943 194469 101411 -16656
12510 44712 100908 171708 65934 319450 337808 24196 8148 144121 207313 -85174 381002
12498 62000 56653 55179 -252843 112904 170038 -1987 -85316 -13496 -474727 18764 -53495 -279936
12486 -279936 -93346 9409 -95864 -418891 -165321 64306 112205 -244349 -307625 -58606 103208
12474C61695e4242k74252F2356d5791N218j26277H7809Q0746i9643d6106j72018
12463b18124e929A480b8712B37062a11780I7890D5964a51261B04823l9879n2354
12452A12590c59998d9243H2795K07228j21685a42418e2240k3208A26420b55323
12441C79019a94902b6217k79517a50525N9426r96b4887k92697B72765d930k16757
12430b21687f9898m0536H966i7078o4696B75377B7688c45129a70079C91166B3865
12418b19177B80517a41070c5484k17242D16080A98957a6930A05333a69074B5650
12407A18409a87218Q6654c3962m8803J7467e207B10510H6326a66800j94371I3796
12395a68328C0809J18643b32847A4972i42G2702l6221c1464i700A24670a02011
$$ plain form
12474 361695 -54242 -328494 62356 -45791 -40573 -166850 87809 168555 -99643 -46106 -218124
12463 -218124 -5929 1480 -28712 237062 -111780 97890 45964 -151261 204823 164944 112590
12452 112590 -359998 -49243 82795 290023 168338 -142418 -52240 -75448 126420 -255323
12441 379019 -194902 -26217 -305734 -150525 -91099 -92095 -24887 -317584 272765 -4930 -221687
12430 -221687 -69898 -110434 8966 -97078 -161774 275377 27688 -345129 -170079 391166 23865
12418 -219177 280517 -141070 -35484 -252726 416080 198957 -16930 105333 -169074 25650
12407 118409 -187218 -100564 -33962 -82765 -65298 -5207 210510 86326 -166800 -361171 93796
12395 -168328 30809 149452 -232847 14972 -942 72702 36481 -31464 -9700 124670 -102011
12383a24262k4895j54007A08052f9562A6503J80069f4385D0879R6953a88651C6627
12371b41895J03070A77632l2982h239j73085C9647c30725H0592a3040q2253C0435
12359g2453B34402C3613K5764A8721K02098B5920K83919C2227a04502p3583Q1648
12348i6437A18190J25096o5739n4344c7584B29843G4700h7253A57139e8183B45559
12336B8725b21507A47356b16622A98753J4658D5922J71650C1903K394j5687J18658
12325A37268A2671J97403a94025B68011a88191B1823a09471A04136g1404B02111
12314B40434N465M9554j16777b35692R2182c7413A85652b559A15082a26702C6766
12302b55300F5068l1344b62483A09313c5907G3261P2507g2151q4221f0821e367
$$ plain form
12383 -124262 -149157 -303164 108052 -69562 16503 196572 -64385 40879 137832 -188651 36627
12371 -241895 -138825 177632 144650 -8239 -181324 39647 -330725 80592 -13040 -95293 30435
12359 -72453 234402 33613 59377 18721 220819 25920 309839 32227 -104502 -178085 -96437
12348 -96437 118190 243286 177547 123203 -37584 229843 74700 -87253 157139 -58183 245559
12336 28725 -221507 147356 -216622 198753 213411 45922 217572 31903 34297 18610 137268
12325 137268 12671 210074 -194025 268011 -188191 21823 -109471 104136 -71404 202111
12314 240434 245899 295453 178676 -235692 -143510 -37413 185652 -2559 115082 -126702 36766
12302 -255300 65068 33724 -262483 109313 -35907 73261 145768 -72151 -156372 -60821 -5367
12290B89814A24011d8333C65456H198c01973F2155K805J1256c03823B00761B838
12278A58640a06546c6909A86746c4642A06357P3429l2757a35588B67673E1328
12267D7783a2114D9129A8247J60976e3714A51639a01730B11573H13f5120C2063
12255a41603A36661J65799o7052I1634K8902N7290A6872K33364a21037K7174G710
12243a64941g7021b534B30213a0987B21833m5789R6471j36032j9862K22961M8943
12232C88525O1334A85366a49947B47222P7010j10939F1777N25805E9657J24054
12222A83711j5874a67235B39461e8673A40717J55274A13703J73132C6423J50307
12212A86730q8358a29494A723b7715A62076k4302Q818J73593E9336f4878j6028
$$ plain form
12290 289814 124011 -48333 365456 8198 -301973 62155 64960 76216 -303823 200761 2838
12278 158640 -106546 -36909 186746 -34642 106357 179786 147029 -135588 267673 51328
12267 47783 -12114 49129 18247 179223 -53714 151639 -101730 211573 813 -65120 32063
12255 -141603 136661 302460 235408 91634 120536 177826 16872 250236 -121037 -93863 7710
12243 -164941 -77021 -2534 230213 -10987 221833 176044 272515 136483 116621 339582 388525
12232 388525 449859 185366 -149947 247222 324232 213293 61777 587582 59657 183711
12222 183711 167837 -167235 239461 -58673 140717 295991 113703 286835 36423 186730
12212 186730 98372 -129494 1723 -27715 162076 137774 146592 320185 59336 -64878 -80906
12201h0906D40553c71171C8924K18425J69714j85904a9624F3927f4475B52589
12190C59455j48621D8371L19289h2930K3174A33529N6942a25288A11304a01531
12179A75322k4356F0232K7939J77707l9031J13212A3226R8705L70226A31947J47686
12168B79633B4440J62065L3963j00960G592h2379n6255L7881H7538j1832M8452
12157A24158b14519Q4031A82893a45179L9843K2032j680c4624G2442g0212D48660
12145A2615M17948f4454f368l8652A62884a9531E8782K78483a09065F07M03702
12134D04309b2971p7641A1655P4990K827K1245i7663n658l8219E9992A7174O207
12122B3381L04230C2540b7131l7204A15862K19536A34695h2669A77860a17221
$$ plain form
12201 -80906 440553 -371171 38924 257349 427063 241159 -19624 63927 -64475 252589
12190 359455 210834 48371 367660 -82930 -59756 133529 190471 -125288 111304 -101531
12179 175322 150966 60232 88171 265878 226847 340059 13226 111931 482157 131947 279633
12168 279633 24440 186505 220468 119508 7592 -82379 -138634 -100753 87538 75706 124158
12157 124158 -214519 -130488 182893 -145179 -105336 -83304 -84984 -34624 72442 -70212 448660
12145 12615 430563 -64454 -6368 -45020 162884 -19531 58782 337265 -109065 607 404309
12134 404309 -22971 -100612 11655 86645 89472 110717 -97663 -103321 -141540 59992 17174 23381
12122 23381 327611 32540 -27131 -64335 115862 335398 134695 -82669 177860 -117221
12111i7126K1945j75531D42210c99293D4151a53243A93154c8303k87303H4082
12100B70446c8203A28128c0685j24219A01183B233a27082k28317e9030A09058
12089a78606A01840b1702j5797j87758B52913a02160B12921q9875a7546H7557
12078a19341A56100M97937L82678J1238m79361A9446J49371P4937L6561a48236
12067B01430e8661A60846i0754o4874l082A1434c95775g5783j57619M7874a7736
12055C1025a57754C48827a526j32752C02578A21862e26834a58066D1634J8757
12045F0391J83796L7946i6671j56115A96154l133H9114d17726a02244L4592j81547
12034b49199I0761b11341C27803A10748M7864J76176a04460K114A158b71751a00872
$$ plain form
12111 -97126 -75181 -250712 442210 -399293 44151 -153243 193154 -38303 -325606 84082
12100 270446 -38203 128128 -30685 -154904 101183 2233 -127082 -355399 -59030 109058
12089 -178606 101840 -21702 -37499 -225257 252913 -102160 212921 123046 -17546 87557
12078 -119341 156100 654037 1036715 1047953 568592 19446 168817 243754 280315 -148236
12067 201430 -58661 160846 -90754 -155628 -158710 11434 -395775 -75783 -233402 -185528 -17736
12055 31025 -157754 348827 -1526 -134278 302578 121862 -526834 -158066 41634 60391
12045 60391 244187 282133 -96671 -252786 196154 193021 89114 -417726 -102244 -67652 -249199
12034 -249199 90761 -211341 327803 110748 158612 334788 -104460 -102346 1158 -271751 -100872
12022b23785C89390C2036c38825g4872A7325a55220j01494q8229J0547Q0349i712
12010D2964a2584p5201I9646N025l147l0548a36133A38579j3899m2142a46030
11998a08275A09588a05264k9999j94246e7643k99552g5770j43108P2146B40213
11987B08079e7943A05430J6485b12970J9001H0312b26577e2533j51184J6144i2981
11975E8916R7984a44551B87052A23093J10592q3511K13216b43492E9232J25043
11965A84275m6480a62411A10831R2665G8666b30102D230Q2585J48551j16620m3364
11954G5382b9117I403b58932E1986J12764a77093E3269J10753F0967b28486C81203
11942a24657H9824a4069B2786g9089q4795C55983c5027e669B53897h1055j62521
$$ plain form
12022 -223785 389390 32036 -338825 -74872 17325 -155220 -256714 -344943 -334396 -254047 -9712
12010 42964 -12584 -87785 99646 104671 101524 70976 -136133 138579 124680 82538 -146030
11998 -108275 109588 -105264 -135263 -329509 -57643 -357195 -75770 -218878 -146732 240213
11987 208079 -57943 105430 121915 -212970 -193969 80312 -226577 -52533 -203717 -187573 -92981
11975 58916 156900 -144551 287052 123093 233685 150174 363390 -243492 59232 184275
11965 184275 137795 -162411 110831 203496 78666 -230102 4230 86815 235366 118746 75382
11954 75382 -29117 9403 -258932 51986 164750 -177093 53269 164022 60967 -228486 381203
11942 -124657 89824 -14069 22786 -79089 -163884 355983 -35027 -5669 253897 -81055 -243576
11931b43576A89070a24356o958r8782O2167A34805a39781A059h1922G1480L051
11920G4531b59883C7331J80615a30010B34637a62749A36700d04879B55259e1836
11909C59610a50640j92689A64237a81996E4457M2788J61449b06575B84575a67788
11898e6011j71583L1134N1392j37846J33696A13607a58839M1072A71114K10559
11888C81673G226b1312A88722g4700L4340j75624i8715E5907P965n344a07761
11876a49070f8097k7165j63988D35875I8229a4806A00709P2389F3965e0908A10633
11864a50146N5584K0721k0710L1430C30135j55835I100J1510c14344B24521E3215
11852c360j41006M6643j00846D8481c21087A9413a76481r9672J10242A04994g6837
$$ plain form
11931 -243576 189070 -124356 -131314 -230096 -167929 134805 -139781 1059 -81922 71480 74531
11920 74531 -259883 37331 217946 -130010 234637 -162749 136700 -404879 255259 -51836
11909 359610 -150640 -343329 164237 -181996 54457 97245 258694 -206575 284575 -167788
11898 -56011 -227594 -196460 -145068 -282914 -149218 113607 -158839 -117767 171114 381673
11888 381673 7226 -21312 188722 -74700 -40360 -215984 -98715 55907 63872 58528 -107761
11876 -149070 -68097 -95262 -259250 435875 98229 -14806 100709 173098 63965 -50908 110633
11864 -150146 -94562 -73841 -94551 -63121 330135 174300 9100 20610 -314344 224521 53215
11852 -3360 -144366 -97723 -198569 48481 -321087 19413 -176481 -276153 -165911 104994 -76837
11840a7330j2888r0002C1423g2585k16228A26508d3812b680D27368b06143B61574
11828d38165e681A2938L1642a83707B60879c60364L5706d8207A65589J8463q3001
11817A01051N5456P7691d80386A64890b65282J18158A83861K49367c4041E0698
11806d1844r6465n9921K7094B39552A6308c755r4295K3192j3336l3121C26605
11794A68543K33614f5649B20956a7385A05845J42925d5702g473l4432A52542g9823
11782B7266a71162g4353I3806c00975A7272i6667d1349l17980m4077C09521c2574
11770a51466m6480f6098B2359Q170a1200j93419A95318g6101L294B18625r6017
11759A22608h636j38496b540j8203o0607k2962k6650C9771a05161A58995G1838
$$ plain form
11840 -17330 -30218 -120220 31423 -72585 -288813 126508 -43812 -2680 427368 -206143 261574
11828 -438165 -5681 12938 44580 -183707 260879 -360364 -324658 -48207 165589 184052 101051
11817 101051 156507 234198 -480386 164890 -265282 -147124 183861 433228 -34041 50698
11806 -41844 -138309 -198230 -171136 239552 16308 -3755 -98050 -74858 -88194 -121315 326605
11794 168543 402157 -65649 220956 -17385 105845 248770 -45702 -7473 -41905 152542 -79823
11782 27266 -171162 -74353 93806 -300975 17272 -96667 -41349 -359329 -403406 309521 -32574
11770 -151466 -197946 -66098 22359 30529 -11200 -204619 195318 -76101 -72807 218625 122608
11759 122608 -8636 -147132 -2540 -20743 -81350 -104312 -130962 39771 -105161 158995 71838
11747C46662A21702M7637j1392m4613C3802b4409j8975F2566J59638K3641b6597
11735a42617K0931B67551f0639j50915N6431N5254A3686a43437G5611f0639J9472
11724d1167j30050B79547a50153F9317L43286c34134D4532a93736A51403h9059
11713H7688J31338a24003f1328j86344f9700B25902A2570b80971A5318J27568
11703A42886a5361j16822A04006J70546A07320i8310j3604B66122b84926a430
11692f170G8897Q3954o0360D9052a4071B63877a98236B40380c0173A88432q0702
11681A07730e4192A179J13493a23194H6843J18169f4230k07152B28081D1557a63147
11669A50037c5986i940D9642N0722g5428b3898A051L04140k5985B0186J32401
$$ plain form
11747 346662 121702 169339 157947 113334 33802 -24409 -43384 62566 222204 245845 -26597
11735 -142617 -121686 267551 -60639 -211554 -155123 -99869 13686 -143437 75611 -60639 -41167
11724 -41167 -171217 279547 -150153 69317 412603 -334134 44532 -193736 151403 -89059
11713 87688 219026 -124003 -61328 -247672 -69700 225902 12570 -280971 15318 142886
11703 142886 -15361 -132183 104006 274552 107320 -98310 -111914 266122 -284926 -1430
11692 -6170 78897 162851 102491 49052 -14071 263877 -198236 240380 -30173 188432 107730
11681 107730 -54192 1179 114672 -123194 86843 205012 -64230 -271382 228081 41557 -163147
11669 150037 -35986 -9940 49642 100364 -75428 -23898 1051 305191 279206 20186 152587
11658A52587A1209K2694a20250o597B38074a10844A67793g7179k55441A8113N6816
11647G4929B4909L63587b66254g856G9156b03792i3191A14119C311K35189q8466
11636A50034p471N0425B6650d8652o7488E9941D758a24175B01947P1627b40996
11624A01338R6833N6381p5414K3578j1509b6399n9987A2605J16117J65236a86332
11612A52946f7103k32514E3037R6814l0739A8003H19d39164d4542a7084o5900
11601h2984G8970K68841A33617j0782M6917K13864c113C0466b1322M660A29510
11589d7454D71924A51381d2044D23032c96410f055I3198J8195K48748b61980m4438
11578c06418C0108c5704C77034a18564B47660A9181P3086c584A0155M1678P34
$$ plain form
11658 152587 11209 33903 -120250 -126847 238074 -110844 167793 -77179 -332620 18113 74929
11647 74929 24909 388496 -266254 -7856 79156 -203792 -93191 114119 3311 238500 150034
11636 150034 142563 192988 26650 -48652 -116140 59941 4758 -124175 201947 273574 -240996
11624 101338 198171 254552 179138 202716 191207 -26399 -86386 12605 128722 293958 -186332
11612 152946 -67103 -299617 53037 149851 119112 18003 819 -439164 -44542 -17084 -82984
11601 -82984 78970 347811 133617 122835 169752 383616 -3113 30466 -21322 -16662 129510
11589 -47454 471924 151381 -42044 423032 -396410 -6055 93198 111393 360141 -261980 -306418
11578 -306418 30108 -35704 377034 -118564 247660 19181 92267 -3584 10155 51833 52567
11567E2567a01327C23927G65a64986G6979c12378f9793A27767d0312A32047O7810
11556A99857J02537A51004R0273A03314P4892O4378b31753H1297h5473B18892
11545b05726c944A60423b14373J06601A97457M5076a0038j04749j46662g8822
11534A99599M4204A17007n3407Q2787J03498K4973A9114f4009A48937k6630a21364
11522B2648i439o1666C18314G8156g7208B12762D1292f4192A43303a8086K046
11511a6040C68495o9042f0736C47229A08078i5854B03126e4818F9030A0714O4541
11500G5255O8936O0309C6595O4694d760B47322J2789G9046b38864A75049A5310
11488c950F0195L59594b51306n9970J51097c0851F4540d9757B13092k6174J47398
$$ plain form
11567 52567 -101327 323927 765 -164986 76979 -312378 -69793 127767 -40312 132047 199857
11556 199857 302394 151004 241277 103314 178206 242584 -231753 81297 -85473 218892
11545 -205726 -3944 160423 -214373 -107772 197457 242533 -10038 -114787 -261449 -78822
11534 199599 243803 117007 63600 146387 249885 274858 19114 -64009 148937 122307 -121364
11522 22648 -9439 -71105 318314 78156 -77208 212762 41292 -64192 143303 -18086 -16040
11511 -16040 368495 299453 -60736 347229 108078 -95854 203126 -54818 69030 10714 75255
11500 75255 144191 204500 36595 101289 -4760 247322 260111 79046 -238864 175049 15310
11488 -3950 60195 419789 -251306 -311276 -160179 -30851 64540 -49757 213092 186918 334316
11477C34316p7692h457F7928c4196C10672F8953K9665a11993C88459G1891b7215
11465B04098N8492i4349C91611B2633a49335n092C25252k9659a102C356K45774
11454B49130A0186J0970J85816a00505q8063O1087j03856f7033f140G9758J35728
11443B15486p2471c73361A25444C2678J16584K58354j68220l4958a12547A41702
11432A55696F6335b5122j82649B2884b55745A76134a01092J9959q0632D87483
11421B0298a19814A95107L4276I829K17360b79337a22657b8268j13824A82210
11410A96149d23925J87770j5123A21114a25936A2452f3280j6212C45162b3704
11399g8472k38513I7054J53950j04413e930B06797k2038q1887J34349O5445D5320
$$ plain form
11477 334316 256624 -8457 67928 -34196 310672 68953 98618 -111993 388459 71891 -27215
11465 204098 262590 -94349 391611 22633 -149335 -154427 325252 295593 -1102 3356 249130
11454 249130 10186 21156 206972 -100505 -188568 -127481 -231337 -67033 -6140 79758 215486
11443 215486 143015 -373361 125444 32678 149262 407616 239396 204438 -112547 141702
11432 155696 66335 -25122 -207771 22884 -255745 176134 -101092 -81133 -161765 487483
11421 20298 -119814 195107 229383 9829 227189 -279337 -122657 -28268 -142092 182210
11410 196149 -423925 -236155 -251278 121114 -125936 12452 -63280 -79492 345162 -23704
11399 -78472 -316985 97054 251004 146591 -5930 206797 184759 102872 237221 302666 45320
11387E9491e754A38734c20728e7133B12665C9024a56398b3822A15129K59893G8347
11375h0872B39528c0661B65133d4278B90892i7298a1223C3053N4536J38436a54369
11363D2414J1430d8784B08782p9718J64675b62662h558F9147J62875b29194O7143
11352a62051j21592A20296a01591A23331c35726D323L95064G5979a19807b3832
11341g1557n0358j12956d2500j17459A22739J39137i6870K4254B75673F0478a3841
11329a56876j77583J39331h5061A47718M8858e152o607C68734A53349p4930i3158
11317e3504b4977E124K12766p5192A4605J01544L4926a48601B713d9325C65086
11305A16040a44387M8694G4287c671m9347A46828g8113I1196r840J96530b07504
$$ plain form
11387 59491 -5754 138734 -320728 -57133 212665 39024 -156398 -23822 115129 375022 78347
11375 -80872 239528 -30661 265133 -44278 290892 -97298 -11223 33053 87589 226025 -154369
11363 42414 53844 -48784 208782 129064 293739 -262662 -8558 69147 232022 -229194 -162051
11352 -162051 -283643 120296 -101591 123331 -335726 4323 399387 75979 -119807 -23832
11341 -71557 -121915 -234871 -42500 -159959 122739 261876 -96870 -72616 275673 60478 -13841
11329 -156876 -334459 -195128 -85061 147718 196576 -5152 -11759 368734 153349 78419 -93158
11317 -53504 -24977 5124 217890 142698 14605 116149 151075 -148601 2713 -49325 365086
11305 116040 -144387 -95693 74287 -3671 -53018 146828 -78113 91196 81356 277886 -207504
11293E643d13625c9402A21530a415j33588M5653k9458I9353c0245k19405E7669
11281B22111p5728F2366a33271N4025l4705p8301e0887r6021D3102a90267A07820
11269A49317b70749F2594h7966G9848F34J47619b45286A8790c31217C6531L86889
11258D23420a71433R126K0569A16053J63384j36147d7602q7928d0141B67927b17880
11246b32582Q2111e501j03972H380P2366c16099E7739O5317g9793j27312d2331
11234A74516a59550j9765B7580c79104e4765I0443a42415p1348H8244c00036j38231
11223d38267J5905J75860B39906d89653A17925k6361D780J84852O8565b08858
11212h4601H5106b88505E6510f2528a9647m7447A88014b6840j99641b3809k30425
$$ plain form
11293 5643 -413625 -39402 121530 -1415 -135003 -89350 -118808 99353 -30245 -249650 57669
11281 222111 146383 62366 -133271 -79246 -113951 -192252 -50887 -146908 43102 -190267 107820
11269 149317 -270749 62594 -87966 79848 634 148253 -245286 18790 -331217 36531 423420
11258 423420 -171433 -162307 -141738 116053 279437 143290 -47602 -135530 -40141 267927 -217880
11246 -232582 -150471 -5501 -109473 8380 80746 -316099 57739 123056 -79793 -207105 -42331
11234 174516 -159550 -179315 27580 -379104 -54765 90443 -142415 -213763 88244 -300036 -438267
11223 -438267 -422362 -246502 239906 -489653 117925 91564 4780 189632 258197 -208858
11212 -84601 85106 -288505 56510 -62528 -19647 -67094 188014 -26840 -226481 -23809 -254234
11201b54234A00456d406H2721J4227h8814o5975B725J96151h1124B2250J72598
11190A94848G8421J66779b17835f1972C736K51588h3861B80493e9161j35868f7834
11178h1418L9041o7790o6896r9368C8470J8626d1959J9053B40059a37709A09308
11166a70517D039f4701p844A4884a5685j8331B975L11472F958L9722h4128K3551
11154f0577k55677h7336M3574A20922E9345i6275A66014l5654f3882r0446J2470
11143a41858A44460p373Q430b94743I7815n693a2056h36j612o8533A98788H2247
11130b98914d8362E957J19649c4181n3868c2767A05120k4009c04075g1395A08749
11118A40836D7546b04032h1576G0589K79963G4655P1301N8552b03175Q8067a4924
$$ plain form
11201 -254234 100456 -4406 82721 96948 -88814 -154789 2725 198876 -81124 22250 194848
11190 194848 78421 245200 -217835 -61972 3736 255324 -83861 280493 -59161 -195029 -67834
11178 -81418 -42377 -110167 -177063 -276431 38470 57096 -41959 -22906 240059 -137709 109308
11166 -170517 4039 -64701 -72545 14884 -15685 -34016 2975 314447 6958 46680 -84128 -60577
11154 -60577 -316254 -87336 -43762 120922 59345 -96275 166014 130360 -63882 -154328 -141858
11143 -141858 144460 137087 145517 -294743 97815 92122 -12056 -836 -2448 -70981 198788 82247
11130 -298914 -48362 5957 125606 -34181 -88049 -32767 105120 81111 -304075 -71395 108749
11118 140836 47546 -204032 -81576 70589 350552 74655 145956 204508 -203175 -115108 -14924
11106A85555b7036r6410B81061r6950J01787A04759a76983A56786F6954N8333
11096A25287D1441a94077C05797H5850J33989a53941O0659A39837b2025A06711
11085A27028a74264D66932H925L52479A29856B9767a37261A20443n5629J26925
11075A91739K95940B30211N0436R1153A76077K54046j46302J17186J10417A65166
11064B94147K32967Q0154j94450J13096A58254K96606J79306J32702l06725Q9071
11054E49214O0125k2166j94693J42525J34255j80400N71400l06523k05467o5273
11044D82997J42142J54568j48013Q4085j53263K99259C21903L55156o9599o7235
11034E40225m0113n3187K9795M45793j87635j39531K14509l56955j7534L40286
$$ plain form
11106 185555 -27036 -123446 281061 184111 285898 104759 -176983 156786 66954 125287
11096 125287 41441 -194077 305797 85850 219839 -153941 -93282 139837 -22025 106711
11085 127028 -174264 466932 8925 361404 129856 29767 -137261 120443 64814 191739
11075 191739 487679 230211 280647 371800 176077 430123 283821 401007 511424 165166
11064 294147 527114 607268 412818 525914 158254 454860 634166 766868 460143 549214
11054 549214 609339 587173 392480 535005 669260 488860 1060260 753737 548270 482997
11044 482997 625139 779707 631694 715779 562516 861775 321903 677059 607460 540225
11034 540225 500112 446925 476720 922513 734878 595347 809856 452901 435367 775653
11024G75653k60609p6045M71472m06123l7237L9253q0699P6181J36582k07635
11014D30793K20358L5118j16182j69387r8345L38886n904o5786j28339J08094
11004E49306K96925j61183k05963A53983K13344M57056m3085l749p0104J33507
10994H40952l71267J19393l5973K10032r7539j35484K10764j46293J57582K14583
10984I66750k21882L08005j22836Q9081O6397r1489O83356k77572M40681m1594
10974A798897R5772O36550k68362k5280J09631j29543J64590m12135j28601K3014
10964A864533k39383p6226j08240q4043K63047p7443k74944L51504K5701k10855
10954A433651j02590m90760j0711k72860J19747l10866l0757J27522A70898M9181
$$ plain form
11024 775653 515044 438999 910471 504348 467111 506364 425665 501846 638428 430793
11014 430793 651151 686269 570087 400700 302355 641241 635337 569551 441212 549306
11004 549306 846231 685048 479085 153983 367327 824383 781298 777549 707445 840952
10994 840952 469685 589078 553105 763137 665598 530114 740878 594585 752167 966750
10984 966750 744868 1052873 930037 1019118 1085515 994026 1677382 1399810 1840491 1798897
10974 1798897 1894669 2531219 2262857 2237577 2347208 2217665 2382255 1970120 1841519 1864533
10964 1864533 1625150 1548924 1440684 1356641 1619688 1542245 1267301 1618805 1644506 1433651
10954 1433651 1331061 840301 829590 556730 676477 365611 334854 462376 170898 220079
10944B20079m9550J4475j3970c0709C75551L3946I4331b02971e1210H2938a80848
10932a15658d7950C72383b59432A40524L9047l6950a19119D4451L5537c23627
10921C83845a00960j82781C3477h1573k82377A60219Q6805G8537i1774j77806
10911b69580F6233J89769i8157J0949R098A21299b6548j69809a3625n7721j04060
10900a75406E5603b44078F4377R452a92818A58455P0257j03903e06816J93608
10890c13208i3933J6609B31608a54304E765J7906b18816F0971j1205J12431a81336
10878a49820J3684d4197H568f7088k42423N3273H1078b33703a1443A23735b3957
10866A43325b63347n6588J05804K1707e360B1694a10080Q119C70436j28685Q4312
$$ plain form
10944 220079 170529 185004 171034 -30709 375551 409497 94331 -202971 -51210 82938 -180848
10932 -115658 -47950 372383 -259432 140524 179571 142621 -119119 44451 79988 -323627
10921 383845 -100960 -283741 33477 -81573 -363950 160219 247024 78537 -91774 -269580
10911 -269580 66233 256002 -98157 -87208 -78110 121299 -26548 -196357 -13625 -71346 -175406
10900 -175406 55603 -244078 64377 73829 -192818 158455 228712 124809 -506816 -313208
10890 -313208 -93933 -77324 231608 -154304 5765 23671 -218816 60971 49766 162197 -181336
10878 -149820 -136136 -44197 8568 -67088 -309511 -256238 81078 -233703 -11443 123735 -23957
10866 143325 -263347 -319935 -214131 -192424 -5360 21694 -110080 -101961 370436 241751 326063
10855C26063b76115B8729i8060A04992h9547B46505D671N2957a04236I7302g8832
10843b39904B00433H9813b36166B46984b65770I2423a06974A05972J65817P2812
10833C44601j23713d00969H3426a81029Q0509B04328C8554O1018h2031C0300b60415
10821A39139a01496r134K3271F0599i9171j04576E3321b43037b593j81501A05020
10809A48162J38833d56592A95353A8873e7608A95600c9689A79929N1179k4520
10799B06588b8144B14281A06532J5524a09968a0225G604b29543A0179f5884A02621
10787A1076a26716A10627a25177A5536O1039C0603g9252H5127e4476n0494D6722
10775B00303q7968a46591J353j8618b1918A96517c62717a31007A29847c27329
$$ plain form
10855 326063 -276115 28729 -98060 104992 -89547 246505 4671 57628 -104236 97302 -78832
10843 -239904 200433 89813 -236166 246984 -265770 92423 -106974 105972 271789 344601
10833 344601 220888 -400969 83426 -181029 -100520 204328 38554 99572 -82031 30300 -260415
10821 139139 -101496 -110630 -87359 60599 -99171 -203747 53321 -243037 -2593 -184094 105020
10809 148162 286995 -456592 195353 18873 -57608 195600 -39689 179929 231108 206588
10799 206588 -28144 214281 106532 122056 -109968 -10225 7604 -229543 10179 -65884 102621
10787 11076 -126716 110627 -125177 15536 76575 30603 -79252 85127 -54476 -104970 46722
10775 200303 112335 -146591 -145238 -163856 -21918 196517 -362717 -131007 129847 -327329
10764c4070A06279b58113C3192g1245o0010M8022j32064d9504F6080l0848d59113
10752a48423j1420C93258E9108a69611D0920b21601H7593d209j12154B95006a85353
10740a72991c8611j83342q8700B12457a63202B35408g5614A08789a90367L0827
10730a59540C10073a55869e59E50945k72172c10228E8642a32144C2503j5489a15084
10718F7940L11779c35346e0723A96784J01335a22908p4303k62087a57953j58919
10708c16872E897J46133a44814J0709L421A41564l6122g0422j06980b9671r0669
10697a20340O258n7650i433I5644P6156k4384E2026d2661j16528C5793N960L05589
10685C47342G2171b03236M8917F4010b4190j77537j77886J03810B00828a61747
$$ plain form
10764 -34070 106279 -258113 33192 -71245 -131255 -83233 -215297 -49504 66080 35232 -459113
10752 -148423 -159843 393258 59108 -169611 40920 -221601 87593 -4209 -116363 295006 -185353
10740 -172991 -38611 -221953 -310653 212457 -163202 235408 -75614 108789 -190367 -159540
10730 -159540 310073 -155869 -559 550945 278773 -310228 58642 -132144 32503 17014 -115084
10718 67940 379719 -335346 -50723 196784 298119 -122908 -197211 -459298 -157953 -316872
10708 -316872 5897 152030 -144814 -134105 -130684 141564 105442 -70422 -177402 -29671 -120340
10697 -120340 -114082 -171732 -9433 95644 171800 147416 52026 -42661 -159189 35793 41753 347342
10685 347342 72171 -203236 -154319 64010 -24190 -201727 -379613 -275803 200828 -161747
10674a2657l07617J39324C9250J43797b66217C8840h0369L4593k7947B21435b2371
10662H4981a66227l2622D4616c50713B6530a14320J6822r2788j50984B78090b0309
10650c9387E188b18785A6338K11935O5976a17066j62787A45688b08943a4711B29650
10638a64780A41926f9828r7962j98398a64380h1268J1739j70929n6795J26070
10628a71183O7198M4714j86017C05496a9426k76123J09671m3236A23648q082l8866
10617G6700N0181b29365J4836O6501F1673d02247e5511o9011A602N7394B4267
10605H1184k7540b62376A27868a50124L8329b7857j5064p5461K9517G1916h4308
10593E919e4502k04812J1983A55323B2699J26334N2361a24978A03224c17623e6024
$$ plain form
10674 -12657 -320274 -180950 39250 183047 -266217 38840 -80369 -45776 -73723 221435 -22371
10662 84981 -166227 -198849 44616 -350713 26530 -114320 -97498 -190286 -341270 278090 -20309
10650 -39387 5188 -218785 16338 228273 294249 -117066 -279853 145688 -208943 -14711 229650
10638 -164780 141926 -69828 -167790 -366188 -164380 -81268 -69529 -240458 -297253 -171183
10628 -171183 -103985 -59271 -245288 305496 -19426 -295549 -185878 -229114 123648 115566 76700
10617 76700 126881 -229365 -214529 -148028 61673 -402247 -55511 -124522 1602 58996 24267
10605 81184 53644 -262376 127868 -150124 -111795 -27857 -42921 -118382 -88865 71916 -84308
10593 5919 -54502 -259314 -247331 155323 22699 149033 201394 -124978 103224 -317623 -56024
10581b26519F178M1573h0362C04446a47622E5168b14861k5228J3108j06713C8724
10569e1921q2460M9685D47775c029B24968A3421b78346J01494D170R8659a76148
10557d347A45772a49693B4464O1748c39788a45991j47689O820R3277M1084e4527
10545d66521B20265i8780a7000l4644A64945d3801C1035b72760A2495J82188E1666
10533d4472A72017a06033A41747b86715A85792a70758b6047L084D3539Q6a81366
10521a96900h1884l8952A24779h3461k62768J46736A09442i6559c5946n1296A19283
10509G4200Q0259r287F2155B2734h705l20163E3976J05936G539c61764e1209G4423
10496a31870j75479g656A73282o9910c06099J45037B40880c22137a54062H8518
$$ plain form
10581 -226519 6178 47751 -80362 304446 -147622 55168 -214861 -240089 -226981 -333694 38724
10569 -51921 -134381 -84696 447775 -3029 224968 13421 -278346 -176852 4170 102829 -176148
10557 -4347 145772 -149693 24464 86212 -339788 -145991 -293680 -286860 -193583 -152499 -54527
10545 -466521 220265 -98780 -17000 -51644 164945 -43801 31035 -272760 12495 194683 51666
10533 -44472 172017 -106033 141747 -286715 185792 -170758 -26047 -22963 43539 43625 -181366
10521 -196900 -81884 -120836 124779 -83461 -346229 -199493 109442 -96559 -35946 -87242 119283
10509 74200 154459 145172 62155 22734 -8705 -328868 53976 159912 7539 -361764 -51209 74423
10496 -131870 -307349 -7656 173282 103372 -306099 -161062 240880 -322137 -154062 88518
10485C08933A24742K13346l6069P4633j40134K23047j55661i3495B74835j1895
10475B62940j21376e0373o362q7262d9591j35550A00229g8626j01501b3279A69661
10463b78957F4448a1764A36435d2608A02148a83692j87367C06271p9554i7180
10452B03441N6207n5206b92148J43232A24535M8949J39957A44253g671j64066
10442a71737j33774C16994a2465j75853E7395B609M28332b87271D18517d0677
10431A20714J39610F3798C1159b45153C9297j3108a2893k03780A52550J9792a67724
10419a59905e6171J8017l11547G0853b19994C6330b42512a12600l7779A15232
10408f0338F5327l1197g5559k68708H6013c01812a22106A26835d44474B91633
$$ plain form
10485 308933 124742 338088 302019 376652 236518 459565 303904 -93495 274835 262940
10475 262940 141564 -50373 -56735 -143997 -49591 -185141 100229 -78626 -180127 -23279 169661
10463 -278957 64448 -11764 136435 -42608 102148 -183692 -371059 306271 226717 -97180
10452 203441 259648 204442 -292148 -148916 124535 173484 313441 144253 -7671 -171737
10442 -171737 -305511 316994 -12465 -188318 57395 2609 430941 -287271 418517 -40677
10431 120714 260324 63798 31159 -245153 39297 26189 -12893 -216673 152550 172342 -167724
10419 -159905 -56171 -38154 -349701 70853 -219994 36330 -242512 -112600 -150379 115232
10408 -60338 65327 34130 -75559 -344267 86013 -301812 -122106 126835 -444474 291633
10397a50158K4748D21222j88757a04548A66635p8587J67840A06730f9822p3382
10387a43204A36737k2416J68961a32327d3317j39417r3680b326A97314N9766O5100
10376C22180I0185M47362A45079m1183B286K4242O9102L78172J08912j20250j62117
10365C00347L307N3539E050a8417A18436J43127d549B92079H8441J92815j22301
10354A58955a6815C12336R7772j40674J61833K08902D122O6144L40663j20795
10344B90134L01359k07753A77700a42155f9842A95945K910J267j4152f4C67810
10332I8383A3820K39434E4854a56906K9714B91578I4929M8645J51127j02194L28250
10321E20757B01197K8806E0785J52405m7222i8759f968j49641C37839j8704b48791
$$ plain form
10397 -150158 -125410 421222 232465 -104548 166635 88048 255888 106730 -69822 -143204
10387 -143204 136737 114321 283282 -132327 -43317 -182734 -276414 -2326 197314 257080 322180
10376 322180 90185 537547 145079 103896 2286 26528 95630 473802 582714 462464 300347
10365 300347 303654 357193 5050 -18417 118436 261563 -4549 292079 88441 281256 158955
10354 158955 -16815 312336 410108 269434 431267 640169 4122 70266 410929 290134
10344 290134 591493 383740 177700 -142155 -69842 195945 198855 200122 185970 -64 367810
10332 98383 13820 253254 54854 -156906 -127192 291578 94929 143574 294701 192507 520757
10321 520757 201197 230003 50785 203190 155968 -98759 -6968 -156609 337839 319135 -248791
10309D3800a35557j73163A51802o6274a52643e4862r0461A50855K0982c64121
10298c65982h068k3247j2229k18835a24294c3268l478p393A05042b80149A87862
10286a70281J8664A2033Q3519l727J62469b6014A00190c4175G8487a87100E5193
10274C696Q9340a80143A17716E3123N6577J04555F7153a75400N5826A02439D3900
10262a48404E11676B02571r3936J67434K81644k61851j25352K9211H6030h3737
10251d38859A81066h7242C7406L6886C3767a18471K3394M897j55084A0673E251
10239A58849E1063P9678a47633B5019K23281a66811f4355J5916A29285K60665
10229C89950j87231F6094c9007o5680C3012f0074C03498a69428a1786A40193c14911
$$ plain form
10309 43800 -135557 -308720 151802 85528 -152643 -54862 -145323 150855 171837 -364121
10298 -365982 -8068 -31315 -43544 -262379 -124294 -33268 -36746 -44139 105042 -280149 187862
10286 -170281 -151617 12033 95552 91825 254294 -26014 100190 -34175 78487 -187100 55193
10274 3696 93036 -180143 117716 53123 109700 214255 67153 -175400 -119574 102439 43900
10262 -148404 511676 202571 108635 276069 557713 295862 170510 199721 86030 -83737
10251 -438859 181066 -87242 37406 74292 33767 -118471 -95077 -90180 -245264 10673 5251
10239 158849 51063 130741 -147633 25019 248300 -166811 -64355 -48439 129285 389950
10229 389950 202719 66094 -39007 -104687 33012 -60074 303498 -169428 -11786 140193 -314911
10217H9184J5009a83005J0986A1639e7500A11388J61038a13873k06341N8490O4207
10206a97517d738j85315c4257E4515f2811p399l77320b9283k27418a25308b2009
10194E5967a79021P415c5014A6845Q1035C7519J85886i1254n3775r5365B39755
10182b58093A44558a75995C3938c37690Q311F745L5533b02252C783g8982k6335
10171a05317B89439C6414h0687m7480B2335K872j172O1266d8892j22854j72701
10160c44447B26978E3187g9607j97761i0190j49071n307E4385h0944E7399j9767
10149C7632A3755J7434j0787b35362J15502C72539b51155O5508a0306n6781B44256
10137G8405a06098k10567B74006K77906a91385H8883c06858a07477c9131n364
$$ plain form
10217 89184 104193 -183005 -172019 11639 -57500 111388 272426 -113873 -320214 -261724 -197517
10206 -197517 -4738 -190053 -34257 54515 -62811 -70210 -447530 -29283 -256701 -125308 -22009
10194 55967 -179021 -171606 -35014 16845 97880 37519 223405 -91254 -145029 -240394 239755
10182 -258093 144558 -175995 33938 -337690 -329379 6745 42278 -202252 3783 -78982 -105317
10171 -105317 289439 36414 -80687 -128167 22335 25207 24035 85301 -48892 -171746 -344447
10160 -344447 226978 53187 -79607 -277368 -90190 -239261 -244568 54385 -80944 57399 37632
10149 37632 13755 31189 20402 -235362 -119860 372539 -251155 -185647 -10306 -67087 244256
10137 78405 -106098 -316665 274006 551912 -191385 88883 -306858 -107477 -39131 -44495
10127d4495J7467M242F720Q9984L1775b34241g3123a7302j19477B57129F5694
10115b21256B37331o5150f0179k3001l4006B05775b13441C5191Q0295A9781K11694
10104B31475c19821a09380k6758A11335P441d44222c1788q2075M5237B2705a41293
10092a115m8879a0014j62442o080N716I8126a22997B38482f6578A29138a05902
10080b8759H4491c36501r733M3130O8371K6033k4274A93115Q7258b05273f0354
10068C43445E3308A3191c7421A83108a1597B36314a04040F3054a12728n1685I0070
10056B7415b65633b9291j53918J5883a2482G9005g3547N673A9518c25275A08061
10044b17337R1682C2236J2584a21162A70718C3334K72949c24195O851Q4172l1070
$$ plain form
10127 -44495 -27028 -22786 6720 96704 128479 -234241 -73123 -17302 -136779 257129 65694
10115 -221256 237331 172181 -60179 -83180 -117186 205775 -213441 35191 115486 19781 231475
10104 231475 -319821 -109380 -136138 111335 118776 -444222 -31788 -113863 -68626 22705 -141293
10092 -1115 -49994 -10014 -172456 -178536 -172820 98126 -122997 238482 -66578 129138 -105902
10080 -28759 84491 -336501 -346234 -303104 -234733 -208700 -232974 193115 280373 -205273 -60354
10068 343445 53308 13191 -37421 183108 -11597 236314 -104040 63054 -112728 -164413 90070
10056 27415 -265633 -29291 -183209 -167326 -12482 79005 -73547 -67874 19518 -325275 108061
10044 -217337 -125655 32236 44820 -121162 170718 33334 306283 -324195 -317344 -233172 -264242
10033b64242B46564a03940d826l91790Q0659a5649p3262l3975A33848c5646p8472
10022a14118B54507a15300b332C94499a28308k82853A8893G637O7010b48054A27874
10010a10978A68831a00626a0611E9264P1740J42361i6645j5523A02936J0676D279
9998A70143k329o2018g18j07389n6917g5834K4631j6937j88111d6502j31025O2641
9986a14886q0706A56757d9508k76218f1215I1091L5721a89454j03207k1904E1256
9974A07557k3883a77292j16172A20362B6563J35068a18099A30909a62567P9475
9964h3092C20154a70472O4424I7933f9814m90972a50549k01845P9441A80751m3125
9953A37626a47622D8669c435q5855d2442E322K35484a08776B04712k7325G0044
$$ plain form
10033 -264242 246564 -103940 -4826 -396616 -315957 -15649 -88911 -122886 133848 -35646 -114118
10022 -114118 254507 -115300 -2332 394499 -128308 -411161 18893 7637 74647 -248054 127874
10010 -110978 168831 -100626 -10611 59264 131004 273365 -96645 -112168 102936 113612 4279
9998 170143 167814 105796 -718 -108107 -165024 -75834 -51203 -68140 -256251 -46502 -177527 -114886
9986 -114886 -195592 156757 -49508 -325726 -61215 91091 126812 -189454 -292661 -314565 51256
9974 107557 83674 -177292 -293464 120362 26563 161631 -118099 130909 -162567 -83092
9964 -83092 320154 -170472 -106048 97933 -69814 -560786 -150549 -352394 -272953 180751 137626
9953 137626 -147622 48669 -3435 -89290 -42442 5322 240806 -108776 204712 177387 70044
9941b83647C7242J65291a92431O1239M3614j2811p6109n9655A00789J11101a06771
9929c44045J29977J04630C15766C4495P936b32902d6252j71382Q0547l48177B65413
9917G7820b15534D5171n729c9090D2981a98855I8693c4113B06256a39203A3260
9905a7884q8695k9k18553A01319l7608b15670b2256H959a66685d2820k70301R9827
9893b13294g2538L1545j07095D292b0903j35483O8428D41475c5141k59972J10766
9882a84347I8673c608A10322c43464J29797A20514c1224R11H8304j670b34520
9870h5195q1197A58219f0146n1129l0903B3690a97671D6565b21889c8460I9615
9858a08430p0195F3189a75486q1220h1421L8399r4906H2479N1083a6000k21042
$$ plain form
9941 -283647 37242 202533 -192431 -131192 -87578 -100389 -176498 -236153 100789 211890 -106771
9929 -344045 -214068 -109438 315766 34495 42431 -232902 -46252 -217634 -137087 -485264 265413
9917 77820 -215534 45171 39442 -39090 42981 -198855 98693 -34113 206256 -139203 13260
9905 -17884 -106579 -106608 -325161 101319 63711 -215670 -22256 8959 -166685 -42820 -313121 -213294
9893 -213294 -72538 -40993 -148088 4292 -20903 -156386 -87958 441475 -35141 -295113 -184347
9882 -184347 98673 -3608 110322 -343464 -213667 120514 -31224 -30313 88304 86634 -234520
9870 -85195 -166392 158219 -60146 -111275 -142178 23690 -197671 46565 -221889 -38460 99615
9858 -108430 -178625 63189 -175486 -256706 -81421 -43022 -137928 82479 133562 -16000 -237042
9847b37042j4408h1092E9488a41148A29474a40385I7933K45684c71179J9809A52401
9835g8120B05879e1934B59498I1880k1473g2132j49421E6818e0572K1589B56151
9823I8468c00814A19051c00086J03663C55625A07912b7877A82858c22466g7398
9812I873J15993O4729H7508c27542i1029k71099A18008a12636f095C8920c08325
9800B36304b2002J699k57301E5616a06991c3122B291h7421o0228l20257C61650
9788a44136A9422K1665f61k16469E5644P9881b57894B4581b9177B7190M7212i3547
9775b86148G6452j1606a16259j94203N6346B01216r7136J33507H5186i5724j40235
9764b35959D4040B0222j787Q236a17309Q211r7403I4994a27302H328i0267F4422
$$ plain form
9847 -237042 -251450 -81092 59488 -141148 129474 -140385 97933 343617 -371179 -351370 152401
9835 -78120 205879 -51934 259498 91880 70407 -72132 -221553 56818 -50572 -28983 256151
9823 98468 -300814 119051 -300086 -196423 355625 107912 -27877 182858 -322466 -77398
9812 9873 125866 190595 87508 -327542 -91029 -362128 118008 -112636 -6095 38920 -308325
9800 236304 -22002 -20303 -277604 55616 -106991 -33122 2291 -87421 -147649 -467906 361650
9788 -144136 19422 41087 -661 -217130 55644 135525 -257894 24581 -29177 27190 74402 -93547
9775 -286148 76452 64846 -116259 -310462 -254116 201216 104080 237587 85186 -95724 -235959
9764 -235959 44040 20222 18435 26671 -117309 -109098 -206501 94994 -127302 8328 -90267 64422
9751A03823d19475J32623J27153k39265J79043A72016d7639K2639j5005q1946
9741a21951m3396e3235k6172j37892Q627K0703L5565l113O2552J7580j29160G7396
9728A72505c9023k47273F6625h1513A6058i9773A99392a48660I238L2120J64170
9717B05528o9301a0046l08324D6825Q1774n3261K9814D9348A8284b02413A23612
9705c57107A91575q1670J57448a24590n6370A42902j0574B105c74433B13590b34312
9693A39652E9963b321A40100F9460A8952c22303i8634A64763b04926P9660L4680
9682i0586E543R427J85617j8995i627H9103B7194N3296d0877j88829h0430p1430
9670a51860j5775M2356q1012N5806D11952a29613K4061k63754J34687i864m857
$$ plain form
9751 103823 -419475 -286852 -159699 -398964 -219921 172016 -47639 -25000 -40005 -121951
9741 -121951 -165347 -53235 -79407 -217299 -208672 -187969 -152404 -155517 -92965 -75385 -204545 77396
9728 172505 -39023 -286296 66625 -81513 16058 -99773 199392 -148660 9238 41358 205528
9717 205528 136227 -10046 -318370 46825 128599 75338 105152 49348 18284 -202413 123612
9705 -357107 191575 109905 267353 -124590 -180960 142902 132328 2105 -374433 213590 -234312
9693 139652 59963 -2321 140100 69460 18952 -322303 -98634 164763 -204926 -125266 -90586
9682 -90586 5543 14970 200587 181592 -9627 89103 27194 80490 -40877 -229706 -80430 -151860
9670 -151860 -167635 -125279 -206291 -150485 411952 -129613 -105552 -369306 -234619 -9864 -14721
9659a4721j33593j63024e1053j04827D8453b4340j92862j2789J14077A50800E4381
9647a33772J0227D5149i4652l2833D8639L13476A38557b52025q1584A22668C9757
9635A28726d7584C2053e1865k4821k36198j3641A52944a9038l4866D1017b41210
9623B06023J14562b74951G0563a02943M3207j27295F5141J25503c26896E2499
9612c49902f6510A62772d7600k23248p894J28791C16369G1510a9594k32629P839
9601b44384D1756a32939K7909A97852i7360p0517p1804A29903c6516C6867a72788
9589f00A1102K98968d1547q1405G5628b28079K7065G2185A2098P659g7428B25275
9576B60394c1113A84081a30265j4317K0554j33955n47i6443p2697A3121g3014
$$ plain form
9659 -14721 -148314 -311338 -51053 -155880 48453 -24340 -217202 -229991 -115914 150800 54381
9647 -133772 -123545 45149 -94652 -127485 48639 362115 138557 -252025 -333609 122668 39757
9635 128726 -47584 32053 -51865 -76686 -312884 -326525 152944 -19038 -53904 41017 -241210
9623 206023 320585 -274951 70563 -102943 -59736 -187031 65141 190644 -326896 52499
9612 -349902 -66510 162772 -47600 -270848 -278742 -149951 316369 71510 -19594 -252223 -244384
9601 -244384 41756 -132939 -105030 197852 -97360 -167877 -239681 129903 -36516 36867 -172788
9589 -600 11102 310070 -41547 -122952 75628 -228079 -201014 72185 12098 19757 -77428 225275
9576 260394 -31113 184081 -130265 -144582 -124028 -257983 -258530 -96443 -169140 13121 -73014
9564C5937b98336A68836i7581J9380D2676b80618g0158j04977F1878Q0903f3383
9552b72279d5007C3389N5787a77467G0754P8444A8868c5461m9278k49387f1726
9540e9836B5835e60484a40841j28894b9218c688A6081i865o1994J2288A60030
9528a29738m3531j18449a23307O1093k83433c9592A27904d26217F2282k165f0052
9516f3186k13411L7120B2915f9669l95404g135k71569B26897a82675n0775A46065
9504A3092J8147N7916L5647a67913N3122k60621i4911l3398K429j78715Q8216
9493b16379c8689k64392f5552A63275E54J6701a42016O8963F885c44835E665c7247
9480B83426A00737k5254b20233J6369F932b7281A75867b01116A78069a74217b8049
$$ plain form
9564 35937 -298336 168836 -97581 -78201 42676 -280618 -70158 -175135 61878 142781 -63383
9552 -272279 -45007 33389 89176 -177467 70754 149198 18868 -35461 -84739 -334126 -61726
9540 -59836 25835 -560484 -140841 -269735 -29218 -3688 16081 -9865 -71859 -59571 160030
9528 -129738 -173269 -291718 -123307 -62214 -345647 -39592 127904 -426217 62282 60117 -60052
9516 -63186 -276597 -239477 22915 -69669 -465073 -7135 -278704 226897 -182675 -233450 146065
9504 13092 31239 89155 124802 -167913 -114791 -375412 -94911 -128309 -125880 -304595 -216379
9493 -216379 -38689 -303081 -65552 163275 554 17255 -142016 -73053 6885 -344835 5665 -37247
9480 283426 100737 75483 -220233 -203864 6932 -27281 175867 -201116 178069 -174217 -28049
9468H6069L4505d3584j48856C3472B507b99870M5083I2526D0018f322C32648b05854
9455E770h6981n2843L4362p5263A1251a78652N3154j11493B4654M77a44084n3097
9443a97181i366j20036j56331c0280k73669g7100A80759b58066D2571a04416k96345
9432d00761a97578K9142A91598H7701m2361J83627c27094a33671j31093A5614
9421B85598b02057P6216d3358k62543A62921i668B60262a34416e8627k78292B00267
9409b21305j78851a89406a8136n2988h735j55370M4349A87005H7998a80595A53019
9397A5021f9883m49408e4301A54451n0735d28587a68044F3061a75742B04524f6934
9385d8348A70188b542A94875e5639K6040K047C0713J67845C4314e4478b551o3396
$$ plain form
9468 86069 120574 -43584 -192440 33472 2507 -299870 -254787 92526 40018 -6322 332648 -205854
9455 5770 -86981 -139824 -105462 -180725 11251 -178652 -125498 -236991 24654 25131 -144084 -197181
9443 -197181 -9366 -129402 -285733 -30280 -303949 -77100 180759 -258066 42571 -104416 -400761
9432 -400761 -197578 -168436 191598 87701 45340 228967 -327094 -133671 -264764 15614
9421 285598 -202057 -125841 -43358 -305901 162921 -9668 260262 -134416 -58627 -336919 200267
9409 -221305 -400156 -189406 -18136 -71124 -8735 -164105 -119756 187005 87998 -180595 153019
9397 15021 -69883 -519291 -54301 154451 103716 -428587 -168044 63061 -175742 204524 -66934
9385 -48348 170188 -2542 194875 -55639 -29599 -27552 30713 198558 34314 -54478 -2551 -65947
9373f5947r7449N4543k84697J84157R7406B14453a53316D97634c9191I016c06437
9361A47361f1201j6280j68695A49094a63771O6603p5558m1815M6203e1785f565
9349i8817j39212D6797Q2607a06898k63291E4566f7229n5315A22338E4154a04555
9337b4429A03319b79184B8629a18960b796j88804j00337J22092h530l18425c4870
9325d153p6192l55102d053A55646j0931a89777M4147j23212J30769n0794r107
9314a97974J6039k5696n790N9020F4112M1526K3895f1044B05714o3287a42774
9302a93955E6824h4406j66452A97085a44043J7932J9553m6305B4423L6695b28838
9290d6361A56061g4742G1359e6094N402j50199j9036d7211D972j252a72953O23
$$ plain form
9373 -65947 -163396 -108853 -393550 -209393 -111987 214453 -153316 497634 -39191 9016 -306437
9361 147361 -61201 -77481 -246176 149094 -163771 -97168 -172726 -214541 -168338 -51785 -6565
9349 -98817 -238029 46797 129404 -106898 -370189 54566 -67229 -122544 122338 54154 -104555
9337 -24429 103319 -279184 28629 -118960 -2796 -191600 -291937 -169845 -8530 -326955 -34870
9325 -4153 -80345 -435447 -4053 155646 144715 -189777 -145630 -268842 -138073 -188867 -197974
9314 -197974 -181935 -207631 -213421 -154401 64112 105638 129533 -61044 205714 142427 -142774
9302 -193955 56824 -84406 -250858 197085 -144043 -126111 -106558 -152863 24423 61118 -228838
9290 -46361 156061 -74742 71359 -56094 -50692 -200891 -219927 -47211 4972 3720 -172953 -172330
9278a72330P6861q774M3701A98458a22788F910g1111m4377M6065j9875n1896a3581
9265b62058h3104m0061l38062A00461h4514F017a95438B49230a9056I9133O4685
9254A63818c05152A0430K63841b73565a8855k58476A4253a39821O8487k8555k43137
9243c43026c3660q4882N6310A18188a30736q9141A93596l870a51918k82286f1148
9231i2486j28083c1663p36D2887a29961c8485J1102r2306A40784a85173g4459
9219g62C11408b06917C28297A3785d46801A82965e65137g1322A15726C1232J38081
9208A69313l9622k7471O2526a95687A33782J7902k0516b30788h1804a6180C96697
9196c80397J67313e1365N700k11589A71481e57891B60133j18042a70087E2143
$$ plain form
9278 -172330 -95469 -104243 -60542 198458 -122788 6910 -71111 -115488 -69423 -89298 -141194 -13581
9265 -262058 -83104 -123165 -461227 100461 -84514 6017 -195438 249230 -19056 99133 163818
9254 163818 -305152 10430 274271 -273565 -18855 -277331 14253 -139821 -71334 -99889 -343026
9243 -343026 -33660 -118542 -62232 118188 -130736 -219877 193596 189726 -151918 -434204 -61148
9231 -92486 -220569 -31663 -32399 42887 -129961 -38485 -27383 -119689 140784 -185173 -74459
9219 -762 311408 -206917 328297 13785 -446801 182965 -565137 -71322 115726 31232 169313
9208 169313 129691 102220 164746 -195687 133782 151684 131168 -230788 -81804 -16180 396697
9196 -380397 -213084 -51365 -45665 -257254 171481 -557891 260133 142091 -170087 52143
9185B5748a27484L3442A4893L57315E871a59267p5720i9234J3780A43860E9611
9173C2088e870I7133a17066j5647l53016B22764b58568r8663D9815d790r3868
9162i8658j720E3162m67i5625j7985A398g2956A45372N1135a71265m2829F2588
9149A59160b71562R2584J1836j46173J42988d9394q6880N3495p5519B02242A00725
9137b98422A01939a00570l8900A86472a23934j00320R1534H5724b4604k59253
9127b83857A06389d18192H4471A3321a7131A11086c0029j33657N0216p4409E5477
9115i5682J6557l3326j58056G4152l6089b57845L16d7722K0360C9283b41400j4827
9103b56227L8325c6339A69971a16508q6782J4127N0901j73842J19272B11976l0284
$$ plain form
9185 25748 -127484 -94042 14893 372208 5871 -159267 -234987 -99234 -85454 143860 59611
9173 32088 -5870 97133 -117066 -132713 -485729 222764 -258568 -357231 49815 -4790 -98658
9162 -98658 -100378 53162 52695 -95625 -113610 1398 -72956 145372 196507 -171265 -214094 62588
9149 159160 -271562 -178978 -167142 -313315 -170327 -49394 -136274 -82779 -158298 202242 100725
9137 -298422 101939 -100570 -139470 186472 -123934 -224254 -132720 85724 -24604 -283857
9127 -283857 106389 -418192 84471 13321 -17131 111086 -30029 -163686 -113470 -187879 55477
9115 -95682 -79125 -112451 -270507 74152 38063 -257845 -257529 -47722 -27362 39283 -241400 -256227
9103 -256227 -217902 -36339 169971 -116508 -203290 -189163 -138262 -312104 -192832 211976 181692
9092A81692c9659j92330h6687b9991k08854A43746f9773j06643A12647O0379E22
9080E7731J14663c1994l0440p8130F4414J4049b06585O5421A47576c20135J38989
9069a81146f4597B00035i72F7451a28324j08343A06047a73802C1180K37308P1269
9058C39757a38693j50613B54063c10941a33701k81347a21228C17060c3796N873
9048b7923o894j11422j8051k34285i5138G0530J12667J34762a79066D4224P7431
9037A21655N7356H9332b21626A14013C2243c45502J45577O078A24774a34920C10702
9025b6615A31759l6999b85591R4597b0463C4004d62548B01833o3605d9393l48361
9014c97754D5637e697B92496c1018j06472G3947a2851A93955b1857m8730L1311
$$ plain form
9092 181692 -39659 -231989 -86687 -29991 -238845 143746 -69773 -176416 112647 173026 522
9080 57731 172394 -31994 -62434 -140564 64414 78463 -206585 -141164 147576 -320135 -181146
9069 -181146 -64597 200035 -972 67451 -128324 -236667 106047 -173802 31180 268488 339757
9058 339757 -138693 -289306 254063 -310941 -133701 -415048 -121228 317060 -33796 -27923
9048 -27923 -34817 -146239 -164290 -398575 -95138 70530 183197 317959 -179066 44224 121655
9037 121655 179011 89332 -221626 114013 32243 -345502 -199925 -193847 124774 -134920 310702
9025 -26615 131759 94760 -285591 -190994 -20463 34004 -462548 201833 138228 -49393 -397754
9014 -397754 45637 -5697 292496 -31018 -137490 73947 -12851 193955 -21857 -70587 -39276
9003c9276B8378d2510k74357J13995g8587G7031a8028A76962a65087c2531D645
8991A01992b38499J00624L6776B0188c65731O5606C49424A52757k1312k6475K28809
8980C33779H7251d08965a12925A9507d4655I2128g8396A41524a17640C9876J03323
8969A43199a54313A19781a39665O4400m479B42572R0972b64660a01207n3412A35261
8957c32081A33716c3215j70309B9683a29205e2923R983A1993Q4443A2799e3877
8945a15648j0908q5272R6835k30749J8409G2640o653e8050b0717A41046l0011
8934A11035j5199M7451P2134a34472A52821c18307a03436A11666K50638J83286
8924E45590J35274J268680N101860j811225A505220E60941j51531g4984B90390
$$ plain form
9003 -39276 28378 -42510 -316867 -202872 -78587 77031 -18028 176962 -165087 -32531 4645
8991 101992 -238499 -137875 -101099 20188 -365731 -300125 349424 152757 131445 104970 333779
8980 333779 87251 -408965 -112925 19507 -44655 92128 -78396 141524 -117640 39876 143199
8969 143199 -154313 119781 -139665 -75265 -79744 242572 333544 -264660 -101207 -154619 135261
8957 -332081 133716 -33215 -203524 29683 -129205 -52923 -42940 11993 96436 12799 -53877
8945 -115648 -126556 -211828 -114993 -345742 -327333 72640 65987 -58050 -20717 141046 111035
8934 111035 95836 143287 215421 -134472 152821 -318307 -103436 111666 362304 545590
8924 545590 680864 1949544 7051404 5240179 1505220 560941 409410 -74984 290390
8914D04785A89380J00599Q2336A0972b58251F350a187A3008g6427A29018f2772
8902A20552i6223J3112c1896j96013m7728D48231A87162c60767A71619e8576A97221
8890g4194C7350e5829B23159a1497m70633B83657a94277K1983F8589j05K43259
8879C11743b16931J7125B6759a31851d7994B32639c23282N5359r1437A31482c5511
8867a28403A45862c67518A1882J29754J52181a04260m33361a99137H8143j9e13721
8855H1954f2243B4185a2796A23400a50734b8324j69681E041a26791o7842h1176
$$ plain form
8914 404785 189380 289979 372315 10972 -258251 6350 -1187 13008 -76427 129018 -62772
8902 120552 -96223 -83111 -31896 -227909 -275637 448231 187162 -360767 171619 -58576 197221
8890 -74194 37350 -55829 223159 -11497 -482130 283657 -194277 -172294 68589 68484 311743
8879 311743 -216931 -199806 26759 -131851 -47994 232639 -323282 -267923 -359360 131482 -35511
8867 -128403 145862 -367518 11882 141636 293817 -104260 -537621 -199137 88143 88124 -513721
8855 81954 -62243 24185 -12796 123400 -150734 -28324 -198005 5041 -126791 -194633 -81176
$$ [...]
##END NTUPLES=NMR SPECTRUM
##END=
