
##TITLE=AC1309_BRAAS11121_6524898_aVjRR3K3v8
##JCAMPDX= 6.0         $$ Bruker NMR JCAMP-DX V2.0
##DATA TYPE= NMR SPECTRUM
##DATA CLASS= NTUPLES
##ORIGIN= BRUKER
##OWNER= Administrator
$$ 1.72 TOPSPIN		Version 2.1
$$ 2012-07-15 00:40:26.781 -0500  Administrator@TOPSPIN
$$ Compression mode = diff/dup
##.OBSERVE FREQUENCY= 400.02188249412
##.OBSERVE NUCLEUS= ^1H
##.ACQUISITION MODE= SIMULTANEOUS (DQD)
##.ACQUISITION SCHEME= undefined
##.AVERAGES= 8
##.DIGITISER RES= 22
##SPECTROMETER/DATA SYSTEM= spect
##.PULSE SEQUENCE= zg30
##.SOLVENT NAME= COFFEE_meoh
##.SHIFT REFERENCE= INTERNAL, COFFEE_meoh, 1, 14.98509
##AUDIT TRAIL= $$ (NUMBER, WHEN, WHO, WHERE, PROCESS, VERSION, WHAT)
$$ ##TITLE= Audit trail, TOPSPIN		Version 2.1
$$ ##JCAMPDX= 5.01
$$ ##ORIGIN= Bruker BioSpin GmbH
$$ ##OWNER= Administrator
$$ $$ C:\Bruker\TOPSPIN/data/COFFEE/nmr/AC1309_BRAAS11121_6524898_aVjRR3K3v8/10/pdata/1/auditp.txt
$$ ##AUDIT TRAIL=  $$ (NUMBER, WHEN, WHO, WHERE, PROCESS, VERSION, WHAT)
(   1,<2012-07-15 00:40:19.703 -0500>,<Administrator>,<TOPSPIN>,<go>,<TOPSPIN 2.1>,
      <created by zg
	started at 2012-07-15 00:39:13.171 -0500,
	POWCHK enabled, PULCHK disabled,
       configuration hash MD5:
       6B 1B 68 BB D9 2E 58 E2 7F 35 AD 54 07 DF 0E 41
       data hash MD5: 64K
       C3 07 E1 B3 C5 2F B5 C3 C5 41 88 7A F1 85 C7 D2>)
(   2,<2012-07-15 00:40:22.390 -0500>,<Administrator>,<TOPSPIN>,<proc1d>,<TOPSPIN 2.1>,
      <Start of raw data processing
       efp LB = 0 FT_mod = 6 PKNL = 1 PHC0 = 0 PHC1 = 0 SI = 32K 
       data hash MD5: 32K
       6B 6C ED 7C 08 4C C3 D5 09 1F 0A 1F 9C 7B FE AF>)
(   3,<2012-07-15 00:40:22.843 -0500>,<Administrator>,<TOPSPIN>,<proc1d>,<TOPSPIN 2.1>,
      <pk PHC0 = 173.8257 PHC1 = 0 
       data hash MD5: 32K
       C4 1C 21 BE 42 EE 41 84 F8 8D E7 3E 29 B0 97 4F>)
(   4,<2012-07-15 00:40:22.937 -0500>,<Administrator>,<TOPSPIN>,<proc1d>,<TOPSPIN 2.1>,
      <abs ABSG = 1 
       data hash MD5: 32K
       FC 8F 97 AF 45 99 A0 AF E9 CD 39 B6 86 1F 9F 2A>)
(   5,<2012-07-15 00:40:23.000 -0500>,<Administrator>,<TOPSPIN>,<proc1d>,<TOPSPIN 2.1>,
      <abs ABSG = 2 
       data hash MD5: 32K
       05 D2 7F 02 60 8D F8 44 60 B3 70 6C A2 A9 0A BD>)
(   6,<2012-07-15 00:40:23.031 -0500>,<Administrator>,<TOPSPIN>,<proc1d>,<TOPSPIN 2.1>,
      <abs ABSG = 3 
       data hash MD5: 32K
       43 9F FE 8D 6B E1 85 AF 0B 29 75 79 2A 91 19 F6>)
(   7,<2012-07-15 00:40:23.062 -0500>,<Administrator>,<TOPSPIN>,<proc1d>,<TOPSPIN 2.1>,
      <abs ABSG = 4 
       data hash MD5: 32K
       7C 7B 7B 5F 4B FF 17 9B C0 AB 4E 28 E3 07 5D 86>)
(   8,<2012-07-15 00:40:23.093 -0500>,<Administrator>,<TOPSPIN>,<proc1d>,<TOPSPIN 2.1>,
      <abs ABSG = 5 
       data hash MD5: 32K
       55 56 F7 C0 F5 00 03 AB B2 15 3D 6C 54 7C BD 68>)
$$ ##END=
$$ 
$$ $$ hash MD5
$$ $$ 2B FF 5A 6A BC 41 BF BB 00 FD B9 E6 A3 CD A0 39
##$RELAX= 
##$RELAX= 
##$RELAX= 
##$RELAX= 
##$RELAX= 
##$RELAX= 
##$RELAX= 
$$ Bruker specific parameters
$$ --------------------------
$$ [...]
##$TP= (0..7)
150 150 150 150 150 150 150 150
##$TP07= 0
##$TPNAME0= <>
##$TPNAME1= <>
##$TPNAME2= <>
##$TPNAME3= <>
##$TPNAME4= <>
##$TPNAME5= <>
##$TPNAME6= <>
##$TPNAME7= <>
##$TPOAL= (0..7)
0.5 0.5 0.5 0.5 0.5 0.5 0.5 0.5
##$TPOFFS= (0..7)
0 0 0 0 0 0 0 0
##$TUNHIN= 0
##$TUNHOUT= 0
##$TUNXOUT= 0
##$USERA1= <user>
##$USERA2= <user>
##$USERA3= <user>
##$USERA4= <user>
##$USERA5= <user>
##$V9= 5
##$VALIST= <valist>
##$VCLIST= <CCCCCCCCCCCCCCC>
##$VD= 0
##$VDLIST= <DDDDDDDDDDDDDDD>
##$VPLIST= <PPPPPPPPPPPPPPP>
##$VTLIST= <TTTTTTTTTTTTTTT>
##$WBST= 2048
##$WBSW= 25
##$XGAIN= (0..3)
0 0 0 0
##$XL= 0
##$YL= 0
##$YMAX_a= 483710
##$YMIN_a= -597709
##$ZGOPTNS= <>
##$ZL1= 120
##$ZL2= 120
##$ZL3= 120
##$ZL4= 120
##$ABSF1= 14.98509
##$ABSF2= -5.573092
##$ABSG= 5
##$ABSL= 3
##$ALPHA= 0
##$AQORDER= 0
##$ASSFAC= 0
##$ASSFACI= 0
##$ASSFACX= 0
##$ASSWID= 0
##$AUNMP= <proc_prof1d_extract_pilot.lims>
##$AXLEFT= 0
##$AXNAME= <>
##$AXNUC= <1H>
##$AXRIGHT= 0
##$AXTYPE= 0
##$AXUNIT= <>
##$AZFE= 0.1
##$AZFW= 0.1
##$BCFW= 0
##$BC_mod= 0
##$BYTORDP= 0
##$COROFFS= 0
##$CY= 15
##$DATMOD= 1
##$DC= 0
##$DFILT= <>
##$DTYPP= 0
##$F1P= 0
##$F2P= 0
##$FCOR= 0.5
##$FTSIZE= 32768
##$FT_mod= 6
##$GAMMA= 0
##$GB= 0
##$INTBC= 1
##$INTSCL= 1
##$ISEN= 128
##$LB= 0
##$LEV0= 0
##$LPBIN= 0
##$MAXI= 10000
##$MC2= 0
##$MEAN= 0
##$ME_mod= 0
##$MI= 0
##$NCOEF= 0
##$NC_proc= -8
##$NLEV= 6
##$NOISF1= 0
##$NOISF2= 0
##$NSP= 0
##$NTH_PI= 0
##$NZP= 0
##$OFFSET= 14.98509
##$PC= 1
##$PHC0= 173.8257
##$PHC1= 0
##$PH_mod= 1
##$PKNL= yes
##$PPARMOD= 0
##$PPDIAG= 0
##$PPIPTYP= 0
##$PPMPNUM= 2147483647
##$PPRESOL= 1
##$PSCAL= 4
##$PSIGN= 0
##$PYNMP= <proc.py>
##$REVERSE= no
##$SF= 400.02
##$SI= 32768
##$SIGF1= 0
##$SIGF2= 0
##$SINO= 400
##$SIOLD= 32768
##$SPECTYP= <>
##$SREGLST= <1H.CDCl3>
##$SSB= 0
##$STSI= 32768
##$STSR= 0
##$SW_p= 8223.68421052631
##$SYMM= 0
##$S_DEV= 0
##$TDeff= 65536
##$TDoff= 0
##$TI= <>
##$TILT= no
##$TM1= 0
##$TM2= 0
##$TOPLEV= 0
##$USERP1= <user>
##$USERP2= <user>
##$USERP3= <user>
##$USERP4= <user>
##$USERP5= <user>
##$WDW= 1
##$XDIM= 32768
##$YMAX_p= 476890723
##$YMIN_p= -689970
##$CURPLOT= <Network HP LaserJet P1505>
##$CURPRIN= <$Network HP LaserJet P1505>
##$DFORMAT= <normdp>
##$LAYOUT= <+/1D_H.xwp>
##$LFORMAT= <normlp>
##$PFORMAT= <normpl>
##$SURQMSG= 1
$$ End of Bruker specific parameters
$$ ---------------------------------
##NTUPLES= NMR SPECTRUM
##VAR_NAME=  FREQUENCY,     SPECTRUM/REAL,   SPECTRUM/IMAG
##SYMBOL=    X,             R,               I
##VAR_TYPE=  INDEPENDENT,   DEPENDENT,       DEPENDENT
##VAR_FORM=  AFFN,          ASDF,            ASDF
##VAR_DIM=   32768,         32768,           32768
##UNITS=     HZ,            ARBITRARY UNITS, ARBITRARY UNITS
##FACTOR=    0.250966925370066, 1,           1
##FIRST=     8223.43324360094, -68810,       -45156
##LAST=      0,             -205921,         40734
##MIN=       0,             -689970,         0
##MAX=       8223.43324360094, 476890723,    0
$$ Real data points
##PAGE= N=1
##DATA TABLE= (X++(R..R)), XYDATA
$$ [...]
$$ plain form
19538 -126392 -212102 64430 154630 -270880 253613 198977 -183476 18305 102166 35076 -185829
19526 59836 -499485 -103976 89781 -210879 120062 205386 -110981 -44945 39744 -425687
19515 -190278 114638 -98824 390645 -352243 -263279 -232149 -24956 148654 136012 49987 35208
19504 35208 -97096 -72691 47372 -48481 -125076 -183235 -243127 -282572 -40174 -51914 -111036 131872
19491 313571 49009 335925 170022 -197210 -75611 -229444 137354 -34677 -75674 71079
19480 49977 12020 -146147 -140878 -308006 -28166 108364 122399 -75460 -40657 112812 -181409
19468 -133280 -54713 86320 -54699 98400 1538 -129000 134256 -86609 -74161 -397893 -70191
19456 229443 69119 60488 -168866 210395 295817 -41910 46705 9020 -122335 211106 6990
$$ packed form
19538a26392q5710F4430R0200b70880B53613n4636a83476A8305Q3861C5076a85829
19526E9836d99485a03976H9781b10879A20062Q5324a10981d4945C9744d25687
19515a90278A14638i8824C90645c52243Q8964L1130b4956A48654j2642D9987j4779
19504C5208i7096K4405D7372d8481p6595n8159n9892l9445d0174j1740n9122A31872
19491C13571D9009K86916j65903a97210g5611j53833A37354c4677m0997G1079
19480D9977A2020a46147N269j67128b8166A08364J4035g5460L4803A12812a81409
19468a33280e4713H6320e4699I8400A538a29000A34256h6609J2448l23732g0191
19456B29443F9119q631a68866B10395Q5422d1910D6705I020a22335B11106F990
$$ plain form
19444 260784 -51539 173058 19314 387780 -63411 -81869 -187768 14463 267382 -157355
19433 -208587 -84447 -217905 -384664 -280349 -244805 -194776 -219953 -538822 -67188 -313535
19423 -313535 -141659 82545 173098 -132236 -275569 -243343 100442 167083 -157205 -105419
19413 -105419 76767 -68501 -6408 75273 40604 -37654 -9209 56663 -47384 -168167 -992 -408435
19401 -408435 1784 -193246 -313128 -340146 -120914 -43855 -20251 -226886 -132443 -158412 -125823
19390 -125823 -201519 74404 122415 -368340 82440 -87453 -282644 -4926 262110 -18102 -144057
19379 -144057 93118 -354839 159746 -122119 40674 -105754 -172172 -27485 37614 -58217 -130745
19368 -130745 -367895 -163262 -328513 -354555 102577 -103848 -273859 -236962 123200 -83365
$$ packed form
19444B60784e1539A73058A9314L68466f3411j8458j05899A4463K52919a57355
19433b08587h4447j33458j66759J04315L5544N0029k5177l18869f7188k46347
19423c13535a41659H2545R0553a32236j43333L2226A00442O6641a57205N1786
19413a05419G6767f8501f408G5273l4669c7654i209E6663d7384j20783i92m07443
19401d08435A784a93246j19882k7018a20914d3855b0251k06635R4443k5969L2589
19390a25823p5696G4404M8011c68340H2440h7453j95191d926B62110a8102j25955
19379a44057I3118c54839A59746a22119D0674a05754o6418b7485C7614e8217p2528
19368a30745k37150a63262j65251k6042A02577a03848j70011L6897A23200h3365
$$ plain form
19357 -84746 -148344 -290660 -348215 -184225 -59040 -189450 -44876 135922 308752 -157503
19346 -117515 283093 21382 6093 -150050 267185 -272426 -36137 -27165 17892 64381 75477
19335 75477 246108 -146032 -197677 94382 -237012 -228469 -105385 -470054 -277390 -204616 -58421
19323 -182058 -417230 -234666 61186 12852 -35869 31637 133561 -156529 2978 43293 136035
19312 136035 152775 -187646 -97851 158762 106738 29320 -265538 193005 -146175 -75503
19302 -75503 18327 -87105 241278 -256285 -273788 64561 297090 -28440 -273021 198449 -258088
19290 36771 -149358 -385197 410598 -287695 214772 15558 -284347 236913 -50314 -118087
19280 -118087 -148209 104108 29323 -119175 -113694 -315548 -199410 -126008 -418637 316776
$$ packed form
19357h4746o3598j42316n7555J63990e9040j30410d4876A35922J72830a57503
19346a17515B83093B1382F093a50050B67185b72426c6137Q972A7892M6489J1096
19335G5477J70631a46032n1645I4382b37012Q543a05385l64669J92664P2774e8421
19323a82058k35172J82564F1186A2852c5869C1637J01924a56529B978M0315R2742
19312A36035J6740a87646Q9795A58762n2024B9320b65538A93005a46175P0672
19302g5503A8327h7105B41278b56285j7503F4561K32529b8440k44581A98449b58088
19290C6771a49358k35839D10598b87695B14772A5558b84347B36913e0314o7773
19280a18087l0122A04108B9323a19175N481k01854J16138P3402k92629C16776
$$ plain form
19269 -213127 200351 -127151 -261341 -395171 -92379 -133237 102466 375892 103570 21343
19258 -109078 74748 -152441 192443 -86415 -102023 -21539 -279822 -235459 -297231 29946 116921
19247 116921 -357669 -96799 -333599 47239 118736 146026 -42754 -186990 -111752 -107205 142874
19235 73040 -108710 -181175 -24162 -235483 -160412 -170834 78558 -100979 -12272 92118 190293
19224 190293 -332373 142179 -33585 177412 -194497 -158938 -305509 190483 -63920 13784
19213 -78544 -26350 -159727 16785 215722 79174 10465 -208183 -83904 -109061 -97758 -47528
19201 -29363 -65826 -88837 -141126 -118416 130958 7164 -58214 -267577 -171734 65008 -313955
19189 -123758 107470 -158371 -2537 243367 68111 37189 191795 -15818 -65971 -172548 43615
$$ packed form
19269b13127B00351a27151j34190j33830i2379m0858A02466K73426A03570B1343
19258a09078G4748a52441A92443h6415j5608b1539k58283M4363o1772B9946Q6975
19247A16921c57669i6799k36800D7239P1497K7290d2754j44236P5238M547A42874
19235G3040a08710p2465b4162k11321P5071j0422G8558a00979a2272I2118R8175
19224A90293c32373A42179c3585A77412a94497L5559j46571A90483f3920A3784
19213g8544b6350j33377A6785J98937G9174A0465b08183h3904k5157J1303d7528
19201b9363l6463k3011n2289K2710A30958G164e8214k09363R5843F5008c13955
19189a23758A07470a58371b537B43367F8111l0922J54606a5818n0153j06577D3615
$$ plain form
19177 -315373 -84466 -261581 -75322 -97001 326272 -57762 -21663 -91036 296318 -98920 -188226
19166 -188226 157968 -76199 -34180 -191544 -27424 -383819 -188601 -191568 94682 130535 -49350
19154 -139354 -193613 124620 192167 28288 -313061 -108006 72340 236953 -98034 -163718 -170866
19143 -170866 57171 173149 -220981 -370834 -208632 -41310 131063 -99350 -381433 45740
19132 137219 -29829 -278756 -245454 -332297 27752 -19317 -188066 -13109 -323494 103385 -4846
19120 20158 -241395 -185746 -230248 79375 -29923 -294561 69944 -5196 19059 -43577 201152
19108 -24006 135629 -220728 28763 221724 214210 -84172 -306369 115548 -64960 -367376 96131
19096 -232818 109335 127290 -161098 126533 -143784 108472 -67184 -340588 -35517 -54400
$$ packed form
19177c15373h4466j77115g5322k1679C26272e7762b1663o9373B96318i8920q9306
19166a88226A57968g6199c4180j57364b7424l56395a88601k967I4682L5853d9350
19154a39354n4259A24620O7547B8288c13061a08006G2340J64613i8034o5684p148
19143a70866E7171J15978b20981j49853J62202d1310A31063i9350k82083D5740
19132A37219b9829k48927L3302q6843B7752a9317j68749a3109l10385A03385d846
19120B0158b41395N5649m4502G9375b9923k64638F9944e196A9059d3577B01152
19108b4006A35629b20728B8763J92961p514h4172k22197A15548f4960l02416I6131
19096b32818A09335J7955a61098A26533a43784A08472f7184k73404c5517j8883
$$ plain form
19086 -54400 268697 147737 -111831 -31580 -242694 -286445 -284320 -82888 -394409 -499468 -319417
19075 -319417 -266632 69032 32099 -75817 254130 -204422 46481 36586 159972 -47124 167655
19063 178352 -23336 -60207 -367607 -88774 -47120 -204701 -73390 -82242 -325794 -282914 -201636
19052 -201636 186934 299736 112985 -260623 314826 135891 298482 -221510 109143 97578
19042 97578 -418574 203760 -249275 6193 -94520 40775 -87735 -185672 38477 151270 -108952
19030 266309 2714 -41031 -65403 2770 187343 -152897 12743 349015 -241217 188301 -205360
19018 190304 -245864 -101128 137085 -13695 303542 94104 -101246 -487348 408946 132002
19007 -139727 207200 -34001 30434 -255619 -157037 94275 -10889 174429 -11581 38657 -158350
$$ packed form
19086e4400B68697j20960a11831c1580k11114m3751K125h2888l11521j05059J80051
19075c19417N2785F9032C2099g5817B54130b04422D6481r895J23386d7124A67655
19063A78352b3336l6871l07400h8774M1654j57581g3390q852k43552M2880Q1278
19052b01636A86934J12802A12985b60623C14826A35891J62591b21510A09143j1565
19042I7578d18574B03760b49275F193i4520D0775h7735r7937C8477J12793a08952
19030B66309B714d1031k4372B770J84573a52897A2743L36272b41217A88301b05360
19018A90304b45864a01128A37085a3695C03542I4104a01246l86102D08946A32002
19007a39727B07200c4001C0434b55619R8582I4275a0889A74429a1581C8657a58350
$$ plain form
18995 105958 -212255 102671 320842 -274475 115545 26329 -42753 -155562 126376 -30011
18984 113720 -163896 -106336 -42322 211270 91539 146351 -189361 5816 198578 27836 100834
18973 100834 -214315 163052 426801 -77381 -218723 -112815 67094 53921 -22290 -213774
18963 -213774 -46020 90868 -161133 -454154 -62860 266768 -156229 -220550 -320828 3604 -184620
18951 44253 55042 -197255 -153192 -156556 -15506 141284 -355022 -352633 64295 220716 135908
18940 135908 321531 -125226 186263 119022 433506 261826 250157 -223220 -64659 61289
18929 -140742 -173222 27001 190653 215015 -138145 -111162 78071 -56955 91761 15520 86618
18918 86618 185528 -300370 -19982 135316 -162898 -252250 156330 51283 203235 -218753
$$ packed form
18995A05958b12255A02671K18171b74475A15545B6329d2753j12809A26376c0011
18984A13720a63896N7560d2322B11270I1539N4812a89361E816J92762B7836P2998
18973A00834b14315A63052K63749g7381j41342J05908F7094j3173b2290j91484
18963b13774d6020I0868a61133k93021f2860B66768a56229o4321j00278C604a84620
18951D4253J0789a97255M4063l364a5506A41284c55022K389F4295J56421q4808
18940A35908J85623a25226A86263o7241L14484j71680j1669b23220f4659F1289
18929a40742l2480B7001J63652K4362a38145K6983G8071e6955I1761A5520P1098
18918H6618R8910c00370a9982A35316a62898q9352A56330E1283J51952b18753
$$ plain form
18907 117988 165441 205198 -78467 221438 -77747 -80010 -258917 72780 23097 -78782 16924
18895 -240078 -150759 89226 -89181 40045 -93322 -55473 -7413 -39629 -175118 141284 -118743
18883 280301 -227388 53719 -16733 -26884 -149854 -381496 173809 -23015 204211 -13506
18872 96637 30343 -120349 78269 -81474 126061 -304012 -358362 -114389 137509 295702
18862 295702 100209 -12310 400569 239784 -52551 16482 -306981 164725 -8151 176745
18851 13782 -316479 138294 -87073 252325 146305 -34774 -58047 -262934 99063 -48699 90921
18839 -48027 -13931 249219 -166902 -2439 -291187 73344 165511 -311096 -197365 -294425 -261060
18828 -261060 -31887 35758 -74814 55128 -178202 -214455 34251 -58923 17707 164899 183799
$$ packed form
18907A17988M7453L9757g8467B21438g7747k263j78907G2780B3097g8782A6924
18895b40078Q9319H9226h9181D0045i3322L7849g413l2216j35489A41284a18743
18883B80301b27388E3719a6733j0151j22970k31642A73809b3015B04211a3506
18872I6637C0343a20349G8269h1474A26061c04012n4350a14389A37509J58193
18862B95702A00209a2310D00569j60785e2551A6482c06981A64725h151A76745
18851A3782c16479A38294h7073B52325j06020c4774k3273k04887I9063d8699I0921
18839d8027a3931B49219a66902b439k88748G3344R2167c11096J13731r7060L3365
18828b61060c1887C5758g4814E5128a78202l6253C4251e8923A7707J47192J8900
$$ plain form
18817 183799 -5827 61186 -92985 69101 42875 5553 201803 90872 351794 149344 -200954
18805 117210 -293909 -159389 -115432 -385981 -28512 138902 -239389 -3269 183374 -49540
18794 234747 -3547 79239 144534 -49094 99637 92668 206798 30803 -165773 -20138 -42489
18783 -42489 -248329 219380 -138191 -109951 -33421 -66851 35882 -26462 -177216 -229921 52662
18771 -21267 309000 -110172 -35189 -105927 -70785 153056 -152365 50203 338326 181062
18761 181062 345736 192671 -174940 136879 18592 14528 -60353 -163062 8040 -112659 -210655
18750 -210655 -548982 375235 39649 59731 -75554 55003 29381 95171 -212564 -162650 25353
18738 169126 -29325 196790 82081 -443169 -71276 -221650 -155483 118778 83219 -5360 -299948
$$ packed form
18817A83799e827F1186i2985F9101k6226E553J96250I0872K60922A49344b00954
18805A17210b93909J34520M3957k70549b8512A38902b39389c269A83374d9540
18794B34747c547G9239O5295d9094I9637o969J14130C0803a65773b0138k2351
18783d2489k05840B19380a38191K8240c3421l3430C5882b6462j50754n2705E2662
18771b1267C09000a10172c5189p0738L5142A53056a52365E0203K88123j57264
18761A81062J64674j53065a74940A36879A8592m064f0353j02709H040a12659r7996
18750b10655l38327C75235C9649K0082g5554E5003k5622O5790b12564M9914B5353
18738A69126b9325A96790H2081d43169g1276j50374O6167A18778l5559e360k94588
$$ plain form
18727 -299948 -1052 23060 -179110 -50715 -123901 -140973 -115742 243794 196365 -101518 -364980
18716 -364980 430683 186667 112520 -210013 265426 79021 -111100 -65731 380664 -140441
18705 -315367 30682 -142663 -521113 15280 -142660 -68794 87054 -348650 -254760 73943 94959
18694 94959 98392 -84558 -157978 21929 -488482 -359739 -505586 -276197 8693 -213187 -121707
18683 -121707 91032 -304698 -139999 -148819 130633 412268 -242831 111123 -171298 -11070
18672 -211560 -293064 -225657 169673 201144 314522 -107077 89472 -152614 -58286 201606
18661 -77756 -334372 82297 -444073 -95448 191153 -467694 192590 -61779 -76203 92606 -70939
18649 -295009 -47750 -169597 -414498 130133 77726 -178085 -141524 -58227 78626 58366 -10392
$$ packed form
18727b99948a052B3060a79110e0715p3186j7072K5231B43794m7429a01518k63462
18716c64980D30683A86667p4147b10013B65426G9021a11100M5369C80664a40441
18705c15367C0682a42663l78450A5280a42660f8794H7054c48650R3890G3943K1016
18694I4959L433h4558p3420B1929d88482J28743j45847K29389H693b13187R1480
18683a21707I1032c04698a39999q820A30633K81635b42831A11123a71298a1070
18672b11560q1504O7407A69673L1471J13378a07077H9472a52614e8286B01606
18661g7756k56616H2297d44073i5448A91153d67694A92590f1779j4424I2606g0939
18649b95009d7750j21847k44901A30133n2407a78085L6561e8227G8626k0260a0392
$$ plain form
18637 63433 87920 -210206 124308 258280 77366 45330 -103553 -289849 42583 -241653
18626 -198733 124212 68720 136983 -185747 -66280 96052 229690 46466 -129030 88494 -32729
18614 -121346 -12207 -186305 -173587 76369 -61600 -172536 -104224 -394884 -195558 74297 -31554
18602 146425 -346393 -276685 -199175 -150549 80189 -374325 94726 -35922 -373712 -428815 -56893
18590 117771 -30778 140734 -150163 -554164 -1460 -52214 -218046 -190609 92256 56118 -5896
18578 161942 -71742 -119264 169904 40554 -144796 -189541 -149343 -281387 -254063 302535 -109413
18566 -71035 -302088 156117 40450 -19893 -159463 57911 242955 -223158 -159039 -59042 -160540
18555 -160540 16881 -88031 138511 46022 -94513 85397 -73943 60978 -1538 -202107 -209131
$$ packed form
18637F3433K4487b10206A24308J33972G7366l2036a03553j86296D2583b41653
18626a98733A24212n5492O8263a85747f6280I6052J33638D6466a29030H8494c2729
18614a21346a2207j74098J2718G6369f1600j10936O8312k90660a95558G4297c1554
18602A46425c46393O9708P7510M8626H0189c74325I4726c5922l37790n5103e6893
18590A17771c0778A40734a50163m04001a460n0754j65832K7437I2256l6138e896
18578A61942g1742m7522A69904D0554a44796m4745M0198j32044K7324C02535a09413
18566g1035k31053A56117D0450a9893j39570E7911J85044b23158O4119e9042j01498
18555a60540A6881h8031A38511D6022i4513H5397g3943F0978a538k00569p024
$$ plain form
18544 -209131 105522 -179076 53326 -83789 -15115 -132185 -50394 -234803 127127 -102721
18533 101207 -175448 -6640 -117154 -263318 -358960 72602 -38535 -309173 -22392 -226398 -280455
18522 -280455 -343810 -184727 -255676 117070 15618 212893 -206120 -158025 -450831 -61318
18511 -34221 -194554 346717 101119 -88153 53395 154444 -64854 187962 -57525 -86851 114496
18499 -125226 230211 -20569 26025 88115 123288 137087 119951 203946 48732 77267 -282638
18487 25194 -272822 -59129 152789 131995 139348 77766 9952 7594 -306297 -34988 -97869 65611
18474 -38801 82693 -75718 127851 -81349 -112726 110783 115275 81356 70423 -306104 151979
18462 111398 119749 88299 184657 -276052 -16215 -293529 83908 43886 15111 114396 58483
$$ packed form
18544b09131A05522a79076E3326h3789a5115j17070e0394j84409A27127a02721
18533A01207a75448f640j10514j46164r5642G2602c8535k70638b2392k04006n4057
18522b80455o3355J59083p0949A17070A5618J97275b06120M8095k92806f1318
18511c4221j60333C46717A01119h8153E3395J01049f4854A87962e7525k9326A14496
18499a25226B30211b0569B6025O2090L5173J3799j7136Q3995D8732K8535b82638
18487B5194b72822e9129A52789k0794P353o1582I952k358c06297c4988o2881F5611
18474c8801H2693g5718A27851h1349l1377A10783M492l3919j0933c06104A51979
18462A11398Q351l1450R6358b76052a6215k77314H3908m0022A5111R9285n5913
$$ plain form
18451 58483 -87963 -60919 -80716 -290166 -320437 -149532 428221 48694 -225824 148621 -113549
18439 -227974 -163309 -98872 -108046 43924 -163074 63252 -88275 -41930 231700 11707 -222943
18427 43826 -342209 -75722 -62446 -383582 -95058 -40070 -251072 -227659 -104801 -6792 -78565
18416 -78565 -229041 181779 -98208 -53894 -346315 33419 246110 -172176 -285157 56334
18405 -43859 17979 26513 -29477 -241212 -50622 -35191 14110 -137222 -44908 219038 127661
18394 127661 172001 31808 -328519 29985 114137 -283761 -178912 -147645 -346408 -141439
18383 -8051 -336535 -84717 -193034 166719 108872 34838 -233811 -92390 -86532 111342 -78487
18371 -135870 72455 -316915 142774 59793 -174109 29021 310646 -351257 -70971 -78800 37295
$$ packed form
18451E8483h7963K7044j9797k09450l0271a49532D28221D8694b25824A48621a13549
18439b27974O4665O4437r174D3924a63074F3252h8275d1930B31700A1707b22943
18427D3826c42209g5722J3276l21136i5058d0070k11002K3413a04801f792p1773
18416g8565j50476A81779i8208M4314k92421C3419K12691a72176j12981E6334
18405d3859A7979Q534b9477k11735e0622J5431A4110a37222d4908B19038r1377
18394A27661M4340C1808c28519B9985Q4152b83761J04849L1267j98763a41439
18383h051l28484h4717j08317A66719n7847C4838b33811i2390N858A11342g8487
18371a35870G2455c16915A42774E9793a74109B9021K81625c51257g0971p829C7295
$$ plain form
18359 93521 437463 348595 91023 -576443 108615 -153251 -41708 -73191 -66641 -243077 -341308
18348 -341308 -589571 -454227 4454 -64137 -275413 -194753 185678 -22030 -315554 141584
18337 -222054 121638 -75622 60149 -218205 -59568 195038 -46929 -57780 64074 -42986 -325184
18326 -325184 249087 100714 -76390 148471 -87560 -35478 -207330 3954 -94940 -445056 43969
18314 356174 -85620 154685 -99689 108494 -205272 -71422 193739 -28236 -50165 280585
18303 -199566 318319 -87232 91407 -103006 84618 67888 -102505 16341 68171 -84799 290445
18291 -206558 -380286 28374 14935 552540 -486667 -24937 -251101 -290877 -138382 126544
18280 699855 86077 83683 317437 127770 -122957 -286785 -129283 -29319 -30262 -191885 141716
$$ packed form
18359I3521L43942q8868I1023e76443A08615a53251d1708l1483O550j76436r8231
18348c41308k48263J35344D454f4137k11276Q0660A85678b2030k93524A41584
18337b22054A21638g5622F0149b18205e9568A95038d6929j0851F4074d2986k82198
18326c25184B49087A00714g6390A48471h7560c5478j71852C954i4940l50116D3969
18314C56174h5620A54685i9689A08494b05272g1422A93739b8236k1929B80585
18303a99566C18319h7232I1407a03006H4618j6730a02505A6341N1830h4799B90445
18291b06558j73728B8374j3439N37605d86667b4937k26164l9776a38382A26544
18280F99855H6077k394K33754A27770a22957j63828a29283b9319r43j61623A41716
$$ plain form
18268 -118475 -36697 -81292 44944 -24081 158082 -404570 109426 75922 32014 -36849 -82104
18257 -82104 -143354 -560535 316573 -190945 -316044 -133404 12238 -357106 -173011 -187124
18247 -187124 68314 -182575 -265917 54317 289773 -31987 -191886 -143370 -402190 -208174
18237 -208174 -10776 96591 187436 -150755 7693 -63438 143652 -335076 -112473 -54259 2864
18225 268369 43611 -152585 -111587 -119971 215409 69630 331641 -3655 -92999 -156896 47068
18213 173552 -28959 -65825 -338732 -54598 19054 83115 -166556 221683 227865 -205020 -199339
18202 -199339 -61187 112643 -480101 -180925 166177 -1574 -304722 -75987 -49120 80979 -16981
18190 -63060 70448 210327 3609 -80678 173128 54212 -3455 -13392 94978 317674 177274
$$ packed form
18268a18475c6697m4595D4944b4081A58082d04570A09426l3504C2014c6849m5255
18257h2104o1250m17181C16573a90945j25099a33404A2238c57106a73011j4113
18247a87124F8314a82575q3342E4317K35456c1987j59899M8516k58820J94016
18237b08174a0776I6591R0845a50755G693f3438A43652c35076a12473e4259B864
18225B68369D3611a52585M0998q384B15409F9630K62011c655q9344o3897D7068
18213A73552b8959l6866k72907e4598A9054O4061a66556B21683O182b05020N681
18202a99339f1187A12643d80101a80925A66177a574l03148g5987K6867H0979a6981
18190f3060G0448J39879C609h0678A73128E4212c455r937I4978K22696j40400
$$ plain form
18179 177274 -396345 -91210 48551 -275821 109655 119887 18188 249231 23917 -32023 9246
18167 64379 235294 -222866 -74280 -166753 -18140 -252679 188766 -299999 -43187 200578
18156 98169 366293 -129661 -107297 -64971 -225536 -213056 -44901 -33089 145819 12798 116641
18145 116641 -202103 -125744 127089 -149381 17018 -217348 109913 -109277 24603 84094
18135 84094 -147459 -58372 264477 97978 -63814 -313241 -64404 -219181 -299023 129178 -115331
18123 -131211 180352 71627 -67931 379837 -48876 -66898 -242244 -89415 -116324 -204349 116280
18111 -198769 -50551 29598 85686 -239306 -87176 -263745 53464 56389 -111674 -51034 -295778
18100 -295778 94009 -86795 395236 -50688 -5167 254018 176669 311148 53958 92487 -149028
$$ packed form
18179A77274c96345i1210D8551b75821A09655J0232A8188K31043B3917c2023I246
18167F4379J70915b22866g4280r2473a8140k34539A88766b99999d3187B00578
18156I8169K68124a29661K2364M2326j60565J2480d4901J1812A45819A2798J03843
18145A16641b02103P6359A27089a49381A7018b17348A09913a09277B4603N9491
18135H4094a47459e8372B64477I7978f3814k49427f4404j54777p9842A29178a15331
18123a31211A80352G1627f7931C79837d8876j8022j75346h9415k6909q8025A16280
18111a98769e0551B9598N6088b39306h7176j76569E3464K925a11674e1034k44744
18100b95778I4009h6795C95236e0688e167B54018p7349J34479E3958L8529a49028
$$ plain form
18088 -201323 -287139 -353424 -131450 148142 -172253 -133136 22071 -163546 -108659 171828
18077 119472 -132634 -148178 97603 -28211 -284486 -156007 -44878 43225 76858 -183009 -89410
18065 245270 24532 472257 265139 -104662 -150757 -432918 -166511 428094 -125188 -256946
18055 -256946 -170213 20527 80936 176674 81018 160141 69836 -297696 2076 129822 -121291
18043 64931 -124800 95592 -17810 -130723 -204619 -287920 151143 -57748 47658 82828 114554
18032 114554 32868 208575 88159 -81149 -313411 77859 -242079 -82480 63318 219940 -177674
18020 -62824 -133711 246870 167069 -87394 -107261 -97948 32318 -142007 14440 -454145 -41518
18008 112437 235553 30710 -72402 163157 293694 87097 -52795 -169783 -168161 -277710 172884
$$ packed form
18088b01323q5816o6285a31450A48142a72253L9117B2071a63546N4887A71828
18077A19472a32634j5544I7603b8211k56275J28479d4878D3225L3633a83009h9410
18065B45270B4532M47725k07118a04662m6095k82161a66511D28094a25188j31758
18055b56946Q6733B0527O0409R5738H1018P9123F9836b97696B076J27746a21291
18043F4931a24800I5592a7810j12913p3896q3301A51143e7748D7658L5170L1726
18032A14554C2868J75707H8159h1149k32262G7859b42079h2480F3318J56622a77674
18020f2824p0887B46870p9801h7394j9867R313C2318a42007A4440d54145d1518
18008A12437J23116C0710g2402A63157J30537H7097e2795j16988J622j09549A72884
$$ plain form
17996 -222725 63721 -85858 66607 162780 -62530 -87947 38885 -243360 -149607 -176674 -198750
17985 -198750 -95212 19874 -279836 -86381 101736 -93745 1061 -22234 21351 -348915 -30419
17973 292751 49566 86256 -102296 -68190 -35660 -89059 -273412 295017 -46271 -14630 -11592
17962 -11592 38049 -262474 42652 -179094 360249 -94559 -144445 -143490 75671 -115311 -83012
17951 -83012 -171845 -128179 -398114 216419 -13784 322890 177717 21488 159924 -18823 -34483
17940 -34483 -265998 -134054 199023 -128355 21962 -54123 370638 -57841 -121401 216732
17929 187354 -398504 -5593 -188477 102477 -221969 100668 28367 -17748 -154181 43144
17918 -129471 31442 -114386 177826 -497 68087 -126495 -199630 232221 362995 -134568 239642
$$ packed form
17996b22725F3721h5858F6607R6173f2530k5417C8885b43360R3753k7067k2076
17985a98750i5212A9874b79836h6381A01736i3745A061b2234B1351c48915c0419
17973B92751D9566L6690a02296L4106L2530n3399j84353B95017d6271a4630L038
17962a1592C8049b62474D2652a79094C60249i4559m9886R55G5671a15311L2299
17951h3012q8833M3666k69935B16419a3784C22890j45173B1488J38436a8823j5660
17940c4483k31515J31944A99023a28355B1962e4123C70638e7841o3560B16732
17929A87354c98504e593j82884A02477b21969A00668B8367a7748j36433D3144
17918a29471C1442a14386A77826d97F8087a26495p3135B32221J30774a34568B39642
$$ plain form
17906 66216 -169030 96630 42814 231325 3995 -15384 -191644 68090 -29486 97467 110130
17895 110130 119827 80337 -382826 45666 77643 -219624 90428 22914 -125593 -242264 62443
17883 -128408 96451 -268125 396711 -76765 53862 -251413 119807 153153 331505 -4198 292513
17871 311622 123039 151417 -332354 -95606 24906 -215432 137744 53246 39878 -40973 -13506
17859 -214095 -111305 -261920 -303091 71181 -172123 210096 -170519 -24583 102663 80856
17849 80856 172869 -450947 -60945 191030 89643 -209132 -160690 111911 -37308 25683 -117563
17837 310669 48224 10297 -14447 405872 102463 133045 49670 -123527 -129175 82598 175145
17826 175145 -77948 -70416 -2792 -258100 -312095 324726 259108 165706 -234113 -360897 244025
$$ packed form
17906F6216a69030I6630D2814J88511C995a5384j76260F8090b9486I7467J2663
17895A10130R697l9490c82826D5666L1977b19624I0428B2914a25593j16671F2443
17883a28408I6451b68125C96711g6765E3862b51413A19807L3346J78352d198B92513
17871C11622A23039K8378c32354i5606B4906b15432A37744E3246j3368d0973a3506
17859b14095J02790j50615m1171G1181a72123B10096a70519b4583A02663k1807
17849H0856R2013d50947f0945A91030H9643b09132M8442A11911c7308B5683a17563
17837C10669D8224A0297a4447D05872A02463L0582D9670a23527n648H2598R2547
17826A75145g7948P532b792k55308n3995C24726o5618r3402b34113j26784B44025
$$ plain form
17814 68139 294340 171803 32182 -69109 219965 -67219 -68085 -176980 -235454 258370 235308
17803 235308 107845 251439 -101554 442679 -326060 -36715 186854 -282422 -154057 -292473
17793 -292473 -13252 -14638 -143477 19690 222493 -81613 204562 -82647 270433 -349618 206315
17781 -48063 -100612 -80306 146132 -117898 -109676 -124554 51612 122496 28187 -270102 93144
17769 57360 139631 -126445 336901 23429 -250459 -8425 -48683 73610 -13501 -106681 -232902
17758 -232902 70025 -74638 64602 187688 194684 -201810 186988 -38418 85063 -162894 -25988
17746 -103288 -78016 -148988 65706 200031 114494 -110429 97002 370133 -50256 -256288 -230741
17735 -230741 -154877 147434 371808 90373 182916 -24070 -24348 -63976 185167 153481 -16380
$$ packed form
17814F8139K26201j22537C2182f9109B19965f7219q66j08895n8474B58370k3062
17803B35308A07845J43594a01554D42679c26060c6715A86854b82422J28365j38416
17793b92473a3252j386j28839A9690K02803h1613B04562h2647B70433c49618B06315
17781d8063n2549K0306A46132a17898Q222j4878E1612P0884B8187b70102I3144
17769E7360Q2271a26445C36901B3429b50459h425m0258G3610a3501r3180j26221
17758b32902G0025g4638F4602J23086O996b01810A86988c8418H5063a62894b5988
17746a03288K5272p0972F5706J34325q5537a10429I7002K73131e0256k06032K5547
17735b30741P5864A47434K24374I0373R2543b4070k78l9628A85167l1686a6380
$$ plain form
17723 -169071 -39197 -151283 30808 -329755 -134245 -174326 -35875 -380860 24401 -241749
17712 -150491 106628 -14224 -23105 -9808 206479 -384535 337499 157161 -64207 -261483 -124305
17700 -132582 305511 -196581 166165 -218312 -14872 -247092 90323 -113532 -135326 -17961
17689 -92940 -33292 284468 245034 110554 -18649 -391127 -189676 -28330 -11762 -18392 -246112
17678 -246112 267397 99697 -94440 352582 146684 -251164 23271 -151441 -13457 -96811
17668 -96811 -85392 46620 -182151 -127445 -13082 69851 -83450 -336885 296893 10635 -201225
17656 358195 -376121 321127 178784 162353 -83439 -24902 -144379 10418 139440 146459 -115640
17644 169264 529687 -2866 146040 54439 165222 167880 269848 -346473 134299 5428 135855
$$ packed form
17723a69071c9197j12086C0808c29755a34245m0081c5875l44985B4401b41749
17712a50491A06628a4224q881i808B06479c84535C37499A57161f4207j97276a24305
17700a32582C05511a96581A66165b18312a4872k32220I0323a13532k1794a7961
17689i2940c3292B84468l9434A10554a8649l72478a89676b8330a1762o630k27720
17678b46112B67397I9697i4440C52582A46684b51164B3271a51441a3457q3354
17668i6811J1419D6620a82151N4706a3082F9851h3450k53435B96893A0635b01225
17656C58195c76121C21127j42343j6431h3439b4902j19477A0418J29022P019a15640
17644A69264L60423b866A46040E4439J10783K658J01968c46473A34299E428J30427
$$ plain form
17633 135855 -98386 -180070 -125204 -138257 -229103 112575 130818 -419673 -60151 241500 92881
17621 170740 -72689 -46504 296431 -81783 28895 63107 -148351 184096 576 -64836 -88585
17610 -88585 344395 101266 -145898 -159133 153493 184986 -266472 -19005 -76738 84390 -299859
17598 390396 -790 76214 -44536 -245638 170090 156213 100182 -63262 -241266 -102302 -84428
17587 -84428 -32619 -83987 -170532 109783 34653 247304 231871 149592 113284 28718 -52162
17575 77797 132211 243813 503851 10909 272377 43383 235726 -360794 166839 -167072
17564 -98836 -144626 -109810 53925 195522 355563 18319 -171244 -163125 141145 64690 140284
17553 140284 -116160 313719 376420 -196509 180503 228106 107727 29644 -136118 51411
$$ packed form
17633A35855i8386q1684N4866j3053r0846A12575J8243d19673f0151B41500I2881
17621A70740g2689K6185B96431h1783B8895L4212a48351A84096E76f4836k3749
17610h8585C44395A01266a45898j3235A53493L1493b66472a9005n7733H4390b99859
17598C90396g90G6214d4536k01102A70090j3877n6031f3262j78004a02302J7874
17587h4428c2619n1368q6545A09783C4653K12651j5433q2279l6308B8718e2162
17575G7797N4414J11602K60038A0909K61468D3383J92343c60794A66839a67072
17564i8836m5790L4816E3925J41597J60041A8319a71244Q119A41145F4690P5594
17553A40284a16160C13719O2701a96509A80503M7603A07727B9644a36118E1411
$$ plain form
17542 -251049 270729 -67054 -80748 178744 -67656 -117904 -80746 19079 -129317 -71704 438141
17530 49546 -173514 -36269 279860 -106363 217640 49246 130059 101770 115 -182423 111411
17518 154576 224874 -50749 551755 131925 253160 -56955 128633 424188 -2807 -75565 -330257
17507 -330257 -172427 -113508 87266 -87694 209720 179129 49856 454608 25872 288832 -188934
17495 173482 -30780 189217 159942 -197662 50386 184923 151319 306514 120729 507 -134379
17483 145136 -120116 -368508 332095 36691 101124 194510 -51521 172162 -68133 -206866
17473 -206866 401844 121830 305620 323696 25646 -40117 93682 -35039 86009 -51527 56933
17461 -210827 11215 -109171 416822 121275 113347 583174 131165 -34439 803613 344160
$$ packed form
17542b51049B70729f7054j3694A78744f7656n0248L7158A9079a29317N7613D38141
17530D9546a73514c6269B79860a06363B17640D9246Q0813k8289A15a82423A11411
17518A54576P0298e0749E51755A31925J21235e6955A28633K95555b807p2758k54692
17507c30257J57830N8919H7266h7694B09720l0591D9856M04752B5872K62960a88934
17495A73482c0780A89217k9275a97662E0386J34537l3604J55195A20729E07a34379
17483A45136a20116k48392C32095C6691O4433R3386e1521A72162f8133j38733
17473b06866D01844A21830J83790J8076B5646d0117I3682c5039H6009e1527E6933
17461b10827A1215a09171D16822A21275p928M69827A31165c4439H03613C44160
$$ plain form
17450 -145268 422007 587145 438512 380059 -127232 90460 -104287 5702 354984 107369
17439 335353 450984 278874 74065 234760 143314 295854 94366 425833 140642 70271
17428 66543 244194 319869 54414 321360 258704 89728 148183 4301 283087 182284 294405
17417 294405 -6369 217412 143954 328572 73295 115271 289565 42579 159254 242788 616668
17406 616668 -23731 187990 159944 -261499 190765 143446 294160 215815 -66918 156047
17395 12451 95818 221854 256175 296304 425181 -485 152470 90493 24316 206769 209402
17384 209402 346835 304521 55308 266614 294791 496650 185056 208396 80266 169433 -133013
17372 152881 100823 41439 -200403 181501 133544 3370 -94968 71618 38613 82614 -45681
$$ packed form
17450a45268D22007J65138j48633n8453a27232I0460a04287E702L49282A07369
17439C35353J15631j72110G4065J60695r1446J52540I4366L31467A40642G0271
17428F6543J77651P5675E4414K66946o2656H9728N8455D301K78786j00803J12121
17417B94405f369B17412p3458J84618G3295M1976J74294D2579J16675Q3534L73880
17406F16668b3731A87990k8046b61499A90765m7319J50714p8345f6918A56047
17395A2451Q3367J26036L4321M0129J28877d85A52470o1977B4316J82453K633
17384B09402J37433m2314E5308K11306K8177K01859A85056K3340H0266Q9167a33013
17372A52881n2058D1439b00403A81501m7957C370i4968G1618l3005M4001d5681
$$ plain form
17360 35982 175046 -284002 38255 319217 -172887 98662 14731 -95399 19026 244480 17167
17348 321941 262502 -117106 -90858 110656 3394 269342 55716 259420 97729 -25841 502037
17336 142929 10874 19472 54404 32593 -163108 -59964 173591 292044 103200 184237 45621
17324 250641 28908 -76163 -34950 274936 243147 99939 226628 -94113 113552 406244 -70211
17312 156988 -312316 -124263 119970 230974 60717 -99436 259372 -94241 281937 90675
17301 102710 149847 -139592 115702 -83907 397467 336079 -84359 143688 -10304 -91576 74752
17289 295635 49440 193379 -78143 -31716 -34155 568873 101276 178461 84574 450478 179756
17277 294921 272461 196836 201909 65883 -10909 439319 46670 263336 31308 264110 442797
$$ packed form
17360C5982J39064b84002C8255K80962a72887I8662A4731i5399A9026K25454A7167
17348C21941n9439a17106K6248A10656C394K65948E5716K03704I7729b5841E02037
17336A42929A0874Q598L4932k1811a63108e9964A73591J18453A03200Q1037D5621
17324B50641B8908g6163c4950B74936l1789I9939J26689i4113A13552K92692g0211
17312A56988c12316a24263A19970J11004F0717i9436B59372i4241B81937I0675
17301A02710M7137a39592A15702h3907C97467o1388h4359A43688a0304q1272G4752
17289B95635D9440J43939g8143c1716k439E68873A01276P7185H4574L65904A79756
17277B94921k2460p5625N073F5883a0909D39319D6670K16666C1308K32802J78687
$$ plain form
17266 442797 -101411 173799 -250039 219948 160139 379328 173363 95916 233357 292437
17256 292437 458146 96303 505450 439525 389466 -109309 260396 -127836 160618 -126925
17245 146670 158206 -234080 44714 -39544 384198 224007 -57963 1521 246260 241060 331763
17234 331763 293544 269699 462127 287874 297287 -142483 80291 138934 39253 334325 397957
17223 397957 -31539 309732 550661 225001 -66436 175484 520412 141973 -146316 127205
17212 -42189 84594 223385 -190689 -98793 160618 300349 309023 -17360 68560 148310 -9977
17200 402005 218120 454741 205163 415631 -90706 262782 265507 350466 69195 64613 177350
17189 177350 -313819 553140 145877 42984 238464 -245667 43284 309204 171119 120755
$$ packed form
17266D42797a01411A73799b50039B19948n9809K19189A73363p7447J37441N9080
17256B92437J65709I6303M09147o5925n0059a09309B60396a27836A60618a26925
17245A46670J1536b34080D4714c9544C84198j60191e7963A521K44739n200R0703
17234C31763l8219k3845J92428j74253R413a42483H0291N8643C9253K95072O3632
17223C97957c1539C09732K40929B25001f6436A75484L44928A41973a46316A27205
17212d2189H4594J38791a90689R1896A60618J39731Q674a7360F8560P9750i977
17200D02005j83885K36621B05163K10468i0706B62782K725Q4959F9195m582J12737
17189A77350c13819E53140A45877D2984J95480b45667D3284K65920j38085n0364
$$ plain form
17179 120755 -59634 107204 315740 234078 651565 124408 421120 386505 -24637 -23049 73406
17167 335934 126969 312676 514835 395819 451992 339398 298588 -40577 83691 237927
17157 237927 -18895 203666 154410 249794 193512 251107 126118 75137 313533 137349 32038
17145 306718 126074 347029 24463 -35235 232851 198042 358642 167334 11056 214203
17135 214203 158391 -14739 95531 25239 337043 249261 227037 676069 211065 324399 570932
17124 570932 272087 342840 480227 260812 170948 52848 623798 12508 160892 392192
17114 392192 466272 298896 486449 305261 208775 403295 232758 475427 519428 302906
17104 302906 475787 601962 327656 678090 466931 124028 769942 350390 457221 224125
$$ packed form
17179A20755e9634A07204K08536q1662M17487A24408K96712l4615b4637J588G3406
17167C35934A26969J85707K02159j19016N6173j12594m0810d0577H3691J54236
17157B37927a8895B03666m9256R5384n6282N7595j24989n0981K38396A37349C2038
17145C06718A26074K20955B4463c5235B32851l4809J60600A67334A1056K03147
17135B14203n5812a4739I5531B5239L11804q7782k2224M49032B11065J13334K46533
17124E70932B72087P0753J37387k19415q9864E2848N70950A2508J48384K31300
17114C92192P4080j67376J87553j81188r6486J94520j70537K42669M4001k16522
17104C02906J72881J26175k74306L50434k11159A24028O45914C50390J06831B24125
$$ plain form
17093 165415 552219 330924 359005 505668 348460 371265 379305 91892 15693 327121 332395
17082 332395 926304 309292 818995 185656 385996 140058 425145 419692 396797 419606
17072 419606 584545 490035 298684 699170 632313 146383 349920 469675 118848 184689
17062 184689 453464 396548 150928 223963 351697 688182 618383 629575 256071 523129
17052 523129 216094 232328 503822 637971 243575 303136 612312 512337 681494 701472
17042 701472 324554 541544 553854 481072 326282 549582 640118 683885 552330 496303
17032 496303 388129 293857 354994 478636 222052 396663 488212 627905 285470 771184
17022 771184 425935 492836 713078 343018 738310 817537 574087 645436 609409 588803
$$ packed form
17093A65415L86804k21295K8081J46663j57208K2805Q040I1892A5693L11428N274
17082C32395N93909C09292N09703A85656K00340A40058K85087n453k2895K2809
17072D19606J64939r4510j91351M00486o6857A46383K03537J19755A18848O5841
17062A84689K68775n6916A50928P3035J27734L36485o9799J1192B56071K67058
17052E23129B16094J6234K71494J34149B43575N9561L09176r9975J69157J9978
17042G01472C24554K16990J2310p2782j54790K23300R0536M3767j31555n6027
17032D96303j08174r4272O1137J23642B22052J74611R1549J39693B85470M85714
17022G71184l45249O6901K20242C43018L95292P9227k43450P1349l6027k0606
$$ plain form
17012 588803 398145 913578 552981 806210 746110 608925 319850 516338 557150 790055
17002 790055 529650 663882 279925 644923 394650 533390 905935 559417 619429 884029
16992 884029 751590 459117 884000 789515 723697 771092 827844 448472 654921 383168
16982 383168 711357 987259 706670 641350 717733 662881 659366 713016 758455 452132 1015409
16971 1015409 741747 835031 762631 919756 869920 841928 907520 970516 766341 687250 839619
16960 839619 890333 1006224 607941 712825 701212 644232 717328 1094906 954808 1119767
16950 1119767 1081743 1160072 883363 920494 1175710 815354 1056874 1173379 1180409 996625
16940 996625 1070408 1052801 677142 1094661 1068359 1207908 1020636 959421 1285177 1329283
$$ packed form
17012E88803j90658N15433l60597K53229o0100j37185k89075J96488M0812K32905
17002G90055k60405J34232B79925L64998k50273J38740L72545l46518O0012K64600
16992H84029j32439k92473M24883r4485o5818M7395N6752l79372K06449k71753
16982C83168L28189K75902k80589o5320P6383n4852l515N3650M5439l06323N63277
16971A015409k73662R3284p2400J57125m9836k7992O5592O2996k04175p9091J52369
16960H39619N0714J15891l98283J04884j1613n6980P3096L77578j40098J64959
16950A119767l8024P8329k76709L7131K55216l60356K41520J16505P030j83784
16940I96625P3783j7607l75659M17519k6302J39549j87272o1215L25756M4106
$$ plain form
16930 1329283 1034431 1115866 1094554 1028729 1245583 1182398 1312332 1107400 1207908 1423410
16920 1423410 974948 1111831 979464 1281624 999149 1018798 1176264 1125944 1439763 1278831
16910 1278831 1042757 1417694 1066860 1472810 1615083 1758164 1313114 1521198 1149426
16901 1149426 1448458 1237540 1433890 1457310 1214266 1484444 1547112 1504061 1801963 1497892
16891 1497892 1900057 1857122 1489110 1879510 1551709 1867301 2012641 1859246 1744856 2062758
16881 2062758 1580235 1854148 2056126 1863420 1637429 2206084 2006542 2000365 2144400 2125192
16871 2125192 2271820 1946394 1835640 2192452 2069963 1946371 2353898 2294860 2533645 2508599
16861 2508599 2477400 2477671 2289633 2496359 2612465 2664032 2666404 2534391 2520856 2798114 2918396
$$ packed form
16930A329283k94852Q1435k1312o5825K16854o3185J29934k04932J00508K15502
16920A423410m48462J36883j32367L02160k82475J9649J57466n0320L13819j60932
16910A278831k36074L74937l50834M05950J42273J43081m45050K08084l71772
16901A149426K99032k10918J96350K3420k43044K70178O2668m3051K97902l04071
16891A497892M02165m2935l68012L90400l27801L15592J45340j53395j14390L17902
16881B062758m82523K73913K01978j92706k25991N68655j99542o177J44035j9208
16871B125192J46628l25426j10754L56812j22489j23592M07527n9038K38785k5046
16861B508599l1199K71j88038K06726J16106N1567K372j32013j3535K77258J20282
$$ plain form
16850 2918396 2969531 2655957 2994701 2914655 2967394 3272565 3154124 2986276 3030957 3198829
16840 3198829 3407860 3225321 3234676 3440433 3447826 3366681 3532195 3951666 3803864 3763603
16830 3763603 3735662 3868653 3586483 3894766 3809215 4185057 4020982 4337121 4512635 4458454
16820 4458454 4697875 4718926 4841150 4979558 4985828 5014290 5015754 5366676 5628923 5538782 5603697
16809 5603697 5780185 5770191 5737537 6066819 6226112 6034390 6315616 6414210 6762292 6969178
16799 6969178 7104797 7480001 7685911 8105524 7775839 8014849 8217741 8280101 8505280 8700661
16789 8700661 9152964 9164208 9364852 10045398 9943157 10371564 10735415 11155024 11244414 11890579
16779 11890579 11992857 12639477 12963076 13624312 13744000 13774925 14376910 15145979 15287974
$$ packed form
16850B918396N1135l13574L38744q0046N2739L05171j18441j67848M4681J67872
16840C198829K09031j82539R355K05757P393q1145J65514M19471j47802m0261
16830C763603k7941J32991k82170L08283q5551L75842j64075L16139J75514n4181
16820D458454K39421K1051J22224J38408O270K8462J464L50922K62247r0141O4915
16809E603697J76488r994l2654L29282J59293j91722K81226R8594L48082K06886
16799F969178J35619L75204K05910M19613l29685K39010K02892O2360K25179J95381
16789H700661M52303J1244K00644O80546j02241M28407L63851M19609Q9390O46165
16779A1890579J02278O46620L23599O61236J19688L0925O01985P69069J41995
$$ plain form
16770 15287974 16114732 16741168 17278858 17638912 18338723 19388999 19720323 20777231 21631085
16761 21631085 22109196 23398214 24358178 25042869 26002546 27610230 28612767 30149952 31427295
16752 31427295 32775364 34610988 36252674 37953032 40064868 42402620 44303052 46549405
16744 46549405 49468871 52143183 55145648 58686377 62146256 65897783 70066499 74506869
16736 74506869 79478949 84893472 89905891 95952618 102239527 109209780 116569125 124200738
16728 124200738 132140501 140931413 149494894 157722348 167062893 175160756 183307734 190720755
16720 190720755 196918748 202000211 205968576 207786137 208544617 207314210 204616747 199968424
16712 199968424 194064952 187417287 179795816 171674082 162880611 154078425 145101007 136316164
$$ packed form
16770A5287974Q26758O26436N37690L60054O99811J050276L31324J056908Q53854
16761B1631085M78111J289018R59964O84691R59677J607684J002537J537185J277343
16752C1427295J348069J835624J641686J700358K111836K337752J900432K246353
16744D6549405K919466K674312L002465L540729L459879L751527M168716M440370
16736G4506869M972080N414523N012419O046727O286909O970253P359345P631613
16728A24200738P939763Q790912Q563481Q227454R340545Q097863Q146978P413021
16720A90720755O197993N081463L968365J817561P58480j230407k697463m648323
16712A99968424n903472o647665p621471q121734q793471q802186q977418q784843
$$ plain form
16704 136316164 128123542 120141147 112620283 105814460 98650759 92149039 86186716 80953163
16696 80953163 75495656 70897729 67047922 62860272 59337524 55659585 52746969 49470292
16688 49470292 46917705 44298824 41909003 39712597 37546952 35746316 33804264 32274055
16680 32274055 31152376 29426231 27915212 26826444 25751830 24727937 23574045 22253552
16672 22253552 21477987 20635188 19747386 19160663 18152770 17872668 17308584 16268862 15843982
16663 15843982 15018073 14632650 14191298 13754567 13608091 13041025 12314812 11873826 11377256
16654 11377256 11132431 11030710 10704989 10354115 9869262 9775684 9308767 9011149 8854193
16645 8854193 8546503 8220642 8060850 7983512 7788294 7576719 7451710 7140530 6739062 7046050
$$ packed form
16704A36316164q192622p982395p520864o805823p163701o501720n962323n233553
16696H0953163n457507m597927l849807m187650l522748l677939k912616l276677
16688D9470292k552587k618881k389821k196406k165645j800636j942052j530209
16680C2274055j121679j726145j511019j088768j074614j023893j153892j320493
16672B2253552p75565q42799q87802n86723j007893k80102n64084j039722m24880
16663A5843982q25909l85423m41352m36731j46476n67066p26213m40986m96570
16654A1377256k44825j01721l25721l50874m84853r3578m66917k97618j56956
16645H854193l07690l25861j59792p7338j95218k11575j25009l11180m01468L06988
$$ plain form
16635 7046050 6719614 6625538 6417818 6101125 6125893 5640124 5969730 5682746 5367432 5125092
16625 5125092 4811751 5143118 4946394 4821691 4672390 4678763 4506141 4663881 4567639 4389193
16615 4389193 4304696 4248362 4034903 3904080 3807088 4123394 3723753 3641776 3735873 3612969
16605 3612969 3715739 3364128 3622282 3232372 3015309 3001100 3214756 3395130 3183564 2808497
16595 2808497 2930275 2870634 2881423 2901637 2749130 2550267 2677954 2376380 2467650 2736598
16585 2736598 2480798 2419095 2395060 2236115 1965350 2105822 1945972 2219861 2397681 2276338
16575 2276338 1960799 1878487 2051078 1902637 2037037 1816074 2199035 1943866 1784500 1870568
16565 1870568 1774161 2151723 1915546 1665535 1787515 1710632 1545230 1750250 1593813 1548667
$$ packed form
16635G046050l26436r4076k07720l16693K4768m85769L29606k86984l15314k42340
16625E125092l13341L31367j96724j24703j49301O373j72622J57740r6242j78446
16615D389193q4497n6334k13459j30823r6992L16306l99641q1977R4097j22904
16605C612969J02770l51611K58154l89910k17063j4209K13656J80374k11566l75067
16595B808497J21778n9641J0789K0214j52507j98863J27687l01574R1270K68948
16585B736598k55800o1703k4035j58945k70765J40472j59850K73889J77820j21343
16575B276338l15539q2312J72591j48441J34400k20963L82961k55169j59366Q6068
16565A870568r6407L77562k36177k50011J21980p6883j65402K05020j56437m5146
$$ plain form
16555 1548667 1689404 1419002 1600591 1627069 1612652 1271529 1074393 1442177 1259896 1270121
16545 1270121 1555364 1435978 1414158 1259577 1265949 1265784 1181238 1254427 1328355 1230530 1383720
16534 1383720 1019888 1144134 1122025 1015562 1229757 1034474 1258178 1007993 1108094 1217525
16524 1217525 1280127 1047112 945508 1125724 945871 1007024 720791 1104505 1177912 887773
16514 887773 685009 1022639 799054 731963 1030609 604875 863595 860429 634430 943942
16504 943942 842799 462789 761407 1243175 862033 589985 623303 826985 681464 626128
16494 626128 802909 952481 783870 693721 456433 652193 425940 608823 908343 681996
16484 681996 685111 855036 968144 577206 863443 734233 349713 453484 552819 701858
$$ packed form
16555A548667J40737k70402J81589K6478j4417l41123j97136L67784j82281J0225
16545A270121K85243j19386k1820j54581O372j65q4546P3189P3928r7825J53190
16534A383720l63832J24246k2109j06463K14195j95283K23704k50185J00101J09431
16524A217525O2602k33015j01604J80216j79853O1153k86233L83714P3407k90139
16514H87773k02764L37630k23585o7091K98646m25734K58720l166k25999L09512
16504I43942j01143l80010K98618M81768l81142k72048L3318K03682j45521n5336
16494F26128J76781J49572j68611r0149k37288J95760k26253J82883K99520k26347
16484F81996L115J69925J13108l90938K86237j29210C49713J03771R9335J49039
$$ plain form
16474 701858 791423 923403 678181 823299 646890 707769 551251 360223 597339 687733
16464 687733 453478 177882 477132 239768 664150 811263 666532 391407 818624 821829
16454 821829 633063 427122 271702 535272 666767 274115 292720 397183 534360 591768
16444 591768 448889 477872 455802 590588 361806 782513 377110 164648 494227 431709
16434 431709 496323 544247 278285 257306 175326 461767 366435 292155 509945 389337 561481
16423 561481 476351 433224 -86574 544685 275726 302570 515623 644728 463627 271023
16413 271023 455551 412959 418541 334032 399174 180459 248624 -46097 155762 634505 627431
16402 627431 -104736 480341 618746 254798 -70238 150377 384429 351159 280192 424354
$$ packed form
16474G01858Q9565J31980k45222J45118j76409O0879j56518j91028K37116R0394
16464F87733k34255A77882K99250k37364M24382J47113j44731k75125M27217L205
16454H21829j88766k05941j55420K63570J31495B74115J8605J04463J37177N7408
16444E91768j42879K8983k2070J34786k28782M20707C77110A64648L29579o2518
16434D31709O4614M7924k65962k0979q1980K86441r5332p4280K17790j20608J72144
16423E61481q5130m3127h6574E44685k68959K6844K13053J29105j81101j92604
16413B71023J84528m2592N582q4509O5142A80459O8165d6097A55762M78743p074
16402F27431a04736D80341J38405B54798g0238A50377K34052l3270p0967J44162
$$ plain form
16392 424354 7429 484600 239599 225985 483076 306911 222905 -18291 -29949 164576 1119
16380 479783 25 277536 -94045 488243 284675 401417 410477 240822 307231 135552 -19221
16368 134882 407777 198180 -37813 215427 80481 81591 33720 281905 223766 79262 420780
16357 420780 416448 404279 156339 -70124 286643 498779 166399 189819 460792 187579
16346 147020 91481 180529 -308518 68120 74959 81782 46610 117170 375832 13431 54749
16335 54749 233316 28060 312436 26738 -147735 245512 250557 116507 339094 153974
16324 90579 201180 178747 -339528 401 129618 235860 -102059 259229 81002 287177 244504
16313 244504 410183 323872 104204 -54197 207305 410424 381435 99181 11495 171139
$$ packed form
16392D24354G429M77171B39599j3614K57091j76165q4006a8291j1658A64576A119
16380D79783B5K77511i4045D88243k03568J16742R060j69655O6409A35552a9221
16368A34882K72895A98180c7813B15427H0481J110C3720K48185n8139G9262L41518
16357D20780m332j2169A56339g0124B86643K12136A66399K3420K70973A87579
16346A47020n5539Q9048c08518F8120O839O823l5172P0560K58662A3431M1318
16335E4749J78567B8060K84376B6738a47735B45512N045A16507K22587A53974
16324I0579J10601k2433c39528D01J29217J06242a02059B59229H1002K06175m2673
16313B44504J65679q6311A04204e4197B07305K03119k8989I9181A1495J59644
$$ plain form
16303 171139 63370 406820 350622 282458 205494 -81573 362915 96713 343238 243552 143890
16292 143890 266431 -32953 -71184 447765 20863 510710 333150 184617 187392 154502 86491
16281 86491 212334 509190 38009 416821 307212 85827 46128 -133904 -94185 -45217 181991
16269 20908 12072 47373 207230 327113 12953 10018 250108 263110 278151 40620 243200
16258 243200 204516 290622 -81735 35565 231513 -252395 -9749 410568 157722 167784 202171
16247 202171 94155 -56793 203701 58690 -76126 111937 98235 241141 -1241 134551 288094
16236 288094 -179866 131316 -333999 53245 -55211 207436 110011 -57981 141822 -115153
16225 -2718 157900 506920 -32019 24855 54262 200081 -184566 44101 246629 37860 -144751
$$ packed form
16303A71139F3370L43450n6198o8164p6964h1573C62915I6713K46525r9686r9662
16292A43890J22541c2953l8231D47765B0863M89847j77560j48533K775l2890o8011
16281H6491J25843K96856C8009L78812j09609H5827l9699a33904L9719d5217A81991
16269B0908q836L5301J59857J19883A2953k935K40090J3002J5041D0620K02580
16258B43200l8684Q6106h1735C5565J95948b52395i749D10568A57722J0062L4387
16247B02171I4155e6793B03701E8690g6126A11937j3702J42906a241A34551J53543
16236B88094a79866A31316c33999E3245e5211B07436r7425e7981A41822a15153
16225b718A57900L49020c2019B4855K9407J45819a84566D4101K02528C7860a44751
$$ plain form
16213 -101813 4579 334777 -135991 -3699 129908 125253 93686 298719 68140 191739 96850
16202 96850 2425 22583 110941 -5793 -298059 -58464 236811 191817 -32253 -66458 -374410
16191 -374410 8653 216260 -49864 178097 -224682 88988 380845 307333 -165515 258593
16180 -271729 237690 -111858 369850 -106055 -110044 -209947 80905 -157358 -281022 -123919
16169 -48735 -7759 -224897 34360 169590 157508 190834 -88630 -203025 -18188 -100492 115462
16157 301694 -124190 198165 178052 293579 -269558 149371 -259324 463691 -109595 372330
16146 52713 -57768 -158409 59939 -102014 38 19793 -266659 38895 -146662 83182 -99997
16134 389552 -5794 96676 62162 -156593 103348 -81885 248134 210733 241843 126018 -225735
$$ packed form
16213a01813D579L30198a35991c699A29908m655l1567K05033F8140J23599r4889
16202I6850B425K0158Q8358e793k92266e8464B36811m4994c2253l4205l07952
16191c74410H653K07607d9864A78097b24682H8988K91857p3512a65515B58593
16180b71729B37690a11858C69850a06055l989r9903H0905a57358j23664a23919
16169d8735g759k17138C4360J35230j2082L3326h8630j14395a8188q2304A15462
16157C01694a24190A98165k0113J15527b69558A49371b59324D63691a09595C72330
16146E2713e7768j00641E9939a02014C8J9755b66659C8895a46662H3182i9997
16134C89552e794I6676l4514a56593A03348h1885B48134l7401L1110j15825b25735
$$ plain form
16122 3415 185737 5382 -131990 220892 -175368 231911 -135316 14211 31362 -115650 -37979
16110 -26559 185847 187265 70698 -19173 336026 -19199 289179 86738 489910 -230988 80450
16098 510624 39649 -59051 108714 -47372 118284 -168964 -82457 -97004 363535 97363 -335599
16086 18268 -194458 -66894 -249794 -158026 202284 129542 -207181 -123441 195854 472707
16076 472707 -87981 -414399 -106180 284829 212338 6684 96963 -226276 -11789 144000 -154878
16064 -67232 -35099 70183 -47426 188435 -249550 66411 -321403 176215 191053 -26373 330414
16052 -183176 -2196 26264 -399785 232027 -47484 141698 -146506 115274 -68293 32718 144873
16041 144873 -69937 -205989 -24941 -8286 365910 -34420 -279772 381379 -130546 -53739 194616
$$ packed form
16122C415J82322E382a31990B20892a75368B31911a35316A4211J7151a15650c7979
16110b6559A85847J418G0698a9173C36026a9199B89179H6738M03172b30988H0450
16098E10624C9649e9051A08714d7372A18284a68964h2457j4547C63535I7363c35599
16086A8268a94458f6894j82900R1768B02284p2742b07181Q3740A95854K76853
16076D72707h7981l26418a06180B84829p2491F684R0279b26276a1789A44000a54878
16064f7232L2133G0183d7426A88435b49550F6411c21403A76215J4838b6373C30414
16052a83176b196B6264c99785B32027d7484A41698a46506A15274f8293C2718J12155
16041A44873f9937j36052b4941h286C65910c4420k45352C81379a30546e3739A94616
$$ plain form
16029 -4100 -223790 -242022 205376 285 -20024 296597 -370149 169164 36163 21456 -283053
16017 215374 -298486 -274297 243629 -94011 -359275 74713 -271863 -150490 222917 343626
16007 343626 -85617 -135062 -44227 98159 -26569 24986 -85453 158075 83607 308354 332530
15996 332530 -263007 -344015 301359 8970 36633 145854 -11322 56504 171532 -10217 122829
15984 -97890 245853 300374 239201 116022 364457 177792 98738 111180 9567 -416543 111271
15972 -333833 -135840 195019 117257 -180250 183560 -64205 -126375 31508 157065 1828 -47323
15960 -61272 -292162 160258 88594 59144 -16199 -159533 49882 -1424 -232670 -302436 -41375
15948 94107 268199 -85410 -71384 -55572 49864 -105737 232768 -104307 -95706 -100015 -130908
$$ packed form
16029d100k19690j8232B05376B85b0024B96597c70149A69164C6163j4707b83053
16017B15374b98486K4189B43629i4011k65264G4713b71863J21373B22917J20709
16007C43626h5617m9445d4227I8159b6569B4986h5453A58075p4468K24747K4176
15996C32530b63007q1008C01359H970K7663J09221a1322E6504J15028a0217A22829
15984i7890B45853N4521o1173A16022K48435A77792p9054J2442I567d16543A11271
15972c33833a35840A95019p7762a80250A83560f4205o2170C1508J25557A828d7323
15960f1272k30890A60258p1664k9450a6199j43334D9882a424k31246o9766d1375
15948I4107J74092h5410J4026J5812D9864a05737B32768a04307Q601m309l0893
$$ plain form
15937 -130908 251818 -29376 265143 -194650 213491 -352067 -200960 -111248 -199234 -150309
15927 -150309 -198895 -438301 -58032 -94658 -166222 -343926 -171437 -59954 -231968 -371993
15917 -371993 11824 21238 -8157 163563 -70279 11392 -146962 -167301 -343237 238893 105491
15905 -121982 18500 -88229 233056 -127171 -163956 108960 -237955 35449 -99692 -91009 -323710
15894 -323710 -193903 -92726 -238402 37608 119160 57986 169086 -97222 16817 3907 -29417
15882 87488 108021 -203129 -133309 -129865 17764 134881 256812 -88813 -192005 149128 17272
15870 -92736 62668 45870 -154518 180579 26783 146145 -3488 -99304 -130368 -303343 17318
15858 -155082 34577 132484 -72178 149789 -247259 71890 118229 296260 -258763 -236463 -194319
$$ packed form
15937a30908B51818b9376B65143a94650B13491c52067J51107Q9712q7986M8925
15927a50309m8586k39406e8032l6626p1564j77704a71437e9954j72014j40025
15917c71993A1824R414h157A63563g0279A1392a46962k0339j75936B38893A05491
15905a21982A8500h8229B33056a27171l6785A08960b37955C5449i9692Q683k32701
15894c23710J29807i2726j45676C7608Q1552E7986J11100i7222A6817C907b9417
15882H7488K0533b03129O9820L444A7764J17117J21931h8813j03192A49128A7272
15870i2736F2668j6798a54518A80579B6783J19362c488r5816l1064j72975A7318
15858a55082C4577R7907g2178A49789b47259G1890M6339J78031b58763K2300M2144
$$ plain form
15847 -194319 249086 -7010 -75433 -235945 115323 -27925 169321 -124033 -140147 -116593 -6200
15835 45903 -36936 -243508 -158252 250811 -86471 4824 37744 -52859 -120982 168755 -107140
15823 -94205 8577 59070 -144411 188933 -21742 72077 22298 -102140 -13873 -40669 78507
15811 227782 -265985 -228672 29961 -212692 -181664 -57627 91358 30692 -79583 124738 239192
15800 239192 -96376 -143487 -105063 -55681 133562 -70844 -152636 74717 228052 -131953 -275840
15789 -275840 7250 -158245 -240120 -181912 32113 -73917 169419 -221156 -189390 10537 -392896
15777 -112682 155412 -157532 3213 -270660 -156681 233477 -108299 -62367 -205239 -216109
15767 -216109 150346 94954 78916 -50975 -269754 -419296 -78846 163951 -40985 43950 22764
$$ packed form
15847a94319B49086g010o8423j60512A15323b7925A69321a24033j6114K3554f200
15835D5903c6936k06572Q5256B50811h6471D824L2920e2859o8123A68755a07140
15823i4205H577N0493a44411A88933b1742G2077B2298a02140a3873k6796G8507
15811B27782b65985L7313B9961b12692L1028e7627I1358C0692g9583A24738J14454
15800B39192i6376m7111L8424M9382A33562g0844q1792G4717J53335a31953j43887
15789b75840G250a58245q1875N8208C2113g3917A69419b21156L1766A0537c92896
15777a12682A55412a57532C213b70660J13979B33477a08299M5932j42872j0870
15767b16109A50346n5392j6038e0975k18779j49542g8846A63951d0985D3950k1186
$$ plain form
15756 22764 53465 -183796 191394 49246 151147 -134947 295728 -73407 -20878 31107 -27442
15744 386267 -52313 87730 191490 217242 -197849 -328230 -27181 -64707 -44464 -261840 18003
15732 -165533 -34672 -103729 -172454 1362 261518 36919 18092 -143607 -66065 -241835 -86160
15720 81438 -171438 45366 178191 -247179 -37465 -419024 -202309 20723 -4886 -45159 -193061
15709 -193061 -66684 98263 -381020 -124725 -75706 139194 -159702 141430 133317 -134855
15698 -395628 79536 -67818 -132529 -207479 -229817 42122 34668 431014 13567 55941 62159 -202476
15685 -40184 -129624 -404788 111985 89951 295802 81531 -115801 -147633 -245030 -309079 317811
15673 82589 -328739 151641 -137012 291180 116522 -178520 -17300 -46236 -373 73414 -134366
$$ packed form
15756B2764L0701a83796A91394D9246J01901a34947B95728g3407b0878C1107b7442
15744C86267e2313H7730J03760K5752a97849j30381b7181l7526K0243k17376A8003
15732a65533c4672o9057o8725A362K60156C6919A8092a43607f6065j75770h6160
15720H1438a71438D5366J32825b47179c7465l81559b02309B0723d886m0273j47902
15709a93061f6684I8263c81020a24725M9019A39194a59702A41430q113a34855
15698c95628G9536f7818o4711p4950k2338D2122p454L96346A3567M2374O218b02476
15685d0184q9440k75164A11985k2034K05851H1531a15801l1832r7397o4049C17811
15673H2589c28739A51641a37012B91180A16522a78520a7300k8936c73G3414a34366
$$ plain form
15661 125862 95009 -234122 2348 76764 118002 -158937 -381065 -296815 58253 -60760 258630
15649 320922 104323 125279 198192 -85273 148091 -39076 -33771 -25054 -195478 -324489 -108199
15637 -321278 125824 -101294 -189611 192714 -27605 -27580 -52760 173045 69060 -151459 -135218
15626 -135218 311550 217993 -166472 188366 126063 -258922 -176566 -57992 152746 -136889
15615 -106427 -98822 -36141 208183 135637 116813 -146672 51887 -267258 -416545 221738 -254585
15603 -244642 -53751 160656 -317393 271461 -198445 -137361 82034 -100010 -233693 112591
15592 -295801 165426 80133 5568 74271 -153619 -20642 299584 -7843 254213 -99367 -373293
15581 -373293 152194 -101832 18205 -27962 26703 -47394 -182837 61541 -324698 -22373 -399403
$$ packed form
15661A25862l0853b34122B348P4416M1238a58937k22128Q4250E8253f0760B58630
15649C20922A04323K0956P2913h5273A48091c9076N305Q717j70424j29011a08199
15637c21278A25824a01294q8317A92714b7605K5k5180A73045F9060a51459J6241
15626a35218C11550r3557a66472A88366o2303b58922Q2356e7992A52746a36889
15615a06427P605c6141B08183p2546j8824a46672E1887b67258j49287B21738b54585
15603b44642e3751A60656c17393B71461a98445O1084H2034a00010j33683A12591
15592b95801A65426H0133E568O8703a53619b0642B99584g843B54213i9367k73926
15581c73293A52194a01832A8205b7962B6703d7394j35443F1541c24698b2373l77030
$$ plain form
15570 -399403 -98794 -129297 -26181 110099 -364099 -123125 284128 -207673 225153 284816
15560 284816 179999 66665 -119759 149069 67157 -102316 -186573 81746 -199037 -237833
15550 -237833 266718 -288615 187731 -232253 -315674 178313 -90962 -277761 -212886 51334
15539 16201 74709 -283073 -12301 165270 -84587 -57771 150532 35464 -182122 -230292 4610
15527 -12722 -27107 95635 -109829 94258 -116306 3961 223090 -337725 50267 -74054 181379
15515 -216515 200894 50456 23555 69220 -324994 -2583 -300424 132678 14906 107401 148911
15504 148911 129075 -269375 -264924 241399 -143415 -36473 -122898 -261741 174836 -76795 94234
15492 -118886 131455 -48931 84806 -247975 284884 -102900 -288206 326338 102748 220871
$$ packed form
15570c99403i8794l0503b6181A10099c64099a23125B84128b07673B25153N9663
15560B84816j04817F6665a19759A49069F7157a02316q4257H1746a99037l8796
15550b37833B66718b88615A87731b32253q3421A78313i0962j86799O4875E1334
15539A6201N8508b83073a2301A65270h4587K6816A50532C5464a82122m8170D610
15527a2722j4385I5635a09829I4258a16306C961K19129c37725E0267g4054A81379
15515b16515B00894E0456B3555M5665c24994b583k97841A32678A4906R2495M1510
15504A48911j9836b69375M451B41399a43415c6473q6425j38843A74836g6795I4234
15492a18886A31455d8931H4806b47975B84884a02900j85306C26338A02748J18123
$$ plain form
15482 220871 258375 -215207 -117739 -5081 1295 356541 -190109 117608 -8110 79924 5281
15470 -233411 -343975 -92600 -223055 -124175 -205416 -242394 -32202 -28639 -185670 -6579 441670
15458 50489 -187373 41205 57767 -298151 105323 147023 -244944 -63572 73621 -73118 -49469
15447 -49469 -157533 -158177 -212309 -413621 70596 -562772 -208135 -58260 118935 69163 121657
15436 121657 239905 -17153 -90071 235604 244963 54796 56499 -132534 357991 -220146 -159711
15425 -159711 358365 -362913 -281409 97004 -79290 23618 23330 125232 102847 -107484 -292372
15414 -292372 93529 -307230 -107507 145577 19560 -80265 286178 87523 32790 156567
15404 156567 108922 -132891 -115538 -118990 -58688 -164582 37400 -45075 64756 61137 -116898
$$ packed form
15482B20871L7504b15207R7468e081A295L55246a90109A17608h110G9924E281
15470b33411j10564i2600j30455R8880q1241l6978c2202L563j57031f579D41670
15458E0489a87373D1205J6562b98151A05323M1700b44944f3572G3621g3118K3649
15447d9469j08064o44n4132k01312G0596e62772b08135e8260A18935m9772N2494
15436A21657J18248a7153p2918B35604R359E4796J703a32534C57991b20146O0435
15425a59711C58365c62913Q1504I7004g9290B3618k88J01902k2385a07484j84888
15414b92372I3529c07230a07507A45577A9560h0265B86178H7523C2790J23777
15404A56567m7645a32891J7353l452e8688j05894C7400d5075F4756l619a16898
$$ plain form
15392 272472 288996 -62035 143908 -146862 77778 321278 -132029 -14779 -34203 161141
15381 64076 -10854 30090 -84541 117664 -8511 182526 -267143 -363519 150060 -210715 -33138
15369 64369 -212567 -200885 9705 -176370 163256 -109425 29449 -462004 265137 75569 -273344
15357 -174605 -77910 378036 69837 161066 129651 -95076 -239862 228076 147722 -177654 -269024
15346 -269024 123353 121867 378144 -82267 -158219 -168281 -192383 -58643 13610 -67998 79757
15334 140798 -114356 -72350 168480 70439 603482 61508 -268779 155243 407015 263181
15324 263181 -75466 -164094 21728 -121687 -7225 -40360 104705 46755 -29305 28918 77473
15313 77473 -87749 222859 99052 42019 -92495 -89364 -127567 141723 174425 281039 160978
$$ packed form
15392B72472J6524f2035A43908a46862G7778K43500a32029a4779j9424A61141
15381F4076a0854C0090h4541A17664h511A82526b67143r6376A50060b10715c3138
15369F4369b12567J1682I705a76370A63256a09425B9449d62004B65137G5569b73344
15357a74605g7910C78036F9837R1229l1415i5076j44786B28076q0354a77654r1370
15346b69024A23353j486K56277h2267p5952j0062k4102e8643A3610f7998G9757
15334A40798a14356M2006A68480G0439N33043F1508b68779A55243K51772j43834
15324B63181g5466q8628B1728a21687g225l3135A04705D6755b9305B8918M8555
15313G7473h7749B22859I9052D2019i2495L131l8203A41723L2702J06614j20061
$$ plain form
15302 160978 625911 8893 -63154 4836 24469 169488 -73126 -368636 -197972 363864 29356
15290 -106110 -258207 245102 -46323 158415 -61459 331770 -199986 186753 111284 31422
15279 250780 -105854 -35423 413298 189107 -104674 -88584 251391 -164905 -135704 21 181441
15268 181441 42447 -23696 -204352 -294061 184097 226364 -67545 20085 -282056 -28541 -114187
15257 -114187 -181500 -39171 93443 -54216 -156812 221178 76634 265612 925035 1093134
15247 1093134 1251882 1018247 1954086 736101 231409 124927 165706 154768 -33129 -168095
15237 -168095 235646 104808 92320 -88378 470844 297858 96236 133611 58388 152317 -442121
15225 99851 67710 321838 232839 59194 81235 161340 -5484 -115954 48663 -205945 -224819
$$ packed form
15302A60978M64933H893f3154D836J9633J45019g3126k95510J70664C63864B9356
15290a06110j52097B45102d6323A58415f1459C31770a99986A86753p5469C1422
15279B50780a05854c5423D13298A89107a04674J6090B51391a64905K9201B1J81420
15268A81441D2447b3696j80656q9709A84097M2267f7545B0085b82056b8541q5646
15257a14187o7313c9171I3443e4216j02596B21178G6634J88978O59423J68099
15247A093134J58748k33635R35839G36101B31409j06482M0779j0938c3129j34966
15237a68095B35646A04808j2488h8378D70844j72986I6236L7375E8388R3929d42121
15225I9851l2141K54128q8999E9194K2041Q0105e484j10470D8663b05945j8874
$$ plain form
15214 -224819 170881 276963 71739 -73184 -31456 35474 218955 -230221 -110083 -10278
15203 420577 194957 -50016 -100915 30235 142151 -285145 355871 308599 111034 567423
15193 567423 186941 1525 -32654 -293653 75023 -32963 58780 377111 296995 -98356 140089
15181 -45528 -57509 -163458 -61089 35807 177986 -234573 302316 -243693 84201 -323011
15170 1758 -41385 -135672 3839 -72866 -17109 -319218 133466 -73916 -163425 51134 146389 22000
15157 14116 176863 -1161 80626 -92163 4133 140232 214588 364677 183597 189383 70456
15145 34374 57931 196603 -94135 -61052 143764 -32543 610554 433055 263991 164945 193478
15134 193478 228439 311480 122413 64520 211625 -109569 4613 -207062 120540 151545 145071
$$ packed form
15214b24819A70881J06082G1739g3184c1456C5474J83481b30221a10083a0278
15203D20577A94957e0016n0899C0235J11916b85145C55871m7272A11034M56389
15193E67423A86941A525c2654k60999G5023c2963E8780L18331q0116i8356A40089
15181d5528j1981j05949f1089C5807J42179b34573C02316b43693H4201c23011
15170A758d1385r4287C839g2866a7109l02109A33466g3916q9509E1134R5255B2000
15157A4116J62747a161H0626i2163D133J36099P4356J50089j81080N786G0456
15145C4374K3557J38672i4135L3083A43764c2543F10554j77499j69064r9046K8533
15134A93478L4961Q3041A22413n7893J47105a09569D613b07062A20540L1005o474
$$ plain form
15123 145071 212807 156143 310391 131060 99742 129329 17456 5483 69769 140455 -198344
15111 27430 11309 28242 227442 -62843 -73254 -98152 164706 258846 423995 -1756 -137034
15100 -137034 -41055 112265 198322 -92690 128032 16414 251584 620261 -54615 176170
15089 154011 -81273 -102050 -133502 42263 356789 191035 -47075 147630 312365 99935 324610
15078 324610 36755 -210915 6848 -89231 3830 286283 122084 283022 233624 -43424 144340
15066 70939 -19809 145678 186582 200948 236466 507904 -89115 203436 -287748 299913 -124870
15054 227116 295856 101177 -125119 171131 169846 69548 43985 -17381 199436 187069 211280
15043 211280 180238 7020 271235 -138864 82004 -2685 36219 85470 -15818 -120388 160142
$$ packed form
15123A45071O7736n6664J54248A31060l1318K9587A7456E483O4286P0686a98344
15111B7430A1309J6933J99200f2843j0411k4898A64706R4140J65149a756j35278
15100a37034d1055A12265Q6057i2690A28032A6414K35170L68677e4615A76170
15089A54011h1273k0777l1452D2263L14526j65754d7075A47630J64735I9935K24675
15078C24610C6755b10915F848h9231C830K82453A22084J60938m9398d3424A44340
15066G0939a9809A45678M0904J4366L5518K71438h9115B03436b87748B99913a24870
15054B27116O8740A01177a25119A71131j285F9548k5563a7381A99436j2367K4211
15043B11280l1042G020K64215a38864H2004b685C6219M9251a5818j04570A60142
$$ plain form
15031 223482 128942 -235181 491057 -58597 121352 89855 372294 214247 217988 -103770
15020 -167223 150590 174011 514741 -220673 191414 631445 51660 -16541 261280 483923
15010 483923 292569 204241 49860 427981 168582 229995 353117 160608 278499 341476
15000 341476 307504 214739 253728 308578 267268 201003 227271 -13636 92828 478660 86992
14988 203893 103614 521735 -40261 140200 -7825 -246959 393490 305924 412080 75536
14977 125425 -45858 274329 241432 55936 95123 368040 519751 3195 295816 92825 221323
14966 221323 113308 134153 427307 556264 -15409 108314 166938 -1246 95618 264778 315515
14955 315515 472724 157687 378182 151527 51854 -100803 408721 421238 166729 575040
$$ packed form
15031B23482r4540b35181D91057e8597A21352l1497K82439j58047L741a03770
15020a67223A50590K3421L40730b20673A91414M40031E1660a6541B61280K22643
15010D83923j91354q8328D9860L78121A68582O1413J23122A60608J17891O2977
15000C41476l3972r2765L8989N4850m1310o6265K6268a3636I2828L85832H6992
14988B03893j00279M18121d0261A40200g825k39134C93490q7566J06156G5536
14977A25425d5858B74329l2897E5936L9187K72917J51711C195K92621I2825J28498
14966B21323j08015K0845K93154J28957a5409A08314N8624a246I5618J69160N0737
14955C15515J57209A57687K20495A51527E1854a00803D08721J2517A66729M08311
$$ plain form
14945 575040 226814 -137614 216761 285070 438560 -16617 537259 91881 215477 339026
14935 339026 80196 223021 159383 564808 128921 253272 225726 321529 130797 161702
14925 161702 325709 138656 290717 -53601 339098 311652 -9918 640544 31559 214889
14915 214889 311078 149707 413486 185071 456228 231891 508208 421013 171402 131281
14905 131281 183372 203688 294735 265919 124134 400991 601116 -1222 432391 91200 138293
14894 138293 170885 274892 15719 274933 -31656 133675 491971 176882 169452 388381
14884 388381 247030 683949 156111 337061 187782 508677 347707 213596 421313 482268
14874 482268 420972 116013 388257 77362 494509 85699 407828 223488 146837 424716
$$ packed form
14945E75040B26814a37614B16761O8309J53490a6617E37259I1881J23596J23549
14935C39026H0196J42825o3638M05425A28921J24351k7546R5803A30797L0905
14925A61702J64007A38656J52061e3601C39098k7446i918F40544C1559J83330
14915B14889R6189A49707K63779A85071K71157k24337K76317q7195A71402m0121
14905A31281N2091K0316R1047k8816A24134K76857K00125a222D32391I1200M7093
14894A38293L2592J04007A5719K59214c1656A33675L58296A76882p430K18929
14884C88381j41351M36919A56111J80950j49279L20895j60970j34111K07717O0955
14874D82268o1296A16013K72244G7362M17147H5699L22129j84340p6651K77879
$$ plain form
14864 424716 425308 432315 290743 84262 627381 37631 375325 407602 185239 340971 523838
14853 523838 472926 474785 362119 497797 481719 269448 531360 534781 506154 145434 284189
14842 284189 555134 433065 419837 188273 468384 259117 453759 423306 243939 343841
14832 343841 348673 396096 231007 -110976 159971 672254 -93913 470651 297368 156726
14822 156726 490573 415033 152439 739 186159 329649 443050 525628 794167 603918
14812 603918 551454 304333 414693 206218 765385 394109 214451 306491 625537 399701
14802 399701 404572 186399 245709 709847 342099 908164 277363 392720 636441 609457
14792 609457 555853 476847 455003 832941 544918 544048 429983 447202 615833 637111 826538
$$ packed form
14864D24716N92P007j41572H4262N43119C7631L37694L2277A85239J55732J82867
14853E23838n0912J859j12666J35678j6078k12271K61912L421k8627A45434J38755
14842B84189K70945j22069j3228A88273K80111k09267J94642l0453j79367R9902
14832C43841M832M7423j65089a10976A59971N12283i3913D70651j73283j40642
14822A56726L33847p5540A52439G39J85420J43490J13401Q2578K68539j90249
14812F03918n2464k47121J10360B06218N59167l71276j79658R2040L19046k25836
14802C99701M871A86399N9310M64138C42099N66065B77363J15357K43721k6984
14792F09457n3604p9006k1844L77938k88023q70j14065J7219J68631K1278J89427
$$ plain form
14781 826538 260562 522436 517761 989958 574448 563179 286683 569387 547834 550392 549852
14770 549852 446555 578324 576762 556512 342644 606055 292553 352120 207405 755140
14760 755140 708263 872218 466549 662299 669447 -30722 615718 1064950 479992 487039 598255
14749 598255 721042 835409 684024 565466 833399 898243 711467 582706 814837 485148
14739 485148 568280 572240 627586 569001 702254 504640 497318 705213 455973 825437 826485
14728 826485 707097 792615 666136 965890 905134 612772 728539 735421 664114 735780 863515
14717 863515 499503 341480 746647 814185 717251 716079 820417 836928 557543 758818
14707 758818 745152 688209 494161 685636 817683 509777 696493 509462 700913 937462
$$ packed form
14781H26538B60562K61874m675M72197m15510j1269k76496K82704k1553K558n40
14770E49852j03297J31769j562k0250k13868K63411B92553N9567j44715N47735
14760G55140m6877J63955m05669J95750P148c0722F15718M49232D79992P047J11216
14749E98255J22787J14367j51385j18558K67933O4844j86776j28761K32131l29689
14739D85148Q3132L960N5346n8585J33253j97614p322K07895k49240L69464J048
14728H26485j19388Q5518j26479K99754o0756k92362J15767O882p1307P1666J27735
14717H63515l64012j58023M05167O7538r6934j172J04338J6511k79385K01275
14707G58818j3666n6943j94048J91475J32047l07906J86716j87031J91451K36549
$$ plain form
14697 937462 797084 878483 818395 1138996 950192 1044848 744710 803628 875804 892317 707642
14686 707642 610799 869406 797865 903259 820289 983593 1013289 938428 1178550 1083266 884727
14675 884727 1231601 1005395 877952 595627 1153983 780839 836736 776518 981258 679838
14665 679838 1090132 1124143 857343 937391 1125779 891045 914695 952172 954527 845206 1036207
14654 1036207 1046024 887043 969249 757772 1046869 1231008 1089521 1238284 1184645 1159552
14644 1159552 925130 1098989 1115125 977205 1377419 1060896 1137050 1094567 1195514 1110256
14634 1110256 1250562 1150920 1058919 1464018 1163906 1501039 1110512 989024 1149640 1281992
14624 1281992 1296399 1387352 1371004 1501927 1552556 1108478 1203255 1484283 1538335 1261278
$$ packed form
14697I37462j40378Q1399o0088L20601j88804R4656l00138N8918P2176J6513j84675
14686G07642r6843K58607p1541J05394q2970J63304K9696p4861K40122r5284j98539
14675H84727L46874k26206j27443k82325N58356l73144N5897o0218K04740l01420
14665F79838M10294L4011k66800Q0048J88388k34734K3650L7477K355j09321J91001
14654A036207R817j58981Q2206k11477K89097J84139j41487J48763n3639k5093
14644A159552k34422J73859J6136j37920M00214l16523P6154m2483J00947q5258
14634A110256J40306r9642r2001M05099l00112L37133l90527j21488J60616J32352
14624A281992J4407R0953j6348J30923N0629m44078R4777K81028N4052k77057
$$ plain form
14614 1261278 1523991 1048039 1480810 1239084 1620517 1198978 1607817 1593003 1353079 1241960
14604 1241960 1645284 1511482 1179269 1537388 1370198 1417490 1684945 1636634 1357856 1735431
14594 1735431 1888961 1558804 1503430 1673355 1940322 1580155 1903881 1692940 1651223 1586275
14584 1586275 1923960 2331356 1764593 1950112 1794377 2000091 2107333 1603569 1891395
14575 1891395 1962828 1890272 2179892 1905205 2111984 2086079 2070925 2069185 2052231 2172691 2123069
14564 2123069 2455487 2280730 2191184 2508488 2535285 2529845 2361473 2989022 2835254 3019326
14554 3019326 3326831 3677646 3609255 4260741 5069696 7092279 10784719 19639180 38994673
14545 38994673 45190195 24384004 9773812 4714091 3035139 2159469 1806129 2056059
$$ packed form
14614A261278K62713m75952M32771k41726L81433m21539M08839j4814k39924j11119
14604A241960M03324j33802l32213L58119j67190M7292K67455m8311k78778L77575
14594A735431J53530l30157n5374J69925K66967l60167L23726k10941m1717o4948
14584A586275L37685M07396n66763J85519j55735K05714J07242n03764K87826
14575A891395P1433p2556K89620k74687K06779k5905j5154j740j6954J20460m9622
14564B123069L32418j74757q9546L17304K6797n440j68372O27549j53768J84072
14554C019326L07505L50815o8391O51486Q08955K022583L692440Q854461J9355493
14545C8994673O195522k0806191I773812D714091j678952q75670l53340K49930
$$ plain form
14537 2056059 1824090 1828626 1674852 1661717 1856309 1904948 2241250 1741489 1842077 1951933
14527 1951933 2084915 1926031 2173599 2348616 2186850 2191375 1945655 2152558 1984511 2341627
14517 2341627 2539582 2489094 2531429 2472171 3098910 2682148 2434338 2594617 2203452 2493801
14507 2493801 2804668 2544709 2855131 2748791 2845881 2682678 2728898 2976809 3031189 2932360
14497 2932360 2952788 2914636 3129116 2966792 3208540 3092855 3330531 2934377 3400138 3375702
14487 3375702 3485658 3778640 3218563 3447236 3394491 3485782 3713462 3482132 4037078 3562792
14477 3562792 3727892 3865578 3887957 3691400 4177215 4005195 3790987 3912327 3801803 4070320
14467 4070320 4316752 4357310 4459739 4319781 4516391 4144586 4787586 4688387 4848453 4724108
$$ packed form
14537B056059k31969M536j53774j3135J94592M8639L36302m99761J00588J09856
14527A951933J32982j58884K47568J75017j61766M525k45720K06903j68047L57116
14517B341627J97955n0488M2335n9258O26739m16762k47810J60279l91165K90349
14507B493801L10867k59959L10422j06340R7090j63203M6220K47911N4380r8829
14497B932360K0428l8152K14480j62324K41748j15685K37676l96154M65761k4436
14487C375702J09956K92982n60077K28673n2745R1291K27680k31330N54946m74286
14477C562792J65100J37686K2379j96557M85815j72020k14208J21340j10524K68517
14467D070320K46432M0558J02429j39958J96610l71805O43000r9199J60066j24345
$$ plain form
14457 4724108 4728967 4641662 4456374 4781944 5074286 4763901 5041805 4878548 4822464 4954140
14447 4954140 5181136 5182706 5481514 5542162 5810780 5603621 5783063 6010080 5607325 5648195
14437 5648195 5484505 5953294 6063049 6132623 6047152 6231645 6567520 6414749 6680047 6398435
14427 6398435 6929915 6976618 6925914 6819523 6986140 7029809 7441668 7457715 7904057 7328415
14417 7328415 7606677 7949906 7914884 8037151 7738663 8498213 8685406 8548062 8736178 8610156
14407 8610156 9023770 9299489 9087201 9272709 9796333 9727743 9739618 9952242 9942451 10275894
14397 10275894 10538678 10334586 10776482 10805316 11441374 11439069 11415139 11372972 12148933 12178331
14387 12178331 12068217 12559273 12772539 12753956 13330741 13593144 14001375 14103340 14236072
$$ packed form
14457D724108M859q7305j85288L25570K92342l10385K77904j63257n6084J31676
14447D954140K26996J570K98808O0648K68618k07159J79442K27017m02755M0870
14437E648195j63690M68789J09755O9574q5471J84493L35875j52771K65298k81612
14427F398435N31480M6703n0704j06391J66617M3669M11859J6047M46342n75642
14417G328415K78262L43229l5022J22267k98488P59550J87193j37344J88116j26022
14407H610156M13614K75719k12288J85508N23624o8590J1875K12624r791L33443
14397A0275894K62784k04092M41896K8834O36058k305k3930m2167P75961K9398
14387A2178331j10114M91056K13266j8583N76785K62403M08231J01965J32732
$$ plain form
14378 14236072 14350880 14830530 15225136 15205818 15768973 16065207 16484253 16428655 17165387 17531002
14368 17531002 17344563 18155959 18033847 18817278 19238015 19509111 20009656 20359077 20979026
14359 20979026 21408866 22317199 22443630 22838680 23581049 23795391 24701146 25397088 25752440
14350 25752440 26445480 27013363 28084894 28870954 29522974 30004778 30930809 31574520 32708100
14341 32708100 33639957 34254132 35041358 36244965 37370808 38355492 39387465 40528426 42097674
14332 42097674 43042696 44825532 45930309 47343121 49389118 50593605 52238554 54260662
14324 54260662 56153186 57613923 59911907 61966877 64385549 66752839 69149764 71638244
14316 71638244 74570279 77536668 80555092 83897287 87412565 90922552 95344861 99340283
$$ packed form
14378A4236072J14808M79650L94606j9318N63155K96234M19046n5598P36732L65615
14368A7531002j86439Q11396j22112P83431M20737K71096N00545L49421O19949
14359B0979026M29840R08333J26431L95050P42369K14342R05755O95942L55352
14350B5752440O93040N67883J071531P86060O52020M81804R26031O43711J133580
14341C2708100R31857O14175P87226J203607J125843R84684J031973J140961J569248
14332D2097674R45022J782836J104777J412812K045997J204487J644949K022108
14324E4260662J892524J460737K297984K054970K418672K367290K396925K488480
14316G1638244K932035K966389L018424L342195L515278L509987M422309L995422
$$ plain form
14308 99340283 103419278 108260110 112962696 118303569 123964950 129703537 135884341 142593820
14300 142593820 149743761 157581952 165606854 174271304 183275977 192791934 203249823 213993873
14292 213993873 225671748 237704048 250434912 264069280 278104616 292456086 307807031
14285 307807031 323522727 340059292 356226877 372897592 388988629 404996833 420393668
14278 420393668 434732231 447611104 458790441 468307977 474775198 476890723 476015948 474177417
14270 474177417 470581593 465988338 461644922 454354201 443924652 431802718 418511064
14263 418511064 403963766 388715628 372916752 356579417 339854589 323311759 307062480
14256 307062480 291462498 276745046 263307916 249516558 236746120 224193096 212997622
$$ packed form
14308I9340283M078995M840832M702586N340873N661381N738587O180804O709479
14300A42593820P149941P838191Q024902Q664450R004673R515957J0457889J0744050
14292B13993873J1677875J2032300J2730864J3634368J4035336J4351470J5350945
14285C07807031J5715696J6536565J6167585J6670715J6091037J6008204J5396835
14278D20393668J4338563J2878873J1179337R517536O467221K115525q74775j838531
14270D74177417l595824m593255m343416p290721j0429549j2121934j3291654
14263D18511064j4547298j5248138j5798876j6337335j6724828j6542830j6249279
14256C07062480j5599982j4717452j3437130j3791358j2770438j2553024j1195474
$$ plain form
14249 212997622 201744954 191670692 182181583 172953394 164398392 156839887 149317205 141935622
14241 141935622 135379721 128884603 123213457 117963427 112925592 107747728 103246171 98761735
14233 98761735 94517789 90799463 87762551 83932323 80722931 77669765 74709120 71597289
14225 71597289 69107847 66265217 64365343 62008620 60016188 58317464 56186477 53834913
14217 53834913 52249122 50524488 49121201 47497731 46672356 45276900 43356844 42169632
14209 42169632 40811498 39989065 39288390 38388258 36838354 35858206 34294533 33940419 33106886
14200 33106886 32397989 31440488 30797679 29467107 29176340 28074641 27670408 27199099 26238625
14191 26238625 25712246 25152728 24396833 23627519 23497920 22631893 22094182 21802522 21191500
$$ packed form
14249B12997622j1252668j0074262r489109r228189q555002p558505p522682p381583
14241A41935622o555901o495118n671146n250030n037835n177864m501557m484436
14233I8761735m243946l718326l036912l830228l209392l053166k960645l111831
14225G1597289k489442k842630j899874k356723j992432j698724k130987k351564
14217E3834913j585791j724634j403287j623470q25375j395456j920056j187212
14209D2169632j358134q22433p00675r00132j549904r80148j563673l54114q33533
14200C3106886p08897r57501o42809j330572k90767j101699m04233m71309r60474
14191B6238625n26379n59518p55895p69314j29599q66027n37711k91660o11022
$$ plain form
14182 21191500 20732823 20532289 19759385 19697002 19079218 18923537 18482199 18030781 17679912
14173 17679912 17486372 17012095 16759011 16239357 15936406 15847460 15343454 15134877 14751367
14164 14751367 14611153 14332190 14214574 14036800 13722151 13501260 13091930 13128711 12978926
14155 12978926 12470077 12108156 12218486 11689017 11814935 11782982 11549432 11265387 11095433
14146 11095433 10738502 10649672 10234980 10295761 9990064 9760848 9785283 9408885 9673017 9273854
14136 9273854 9241567 9103155 9357713 8580422 8757742 8415050 8482247 8306701 8199112 8016682
14126 8016682 8193337 7727974 7756409 7967701 7789409 7673713 7521582 7183455 7119545 7166227
14116 7166227 6884813 6898594 6655622 6707268 6898925 6737077 6788770 6585920 6260962 5913456
$$ packed form
14182B1191500m58677k00534p72904o2383o17784j55681m41338m51418l50869
14173A7679912j93540m74277k53084n19654l02951q8946n04006k08577l83510
14164A4751367j40214k78963j17616j77774l14649k20891m09330L6781j49785
14155A2978926n08849l61921J10330n29469J25918l1953k33550k84045j69954
14146A1095433l56931q8830m14692O0781l05697k29216K4435l76398K64132l99163
14136I273854l2287j38412K54558p77291J77320l42692O7197j75546j07589j82430
14126H016682J76655m65363K8435K11292j78292j15696j52131l38127o3910M6682
14116G166227k81414J3781k42972N1646J91657j61848N1693k02850l24958l47506
$$ plain form
14106 5913456 6214945 6376181 6200254 5873132 6122720 5845772 5943710 5794568 5781394 5443336
14096 5443336 5370013 5536263 5456705 5633578 5204099 4941762 5224887 4990342 5184259 4672860
14086 4672860 4881976 4905382 4675585 4648021 4463445 4704410 4668524 4704156 4657914 4049996
14076 4049996 4456880 4398686 4401562 4335066 4294594 3879971 4231288 4266429 3994831 3992674 3866866
14065 3866866 3934110 3816422 3879129 4014808 3849777 4024630 3485948 3783411 4076378 3898265
14055 3898265 3491477 3551079 3628954 3703233 3217326 3655412 3227747 3329159 3209423 3386495
14045 3386495 3179866 3197820 3286594 2892924 3091365 3187116 3193114 3259659 2809623 2933147
14035 2933147 2952918 2914807 2849766 3204610 2835693 2897330 3073896 2665534 2904061 2446964
$$ packed form
14106E913456L01489J61236j75927l27122K49588k76948R7938j49142j3174l38058
14096E443336p3323J66250p9558J76873m29479k62337K83125k34545J93917n11399
14086D672860K09116K3406k29797k7564j84576K40965l5886L5632m6242o07918
14076D049996M06884n8194K876o6496m0472m14623L51317L5141k71598k157j25808
14065C866866O7244j17688O2707J35679j65031J74853n38682K97463K92967j78113
14055C898265m06788N9602P7875P4279m85907M38086m27665J01412j19736J77072
14045C386495k06629J7954Q8774l93670J98441R5751N998O6545m50036J23524
14035B933147J9771l8111o5041L54844l68917O1637J76566m08362K38527m57097
$$ plain form
14025 2446964 2924297 2584326 2873282 2191886 2796215 2517664 2579270 2616683 2630695 2340937
14015 2340937 2629486 2324846 2295686 2407334 2347137 2334759 2085959 2038875 2085205 2270569
14005 2270569 2138898 1959419 2278617 2140442 1993690 2134005 1848044 2108805 1927137
13996 1927137 2174882 2050698 1875616 1898920 2065080 2189718 2398604 3950301 6020411
13987 6020411 12595746 31354510 45276780 27459430 12889532 8165781 5881718 4642213
13979 4642213 3537551 3469909 3123755 2905730 2808783 2683427 2666367 2390132 2360881 2410004
13969 2410004 2395367 2436945 2138977 2314948 2230799 2138118 2284091 2100276 2321431 2045460
13959 2045460 2235243 1879328 2010165 1965306 1856275 1885478 1948471 1758760 1621756 1559597
$$ packed form
14025B446964M77333l39971K88956o81396O04329k78551O1606L7413J4012k89758
14015B340937K88549l04640k9160J11648o0197j2378k48800m7084M6330J85364
14005B270569j31671j79479L19198j38175j46752J40315k85961K60761j81668
13996A927137K47745j24184j75082K3304J66160J24638K08886J551697K070110
13987F020411O575335J8758764J3922270j7817350A2889532m723751k284063j239505
13979D642213j104662o7642l46154k18025r6947j25356j7060k76235k9251M9123
13969B410004j4637M1578k97968J75971q4149r2681J45973j83815K21155k75971
13959B045460J89783l55915J30837m4859j09031K9203O2993j89711j37004o2159
$$ plain form
13949 1559597 1803292 1888351 1747421 1668249 1813236 1962305 1641233 1773524 1700739 1737996
13939 1737996 1553938 1606349 1701303 1802277 1492718 1481995 1561565 1321826 1608957 1455875
13929 1455875 1756497 1400516 1463786 1656164 1547828 1706657 1590987 1184192 1383013 1260116
13919 1260116 1357645 1227722 1483697 1502437 1693497 1712288 1376675 1581505 1339175 1156189
13909 1156189 1457279 1602236 1494525 1786922 1189545 1214618 1246758 1507715 999942 1404025
13899 1404025 1353409 1312895 1249613 1465446 1495659 1349510 1284551 1128357 1455660 1559519
13889 1559519 1218642 1466561 1116678 1227613 1257706 1203677 1155315 1263495 1227315 1525871
13879 1525871 911360 1103830 1140705 1413687 1364055 1379952 1332968 1344991 878098 1190368
$$ packed form
13949A559597K43695Q5059j40930p9172J44987J49069l21072J32291p2785L7257
13939A737996j84058N2411R4954J00974l09559j0723P9570k39739K87131j53082
13929A455875L00622l55981O3270J92378j08336J58829j15670m06795J98821j22897
13919A260116R7529j29923K55975J8740J91060J8791l35613K04830k42330j82986
13909A156189L01090J44957j07711K92397n97377K5073L2140K60957n07773M04083
13899A404025n0616m0514o3282K15833L0213j46149o4959j56194L27303J03859
13889A559519l40877K47919l49883J10935L0093n4029m8362J08180l6180K98556
13879A525871o14511J92470L6875K72982m9632J5897m6984J2023m66893L12270
$$ plain form
13869 1190368 1083324 1306212 853743 1338735 1163353 1167545 1123887 1056707 892319 891020
13859 891020 1110257 1087864 810570 1167258 1182739 934383 1257580 1081773 878505 984321
13849 984321 1063319 1349113 878916 1038106 1011328 1213141 1070471 882744 744151 1034168
13839 1034168 733752 1134680 961944 603638 977608 931648 1125429 1136594 1029874 857721
13829 857721 720374 767372 820506 832695 738753 816731 911925 949737 998190 792869 780092
13818 780092 824619 1021339 811218 827196 917610 784153 742026 1022727 760986 882442
13808 882442 783465 850992 513083 611195 599400 776135 994186 860622 597412 680483
13798 680483 678854 706309 653330 826063 642132 742325 961168 486584 765869 709964
$$ packed form
13869A190368j07044K22888m52469M84992j75382M192m3658o7180j64388j299
13859H91020K19237k2393k77294L56688J5481k48356L23197j75807k03268J05816
13849I84321P8998K85794m70197J59190k6778K01813j42670j87727j38593K90017
13839A034168l00416M00928j72736l58306L73970m5960J93781J1165j06720j72153
13829H57721j37347M6998N3134J2189r3942P7978R5194L7812M8453k05321j2777
13818G80092M4527J96720k10121J5978R0414j33457m2127K80701k61741J21456
13808H82442r8977O7527l37909R8112j1795J76735K18051j33564k63210Q3071
13798F80483j629K7455n2979J72733j83931J00193K18843m74584K79285n5905
$$ plain form
13788 709964 588373 845080 903106 820799 568100 886771 941477 448343 755125 724302
13778 724302 422793 562053 954499 725360 800543 856932 630509 490099 786253 814063
13768 814063 698340 540328 881304 756677 556161 343520 478139 642114 532554 444143
13758 444143 558895 741616 562040 577121 734823 616987 874812 776284 1018099 415761
13747 350100 440519 344031 631264 822791 598184 566781 597163 661914 474718 552764 549844
13736 549844 687129 675010 663367 553372 680921 780998 782938 414473 729135 456528
13726 456528 558434 403486 608498 663907 372020 953660 670654 585199 405368 475524
13716 475524 465987 681650 633878 497215 500345 265273 529922 104593 329354 789085
$$ packed form
13788G09964j21591K56707N8026q2307k52699L18671N4706D48343L06782l0823
13778G24302l01509J39260L92446k29139P5183N6389k26423j40410K96154K7810
13768H14063j15723j58012L40976j24627k00516k12641J34619J63975j09560q8411
13758D44143J14752J82721j79576J5081J57702j17836K57825r8528K41815D15761
13747C50100R0419r6488K87233J91527k24607l1403L0382O4751j87196P8046k920
13736E49844J37285j2119j1643j09995J27549J00077J940l68465L14662k72607
13726D56528J01906j54948K05012N5409k91887N81640k83006q5455j79831P0156
13716D75524r537K15663m7772j36663L130k35072K64649A04593K24761M59731
$$ plain form
13706 789085 527496 519163 379380 340784 507545 559456 220585 413293 371923 301389 649715
13695 649715 369768 558215 361753 370329 641056 814370 646113 861656 462438 357345
13685 357345 196711 690151 578536 362639 380055 545198 604671 613332 664623 384091
13675 384091 481617 176357 529472 430233 494898 386038 277606 329463 329215 516988 325562
13664 325562 607682 96560 466887 522516 444469 546130 269518 409946 425417 473595
13654 473595 361813 394974 179720 444348 395795 364757 336182 708062 214036 625195
13644 625195 223831 349701 506489 507672 342271 662328 527167 -202091 193892 315645
13634 315645 192232 532774 585179 430202 390028 609725 521009 295063 419869 409506
$$ packed form
13706G89085k61589q333j39783l8596J66761N1911B20585J92708m1370p0534L48326
13695F49715k79947J88447j96462Q576K70727J73314j68257K15543l99218j05093
13685C57345j60634M93440j11615k15897J7416J65143N9473Q661N1291k80532
13675C84091R7526A76357L53115r9239O4665j08860j08432N1857k48J87773j91426
13664C25562K82120I6560L70327N5629p8047J01661B69518J40428J5471M8178
13654D73595j11782L3161A79720K64628m8553l1038k8575L71880B14036M11159
13644F25195B23831J25870J56788J183j65401L20057j35161b02091A93892J21753
13634C15645j23413L40542N2405j54977m0174K19697q8716k25946J24806j0363
$$ plain form
13624 409506 443289 540401 447262 259788 316796 575360 191787 236603 396939 118300
13613 338355 460466 245131 334008 318983 596429 285989 378922 408272 260215 293567
13603 293567 452541 42445 773692 518220 550528 210205 334164 460789 230979 329736
13593 329736 32904 375104 377445 442956 432014 -122777 557297 396949 404454 43845 300763
13582 300763 359318 160951 437350 458781 374940 195887 255472 419552 248537 388394
13572 388394 119582 395935 -197515 108589 -225834 95980 -31254 313237 -25239 713338
13561 239744 485457 536412 201793 487389 151794 199531 345924 511021 84100 243458
13551 243458 292287 402861 457290 452296 271394 694615 298157 437548 230572 104688
$$ packed form
13624D09506L3783R7112r3139j87474N7008K58564A91787M4816J60336A18300
13613C38355J22111k15335Q8877j5025K77446B85989R2933K9350j48057L3352
13603B93567J58974D2445P31247k55472L2308B10205J23959J26625k29810R8757
13593C29736C2904L42200K341O5511j0942a22777E57297j60348P505D3845K56918
13582C00763N8555A60951K76399K1431q3841j79053N9585J64080j71015J39857
13572C88394A19582K76353a97515A08589b25834I5980c1254C13237b5239G13338
13561B39744K45713N0955B01793K85596A51794M7737J46393J65097H4100J59358
13551B43458M8829J10574N4429m994j80902M23221B98157J39391k06976A04688
$$ plain form
13540 101791 294919 117955 100821 602294 397971 128820 179959 234943 453218 299146
13530 299146 382823 339648 362114 284511 104363 89237 175527 189330 329979 368889 524043
13519 524043 354088 98941 278655 135440 155448 4965 -25093 64137 299758 310522 271231
13508 271231 219508 193599 187334 151477 426686 106021 145371 212494 -27802 359373 207326
13497 207326 328833 317467 426609 389679 195536 -221518 136863 245318 428329 410927
13487 410927 291090 69970 322039 128083 312018 462478 52618 466242 449439 428979
13477 428979 265285 209262 149005 376803 305455 127235 450362 20369 514918 87957
13466 255207 223127 105573 325245 -90210 218793 345496 219544 163765 113479 -264701
$$ packed form
13540A01791J93128A17955j7134N01473k04323A28820N1139N4984K18275j54072
13530B99146Q3677m3175K2466p7603A04363j5126Q6290J3803J40649L8910J55154
13519E24043j69955I8941J79714A35440K0008D965b5093F4137K35621J0764l9291
13508B71231n1723k5909o265l5857K75209A06021L9350O7123b7802C59373j52047
13497B07326J21507j1366J09142l6930j94143b21518A36863J08455J83011j7402
13487D10927j19837F9970K52069A28083J83935J50460E2618M13624j6803k0460
13477D28979j63694n6023o0257K27798p1348A27235L23127B0369M94549H7957
13466B55207l2080A05573K19672i0210B18793J26703j25952n5779n0286b64701
$$ plain form
13455 208719 5972 -52479 314887 216080 1413 252268 526218 144008 28675 16614 356539
13444 356539 401441 284344 149556 256959 282130 238307 13861 50639 195184 466406
13434 466406 284115 50580 345417 459918 526781 210622 484067 49334 22636 256321
13424 256321 -15078 269728 296324 127104 370718 238020 272474 297969 205568 193421 424532
13413 424532 85154 433162 347587 221467 405288 -8916 -35989 261972 113927 288285
13403 288285 112225 382472 239669 490738 416996 322064 103147 253432 341226 422974
13393 422974 571090 364343 81566 37308 459 145763 221021 268251 630103 168056 77927
13381 228257 108647 -8202 182750 203509 96956 413946 245036 167227 54152 408907 109706
$$ packed form
13455B08719E972e2479C14887r8807A413K50855K73950A44008B8675j2061L39925
13444C56539M4902j17097j34788J07403K5171m3823A3861L6778J44545K71222
13434D66406j82291E0580K94837J14501O6863B10622K73445D9334B2636K33685
13424B56321a5078B69728K6596A27104K43614j32698L4454K5495r2401j2147K31111
13413D24532H5154L48008q5575j26120J83821h916k7073B61972A13927J74358
13403B88285A12225K70247j42803K51069p3742r4932A03147J50285Q7794Q1748
13393D22974J48116k06747H1566C7308D59J45304P5258M7230L61852A68056G7927
13381B28257A08647h202A82750K0759I6956L16990j68910p7809E4152L54755A09706
$$ plain form
13369 404269 200241 296034 317713 615355 277553 272341 -109093 272260 310707 92030 322627
13358 322627 416064 408431 189165 337207 365670 44741 114423 162633 187313 118156 363059
13347 363059 137736 169940 74708 264497 259611 276921 290000 477703 -65938 436349 180583
13335 284510 8311 112207 66205 417426 303201 -13073 92789 382901 292664 161207 608319
13324 608319 198470 120115 -16471 115044 -61200 407862 378876 123470 1666 381292 136496
13312 70553 88101 257860 272810 133048 96373 -19445 -112347 118207 -25801 112225 316993
13301 316993 -52029 140296 294933 307881 59523 215410 208712 -33459 343204 190680 21533
13289 -83839 381889 256899 66599 31843 274357 -120181 121922 59900 -59414 -24245 515453
$$ packed form
13369D04269B00241R5793K1679K97642B77553n212a09093B72260L8447I2030K30597
13358C22627R3437p633A89165J48042K8463D4741O9682M8210K4680o9157K44903
13347C63059A37736L2204G4708J89789m886J7310J3079J87703f5938D36349A80583
13335B84510H311J03896m6002L51221j14225a3073I2789K90112r0237j31457M47112
13324F08319A98470p8355a6471A15044f1200D07862k8986A23470A666L79626A36496
13312G0553J7548J69759J4950A33048l6675a9445r2902A18207b5801A12225K04768
13301C16993e2029A40296J54637J2948E9523J55887o698c3459C43204j52524B1533
13289h3839C81889j24990F6599C1843K42514a20181A21922E9900e9414b4245E15453
$$ plain form
13277 -69968 131141 234606 72730 -92189 133661 158330 341078 484844 145055 424749
13267 424749 161698 108459 63944 -50008 91795 234878 -62649 -128204 434370 -69200 -22641
13255 -90136 -31166 148848 134705 85565 283427 -275125 277911 152895 -17647 -53423 -123664
13244 -123664 89442 59118 72542 109173 151976 11738 27957 64468 334219 534868 31919
13232 291887 120162 350539 -31806 87445 142171 -208321 180260 365290 38779 87261
13222 87261 -31525 400820 -358705 26725 165358 160248 74201 139649 135153 159311 1637 63073
13210 63073 -35096 217382 200009 261935 69605 198965 324086 173271 -51101 189346 12558
13198 -217897 -142841 -100329 51209 -243611 46332 -1821 204262 -122640 237710 296003 409182
$$ packed form
13277f9968A31141J03465G2730i2189A33661K4669J82748J43766A45055K79694
13267D24749A61698n3239m4515e0008I1795J43083f2649o5555D34370f9200b2641
13255i0136c1166A48848j4143m9140J97862b75125B77911j25016a7647l5776p0241
13244a23664H9442l0324J3424L6631M2803A1738J6219L6511K69751K00649C1919
13232B91887A20162K30377c1806H7445N4726b08321A80260J85030C8779M8482
13222H7261c1525D00820c58705B6725J38633n110G4201O5448m496K4158A637O1436
13210F3073c5096B17382j7373O1926F9605J29360J25121j50815e1101A89346A2558
13198b17897P5056M2512E1209b43611D6332a821B04262a22640B37710N8293J13179
$$ plain form
13187 409182 262496 438437 269828 116872 273873 -257062 -12929 37141 135914 146118
13177 146118 -24440 202464 33003 160094 -46486 44568 265953 259721 -241101 301398 30910
13165 241625 -153709 294563 61881 -10227 262447 88190 4613 31644 288615 233613 550189
13154 550189 270815 54134 -37312 -563 163102 288877 504473 108994 363912 95057 160945
13143 160945 129891 228141 372323 -130276 -35705 363447 -125020 261439 -101658 105515
13132 -140968 -240089 93377 -60489 36363 35774 43818 288558 189005 312577 -161912 48833
13120 -104461 349092 27389 385149 146716 103545 228529 149375 92451 -279933 78724
13109 140937 208941 462597 89935 96325 80257 -123723 106886 254449 75953 10527 218504
$$ packed form
13187D09182j46686J75941j68609A16872J57001b57062a2929C7141R8773J0204
13177A46118b4440B02464C3003J27091d6486D4568K21385o232b41101C01398C0910
13165B41625a53709B94563F1881a0227B62447H8190D613K7031K56971n5002L16576
13154E50189B70815E4134c7312e63A63102J25775K15596A08994K54918I5057O5888
13143A60945l1054R8250J44182a30276c5705C63447a25020B61439a01658A05515
13132a40968r9121I3377f0489C6363n89Q044K44740r9553J23572a61912D8833
13120a04461C49092B7389L57760A46716m3171J24984p9154n6924b79933G8724
13109A40937O8004K53656H9935O390j6068a23723A06886J47563G5953A0527K07977
$$ plain form
13098 218504 -50302 -67359 44868 80552 64341 -68569 235294 -34493 69345 43767 -46350
13086 -233967 -5369 -59441 79260 -32764 284230 114087 121403 -465220 -271470 -29446 420517
13074 248247 778 89691 48436 -26052 -191307 -70270 281838 232227 15700 143657 216393
13063 216393 198942 77506 84401 82214 -48411 -93655 -114237 -87391 266490 157935 -415905
13051 14368 185849 374696 405301 -93485 74122 -72899 35973 114249 61480 18805 -56386
13039 -14380 -135491 70556 -92145 142054 105061 19435 82474 136698 -31647 329431 238954
13028 238954 97503 -110400 307696 232214 -64570 265774 118431 190532 279942 -1731 181334
13016 273410 237107 165447 73425 325980 -168250 202821 -243170 -20628 64061 -154579
$$ packed form
13098B18504e0302j7057D4868L5684j6211f8569B35294c4493F9345k5578d6350
13086b33967e369n4072G9260c2764B84230A14087P316d65220J93750b9446D20517
13074B48247G78Q8913m1255b6052j65255g0270B81838m9611A5700J27957P2736
13063B16393j7451G7506O895k187d8411m5244k0582K6846B66490j08555d15905
13051A4368J71481J88847L0605i3485G4122g2899C5973P8276n2769A8805e6386
13039a4380j21111G0556i2145A42054l6993A9435O3039N4224c1647C29431r0477
13028B38954I7503a10400C07696p5482f4570B65774A18431P2101Q9410a731A81334
13016B73410l6303p1660G3425K52555a68250B02821b43170b0628F4061a54579
$$ plain form
13005 185743 -23994 60707 121436 146709 66138 4044 609644 325786 -76758 -35078 38471
12993 84784 -89248 -332558 343064 215089 244837 -224683 234959 124710 311486 158170
12983 158170 252934 215212 30511 135995 90703 241670 69062 -139551 231768 50491 38454
12972 38454 -115986 -163999 -202373 342953 151430 369493 -218288 -98283 -106558 140384 -285116
12960 -28224 -9002 -12009 182367 -92281 25910 121144 106569 -22437 369497 786 -162158 -36425
12947 54813 -6332 275103 -424043 -102466 359320 -23773 444153 -43370 11757 210295 95333
12935 -146601 71225 39326 372151 -110189 -129476 115475 -105044 432701 237826 398916
12925 398916 -97894 -296889 -77209 277326 145854 -8978 -38463 204992 -13538 110505 26949
$$ packed form
13005A85743b3994F0707O0729K5273F6138D044O05600k83858g6758c5078C8471
12993H4784h9248k43310C43064j27975K9748b24683B34959j10249J86776j53316
12983A58170R4764l7722C0511J05484m5292J50967F9062a39551B31768E0491j2037
12972C8454a15986m8013l8374C42953A51430K18063b18288i8283q275A40384b85116
12960b8224i002l007A82367i2281B5910R5234j4575b2437C69497G86a62158c6425
12947E4813f332B75103d24043a02466C59320b3773D44153d3370A1757J98538I5333
12935a46601G1225l1899L32825a10189j9287A15475a05044D32701j94875J61090
12925C98916i7894j98995g7209B77326j31472h978k9485B04992a3538A10505B6949
$$ plain form
12913 463154 163494 167292 433161 126503 3373 234089 424112 263190 165464 -79897 16863
12901 -183518 12225 -1759 291834 119291 190682 158342 -117362 79506 95501 93631 -279295
12889 42282 41739 97696 -88775 86590 97440 256737 -64536 256500 163371 -50426 276127
12877 -126610 89275 147266 -171298 54935 197125 93647 78325 260454 19901 10205 152694
12866 152694 163795 145143 -13398 170881 -42102 -113119 -253172 224570 68717 63752 -113838
12854 -23736 -60461 -211019 94620 -49765 146964 -8570 140758 -22468 63480 28015 -34418
12842 -16667 153320 146027 -223421 91644 -173323 -100943 311072 -12305 329188 -253499 -152089
12831 -152089 -1880 -192812 160289 230370 -188411 122451 109688 58441 -17964 -243398 183873
$$ packed form
12913D63154A63494L798K65869A26503C373K30716J90023j60922r7726g9897A6863
12901a83518A2225a759B91834A19291P1391l2340a17362G9506J5995j870b79295
12889D2282n43N5957h8775H6590J0850J59297f4536B56500r3129e0426B76127
12877a26610H9275N7991a71298E4935J42190I3647j5322J82129A9901r696J42489
12866A52694J1101j8652a3398A70881d2102p1017j40053B24570F8717m965a13838
12854b3736l6725j50558I4620d9765A46964h570A40758b2468F3480B8015c4418
12842a6667A53320p293b23421I1644a73323P2380C11072a2305C29188b53499J01410
12831a52089a880j90932A60289P0081a88411A22451j2763n1247a7964k25434A83873
$$ plain form
12819 217241 -4703 31576 62572 -138676 178758 181774 23218 -197539 -68834 -336314 366993
12807 366657 -226583 265588 -36330 184215 -61251 110265 130399 255143 71823 -193647
12796 -42897 18865 158943 -47649 115937 -46172 -6810 200408 7343 -120564 -26022 -17438
12785 -17438 82012 74841 -310660 147653 -212599 37612 -15116 37419 -97358 -172657 -39132
12773 109884 -93289 -11419 -31877 6166 -508576 139320 28843 -222411 -232665 -169795 40697
12761 100985 158800 153687 -188723 327333 -18896 104084 -337491 -60282 -108196 -76416 89161
12749 197817 174242 261760 -171618 -116549 188599 117189 -253737 42409 164044 18715 25416
12738 25416 -111913 110065 -229438 -78148 96358 173694 159570 32492 288488 155034 -13366
$$ packed form
12819B17241d703C1576L0996a38676A78758L016B3218a97539f8834k67480C66993
12807C66657b26583B65588c6330A84215f1251A10265K0134J24744G1823a93647
12796d2897A8865J40078d7649A15937d6172f810B00408G343a20564b6022Q584
12785a7438H2012p171c10660A47653b12599C7612a5116C7419i7358p5299c9132
12773A09884i3289a1419k0458F166e08576A39320B8843b22411j0254O2870D0697
12761A00985N7815n113a88723C27333a8896A04084c37491f0282m7914L1780H9161
12749A97817k3575Q7518a71618N5069A88599p1410b53737D2409J21635A8715O701
12738B5416a11913A10065b29438g8148I6358P7336j4124C2492K55996j33454a3366
$$ plain form
12726 297667 8878 9936 -3674 19327 -187179 -126379 8289 -59794 -184842 64554 -16078 245378
12713 16476 -203005 -26333 121361 221743 -254053 259663 294441 395721 651300 430119
12703 430119 287589 -124628 142734 298805 177470 189029 -170643 -85337 -106153 246229
12692 2149 202810 -63548 -128913 273925 24842 116278 -184567 308264 171367 -165976 -167915
12681 -167915 157714 277236 -46624 22078 -30001 56812 82579 206836 84783 111551 -27826
12669 41622 11718 -104306 -98826 81119 237359 89430 -191673 14778 -73250 177762 256884
12658 256884 150833 -162935 -167073 163365 -484 169403 152299 104216 -112215 126597 -37455
12646 39994 -371252 89188 -39904 107007 192174 128314 -66032 -22219 206263 288826 91492
$$ packed form
12726B97667H878J058c674A9327a87179O0800H289e9794j25048F4554a6078B45378
12713A6476b03005b6333A21361J00382b54053B59663L4778J01280K55579k21181
12703D30119j42530a24628A42734J56071j21335J1559a70643Q5306k0816B46229
12692B149K00661f3548o5365B73925B4842R1436a84567C08264j36897a65976j939
12681a67915A57714J19522d6624B2078c0001E6812K5767J24257H4783K6768b7826
12669D1622A1718a04306N480H1119J56240H9430a91673A4778g3250A77762P9122
12658B56884j06051a62935m138A63365d84A69403j7104m8083a12215A26597c7455
12646C9994c71252H9188c9904A07007Q5167o3860f6032b2219B06263Q2563I1492
$$ plain form
12634 -167602 243601 236580 224627 68251 434881 98137 17548 70050 168310 347713 262029
12623 262029 153082 440258 162763 82071 -62023 172526 98239 -213093 1956 -9757 177344
12611 206198 117216 -151316 136248 144046 100648 172404 -14821 -43656 66281 122476 -136072
12599 139534 442299 243981 204819 -9368 -115604 -50645 63925 241129 179424 35268 189966
12588 189966 197694 -32324 317753 -32403 7914 -221921 -81992 -43705 67398 118717 171638
12577 171638 101454 240277 -295721 -133163 -80877 225828 -65919 -181442 72917 76491 -220478
12565 207140 100509 123937 365325 -20547 141106 147168 123079 -112436 -300359 67576 93749
12554 93749 -57072 400472 -85219 -122355 -251567 238200 32997 2110 303757 -146972 167378
$$ packed form
12634a67602B43601p021j1953F8251L66630I8137A7548N2502R8260J79403q5684
12623B62029j08947K87176A62763q0692f2023A72526p4287b13093A956i757A77344
12611B06198q8982a51316A36248P798m3398P1756a4821k8835F6281N6195a36072
12599A39534L02765j98318l9162i368j06236e0645F3925J77204o1705C5268J54698
12588A89966P728c2324C17753c2403G914b21921h1992L8287F7398N1319N2921
12577A71638p0184J38823b95721a33163N2286B25828f5919j15523G2917L574b20478
12565B07140A00509K3428K41388b0547A41106O062k4089a12436j87923F7576K6173
12554I3749e7072D00472h5219l7136j29212B38200C2997B110L01647a46972A67378
$$ plain form
12542 -275324 -190796 162926 18580 -34026 -249442 -127500 -292475 122861 209303 -129128
12531 -33586 193874 131858 42183 159377 -150108 -22524 -47103 35454 108051 -71552 191409
12519 -91025 37500 -132948 35783 230920 -26384 158368 -241177 193757 121970 76494 -250238
12507 -270760 -112590 -230457 -175997 180070 110168 -99517 116304 166613 129252 121596 -319470
12495 83085 -144383 -6210 -158555 46907 1571 158364 -207717 -39218 148909 322149 -148847
12483 -254150 -165460 278995 -169943 -104281 125351 -18218 117705 378296 2858 -118458
12472 -303005 230653 242191 58945 5578 112470 201927 -195223 -2697 138745 122870 -222323
12460 552861 398248 63202 155798 18842 50472 146392 61082 216737 -100884 -170693 225598
$$ packed form
12542b75324Q4528A62926A8580c4026k15416J21942j64975A22861Q6442a29128
12531c3586A93874o2016D2183J17194a50108b2524k4579C5454P2597g1552A91409
12519i1025C7500a32948C5783J95137b6384A58368b41177A93757p1787m5476b50238
12507b70760a12590j17867N4460A80070o9902i9517A16304N0309l7361p656c19470
12495H3085a44383f210j52345D6907A571J56793b07717c9218A48909J73240a48847
12483b54150Q8690B78995a69943O5662A25351a8218A17705K60591B858a18458
12472c03005B30653J1538E8945E578J06892Q9457a95223b697A38745j5875b22323
12460E52861j54613F3202R2596A8842L1630R5920F1082J55655a00884o9809B25598
$$ plain form
12448 -27277 326720 -199479 13363 -150235 199690 161659 -17631 221625 -3093 52417 77049
12437 77049 -160549 -138995 -239331 95412 -196132 45717 185046 -214624 -36644 -172973
12427 -172973 -40984 -42701 -34362 59385 -101388 142498 70870 -113355 293222 -121493 -98729
12416 -98729 -185151 112560 39448 -194774 26593 89301 -100615 -88418 -53605 -260330 -118939
12404 -304501 -203965 230725 -127537 -51763 -155375 -75012 171327 -95244 148715 338658
12394 338658 -90482 -189891 -146383 19865 -112255 -38459 -84479 258969 -49522 153600 -204014
12382 -105582 71040 -33982 44827 382036 49538 -127988 -290111 -109393 253991 -42583
12371 -51663 141253 207307 -306679 -192338 -44783 215923 -127579 105388 -103948 -247041
$$ packed form
12448b7277C26720a99479A3363a50235A99690l8031a7631B21625c093E2417K4632
12437G7049a60549K1554j00336I5412a96132D5717J39329b14624c6644j36329
12427a72973d0984j717Q339E9385a01388A42498G0870a13355B93222a21493K2764
12416i8729q6422A12560C9448a94774B6593O2708a00615J2197L4813k06725a18939
12404c04501J00536B30725a27537e1763j03612g5012A71327i5244A48715J89943
12394C38658i0482r9409M3508A9865a12255c8459m6020B58969d9522A53600b04014
12382a05582G1040c3982D4827L37209D9538a27988j62123a09393B53991d2583
12371e1663A41253O6054c06679J14341d4783B15923a27579A05388a03948j43093
$$ plain form
12361 -247041 147844 361396 -77565 207369 -2831 -290731 111673 11505 293113 73465
12350 -102524 -170540 247523 -79118 21530 195685 283452 -96715 -149831 3029 110254 39599
12338 181662 18401 137803 -220229 5034 -126472 -151965 36813 224904 -103370 -3640 14880
12326 -31044 28159 -51916 240586 142878 -9034 151010 -17829 -137899 -418013 -37973 151729
12314 -78687 -63521 207893 -244997 84251 -21928 23055 -22380 -133588 48503 279159 89043
12302 138541 194663 49643 -98581 127842 -73445 107856 -97783 235905 -7491 -142151 179702
12290 -59181 -26192 77714 21955 -101594 215064 81282 228004 184562 169805 164056 -92478
12278 288523 -48717 581324 -105501 -10412 392273 15498 288927 323083 12162 364258
$$ packed form
12361b47041A47844K13552g7565B07369b831k87900A11673A1505K81608G3465
12350a02524o8016B47523g9118B1530J74155Q7767i6715n3116C029J07225C9599
12338A81662A8401J19402b20229E034a26472k5493C6813J88091a03370c640A4880
12326c1044B8159e1916B40586r7708i034A51010a7829j20070k80114c7973A51729
12314g8687J5166B07893b44997H4251b1928B3055b2380j11208D8503K30656H9043
12302A38541N6122D9643i8581A27842g3445A07856i7783B35905g491j34660A79702
12290e9181b6192G7714B1955a01594B15064H1282J46722m3442j4757n749i2478
12278B88523d8717E81324a05501a0412C92273A5498K73429L4156A2162L52096
$$ plain form
12268 364258 -83871 129044 89977 121529 -41325 -28225 -206359 -44323 -25167 153835 -22844
12256 -13880 204571 -6150 -199242 88338 -168993 -197707 253421 -31837 382997 228144 163551
12245 163551 191537 -208224 73721 -291045 68765 -47703 -119888 319159 -385738 101714
12234 33729 368775 11597 20578 240209 35295 393605 440494 310321 320098 -3291 531484
12222 582150 172404 374957 288728 157525 259527 434119 -78416 365313 10204 512418
12212 512418 175315 79401 -140346 123954 191014 322045 162186 68251 31636 159318
12202 159318 188416 196450 39284 204748 68217 249397 576967 241417 107945 306741
12192 306741 190787 -39838 73890 69744 113267 78611 267077 127837 148799 -14241 97991
$$ packed form
12268C64258h3871A29044l9067L1552d1325J3100j78134d4323J9156A53835b2844
12256a3880B04571f150j93092H8338a68993k8714B53421c1837C82997j54853o4593
12245A63551K7986b08224G3721b91045F8765d7703p2185C19159c85738A01714
12234C3729L35046A1597Q981K19631C5295L58310M6889j30173R777c291E31484
12222E82150A72404K02553q6229j31203J02002J74592g8416C65313A0204N02214
12212E12418A75315G9401a40346A23954O7060J31031j59859F8251C1636J27682
12202A59318K9098Q034C9284J65464F8217J81180L27570B41417A07945J98796
12192C06741j15954c9838G3890m146M3523l4656J88466A27837K0962a4241I7991
$$ plain form
12180 183573 106906 -160810 -77893 -141697 245528 498284 257807 158899 287897 143780
12169 -32608 92863 -38394 382841 -100700 123112 457895 269106 297440 199980 30113 88751
12158 88751 206268 181273 153473 -80883 101508 -279271 92363 -203832 185332 151282 -160709
12146 97565 138564 276610 262057 209957 47804 351200 171741 280853 -335391 7323 -17299
12134 -94562 -272234 -19544 -133574 256477 192289 108971 -36067 -334123 -209360 -31595 28876
12122 -41321 -1162 217023 75658 323286 287758 94849 -130809 149624 -247735 235366 -91971
12110 131059 330572 178311 -48830 80011 -78100 -31288 201656 -248752 248181 188959
12100 188959 214182 99313 -128461 -54696 -34064 -104454 42118 216623 -190807 -200700 -40132
$$ packed form
12180A83573p6667a60810g7893o3804B45528K52756k40477r8908J28998A43780
12169c2608I2863c8394C82841a00700A23112L34783j88789K8334r7460C0113N8638
12158H8751J17517k4995k7800h0883A01508b79271I2363b03832A85332l4050a60709
12146I7565M0999J38046j4553n2100D7804L03396A71741J09112c35391G323a7299
12134i4562j77672a9544j14030B56477o4188q3318c6067k98056J24763c1595B8876
12122d1321a162B17023G5658K47628l5528I4849a30809A49624b47735B35366i1971
12110A31059J99513j52261d8830H0011g8100c1288B01656b48752B48181n9222
12100A88959K5223I9313a28461e4696K0632p0390D2118J74505a90807r893d0132
$$ plain form
12088 13367 21681 387869 303389 -221227 -181016 196352 215348 -51232 171393 152232 -147203
12076 -54107 -70328 -187402 -36054 125568 336889 461997 1150538 1775963 675359 104165
12065 483432 -266482 -183065 129249 75193 242105 141583 89750 55080 136910 25998 -24398
12053 36443 -231481 11774 -158303 -125349 -305869 -112325 81168 -339199 102455 276095
12043 276095 -177682 6364 -58135 -143792 17157 112217 -319937 -42325 -405866 -144425 42172
12031 -290842 -69718 235879 37270 -10568 -45301 252625 -21807 71857 117378 269421 -216597
12019 -67784 431735 64320 -137608 -169155 33901 -140481 -77007 -71798 94084 -248572 -127822
12008 -127822 42737 -79259 103264 131963 -96157 15744 65999 -85349 -85581 -243559 45102
$$ packed form
12088A3367Q314L66188q4480b21227M0211A96352J8996e1232A71393j9161a47203
12076e4107j6221j17074c6054A25568K11321J25108O88541O25425F75359A04165
12065D83432b66482Q3417A29249n4056J66912j00522n1833l4670Q1830B5998b4398
12053C6443b31481A1774a58303L2954j80520a12325H1168c39199A02455J73640
12043B76095a77682F364e8135q5657A7157R5060c19937d2325l63541a44425D2172
12031b90842f9718B35879C7270a0568l4733B52625b1807G1857M5521J52043b16597
12019f7784D31735F4320a37608l1547C3901a40481O3474N209I4084b48572J20750
12008a27822D2737g9259A03264K8699i6157A5744N0255h5349k32j57978D5102
$$ plain form
11996 3494 51183 356939 -185428 21076 154237 93632 89680 -101322 -8283 272171 2830
11984 -8874 379083 -118789 -309182 213018 25994 4157 15655 213078 -136346 -213335 30345
11972 162362 -299445 98884 -306255 -13201 -53746 -186468 -115855 113651 17559 23950 -135555
11960 -213754 -49607 73751 -104926 -101975 181582 65718 148198 -373714 -411955 -157293 140508
11948 243507 -28076 -50487 -742 51297 34004 -107667 101615 401993 65719 301281 -125197
11936 -164747 204817 -70284 30719 -280066 -121069 -44408 -101293 -88444 178254 -72832 -520853
11925 -520853 94736 50088 188341 122932 -130863 226481 136104 -69681 -269602 -154043
11915 -154043 355906 -29247 75765 -251154 93965 193023 342404 -144871 -473558 -38641
$$ packed form
11996C494M7689L05756a85428B1076J33161o0605l952a01322h283B72171B830
11984h874C79083a18789j90393B13018B5994D157J1498J97423a36346p6989C0345
11972A62362b99445I8884c06255a3201m0545j32722P0613A13651A7559O391a35555
11960b13754d9607G3751a04926K951A81582F5718Q2480c73714l8241a57293A40508
11948B43507b8076k2411g42E1297j7293a07667A01615L00378F5719K35562a25197
11936a64747B04817g0284C0719b80066a21069d4408n6885J2849A78254g2832m48021
11925e20853I4736m4648J38253o5409a30863B26481r0377f9681j99921J15559
11915a54043C55906b9247G5765b51154I3965R9058J49381a44871l28687c8641
$$ plain form
11904 54421 62439 186883 119803 -189170 -86346 179022 13580 17428 -224851 -104721 -14366
11892 16972 162303 177995 211459 -318569 10623 -325819 76661 68623 434843 66179 -43445
11880 -147030 -79762 88643 -6325 -106359 -161736 -68519 -80729 -62528 208615 316594 -347805
11868 186746 -417003 222531 35676 -224414 104049 -184157 -81991 -91528 451370 37872
11857 -214848 69901 9558 -66218 31243 18955 -147852 -5781 -177390 16342 -106496 -130316
11846 -130316 -88878 -177975 -439159 -103131 -195608 194866 -127538 -336446 -11614 38420
11835 -47918 -276050 -28864 -88611 -531436 -167376 73588 -8929 -45400 -150168 -135093 -351599
11824 -351599 -158885 294653 -156327 -249845 -109900 -314830 -102000 122940 -225869 330157
$$ packed form
11904E4421Q018J24444o7080a89170h6346A79022A3580L848b24851a04721a4366
11892A6972J45331J5692L3464c18569A0623c25819G6661q038L66220F6179d3445
11880a47030O7268H8643f325j00034n5377f8519j2210J8201B08615J07979c47805
11868A86746d17003B22531C5676b24414A04049a84157h1991r537D51370C7872
11857b14848F9901I558f6218C1243j2288a47852e781j71609A6342a06496k3820
11846a30316M1438q9097k61184a03131r2477A94866a27538k08908a1614C8420
11835d7918k28132b8864n9747m42825a67376G3588h929l6471j04768J5075k16506
11824c51599a58885B94653a56327r3518a09900k04930a02000A22940b25869C30157
$$ plain form
11813 -81119 16328 -302476 -341147 94212 154773 -5549 47536 166743 60864 -235115 -156177
11802 -156177 -182688 -64976 58076 -296277 277719 -72935 -16664 62152 73703 -29108 -55871
11791 -55871 75392 167844 52339 -167593 65409 203240 -26869 317160 -167326 68293 -389866
11779 229594 31683 -73563 -163814 94714 216707 234732 -140344 164150 170081 -169580 -11914
11767 -22491 133955 27075 125434 139850 -89099 -394607 -37613 98034 125461 121343 298202
11756 298202 -180569 -117167 164028 -14190 -52733 -350309 -55032 92793 -112983 61637 -90776
11744 33074 40072 233304 -83250 -16931 250726 -154754 133560 -138427 -99463 139761 25809
11732 141227 -177935 -38131 -30894 58146 -239154 -121985 -179756 396207 213093 -131494
$$ packed form
11813h1119A6328c02476l8671I4212O0561e549D7536J19207F0864b35115P8938
11802a56177k6511f4976E8076b96277B77719g2935a6664F2152J1551b9108k6763
11791e5871G5392R2452E2339a67593F5409J37831b6869C17160a67326F8293c89866
11779B29594C1683g3563r0251I4714J21993J8025a40344A64150N931a69580a1914
11767b2491A33955B7075R8359J4416h9099l05508c7613I8034K7427m118J76859
11756B98202a80569O3402A64028a4190l8543k97576e5032I2793a12983F1637i0776
11744C3074O998J93232h3250a6931B50726a54754A33560a38427L8964A39761B5809
11732A41227a77935c8131P237E8146b39154J17169n7771C96207j83114a31494
$$ plain form
11721 212905 11490 -182312 -25295 -27923 -33469 -237035 -87583 23866 320115 21932 -18395
11709 74565 -310377 26567 -124061 -4526 -23932 -65517 179931 -111032 53137 186836 -22788
11697 204611 -53230 15755 287654 -250181 218636 7481 46966 133511 -43915 248730 -52344
11685 -78384 18396 188952 599868 252038 155582 35884 44031 -207845 160567 -208985 80848
11673 81744 388014 259527 454282 145609 -141354 274380 290212 -103565 193266 36017
11662 31539 219446 270535 -8257 -77087 146296 118123 -47330 40758 8398 181423 346522
11651 346522 59284 -39779 49575 110597 154618 -26107 -171813 266378 225846 83862 -130864
11639 16063 -274716 277124 -154688 92654 -156923 -41132 213563 -54676 196038 -216722
$$ packed form
11721B12905A1490a82312b5295k628n546k03566h7583B3866K96249B1932a8395
11709G4565c10377B6567a24061d526j9406m1585A79931a11032E3137J33699b2788
11697B04611e3230A5755K71899b50181B18636G481L9485Q6545d3915B48730e2344
11685g8384A8396J70556M10916B52038r6456C5884Q147b07845A60567b08985H0848
11673H1744L06270j28487J94755A45609a41354B74380J5832a03565A93266C6017
11662C1539J87907N1089h257o8830A46296k8173d7330D0758H398J73025J65099
11651C46522E9284c9779D9575O1022M4021b6107j45706B66378m0532H3862a30864
11639A6063b74716B77124a54688I2654a56923d1132B13563e4676A96038b16722
$$ plain form
11628 -35467 50597 -2169 -41889 31589 242685 -173207 160298 70091 288695 33854 17979
11617 17979 509768 -168263 -55819 -23062 -178744 40627 76801 -107162 14012 -84559 -222333
11606 -222333 -271500 -151475 -4237 130737 242186 146981 -314457 46390 159763 128832 394258
11595 394258 236181 236362 147923 5381 -101379 -89273 110172 151121 155583 108236 -88780 -63339
11583 -63339 212394 542697 86737 -134505 176033 108300 86309 -158200 -82081 8184 118726
11572 118726 122537 111040 261206 248538 -237627 249899 126290 254126 221844 -13018 -37426
11561 -37426 117127 -96852 95296 83635 34566 -40293 43314 -227732 -154284 -141806 -219012
11550 -219012 449526 429455 -100650 345825 63242 50961 285585 265434 212836 -72215 4710
$$ packed form
11628c5467E0597b169l9720C1589K11096a73207A60298G0091K18604C3854j5875
11617A7979M91789a68263e5819b3062j55682D0627L6174a07162A4012h4559j37774
11606b22333m9167J20025d237A30737J11449r5205c14457D6390J13373l0931K65426
11595C94258j58077J81q8439E381a01379J2106A10172M0949M462m7347h8780K5441
11583f3339B12394L30303H6737a34505A76033o7733k1991a58200P6119H184J10542
11572A18726L811j1497J50166j2668b37627B49899j23609J27836l2282a3018k4408
11561c7426A17127i6852I5296j1661C4566d0293D3314b27732P3448J2478p7206
11550b19012D49526k0071a00650C45825F3242j2281K34624k0151n2598g2215D710
$$ plain form
11538 283342 77176 41881 -401889 -274047 -32025 -63649 -182499 289369 362631 -35771 330409
11526 -123069 -29279 -95953 64028 521216 81698 122452 -169345 123430 -232743 168002
11515 337171 130345 -53586 255390 286011 152611 -72350 296222 127413 247466 392770
11505 392770 235440 220254 109873 3676 83280 102124 -68751 428851 -31536 112990 106625
11494 106625 -26571 -163026 54065 121587 -222523 142850 -86237 251893 224196 -13500 -230130
11483 -230130 100531 7739 314021 50675 374721 -119484 208772 171569 206970 228207 138087
11472 138087 381580 227431 680242 162367 116522 -15622 291192 175407 295987 155294
11462 155294 313530 160555 458841 564663 43378 -73422 -40480 453603 -38666 199726
$$ packed form
11538B83342G7176l5295d01889J27842c2025l1624j18850B89369P3262c5771C30409
11526a23069b9279o6674F4028M57188H1698M0754a69345A23430b32743A68002
11515C37171A30345e3586B55390L0621j33400g2350B96222A27413J20053J45304
11505C92770j57330j5186A09873C676P9604J8844f8751D28851c1536A12990o365
11494A06625b6571j36455E4065O7522b22523A42850h6237B51893k7697a3500k16630
11483b30130A00531G739L06282E0675L24046a19484B08772l7203L5401K1237r0120
11472A38087K43493j54149M52811A62367m5845a5622B91192j15785J20580j40693
11462A55294J58236j52975K98286J05822D3378g3422L2942D53603c8666A99726
$$ plain form
11451 -202590 21075 -246179 414276 87226 -126504 -142833 110381 -39299 21347 -94267 121042
11439 -58444 356854 35337 41312 -61104 118628 -28156 92060 -95839 184736 -28611 -384291
11428 -384291 -69353 -419084 -145349 -81997 -73865 212546 -93521 -175870 140277 216316 175115
11417 175115 -270781 -93596 -63836 83587 154909 -244162 176152 -200134 -93900 102138
11406 -53890 169704 -17286 -77131 -121505 -204232 117559 -162670 -34128 -30082 -55924 -77725
11395 -77725 -58243 -60893 -99734 422628 -89107 118728 129574 -145905 -177302 118129 103484
11384 103484 -209263 -19731 324018 76051 -8607 175192 180162 133062 349686 168960 -221041
11372 193331 366463 -292098 34151 -105189 -57992 14324 167798 54291 60757 -154822 -87559
$$ packed form
11451b02590B1075b46179D14276H7226a26504j6329A10381c9299B1347i4267A21042
11439e8444C56854C5337N975f1104A18628b8156I2060i5839A84736b8611l55680
11428c84291f9353l49731a45349O3352Q132B12546i3521q2349A40277P6039m1201
11417A75115b70781i3596K9760H3587P1322b44162A76152b00134i3900A02138
11406e3890A69704a7286n9845m4374q2727A17559a62670c4128M046k5842k1801
11395g7725J9482k650l8841D22628h9107A18728J0846a45905l1397A18129j4645
11384A03484b09263a9731C24018G6051h607A75192M970m7100K16624A68960b21041
11372A93331J73132b92098C4151a05189M7197A4324J53474E4291O466a54822O7263
$$ plain form
11361 -87559 -196323 -230170 222570 -56602 -168251 216373 -52950 -12728 -9264 27879 -306006
11349 -93205 -274730 170827 173787 450178 -435037 -373631 -89577 93696 -17128 -296417 73080
11337 78961 177706 117506 93639 59921 -60317 -114486 226609 55914 154286 -17557 -24591 47724
11324 -256307 119599 -27536 203374 -51748 176185 185832 285642 -233651 126949 -218418
11313 -481680 -21010 -142485 -240651 4635 -126547 32909 21719 -138728 174447 -214277 -32356
11301 344554 -67258 -28400 248992 10351 68855 160475 -83436 -109028 198151 -237486 -28759
11289 -109843 75943 -50035 -231285 -181835 -107014 13499 -136649 -167466 15204 32205 -165109
11277 -119220 -32898 -12425 165057 172009 11302 136979 72435 96835 -229301 138868 180495
$$ packed form
11361h7559j08764l3847B22570e6602j11649B16373e2950a2728L464B7879c06006
11349i3205j81525A70827K960K76391d35037O1406h9577I3696a7128k79289G3080
11337G8961R8745o0200k3867l3718f0317n4169B26609E5914R8372a7557p034D7724
11324b56307A19599b7536B03374e1748A76185R647R9810b33651A26949b18418
11313d81680b1010j21475r8166D635a26547C2909j1190a38728A74447b14277c2356
11301C44554f7258b8400B48992A0351N8504R1620h3436k5592A98151b37486b8759
11289a09843G5943e0035j81250M9450P4821A3499a36649l0817A5204J7001a65109
11277a19220c2898a2425A65057O952A1302J25677o4544K4400b29301A38868M1627
$$ plain form
11266 180495 62480 202516 -213488 -216789 -38359 -22518 96440 -96715 -9600 -261602 162427
11254 26280 -181820 -34427 -84728 -63315 96710 -140633 -49231 98442 274018 -4665 -117070
11243 -117070 263718 -402547 -97737 106744 212519 59218 -156495 -4280 -122397 -329607
11233 -329607 -12954 -156986 308621 -294278 -283250 119023 -182302 70591 -150996 149681
11222 -108739 -63241 -208486 87337 -599016 390649 -201118 -195336 -289955 -187601 36902 -331214
11210 -7482 122013 -440625 72282 130141 4930 -138827 129346 -178431 213550 -244579 -22420
11198 -47101 10638 164660 -86975 -219303 -224703 -225496 -107455 75617 179132 -52577 312240
11186 -4372 123478 -46385 3138 30090 -288719 129578 9507 -254346 151491 260286 -146448
$$ packed form
11266A80495F2480J40036b13488l301c8359J5841I6440i6715i600k52002A62427
11254B6280a81820c4427n0301K1413I6710a40633d9231I8442J75576d665j12405
11243a17070B63718d02547i7737A06744J05775E9218a56495d280j18117k07210
11233c29607a2954j44032C08621b94278J1028A19023a82302G0591a50996A49681
11222a08739M5498j45245H7337e99016C90649b01118N782r4619J02354C6902c31214
11210g482A22013d40625G2282N7859D930a38827A29346a78431B13550b44579b2420
11198d7101A0638J54022h6975j32328n400p93a07455G5617J03515e2577C12240
11186d372A23478d6385C138K6952b88719A29578I507b54346A51491J08795a46448
$$ plain form
11174 -233866 267875 -173628 -300208 102048 121429 -134717 -61211 -99783 -353838 111949
11163 72138 -63551 -207393 13186 -65284 -205932 -227158 -23629 -121856 64363 29568 323690
11152 323690 -20599 -163392 -195578 -329803 -63942 -84302 -72609 164299 -138523 -51632 55449
11140 21732 -56889 199964 11354 -30755 173253 -6287 -178941 189024 200449 -95833 -93426
11129 -93426 358021 224526 104852 216797 -250865 -32514 -83207 -167955 -127633 -253807
11119 -253807 45209 -22872 278445 -10027 -201483 421265 201221 123254 67607 95720 63609
11108 63609 142542 373601 412147 495183 -92214 26554 122196 33974 55743 -5400 142027
11096 127950 117383 268237 304335 -35834 -155726 -30828 6472 495232 -279030 371535 -105827
$$ packed form
11174b33866B67875a73628j26580A02048J9381a34717f1211l8572k54055A11949
11163G2138f3551j43842A3186f5284j40648k1226b3629r8227F4363B9568K94122
11152C23690b0599j42793l2186j34225f3942k0360J1693A64299a38523e1632E5449
11140B1732e6889A99964A1354c0755A73253f287j72654A89024J1425i5833K407
11129i3426C58021j33495A04852J11945b50865c2514n0693q4748M0322j26174
11119b53807D5209b2872B78445a0027j91456D21265B01221p7967n5647K8113l2111
11108F3609P8933K31059L8546Q3036i2214B6554R5642C3974K1769e400A42027
11096A27950j0567J50854L6098c5834j19892c0828F472M88760b79030C71535a05827
$$ plain form
11084 228037 380441 125488 493667 393113 522118 55708 180300 233473 -51483 -77666
11074 -77666 266229 284869 -5265 245401 569894 417052 428264 211605 643737 437750
11064 437750 527899 396741 476310 579330 570118 917703 532643 513029 121533 606904
11054 606904 889842 838707 680295 605463 710570 931438 467097 802410 672739 770476
11044 770476 1041137 849979 372260 1004265 975062 701141 719770 681734 779018 422839
11034 422839 518122 698081 785240 813873 585902 779982 754169 583481 747687 839296
11024 839296 721101 842018 845744 634349 658169 523076 704229 930929 385916 773731
11014 773731 611803 1118469 471110 517597 952686 797120 717303 531123 429389 424966
$$ packed form
11084B28037J52404A25488L68179j00554J29005E5708J24592N3173e1483k6183
11074g7666B66229J8640e265B45401L24493j52842J1212B11605M32132k05987
11064D37750R0149j31158P9569J03020r212L47585l85060j9614A21533M85371
11054F06904K82938n1135j58412p4832J05107K20868m64341L35313j29671R7737
11044G70476K70661j91158C72260O32005k9203k73921J8629l8036R7284l56179
11034D22839R5283J79959Q7159K8633k27971J94080k5813j70688J64206R1609
11024H39296j18195J20917L726k11395K3820j35093J81153K26700C85916L87815
11014G73731j61928N06666D71110M6487M35089j55566p9817j86180j01734m423
$$ plain form
11004 424966 463863 440757 778139 525946 411004 634643 601782 662985 651907 534502
10994 534502 940342 781098 900284 609755 478169 729563 884680 825202 1125335 979963
10984 979963 1185563 1272902 1375297 1142863 1084949 1173291 1682396 1554437 1958537 2348256
10974 2348256 2422981 2749782 2823859 2965424 3107064 2755527 3015876 2258846 2264984 2051878
10964 2051878 2033229 1847253 1558480 1750816 1737985 1732474 1855188 1954658 1985479 1376619
10954 1376619 1284050 1387803 1332217 876443 1180366 414315 1018268 238605 579970 305209
10944 305209 574246 145332 438767 344341 364128 69545 49273 178008 225437 44406 316924
10933 316924 218980 295210 -107341 191809 145234 8561 176713 64335 259438 -48145 -35722
$$ packed form
11004D24966L8897k3106L37382k52193j14942K23639l2861O1203j1078j17405
10994E34502M05840j59244J19186k90529j31586K51394J55117n9478L00133j45372
10984I79963K05600Q7339J02395k32434n7914Q8342N09105j27959M04100L89719
10974B348256P4725L26801P4077J41565J41640l51537K60349p57030O138k13106
10964B051878j8649j85976k88773J92336j2831n511J22714R9470L0821o08860
10954A376619r2569J03753n5586m55774L03923D14315O03953B38605L41365k74761
10944C05209K69037A45332K93435r4426J9787F9545k0272J28735M7429D4406K72518
10933C16924r7944P6230a07341A91809m6575H561J68152F4335J95103d8145J2423
$$ plain form
10922 -35722 187829 -66033 -11215 333415 77446 -5676 119385 196324 117061 66686 111124
10911 111124 -43836 -207559 17777 -63867 -169733 121112 -32238 30126 60245 97377 11332
10899 32565 166240 -320576 88246 -210219 243781 -200199 -261322 182553 133238 -61634
10888 -7893 -132435 -146248 193455 -193742 28017 -32022 -47464 161629 85480 -70839 216795
10876 -97137 -75460 -96095 -209497 -46789 -45569 -87954 1694 -35191 203067 38369 81655 171364
10864 171364 73813 28231 206137 -162071 -139378 -38103 47608 214498 -38907 357986 -192685
10852 187181 -110387 -46956 58925 -42438 -177761 232013 -27338 127311 112150 -143705
10841 -57797 -109254 98706 47595 247374 -12014 -141379 191736 -163024 -2780 -52025 280762
$$ packed form
10922c5722A87829f6033a1215C33415G7446e676A19385P6939p9263n0375M4438
10911A11124d3836j63723A7777f3867j05866A21112c2238C0126L0119L7132A1332
10899C2565J33675c20576H8246b10219B43781b00199o1123A82553m9315f1634
10888g893j24542j3813A93455a93742B8017c2022j5442A61629p6149g0839B16795
10876i7137K1677k0635j13402d6789J220m2385A694c5191B03067C8369M3286Q9709
10864A71364G3813B8231J77906a62071K2693c8103D7608J66890c8907C57986a92685
10852A87181a10387d6956E8925d2438j35323B32013b7338A27311j5161a43705
10841e7797n1457I8706D7595J99779a2014j29365A91736a63024b780m9245B80762
$$ plain form
10829 588298 99325 -54938 -187468 -340172 89632 -281069 -193018 -173763 -132369 -14767 -101503
10818 -101503 45586 213500 -464181 -285724 -56168 -246411 -106160 -112292 -366221 -100387
10807 -149480 -136403 263096 -263347 -95166 216597 -145126 130133 -102302 46524 -121102
10796 283803 -340286 170426 -83583 275155 -296951 -100790 -372188 -132446 6290 -153461
10785 -193377 72595 -353302 91400 -37319 209255 -14845 234396 -126149 -39651 -515607
10775 -515607 153463 -132077 14859 -192003 228111 365197 -111287 -43106 -152430 272194
10764 659365 -231851 -6299 -257742 -17835 -102843 78552 -42883 7246 -8509 138916 -50514
10752 -48051 -181782 179898 60691 -353260 -190886 -355149 176531 129100 -360632 89238
$$ packed form
10829E88298I9325e4938j32530j52704H9632b81069Q8051J9255M1394a4767q6736
10818a01503D5586J67914d64181J78457e6168j90243a06160o132k53929a00387
10807a49480J3077B63096b63347i5166B16597a45126A30133a02302D6524a21102
10796B83803c40286A70426h3583B75155b96951a00790k71398a32446F290a53461
10785a93377G2595c53302I1400c7319B09255a4845B34396a26149c9651m75956
10775e15607A53463a32077A4859a92003B28111J37086a11287d3106j09324B72194
10764F59365b31851f299k51443a7835q5008G8552d2883G246h509A38916e0514
10752d8051j33731A79898F0691c53260J62374j64263A76531m7431c60632H9238
$$ plain form
10741 88603 152128 -106971 198582 15491 -34928 237907 -304132 -31092 -90354 47218 -72970
10729 419735 -364949 161080 198801 -160914 -289237 130550 97134 -316947 -32521 -161907
10719 -161907 -196832 52409 -33310 92615 -60019 134165 -115859 57660 88713 -112288 30399
10707 73437 -102411 -314080 73933 41625 -226998 -152425 -381268 -84941 82368 -93185 -265725
10696 -265725 149003 290288 -53509 83828 131814 83973 -151644 163293 48276 -10313 162655
10684 133146 8156 73981 2352 -104218 -84697 -191446 -155434 -293661 -29325 -166444 -78897
10672 -161616 90514 -124973 265807 -265659 380684 -109903 90158 64174 -173851 -85538
10661 253 -124235 -208695 97070 -152500 109109 -140778 -144113 -458053 -8724 199432 73203
$$ packed form
10741H8603O3525a06971A98582A5491c4928B37907c04132c1092n9262D7218g2970
10729D19735c64949A61080L7721a60914j28323A30550l3416c16947c2521j29386
10719a61907l4925E2409c3310I2615f0019A34165a15859E7660L1053a12288C0399
10707G3437a02411k11669G3933l2308b26998P4573k28843h4941H2368i3185j72540
10696b65725A49003J41285e3509H3828M7986m7841a51644A63293D8276a0313A62655
10684A33146H156O5825B352a04218J9521j06749L6012j38227b9325j37119g8897
10672a61616I0514a24973B65807b65659C80684a09903I0158k5984a73851h5538
10661B53a24235q4460I7070a52500A09109a40778l335l13940h724A99432G3203
$$ plain form
10649 145925 -80554 -343849 148731 -14269 -140160 -102194 88025 5731 -258037 -2342 -38964
10638 -38964 153003 -178438 -189599 -197966 -242486 -50344 -55552 -20454 26673 -66443 53329 -254996
10625 34728 -5714 74374 71964 -65505 127153 -134737 66150 -119020 210866 -62519 -311004
10614 -311004 -206637 -150063 -34209 130757 53367 -184696 34181 174960 -279466 -127401
10603 -259928 63037 78365 -252933 -81400 -134118 80405 143349 -117660 4515 30782 247608
10592 247608 104285 -438403 238906 93618 -256067 -195336 172816 244284 -449990 -283789
10582 -283789 -3555 -334677 65005 80412 -167513 155384 -208901 -156045 94517 -241041 -27758
10570 -60017 64791 -284206 -122743 251967 -77308 54158 68532 -153249 -140773 72894 -127081
$$ packed form
10649A45925h0554k63295A48731a4269j25891L7966H8025E731b58037b342l6622
10638c8964A53003a78438j1161q367m4520e0344n208b0454B6673f6443E3329b54996
10625C4728e714G4374k410f5505A27153a34737F6150a19020B10866f2519k48485
10614c11004J04367N6574c4209A30757E3367a84696C4181J40779b79466a27401
10603b59928F3037J5328b52933h1400n2718H0405O2944a17660D515K6267K16826
10592B47608A04285d38403B38906I3618b56067O0731A72816P1468d49990J66201
10582b83789c555l31122F5005J5407a67513A55384b08901N2856I4517b41041b7758
10570f0017F4791b84206a22743B51967g7308E4158J4374a53249J2476G2894a27081
$$ plain form
10558 91215 90264 383495 -169354 217229 112647 110856 -136872 185492 -264613 -85320 -5063
10546 280833 -150753 -4449 83237 -67239 76023 127932 -68046 463707 -182277 -402743 -215083
10535 -215083 123722 -7249 -115413 -156316 140155 -103283 -113347 -210128 -101548 226666
10524 -138894 -129184 169521 80879 324569 -260007 -108501 236276 207419 86920 -13699 47951
10512 -127585 -102753 -127534 -19084 -130942 -105838 -528932 59318 22291 199227 235810 -254022
10500 -39388 -149422 4036 9018 -201957 121300 -157200 25120 -367700 40352 -122167 -82569
10489 -82569 -40341 20570 250630 -110674 -179749 140814 -12551 510926 665511 354795
10479 354795 429437 174690 47893 31810 208361 170392 32407 -244268 73995 58120 87405
$$ packed form
10558I1215r51K93231a69354B17229j04582j791a36872A85492b64613h5320e063
10546B80833a50753d449H3237f7239G6023N1909f8046D63707a82277k20466J87660
10535b15083A23722g249j08164m0903A40155a03283j0064r6781a01548B26666
10524a38894R710A69521H0879K43690b60007a08501B36276k8857H6920a3699D7951
10512a27585K4832k4781a9084j11858K5104m23094E9318B2291J76936L6583b54022
10500c9388j10034D036M982b01957A21300a57200B5120c67700D0352a22167L9598
10489h2569d0341B0570K30060a10674o9075A40814a2551E10926J54585l10716
10479C54795P4642A74690D7893j6083J76551l7969C2407b44268G3995j5875K9285
$$ plain form
10468 87405 24880 87894 320318 200678 -206894 145090 -223103 -156993 -75653 -299453
10458 -299453 76235 122999 -284395 -87011 -208557 -165427 -8316 -146494 -33578 129216 -209069
10446 132337 -315806 230490 278085 -218132 136250 -182468 155199 -101766 121537 41978
10435 -110584 -79105 -44365 -3330 -85164 156081 -25737 -110317 236104 -153546 124481 -480777
10423 -99671 80340 -110833 -187847 -58980 112531 -10651 236297 -145260 -291703 146447
10412 -135757 -33823 -110403 35611 54892 9636 7736 -138513 9638 258089 146380 -36970
10400 274415 165955 -144372 18276 -4796 -192284 235963 4623 445047 87857 287845 -295436
10388 -48794 434444 117593 201864 44282 -21747 -70192 91003 55032 -112955 195161 350707
$$ packed form
10468H7405B4880O3014K32424j19640b06894A45090b23103O6110g5653k23800
10458b99453G6235M6764b84395h7011j21546M3130h316j38178c3578A29216b09069
10446A32337c15806B30490M7595b18132A36250a82468A55199a01766A21537D1978
10435a10584L1479L4740c330q1834A56081b5737q4580B36104a53546A24481d80777
10423i9671H0340a10833p7014e8980A12531a0651B36297a45260j46443A46447
10412a35757c3823p6580C5611J9281I636j900a38513I638K48451j11709c6970
10400B74415j08460a44372A8276d796j87488B35963D623M40424H7857J99988b95436
10388d8794D34444A17593Q4271D4282b1747m8445I1003l5971a12955A95161J55546
$$ plain form
10377 350707 284983 334320 384889 222854 2200 111976 453 437388 31667 355711 482938
10366 482938 689083 405528 273816 207815 188387 488578 160586 -33989 479297 93013
10355 306416 231999 332084 499778 462251 221602 736776 370036 444516 24779 -116363
10344 253721 917771 495278 148119 174091 463882 83031 487252 387719 593939 280075
10333 -279143 -102927 -7119 118054 41978 109712 118426 51074 -65400 24051 -12 252355 216595
10321 216595 188147 119496 277183 -53687 280576 246948 264759 265531 180699 234309 -157687
10309 16662 -77399 -294682 202902 36939 -73410 300768 12000 -142613 -76629 -406116 -15514
10297 -61883 223496 -185310 -296091 50584 -63812 -174925 -173378 -75226 -42618 -57114 349067
$$ packed form
10377C50707o5724M9337N0569j62035B200J09776D53M36935C1667L24044J27227
10366D82938K06145k83555j31712o6001j9428L00191A60586c3989D79297I3013
10355C06416p4417J00085J67694l7527B21602N15174l66740P4480B4779a16363
10344B53721O64050m22493A48119K5972K89791H3031M04221r9533K06220B80075
10333b79143a02927g119A18054D1978O7734Q714E1074f5400B4051a2B52355l5760
10321B16595k8448o8651J57687e3687B80576l3628J7811P72q4832N3610a57687
10309A6662g7399k17283B02902C6939g3410C00768A2000a42613O5984l29487a5514
10297f1883B23496a85310j10781E0584f3812j11113J547g5226L2608j4496C49067
$$ plain form
10285 47272 262174 -131839 -28153 88759 -203043 -30514 183007 -89664 -56294 -356067 -138993
10273 -51219 -47725 91091 -177177 -101868 115392 173037 -175803 -55446 94639 64929 -43915
10261 403280 445376 285685 352761 662307 676926 271186 181959 -46719 82921 -147691 9520
10249 35568 -345477 62908 -176075 -143009 -28232 94623 71505 -294138 -42433 -170157 -182599
10238 -182599 -231978 -66474 -62855 9413 -209750 31116 56496 -60658 -30900 67673 -13148 -470966
10226 -470966 111160 286428 56160 -192729 37239 24489 -282346 -164181 -115819 415703
10215 -147211 111614 326872 -127986 125144 -143536 -363974 -41290 -4000 143505 -137243
10204 47392 -62814 34734 -192263 -16966 325209 -120042 -3644 97798 -294958 -221066 -80139
$$ packed form
10285D7272K14902a31839b8153H8759b03043c0514A83007h9664L3370k99773a38993
10273e1219L494I1091a77177P5309A15392N7645a75803e5446I4639k9710d3915
10261D03280M2096j59691O7076L09546J4619B71186q9227d6719H2921a47691I520
10249C5568c45477F2908a76075L3066b8232I4623k3118b94138d2433j27724j2442
10238a82599m9379f6474L619I413b09750C1116K5380f0658K9758F7673a3148m57818
10226d70966A11160J75268E6160a92729C7239j2750b82346J18165M8362D15703
10215a47211A11614K15258a27986A25144a43536k20438d1290d000A43505a37243
10204D7392f2814C4734a92263a6966C25209a20042c644I7798b94958P3892h0139
$$ plain form
10192 -54686 170295 -181713 -203861 125231 -102756 -91097 -345588 123413 179974 454501
10182 454501 -273363 180036 -37519 -3674 174223 -71420 -145094 -338866 -144066 -127630 -33610
10170 240677 -112077 -33717 -4755 16429 -131243 61690 47692 -249382 -25154 -224251 -15824
10158 -306570 -154570 41444 -32570 -25482 -394623 -131141 136226 -9717 -211553 -120500 188140
10146 -71974 -287709 177476 61290 -170003 -2550 -470780 178535 -145650 27075 180196
10136 180196 46594 129257 19745 -89000 -240637 -172786 -218300 -142224 -267868 -216685 -216340
10125 -216340 -109573 -44737 -2914 150655 148756 24657 -145287 -150593 28104 -305630 -82544
10113 -40977 -9485 256156 -150933 -215583 -340551 -120418 -277573 -63554 -37885 -42982 -214385
$$ packed form
10192e4686A70295a81713k2148A25231a02756J1659k54491A23413N6561K74527
10182D54501b73363A80036c7519c674A74223g1420p3674j93772a44066J6436c3610
10170B40677a12077c3717d755A6429a31243F1690j3998b49382b5154j99097a5824
10158c06570J52000D1444c2570P088l69141a31141A36226i717k01836R1053A88140
10146g1974k15735A77476F1290a70003b550m68230A78535a45650B7075J53121
10136A80196D6594Q2663A9745h9000j51637O7851m5514P6076j25644N1183L45
10125b16340J06767d4737b914A50655j899B4657a45287n306B8104c05630h2544
10113d0977i485B56156a50933o4650j24968a20418j57155f3554K5669n097j71403
$$ plain form
10102 -214385 -6350 201153 133186 -178007 243304 -1657 121396 -183524 39207 66945 -380019
10090 144599 21412 -105925 -253945 -158244 -189022 -5592 -387583 -241630 111688 85878 67533
10079 67533 228290 -62094 -110938 -131373 76885 10194 -243852 -138592 -349443 40607 -377029
10067 186914 -158500 67487 126375 -89081 -25474 445885 204800 281336 -181440 108705
10056 -21873 -84213 -148549 -241002 -156858 -186497 -276266 -97801 -140647 21111 -129458 275514
10044 -141913 -110058 -196286 -155602 -293885 173251 -153058 -114142 115093 -145238 -141049 -78062
10033 -78062 -3967 -223503 156064 293592 -477986 -3464 -19751 -339388 -21234 168231 49571
10021 -43688 -113281 -20519 -171789 62895 -155234 -253377 28056 -337670 -40046 -141248 -92707
$$ packed form
10102b14385f350B01153o7967a78007B43304a657A21396a83524C9207K7738c80019
10090A44599B1412a05925j48020R5701l0778e592l81991J45953A11688k5810j8345
10079F7533J60757f2094m8844k0435G6885A0194b43852J05260k10851D0607c77029
10067A86914a58500F7487N8888h9081b5474D45885B04800P6536a81440A08705
10056b1873o2340o4336r2453Q4144k9639q9769i7801m2846B1111a29458B75514
10044a41913L1855q6228M0684j38283A73251a53058L8916A15093a45238M189O2987
10033g8062c967k19536A56064J37528d77986c464j6287l19637b1234A68231D9571
10021d3688o9593b0519j51270F2895a55234r8143B8056c37670d0046j01202M8541
$$ plain form
10010 -92707 -153919 -219582 -171279 -146831 -94436 -27122 -152260 136954 126742 133329 -66328
9998 -117901 47247 -97947 -145837 -6853 -51228 40918 7275 -83663 -376040 -204661 -326135
9987 -326135 -17458 110187 3256 -11365 -260004 162375 -257761 -126436 181105 -85156 -65576
9976 -65576 -391734 -42398 -223935 131118 111986 -19842 187035 -253556 -118684 46021 -184336
9964 -113640 196064 -182359 205120 99381 -226637 -402483 -15149 -22139 -223113 171212
9953 3309 153325 183721 -254680 265521 -52802 251306 -30724 -104407 -27753 40482 -146667
9941 233487 -393669 -116929 -178093 -441239 -218890 -57544 20833 -129076 -61111 127030
9930 -311995 -131715 -98544 -202445 -161715 34806 200945 56210 160309 -243576 -377561
$$ packed form
10010i2707o1212o5663M8303K4448N2395b7122j25138A36954j0212O587f6328
9998a17901D7247i7947m7890f853m4375D0918G275h3663k92377J71379j21474
9987c26135a7458A10187C256a1365k48639A62375b57761a26436A81105h5156J9580
9976f5576l26158d2398j81537A31118j9132a9842A87035b53556a18684D6021a84336
9964a13640A96064a82359B05120I9381b26637j75846a5149o990k00974A71212
9953C309J50016L0396b54680B65521e2802B51306c0724p3683b7753D0482a46667
9941B33487c93669a16929o1164k63146b18890e7544B0833a29076f1111A27030
9930c11995a31715L3171j03901M0730C4806J66139E6210J04099b43576j33985
$$ plain form
9920 -377561 -243224 -164732 -61693 -273424 -332318 -220955 20798 -153057 7061 -158811 80663
9908 -196318 390942 -109552 -36330 -520643 -244524 -41946 -108320 -9081 -52722 -52529 -110945
9897 -110945 24607 109868 91084 -175627 -272469 46805 -163264 203191 -200412 -386334 418691
9885 284951 -299523 -62979 156755 -119337 -260614 -72603 56168 38925 3726 56145 -14520
9873 19094 224572 -298929 -159309 85084 22718 -18573 -257327 -50624 -79548 131201 -436952
9861 -195572 -57444 -128248 -350404 -24139 122451 2144 -116452 -14248 5682 -177598 105596
9849 -48086 95984 188499 -284182 170687 -196694 -178298 -10487 34793 -155177 -35493 -313329
9838 -313329 149491 -256960 -44222 33012 85518 70572 -199297 -222177 -25659 -333895 -305792
$$ packed form
9920c77561J34337P8492f1693k11731n8894J11363B0798a53057G061a58811H0663
9908a96318C90942a09552c6330m84313b44524d1946o6374i081m3641J93n8416
9897a10945B4607Q5261j8784a75627r6842D6805a63264B03191b00412j85922D18691
9885B84951b99523f2979A56755a19337j41277g2603E6168j7243C726N2419a4520
9873A9094K05478b98929J39620H5084B2718a8573k38754e0624k8924A31201d36952
9861a95572e7444p0804k22156b4139A22451B144a16452a4248E682a77598A05596
9849d8086I5984R2515b84182A70687a96694J8396a0487C4793a55177c5493k77836
9838c13329A49491b56960d4222C3012N2506j4946a99297k2880b5659l08236K8103
$$ plain form
9827 -305792 -149914 -224426 -258411 -184385 -283596 -36791 48263 -315004 14156 -212970 252648
9815 -259417 312974 -91852 -36420 -22881 -144362 121480 -38488 -15185 31977 280428 -200686
9803 398845 -157561 -131269 -235723 -258036 -305477 114497 -212152 169316 -169485 -51391
9792 93545 -210678 -94242 72610 -130287 -227932 -184211 -279922 102698 -238630 -120323 -3825
9780 -109660 62872 -100067 78263 19064 -39154 68325 -345678 -5939 -110582 -264775 -316334
9769 -316334 -282651 -107636 -135855 -10073 136783 -118767 94370 43727 -107252 -181090 -105344
9758 -105344 299186 -44277 -76269 98068 -333867 170116 -119292 -19579 19452 -58881 34478
9746 493147 270315 -375655 -299753 99775 10472 -158824 162434 -83943 257764 33426 -287065
$$ packed form
9827c05792a49914p4512l3985P4026r9211c6791D8263c15004A4156b12970B52648
9815b59417C12974i1852c6420J3539j21481A21480c8488a5185C1977K48451b00686
9803C98845a57561K6292j04454k2313m7441A14497b12152A69316a69485e1391
9792I3545b10678i4242G2610a30287r7645M3721r5711A02698b38630J18307c825
9780a09660F2872a00067G8263A9064c9154F8325c45678e939j04643j54193n1559
9769c16334L3683a07636k8219a0073A36783a18767I4370D3727a07252p3838P5746
9758a05344B99186d4277l1992I8068c33867A70116a19292a9579A9452e8881C4478
9746D93147k22832c75655P5902I9775A0472a58824A62434h3943B57764C3426b87065
$$ plain form
9734 169386 69499 30098 -125781 12277 -335690 -81162 -49013 89939 -167782 20488 -10916
9722 -301833 116674 105490 136600 217378 39257 -140120 -206460 171747 -16241 -175765 196963
9710 -286788 -8648 216639 -232773 -10471 -34301 -220522 -61400 -18661 -203627 123943 -186806
9698 39426 149582 -196061 343745 -297313 -126585 -306519 -51458 34453 88374 -66227 -48495
9687 -48495 -101674 110762 93310 -163760 -158600 -339460 -212371 -456450 -49331 265311 -122667
9675 -230051 -53960 -137578 -197078 -313313 179100 -11310 -118719 -63393 -190285 -111013 -215826
9664 -215826 106071 62060 -137499 -247371 86858 -133406 -206577 -386794 -291007 -524271
9654 -524271 -276071 -220813 100190 -423468 11448 101528 239858 -238653 -117522 70575
$$ packed form
9734A69386F9499C0098a25781A2277c35690h1162L2149H9939a67782B0488a0916
9722c01833A16674j1184L1110Q0778C9257a40120o6340A71747a6241j59524A96963
9710b86788h648B16639b32773a0471k3830j86221f1400a8661j84966A23943a86806
9698C9426J10156a96061C43745b97313a26585j79934e1458C4453N3921f6227J7732
9687d8495n3179A10762j7452a63760N160j80860J27089k44079d9331B65311a22667
9675b30051e3960q3618n9500j16235A79100a1310j07409N5326j26892P9272j04813
9664b15826A06071m4011a37499j09872H6858a33406p3171j80217R5787k33264
9654e24271K48200N5258A00190d23468A1448R0080J38330b38653a17522G0575
$$ plain form
9643 -73858 -100724 -188880 118682 -218703 194222 34610 -153389 85594 27243 -193102 -40050
9631 61977 -107784 -378035 90365 63709 -158966 44420 380065 39284 -102298 -210941 -207319
9620 -207319 -96805 69879 27018 31090 -134208 -183457 14725 -145061 -88004 -99940 -76405
9609 -76405 29426 -156890 -240154 54638 70020 -345140 -167889 -431202 -110477 352943 483807
9598 483807 -272401 152920 124666 3259 -2947 -275120 -219767 -40475 -552298 83754 -180154
9586 -32805 -109900 -104453 -125494 -182680 -44714 63684 -261199 203315 24775 -109794 67981
9574 -93578 -268563 -233509 -13498 -119647 -291534 182292 -286177 -154761 -58768 64487 -4118
9562 97782 -184777 -189548 -125590 360825 -303333 101686 365621 99833 13982 154948 -253290
$$ packed form
9643g3858k6866q8156A18682b18703A94222C4610a53389H5594B7243a93102d0050
9631F1977a07784k70251I0365k6656a58966D4420L35645C9284a02298j08643L622
9620b07319i6805F9879B7018M072a34208m9249A4725a45061N7057j1936K3535
9609g6405B9426a56890q3264E4638J5382c45140a67889k63313a10477C52943J30864
9598D83807b72401A52920k8254C259b947k72173N5353d0475n11823H3754a80154
9586c2805p7095N447k1041n7186d4714F3684b61199B03315B4775a09794F7981
9574i3578j74985L5054a3498j06149j71887A82292b86177J31416e8768F4487d118
9562I7782a84777m771O3958C60825c03333A01686K63935I9833A3982J40966b53290
$$ plain form
9550 -109923 82880 -131220 111181 -62243 137647 -24267 -2389 -33918 -42206 597 46114 -26601
9537 -312872 -191072 -231141 113519 12805 -103733 -78769 -804 -138143 -109273 -320753 -108888
9525 -31454 145391 11109 -29368 -275924 -18694 -347923 -211521 -179662 140209 -150156 -33036
9513 23265 -308059 295901 -108139 143318 184827 4714 -297373 175696 71811 148454 -366271
9501 81733 -165569 -371439 178437 -263541 169391 78069 -259870 248375 -147224 -104074
9491 -104074 79581 -182316 -61261 -91390 94178 -67346 -278994 -176425 214974 42518 208181
9480 208181 -159533 15672 411295 205943 -71136 -96036 -31989 -321910 -44643 -94293 93232
9468 -12007 -377999 -48674 -102128 -169329 -211225 -193935 -154943 -259248 150659 252191 -137448
$$ packed form
9550a09923H2880a31220A11181f2243A37647b4267b389l1529q288E97M5517b6601
9537c12872J21800m0069A13519A2805a03733K4964h04j37339K8870k11480a08888
9525c1454A45391A1109b9368k46556a8694l29229J36402L1859A40209a50156c3036
9513B3265c08059B95901a08139A43318M1509D714b97373A75696G1811P6643c66271
9501H1733a65569k05870A78437b63541A69391G8069b59870B48375a47224M3150
9491a04074G9581a82316f1261l0129I4178f7346k11648J02569B14974D2518J65663
9480B08181a59533A5672L95623k05352g1136k4900c1989k89921d4643m9650I3232
9468a2007l65992d8674n3454o7201m1896J7290L8992j04305A50659J01532a37448
$$ plain form
9456 65216 -166974 146774 -148894 -292964 -107757 -1977 -65587 -132906 -22045 69118 -127984
9444 -281708 138409 -295989 -123431 19026 -270419 134440 142312 21180 -180635 53300 -16350
9432 164291 91794 -275109 -128561 121469 -36732 -15627 -276375 105306 41331 211694
9422 211694 135055 -10228 -229271 -304238 -6074 -179179 -95717 97649 -42161 -260872 96453
9410 135464 -304529 67219 -442058 -112443 -164491 -163750 -77539 -9933 -136544 -21286 131512
9398 331716 330967 -37958 -175710 106246 202495 -33235 -74773 -19973 38092 -78252 -425152
9387 -425152 -47173 37298 -365644 -278010 -87403 -182186 -230192 289862 -103746 -151297 61960
9375 -41055 -12149 -187809 -471415 -136889 110087 -37660 185674 17354 162506 130829 -362734
$$ packed form
9456F5216a66974A46774a48894j44070a07757a977o3610o7319b2045F9118a27984
9444b81708A38409b95989a23431A9026b70419A34440P872B1180a80635E3300a6350
9432A64291p2497b75109a28561A21469c6732a5627k60748A05306D1331J70363
9422B11694p6639a0228k19043p4967f074j73105Q3462I7649d2161k18711I6453
9410A35464c04529F7219d42058a12443n2048P41g7539i933j26611b1286A31512
9398C31716p49c7958j37752A06246R6249c3235m1538a9973C8092g8252l46900
9387d25152d7173C7298c65644Q7634h7403r4783m8006B89862a03746m7551F1960
9375d1055a2149j75660k83606a36889A10087c7660A85674A7354J45152l1677c62734
$$ plain form
9363 -68057 -222837 40893 162631 -128959 33165 -332415 -296738 -95109 -223564 62388 310430
9352 310430 -102146 -64783 -103867 -151310 54573 -26739 31822 -110758 -187193 -86364 111787
9340 145100 33215 -107861 -151938 -185037 -59129 -107866 -203337 112886 -67392 -82072 -92978
9329 -92978 195087 -281619 -231671 36437 131815 -125867 17211 -158656 -105279 12486 38937
9318 38937 -67969 131165 39474 -10710 -91811 229046 -324562 248753 -125929 -222493 22945
9306 -24150 -245627 101324 -75138 -122510 251167 -203709 -32042 118314 -60868 -165005 -376549
9295 -376549 -15721 -37845 -63962 -110876 -240850 -30496 -54592 31176 -352541 33161 -204914
9283 190601 8705 44715 284642 -256901 -255466 94621 -275668 -27015 -131489 42801 -145983
$$ packed form
9363f8057j54780D0893J21738a28959C3165c32415L5677i5109j28455F2388K48042
9352C10430a02146L7363l9084m7443E4573b6739C1822a10758p6435h6364A11787
9340A45100C3215a07861m4077l3099e9129m8737r5471A12886f7392j4680j0906
9329i2978A95087b81619M9948C6437R5378a25867A7211a58656N3377A2486K6451
9318C8937f7969A31165C9474a0710q1101B29046c24562B48753a25929r6564B2945
9306b4150k21477A01324g5138m7372B51167b03709c2042A18314f0868j04137k11544
9295c76549a5721k2124k6117m6914j29974c0496k4096C1176c52541C3161b04914
9283A90601H705L6010K39927b56901J435I4621b75668b7015j04474D2801a45983
$$ plain form
9271 -87934 86583 -270360 -128179 27915 -938 -27780 -21893 -82669 100999 -324180 -350758 -117105
9258 257536 59117 -142017 -67754 21306 -318349 186263 31927 -216311 -109145 -163725 -238697
9247 -238697 39042 -85172 -35931 -51370 9932 -155155 -146563 -20066 -7592 -271532 107452 1488
9234 -80223 -117662 -105650 7157 16781 14756 78366 -117605 -71448 -22908 54679 -39972 143103
9221 -51956 -113777 142448 -304352 -68412 74072 -106655 -3890 -131789 47901 -22333 -217333
9210 -217333 -81238 -47616 -241566 -153943 -285385 86382 -166611 -102585 92789 -206791 -39466
9198 -93222 -278058 -213537 25933 106839 151814 -225060 -218587 156937 184342 389679 -625535
9186 2460 -385020 -39013 -196509 -108915 36942 -89907 -2112 19403 -380320 -120979 -135590
$$ packed form
9271h7934H6583b70360a28179B7915i38k6842N887o0776A00999c24180k6578a17105
9258B57536E9117a42017f7754B1306c18349A86263C1927b16311J07166n4580p4972
9247b38697C9042h5172c5931j5439I932a55155Q592b0066g592k63940A07452A488
9234h0223l7439J2012G157R624k025O3610a17605M6157b2908E4679c9972A43103
9221e1956o1821A42448c04352f8412G4072a06655c890j27899D7901b2333j95000
9210b17333h1238L3622j93950Q7623j31442H6382a66611O4026I2789b06791c9466
9198i3222j84836O4521B5933Q0906M4975b25060O473A56937K7405K05337f25535
9186B460c85020c9013j57496Q7594C6942h9907b112A9403c80320a20979j4611
$$ plain form
9175 -135590 -14240 -80141 -80336 181376 28748 -1281 -136202 -147904 61955 -84043 -106565 10497
9162 430431 11101 -313506 34251 39972 -133618 -296820 -143135 100291 311613 153662
9151 156469 -135986 17279 -179553 -283165 -31015 110619 219020 26623 -92032 124587
9140 141326 96518 -5994 6697 -281109 -74270 13480 130140 -231545 -157005 88733 -256875
9128 -20809 -54365 -53104 7896 -111377 18888 -337594 7658 -329998 -216089 475 229090 -174596
9115 -38623 -21257 -82420 60804 58932 -42595 429432 239970 255922 -338951 -93327 -40663
9103 70907 -228350 -435159 -48490 -3797 -429918 -229378 -349923 -312671 -157779 -70500 -233204
9092 -233204 -147261 54598 122797 -170570 -91399 -26134 -368597 -271660 -60756 76978 -488849
$$ packed form
9175a35590a4240o5901j95A81376B8748a281j34921j1702F1955h4043k2522A0497
9162D30431A1101c13506C4251N721a33618j63202a43135A00291K11322A53662
9151A56469a35986A7279a79553j03612c1015A10619J08401B6623i2032A24587
9140A41326m4808e994F697b81109g4270A3480J16660b31545P4540H8733b56875
9128b0809l3556J261G896a11377A8888c37594G658c29998J13909D75K28615a74596
9115c8623J7366o1163F0804j872d2595D29432j89462J5952c38951i3327d0663
9103G0907b28350k06809d8490c797m26121K00540j20545L7252J54892g0500j62704
9092b33204Q5943E4598O8199a70570P9171b6134l42463R6937f0756G6978d88849
$$ plain form
9080 153133 132082 -228759 -74306 -12531 15725 58409 -25606 -39405 -201067 -222650 -83438
9068 13255 319345 -120591 110749 -66829 -275253 267598 143587 6072 -172589 60482 1422
9056 52669 -115334 3201 29206 -45922 133066 220956 -206210 -237410 -394454 -104812 -186102
9045 -186102 101557 -88436 -47565 -261258 259442 -131784 -169423 202344 102581 -45866 2529
9033 153393 -183326 125040 -81521 150620 -307356 -266235 184030 -35442 56649 110754 9370
9021 -147914 -113478 -49847 125348 87736 56311 -20003 117997 69089 306945 -75281 -59958
9010 -59958 -108321 -433243 23798 -53001 99538 2335 276252 2395 23821 192008 14639 15444
8998 15444 -15244 195191 169202 240701 13838 63271 278165 78572 27266 155076 130207
$$ packed form
9080A53133k1051b28759g4306a2531A5725M2684b5606j3799j61662k1583h3438
9068A3255L06090a20591A10749f6829k08424B67598j24011F072a72589F0482A422
9056E2669a15334C201K6005d5922A33066Q7890b06210l1200j57044a04812q1290
9045a86102A01557h8436M0871k13693B59442a31784l7639B02344r9763d5866B529
9033A53393a83326A25040h1521A50620c07356M1121A84030c5442E6649N4105I370
9021a47914L4436d9847A25348l7612l1425b0003A17997m8908K37856g5281J5323
9010e9958m8363l24922B3798e3001I9538B335K73917B395K1426J68187A4639Q05
8998A5444a5244A95191k5989P1499A3838M9433K14894G8572B7266J27810k4869
$$ plain form
8987 130207 62091 -115122 -480458 156740 -88239 34801 -57313 -212943 -74506 -284938 9959
8975 -212159 174469 -281979 -384582 -113076 -72729 189934 99469 86232 87650 -157211 27091
8963 90798 2258 -242656 -38799 76925 -117728 228603 90354 10784 78447 -218711 -14058
8951 -35233 50888 -89871 -24002 -193415 54975 56512 -193452 -165493 263795 -159115 105788
8939 -146938 184719 71218 -195852 84633 534130 -95142 114102 105767 39498 258058 66069
8927 205046 -65054 448656 612558 890886 3446560 12510511 6177901 1182843 345241
8917 307499 294317 -128041 -93806 -170122 -201798 -252496 148023 -127762 129635 262044 -161959
8905 7751 -175414 -23071 -256918 15506 -186312 -330923 -14885 -288190 26364 -178545 -511285
$$ packed form
8987A30207F2091a15122l65336A56740h8239C4801e7313j55630g4506k10432I959
8975b12159A74469b81979j02603a13076M0347A89934r0465j3237J418a57211B7091
8963I0798B258b42656c8799G6925a17728B28603I0354A0784O7663b18711a4058
8951c5233E0888h9871b4002j69413E4975J537a93452K7959B63795a59115A05788
8939a46938A84719G1218a95852H4633M49497i5142A14102q335C9498K18560F6069
8927B05046f5054D48656J63902K78328K555674R063951F177901A182843C45241
8917C07499j3182a28041L4235p6316l1676n0698A48023a27762A29635J32409a61959
8905G751a75414b3071k33847A5506a86312j44611a4885k73305B6364a78545l32740
$$ plain form
8894 -511285 -73978 -33026 -43350 -40005 45189 -79312 -125032 80003 -267064 -175648 -231449 -181163
8882 -181163 -80905 84729 -54153 34163 54516 -27427 110869 -191332 279680 57637 -130445
8870 -9755 -16651 -173366 -284733 -573156 -158214 5179 -307058 35696 -156157 -192737 14225
8858 -248038 -189950 -116447 -76912 195212 68260 14936 -252116 -134657 -107485 -381213 26764
$$ packed form
8894e11285g3978c3026j0324L345D5189g9312m5720H0003b67064R1416n5801N0286
8882a81163h0905H4729e4153C4163K0353b7427A10869a91332B79680E7637a30445
8870i755o896j56715j11367k88423a58214E179c07058C5696a56157l6580A4225
8858b48038N8088P3503L9535A95212F8260A4936b52116J17459K7172k73728B6764
$$ [...]
##END NTUPLES=NMR SPECTRUM
##END=
