
##TITLE=AC1309_BRAAS11121_6524898_aVjRR3K3v8
##JCAMPDX= 6.0         $$ Bruker NMR JCAMP-DX V2.0
##DATA TYPE= NMR SPECTRUM
##DATA CLASS= NTUPLES
##ORIGIN= BRUKER
##OWNER= Administrator
$$ 1.72 TOPSPIN		Version 2.1
$$ 2012-07-15 00:53:31.078 -0500  Administrator@TOPSPIN
$$ Compression mode = diff/dup
##.OBSERVE FREQUENCY= 400.02188249412
##.OBSERVE NUCLEUS= ^1H
##.ACQUISITION MODE= SIMULTANEOUS (DQD)
##.ACQUISITION SCHEME= undefined
##.AVERAGES= 64
##.DIGITISER RES= 22
##SPECTROMETER/DATA SYSTEM= spect
##.PULSE SEQUENCE= noesygpps1d.comp
##.SOLVENT NAME= COFFEE_meoh
##.SHIFT REFERENCE= INTERNAL, COFFEE_meoh, 1, 14.96068
##AUDIT TRAIL= $$ (NUMBER, WHEN, WHO, WHERE, PROCESS, VERSION, WHAT)
$$ ##TITLE= Audit trail, TOPSPIN		Version 2.1
$$ ##JCAMPDX= 5.01
$$ ##ORIGIN= Bruker BioSpin GmbH
$$ ##OWNER= Administrator
$$ $$ C:\Bruker\TOPSPIN/data/COFFEE/nmr/AC1309_BRAAS11121_6524898_aVjRR3K3v8/12/pdata/1/auditp.txt
$$ ##AUDIT TRAIL=  $$ (NUMBER, WHEN, WHO, WHERE, PROCESS, VERSION, WHAT)
(   1,<2012-07-15 00:53:26.468 -0500>,<Administrator>,<TOPSPIN>,<go>,<TOPSPIN 2.1>,
      <created by zg
	started at 2012-07-15 00:41:56.140 -0500,
	POWCHK enabled, PULCHK disabled,
       configuration hash MD5:
       6B 1B 68 BB D9 2E 58 E2 7F 35 AD 54 07 DF 0E 41
       data hash MD5: 64K
       33 C7 59 E2 6A 88 D3 E8 52 D4 3D F4 B2 14 77 DB>)
(   2,<2012-07-15 00:53:29.218 -0500>,<Administrator>,<TOPSPIN>,<proc1d>,<TOPSPIN 2.1>,
      <Start of raw data processing
       efp LB = 0.3 FT_mod = 6 PKNL = 1 PHC0 = 0 PHC1 = 0 SI = 128K 
       data hash MD5: 128K
       98 5B 8C 58 72 07 C5 94 5E 14 BE A9 B0 C4 BD 35>)
(   3,<2012-07-15 00:53:30.343 -0500>,<Administrator>,<TOPSPIN>,<proc1d>,<TOPSPIN 2.1>,
      <pk PHC0 = -4.224243 PHC1 = 0 
       data hash MD5: 128K
       C3 88 7E 65 A4 53 CB B7 62 2E 7A CA 00 5D 30 C4>)
(   4,<2012-07-15 00:53:30.578 -0500>,<Administrator>,<TOPSPIN>,<proc1d>,<TOPSPIN 2.1>,
      <abs ABSG = 1 
       data hash MD5: 128K
       8A 7C 24 E3 45 A5 AD AC DE ED F5 5E 62 BD 3E D1>)
(   5,<2012-07-15 00:53:30.656 -0500>,<Administrator>,<TOPSPIN>,<proc1d>,<TOPSPIN 2.1>,
      <abs ABSG = 2 
       data hash MD5: 128K
       20 E8 03 13 63 11 00 40 10 3B 5D 5A 45 91 18 DB>)
(   6,<2012-07-15 00:53:30.718 -0500>,<Administrator>,<TOPSPIN>,<proc1d>,<TOPSPIN 2.1>,
      <abs ABSG = 3 
       data hash MD5: 128K
       7C 33 55 6E 2E 30 CA 7C 0C CE 00 C0 50 26 64 AC>)
(   7,<2012-07-15 00:53:30.859 -0500>,<Administrator>,<TOPSPIN>,<proc1d>,<TOPSPIN 2.1>,
      <abs ABSG = 4 
       data hash MD5: 128K
       35 D4 B8 EB BC 6C 87 55 30 90 97 FC 7D EB 23 DF>)
(   8,<2012-07-15 00:53:31.000 -0500>,<Administrator>,<TOPSPIN>,<proc1d>,<TOPSPIN 2.1>,
      <abs ABSG = 5 
       data hash MD5: 128K
       90 C6 62 12 39 61 CD 0F 4F A9 D8 C5 7E F6 86 E8>)
$$ ##END=
$$ 
$$ $$ hash MD5
$$ $$ D3 CB 86 C8 39 07 43 46 C4 2F 09 E6 99 98 BD E9
##$RELAX= 
##$RELAX= 
##$RELAX= 
##$RELAX= 
##$RELAX= 
##$RELAX= 
##$RELAX= 
##$RELAX= 
$$ Bruker specific parameters
$$ [...]
##$TP07= 0
##$TPNAME0= <>
##$TPNAME1= <>
##$TPNAME2= <>
##$TPNAME3= <>
##$TPNAME4= <>
##$TPNAME5= <>
##$TPNAME6= <>
##$TPNAME7= <>
##$TPOAL= (0..7)
0.5 0.5 0.5 0.5 0.5 0.5 0.5 0.5
##$TPOFFS= (0..7)
0 0 0 0 0 0 0 0
##$TUNHIN= 0
##$TUNHOUT= 0
##$TUNXOUT= 0
##$USERA1= <user>
##$USERA2= <user>
##$USERA3= <user>
##$USERA4= <user>
##$USERA5= <user>
##$V9= 5
##$VALIST= <valist>
##$VCLIST= <CCCCCCCCCCCCCCC>
##$VD= 0
##$VDLIST= <DDDDDDDDDDDDDDD>
##$VPLIST= <PPPPPPPPPPPPPPP>
##$VTLIST= <TTTTTTTTTTTTTTT>
##$WBST= 2048
##$WBSW= 25
##$XGAIN= (0..3)
0 0 0 0
##$XL= 0
##$YL= 0
##$YMAX_a= 10861076
##$YMIN_a= -9109096
##$ZGOPTNS= <>
##$ZL1= 120
##$ZL2= 120
##$ZL3= 120
##$ZL4= 120
##$ABSF1= 14.96068
##$ABSF2= -5.597502
##$ABSG= 5
##$ABSL= 3
##$ALPHA= 0
##$AQORDER= 0
##$ASSFAC= 0
##$ASSFACI= 0
##$ASSFACX= 0
##$ASSWID= 0
##$AUNMP= <proc_prof1d_extract.lims>
##$AXLEFT= 0
##$AXNAME= <>
##$AXNUC= <1H>
##$AXRIGHT= 0
##$AXTYPE= 0
##$AXUNIT= <>
##$AZFE= 0.1
##$AZFW= 0.1
##$BCFW= 0
##$BC_mod= 0
##$BYTORDP= 0
##$COROFFS= 0
##$CY= 15
##$DATMOD= 1
##$DC= 0
##$DFILT= <>
##$DTYPP= 0
##$F1P= 0
##$F2P= 0
##$FCOR= 0.5
##$FTSIZE= 131072
##$FT_mod= 6
##$GAMMA= 0
##$GB= 0
##$INTBC= 1
##$INTSCL= 1
##$ISEN= 128
##$LB= 0.3
##$LEV0= 0
##$LPBIN= 0
##$MAXI= 10000
##$MC2= 0
##$MEAN= 0
##$ME_mod= 0
##$MI= 0
##$NCOEF= 0
##$NC_proc= -2
##$NLEV= 6
##$NOISF1= 0
##$NOISF2= 0
##$NSP= 0
##$NTH_PI= 0
##$NZP= 0
##$OFFSET= 14.96068
##$PC= 1
##$PHC0= -4.224243
##$PHC1= 0
##$PH_mod= 1
##$PKNL= yes
##$PPARMOD= 0
##$PPDIAG= 0
##$PPIPTYP= 0
##$PPMPNUM= 2147483647
##$PPRESOL= 1
##$PSCAL= 4
##$PSIGN= 0
##$PYNMP= <proc.py>
##$REVERSE= no
##$SF= 400.020009763198
##$SI= 131072
##$SIGF1= 0
##$SIGF2= 0
##$SINO= 400
##$SIOLD= 131072
##$SPECTYP= <>
##$SREGLST= <1H.CDCl3>
##$SSB= 0
##$STSI= 131072
##$STSR= 0
##$SW_p= 8223.68421052631
##$SYMM= 0
##$S_DEV= 0
##$TDeff= 65536
##$TDoff= 0
##$TI= <>
##$TILT= no
##$TM1= 0
##$TM2= 0
##$TOPLEV= 0
##$USERP1= <user>
##$USERP2= <user>
##$USERP3= <user>
##$USERP4= <user>
##$USERP5= <user>
##$WDW= 1
##$XDIM= 131072
##$YMAX_p= 427147493
##$YMIN_p= -11355
##$CURPLOT= <Network HP LaserJet P1505>
##$CURPRIN= <$Network HP LaserJet P1505>
##$DFORMAT= <normdp>
##$LAYOUT= <+/1D_H.xwp>
##$LFORMAT= <normlp>
##$PFORMAT= <normpl>
##$SURQMSG= 1
$$ End of Bruker specific parameters
$$ ---------------------------------
##NTUPLES= NMR SPECTRUM
##VAR_NAME=  FREQUENCY,     SPECTRUM/REAL,   SPECTRUM/IMAG
##SYMBOL=    X,             R,               I
##VAR_TYPE=  INDEPENDENT,   DEPENDENT,       DEPENDENT
##VAR_FORM=  AFFN,          ASDF,            ASDF
##VAR_DIM=   131072,        131072,          131072
##UNITS=     HZ,            ARBITRARY UNITS, ARBITRARY UNITS
##FACTOR=    0.0627417313425164, 1,          1
##FIRST=     8223.62146879497, -1046,        -57944
##LAST=      0,             436,             -58530
##MIN=       0,             -11355,          0
##MAX=       8223.62146879497, 427147493,    0
$$ Real data points
##PAGE= N=1
##DATA TABLE= (X++(R..R)), XYDATA
$$ [...]
63912C250257k54984k42692k27849k11470j94200j76094j57423j39183j22375
63903A523987j07250r3629q1567p1151o2084n3977m6770m0365l4224k7972k2182
63892H82816j7909j5581j4844j5250j6430j7734j8513j8794j9031j9079j8129
63881F91522j5806j2740r748o998m253j456J320M174P282J0676J4200J7535K0158
63868G15866K1749K2712K3873K5447K6722K6922K6082K4790K3443K2051K0426
63857I80083J8282J5468J2250R054N767J856k557o423r086j1321j4286j7927k1213
63844I59947k3663k5621k7161k7840k7831k8266k9838l1705l2484l1903l0854
63833F42781l0040k9220k7855k5946k4024k2475k1139j9579j7741j6098j5054
$$ y = [3250257, 2995273, 2752581, 2524732, 2313262, 2119062, 1942968, 1785545, 1646362, 1523987, 1416737, 1323108, 1241541, 1170390, 1108306, 1054329, 1007559, 967194, 932970, 904998, 882816, 864907, 849326, 834482, 819232, 802802, 785068, 766555, 747761, 728730, 709651, 691522, 675716, 662976, 653228, 646230, 641977, 640521, 641841, 646015, 653297, 663973, 678173, 695708, 715866, 737615, 760327, 784200, 809647, 836369, 863291, 889373, 914163, 937606, 959657, 980083, 998365, 1013833, 1026083, 1035137, 1040904, 1042760, 1040203, 1033780, 1024694, 1013373, 999087, 981160, 959947, 936284, 910663, 883502, 855662, 827831, 799565, 769727, 738022, 705538, 673635, 642781, 612741, 583521, 555666, 529720, 505696, 483221, 462082, 442503, 424762, 408664, 393610]
63822C93610j4344j3411j2206j1166j0387r423q101p026o751o930o767o054n175
63809B75869m315l377k582k473l013l254k318m97J014J319N32o16j497j870j761
63794B51161j381j126j460k470l603m026l433k383j752j910k532l027k987k341
63780B16730j352m90j15j82l42l17j15J45L93N64N02N4o92j329j409q97l39l18
63762B10491q01j164r66m05J11M74P57Q53O66L90K39O0l91r37j200j165j028o19
63744B05365L24J367J615R92N41J060K042K577K663K925L386L421K846K269K167
63729B35560K272K185K094K449L230L952M340M598M941N263N380N433N657N845
63715B93199N394M123K691J851J433N95r70k569l444l647l654l504k925k073j591
$$ y = [393610, 379266, 365855, 353649, 342483, 332096, 322673, 314572, 307546, 300795, 293865, 287098, 281044, 275869, 271554, 268177, 265595, 263122, 260109, 256855, 254537, 254040, 255054, 256373, 256905, 256289, 254792, 252922, 251161, 249780, 248654, 247194, 244724, 241121, 237095, 233662, 231279, 229527, 227617, 225085, 222058, 219071, 216730, 215378, 214888, 214773, 214591, 214249, 213932, 213817, 213962, 214355, 214919, 215421, 215475, 214783, 213454, 212045, 211148, 210809, 210491, 209690, 208526, 207560, 207155, 207266, 207740, 208497, 209350, 210016, 210406, 210645, 210705, 210314, 209377, 208177, 207012, 205984, 205365, 205689, 207056, 208671, 209663, 210204, 211264, 213306, 215883, 218546, 221471, 224857, 228278, 231124, 233393, 235560, 237832, 240017, 242111, 244560, 247790, 251742, 256082, 260680, 265621, 270884, 276264, 281697, 287354, 293199, 298593, 302716, 305407, 307258, 308691, 309286, 308316, 305747, 302303, 298656, 295002, 291498, 288573, 286500, 284909]
63700B84909j779k169k074j353m26L26R33J612K259K417J894J282J479K662M010
63685B95982M643M424L632K313N11j149j756j146j36L37M4o53j322j639j370m26
63669C02289J009K550L718M133L752K951K150J425N90m18j503k641l784m616m782
63654C06823m430m157m314m668m817m566l858k732j578r57r33r09m60J05L26L26
63638B69201N20Q95J194J583K448L593M345M527M712N252N701N562N132N083N562
63623C25310O186O686P106P496P931Q745J0241J2160J3880J5173J6403J7833J9334
63610D74484K0800K2441K4366K6386K8507L1132L4328L7276L8987L9202L8020
63599H15929L4986K9382K1427J2496M019l247q841j2249j3333j2672j1189r770
$$ y = [284909, 283130, 280961, 278887, 277534, 277108, 277434, 278367, 279979, 282238, 284655, 286549, 287831, 289310, 291972, 295982, 300625, 305049, 308681, 310994, 311505, 310356, 308600, 307454, 307318, 307655, 307699, 307046, 305724, 304085, 302715, 302289, 303298, 305848, 309566, 313699, 317451, 320402, 322552, 323977, 324567, 324149, 322646, 320005, 316221, 311605, 306823, 302393, 298236, 293922, 289254, 284437, 279871, 276013, 273281, 271703, 270746, 269813, 268904, 268444, 268549, 268875, 269201, 269721, 270616, 271810, 273393, 275841, 279434, 283779, 288306, 293018, 298270, 303971, 309533, 314665, 319748, 325310, 331496, 338182, 345288, 352784, 360715, 369460, 379701, 391861, 405741, 420914, 437317, 455150, 474484, 495284, 517725, 542091, 568477, 596984, 628116, 662444, 699720, 738707, 777909, 815929, 850915, 880297, 901724, 914220, 918239, 914992, 906151, 893902, 880569, 867897, 856708, 846938]
63587H46938r270j0281j2616j5540j8696k2273k5969k8613k9418k8917k7971k6423
63575E90951k3624j9902j6481j3986j1967r932p984o254m465k477o07Q93K199
63562D76364L494M653N600O573P722Q812R532R833R772R539R789J1417J4544J8131
63548F05775K1095K3557K6500L0423L4970L9811M5168N0857N5050N4654M7565
63537A035425L4718J9680O043m687j2664j7950j9976j8637j5092j1161q355p545
63525I79799q924j1948j5767k0092k5208l0943l6141l9623m1157m1118l9712l7139
63513F32027l4118l1385k8849k5916k2622j9726j7672j6047j4256j2236j0317
63502C98883q756p607o752n903m854l802l211l271l654l790l239j935l93N29M65
$$ y = [846938, 837668, 827387, 814771, 799231, 780535, 758262, 732293, 703680, 674262, 645345, 617374, 590951, 567327, 547425, 530944, 516958, 504991, 495059, 487075, 480821, 476356, 473879, 473272, 474165, 476364, 479858, 484511, 490111, 496684, 504406, 513218, 522750, 532583, 542355, 551894, 561683, 573100, 587644, 605775, 626870, 650427, 676927, 707350, 742320, 782131, 827299, 878156, 933206, 987860, 1035425, 1070143, 1089823, 1095866, 1091179, 1078515, 1060565, 1040589, 1021952, 1006860, 995699, 987344, 979799, 970875, 958927, 943160, 923068, 897860, 866917, 830776, 791153, 749996, 708878, 669166, 632027, 597909, 566524, 537675, 511759, 489137, 469411, 451739, 435692, 421436, 409200, 398883, 390127, 382520, 375768, 369865, 365011, 361209, 357998, 354727, 351073, 347283, 344044, 342109, 341716, 342245, 342710]
63487C42710N6J25M78K34o19q82K87K145L339L538L463L643L929M116M250M166
63471C74978L423J942L01r67j965l053m160m894n203n444n775n812n131l884k737
63456C31619k184k124k085j733j017JJ230K387L015K880K317K042K602M010N819
63441C48779P398Q292Q508Q599R193J0471J2274J4598J7747K1871K6722L1848
63429E26300L6509L9220L8097L2554K4389J6548J0729O784M295L684N445R087
63417G53641J3616J8549K3920K9589L5193M0517M5208M8215M8135M4261L6957
63406A137801K7181J6145N341l816j0615j5038j7121j6916j5188j3516j3280j4818
63394A066160j7754k1730k6479l1490l6059l9573m1590m1830m0370l7733l4571
$$ y = [342710, 342766, 342891, 343369, 343603, 342984, 342102, 342389, 344534, 347873, 351411, 354874, 358517, 362446, 366562, 370812, 374978, 378401, 380343, 380644, 379677, 377712, 374659, 370499, 365605, 360402, 354958, 349183, 343371, 338240, 334356, 331619, 329435, 327311, 325226, 323493, 322476, 322477, 323707, 326094, 329109, 331989, 334306, 336348, 338950, 342960, 348779, 356177, 364469, 372977, 381576, 390769, 401240, 413514, 428112, 445859, 467730, 494452, 526300, 562809, 602029, 640126, 672680, 697069, 713617, 724346, 731130, 735425, 739109, 744554, 753641, 767257, 785806, 809726, 839315, 874508, 915025, 960233, 1008448, 1056583, 1100844, 1137801, 1164982, 1181127, 1186468, 1182652, 1172037, 1156999, 1139878, 1122962, 1107774, 1094258, 1080978, 1066160, 1048406, 1026676, 1000197, 968707, 932648, 893075, 851485, 809655, 769285, 731552, 696981]
63383F96981l1324k8253k5536k3132k0730j8065j5220j2419r722p083m575k302
63371D98620j89J936M100O133P838R152J0240J1512J3318J5539J7645J9342K0998
63358F36184K3233K6238K9688L3209L6685M0137M3442M6173M7693M7417M5040
63347A055139M0449L3552K4474J4011L615n275j1800j5710j7205j6970j6056j5357
63335A072867j5284j6046j7981k1316k5708l0348l4492l7668l9464l9473l7597
63324G57490l4385l0800k7585k4771k1807j8113j3411p702j543L423M882J653
63312E87331m948j2114j7845k1692k3577k3178k0777j7676j5009j2772j0563q627
63300C98553p422o723n997n279m873m515l748k921k852l533l993l612k825k383
$$ y = [696981, 665657, 637404, 611868, 588736, 568006, 549941, 534721, 522302, 512580, 505497, 500922, 498620, 498431, 500367, 504467, 510600, 518438, 527590, 537830, 549342, 562660, 578199, 595844, 615186, 636184, 659417, 685655, 715343, 748552, 785237, 825374, 868816, 914989, 962682, 1010099, 1055139, 1095588, 1129140, 1153614, 1167625, 1171240, 1165965, 1154165, 1138455, 1121250, 1104280, 1088224, 1072867, 1057583, 1041537, 1023556, 1002240, 976532, 946184, 911692, 874024, 834560, 795087, 757490, 723105, 692305, 664720, 639949, 618142, 600029, 586618, 578916, 577373, 580796, 585678, 587331, 582383, 570269, 552424, 530732, 507155, 483977, 463200, 445524, 430515, 417743, 407180, 398553, 391131, 384408, 378411, 373132, 368259, 363744, 359996, 357075, 354223, 350690, 346697, 343085, 340260, 337877]
63286C37877k543l140l876m312m055l193k224j505j109j143j624k020j621n02
63272C05010M70P84Q24R47P85j0q11n87P49K188K819K742K665K925L123K718J809
63255C29150J208J614K864M153M952N369N633N643N261M779M836N816P460R021
63241C97759R882J0170J0687J2044J3964J5721J7118J8558K0189K1535K2270K2839
63229E92736K3873K5297K6382K6558K5845K4597K3225K2140K1670K1914K2735
63218H56972K3869K5007K5858K6260K6172K5437K3741K0922J7224J2934P839J420
63206A093655o278j4182k0869k5699k9097l1721l3616l4300l3481l1422k8637
63195H04353k5499k2210j8925j5761j2704r563o002j763K931P356J0950J3908
$$ y = [337877, 335334, 332194, 328318, 324006, 319951, 316758, 314534, 313029, 311920, 310777, 309153, 307133, 305512, 305010, 305480, 306264, 307088, 308035, 308820, 308810, 307999, 307412, 308161, 310349, 313168, 315910, 318575, 321500, 324623, 327341, 329150, 330358, 331972, 334836, 338989, 343941, 349310, 354943, 360586, 365847, 370626, 375462, 381278, 388738, 397759, 407641, 417811, 428498, 440542, 454506, 470227, 487345, 505903, 526092, 547627, 569897, 592736, 616609, 641906, 668288, 694846, 720691, 745288, 768513, 790653, 812323, 834237, 856972, 880841, 905848, 931706, 957966, 984138, 1009575, 1033316, 1054238, 1071462, 1084396, 1092235, 1093655, 1087377, 1073195, 1052326, 1026627, 997530, 965809, 932193, 897893, 864412, 832990, 804353, 778854, 756644, 737719, 721958, 709254, 699691, 693689, 691926, 694857, 702213, 713163, 727071]
63183G27071J6744J9401K1309K2368K3163K3985K4361K3962K3368K3305K3634
63172I72671K3695K3320K2759K1974K0719J9144J7544J5617J2614Q192K564m065
63160A156748j1485j9022k5752l1297l5801l9215m1319m2383m2939m2827m1263
63149G83445l8101l4312l0843k7756k4750k1926j9506j7407j5439j3599j1865
63138E27941j0107q417p111o182n275m344l757l555l160k170q93J72R11J350J449
63123D76852J392J621K287L190M277N533O287N663M070L180L830M873M875M010
63109E31940L322L021K682K449K769L250L070K347J909J799J158k44j456j599
63095E56417q45J24R08J314J226Q33N62M84K49k88p81q87n84Q2J082K136K741
$$ y = [727071, 743815, 763216, 784525, 806893, 830056, 854041, 878402, 902364, 925732, 949037, 972671, 996366, 1019686, 1042445, 1064419, 1085138, 1104282, 1121826, 1137443, 1150057, 1158249, 1160813, 1156748, 1145263, 1126241, 1100489, 1069192, 1033391, 994176, 952857, 910474, 867535, 824708, 783445, 745344, 711032, 680189, 652433, 627683, 605757, 586251, 568844, 553405, 539806, 527941, 517834, 509417, 502306, 496124, 490849, 486505, 482748, 479193, 476033, 473863, 472970, 473142, 474053, 475403, 476852, 478244, 479865, 482152, 485342, 489619, 495152, 501439, 507102, 511172, 514352, 518182, 523055, 527930, 531940, 535262, 538283, 540965, 543414, 546183, 549433, 552503, 554850, 556759, 558558, 559716, 559472, 558016, 556417, 555572, 555696, 556604, 557918, 559144, 559977, 560539, 561023, 561272, 560984, 560203, 559316, 558732, 558814, 559896, 562032, 564773]
63078E64773K727K439K316K595L392M687O126P267Q015Q594R101R478R863J0510
63064F51883J1402J2426J3818J5935J8547K0935K2817K4656K6986K9847L3036
63053H82288L6461M0050M3718M7478N1262N4638N7147N8939O0479O1674O1934
63042A456068O1223O0320N9696N8856N7351N5817N5413N6451N8167N9553N9909
63031B098824N8703N5560N0483M3765L5493K5404J3323l87j4894k9317m2977n5308
63019B238672o5681p3545p8747q1508q1958p9923p5374o8846o1141n2810m4193
63008A474946l5722k7637j9550j0853j646P123J4548K0484K5410K9946L4439L8627
62996A550115M1738M3332M3946M4438M4869M4731M4098M3724M3807M3606M2560
$$ y = [564773, 567500, 569939, 572255, 574850, 578242, 582929, 589055, 596322, 604337, 612931, 622032, 631510, 641373, 651883, 663285, 675711, 689529, 705464, 724011, 744946, 767763, 792419, 819405, 849252, 882288, 918749, 958799, 1002517, 1049995, 1101257, 1155895, 1213042, 1271981, 1332460, 1394134, 1456068, 1517291, 1577611, 1637307, 1696163, 1753514, 1809331, 1864744, 1921195, 1979362, 2038915, 2098824, 2157527, 2213087, 2263570, 2307335, 2342828, 2368232, 2381555, 2381168, 2366274, 2336957, 2293980, 2238672, 2172991, 2099446, 2020699, 1939191, 1857233, 1777310, 1701936, 1633090, 1571949, 1519139, 1474946, 1439224, 1411587, 1392037, 1381184, 1379538, 1386661, 1401209, 1421693, 1447103, 1477049, 1511488, 1550115, 1591853, 1635185, 1679131, 1723569, 1768438, 1813169, 1857267, 1900991, 1944798, 1988404, 2030964]
62985B030964M0862L8474L4386K7673J8716Q676j836j2942k4712l6869m8957o0192
62973B014243o9466p6155q0616q3354q4045q2217p8517p4250o9783o4432n8131
62962A193277n2099m7296m3156l8596l3734k9756k7339k5931k4644k3219k1953
62951H25554k1051k0334j9496j8476j7523j6896j6541j6169j5654j5190j4932
62940F33292j4720j4286j3577j2676j1568j0314r259q721q380p526o023m654m109
62927E07479l999l345j910m86J64J12j65m67q36j180j350j372j250p71R7Q15P78
62910D92314J16n01q62j468k625l818m298m051l753l919m369m563m227l572k913
62895D47491k332j754j274j030p92j08R41J558J262O77P15J285J497J035M87L51
$$ y = [2030964, 2071826, 2110300, 2144686, 2172359, 2191075, 2199751, 2197915, 2184973, 2160261, 2123392, 2074435, 2014243, 1944777, 1868622, 1788006, 1704652, 1620607, 1538390, 1459873, 1385623, 1315840, 1251408, 1193277, 1141178, 1093882, 1050726, 1012130, 978396, 948640, 921301, 895370, 870726, 847507, 825554, 804503, 784169, 764673, 746197, 728674, 711778, 695237, 679068, 663414, 648224, 633292, 618572, 604286, 590709, 578033, 566465, 556151, 546892, 538171, 529791, 522265, 516242, 511588, 507479, 503480, 500135, 498225, 497739, 497903, 498015, 497850, 497383, 496547, 495367, 494017, 492645, 491395, 490624, 490721, 491536, 492314, 492430, 491929, 491067, 489599, 486974, 483156, 478858, 474807, 471054, 467135, 462766, 458203, 453976, 450404, 447491, 445159, 443405, 442131, 441101, 440309, 440201, 441142, 442700, 443962, 444639, 445354, 446639, 448136, 449171, 449658, 450009]
62879D50009M57N62P62J006R68P13Q00J299J384N39n55j035j118j564k253k346
62863D49628j709j154j198j396j166n01L43J288K163K549K268J701J292J016O66
62848D55790L42L19N94Q97J077J163J146R49O09K72q6p21j752k721k853j843l60
62831D52822N52N23R1q7P9L78P73J251J563J566J587J918K140J681R39J042K234
62814D71052L312L131K124J687K452L832N029N771N939N310M002K847K838M207
62800E23533O232P928Q813R120R430J0110J1136J2341J3696J5163J6499J7490
62788F61491J8488K0338K3593K7933L2612L7263M2083M7373N3206N9512O6129
62777A090021P2710P8904Q4770R0662R6474J01208J03622J03108R9649R3167Q3486
$$ y = [450009, 450466, 451028, 451790, 452796, 453764, 454477, 455277, 456576, 457960, 458499, 457944, 456909, 455791, 454227, 451974, 449628, 447919, 446765, 445567, 444171, 443005, 442504, 442847, 444135, 446298, 448847, 451115, 452816, 454108, 455124, 455790, 456132, 456451, 457045, 457942, 459019, 460182, 461328, 462277, 462886, 463158, 463072, 462351, 460599, 457878, 455025, 453182, 452822, 453374, 453897, 453988, 453901, 453980, 454358, 455131, 456382, 457945, 459511, 461098, 463016, 465156, 466837, 467776, 468818, 471052, 474364, 477495, 479619, 481306, 483758, 487590, 492619, 498390, 504329, 509639, 513641, 516488, 519326, 523533, 529765, 537693, 546506, 555626, 565056, 575166, 586302, 598643, 612339, 627502, 644001, 661491, 679979, 700317, 723910, 751843, 784455, 821718, 863801, 911174, 964380, 1023892, 1090021, 1162731, 1241635, 1326405, 1417067, 1513541, 1614749, 1718371, 1821479, 1921128, 2014295, 2097781]
62766B097781P0958N6512M0777K3561M676j4940l3471m9622o3359p5133q4767
62755A972973r1510r4983r5740r4799r2876r0154q6552q1988p6523p0497o4536
62744A032815n9169n4389m9729m4922m0237l6047l2299k8720k5314k2303j9601
62733F20085j6813j3914j1485j0003r145q158o723n164l833k734j781j067o21
62720E28644j13Q57K224L503M427N308O578Q218R861J1329J2865J4781J7186K0100
62706F45768K3491K7151L0824L4664L9178M4461M9892N4987O0246O6458P3374
62695A150494P9730Q4772Q8938R2830R6033R7486R6606R3454Q7948P9508O7577
62684B115376N2305L4608J5723l313k1886l9583n5877p0105q1734r0412r5885
$$ y = [2097781, 2168739, 2225251, 2266028, 2289589, 2294265, 2279325, 2245854, 2196232, 2132873, 2057740, 1972973, 1881463, 1786480, 1690740, 1595941, 1503065, 1412911, 1326359, 1244371, 1167848, 1097351, 1032815, 973646, 919257, 869528, 824606, 784369, 748322, 716023, 687303, 661989, 639686, 620085, 603272, 589358, 577873, 567870, 558725, 550567, 543844, 538680, 534847, 532113, 530332, 529265, 528644, 528531, 529388, 531612, 535115, 539542, 544850, 551428, 559646, 569507, 580836, 593701, 608482, 625668, 645768, 669259, 696410, 727234, 761898, 801076, 845537, 895429, 950416, 1010662, 1077120, 1150494, 1230224, 1314996, 1403934, 1496764, 1592797, 1690283, 1786889, 1880343, 1968291, 2047799, 2115376, 2167681, 2202289, 2218012, 2214699, 2192813, 2153230, 2097353, 2027248, 1945514, 1855102, 1759217]
62673A759217r8182r7921r5983r2719q7913q1785p5425o9826o4834n9687n4224
62662H80718m9012m4357m0021l5880l2151k8819k5459k2021j9118j7129j5472
62651E51279j3407j1219r869r588r549r053q336p905p652p161o467n894n346m458
62637D35375l360k595k119j192M44J914K315J877J378Q86r1j460k512k943l043
62622D24874k828j925n28M27M65J83K24M76P98J703L477N349O411O856P384P856
62606D61202P694P330P969R847J1854J3180J4296J5911J7932J9997K2315K5269
62594F34796K8696L2232L5912L9905M3894M7305M9830N1280N1169M9008M4892
62583A108919L9271L2280K3729J3802L312o807j5965k3933l0728l6511m1284m4653
$$ y = [1759217, 1661035, 1563114, 1467131, 1374412, 1286499, 1204714, 1129289, 1059463, 994629, 934942, 880718, 831706, 787349, 747328, 711448, 679297, 650478, 625019, 602998, 583880, 566751, 551279, 537872, 526653, 516784, 507196, 497647, 488594, 480258, 472353, 464701, 457540, 451073, 445179, 439833, 435375, 432015, 429420, 427301, 426109, 426553, 428467, 430782, 432659, 434037, 434923, 434832, 433372, 430860, 427917, 424874, 422046, 420121, 419593, 420020, 420485, 420668, 420892, 421368, 422166, 423869, 427346, 432695, 439106, 445962, 453346, 461202, 468896, 476226, 484195, 494042, 505896, 519076, 533372, 549283, 567215, 587212, 609527, 634796, 663492, 695724, 731636, 771541, 815435, 862740, 912570, 963850, 1015019, 1064027, 1108919, 1148190, 1180470, 1204199, 1218001, 1221313, 1214506, 1198541, 1174608, 1143880, 1107369, 1066085, 1021432]
62571A021432m6178m5986m4816m3345m1667l9543l6887l3892l0771k7623k4566
62560F06158k1894j9891j8378j6666j4234j1450r216p898o978o006n305n279n460
62547D57503m982l838k898k624k500j959j156m55K44J074J650J601J339J557K120
62532D46676K220J644J135J300J902K534L354M590N896O867P956J0112J3513J7245
62518E26944K0368K2850K5308K8227L1714L5675L9940M4272M8408N2079N4936
62507I30721N6625N6998N6071N3700M9521M3371L5620K6955J7864Q486j137j0713
62495A324082j9591k6932l2129l5126l6244l5687l3357k9248k3795j7616j1087
62484A023270m360K341Q813J5234K2012K9093L5688M1030M5246M9092N2685N4801
$$ y = [1021432, 975254, 929268, 884452, 841107, 799440, 759897, 723010, 689118, 658347, 630724, 606158, 584264, 564373, 545995, 529329, 515095, 503645, 494429, 486531, 479553, 473547, 468242, 462963, 457503, 452521, 448683, 445785, 443161, 440661, 438702, 437546, 437091, 437335, 438409, 440059, 441660, 442999, 444556, 446676, 448896, 450540, 451675, 452975, 454877, 457411, 460765, 465355, 471251, 478118, 486074, 496186, 509699, 526944, 547312, 570162, 595470, 623697, 655411, 691086, 731026, 775298, 823706, 875785, 930721, 987346, 1044344, 1100415, 1154115, 1203636, 1247007, 1282627, 1309582, 1327446, 1335932, 1334795, 1324082, 1304491, 1277559, 1245430, 1210304, 1174060, 1138373, 1105016, 1075768, 1051973, 1034357, 1023270, 1018910, 1021251, 1030064, 1045298, 1067310, 1096403, 1132091, 1173121, 1218367, 1267459, 1320144, 1374945]
62472A374945N3711M8537L9783K8859J7459O991k213j1332k2018l4467m6897n7119
62460A396239o4253o8530p0209o9611o7780o5943o4137o1189n6397n0445m4355
62449G13390l8313l2126k6199k1276j7460j4185j1137q583o733n172l205o68J849
62436E30182L570M387M973N893O728O464M690K045n81k772m510n897p292r130
62422E38750j1190j2491j2376j1354j0398r724q817p422n974n030m739m757m530
62409D29948l716k645k115k408k803k450j485q40j114k037k923l186k517j053
62395C98656O54K048K944L327L162K611K162K032J861J399J097J399J851J758
62381D26961J484K144L987N961P101P545P903Q306Q480Q340Q122Q193Q917J0321
$$ y = [1374945, 1428656, 1477193, 1516976, 1545835, 1563294, 1570285, 1568072, 1556740, 1534722, 1500255, 1453358, 1396239, 1331986, 1263456, 1193247, 1123636, 1055856, 989913, 925776, 864587, 808190, 757745, 713390, 675077, 642951, 616752, 595476, 578016, 563831, 552694, 544111, 537378, 532206, 529001, 528333, 530182, 533752, 538139, 543112, 549005, 555733, 562197, 566887, 568932, 568351, 565579, 561069, 555172, 547880, 538750, 527560, 515069, 502693, 491339, 480941, 471217, 462400, 454978, 449004, 443974, 439235, 434478, 429948, 426232, 423587, 421472, 419064, 416261, 413811, 412326, 411486, 410372, 408335, 405412, 402226, 399709, 398656, 399310, 401358, 404302, 407629, 410791, 413402, 415564, 417596, 419457, 420856, 421953, 423352, 425203, 426961, 428445, 430589, 434576, 440537, 447638, 455183, 463086, 471392, 479872, 488212, 496334, 504527, 513444, 523765]
62367E23765J1852J2824J3307J4130J5845J8071K0074K1765K3845K7128L1805
62356G34411L7301M2864M8307N3963N9773O4878O8454P0303P0063O6523N8806
62345A375646M8026L6495K5404J4331L138p065j5357k2193k8481l4352l9532m4065
62333A311995m7821n0043n0262m9056m7152m4289l9947l4689k9781k5759k2281
62322H70915j9290j7329j6633j6769j7343j8411j9967k1583k2747k3201k2852
62311F54790k1765k0360j9184j8331j7387j6030j4349j2510j0533q601p218o646
62299D81876o369n436l482j204L32P56N92M69N14O48J075J951K855L209L162L405
62283D84353M017M261L775L270L575M576N544O039N926N103L820K928L105M038
$$ y = [523765, 535617, 548441, 561748, 575878, 591723, 609794, 629868, 651633, 675478, 702606, 734411, 771712, 814576, 862883, 916846, 976619, 1041497, 1109951, 1180254, 1250317, 1316840, 1375646, 1423672, 1460167, 1485571, 1499902, 1503040, 1495975, 1480618, 1458425, 1429944, 1395592, 1356060, 1311995, 1264174, 1214131, 1163869, 1114813, 1067661, 1023372, 983425, 948736, 918955, 893196, 870915, 851625, 834296, 817663, 800894, 783551, 765140, 745173, 723590, 700843, 677642, 654790, 633025, 612665, 593481, 575150, 557763, 541733, 527384, 514874, 504341, 495740, 488522, 481876, 475507, 470071, 466589, 465385, 465717, 466473, 467065, 467534, 468048, 468696, 469771, 471722, 474577, 477786, 480948, 484353, 488370, 492631, 496406, 499676, 503251, 507827, 513371, 519410, 525336, 530439, 534259, 537187, 540292, 544330]
62269E44330M995N835O871Q026Q967R944J1638J4171J7000J9859K3064K6759L0622
62256G32081L4661L9515M5560N2162N8336O3717O8330P1696P2743P0630O5256
62245A374687N6976M6271L3947K1328R824L0q615j7148k6039l4944m3340n1024
62233A361953n7835o3298o6796o7998o6860o3526n8566n3046m7861m3063l8200
62222G34904l3225k8627k4757k1539j8832j6619j4688j2568j0084p662n851m699
62210E35753l717k326l30J798L117L041K170J915L077N033O492O831O430N949
62196E75233N654N430N099M552L803L010K483K474K960L577L916L954M118M838
62182F31101O055P244P936Q041P711P063O214N427M948M634M014L034K637M135
$$ y = [544330, 549325, 555160, 562031, 570057, 579024, 588968, 600606, 614777, 631777, 651636, 674700, 701459, 732081, 766742, 806257, 851817, 903979, 962315, 1026032, 1094362, 1166058, 1238801, 1309431, 1374687, 1431663, 1477934, 1511881, 1533209, 1543033, 1543063, 1534448, 1517300, 1491261, 1456317, 1412977, 1361953, 1304118, 1240820, 1174024, 1106026, 1039166, 975640, 917074, 864028, 816167, 773104, 734904, 701679, 673052, 648295, 626756, 607924, 591305, 576617, 564049, 553965, 546303, 540452, 535753, 532036, 529710, 529380, 531178, 534295, 537336, 539506, 541421, 544498, 549531, 556023, 562854, 569284, 575233, 580887, 586317, 591416, 595968, 599771, 602781, 605264, 607738, 610698, 614275, 618191, 622145, 626263, 631101, 637156, 644400, 652336, 660377, 668088, 675151, 681365, 686792, 691740, 696374, 700388, 703422, 706059, 710194]
62168G10194P753J2166J5982J9400K3806K9755L6125M1592M6142N0427N4038N5352
62156A102732N3084M7331L9057K9255J8988R536J808m358r837j5234k0560k5777
62144A226025l1090l6367m0709m3092m3436m2563m1070l8750l5331l1215k7012
62133H15390k2709j7993j3198r230o440m285k262n82L08L96J2l97k13J105L321
62118G43223N513P250R040J1078J2204J0916P180K504j613m615o458p041o347
62105G82834m729l007k364l733o764r691j0858j0235q964p677o072l933j619N94
62091G03782K849N044O604P193P228P283P478P666P824P985Q141Q471R331J0841
62077H07720J2777J4915J7108J9002K0296K1432K3324K5978K7939K7714K5480
$$ y = [710194, 717947, 730113, 746095, 765495, 789301, 819056, 855181, 896773, 942915, 993342, 1047380, 1102732, 1155816, 1203147, 1242204, 1271459, 1290447, 1299983, 1301791, 1297433, 1287596, 1272362, 1251802, 1226025, 1194935, 1158568, 1117859, 1074767, 1031331, 988768, 947698, 908948, 873617, 842402, 815390, 792681, 774688, 761490, 752260, 745820, 741535, 739273, 738691, 738999, 739395, 739407, 739010, 738797, 739902, 743223, 748736, 755986, 765026, 776104, 788308, 799224, 806404, 808908, 807295, 802680, 796222, 789181, 782834, 778105, 775098, 772734, 769001, 762237, 752546, 741688, 731453, 722489, 714812, 708740, 704807, 703188, 703782, 706631, 711675, 718279, 725472, 732700, 739983, 747461, 755127, 762951, 770936, 779077, 787548, 796879, 807720, 820497, 835412, 852520, 871522, 891818, 913250, 936574, 962552, 990491, 1018205, 1043685]
62066A043685K2933K1608K1799K2961K4690K7111L0489L4474L7818L9073L7622
62055A364263L3870K8501K1934J4611P254M92n513j0828j5495j9814k4565l0380
62043A364330l6967m3262m8325n1840n3810n4193n2973n0511m7603m5104m3245
62032H36497m1386l8619l4716l0358k6398k3102k0242j7657j5512j4056j3271
62021E61180j2718j1802j0345q874q075q011q151q163q188q242p888o887n795
62008D48041n370n551n453m365k442m10J141K091K691L250L937M722N484O019
61994D53785O073N541M655L768K969K125J296O88J05j082l112n296o734p295p543
61979D49943p784p695o866n336l499j838q41q14j541k327k616k491k347k211j758
$$ y = [1043685, 1066618, 1088226, 1110025, 1132986, 1157676, 1184787, 1215276, 1249750, 1287568, 1326641, 1364263, 1398133, 1426634, 1448568, 1463179, 1470433, 1470925, 1465412, 1454584, 1439089, 1419275, 1394710, 1364330, 1327363, 1284101, 1235776, 1183936, 1130126, 1075933, 1022960, 972449, 924846, 879742, 836497, 795111, 756492, 721776, 691418, 665020, 641918, 621676, 604019, 588507, 574451, 561180, 548462, 536660, 526315, 517441, 509366, 501355, 493204, 485041, 476853, 468611, 460723, 453836, 448041, 442671, 437120, 431667, 427302, 424860, 424450, 425591, 427682, 430373, 433623, 437560, 442282, 447766, 453785, 459858, 465399, 470054, 473822, 476791, 478916, 480212, 480900, 481005, 479923, 476811, 471515, 464781, 457486, 449943, 442159, 434464, 427598, 422262, 418763, 416925, 416084, 415270, 413729, 411402, 408786, 406295, 403948, 401737, 399979]
61964C99979j016o15r99j594j353j48Q83P59p2m54k07k63j016j437m09J630L103
61947C96771L233K838L103M153N214N750N983O426P355Q817J0728J2786J4478
61934D87635J5400J5517J5014J4056J2905J1989J1586J1480J1307J1031J0704
61923F28624R815P571M068N63j838l331m821o546p840q089p367o112m696l263
61909E96738j731J64K551N245P921J0331J2119J2873J2646J2040J1284R653O466
61896F98300K432r19l069m957p401r903j1404j1652j1342j1158j1135j0839r873
61883E97080q290o584n311m725m932o055p931r778j0703j0586j0127r976j0099
61870D91983j0005r279p899o253m803l533j997r4J558K406K701K999L423M046
$$ y = [399979, 398963, 398348, 397349, 395755, 394402, 394254, 395137, 395896, 395824, 395370, 395163, 394900, 393884, 392447, 392038, 393668, 396771, 400004, 402842, 405945, 410098, 415312, 421062, 427045, 433471, 440826, 449643, 460371, 473157, 487635, 503035, 518552, 533566, 547622, 560527, 572516, 584102, 595582, 606889, 617920, 628624, 638439, 646010, 650078, 650641, 648803, 645472, 640651, 634105, 626265, 618176, 610809, 604697, 600001, 596738, 595007, 595171, 597722, 602967, 610888, 621219, 633338, 646211, 658857, 670897, 682181, 691834, 698300, 700732, 699813, 696744, 691787, 684386, 674483, 663079, 651427, 640085, 628927, 617792, 606953, 597080, 588790, 582206, 576895, 572170, 567238, 561183, 553252, 543474, 532771, 522185, 512058, 502082, 491983, 481978, 472699, 464800, 458547, 453744, 450211, 448214, 448120, 449678, 452084, 454785, 457784, 461207, 465253]
61856D65253N419P829J0449J2286J3666J5661J8312K0643K2373K4172K6094K7232
61844F69389K7321K7291K7579K7228K5358K2422J9144J5283J0393M932l08n079
61832H70953r195j1921j2833j2566j1818j0266p335l454M42M091P601J0573J2448
61819H26720J3273J3185J1667Q331L892o52n374j0754j6241k0632k3619k5691
61807G74105k6749k6249k4643k3264k2586k1817k0405j8723j7044j5056j2881
61796E44688j1389j0930j0649r736q495p584o826n641m179l260l308l812l871
61783D55008l025j686p53p00j071j157r76j113j701k179k087j608j150q69o93
61768D34240m88j25K54K50j43j46Q63K263K860K520K218K490K838K892L066L601
$$ y = [465253, 470672, 478501, 488950, 501236, 514902, 530563, 548875, 569518, 591891, 616063, 642157, 669389, 696710, 724001, 751580, 778808, 804166, 826588, 845732, 861015, 871408, 876340, 876032, 870953, 861758, 849837, 837004, 824438, 812620, 802354, 795019, 791565, 792007, 796098, 803699, 814272, 826720, 839993, 853178, 864845, 873176, 877068, 876416, 871042, 860288, 844047, 823415, 799796, 774105, 747356, 721107, 696464, 673200, 650614, 628797, 608392, 589669, 572625, 557569, 544688, 533299, 522369, 511720, 501984, 493489, 485905, 479079, 473438, 469259, 465999, 462691, 458879, 455008, 451983, 450297, 449544, 448844, 447773, 446616, 445640, 444527, 442826, 440647, 438560, 436952, 435802, 434933, 434240, 433752, 433627, 433881, 434131, 433988, 433842, 434705, 436968, 439828, 442348, 444566, 447056, 449894, 452786, 455852, 459453]
61752D59453L902L498K869K683K747K414J585O77r0q36j658k596l666m589m798
61737D61595m133l196k654k451k157j726j452j354j140o77p8N64J169J483J302
61722D45095Q15M72M90P36J039J393J843K374K891L212L121K621K009J561J146
61707D70818L79p98j914k459k545k825l680m662m997m543l822l182k441j621j373
61692D30335k148l323l778l132j924q06j69l01j199k251k759k776k862l057k920
61677C96930k503k457k932l241k921k334j890j438r06p75j221j521j017k62l31
61662C71181j242j882j442l09N74O86K01l39m44m7M76Q03J058J528K137K553K695
61645C78187K813L009L053K784K456K425K637K628K131J429R83Q27O19K17j45
$$ y = [459453, 463355, 466853, 469722, 472405, 475152, 477566, 479151, 479828, 479738, 478902, 477244, 474648, 470982, 466393, 461595, 457462, 454266, 451612, 449161, 447004, 445278, 443826, 442472, 441332, 440655, 440577, 441141, 442310, 443793, 445095, 445910, 446382, 446872, 447608, 448647, 450040, 451883, 454257, 457148, 460360, 463481, 466102, 468111, 469672, 470818, 471197, 470399, 468485, 466026, 463481, 460656, 456976, 452314, 447317, 442774, 438952, 435770, 433329, 431708, 430335, 428187, 424864, 421086, 417954, 416030, 415224, 415055, 414754, 413555, 411304, 408545, 405769, 402907, 399850, 396930, 394427, 391970, 389038, 385797, 382876, 380542, 378652, 377214, 376308, 375533, 374312, 372791, 371774, 371512, 371181, 369939, 368057, 366615, 366306, 366880, 367566, 367767, 367428, 366984, 366937, 367413, 368216, 369274, 370802, 372939, 375492, 378187, 381000, 384009, 387062, 389846, 392302, 394727, 397364, 399992, 402123, 403552, 404535, 405362, 405981, 406198, 406053]
61630D06053l43n94j003j289j244j151j340j706k067k555l157l251k394j236q25
61615C81898j190j485j432j632k369l108l504l875m379m584m394m497n266n899
61601C34284n447m170l136k837k881k811k585k387k436k919l747m503m780m429
61587B85216l415j867m11J02m58j278j589j431j188r46p35p98j091j080n31J%
61570B68501k08j11M9k70r21j287j215r99o78j03N08Q13J008J521K179K415K197
61553B73399K003J894J430O16J76N67J339J766J678J363J030O99L72O9j57j70
61537B88074J65Q15J592K337K876K954K399J350J50q72j378j126m15r4p16j797
61521B96314k370k178j851j961k416k819k934k663j890o24Q58K121K730K481J580
$$ y = [406053, 405710, 405116, 404113, 402824, 401580, 400429, 399089, 397383, 395316, 392761, 389604, 386353, 383959, 382723, 381898, 380708, 379223, 377791, 376159, 373790, 370682, 367178, 363303, 358924, 354340, 349946, 345449, 340183, 334284, 328837, 324667, 321531, 318694, 315813, 313002, 310417, 308030, 305594, 302675, 298928, 294425, 289645, 285216, 281801, 279934, 279523, 279625, 279167, 277889, 276300, 274869, 273681, 272735, 272000, 271202, 270111, 269031, 268500, 268501, 268501, 268293, 268182, 268231, 267961, 267040, 265753, 264538, 263539, 262861, 262758, 263266, 264079, 265087, 266608, 268787, 271202, 273399, 275402, 277296, 278726, 279342, 279518, 280085, 281424, 283190, 284868, 286231, 287261, 287960, 288332, 288401, 288244, 288074, 288239, 289054, 290646, 292983, 295859, 298813, 301212, 302562, 302712, 301840, 300462, 299336, 298921, 298827, 298111, 296314, 293944, 291766, 289915, 287954, 285538, 282719, 279785, 277122, 275232, 274608, 275466, 277587, 280317, 282798, 284378]
61506B84378N96l3l21m24k73J75N57L83l30j014j195q94m22k8K65O08J052J322
61488B84402J089N95N53J175J707J341K82o27r89j037r33o04j31K42N86J240K214
61471B91105L055L323K877J810N22k71j77K62J05p86j565j508p82m7K61J11j73
61454B98122o8O53J381J147p3j003m48J206K352J982P66J33N33J026O63j42j50
61437C08080R59K116K396K232K557L302L619L231K691K299J682O39l35o81m06
61422C34381J80Q94J560J876J776J589J591J675J648J615J802K158K362K114J337
61407C58558K55p05j219j341j329j296j216j184j352j668j891j885j589q84J61
61392C41415J004J089N78J71J87K39n3n82j028j202r08m9R50J309Q50L80O82J484
$$ y = [284378, 284974, 284941, 284620, 284196, 283923, 284098, 284655, 285038, 284708, 283694, 282499, 281605, 281183, 281155, 281420, 282028, 283080, 284402, 285491, 286086, 286639, 287814, 289521, 290862, 291144, 290517, 289528, 288491, 287558, 286954, 286823, 287065, 287651, 288891, 291105, 294160, 297483, 300360, 302170, 302692, 302421, 302244, 302506, 302611, 301825, 300260, 298752, 297970, 297923, 298184, 298295, 298122, 298054, 298707, 300088, 301235, 301162, 300159, 299711, 300917, 303269, 305251, 306017, 306150, 306683, 307709, 308372, 308230, 308080, 309039, 311155, 313551, 315783, 318340, 321642, 325261, 328492, 331183, 333482, 335164, 335803, 335468, 334787, 334381, 334561, 335455, 337015, 338891, 340667, 342256, 343847, 345522, 347170, 348785, 350587, 352745, 355107, 357221, 358558, 358813, 358108, 356889, 355548, 354219, 352923, 351707, 350523, 349171, 347503, 345612, 343727, 342138, 341254, 341415, 342419, 343508, 344086, 344257, 344444, 344683, 344630, 344048, 343020, 341818, 340910, 340861, 341811, 343120, 343970, 344350, 345032, 346516]
61374C46516J891J614J203J151J283J153P11K65N2Q8L52Q39J357J575J373J041
61358C62464Q92Q00M53J4J45J267L073M901O246O859O787O492O546O854O639N519
61342D25951M171L452L268K897K151J574J655K375L429M413M871M621L982L267
61328D72077K287P95p72j627j578j115p39p02j172j993k416j781m10Q02J558K196
61312D65410K812L229L803N228P354R144J0142J1071J2613J4364J5521J5838J5447
61299E91976J4349J2623J0636Q468N648J974j782m571o152p043p749q472r295
61286F00610j0126j0631j0630j0442j0418j0368r782q548p095n891n059m469l953
61273D93198l402k669j515J41J856K771K493J655J230J440J806K062K381K818
$$ y = [346516, 348407, 350021, 351224, 352375, 353658, 354811, 355522, 355787, 355839, 355927, 356279, 357118, 358475, 360050, 361423, 362464, 363356, 364156, 364609, 364623, 364768, 366035, 369108, 374009, 380255, 387114, 393901, 400393, 406939, 413793, 420432, 425951, 430122, 433574, 436842, 439739, 441890, 443464, 445119, 447494, 450923, 455336, 460207, 464828, 468810, 472077, 474364, 475159, 474387, 472760, 471182, 470067, 469328, 468626, 467454, 465461, 463045, 461264, 460854, 461656, 463214, 465410, 468222, 471451, 475254, 480482, 487836, 496980, 507122, 518193, 530806, 545170, 560691, 576529, 591976, 606325, 618948, 629584, 638052, 643700, 645674, 643892, 639321, 633169, 626126, 618377, 609905, 600610, 590484, 579853, 569223, 558781, 548363, 537995, 528213, 519665, 512570, 506679, 501620, 497151, 493198, 489796, 487127, 485612, 485753, 487609, 490380, 492873, 494528, 495758, 497198, 499004, 501066, 503447, 506265]
61259E06265L225L859N210P056Q323Q282P279O024M722L315K063J371J376K001
61245E70371L085M177M566L882K443Q07o79j753k150j863j209n02Qm9q30j681
61229E78623j563l26J120K082K849L824M692N012N020N256N784O319O713O922
61215F32327O864O626O474O320N713M608L614L147K921K626K413K301J818Q66
61201F88638K35N36J281J742K176L328N216P304R440J1722J3650J4463J4117J3107
61187G86955J1439Q678N095J875q0r99j626k280k733k763k592k791l731n094o190
61172G83163o784p179p396o960n890n208n807p241q393q858q991q999q873q974
61158F77610r716j0727j1118j0633r877r331q881q311p594o532m763k359KJ650
$$ y = [506265, 509490, 513349, 518559, 525615, 533938, 542220, 549499, 555523, 560245, 563560, 565623, 566994, 568370, 570371, 573456, 577633, 582199, 586081, 588524, 589331, 588652, 586899, 584749, 582886, 581677, 581175, 581183, 581134, 580304, 578623, 577060, 576734, 577854, 579936, 582785, 586609, 591301, 596313, 601333, 606589, 612373, 618692, 625405, 632327, 639191, 645817, 652291, 658611, 664324, 668932, 672546, 675693, 678614, 681240, 683653, 685954, 687772, 688638, 688873, 689409, 690690, 692432, 694608, 697936, 703152, 710456, 719896, 731618, 745268, 759731, 773848, 786955, 798394, 807072, 812167, 814042, 813962, 812963, 811337, 809057, 806324, 803561, 800969, 798178, 794447, 789353, 783163, 776379, 769200, 761804, 754844, 748954, 743746, 737939, 730698, 722305, 713447, 704456, 695457, 686584, 677610, 667894, 657167, 646049, 635416, 625539, 616208, 607327, 599016, 591422, 584890, 580127, 577768, 577770, 579420]
61144E79420K306J821R3k585n478p894r434r788q853p155n673m816l952k362l98
61129E15252Q89J252J690L071M789N577N411N718P402R653J1315J2541J4141J5965
61115F14666J7273J8314K0074K2422K4034K4324K4108K3916K3196K1823K0900
61104H55050K1099K1420K0699J9316J8218J7125J4923J1192O365R58m315q326
61092I93724j0592j2095j4113j6689j9023k0742k1876k2263k1993k1811k2082
61081G90445k1993k0814j9259j8432j8152j7503j6406j5340j4105j2265j0328
61070F05848r122q444p560o547n802m806k894p55L90O86J139J673J490J043J754
61055E68093L729N538O342O686P105P537Q119R112J0007J0249J0665J2545J5416
$$ y = [579420, 581726, 583547, 583640, 581055, 575577, 567683, 558249, 548461, 539608, 532453, 526780, 521964, 518012, 515650, 515252, 516141, 517393, 519083, 522154, 526943, 532520, 537931, 543649, 551051, 560704, 572019, 584560, 598701, 614666, 631939, 650253, 670327, 692749, 716783, 741107, 765215, 789131, 812327, 834150, 855050, 876149, 897569, 918268, 937584, 955802, 972927, 987850, 999042, 1005407, 1006365, 1002050, 993724, 983132, 971037, 956924, 940235, 921212, 900470, 878594, 856331, 834338, 812527, 790445, 768452, 747638, 728379, 709947, 691795, 674292, 657886, 642546, 628441, 616176, 605848, 596726, 588282, 580722, 574175, 568373, 563567, 560673, 559918, 560308, 560994, 562133, 563806, 565296, 566339, 568093, 571822, 577360, 583702, 590388, 597493, 605030, 613149, 622261, 632268, 642517, 653182, 665727, 681143]
61042F81143J7535J8517J9631K1421K3028K4127K5579K7751K9851L1393L2737
61031I52713L4003L5042L6512L9304M2808M5500M7032M7961M7858M6182M4589
61020A419504M5664M9416N3971N9432O7661P8102Q7745R5682J03940J13423J23783
61009B298323J38193J62756J99248K43886K95601L59453M39229N34770O51906
61000E323365Q06459J010691J265047J572057J937936K323632K590410K540634
60992A9370231K066212J269526M18112k31233n62147n79597l27722J17771N89182
60983B2130335Q33851O51300M3778p78931j546403k080336k334782k345810k179209
60974A2393793j910686j612500j333379j091352q87764p21616n89733m84004l96674
$$ y = [681143, 698678, 717195, 736826, 758247, 781275, 805402, 830981, 858732, 888583, 919976, 952713, 986716, 1021758, 1058270, 1097574, 1140382, 1185882, 1232914, 1280875, 1328733, 1374915, 1419504, 1465168, 1514584, 1568555, 1627987, 1695648, 1773750, 1861495, 1957177, 2061117, 2174540, 2298323, 2436516, 2599272, 2798520, 3042406, 3338007, 3697460, 4136689, 4671459, 5323365, 6129824, 7140515, 8405562, 9977619, 11915555, 14239187, 16829597, 19370231, 21436443, 22705969, 23124081, 22892848, 22330701, 21751104, 21423382, 21541153, 22130335, 22964186, 23615486, 23659264, 22880333, 21333930, 19253594, 16918812, 14573002, 12393793, 10483107, 8870607, 7537228, 6445876, 5558112, 4836496, 4246763, 3762759, 3366085]
60965C366085l25497k70209k27715j94173j68331j49305j33910j19457j06688
60956A670800r6841q8073p7812o6694n7089m9286m2012l5499l1193k9230k8498
60945A068573k8458k8872k8573k6581k3720k1354j9343j6943j4770j3922j3928
60934H32109j3440j2334j1379j0537r319q286q324q889q668p570o527n680m407
60921G16749k807j567o53M70J657K504L520N386P447Q483Q752R652J1556J3554
60907G84703J5131J6578J7796J8336J8595J9445K0514K0402J8848J7123J5918
60896I83389J4270J1255P464M138J735r1j900m247p392j0864j3908j6396j8627
60883I48826k0359k1027k0971k1261k2071k2302k1254j9659j8567j8115j7880
$$ y = [3366085, 3040588, 2770379, 2542664, 2348491, 2180160, 2030855, 1896945, 1777488, 1670800, 1573959, 1485886, 1408074, 1341380, 1284291, 1235005, 1192993, 1157494, 1126301, 1097071, 1068573, 1040115, 1011243, 982670, 956089, 932369, 911015, 891672, 874729, 859959, 846037, 832109, 818669, 806335, 794956, 784419, 775100, 766814, 758490, 749601, 740933, 733363, 726836, 721156, 716749, 713942, 712375, 711722, 712192, 713849, 716353, 719873, 725259, 732706, 741189, 749941, 759593, 771149, 784703, 799834, 816412, 834208, 852544, 871139, 890584, 911098, 931500, 950348, 967471, 983389, 997659, 1008914, 1016378, 1020516, 1022251, 1022160, 1020260, 1016013, 1008621, 997757, 983849, 967453, 948826, 928467, 907440, 886469, 865208, 843137, 820835, 799581, 779922, 761355, 743240, 725360]
60872G25360j7662j7284j6312j4556j2521j0877r873r422r322r151q478p422o542
60859E75938n974n272m284l656m073n405o904p915q151p624o554n196l744k532
60845D98654k177l069m779o336p046o845o111n599o047p306q153p705o660o308
60831D14513o640o528n484m101k850j613n15J1K30R14J887J968Q66j73k16O5j74
60814C92160l70M51J906K668K242J294N49K45M36J028J551J561J183Q15N12J14
60798D08345k66l79k81k40l86p65j442k220k630k569k486k632k675k424k329k660
60782C81961k838k387j957k464l550l973l417k820k877l254l451l560l702l457
60768C38254k446j018J28P17R65J105J193J205J063O90K61K29Q22J606J851J371
$$ y = [725360, 707698, 690414, 674102, 659546, 647025, 636148, 626275, 616853, 607531, 598380, 589902, 582480, 575938, 569964, 564692, 560408, 556752, 552679, 547274, 540370, 532455, 524304, 516680, 510126, 504930, 501186, 498654, 496477, 493408, 488629, 482293, 475247, 468402, 462291, 456692, 450645, 443339, 435186, 427481, 420821, 414513, 407873, 401345, 395861, 391760, 388910, 387297, 386782, 386793, 387023, 387937, 389824, 391792, 392658, 392485, 392269, 392334, 392160, 391790, 392241, 394147, 396815, 399057, 400351, 400900, 401145, 401581, 402609, 404160, 405721, 406904, 407719, 408231, 408345, 408079, 407700, 407419, 407179, 406793, 406028, 404586, 402366, 399736, 397167, 394681, 392049, 389374, 386950, 384621, 381961, 379123, 376736, 374779, 372315, 368765, 364792, 361375, 358555, 355678, 352424, 348973, 345413, 341711, 338254, 335808, 334790, 334918, 335635, 336600, 337705, 338898, 340103, 341166, 341856, 342117, 342346, 343168, 344774, 346625, 347996]
60752C47996Q12R52J876K950L507L375K825K335K491L597N081N633M505K459Q25
60737C91219j52j272k775l819l863l672m251n465o381o564o274n771n148m617
60723C31195m320l980l281k413j810j499j333j513k223k888k649j568o52n54r03
60708B99609j075r91q53o61l43o8o0k84m67l54N6M19K75l50p99n36J36N80Q13
60689B95047J310J985K171J729J379J563J792J577J410K074L401M472M850N012
60675C29772N503O150O302N570M301L483L986N665P185P073N053K239J7j098j530
60660C89671j895k378k752k787k502k089j740j568j584j619j348o46J66O14O47
60645C68190O60R07J036N17o45j813k433k671l109l872m329l921k965k310k273
$$ y = [347996, 348808, 349760, 351636, 354586, 358093, 361468, 364293, 366628, 369119, 372716, 377797, 383430, 387935, 390394, 391219, 391067, 389795, 387020, 383201, 379338, 375666, 371415, 365950, 359569, 353005, 346731, 340960, 335812, 331195, 326875, 322895, 319614, 317201, 315391, 313892, 312559, 311046, 308823, 305935, 303286, 301718, 301066, 300512, 299609, 298534, 297543, 296690, 296029, 295686, 295618, 295558, 295274, 294807, 294453, 294509, 294928, 295203, 294853, 294054, 293518, 293654, 294234, 295047, 296357, 298342, 300513, 302242, 303621, 305184, 306976, 308553, 309963, 312037, 315438, 319910, 324760, 329772, 335275, 341425, 347727, 353297, 357598, 361081, 365067, 370732, 377917, 384990, 390043, 392282, 392299, 391201, 389671, 387776, 385398, 382646, 379859, 377357, 375268, 373528, 371960, 370376, 368757, 367409, 366763, 366929, 367543, 368190, 368850, 369757, 370793, 371310, 370665, 368852, 366419, 363748, 360639, 356767, 352438, 348517, 345552, 343242, 340969]
60630C40969k402k330k227k202j856r52n1J72n9k1L77N34K59K8N8p1n29o73J13
60611C29137J406K092J545J75r98j112j66Q91R95J29o72n90R0O32Q78J212J793
60594C37437K356K666K767K823K911K935K624J814Q16K15J31J0n76j304j612j427
60578C54586j026m75L05J170J903K571L267L794M127M876O560Q700J0351J1521
60564D12230J3082J5130J6460J6042J4229J1843Q831M738O6l833o215p525q435
60551D86643q974q845q046o772n062k898n07J768L751N478P025Q498J0043J1705
60537D93807J3440J5369J7752K0412K2380K2624K1052J8368J4947J0421M635j463
60525F73744o356r257j0553j1113j1440j1465j0927r881q802q071p394o142m395
$$ y = [340969, 338567, 336237, 334010, 331808, 329952, 329000, 328949, 329121, 329062, 329041, 329418, 329952, 330211, 330239, 330297, 330226, 329697, 329024, 329137, 330543, 332635, 334180, 334355, 333357, 332245, 332079, 332970, 333965, 334094, 333422, 332832, 332922, 333554, 334432, 335644, 337437, 339793, 342459, 345226, 348049, 350960, 353895, 356519, 358333, 359149, 359364, 359495, 359505, 358929, 357625, 356013, 354586, 353560, 353085, 353390, 354560, 356463, 359034, 362301, 366095, 370222, 375098, 381658, 390358, 400709, 412230, 425312, 440442, 456902, 472944, 487173, 499016, 507847, 512585, 512651, 508818, 502603, 495078, 486643, 477669, 468824, 460778, 454006, 448944, 446046, 445539, 447307, 451058, 456536, 463561, 472059, 482102, 493807, 507247, 522616, 540368, 560780, 583160, 605784, 626836, 645204, 660151, 670572, 675207, 673744, 667388, 658131, 647578, 636465, 625025, 613560, 602633, 592752, 583950, 575879, 568485, 562343, 557948]
60512E57948l105k846k895k135n26R89J879K534L483M859O779R496J2947J6793
60498F06200K1130K6445L2541L8244M2713M6389M9953N2881N3785N2016M8150
60487A070447M3066L7149L0425K2856J4333M762n648j6345k6643l5925m3722m9856
60475A044899n4269n6662n6615n4299n0646m6451m1723l6418l1317k7410k4602
60464E64487k1886j8775j5859j3786j2417j1206r911q626p500o653o076n475m579
60451D21738l647l276l591m037m148m026l890l605k988k243j734j543j472j294
60437C80244q12O3J056J615J459Q26P0p28j541k130k222j830j131k89M56P59N15
60420C76380L7l20n28o35m77L7N60O00J60k36j31M58J199J756J961J806J382P66
$$ y = [557948, 554843, 551997, 549102, 546967, 546441, 547430, 549309, 551843, 555326, 560185, 566964, 576460, 589407, 606200, 627330, 653775, 686316, 724560, 767273, 813662, 863615, 916496, 970281, 1022297, 1070447, 1113513, 1150662, 1181087, 1203943, 1218276, 1223038, 1217390, 1201045, 1174402, 1138477, 1094755, 1044899, 990630, 933968, 877353, 823054, 772408, 725957, 684234, 647816, 616499, 589089, 564487, 542601, 523826, 507967, 494181, 481764, 470558, 460647, 452021, 444521, 437868, 431792, 426317, 421738, 418091, 414815, 411224, 407187, 403039, 399013, 395123, 391518, 388530, 386287, 384553, 383010, 381538, 380244, 379432, 379495, 380551, 382166, 383625, 384451, 384521, 383793, 382252, 380122, 377900, 376070, 374939, 374650, 375106, 375865, 376380, 376417, 376097, 375569, 374934, 374457, 374494, 375054, 375654, 375814, 375578, 375447, 375905, 377104, 378860, 380821, 382627, 384009, 384775]
60402C84775J30j47K78J186J876J946J741J725J817J732J674K051K697K984K761
60387D09226K556K719K964L017L133L592M084M099L598K883K073J235Q27J312
60373D47318K369L085L031K649K434K291J933J389P55p5r84j426j190r43j277
60358D61359j551o35J252K466K048J016J031K376M017N153N966O902P909Q494
60344E07803Q216P052N480M070K840J259q60k864m055m601n123n609n464m590
60330E03554l685l360l498l660l657l452l030k616k684l399m318m814m683m139
60316D52559l435k642j695n09Q27J978K694L221M172N898Q166J0481J2605J4797
60302E09117J7675K1559K5658K8148K7587K4181J9161J3075N413l862j3297k0894
$$ y = [384775, 384905, 384758, 385036, 386222, 388098, 390044, 391785, 393510, 395327, 397059, 398733, 400784, 403481, 406465, 409226, 411782, 414501, 417465, 420482, 423615, 427207, 431291, 435390, 438988, 441871, 443944, 445179, 446006, 447318, 449687, 452772, 455803, 458452, 460886, 463177, 465110, 466499, 467254, 467179, 466195, 464769, 463579, 462636, 461359, 459808, 459173, 460425, 462891, 464939, 465955, 466986, 469362, 473379, 478532, 484498, 491400, 499309, 507803, 516019, 523071, 528551, 532621, 535461, 536720, 535860, 532996, 528941, 524340, 519217, 513608, 508144, 503554, 499869, 496509, 493011, 489351, 485694, 482242, 479212, 476596, 473912, 470513, 466195, 461381, 456698, 452559, 449124, 446482, 444787, 444278, 445105, 447083, 449777, 452998, 457170, 463068, 471234, 481715, 494320, 509117, 526792, 548351, 574009, 602157, 629744, 653925, 673086, 686161, 691574, 687712, 674415, 653521]
60290F53521k5654k7744k7562k5296k1289j6382j1741q317o318n086l749k169
60278D72214j053j005j781k661l238l563l721l629l280k946k978l413l747l343
60264D31856k193j068o03n61m35m70j335k794l603k982j537l70M6j54p24j292
60248D11781j357q54l31j65p2K79O40O71N36M53J66n31j062o73N05J600K071K068
60230D15725J919J818J927K277K675L002L349L531K992J743Q66J233K207K504
60216D47768K085K065K884L711L908L953M485N313N938O398P007P726Q214Q233
60202E19688P702O791O127O376P241P451O245M416L363L449L854L819L406L035
60188E92963K824K546J995J174K50o28j488k449l407m045m238m314m689n318n736
$$ y = [653521, 627867, 600123, 572561, 547265, 525976, 509594, 497853, 489536, 483218, 478132, 474383, 472214, 471161, 470156, 468375, 465714, 462476, 458913, 455192, 451563, 448283, 445337, 442359, 438946, 435199, 431856, 429663, 428595, 427992, 427431, 426996, 426526, 425191, 422397, 418794, 415812, 414275, 413905, 413951, 413797, 413073, 411781, 410424, 409570, 409239, 409074, 409002, 409281, 409921, 410592, 411128, 411581, 411747, 411216, 410154, 409481, 409986, 411586, 413657, 415725, 417644, 419462, 421389, 423666, 426341, 429343, 432692, 436223, 439215, 440958, 441824, 443057, 445264, 447768, 449853, 451918, 454802, 458513, 462421, 466374, 470859, 476172, 482110, 488508, 495515, 503241, 511455, 519688, 527390, 534181, 540308, 546684, 553925, 561376, 567621, 572037, 575400, 578849, 582703, 586522, 589928, 592963, 595787, 598333, 600328, 601502, 601752, 601124, 599636, 597187, 593780, 589735, 585497, 581183, 576494, 571176, 565440]
60173E65440n620n118m633m373m190l815l124k233j455j221j849l144m248m270
60159E16147l254k220k021k377k264j147M87J712K014J634J257J324J535J210
60145E14037K27o96q91n33k13j0M69J328K189K721K997L324L963M936N825N993
60129E45666N341M567M253M013L082J530K04l93m53j96L92J143J778K414L311
60114E76652M056L847K751J897J988K487K595K385K316K283J819Q76j70j080j866
60099F02836k553l153l697m045l954l477k923k289j216J96J180J242P80L14k31
60084E79010r53j285p50R5K60l34r52j274j667k245k573k505k554l115l919m588
60068E50651n248o211p348q202q484q243p685p084o691o455n994n033l869l130
$$ y = [565440, 559820, 554702, 550069, 545696, 541506, 537691, 534567, 532334, 530879, 529658, 527809, 524665, 520417, 516147, 512893, 510673, 508652, 506275, 504011, 502864, 503351, 505063, 507077, 508711, 509968, 511292, 512827, 514037, 514264, 513568, 512677, 512144, 511931, 511921, 512390, 513718, 515907, 518628, 521625, 524949, 528912, 533848, 539673, 545666, 551007, 555574, 559827, 563840, 566922, 568452, 568656, 568263, 567810, 567614, 568006, 569149, 570927, 573341, 576652, 580708, 584555, 587306, 589203, 591191, 593678, 596273, 598658, 600974, 603257, 605076, 605952, 605782, 604702, 602836, 600283, 597130, 593433, 589388, 585434, 581957, 579034, 576745, 575529, 575725, 576905, 578147, 578927, 579241, 579010, 578057, 576772, 576022, 576117, 576377, 576043, 575091, 573817, 572150, 569905, 567332, 564827, 562273, 559158, 555239, 550651, 545403, 539192, 531844, 523642, 515158, 506915, 499230, 492146, 485455, 479000, 473006, 467973, 464104, 460974]
60054D60974l092l376l392k931k204j415n54L58J080J471J791K408L273L994M419
60039D62804M781N191N469N507N481N442N137M500L939L754L576K811J432j06
60025E19718j461k598l517m296n261o639q001q520p861o539n302m531m234m252
60011D46706m271l953l352k955l129l596l719l200k411j952k056k434k648k516
59997D04514k091j416n61K16N93O32P85J295J842K048K075K401L097L763M134
59982D23327M339M480M313L639K753K191K084J959J272m4j562k836l703m138l989
59967D34085l112j774o50k48l86m43p1N19R32J039R79Q82Q17R11J244J569J419
59950D37712P34J84M56J326J902J862J830K328K916K957K709K854L231K903J579
$$ y = [460974, 457882, 454506, 451114, 448183, 445979, 444564, 444010, 444368, 445448, 446919, 448710, 451118, 454391, 458385, 462804, 467585, 472776, 478245, 483752, 489233, 494675, 499812, 504312, 508251, 512005, 515581, 518392, 519824, 519718, 518257, 515659, 512142, 507846, 502585, 495946, 487945, 479425, 471564, 465025, 459723, 455192, 450958, 446706, 442435, 438482, 435130, 432175, 429046, 425450, 421731, 418531, 416120, 414168, 412112, 409678, 407030, 404514, 402423, 401007, 400446, 400662, 401255, 401887, 402672, 403967, 405809, 407857, 409932, 412333, 415430, 419193, 423327, 427666, 432146, 436459, 440098, 442851, 445042, 447126, 449085, 450357, 450313, 448751, 445915, 442212, 438074, 434085, 430973, 429199, 428549, 428301, 427915, 427472, 427401, 427920, 428852, 429891, 430870, 431752, 432569, 433480, 434724, 436293, 437712, 438446, 438630, 439086, 440412, 442314, 444176, 446006, 448334, 451250, 454207, 456916, 459770, 463001, 465904, 467483]
59935D67483J03o90q39p14l35K25M11j87j049j250o10K21O78Q63J186J788K402
59918D69686K584K196J732J987L210M838O193P086P475P055N710M021K652J412
59904E27837l50k496l959m067l362k847k852k967k751k103j191k87M01R46J618
59889E01570K438L048L240L380M029N196O323O937P010O680O004N197M723M807
59875E70582N011M737M022L405K979K101L43j765l378m402n337o347p053p265
59861E57633p215o954o131m670l221k499k419k297j670o01P07K207L872N573P215
59846E39530Q822J0315J1235J0873Q860N653K289l72j962k188p18K061M560N018
59832F03976L091m1l101n698p879r354r556q253n938l720k713l181m347n292n831
$$ y = [467483, 467586, 466896, 466057, 465343, 465008, 465233, 465644, 465457, 464408, 463158, 462548, 462769, 463447, 464310, 465496, 467284, 469686, 472270, 474466, 476198, 478185, 481395, 486233, 492426, 499512, 506987, 514042, 519752, 523773, 526425, 527837, 527487, 524991, 521032, 516965, 513603, 510756, 507904, 504937, 502186, 500083, 498892, 498605, 499006, 499952, 501570, 504008, 507056, 510296, 513676, 517705, 522901, 529224, 536161, 543171, 549851, 555855, 561052, 565775, 570582, 575593, 580330, 584352, 587757, 590736, 592837, 593180, 591415, 588037, 583635, 578298, 571951, 564898, 557633, 550418, 543464, 537333, 532663, 529442, 526943, 524524, 522227, 520557, 519956, 520663, 522870, 526742, 532315, 539530, 548352, 558667, 569902, 580775, 589635, 595288, 597577, 597205, 595243, 593055, 592337, 594398, 598958, 603976, 607067, 607026, 603925, 598227, 590348, 580994, 571438, 563185, 557247, 553527, 550814, 547633, 543286, 537994, 532163]
59817E32163o126n948n032l882l206k719j551J45J184J147Q92Q78L23j232k758
59802E04278l188k995l178l472k905j619p85r20j390j592j547j374j009n29m3
59787D77732O68J693K369J893N38n16o34l53m65j108j835k135j778j025m33j95
59771D74416Q4N95Q37L95k29l32j25k31m77j60O50J112R72Q81J233J634J733J811
59753D84799K271L127M162N058N394N171N230O372Q003Q585P536N827M487L551
59739E59573K753K317K455K782K796K464J906J026p0p94o96j9P27J355J944K429
59723E82948K604K338J640P72K50L00M47R8n05n96j37J11j24j71M47J212J436
59706E93070J184Q82O33M84Q08J773K780L065K608K031J740J653J637J879K782
$$ y = [532163, 526037, 520089, 515057, 511175, 507969, 505250, 503699, 503844, 505028, 506175, 507067, 507945, 508268, 507036, 504278, 501090, 498095, 494917, 491445, 488540, 486921, 486136, 485216, 483826, 482234, 480687, 479313, 478304, 477775, 477732, 478400, 480093, 482462, 484355, 484893, 484377, 483743, 483390, 482925, 481817, 479982, 477847, 476069, 475044, 474611, 474416, 474500, 475095, 475932, 476327, 476098, 475766, 475641, 475410, 474933, 474773, 475423, 476535, 477507, 478388, 479621, 481255, 482988, 484799, 487070, 490197, 494359, 499417, 504811, 509982, 515212, 521584, 529587, 538172, 545708, 551535, 556022, 559573, 562326, 564643, 567098, 569880, 572676, 575140, 577046, 578072, 578002, 577208, 576512, 576493, 577220, 578575, 580519, 582948, 585552, 587890, 589530, 590302, 590552, 590852, 591299, 591397, 590892, 590296, 590159, 590270, 590146, 589975, 590422, 591634, 593070, 594254, 595136, 595769, 596253, 597061, 598834, 601614, 604679, 607287, 609318, 611058, 612711, 614348, 616227, 619009]
59691F19009M476O335P110N955L318M19j912l427l756k555n33O97K61j182k609
59676F31606l773m765n293n166m892n033n422n622n718o007o280o106n589n236
59662E56704n240n335n145m314k644n59R61J452J614K330L410L987L927M004M661
59647E59813N279M940L487J604O0j005k034l380m705n339n216n073n512o238o473
59632E30208n883m778l654k790k157j588j109j092j721k442k487j983j880k602
59618D94042l514m002m324m877n365n357n068m854m419l280j696m03L74Q98J191
59603D49346J055P35Q00J268J499J073L16j86k12J02N37R25J170J284J333J330
59587D62375J260J109Q20M31J60J81K38j18q82j600k045k462k957l182k939k565
$$ y = [619009, 623485, 629820, 636930, 642885, 646203, 646622, 644710, 641283, 637527, 634972, 634439, 635136, 635397, 634215, 631606, 627833, 623068, 617775, 612609, 607717, 602684, 597262, 591640, 585922, 579915, 573635, 567529, 561940, 556704, 551464, 546129, 540984, 536670, 534026, 533467, 534428, 535880, 537494, 539824, 543234, 547221, 551148, 555152, 559813, 565092, 570032, 573519, 575123, 575183, 574178, 572144, 568764, 564059, 558720, 553504, 548431, 542919, 536681, 530208, 524325, 519547, 515893, 513103, 510946, 509358, 508249, 507157, 505436, 502994, 500507, 498524, 496644, 494042, 490528, 486526, 482202, 477325, 471960, 466603, 461535, 456681, 452262, 448982, 447286, 446883, 447257, 448155, 449346, 450401, 451136, 451936, 453204, 454703, 455776, 456092, 455906, 455694, 455796, 456333, 457258, 458428, 459712, 461045, 462375, 463635, 464744, 465564, 465995, 466155, 466336, 466574, 466456, 465574, 463974, 461929, 459467, 456510, 453328, 450389, 447824]
59571D47824k483k706l051l420l605l285k516j763j249q08n21q18j583j910j245
59556D16861j58N36Q31J101J289J156Q78P93R22J236J869K683L166L242L498M206
59540D44109N007N975P950J1040J4072J6517J9518K3359K5118K1173J1758J103
59528F06699o908j1383j2888j1744q713n560l509k058j63K130L935M628M092K546
59514E61104P24m80j071k058m035o238p570p906p872p844p820p830p903p817p295
59499D78089o310m983l533k421k060k186k014j256m68j90k51l12m31o57n71J90
59483D50636J282K093K594L208L992M534M701N033O113P717Q879Q863P887O656
59469E24188N341L504J162p47j452j442j711k318k452j774q01J07J198K606L923
$$ y = [447824, 445341, 442635, 439584, 436164, 432559, 429274, 426758, 424995, 423746, 422938, 422417, 421599, 420016, 418106, 416861, 416703, 417239, 418070, 419171, 420460, 421616, 422494, 423287, 424209, 425445, 427314, 429997, 433163, 436405, 439903, 444109, 449116, 455091, 463041, 474081, 488153, 504670, 524188, 547547, 572665, 593838, 605596, 606699, 599791, 588408, 575520, 563776, 555063, 549503, 545994, 543936, 543773, 545903, 549838, 554466, 558558, 561104, 561828, 561348, 560277, 558219, 554184, 547946, 540376, 532470, 524598, 516754, 508934, 501104, 493201, 485384, 478089, 471779, 466796, 463263, 460842, 458782, 456596, 454582, 453326, 452858, 452668, 452417, 452105, 451674, 451017, 450446, 450636, 451918, 454011, 456605, 459813, 463805, 468339, 473040, 478073, 484186, 491903, 500782, 509645, 517532, 524188, 529529, 533033, 534195, 533448, 531996, 530554, 528843, 526525, 524073, 522299, 521498, 521605, 522803, 525409, 529332]
59454E29332M808N469O252P204Q232R202R833R988J0083J0589J1049J0391Q301
59441F40733N476K384j315n590r237j0957j0705r423p953o793o370o778p438p582
59427E58452o997n993m896l818k644j107Q92K926M530O018Q149J0903J3398J5237
59413E95050J6980J9091K1587K5136L0639L6503L7807L0397J5504j212j4738k3307
59401G89437k6788k5253j9778j2416m156N437J5186K0571J7143N388r345k1515
59389G33911k8801l1479l0515k7064k2534j8013j3835j0157p355n544m190k763
59377E31661j352k83N71J558K655L648M554N355N550M723L413K741L076L701L942
59362E75513L983M294M832N270N616O155O963P805Q425Q728Q819Q998R497J0133
$$ y = [529332, 534140, 539609, 545861, 553065, 561297, 570499, 580332, 590320, 600403, 610992, 622041, 632432, 640733, 646209, 648593, 647278, 641688, 632451, 621494, 610789, 601366, 593413, 586620, 580250, 573472, 566034, 558452, 551455, 545462, 540566, 536748, 534104, 532997, 533889, 536815, 541345, 547363, 555512, 566415, 579813, 595050, 612030, 631121, 652708, 677844, 708483, 744986, 782793, 813190, 828694, 827482, 812744, 789437, 762649, 737396, 717618, 705202, 701046, 706483, 721669, 742240, 759383, 764771, 755426, 733911, 705110, 673631, 643116, 616052, 593518, 575505, 561670, 551513, 544158, 538614, 534424, 531661, 530309, 530026, 530597, 532155, 534810, 538458, 543012, 548367, 553917, 558640, 562053, 564794, 567870, 571571, 575513, 579496, 583790, 588622, 593892, 599508, 605663, 612626, 620431, 628856, 637584, 646403, 655401, 664898, 675031]
59348F75031J0472J0452J0551J1214J2413J3835J5065J5556J4992J3825J2933
59337H16339J2426J1442R401O743L986Q67k851o412q822j0162j1232j2240j2817
59324G96668j3062j3499j3991j3728j2471j0984r989r387q773q099p527p015o345
59311F61798n306l873k444j708j849k091j535k03J331K937M840O832Q668J0978
59297F78375J4531J8319J9489J5818P666k578j2114j8700k1314k0741j8871j6890
59285F42990j4643j1955r591q240p388o065m265k754j790p78Q42K925M829O114
59271E90231P032Q377J0499J2597J3510J3247J2900J2962J2650J1354R690Q289
59259G23338O462L125j375n510q396j0367j1806j2439j2024j0975r925r156q680
$$ y = [675031, 685503, 695955, 706506, 717720, 730133, 743968, 759033, 774589, 789581, 803406, 816339, 828765, 840207, 849608, 856351, 860337, 861204, 858353, 851941, 843119, 832957, 821725, 809485, 796668, 783606, 770107, 756116, 742388, 729917, 718933, 708944, 699557, 690784, 682685, 675158, 668143, 661798, 656492, 652619, 650175, 648467, 646618, 644527, 642992, 642789, 644120, 647057, 651897, 658729, 667397, 678375, 692906, 711225, 730714, 746532, 754198, 751620, 739506, 720806, 699492, 678751, 659880, 642990, 628347, 616392, 606801, 598561, 591173, 585108, 580843, 578089, 576299, 575521, 576363, 579288, 584117, 590231, 597263, 605640, 616139, 628736, 642246, 655493, 668393, 681355, 694005, 705359, 715049, 723338, 729800, 732925, 731550, 726040, 717644, 707277, 695471, 683032, 671008, 660033, 650108, 640952, 632272]
59246F32272q462q210p327n454l006r66n2j60n27m70R0Q05J426J971K451K803
59230F07184L100L526L936L759K627R87j96l99j80o99k408m299m814l704k487
59215F05933k623l734m242l469k192j225m90L01R05R60N75J16k02k58K1M31N82
59198E91389L61m8o09j286j586r47K48R00O42L00N30Q68O16k5k94J15R75J904
59180E94053K481K378J800J424J539J766J860K115K645K966K833K790L268L804
59166F27722L817L691M281N704P281Q441R096R313R107Q471P296N515L447J608
59152G14790k8j957m166n854o530o619o603o389o060o368p624q887r114q583q254
59137F21754q321q286q042p874p735p416p090o859o156m540k768j984k033j672
$$ y = [632272, 623810, 615600, 608273, 602819, 599813, 598847, 598795, 598635, 598108, 597638, 597728, 598533, 599959, 601930, 604381, 607184, 610284, 613810, 617746, 621505, 624132, 625119, 624923, 624524, 624344, 623645, 621237, 616938, 612124, 608420, 605933, 603310, 599576, 595334, 591865, 589673, 588448, 587958, 588259, 589164, 590124, 590699, 590815, 590613, 590355, 590376, 590807, 591389, 591750, 591702, 591093, 589807, 588221, 587274, 587522, 588422, 589064, 589364, 589894, 590762, 591378, 591353, 591059, 591174, 592149, 594053, 596534, 598912, 600712, 602136, 603675, 605441, 607301, 609416, 612061, 615027, 617860, 620650, 623918, 627722, 631539, 635230, 639511, 645215, 652496, 660937, 670033, 679346, 688453, 696924, 704220, 709735, 713182, 714790, 714762, 712805, 708639, 702785, 696255, 689636, 683033, 676644, 670584, 664216, 656592, 647705, 638591, 630008, 621754, 613433, 605147, 597105, 589231, 581496, 574080, 566990, 560131, 553975, 549435, 546667, 544683, 542650, 540978]
59123E40978l57J190K318L300M644O295P885R173J0037J0462J0645J0804J0834
59110F28208J0527J0027R553Q939P838O367N004L961L167K644K459K362K059J649
59096G04764J363J067M48m70j504k659l816m429m137l327k501j562m62k4j045
59081F81706k908m162m451m734n622o619p253p813q533q928q531p695p138p097
59067E90222p273p247o649n346l758k717k698l365l991m147l886l549l412l397
59053E28787l189k748k439k418k293j730j048o80m38M3M41J79m98p00k08K19p8
59036E11202q81j529j584r67J6P70J076J521K690M063M544M107L971M943O446
59021E40388P643Q644J0092J2022J3788J4799J4841J3898J2137R917P535N001
$$ y = [540978, 540621, 541811, 544129, 547429, 552073, 558368, 566253, 575426, 585463, 595925, 606570, 617374, 628208, 638735, 648762, 658315, 667254, 675092, 681459, 686463, 690424, 693591, 696235, 698694, 701056, 703115, 704764, 706127, 707194, 707642, 707172, 705668, 703009, 699193, 694764, 690627, 687300, 684799, 683237, 682775, 682751, 681706, 678798, 674636, 670185, 665451, 659829, 653210, 645957, 638144, 629611, 620683, 612152, 604457, 597319, 590222, 582949, 575702, 569053, 563707, 559949, 557232, 554534, 551169, 547178, 543031, 539145, 535596, 532184, 528787, 525598, 522850, 520411, 517993, 515700, 513970, 512922, 512242, 511804, 511847, 512288, 512467, 511969, 511269, 511061, 511280, 511202, 510321, 508792, 507208, 506241, 506257, 507027, 508103, 509624, 512314, 516377, 520921, 525028, 528999, 533942, 540388, 548031, 556675, 566767, 578789, 592577, 607376, 622217, 636115, 648252, 658169, 665704, 670705]
59009F70705K290l40k409l582l923l848l754l561k764j135P76K201L085L988N078
58994F62807N692N191L860K665K164K014J566P30m0n36j091j915k630k945l340
58979F74192m210m717l584j063J110K013K555L752N295O688Q530J1392J4341J5934
58965G32228J6122J5946J5851J5507J4834J3967J2537J0275P984O626N615L413
58953H70905k71m183p464j0487j3585j6210j7803j8462j8430j7822j7065j6592
58941G12531j5974j4390j2143j0496r730q592o279l852k804l110l503l150k266
58928F16242j405q52n52k98m6o8n51j157j402j370j459j627j553j408j583j765
58912E99146j196M2J034J429J848K688L514M047M688N685O604P260Q327J0357
$$ y = [670705, 672995, 672655, 670246, 666664, 662741, 658893, 655139, 651578, 648814, 647679, 648455, 650656, 653741, 657729, 662807, 668499, 673690, 677550, 680215, 682379, 684393, 685959, 686689, 686649, 686113, 685022, 683107, 680477, 677532, 674192, 669982, 665265, 661681, 660618, 661728, 663741, 666296, 670048, 675343, 682031, 690561, 701953, 716294, 732228, 748350, 764296, 780147, 795654, 810488, 824455, 836992, 847267, 855251, 861877, 867492, 870905, 870634, 866451, 858987, 848500, 834915, 818705, 800902, 782440, 764010, 746188, 729123, 712531, 696557, 682167, 670024, 659528, 649798, 641206, 634927, 631075, 628271, 625161, 621658, 618508, 616242, 614837, 613985, 613433, 613135, 613089, 613021, 612470, 611313, 609911, 608541, 607082, 605455, 603902, 602494, 600911, 599146, 597950, 597992, 599026, 600455, 602303, 604991, 608505, 612552, 617240, 622925, 629529, 636789, 645116, 655473]
58898F55473J2860J4872J5912J5916J4909J3262J1719J0623R685Q931R262J1382
58886H04806J4684J7796J9934K1126K1492K1001J9753J7921J5351J1678O941J944
58874I94427k234n087p128r360j2211j5123j7228j8127j7828j6519j4798j3576
58862H45208j3086j2455j0997r438q938r306r336q707q291q586r086r370r664
58849G17948r935r646q812q289q470q584p939o997o591o751o956o983o899o628
58835F08468o126n690n627n760n600m832l535k171j359j369j779j895j444n71
58821E60710N40J614K247K465K990M231N408N522M833M394M462M445M147L902
58807F11910L550K522J014r7n69r56j488j938k476l482m446m507m051m362n534
$$ y = [655473, 668333, 683205, 699117, 715033, 729942, 743204, 754923, 765546, 775231, 784162, 793424, 804806, 819490, 837286, 857220, 878346, 899838, 920839, 940592, 958513, 973864, 985542, 992483, 994427, 992193, 987106, 979978, 970618, 958407, 943284, 926056, 907929, 890101, 873582, 858784, 845208, 832122, 819667, 808670, 799232, 790294, 780988, 771652, 762945, 754654, 746068, 736982, 727612, 717948, 708013, 698367, 689555, 681266, 672796, 664212, 656273, 649276, 642685, 635934, 628978, 621995, 615096, 608468, 602342, 596652, 591025, 585265, 579665, 574833, 571298, 569127, 567768, 566399, 564620, 562725, 561281, 560710, 561250, 562864, 565111, 567576, 570566, 574797, 580205, 585727, 590560, 594954, 599416, 603861, 608008, 611910, 615460, 617982, 618996, 618899, 618330, 617374, 615886, 613948, 611472, 607990, 603544, 599037, 594986, 590624, 585090]
58792E85090o323o280o347o856o738n424l913l020k035k86J366J867J799K497
58778E45397M088N506O058N965N708N566N421M598K384q93l941n964p295q264
58764E64334q434p486o096n143m728m454m112l681l199k910k919k647j422L35
58750E07438J511J941K486L418M008M006M151M748N082M756M371M382M541M895
58736E61734N978P432P938P206O574O932P428P083O248N528M625L293K206J796
58722F42001J342K03j163k208l161m072m176l140j728m83J022K850M092M472M987
58707F40838N887N678L401M23j447k286l173m393n903q218j1291j3713j4541j4692
58693E76570j5154j5134j3672j1698j0672j0171q799o578m690l650l299l770m829
$$ y = [585090, 578767, 572487, 566140, 559284, 552546, 547122, 543209, 540189, 538154, 537868, 539234, 541101, 542900, 545397, 549485, 554991, 561049, 567014, 572722, 578288, 583709, 588307, 590691, 589798, 585857, 579893, 572598, 564334, 555900, 548414, 542318, 537175, 532447, 527993, 523881, 520200, 517001, 514091, 511172, 508525, 507103, 507438, 508949, 510890, 513376, 516794, 520802, 524808, 528959, 533707, 538789, 543545, 547916, 552298, 556839, 561734, 567712, 575144, 583082, 590288, 596862, 603794, 611222, 618305, 624553, 630081, 634706, 637999, 640205, 642001, 643343, 643546, 642383, 640175, 637014, 632942, 628766, 625626, 623898, 623415, 624437, 627287, 631379, 635851, 640838, 646725, 652403, 655804, 656227, 654780, 652494, 649321, 644928, 639025, 630807, 619516, 605803, 591262, 576570, 561416, 546282, 532610, 520912, 510240, 500069, 491270, 484692, 480002, 476352, 473053, 469283, 464454]
58680D64454n180m117l001l366m461m428l132j866j041n4J038J601J852K559L687
58665D44545M816O248Q251R873J0139R678R549R160P226M087J190j191l752o124
58651E13695p056o472n557m916m311l882l953l852k630q62q9o60j580k212k616
58636D63047k482j344K74J377J979K718L472L709L760M179M436L776K874K868
58622D94643L347L069K313K470L648M512M456M069L607K735J806J643K094K291
58608E36703K221K475K707K027O97j56l11l75k90L61Q85J93j265k044j987k182
58592E39659k810k940k385j901j515m31J339K964M373O245Q416R956J0691J1212
58578E82873J1513J1172J0496R943Q869O709M683M382N177N225M543M741O070
$$ y = [464454, 459274, 455157, 452156, 448790, 444329, 439901, 436769, 434903, 433862, 433808, 434846, 436447, 438299, 440858, 444545, 449361, 455609, 463860, 473733, 483872, 493550, 503099, 512259, 519485, 523572, 524762, 523571, 519819, 513695, 506639, 500167, 494610, 489694, 485383, 481501, 477548, 473696, 471066, 470204, 470115, 469455, 467875, 465663, 463047, 460565, 459221, 459495, 460872, 462851, 465569, 469041, 472750, 476510, 480689, 485125, 488901, 491775, 494643, 497990, 501059, 503372, 505842, 509490, 514002, 518458, 522527, 526134, 528869, 530675, 532318, 534412, 536703, 538924, 541399, 544106, 546133, 546830, 546674, 546363, 545988, 545698, 546059, 546944, 547137, 545872, 543828, 541841, 539659, 536849, 533909, 531524, 529623, 528108, 527677, 529016, 531980, 536353, 542598, 551014, 560970, 571661, 582873, 594386, 605558, 616054, 625997, 634866, 641575, 646258, 650640, 655817, 661042, 665585, 670326, 676396]
58565F76396P310Q411J0582J3616J5771J6680J7933K0311K2674K4115K4891K4755
58553H83445K2569J8272J3242Q238K956k066n240o240o457o638o145n000m571
58540I06365n452o692p791r598j2520j5708j8572k1308k3334k3235k1035j8693
58528G22427j7489j6557j4678j1918q858n781l226j911j567j185o18n15p36n83
58514F36805n35j677l383l728k463j364j370j606j562j896k532k346j405j217
58500F09721k042k252j194m12r62j714j499j004j228j678j353k39J070K245L090
58485F00549L574M208N345O359O744P481R567J1967J3111J3707J5451J7651J8108
58472G33822J6900J6047J5509J3066Q406L727j82m811j0048j3141j2851j1288
$$ y = [676396, 683706, 692117, 702699, 716315, 732086, 748766, 766699, 787010, 809684, 833799, 858690, 883445, 906014, 924286, 937528, 945766, 948722, 946656, 941416, 935176, 928719, 922081, 915936, 910936, 906365, 900913, 894221, 886430, 876832, 864312, 848604, 830032, 808724, 785390, 762155, 741120, 722427, 704938, 688381, 673703, 661785, 652927, 647146, 643920, 642009, 640442, 639257, 638639, 638124, 637388, 636805, 636270, 634593, 631210, 627482, 625019, 623655, 622285, 620679, 619117, 617221, 614689, 612343, 610938, 609721, 607679, 605427, 604233, 603821, 602859, 601145, 599646, 598642, 597414, 595736, 594383, 594144, 595214, 597459, 600549, 604123, 608331, 613676, 620035, 626779, 634260, 643827, 655794, 668905, 682612, 698063, 715714, 733822, 750722, 766769, 782278, 795344, 803750, 807477, 807295, 802484, 792436, 779295, 766444, 755156]
58460G55156j0292r106o988m953l394j020K338M812N851P495J0676J3320J3806
58447G77701J3298J2686J0304M979j282o000r331j2331j4351j4352j2986j1370
58435G36965r425p078n291m432l417j655RJ276L066N263O285N976O339Q251J0173
58420G52305J1166J2241J3434J2717R388N527K544o43m406o782o993p239q837
58407G84422r827q725p385p571p766o178m096l457l627l257k807k718j563J327
58393G16772L822M137L605L994M563M188L850M357M161K055k68q98n75n61j39
58378G53063J331K444K295K458L961N050M371L629M426N352M931M657O200Q252
58364H12420R023R251R991J0239R508R941J2809J5689J6105J5230J5080J4915
$$ y = [755156, 744864, 735758, 728770, 723817, 720423, 719403, 721741, 726553, 732404, 739899, 750575, 763895, 777701, 790999, 803685, 813989, 818968, 817686, 811686, 802355, 790024, 775673, 761321, 748335, 736965, 727540, 720462, 715171, 710739, 707322, 705667, 705676, 706952, 710018, 715281, 721566, 727542, 733881, 742132, 752305, 763471, 775712, 789146, 801863, 811251, 816778, 819322, 818679, 814273, 807491, 800498, 793259, 784422, 774595, 765870, 758485, 750914, 743148, 736970, 732874, 729417, 725790, 722533, 719726, 717008, 715445, 716772, 720594, 724731, 728336, 732330, 736893, 741081, 744931, 749288, 753449, 755504, 755236, 754338, 753763, 753202, 753063, 754394, 756838, 759133, 761591, 765552, 770602, 774973, 778602, 783028, 788380, 793311, 797968, 804168, 812420, 821443, 830694, 840685, 850924, 860432, 870373, 883182, 898871, 914976, 930206, 945286, 960201]
58352I60201J3456J1723J0624Q607M775J364J53m83j882j975P62L709M268M269
58338A019571O360R182J0182J0236J1368J2696J2604J2299J3388J4616J4630J4978
58326A162110J6754J7492J5228J2338J1377J0610P758M665L877M013K995K353
58314A271570L801N095M026L010M831P382P629P274R279J2220J3310J3663J5328
58301A378418J6549J5290J3991J5435J7489J7249J6644J8326J9951J8558J6661
58290A564561J7884K0349K0558J9967K1340K2733K1671K1107K4390K8373K8668
58279A811601K7459K8895L1027L0083K8517L0642L4316L5122L4919L7851M1841
58268B172273M2653M2464M5659N0024N1112N1293N5247O0517O2052O2047O5517
$$ y = [960201, 973657, 985380, 996004, 1004611, 1009386, 1010750, 1010903, 1010420, 1008538, 1006563, 1007325, 1011034, 1015302, 1019571, 1025931, 1035113, 1045295, 1055531, 1066899, 1079595, 1092199, 1104498, 1117886, 1132502, 1147132, 1162110, 1178864, 1196356, 1211584, 1223922, 1235299, 1245909, 1253667, 1258332, 1262209, 1266222, 1269217, 1271570, 1275371, 1280466, 1284492, 1287502, 1292333, 1299715, 1307344, 1314618, 1323897, 1336117, 1349427, 1363090, 1378418, 1394967, 1410257, 1424248, 1439683, 1457172, 1474421, 1491065, 1509391, 1529342, 1547900, 1564561, 1582445, 1602794, 1623352, 1643319, 1664659, 1687392, 1709063, 1730170, 1754560, 1782933, 1811601, 1839060, 1867955, 1898982, 1929065, 1957582, 1988224, 2022540, 2057662, 2092581, 2130432, 2172273, 2214926, 2257390, 2303049, 2353073, 2404185, 2455478, 2510725, 2571242, 2633294, 2695341, 2760858]
58257B760858P0174P0860O9880P2496P6174P5141P1634P1688P3766P2891P1778
58246C557340P6100Q2841Q5466Q6494R2601J01597J07118J11673J21582J33681
58236D556493J40940J46553J57896J71522J79511J85574J98762K16218K29086
58227F182555K40358K59087K82134L00295L17305L43220L74349M00380M25826
58218I125509M62632N07331N48654N91697O49847P19126P87052Q60453R56114
58209A5208415J070810J191341J327089J499476J707061J937666K207072K546520
58201B8695450K962288L452761M054053M816597N749004O846924Q168614R817522
58193G4563213J1870068J4405741J7583140K1563161K6352750L1813639L7673977
$$ y = [2760858, 2831032, 2901892, 2971772, 3044268, 3120442, 3195583, 3267217, 3338905, 3412671, 3485562, 3557340, 3633440, 3716281, 3801747, 3888241, 3980842, 4082439, 4189557, 4301230, 4422812, 4556493, 4697433, 4843986, 5001882, 5173404, 5352915, 5538489, 5737251, 5953469, 6182555, 6422913, 6682000, 6964134, 7264429, 7581734, 7924954, 8299303, 8699683, 9125509, 9588141, 10095472, 10644126, 11235823, 11885670, 12604796, 13391848, 14252301, 15208415, 16279225, 17470566, 18797655, 20297131, 22004192, 23941858, 26148930, 28695450, 31657738, 35110499, 39164552, 43981149, 49730153, 56577077, 64745691, 74563213, 86433281, 100839022, 118422162, 139985323, 166338073, 198151712, 235825689]
58186B35825689M3107393M6151161M4070783L5098331K0161782K732354j3239335
58179D13908158k5352190l3139536l7162989l8169016l6888914l4079091l0431823
58172A78684599k6467024k2550182j8939077j5773525j3081649j0841358r018149
58165F2013635p551178o358687n379541m582821l934895l391765k928263k542510
58157B5343975k225995j956782j724295j532831j377258j240513j117274j015563
58149A3153464r32716q53149p72174o99719o38323n78656n18937m68074m26903
58140G264813l85718l43148l09173k86876k68475k51466k41545k37287k28726
58131D712399k13979k01564j93859j83526j68793j57096j50562j42287j30106
$$ y = [235825689, 278933082, 325084243, 369155026, 404253357, 424415139, 427147493, 413908158, 388555968, 355416432, 318253443, 280084427, 243195513, 209116422, 178684599, 152217575, 129667393, 110728316, 94954791, 81873142, 71031784, 62013635, 54462457, 48103770, 42724229, 38141408, 34206513, 30814748, 27886485, 25343975, 23117980, 21161198, 19436903, 17904072, 16526814, 15286301, 14169027, 13153464, 12220748, 11367599, 10595425, 9895706, 9257383, 8678727, 8159790, 7691716, 7264813, 6879095, 6535947, 6226774, 5939898, 5671423, 5419957, 5178412, 4941125, 4712399, 4498420, 4296856, 4102997, 3919471, 3750678, 3593582, 3443020, 3300733, 3170627]
58122C170627j20480j15583j09626j00915r5068r3231q9256q1432p5477p3139
58112B216420o9204o2432n8296n8090n6136n0589m6681m6424m5242m1426l9194
58101A642706l9719l8717l5369l4292l6209l5965l2204k9930l0970l0920k8021
58090A270390k6204k6778k5760k2091k0020k0753k0052j6734j5320j7475j8920
58079A040283j7611j7118j9061j9929j8336j7861j9781k0344j8152j6981j8355
58068H36754j8452j5466j3039j3253j3009j0525q850r662r903p831o436p634q898
58055F93796q564q862j0876j2047j1358j1396j2713j1959q157n198n315n720m380
58042E77251l599m920n945n104m551n562o100n342n549p092o923m445l469n762
$$ y = [3170627, 3050147, 2934564, 2824938, 2724023, 2628955, 2535724, 2446468, 2365036, 2289559, 2216420, 2147216, 2084784, 2026488, 1968398, 1912262, 1861673, 1814992, 1768568, 1723326, 1681900, 1642706, 1602987, 1564270, 1528901, 1494609, 1458400, 1422435, 1390231, 1360301, 1329331, 1298411, 1270390, 1244186, 1217408, 1191648, 1169557, 1149537, 1128784, 1108732, 1091998, 1076678, 1059203, 1040283, 1022672, 1005554, 986493, 966564, 948228, 930367, 910586, 890242, 872090, 855109, 836754, 818302, 802836, 789797, 776544, 763535, 753010, 744160, 734498, 724595, 716764, 710328, 702694, 693796, 685232, 676370, 665494, 653447, 642089, 630693, 617980, 606021, 597864, 592666, 587351, 581631, 577251, 573652, 568732, 562787, 557683, 553132, 547570, 541470, 536128, 530579, 523487, 516564, 512119, 508650, 502888]
58028E02888q045q063q099r687j0334q663p466q328q494o363m963o357p604n987
58014C94435l641l172l113j608l97j284k459j989j400k277k870j440L30N20K48
57999C69883P97Q95k44o01J032K432J758N63L74j62j937k894j849j168k670m343
57983C61866m158l642m534n352m501l528l987m289k875j390j544j861p77P7r96
57968C18509k251j441L53J016R48J297J270J73l38R90K423K135J134P87J25j677
57952C25453l026k817k764m045m634k884p51m17o66K63J224R57J264L762O280
57937C17199O321N568O940R533J0465R850R839J0398R827Q198O763N266K948Q81
57923D19996J96m15k466m657n103m845n940p715q196p661p558p414o102m779n213
$$ y = [502888, 494843, 486780, 478681, 468994, 458660, 449997, 442531, 434203, 425709, 419346, 414383, 408026, 400422, 394435, 390794, 387622, 384509, 382901, 382504, 381220, 378761, 376772, 375372, 373095, 370225, 368785, 369115, 369635, 369883, 370680, 371575, 371331, 370730, 371762, 374194, 375952, 376515, 376889, 376727, 374790, 371896, 370047, 368879, 366209, 361866, 357708, 354066, 349532, 344180, 339679, 336151, 332164, 327875, 325000, 323610, 322066, 320205, 319428, 319505, 318509, 316258, 314817, 315170, 316186, 317134, 318431, 319701, 319874, 319536, 320526, 322949, 325084, 326218, 327005, 327130, 325453, 322427, 319610, 316846, 312801, 308167, 305283, 304532, 304115, 303449, 303712, 304936, 305893, 307157, 310919, 317199, 323520, 329088, 336028, 345561, 356026, 365876, 375715, 386113, 395940, 404138, 410901, 416167, 419115, 419996, 420192, 419777, 417311, 412654, 407551, 402706, 396766, 389051, 380855, 373194, 365636, 358222, 352120, 347341, 342128]
57908C42128o404o087m417l185k602j892j776l202m799m715l855m190n073m427
57894B85504k556j551j703j599j038q15m40J098K862L164K497K599L380L472L002
57879B97876L017K983J670j39p06m34j127k638l115k177j201p22q2O05M98k10
57863B94098o38r36j685k230j593l44N13J432L061M223L598K354K434L259K802
57848C10348J144Q2j30q05k024k576k423k640l147k959k424k797l853m246m010
57833B77540m266m791m280k809j771j462r38q9K64J71M28R17R43Q99J589K446
57817B64791K370J845K170L165L643L467L036J583j589m914o232o056o561p811
57803B52907p804o015m051k721j205O22J595J406J125J233J127Q25J159K042K421
$$ y = [342128, 335724, 329637, 325220, 322035, 319433, 317541, 315765, 312563, 307764, 303049, 299194, 295004, 289931, 285504, 282948, 281397, 279694, 278095, 277057, 276242, 275802, 276900, 279762, 282926, 285423, 288022, 291402, 294874, 297876, 300893, 303876, 305546, 305407, 304701, 304267, 303140, 300502, 297387, 295210, 294009, 293287, 293205, 293810, 294308, 294098, 293460, 292524, 290839, 288609, 287016, 286672, 287185, 288617, 291678, 295901, 299499, 301853, 304287, 307546, 310348, 311492, 311574, 311444, 310639, 308615, 306039, 303616, 300976, 297829, 294870, 292446, 289649, 285796, 281550, 277540, 273274, 268483, 264203, 261394, 259623, 258161, 257223, 257134, 257398, 257569, 257997, 258914, 259857, 260756, 262345, 264791, 267161, 269006, 271176, 274341, 277984, 281451, 284487, 286070, 284481, 279567, 273335, 267279, 260718, 252907, 245103, 239088, 235037, 232316, 231111, 231733, 233328, 234734, 235859, 237092, 238219, 239044, 240203, 242245, 244666]
57788B44666K088J811J699J176M16Q0j22p38r66K56K010K491J884J888K656K752
57772B64047J989J782K442K592J550J11j325l190n053n654n003m535m797m899
57758B40057m441m109m084l782l354l511l737k578j6K368L803M995O153O417N672
57743B39853N015M903M518L436K348J671Q81l30j532k370k818k656j907j426j799
57728B47787k166j585p90q43r21L13J912J797K69l45M62P71l28j353j206p38p86
57711B42250q28m37k89p86j431k084l235m537m789l773k536j566k91J327K357
57696B19352K454K255K066J735J688K357K655J042j879l872m230m227m367l530
57682B13499j393O17J487J878K663M012O262R833J3903J7190K0410K5896L4385
$$ y = [244666, 246754, 248565, 250264, 251440, 251856, 251936, 251814, 251076, 250110, 250366, 252376, 254867, 256751, 258639, 261295, 264047, 266036, 267818, 270260, 272852, 274402, 274513, 273188, 269998, 264945, 259291, 254288, 249753, 244956, 240057, 235616, 231507, 227423, 223641, 220287, 216776, 213039, 210461, 210445, 212813, 216616, 221611, 227764, 234181, 239853, 244868, 249771, 254289, 257725, 260073, 261744, 262625, 262295, 260763, 258393, 255575, 252919, 251012, 249586, 247787, 245621, 244036, 243246, 242403, 241482, 241795, 243707, 245504, 245773, 245428, 245890, 246661, 246333, 244980, 243774, 243036, 242250, 241422, 240985, 240696, 239910, 238479, 236395, 233160, 228623, 223834, 220061, 217525, 215959, 215668, 216995, 219352, 221806, 224061, 226127, 227862, 229550, 231907, 234562, 235604, 233725, 229853, 225623, 221396, 217029, 213499, 212106, 212723, 214210, 216088, 218751, 222763, 229025, 238858, 252761, 269951, 290361, 316257, 350642]
57669C50642M4324N4867O7150Q1384R4205R9737R2342O9080L2269r661m6204p1141
57657H58994q4228q7553q2943p3108o1940n1907m2913l4586k7707k2652j8514
57646B70943j4820j2174j0473q440n847m015l381k647j277o16j336k040j643j081
57632B01153j249j237j57J082J346J042Q82L84r64k389l000l121l275l146k564
57617A84787k252k542k628k080j756k281k881k688j968j272o20k33o45j392j119
57602A58430L10J290Q41j06n16p06j168j570j823k538l624l962l271k697k806
57587A36084k758k100j605j599j331q10j171k395k787j730p83r99j334j002j038
57572A12642k070k728j941p95m66l02L73M56r39k527k767k148j739j199p4N31
$$ y = [350642, 394966, 449833, 516983, 598367, 692572, 792309, 884651, 953731, 986000, 976339, 930135, 858994, 774766, 687213, 604270, 531162, 469222, 417315, 374402, 339816, 312109, 289457, 270943, 256123, 243949, 233476, 225036, 219189, 215174, 211793, 209146, 207869, 207253, 205917, 203877, 202234, 201153, 199904, 198667, 198510, 199592, 200938, 201980, 202862, 203246, 202282, 199893, 196893, 193772, 190497, 187351, 184787, 182535, 179993, 177365, 175285, 173529, 171248, 168367, 165679, 163711, 162439, 161819, 161586, 160941, 159549, 158430, 158740, 160030, 160871, 160765, 160249, 159543, 158375, 156805, 154982, 152444, 148820, 144858, 141587, 138890, 136084, 133326, 131226, 129621, 128022, 126691, 125881, 124710, 122315, 119528, 117798, 117015, 116016, 114682, 113680, 112642, 110572, 107844, 105903, 105108, 104642, 104340, 104713, 105169, 104230, 101703, 98936, 96788, 95049, 93850, 93776, 94307]
57556I4307l69j668j809j080m89J84J386K227J864J195J317J499O04o83r60l90
57540I7135n0J5L94R45J427K352L718M138K801R95J04m50j483j974q86M00n5j568
57522A07958j894o87M61P22O07K96m24r96o16L38R53J255J649J680R58L59O83
57505A13302J062M01n64n19J01Q2k70Q9O90K81q20j287j272k073l653m490l887
57488I7173k626j529r13j118k050k520j585m7P41Q53J077J114K97p05q30n87j146
57471H5599k089k107j357j132j617j978k159k594k583j130Q96J578P43q5k11k82
57455F9492m52j99R5n27j644j793q39r7m8J56P55Q92K98k24k70j93R3J028K095
57436F8618K143J203L84Q1j88k94L34J118Q02l33n95M90J404R22l98j438j800
$$ y = [94307, 93938, 92270, 90461, 89381, 88892, 89076, 90462, 92689, 94553, 95748, 97065, 98564, 99168, 98485, 97525, 97135, 97085, 97100, 97494, 98439, 99866, 102218, 105936, 110074, 112875, 113870, 113974, 113524, 112041, 110067, 109181, 109581, 109526, 107958, 106064, 105377, 105838, 106560, 107167, 107463, 107039, 106043, 105427, 105765, 106718, 107973, 109622, 111302, 112260, 112619, 113302, 114364, 114765, 114201, 113682, 113783, 113865, 113595, 113684, 114374, 114655, 113835, 112548, 111276, 109203, 105550, 101060, 97173, 94547, 93018, 92105, 90987, 88937, 86417, 84832, 84785, 85526, 86379, 87456, 88570, 88867, 88162, 87332, 86745, 85599, 83510, 81403, 80046, 78914, 77297, 75319, 73160, 70566, 67983, 66853, 67749, 69327, 70070, 69985, 69774, 69492, 69040, 68841, 68936, 68409, 66765, 64972, 64133, 64036, 63988, 64144, 64899, 65791, 66089, 65865, 65595, 65402, 65495, 66523, 68618, 70761, 71964, 72348, 72429, 72241, 71947, 72281, 73399, 74201, 73868, 73273, 73763, 75167, 76089, 75691, 74253, 72453]
57419G2453j533p61J8L40N44J081J418Q37q1k20J96J47j48L65J394J518O01n2
57401G8117l9l65j323j846j463j056j155j114n28N7L05N59P78M59r8L9Q07J225
57383G3359J307K110L572M167L303K272K048J901J074K67K42L45l93j655k472
57368I1447k696k827k910k522j608o87k99m56o34l70J0k59j088j391q06m85j167
57351G1252j603m02J544K271J690J369J809J976J417Q17M15k43q24m09O34Q13
57335H2526j34p84k75N77Q29N62J02m62p18k24L88kj213j936j717j291j000m86
57317G4742K0j66o89n32R7K8o78o78L03J063J059J031J133N17p80j515j305j128
57299G2522j245p07N55J183P48N66J291J638O37o68q76j52N93J075J287J029N68
$$ y = [72453, 70920, 70159, 70177, 70517, 71061, 72142, 73560, 74397, 74316, 74096, 74292, 74439, 74291, 74656, 76050, 77568, 78169, 78117, 78078, 77713, 76390, 74544, 73081, 72025, 70870, 69756, 69228, 69285, 69590, 70149, 70927, 71386, 71288, 71327, 72134, 73359, 74666, 76776, 80348, 84515, 87818, 90090, 92138, 94039, 95113, 95380, 95622, 95967, 95574, 93919, 91447, 88751, 85924, 83014, 80492, 78884, 78197, 77898, 77442, 76808, 76438, 76448, 76189, 75101, 73710, 72904, 72419, 71252, 69649, 69247, 70791, 73062, 74752, 76121, 77930, 79906, 81323, 82140, 82555, 82312, 81488, 81079, 81713, 82526, 82392, 81608, 81333, 81910, 82739, 83301, 83403, 82941, 82223, 81999, 82387, 82385, 81172, 79236, 77519, 76228, 75228, 74742, 74762, 74596, 73907, 73375, 73472, 73500, 72822, 72144, 72447, 73510, 74569, 75600, 76733, 77250, 76470, 74955, 73650, 72522, 71277, 70570, 71125, 72308, 73056, 73622, 74913, 76551, 77188, 76520, 75644, 75492, 76085, 77160, 78447, 79476, 80044]
57282H0044N77R50R05N21O25R60L59r42j217r7O92J81m03q7J93l50o77K25J513
57263H3972J992J941K041J928J178N08O04R07O53P2l96q85j283r20J31P47N38
57246I3728M72J015J263P62M34P26O58j82n33L82J327J104M87N72Q22L85j9O91
57228A04094J999K604K338J913J626J509J834K412K405J716J446K043K441J921
57214A32301J427J865K535K518K261K502K961L208L581M120M022L236L027L870
57200A73434M406L777L156L562M052L757L873N632P913Q893Q795R002R706J0417
57186B60375J1561J3510J5150J5344J4823J4831J4976J4356J3677J4115J5056
57175D17774J5102J4517J4662J5600J6213J6077J5504J4376J2736J1688J2055
$$ y = [80044, 80621, 81571, 82476, 82997, 83622, 84582, 84941, 83999, 82782, 82685, 83377, 83558, 83155, 83068, 83261, 82911, 82234, 82459, 83972, 85964, 87905, 89946, 91874, 93052, 93560, 94164, 95071, 95724, 95796, 95400, 94515, 93232, 92312, 92443, 93190, 93728, 94200, 95215, 96478, 97240, 97674, 98400, 99058, 98876, 98343, 98725, 100052, 101156, 101643, 102215, 103037, 103422, 103403, 104094, 106093, 108697, 111035, 112948, 114574, 116083, 117917, 120329, 122734, 124450, 125896, 127939, 130380, 132301, 133728, 135593, 138128, 140646, 142907, 145409, 148370, 151578, 155159, 159279, 163301, 166537, 169564, 173434, 177840, 181617, 184773, 188335, 192387, 196144, 200017, 205649, 213562, 222455, 231250, 240252, 249958, 260375, 271936, 285446, 300596, 315940, 330763, 345594, 360570, 374926, 388603, 402718, 417774, 432876, 447393, 462055, 477655, 493868, 509945, 525449, 539825, 552561, 564249, 576304]
57164E76304J2860J2886J2776J3728J5081J5338J4826J5120J6380J7344J7611
57153G40254J7892J8263J8094J7525J7317J7421J7194J6653J6170J5448J4256
57142I26487J3484J3920J4684J4559J4062J4432J5298J5343J4734J4852J5959
57131A087814J7074J7882J8965K0315K1296K1987K3035K4469K6011K8124L1375
57120A338347L5229L8919M2912M8051N4021O0050O6404P3638Q1140Q8106R5177
57109B021994J03468J12830J22802J34394J49166J67404J89001K15274K48226
57100C464559K89139L39809M04138M86465N89214P13739Q61796J033963J227902
57091I410724J440111J667518J904763K141829K366740K568571K736038K857595
$$ y = [576304, 589164, 602050, 614826, 628554, 643635, 658973, 673799, 688919, 705299, 722643, 740254, 758146, 776409, 794503, 812028, 829345, 846766, 863960, 880613, 896783, 912231, 926487, 939971, 953891, 968575, 983134, 997196, 1011628, 1026926, 1042269, 1057003, 1071855, 1087814, 1104888, 1122770, 1141735, 1162050, 1183346, 1205333, 1228368, 1252837, 1278848, 1306972, 1338347, 1373576, 1412495, 1455407, 1503458, 1557479, 1617529, 1683933, 1757571, 1838711, 1926817, 2021994, 2125462, 2238292, 2361094, 2495488, 2644654, 2812058, 3001059, 3216333, 3464559, 3753698, 4093507, 4497645, 4984110, 5573324, 6287063, 7148859, 8182822, 9410724, 10850835, 12518353, 14423116, 16564945, 18931685, 21500256, 24236294, 27093889]
57083B7093889K926288K937101K869658K678184K315719J778307J121082M26011
57075D4146239k43791q59375j409647j883168k265105k542710k710032k770712
57067B9461699k738321k632464k473313k279334k067538j852405j644027j448454
57059A2325843j269548j109473r68356q45150p38786o47907n70434n04441m48782
57050E222966m02179l62634l28515k99188k73944k51430k30839k12358j95654
57041B666225j79310j62627j46574j32043j18521j05436r3311q2538p2413o2466
57031A510986n3247m4659l5092k3540j0768L141K0127M0015N5992N7586L9365
57020A559906N666l2983o6611q9542j00419j00788r3694q2598p0668o0075n1379
$$ y = [27093889, 30020177, 32957278, 35826936, 38505120, 40820839, 42599146, 43720228, 44146239, 43902448, 43043073, 41633426, 39750258, 37485153, 34942443, 32232411, 29461699, 26723378, 24090914, 21617601, 19338267, 17270729, 15418324, 13774297, 12325843, 11056295, 9946822, 8978466, 8133316, 7394530, 6746623, 6176189, 5671748, 5222966, 4820787, 4458153, 4129638, 3830450, 3556506, 3305076, 3074237, 2861879, 2666225, 2486915, 2324288, 2177714, 2045671, 1927150, 1821714, 1728403, 1645865, 1573452, 1510986, 1457739, 1413080, 1377988, 1354448, 1343680, 1346821, 1366948, 1406963, 1462955, 1520541, 1559906, 1565572, 1532589, 1465978, 1376436, 1276017, 1175229, 1081535, 998937, 928269, 868194, 816815]
57009H16815m3929l7226l1647k7646k4914k2704k0594j8525j6572j4941j3750
56998E44367j2696j1444j0412j0314j0869j0829r598p884o478n244l726j879K91
56985D43285K991O132R043J0987J1360R467M982j188p324j2247j5646j7283j7063
56972D27496j5787j4594j3492j1694r295p261n663l505o05J949L654N412P938
56959C64553J0799J3653J6884K0242K2019K0490J5309P177k621j1940j8546k1923
56947D36096k3258k3226k1167j6985j2298q765o501m827l388j755Q07M313P845
56934C26891J0992J4482J8841K3549K7774L0500K9654K3058J1272j991j3253k1687
56922D80082k7607l0484k9905k7051k3697k0617j7953j5987j4529j2634r963p490
$$ y = [816815, 772886, 735660, 704013, 676367, 651453, 628749, 608155, 589630, 573058, 558117, 544367, 531671, 520227, 509815, 499501, 488632, 477803, 468205, 460321, 453843, 448599, 444873, 442994, 443285, 446276, 452408, 461451, 472438, 483798, 493265, 498247, 497059, 489735, 477488, 461842, 444559, 427496, 411709, 397115, 383623, 371929, 362634, 355373, 349710, 346205, 345600, 347549, 351203, 356615, 364553, 375352, 389005, 405889, 426131, 448150, 468640, 483949, 491126, 488505, 476565, 458019, 436096, 412838, 389612, 368445, 351460, 339162, 330397, 323896, 319069, 315681, 313926, 314733, 319046, 326891, 337883, 352365, 371206, 394755, 422529, 453029, 482683, 505741, 517013, 515022, 501769, 480082, 452475, 421991, 392086, 365035, 341338, 320721, 302768, 286781, 272252, 259618, 249655, 242165]
56910B42165n973m939l943l494l778l899l392l123l547l540k262p66l26l17O55
56895A99521K571M339N532O455P300Q413J0566J3859J7176J9641K1572K3046K2730
56882C62721J9408J3612O578j117q704j4278j6414j5869j4290j2091q973n475
56870C05108k474J48K971N966R135J3369J9233K5789L2026L8553M6319N4217N9294
56857F09654N8844N1346L6509J6142n563k4105l7026m3818m4767m1149l5387k9360
56845E11320k3053j5865q275j056O047J3472K0775K7886L6293M7320O0205P3283
56833G48352Q5640R5423R7784Q7405O3352K9947o532m0286o6282q1334q5821q2873
56821H44775p5500o5423n4140m3229l3302k4056j5414p572j47P515J5475K3762
$$ y = [242165, 236192, 231253, 227310, 223816, 220038, 216139, 212747, 209624, 206077, 202537, 200275, 199509, 199183, 198866, 199521, 202092, 206431, 211963, 218418, 225718, 234131, 244697, 258556, 275732, 295373, 316945, 339991, 362721, 382129, 395741, 402319, 401202, 392498, 378220, 361806, 345937, 331647, 319556, 310583, 305108, 302634, 302782, 305753, 311719, 320854, 334223, 353456, 379245, 411271, 449824, 496143, 550360, 609654, 668498, 719844, 756353, 772495, 766932, 742827, 705801, 661983, 617216, 576067, 540680, 511320, 488267, 472402, 464127, 463071, 469118, 482590, 503365, 531251, 567544, 614864, 675069, 748352, 833992, 929415, 1027199, 1114604, 1177956, 1207903, 1201371, 1161085, 1094803, 1013469, 927648, 844775, 769275, 703852, 649712, 606483, 573181, 549125, 533711, 526139, 525992, 533507, 548982, 572744]
56809E72744L3318M4935N7305O7165P1034O6058N0498K5510l779l0771n1275o4284
56797H38458p0039o9281o3944n6533m8439l9939l1562k4105j7590j1610o357j994
56785C97065K540Q480J5400K1885K7606L2843L6265L5147K8041J5848N35j5555
56773F06100k9336l8049m1337m1020l8793l5314l1324k7802k4774k1471j7955
56762B58925j5227j3601j2275j0726r185p671n862m140l431l777m199m074l510
56749A61247k530j152k20o73j922k364j604q42q86j252j388j457j460r66o9M31
56733A42893K33p3j08k01n23o95n01k62k48l78m77l09M97J795K664K504J888J553
56715A50252J225N43K44J044K057J919R74O57J168J515J570K131L088L312K535
$$ y = [572744, 606062, 650997, 708302, 775467, 846501, 912559, 963057, 988567, 984788, 954017, 902742, 838458, 768419, 699138, 635194, 578661, 530222, 490283, 458721, 434616, 417026, 405416, 399059, 397065, 399605, 408085, 423485, 445370, 472976, 505819, 542084, 577231, 605272, 621120, 621655, 606100, 576764, 538715, 497378, 456358, 417565, 382251, 350927, 323125, 298351, 276880, 258925, 243698, 230097, 217822, 207096, 197911, 190240, 184378, 180238, 176807, 173030, 168831, 164757, 161247, 158717, 157565, 157345, 156672, 154750, 152386, 150782, 149940, 149054, 147802, 146414, 144957, 143497, 142531, 142462, 142893, 143126, 143053, 142945, 142744, 142221, 141526, 141025, 140763, 140515, 140137, 139660, 139351, 139848, 141643, 144307, 146811, 148699, 150252, 151477, 152020, 152264, 153308, 155365, 157284, 158258, 158915, 160083, 161598, 163168, 165299, 168387, 171699, 174234]
56700A74234J622R07l4r35q85n3L17r0k77J43K65l97j047j019p65r02j286j523
56682A68275j435q29L15J351J596J349J286J193M60m92p23l81l61o23l98J56J82
56665A70921k01j47K01Ol84J78J401J781J194J110J992K582K362K549L824M952
56649A94321M644L257J726L16q28j194q26n65p42p55l86k37m62l62K90P74P15
56632A99686N53L85l68j672k586k650k390k216k013j973k479l015k599j428p22
56617A74513p65p16l83m89j030j143q46j078j732j562m29L19J63J41P21R59M61
56600A67104K22O90Q72K45k01K29P56O58L70K66j12p60p56R2O89N48O25J437K021
56581A74995J580O30k47j193j946j608l26M80L41M28J241J630J020O21J293K104
$$ y = [174234, 175856, 176763, 176729, 175794, 174909, 174856, 175173, 175083, 174806, 174949, 175214, 174817, 173770, 172751, 171986, 171084, 169798, 168275, 166840, 166011, 166326, 167677, 169273, 170622, 171908, 173101, 173561, 173069, 172346, 171965, 171604, 170981, 170583, 170739, 170921, 170720, 170573, 170774, 170780, 170396, 170574, 171975, 173756, 174950, 176060, 178052, 180634, 182996, 185545, 189369, 194321, 198965, 202222, 203948, 204264, 203436, 202242, 201416, 200851, 200109, 199354, 198968, 198731, 198269, 197907, 198197, 198971, 199686, 200239, 200624, 200256, 198584, 195998, 193348, 190958, 188742, 186729, 184756, 182277, 179262, 176663, 175235, 174513, 173748, 173032, 172649, 172160, 171130, 169987, 169141, 168063, 166331, 164769, 164340, 164659, 164822, 164963, 165684, 166643, 167104, 167326, 168016, 168888, 169133, 168932, 169161, 169917, 170575, 170945, 171211, 171099, 170339, 169583, 169675, 170364, 170912, 171537, 172974, 174995, 176575, 177205, 176958, 175765, 173819, 172211, 171885, 172365, 172706, 173134, 174375, 176005, 177025, 177646, 178939, 181043]
56565A81043K305K915M837P058Q252Q848J0065J2038J4045J5431J5321J2732Q054
56552C02944L242k80k642m054m055k994k347k587k547j846j879l246m319l868
56538B69522l081l342l815l150j989j878k899m100n071n658n280l969k936k796
56524B19558k537j436m17k74j99M41N62p13k191k421j937j924k051j490p80q05
56508B01386j088q75p64j478k139j650o51l83n69k44K73J13l57k27K73L29R3J12
56490A92154J14l06o21l73j76m42l27N77R44k04j467j054L57Q25K58J43Q61J295
56472A92558Q83K43j0K66J108K145K460J777J073J117J328J011N77M57J10p20
56456B06383j060k97O29Q07P28R02O84j37l83M06P56j56p34L14J443P97n82n72
$$ y = [181043, 183348, 186263, 191100, 198158, 206410, 215258, 225323, 237361, 251406, 266837, 282158, 294890, 302944, 306186, 305906, 303264, 299210, 295155, 292161, 289814, 287227, 284680, 282834, 280955, 277709, 273390, 269522, 266441, 263099, 259284, 256134, 254145, 252267, 249368, 245268, 240197, 234539, 229259, 225290, 222354, 219558, 217021, 215585, 215168, 214894, 214695, 215136, 215698, 214985, 212794, 210373, 208436, 206512, 204461, 202971, 202191, 201386, 200298, 199423, 198659, 197181, 195042, 193392, 192741, 192358, 191789, 191545, 191818, 191931, 191574, 191347, 191620, 191949, 192042, 192154, 192268, 191962, 191341, 190968, 190792, 190350, 190023, 190600, 191544, 191340, 189873, 188819, 189176, 190001, 190259, 190402, 191263, 192558, 193441, 193684, 193674, 193940, 195048, 197193, 199653, 201430, 202503, 203620, 204948, 205959, 206536, 206993, 207103, 206383, 205323, 205026, 205655, 206462, 207190, 208092, 208776, 208639, 208256, 208662, 209418, 209262, 208528, 208842, 210285, 211082, 210500, 209928]
56438B09928N72J210J312J748J871N80j144j511q68p66j055n36K78q0j136j052
56422B09351J94Q46L11l59p27j331j948j674o93L8N04J236J695J085K04L67J068
56405B10167R57M82J166K630K893J544K37j0J93M42J191K287K696K047J027K42
56389B30191o2N18J979L217L257K672K503K573K296K126K649L235L191L119L368
56374B66832K614O2k409k737j960k354l467l144j518q16j513j836r89o5M02J113
56358B48215K020K006R32l4k60j37J35O04P43K75J61J116J995J515N00M35R49
56341B61170R54R88J922K628J702K78K88J046P61J74J245L204L567K494K336L237
56325B87994L031J478Q22J808K631K339K021K180J903J163J008J246O80k90j20
$$ y = [209928, 210500, 211710, 213022, 214770, 216641, 217221, 216077, 214566, 213698, 212932, 211877, 211341, 211619, 211539, 210403, 209351, 209545, 210391, 210702, 210343, 209616, 208285, 206337, 204663, 203970, 204008, 204512, 205748, 207443, 208528, 208732, 209099, 210167, 211124, 211606, 212772, 215402, 218295, 219839, 220076, 220066, 220259, 220701, 221892, 224179, 226875, 228922, 229949, 230191, 230129, 230647, 232626, 235843, 239100, 241772, 244275, 246848, 249144, 251270, 253919, 257154, 260345, 263464, 266832, 269446, 269508, 267099, 264362, 262402, 260048, 256581, 253437, 251919, 251103, 249590, 247754, 246765, 246700, 247102, 248215, 250235, 252241, 253173, 253139, 252879, 252742, 252877, 253481, 254224, 254499, 254660, 255776, 257771, 259286, 259786, 260221, 261170, 262124, 263112, 265034, 267662, 269364, 269642, 269930, 270976, 271737, 271911, 273156, 276360, 279927, 282421, 284757, 287994, 291025, 292503, 293325, 295133, 297764, 300103, 302124, 304304, 306207, 307370, 308378, 309624, 310304, 310014, 309894]
56310C09894Q61R01J60M03J456J391K74K67J695K564K445L277N568P224P067O325
56294C51772N770M446K278R23J103J652J952K683L671L733L191L717N297O193
56280C98381O189O842Q232Q622P884P938R230J0035R848J0293J1902J3202J3705
56267E22303J4669J6223J6973J7070J8412K1121K3193K4300K6461L0220L3735
56256G64680L6554M0660M6706N2840N8485O5695P5454Q6069R6468J07633J19386
56245A550630J29401J36874J43842J51242J57008J59594J59873J57873J51129
56236B897466J38217J20889J00738P6861M8838J9140r417l6216o1158q2993j00920
56225C111445j15532j26914j34094j37360j38532j38162j35175j29883j24269
$$ y = [309894, 310755, 311656, 311816, 312219, 313675, 315066, 315340, 315607, 317302, 319866, 322311, 325588, 331156, 338380, 345447, 351772, 357542, 361988, 364266, 365189, 366292, 367944, 369896, 372579, 376250, 379983, 383174, 386891, 392188, 398381, 404570, 411412, 419644, 428266, 436150, 444088, 453318, 463353, 473201, 483494, 495396, 508598, 522303, 536972, 553195, 570168, 587238, 605650, 626771, 649964, 674264, 700725, 730945, 764680, 801234, 841894, 888600, 941440, 999925, 1065620, 1141074, 1227143, 1323611, 1431244, 1550630, 1680031, 1816905, 1960747, 2111989, 2268997, 2428591, 2588464, 2746337, 2897466, 3035683, 3156572, 3257310, 3334171, 3383009, 3402149, 3392732, 3356516, 3295358, 3212365, 3111445, 2995913, 2868999, 2734905, 2597545, 2459013, 2320851, 2185676, 2055793, 1931524]
56216A931524j18648j11415j02802r5306q9496q3108p5414o8638o3799n9034n3430
56205A010434m8696m5492m1884l7114l3146l0878k8426k4842k1879k0441j8906
56194F58730j6569j4996j4460j2903j0016q366q788q767p034n618n507m610k063
56181E39033k80n79r47k13j68j376j326R26K596J984J122J354Q53r95j387R65
56165E41562L213L328L178M094M158K736K826N768Q403Q699R243J1797J3515J2329
56151F34849J1294J3425J6778J8709K0608K4391K8586L1965L6925M5343N5136
56140I38009O4515P5122Q7296R7035J01552J02902J02155R5473Q0921O4073N1577
56129A860630M3684L8104L6010L8314M0426L7085K9139K0295J0951N58p910j1785
$$ y = [1931524, 1812876, 1701461, 1598659, 1503353, 1413857, 1330749, 1255335, 1186697, 1122898, 1063864, 1010434, 961738, 916246, 874362, 837248, 804102, 773224, 744798, 719956, 698077, 677636, 658730, 642161, 627165, 612705, 599802, 589786, 581420, 572632, 563865, 556831, 551213, 545706, 541096, 539033, 538753, 538174, 537227, 537014, 536846, 535470, 534144, 535070, 537666, 539650, 540772, 542126, 542979, 541984, 540597, 541562, 544775, 548103, 551281, 555375, 559533, 562269, 565095, 570863, 579266, 587965, 597208, 609005, 622520, 634849, 646143, 659568, 676346, 695055, 715663, 740054, 768640, 800605, 837530, 882873, 938009, 1002524, 1077646, 1164942, 1261977, 1363529, 1466431, 1568586, 1664059, 1744980, 1809053, 1860630, 1904314, 1942418, 1978428, 2016742, 2057168, 2094253, 2123392, 2143687, 2154638, 2155196, 2147286, 2135501]
56117B135501j3921j8887k7149l7573n1575o9387q6024r6440j01352j03107j00044
56106A430042r0431p7952o7325n8001m7659l8172l2271k7968k2105j6128j2827
56095I39203j0863p890n434n300n022k203N46M54j4K057M383M237M040O331Q179
56080I32704O779N426P457R544P919N838P491R867Q504O172P661J0816J1119J0434
56066A047731J2705J5536J4779J3077J5075J8439J8489J7336J9434K2411K1542
56055A236554J9111J9946K1863K0128J7125J7818J9822J7962J4603J5173J7545
56044A437650J6371J3967J6104K0736K1805K0581K2348K5518K5096K3357K5771
56033A669304L0075L0667L0038L4109M0163M1385L9660M1538M5411M5254M3255
$$ y = [2135501, 2121580, 2102693, 2075544, 2037971, 1986396, 1917009, 1830985, 1734545, 1633193, 1530086, 1430042, 1339611, 1261659, 1194334, 1136333, 1088674, 1050502, 1018231, 990263, 968158, 952030, 939203, 928340, 920450, 915016, 909716, 904694, 902491, 903037, 903491, 903477, 905534, 909917, 914154, 918194, 924525, 932704, 939483, 944909, 952366, 961910, 969829, 975667, 983158, 993025, 1001529, 1007701, 1015362, 1026178, 1037297, 1047731, 1060436, 1075972, 1090751, 1103828, 1118903, 1137342, 1155831, 1173167, 1192601, 1215012, 1236554, 1255665, 1275611, 1297474, 1317602, 1334727, 1352545, 1372367, 1390329, 1404932, 1420105, 1437650, 1454021, 1467988, 1484092, 1504828, 1526633, 1547214, 1569562, 1595080, 1620176, 1643533, 1669304, 1699379, 1730046, 1760084, 1794193, 1834356, 1875741, 1915401, 1956939, 2002350, 2047604, 2090859]
56022B090859M5764N0442N0573M8400N0803N5650N6207N5011N9143O5773O7088
56011B695713O5526O9023P5250P6265P4613P8700Q6181Q8575Q8228R3623J02202
56000C593899J05495J06836J15489J27856J33760J36624J47190J62079J69888
55991D799116J73896J86284K04435K16300K24917K43014K67569K85313K99362
55982F900206L23718L55453L80395M02200M36285M79260N15598N50309O01780
55973A0945204O66760P27909P91590Q79920R89968J101955J223639J382121J576236
55964B0285302J786197K027014K339949K735691L204672L778533M513856N418958
55956D6090172O474682P729028R289635J1230613J3612242J6585140K0331987
$$ y = [2090859, 2136623, 2187065, 2237638, 2286038, 2336841, 2392491, 2448698, 2503709, 2562852, 2628625, 2695713, 2761239, 2830262, 2905512, 2981777, 3056390, 3135090, 3221271, 3309846, 3398074, 3491697, 3593899, 3699394, 3806230, 3921719, 4049575, 4183335, 4319959, 4467149, 4629228, 4799116, 4973012, 5159296, 5363731, 5580031, 5804948, 6047962, 6315531, 6600844, 6900206, 7223924, 7579377, 7959772, 8361972, 8798257, 9277517, 9793115, 10343424, 10945204, 11611964, 12339873, 13131463, 14011383, 15001351, 16103306, 17326945, 18709066, 20285302, 22071499, 24098513, 26438462, 29174153, 32378825, 36157358, 40671214, 46090172, 52564854, 60293882, 69583517, 80814130, 94426372, 111011512, 131343499]
55949A31343499K4881568L0099774L5761145M1193645M4625490M3342196L5275844
55942C86523161K0834305L080375j3995846k7438036l6015136l9804982l9642170
55935B53541671l6781008l2535233k7900615k3445272j9462790j6095372j3337691
55928H3983690j1082082r233120p742774o550158n568606m744540m068379l519295
55920C1474736l052734k647366k312714k042889j807729j594960j418153j276939
55912A5321252j148667j025134r20465q36880p57154o76661o10152n60877n13460
55903H271802m63095m22803l95961l68981l36997l11036k94185k75174k51003
55894E152567k32536k22285k09061j89744j74956j68023j59018j44607j33880
$$ y = [131343499, 156225067, 186324841, 222085986, 263279631, 307905121, 351247317, 386523161, 407357466, 410437841, 396441995, 369003959, 332988823, 293183841, 253541671, 216760663, 184225430, 156324815, 132879543, 113416753, 97321381, 83983690, 72901608, 63668488, 55925714, 49375556, 43806950, 39062410, 34994031, 31474736, 28422002, 25774636, 23461922, 21419033, 19611304, 18016344, 16598191, 15321252, 14172585, 13147451, 12226986, 11390106, 10632952, 9956291, 9346139, 8785262, 8271802, 7808707, 7385904, 6989943, 6620962, 6283965, 5972929, 5678744, 5403570, 5152567, 4920031, 4697746, 4488685, 4298941, 4123985, 3955962, 3796944, 3652337, 3518457]
55885C518457j29479j22064j08530r7460r1974q5019p6084p4678q2304q7919q6176
55874B476770q3873q3969p9828p0321o4453o5424o5095n9654n6045n7527n7173
55863A733408n1402m6351m5148m2010l4551k9413l0026l0768k8398k7638l0265
55852A337438l0369k5764k2909k5207k7175k5384k4568k7598k9555k7218k4803
55841A046888k5167k4531k0910j8743k0324k1240j8839j6803j7174j6286j2724
55830H34147j0865j2485j3132j0704r253j0520j0250o881n405q277j0841j0082
55818G15452r810j2632j4671j3009j0956j1295j1359r192p693q428q116n288l669
55805E89334n065n621l046p34q87m19K401M085K695J723L153L407M27j944r70
$$ y = [3518457, 3388978, 3266914, 3158384, 3060924, 2968950, 2883931, 2807847, 2733169, 2650865, 2562946, 2476770, 2392897, 2308928, 2229100, 2158779, 2094326, 2028902, 1963807, 1904153, 1848108, 1790581, 1733408, 1682006, 1635655, 1590507, 1548497, 1513946, 1484533, 1454507, 1423739, 1395341, 1367703, 1337438, 1307069, 1281305, 1258396, 1233189, 1206014, 1180630, 1156062, 1128464, 1098909, 1071691, 1046888, 1021721, 997190, 976280, 957537, 937213, 915973, 897134, 880331, 863157, 846871, 834147, 823282, 810797, 797665, 786961, 777708, 767188, 756938, 750057, 744652, 736375, 725534, 715452, 705642, 693010, 678339, 665330, 654374, 643079, 631720, 622528, 614835, 606407, 598291, 593003, 589334, 584269, 578648, 575602, 574868, 573981, 573562, 575963, 580048, 582743, 584466, 587619, 591026, 591453, 589509, 588539]
55790E88539M9j644l155k002j080k775l985j847R12J014k23j115l738r329j4367
55775E45254j5634j4617j3228j0017m316R28M232Q366J4273J7402J4122P011n2
55762E53724o970j3791j7354j6083j3389j2144j0429o636l829m608o429o515o775
55749D28772r301j1545j0740r003r263r995q641o576o106o060m660l338l587l468
55735C26489j345M28m04j798j270m53j588l084k781k311l913o021o194n430n601
55720B84724n648m203k895l249l404j729l27j018j250J696N701P399P612Q642
55706B92051R184O823L065J041L13j508l956m943n022o182p929q416p975p896
55692B58650p406n391l354l147l565k506p37j05K4J198K584K676K429L434M744
$$ y = [588539, 588588, 586944, 583789, 581787, 580707, 577932, 573947, 572100, 573012, 574026, 573803, 572688, 568950, 559621, 545254, 529620, 515003, 501775, 491758, 487442, 488370, 492602, 500968, 515241, 532643, 546765, 553776, 553724, 546754, 532963, 515609, 499526, 486137, 473993, 463564, 456928, 453099, 448491, 442062, 435547, 428772, 419471, 407926, 397186, 388183, 378920, 368925, 360284, 353708, 347602, 341542, 336882, 333544, 329957, 326489, 325144, 325572, 325168, 323370, 322100, 321647, 320059, 316975, 314194, 311883, 307970, 301949, 295755, 290325, 284724, 279076, 274873, 271978, 268729, 265325, 263596, 263269, 262251, 261001, 262697, 268398, 275797, 283409, 292051, 301235, 308058, 311123, 312164, 312477, 310969, 307013, 302070, 297048, 290866, 282937, 274521, 266546, 258650, 251244, 245853, 242499, 239352, 235787, 233281, 232544, 232439, 232463, 233661, 236245, 238921, 241350, 244784, 249528]
55677B49528M675L947L924L720K139M77K67K93r80k203j558l08n34j430j131k26
55661B60600j32p3J090K002J149LN06J538J219N76J334K183R67j289k169j930
55645B67574k239k666k044j528k660m086l830l056l886n267m892l653m120n885
55631B17762o447n589n072m934l832k243j762j990j389l92n07j257j083k47L4
55616A81052R9N94L28j637l391k954j784k178l024k030l54q08k789l261j813o30
55600A55420k87M22J171N49p35q42l05r51k136j769l56j45r36o78M20K97q68r29
55582A47342K38Q60J006K325M233M412L008K501L385L810L573M495O567P612P255
55567B02622P522Q889R233P475M983K737J98k409l785m095m954o461p107o785
$$ y = [249528, 254203, 258150, 262074, 265794, 267933, 268410, 268677, 268970, 267990, 265787, 264229, 263921, 263387, 261957, 260826, 260600, 260468, 260395, 261485, 263487, 264636, 264639, 265145, 266683, 267902, 268478, 269812, 271995, 272962, 271673, 269504, 267574, 265335, 262669, 260625, 259097, 256437, 252351, 248521, 245465, 241579, 236312, 231420, 227767, 223647, 217762, 211315, 205726, 200654, 195720, 191888, 189645, 187883, 185893, 184504, 184112, 183605, 182348, 181265, 181018, 181052, 181151, 181745, 182073, 180436, 177045, 174091, 172307, 170129, 167105, 165075, 164721, 163913, 161124, 157863, 156050, 155420, 155133, 155555, 156726, 157275, 156540, 155698, 155393, 154442, 152306, 150537, 150181, 150036, 149100, 148422, 148842, 149139, 148271, 147342, 147580, 148440, 149446, 151771, 156004, 160416, 163424, 165925, 169310, 173120, 176693, 181188, 187755, 195367, 202622, 210144, 219033, 228266, 235741, 240724, 243461, 243659, 241250, 237465, 233370, 228416, 221955, 214848, 208063]
55553B08063o904p331o493m719m184n034m894k954j288j324k004k327k782l290
55539A52535k558m97J180J671J977K475K124Q50J80O62J032O77O44J389J749R75
55523A67065k12j204k300l470m146m538n277n824n241m314m623n708n671m420
55509A10117l591l292j927M48J634P95l51n12l98n30r9J119J962J875J632J446
55493A10328N54q15j227l77M55O23P53Q83K78o14l91P59J089K54j60M96J015P58
55475A14661O29J037J176Q81R57J180K83j582k648k273j631j328p08J25J04n52
55459A10311l74O22P98q8m54P1m5j166j599p26j97r17j492q85j61l05n84k90j8
55440A02501j11J27P53P77J83K55J159J471P41J94K30k53j245j111L95J327Q21
$$ y = [208063, 201159, 193828, 187335, 182616, 178432, 173398, 168504, 165550, 164262, 162938, 160934, 158607, 155825, 152535, 149977, 149480, 150660, 152331, 154308, 156783, 158907, 159757, 159937, 160599, 161631, 162308, 162952, 164341, 166090, 167065, 166853, 165649, 163349, 159879, 155733, 151195, 145918, 140094, 134853, 130539, 125916, 120208, 114537, 110117, 106526, 103234, 101307, 101755, 103389, 104184, 103833, 103321, 102923, 102393, 102294, 103413, 105375, 107250, 108882, 110328, 110882, 110067, 108840, 108463, 108918, 109541, 110294, 111177, 111455, 110841, 110450, 111209, 112298, 112552, 112392, 112888, 113903, 114661, 115290, 116327, 117503, 118384, 119341, 120521, 120804, 119222, 116574, 114301, 112670, 111342, 110634, 110759, 110863, 110311, 109937, 110559, 111357, 111269, 110815, 110886, 110841, 109675, 108076, 107350, 107153, 106236, 104744, 103859, 103698, 103393, 102809, 102519, 102501, 102390, 102517, 103270, 104047, 104230, 104485, 105644, 107115, 107856, 108050, 108280, 108027, 106782, 105671, 106066, 107393, 108214]
55423A08214M34J002J039k90j308o80L72M49K91R30J648J609J485J816J636L80
55407A19027p44q63j066k296l473l292k271j446p48m7j54j286k160j938j493j508
55391I4242j154P7J096J143J177J957K547K162J669J778J600N10l61k2O63O84
55375A09768N00N73K3j576k813k520j650j506j728j494j124r27j39J420K283J511
55359A00601L09RJ12j45r5P49J225M57m09k01K70J5j36O51J144Q5j286j061K24
55340A02518O62N5l54k57k44k18J63K41n58j291q99j48l50j025p88K55Q98Q91
55322I9551Q54P80K86k16j92j11n02p22p3P06O29K05L49N55j39j202j364o91k34
55303I8469k31j44R5K89P11J400J547Q63M41R40J179J45q77k23J269J484L85j37
$$ y = [108214, 108648, 109650, 110689, 110399, 109091, 108411, 108783, 109232, 109523, 110453, 112101, 113710, 115195, 117011, 118647, 119027, 118283, 117420, 116354, 114058, 110585, 107293, 105022, 103576, 102828, 102781, 102627, 101341, 99181, 97243, 95750, 94242, 93088, 93165, 94261, 95404, 96581, 98538, 101085, 103247, 104916, 106694, 108294, 108804, 108443, 108421, 109084, 109768, 110268, 110841, 110864, 109288, 106475, 103955, 102305, 100799, 99071, 97577, 96453, 95526, 95387, 96807, 99090, 100601, 100910, 100919, 101031, 100886, 100791, 101540, 102765, 103222, 102813, 102612, 102882, 102897, 102761, 103412, 104556, 104641, 103355, 102294, 102518, 103180, 103235, 102881, 102624, 102380, 102162, 102325, 102566, 102008, 100717, 99818, 99670, 99320, 98295, 97507, 97762, 98660, 99551, 100405, 101185, 101471, 101255, 101063, 100952, 100450, 99728, 99655, 100361, 100990, 101195, 101544, 102099, 101960, 100758, 99394, 98703, 98469, 98238, 98094, 98189, 98478, 99189, 100589, 102136, 102999, 103440, 104380, 105559, 105704, 104827, 104604, 105873, 107357, 107742, 107605]
55285A07605N74J224R10K90J96N41Q24O53j81j287j670r56o3R6j70k22k62n79
55267A07523o75k10J99J65L47R62Q37o57k113k029r86k90K11J162J849J349M69
55250A08113M35O15k91j685j898r61l21k70J94J161J536R02k5p10j110r94l73
55233A04318j47q60j440p01N53O65k73q16o60p94j425j683j260o86r1P55J385
55216I6840J076J84l11l16l44k24M72J176R96K15j90j18k5K38Q77J175O34K59
55198A02614J016J829J107n06j018j85M03N5m14o02r81j454j353q85q68j089o41
55181I7028K70O11M17N22P09Mj210j419l91N02N29L50M11L28P2J79N48N30K61
55162A00251M22P87N61Q5M53J535K073J732J323J024J94r53j284o70k41n58j014
$$ y = [107605, 108179, 109403, 110313, 110603, 110799, 111340, 112164, 112817, 112636, 111349, 109679, 108723, 108660, 108756, 108586, 108364, 108102, 107523, 106848, 106638, 106837, 107002, 107349, 108311, 109148, 108491, 106378, 104349, 103363, 103073, 103284, 104446, 106295, 107644, 108113, 108548, 109163, 108872, 107187, 105289, 104328, 104007, 103737, 103931, 105092, 106628, 107530, 107505, 106795, 105685, 104691, 104318, 104171, 103311, 101871, 101170, 101723, 102388, 102115, 101299, 100639, 99845, 98420, 96737, 95477, 94791, 94700, 95455, 96840, 97916, 98100, 97789, 97473, 97129, 96905, 97377, 98553, 99549, 99764, 99574, 99456, 99431, 99669, 100546, 101721, 102355, 102614, 103630, 105459, 106566, 106060, 105042, 104857, 105260, 105315, 104901, 104299, 103318, 101864, 100511, 99626, 98758, 97669, 97028, 97298, 97909, 98326, 98848, 99557, 99561, 98351, 96932, 96541, 97043, 97572, 97922, 98333, 98661, 98733, 98912, 99460, 99990, 100251, 100673, 101460, 102021, 102106, 102559, 104094, 106167, 107899, 109222, 110246, 110440, 109487, 108203, 107533, 107292, 106734, 105720]
55145A05720j161j126o76M67J414R80k57n48L28Q24K57k53Q1N60N00L15M54O91
55127A08570Q56J006P09m95j814j891q16RN2K8J82Lk19N15J905K353J340J19l87
55108A12025o19r20q10k79j13m23m34j20l71j100j011K25J266J250R25J019J083
55091A11593P50N33O58N76K01K82Q82J021L85j24j09l28j032j272n96J26K89L60
55073A14195N11O0r38j222l50M55L90L08Q68J147L80m32j14P42Q35J56m41p73
55055A15777j184j577j652j542j342p16L48J105J065P36O47N83L06K47P16J247
55039A14764J268P97N8q07j382j240q63j141j846j790q19j89n55j066j025r32
55023A03232j055n49J021K529K780K088J395Q71K63k41m20n05o13m89k36l32n17
$$ y = [105720, 104559, 103433, 102757, 103224, 104638, 105618, 105361, 104813, 105141, 105965, 106222, 105969, 106050, 106610, 107110, 107425, 107879, 108570, 109426, 110432, 111141, 110646, 108832, 106941, 106125, 106134, 106186, 106214, 106396, 106399, 106180, 106695, 108600, 110953, 112293, 112412, 112025, 111406, 110486, 109676, 109397, 109284, 108861, 108427, 108307, 107936, 106836, 105825, 106050, 107316, 108566, 109491, 110510, 111593, 112343, 112876, 113534, 114110, 114311, 114593, 115475, 116496, 116881, 116757, 116648, 116320, 115288, 114016, 113420, 113546, 113835, 114195, 114706, 114766, 113828, 112606, 112256, 112711, 113101, 113409, 114277, 115424, 115804, 115372, 115258, 116000, 116835, 116991, 116550, 115777, 114593, 113016, 111364, 109822, 108480, 107764, 108112, 109217, 110282, 111018, 111665, 112248, 112554, 112801, 113517, 114764, 116032, 116829, 116887, 116080, 114698, 113458, 112595, 111454, 109608, 107818, 106999, 106810, 106255, 105189, 104164, 103232, 102177, 101628, 102649, 105178, 107958, 110046, 111441, 112312, 112575, 112334, 111914, 111409, 110796, 110307, 110071, 109739, 109222]
55006A09222J52J654K659K437J738J194K94j226k397k385j714j136n06L81J018
54991A11385J121J202J411J085K55J58J213J935J101k77n85l0O5n28r22p17k91
54974A17581O9L29M12M92R16J395J080N6l80L58J181J102O49N26K69n54j066m88
54956A23927L24K06l60j98M64M47m16j178j294r65l42M33P65K81m80q52r44j000
54938A18818n70O12J667J611Q04K90K40J17k00l93l64l9Q93K259L092K927K608
54921A34372K955L491L527L555M410N825P047Q119R246R679Q610O632M928L436
54907B15832J243j630m170n864o969p547p426o963o717o466n611m345l464l140
54893A46763k878k485k190j963j566j153r76p42k5Q97J373J346J278J401J679
$$ y = [109222, 109374, 111028, 113687, 116124, 117862, 119056, 119350, 118124, 115727, 113342, 111628, 110492, 109986, 110367, 111385, 112506, 113708, 115119, 116204, 116459, 116617, 117830, 119765, 120866, 120589, 120004, 119974, 120039, 119511, 118589, 117872, 117581, 117650, 117979, 118391, 118883, 119799, 121194, 122274, 122330, 121950, 122308, 123489, 124591, 125240, 125766, 126035, 125481, 124415, 123927, 124251, 124457, 124097, 123899, 124363, 124810, 124394, 123216, 121922, 120957, 120615, 121048, 121813, 122094, 121614, 120762, 119818, 118818, 118248, 118860, 120527, 122138, 122942, 123232, 123472, 123589, 123389, 122996, 122632, 122593, 123486, 125745, 128837, 131764, 134372, 137327, 140818, 144345, 147900, 152310, 158135, 165182, 173301, 182547, 192226, 200836, 207468, 212396, 215832, 217075, 215445, 211275, 205411, 198442, 190895, 183469, 176506, 169789, 163323, 157712, 153367, 149903, 146763, 143885, 141400, 139210, 137247, 135681, 134528, 133552, 132810, 132785, 133682, 135055, 136401, 137679, 139080, 140759]
54878A40759K232L105L894M331M861O025P534Q607Q915Q676Q136P393O344M534
54864B25346J555k035m943o649p827q902r200q206o652n573n108m915m924m917
54850A47050m364l372k827k892k537j369o36j319k440k551j802j227r64o01l58
54835A17791n23n50K4N31L46J53P06J260P80j73l64N2M7l92m78k00j30j58R0J42
54815A18954n21j197r60k61l7PN43Q53p0j298j009N99J573J244Q68J197J476J198
54797A23159R22R38P45K67J02K93J81k69l81j07j20m06k05N17Q98O34K88K6m84
54778A26998r26m70P17J529J680J938K500K593K048J809K431L365M129M933N778
54763A61052O182O259O859Q190R367R659R206Q250O715M738K592n8l673p466r807
$$ y = [140759, 142991, 146096, 149990, 154321, 159182, 165207, 172741, 181348, 190263, 198939, 207075, 214468, 220812, 225346, 226901, 224866, 219923, 213274, 205447, 196545, 187345, 179139, 172487, 166914, 161806, 156891, 151967, 147050, 142686, 139314, 136487, 133595, 131058, 129689, 129053, 127734, 125294, 122743, 120941, 119714, 118750, 118149, 117791, 117268, 116718, 116742, 117273, 117619, 117772, 118478, 119738, 120518, 120345, 119981, 120033, 120080, 119688, 119210, 119010, 118880, 118722, 118812, 118954, 118433, 117236, 116276, 116015, 115978, 115985, 116528, 117381, 117311, 116013, 115004, 115603, 117176, 118420, 119288, 120485, 121961, 123159, 124081, 125019, 125764, 126031, 126133, 126426, 126607, 126338, 125957, 125850, 125730, 125324, 125119, 125636, 126534, 127168, 127456, 127482, 126998, 126072, 125602, 126319, 127848, 129528, 131466, 133966, 136559, 138607, 140416, 142847, 146212, 150341, 155274, 161052, 167234, 173493, 180352, 188542, 197909, 207568, 216774, 225024, 231739, 236477, 239069, 239011, 235338, 227872, 218065]
54748B18065j0206r706r089q127o825n956n751n348m203k941k154j485n60J24
54734A45838M6m16n56k96LJ17K3j53m9N84J451K118K683L370L807L633L555M621
54716A70379O543P971Q335Q141P443N530K435o00k682m158n543o583o922o740
54702A83549o279n536m725m259m055l619k966k616k622k462j994j560j218q22
54688A38816p66j506k412k340j373p50r46j136p94m61o22r79j183j252j008k58
54672A21030M25K17n51p58k90q1l47l13J47J79l90o73l81k67n07k89M64O40p6
54653A18179m97Q9P27N56J61K17K79n2j51L37N48r7p25n25j80n32r31l41P98J277
54633A19137J024R35J300J575J408Q66Qr39j332q15R1O64Q55R59R55O87K78j18
$$ y = [218065, 207859, 198153, 189064, 180937, 174112, 168156, 162405, 157057, 152854, 149913, 147759, 146274, 145714, 145838, 145884, 145468, 144912, 144616, 144619, 144736, 144759, 144606, 144557, 145141, 146592, 148710, 151393, 154763, 158570, 162203, 165758, 170379, 176922, 184893, 193228, 201369, 208812, 214342, 216777, 216177, 213495, 209337, 203794, 197211, 190289, 183549, 177270, 171734, 167009, 162750, 158695, 155076, 152110, 149494, 146872, 144410, 142416, 140856, 139638, 138816, 138050, 136544, 134132, 131792, 130419, 129669, 128723, 127587, 126793, 126332, 125710, 124731, 123548, 122296, 121288, 121030, 121455, 121672, 121121, 120363, 120073, 119992, 119645, 119332, 119479, 119658, 119268, 118595, 118214, 117947, 117440, 117151, 117615, 118255, 118179, 117682, 117771, 118498, 119054, 119215, 119432, 119711, 119659, 119508, 119845, 120393, 120296, 119571, 119046, 118866, 118334, 117403, 117062, 117860, 119137, 120161, 121096, 122396, 123971, 125379, 126245, 126253, 125314, 123982, 123167, 123258, 123922, 124777, 125736, 126691, 127378, 127656, 127538]
54615A27538n02p19n48k89n00r84r38k94J71J78K51L81j75j274j553m29Q79J207
54597A22400J009J169J476J298P61K47l00p88o58P1M98L37M42J035R58k98j270
54580A28387o70N14O22r5l22q5m48j356j605p92K40P69P88M20j77n03k87l8j61
54561A25201j23N96J336J189N62N38J138J440J094N38On58q25m00L48O81N92N68
54543A33921O50N29L54N16R29J259J558J893J811J012J36n0J70k1p00j275j416
54526A41276j112l12O80R49Q6j002j358j406k118l278l695k798r59J253L127L652
54510A32985K485P31l31p51j163j293n62M12N27K6O0O42P06R9j63K82N84K56j69
54491A35363l70p93j518j767j127k13L05N19P17Q51R19J083J132O05l48r65r32
$$ y = [127538, 127036, 126317, 125769, 125480, 124980, 123996, 123058, 122764, 122935, 123113, 123364, 123745, 123570, 122296, 120743, 120314, 121193, 122400, 123409, 124578, 126054, 127352, 128113, 128360, 128060, 127272, 126614, 126685, 127183, 127520, 127962, 128997, 129955, 129657, 128387, 127717, 128231, 128853, 128758, 128436, 128351, 127903, 126547, 124942, 124150, 124390, 125159, 125947, 126367, 126190, 125687, 125400, 125362, 125201, 125078, 125674, 127010, 128199, 128761, 129299, 130437, 131877, 132971, 133509, 133515, 132957, 132132, 131732, 132080, 132761, 133353, 133921, 134571, 135100, 135454, 135970, 136899, 138158, 139716, 141609, 143420, 144432, 144568, 144518, 144688, 144667, 143967, 142692, 141276, 140164, 139852, 140532, 141481, 141567, 140565, 139207, 137801, 135683, 132405, 128710, 125912, 124953, 126206, 129333, 132985, 135470, 136201, 135870, 135119, 133956, 132663, 132101, 132513, 133040, 133066, 133126, 133768, 134474, 134573, 134410, 134692, 135276, 135532, 135363, 134993, 134200, 132682, 130915, 129788, 129575, 129880, 130399, 131116, 131967, 132886, 133969, 135101, 135706, 135358, 134393, 133461]
54474A33461o53k96N08J653K145J310k05j086p11M50J435J565R64M57O91J420
54458A43108J892J776J296P03J41j82k21k88n84p47m59n8K3M3M50R60R57M51j97
54439A49064j083k253k846j961k47O48K69k66j32J69Ol25k92J6K63M34O28P99
54421A42891J012J379J607J263O02M12Q46J151P92Q3n71j231j854j865r88J5J24
54404A45668o50j313j103l08K31J53m5K78R90J344J104R47J430K077K171J906
54388A54880K002K337J948M68j200j897j423m80J87L83L73M12M17K11j6P0K97
54371A58969K07K3N45J715K221J282j07o01l53l44n22m9R73J441R16K07J10O09
54353A67242J393K255K867K991L009L445M004L861K936J961J355P77q8j129k225
$$ y = [133461, 132808, 132512, 133020, 134673, 136818, 138128, 137923, 136837, 136126, 136576, 138011, 139576, 140540, 140997, 141688, 143108, 145000, 146776, 148072, 148775, 148916, 148734, 148513, 148225, 147641, 146894, 146435, 146377, 146400, 146443, 146893, 147853, 148810, 149261, 149064, 147981, 145728, 142882, 140921, 140674, 141322, 141591, 141325, 141193, 141362, 141368, 141043, 140751, 140767, 141030, 141464, 142092, 142891, 143903, 145282, 146889, 148152, 148754, 149166, 150012, 151163, 151955, 152038, 151467, 150236, 148382, 146517, 145529, 145544, 145668, 145018, 143705, 142602, 142294, 142525, 142678, 142633, 142911, 143901, 145245, 146349, 147296, 148726, 150803, 152974, 154880, 156882, 159219, 161167, 161635, 160435, 158538, 157115, 156635, 156822, 157205, 157578, 157990, 158407, 158618, 158602, 158672, 158969, 159176, 159199, 159744, 161459, 163680, 164962, 164855, 164254, 163901, 163557, 163035, 162986, 163959, 165400, 166316, 166523, 166633, 167242, 168635, 170890, 173757, 176748, 179757, 183202, 187206, 191067, 194003, 195964, 197319, 198096, 198008, 196879, 194654]
54338A94654l293l937l815l322l193l417l335k730k064j646j340j135j169j198
54324A59060p72L2O72Q96P68K57n32r81p23l60n88r18m56M41N71k31r49j035q79
54305A54273o30K7P61O93j09n62l20k43p34r88m43K26K65r4l73o48r60q61j86
54286A49094M67N97M19K47O0j5L97J118J426J131P26K97n68j447j079O08J834
54269A55312J242k43q56l42K73M38M24M04K60O8l7k09m77l66M55J475J920J708
54251A61449J318J063R82J126J439J618J420Q90J54o76j288j395j219j188j196
54236A64497q75n68r50j667j555n17J35k76p64m61m6m39j164j298j026j013r69
54219A51044k03Q74J207P28M13P61J337J663J677J315N21l85r27j057r71o29o4
$$ y = [194654, 191361, 187424, 183609, 180287, 177094, 173677, 170342, 167612, 165548, 163902, 162562, 161427, 160258, 159060, 158288, 158320, 158992, 159888, 160656, 160913, 160381, 159400, 158677, 158317, 157729, 156811, 156355, 156796, 157367, 157136, 156187, 155152, 154273, 153643, 153670, 154431, 155124, 155015, 154453, 154133, 153890, 153156, 152168, 151725, 151951, 152216, 152122, 151749, 151101, 150141, 149280, 149094, 149561, 150158, 150577, 150824, 150884, 150869, 151266, 152384, 153810, 154941, 155667, 155964, 155396, 153949, 152870, 153478, 155312, 156554, 156311, 155455, 155113, 155386, 155824, 156248, 156652, 156912, 156980, 156943, 156734, 156257, 155891, 156346, 157821, 159741, 161449, 162767, 163830, 164812, 165938, 167377, 168995, 170415, 171305, 171459, 170783, 169495, 168100, 166881, 165693, 164497, 163622, 163054, 162104, 160437, 158882, 158365, 158500, 158224, 157460, 156999, 156953, 156514, 155350, 154052, 153026, 152013, 151044, 150841, 151715, 152922, 153650, 154063, 154824, 156161, 157824, 159501, 160816, 161337, 160952, 160025, 158968, 157997, 157368, 157304]
54202A57304K16j43o17n10p6r8o00q53o21m82p61r79o48j0L67K70r3l75l28M8
54182A51011M63O30N96O37Q72J150J269J138Q22M94K54L2j83j78J15K83o7n70
54164A58768n32n2N6m53q77p23m02m00n69o32o74o85m04J6J4k30K65J557K115
54145A56158Q77r89j562o92K87P24R87R75J8j575k262j183O74J779J720J081L61
54128A57378l03p86r67j001j128j222q14K80J546K153J856J227Q25M64j65n32
54112A58811K08J679K374J626N36L27P32Q09N75P25J199J213N91k1j76j07j37
54095A70964k68m36n58m15j2J14m14j031q17J81J007J135R60R17Q54N37J05k14
54077A72609l80k79L09J220J854J876J629J617J838J946J845J808K096K655L258
$$ y = [157304, 157520, 157377, 156760, 156250, 156174, 156076, 155476, 154623, 154002, 153520, 152759, 151780, 151132, 151122, 151489, 151759, 151666, 151291, 150963, 151011, 151474, 152104, 152700, 153337, 154209, 155359, 156628, 157766, 158588, 159082, 159336, 159368, 159185, 159007, 159122, 159405, 159338, 158768, 158236, 158184, 158240, 157787, 156910, 156187, 155785, 155385, 154816, 154184, 153510, 152825, 152421, 152437, 152451, 152221, 152486, 154043, 156158, 157035, 156046, 154484, 153792, 154079, 154803, 155790, 156765, 156783, 155208, 152946, 151763, 152437, 154216, 155936, 157017, 157378, 157075, 156289, 155322, 154321, 153193, 151971, 151157, 151437, 152983, 155136, 156992, 158219, 159044, 159508, 159343, 158811, 159019, 160698, 163072, 164698, 165234, 165561, 166293, 167102, 167677, 168402, 169601, 170814, 171405, 171384, 171208, 171101, 170964, 170696, 170260, 169702, 169287, 169275, 169389, 168975, 167944, 167127, 167308, 168315, 169450, 170410, 171327, 172181, 172718, 172823, 172609, 172229, 171950, 172259, 173479, 175333, 177209, 178838, 180455, 182293, 184239, 186084, 187892, 189988, 192643, 195901]
54062A95901L889M845O378Q175R427R496Q290N923K460j644n168o833o445n060
54048B29634m009l868m257m275l183r81J523L289L728K991J859J435K448M575
54034B30909O567P389P135O713O818P374P776P459O320M744L242K035J117N73
54020C06171M77N74M74K07J26K51J46m86j580l083m855o175o231n335m791n133
54004B70757n409m795l993m104m837m934m036k988k410j972j254n25k79n21q61
53989B27839j027j087j227j541j932k281k505k419j708l82Q90J335R37K90k58
53974B14924o64n90L41J599K161K072K484L736M537L830K326J247N82l23j198
53959B37064j282p85o01q46r09p51r35j328j020K60J626K214K114J901J919K284
$$ y = [195901, 199790, 204635, 211013, 219188, 228615, 238111, 246401, 252324, 254784, 253140, 247972, 241139, 234694, 229634, 225625, 221757, 217500, 213225, 210042, 209061, 210584, 213873, 217601, 220592, 222451, 223886, 226334, 230909, 237476, 244865, 252000, 258713, 265531, 272905, 280681, 288140, 294460, 299204, 302446, 304481, 305598, 306171, 306648, 307222, 307696, 307903, 308029, 308280, 308426, 307940, 306360, 303277, 298422, 292247, 286016, 280681, 275890, 270757, 265348, 260553, 256560, 252456, 247619, 242685, 238649, 235661, 233251, 231279, 230025, 229500, 229221, 228700, 227839, 226812, 225725, 224498, 222957, 221025, 218744, 216239, 213820, 212112, 211730, 212620, 213955, 214892, 215182, 214924, 214260, 213670, 214011, 215610, 217771, 219843, 222327, 226063, 230600, 234430, 236756, 238003, 238585, 238262, 237064, 235782, 234997, 234396, 233550, 232641, 231890, 230955, 229627, 228607, 228867, 230493, 232707, 234821, 236722, 238641, 240925]
53943B40925K995L781M245M328M329M449M680N074N646O070N930N229M315L367
53929C05363K340J316N18J54M99J865M026N968O833O906P127P865Q780R740J1136
53914C80436J3239J5960J9288K3364K7609L0153K8633K1920J1266k51r662j5679
53902E46276j8502j8620j6527j3405j0964r995r749r181q302p754p739p968q192
53889C99378q232p975p792q395r727j0600j0078q615p216o147n144m268l668l081
53875B98440k408k273l193m573n402n463n122m514l758l433l805m135l650k727
53861B43984k160j909j645j811k841l833l517k205j388j577j923j855j677j545
53847B14098j193p56o94p97m80k1l20j282j738j157k51K33L16J87j36l79k32k
$$ y = [240925, 243920, 247701, 251946, 256274, 260603, 265052, 269732, 274806, 280452, 286522, 292452, 297681, 301996, 305363, 307703, 309019, 309537, 309691, 310190, 312055, 316081, 322049, 328882, 335788, 342915, 350780, 359560, 369300, 380436, 393675, 409635, 428923, 452287, 479896, 510049, 538682, 560602, 571868, 571617, 561955, 546276, 527774, 509154, 492627, 479222, 468258, 458263, 448514, 439333, 431031, 423277, 415538, 407570, 399378, 391146, 383171, 375379, 366984, 357257, 346657, 336579, 327964, 320748, 314601, 309457, 305189, 301521, 298440, 296032, 293759, 290566, 285993, 280591, 275128, 270006, 265492, 261734, 258301, 254496, 250361, 246711, 243984, 241824, 239915, 238270, 236459, 233618, 229785, 226268, 224063, 222675, 221098, 219175, 217320, 215643, 214098, 212905, 212149, 211455, 210658, 210178, 210157, 209837, 208555, 206817, 205660, 205409, 205642, 205958, 206145, 206009, 205630, 205398, 205396]
53829B05396j10j18O06J464J306L98J36P67J063N53L06R22J430J020L75L80P51
53812B16645R29J204J911K576K752K900L491M097M224M295M878N649N993N988
53798B67532O052O096N848N447N099M607L840L085K452J560M31j06M33J304J537
53783C15217J229J056J053P48J05n54j284k379l680m658n093n195n166n043m863
53768B81493m661m433m301m428m646m549m090l634l349l023k647k550k739k777
53754B29666k521k358k424k289j752j276j229j297j074o34k21J37L05K8n28q09
53738B11724p36p70q73l93O84J328J004O41J216K214K451J795J115R21J003J159
53722B24483J441J807K096K274K244J786R74L58K71L53J83p6J4O01J660L075M216
$$ y = [205396, 205286, 205168, 205774, 207238, 208544, 208942, 209078, 209845, 210908, 211461, 211767, 212689, 214119, 215139, 215514, 215894, 216645, 217574, 218778, 220689, 223265, 226017, 228917, 232408, 236505, 240729, 245024, 249902, 255551, 261544, 267532, 273584, 279680, 285528, 290975, 296074, 300681, 304521, 307606, 310058, 311618, 312049, 311943, 312376, 313680, 315217, 316446, 317502, 318555, 319303, 319408, 318854, 317570, 315191, 311511, 306853, 301760, 296565, 291399, 286356, 281493, 276832, 272399, 268098, 263670, 259024, 254475, 250385, 246751, 243402, 240379, 237732, 235182, 232443, 229666, 227145, 224787, 222363, 220074, 218322, 217046, 215817, 214520, 213446, 212812, 212591, 212728, 213033, 213061, 212533, 211724, 210988, 210218, 209345, 208952, 209636, 210964, 211968, 212609, 213825, 216039, 218490, 220285, 221400, 222321, 223324, 224483, 225924, 227731, 229827, 232101, 234345, 236131, 237105, 237463, 237734, 238087, 238270, 238194, 238208, 238809, 240469, 243544, 247760]
53705B47760M157K907J772J851K683L090K759K275K047K092K482L186L679L498
53691B86238L003K916L239L319K837K161J696J459J247Q40N2j001j796j889j439
53676C02882j035j084j519j933j954j674j684k295k880k598j645j001r18o12K64
53661B80314R51Q30L30j5m59j235j739j428p99n15l02L43R26N64n28j241j044
53644B74953l42L88J031J538J979K678L575L795K665R66K46R70K178K852K846
53629C02318K432J780J107P57Q95J390K067K739L162L251L228L280L282L161L175
53614C38024L481L817L958M112M435M651M668M990N853O502O107N029M317M234
53600D04178M191L905L731L868M010L832L228K047K56j602k754l083l270l953
$$ y = [247760, 251917, 254824, 256596, 258447, 261130, 264220, 266979, 269254, 271301, 273393, 275875, 279061, 282740, 286238, 289241, 292157, 295396, 298715, 301552, 303713, 305409, 306868, 308115, 308955, 309007, 308006, 306210, 304321, 302882, 301847, 300763, 299244, 297311, 295357, 293683, 291999, 289704, 286824, 284226, 282581, 281580, 280662, 280050, 280314, 281265, 282095, 282425, 282410, 281951, 280716, 278977, 277549, 276750, 276235, 275933, 276276, 277202, 277766, 277238, 275997, 274953, 274611, 274999, 276030, 277568, 279547, 282225, 285800, 289595, 292260, 293226, 293472, 294442, 296620, 299472, 302318, 304750, 306530, 307637, 308394, 309289, 310679, 312746, 315485, 318647, 321898, 325126, 328406, 331688, 334849, 338024, 341505, 345322, 349280, 353392, 357827, 362478, 367146, 372136, 377989, 384491, 390598, 395627, 399944, 404178, 408369, 412274, 416005, 419873, 423883, 427715, 430943, 432990, 433246, 431644, 428890, 425807, 422537, 418584]
53586D18584n047n881n768m641l309k770l045l104k271j147o40p28q34q92j146
53571C77361j384j258j054j258j583j360p20m24n76m59K31Q74Q77M26R4K37R36
53554C70960J979K818K987K680K490K557K510K194J971K136K491K666K575K498
53540D05512K853L776M798N189M903M830N743P381Q889R780R945R305Q191P649
53526D98744Q512J0328J1962J2979J3724J4226J4094J3511J3371J4123J5282J6354
53514F57210J7599J9450K1659K3472K4459K4882K5338K6106K6833K6945K6375
53503I20328K5684K5262K4820K3977K2981K2376K2240K2137K1674K0737J9393
53492A171609J7966J6976J6647J6717J6947J7435J8099J8370J7969J7503J7703
$$ y = [418584, 413537, 407656, 401888, 397247, 393938, 391168, 388123, 385019, 382748, 381601, 380961, 380233, 379399, 378507, 377361, 375977, 374719, 373665, 372407, 370824, 369464, 368744, 368320, 367744, 367285, 367516, 368390, 369267, 369693, 369787, 370024, 370960, 372939, 375757, 378744, 381424, 383914, 386471, 388981, 391175, 393146, 395282, 397773, 400439, 403014, 405512, 408365, 412141, 416939, 422128, 427031, 431861, 437604, 444985, 453874, 463654, 473599, 482904, 491095, 498744, 507256, 517584, 529546, 542525, 556249, 570475, 584569, 598080, 611451, 625574, 640856, 657210, 674809, 694259, 715918, 739390, 763849, 788731, 814069, 840175, 867008, 893953, 920328, 946012, 971274, 996094, 1020071, 1043052, 1065428, 1087668, 1109805, 1131479, 1152216, 1171609, 1189575, 1206551, 1223198, 1239915, 1256862, 1274297, 1292396, 1310766, 1328735, 1346238, 1363941]
53481A363941J8391J8773J8515J7843J6857J5304J2925R797O430L656J871K68
53469A504571k390n980q915j0381j1558j3772j6456j8063j8241j7826j7333j6788
53457A346868j6578j7202j8327j9253j9994k0851k1375k1025k0455k0766k1655
53446A129387k1711k0485j8869j7406j5642j3362j1113r242p503n905m849m207
53434I79093l309k061j071m35N26K122L840N328O776Q164R082R618J0450J1810
53420A039933J3240J4553J6105J7886J9345K0377K1573K3246K5081K6912K8934
53409A267185L0985L2623L4038L5890L8127M0093M1889M4278M7052M8967M9727
53398A710854N0613N2423N4208N4891N4957N5540N6791N8062N8871N8894N7830
$$ y = [1363941, 1382332, 1401105, 1419620, 1437463, 1454320, 1469624, 1482549, 1492346, 1498776, 1502432, 1504303, 1504571, 1502181, 1496201, 1487286, 1476905, 1465347, 1451575, 1435119, 1417056, 1398815, 1380989, 1363656, 1346868, 1330290, 1313088, 1294761, 1275508, 1255514, 1234663, 1213288, 1192263, 1171808, 1151042, 1129387, 1107676, 1087191, 1068322, 1050916, 1035274, 1021912, 1010799, 1001557, 994054, 988149, 983300, 979093, 975784, 973723, 972652, 972217, 972743, 974865, 978705, 984033, 990809, 998973, 1008055, 1017673, 1028123, 1039933, 1053173, 1067726, 1083831, 1101717, 1121062, 1141439, 1163012, 1186258, 1211339, 1238251, 1267185, 1298170, 1330793, 1364831, 1400721, 1438848, 1478941, 1520830, 1565108, 1612160, 1661127, 1710854, 1761467, 1813890, 1868098, 1922989, 1977946, 2033486, 2090277, 2148339, 2207210, 2266104, 2323934]
53387B323934N6023N4396N3104N1174M8172M5197M3228M1420L8247L3582K8495
53376B816972K3564J8615J3731R333N311J017l908r437j5731k3035l1040l8893
53364B766499m5802n1257n4895n6707n7181n6918n6228n5386n4804n4477n3720
53353B169124n1927m9321m6541m3874m1438l9729l9304m0069m1302m2313m2689
53342A690617m2136m0540l8169l5563l3124l0912k8652k6025k3088k0364j8203
53331A353841j6256j4160j2472j2150j3126j4252j4789j5086j5528j5744j5294
53320A194984j4391j3408j2350j1163j0003q733o911m635k743j667q44L35J707
53307A110178K947M256N824P334Q645J0286J2582J4900J6506J7640J9063K1002
$$ y = [2323934, 2379957, 2434353, 2487457, 2538631, 2586803, 2632000, 2675228, 2716648, 2754895, 2788477, 2816972, 2840536, 2859151, 2872882, 2882215, 2887526, 2888543, 2884635, 2875198, 2859467, 2836432, 2805392, 2766499, 2720697, 2669440, 2614545, 2557838, 2500657, 2443739, 2387511, 2332125, 2277321, 2222844, 2169124, 2117197, 2067876, 2021335, 1977461, 1936023, 1896294, 1856990, 1816921, 1775619, 1733306, 1690617, 1648481, 1607941, 1569772, 1534209, 1501085, 1470173, 1441521, 1415496, 1392408, 1372044, 1353841, 1337585, 1323425, 1310953, 1298803, 1285677, 1271425, 1256636, 1241550, 1226022, 1210278, 1194984, 1180593, 1167185, 1154835, 1143672, 1133669, 1124936, 1118025, 1113390, 1110647, 1108980, 1108136, 1108471, 1110178, 1113125, 1117381, 1123205, 1130539, 1139184, 1149470, 1162052, 1176952, 1193458, 1211098, 1230161, 1251163]
53295A251163K3216K5558K7740K9091K9340K9247K9670L0252K9850K7961K5152
53284A558240K2271J9864J8145J6828J5153J2529R082N237J146l039o730r363
53272A659363j1113j2669j4466j6486j8575k0589k2453k4237k5890k6885k6726
53261A439274k6006k6176k7831k9889l0971l0894l0270k9422k8408k7479k6717
53250A125211k5758k4552k3797k3918k4244k4083k3960k4728k5932k6257k5374
53239H52608k4225k3465k2704k1349j9369j7014j4475j2045j0073q680p817p523
53227F63869p700p922p994q419r702j1420j2638j3102j3352j3792j4287j4667
53215E28874j4917j4836j4109j2805j1371j0113r027q125p510p210p226p541p813
$$ y = [1251163, 1274379, 1299937, 1327677, 1356768, 1386108, 1415355, 1445025, 1475277, 1505127, 1533088, 1558240, 1580511, 1600375, 1618520, 1635348, 1650501, 1663030, 1672112, 1677349, 1678495, 1675456, 1668726, 1659363, 1648250, 1635581, 1621115, 1604629, 1586054, 1565465, 1543012, 1518775, 1492885, 1466000, 1439274, 1413268, 1387092, 1359261, 1329372, 1298401, 1267507, 1237237, 1207815, 1179407, 1151928, 1125211, 1099453, 1074901, 1051104, 1027186, 1002942, 978859, 954899, 930171, 904239, 877982, 852608, 828383, 804918, 782214, 760865, 741496, 724482, 710007, 697962, 687889, 679209, 671392, 663869, 656169, 648247, 640253, 631834, 622132, 610712, 598074, 584972, 571620, 557828, 543541, 528874, 513957, 499121, 485012, 472207, 460836, 450723, 441696, 433571, 426061, 418851, 411625, 404084, 396271]
53202C96271p462o514n970o650p988q637q118p122o333n768n310n124n228n212
53188C04835m705l859l167k975l220l470l313k814k459k439k352j849j204q19
53174B66190n59j60P4l48j109j266n26K19k2j086j822j431l94Q1n20j441j692
53157B54188j329j137j277j109m32K7k56p89r13p57p31p53o47p09j134j344p65
53140B40133J74N37J01o13j126j105j53J577K847K442Q22k72J06J182J716J415
53124B49783Q63N57M42J29n35j090q82L2P74P96O87J256K224K558J871P94M1l05
53106B59995m54m78l64k52m74j336k730l862l872k872j922j710j785j412n98K06
53090B36080Q40J238J119M41j95k09J82L41L5n65j151j239m43P58J229O79R3J86
$$ y = [396271, 388809, 382295, 376325, 369675, 361687, 353050, 344932, 337810, 331477, 325709, 320399, 315275, 310047, 304835, 300130, 296271, 293104, 290129, 286909, 283439, 280126, 277312, 274853, 272414, 270062, 268213, 267009, 266190, 265631, 265471, 265545, 265197, 264088, 262822, 262296, 262515, 262493, 261407, 259585, 258154, 257760, 257841, 257321, 255880, 254188, 252859, 251722, 250445, 249336, 248904, 248931, 248675, 247886, 246973, 246216, 245485, 244732, 244085, 243376, 242242, 240898, 240133, 240307, 240844, 240945, 240332, 239206, 238101, 237948, 239525, 242372, 244814, 245636, 245364, 245470, 246652, 248368, 249783, 250646, 251203, 251645, 251774, 251239, 250149, 249267, 249299, 250073, 250869, 251556, 252812, 255036, 257594, 259465, 260259, 260300, 259995, 259541, 259063, 258699, 258447, 257973, 256637, 253907, 250045, 246173, 243301, 241379, 239669, 237884, 236472, 235874, 236080, 236920, 238158, 239277, 239718, 239523, 239314, 239496, 239837, 239872, 239307, 238156, 236917, 236474, 237232, 238461, 239140, 239233, 239419]
53072B39419L16k68j082j358j351j560j487n33N37M94m30r67q27q07j123j064
53056B27909l64L93P98R56Q11K14m47o17m54l08K74J706K946K503O91o60q52r26
53038B34573j484j622o77N30J004R06Q51Q55P80Q50J097J020M12k15m29m00k65
53021B37786J97Q65J115P84N75R98J587J584Q87N1k43L60J390J637N17q88j082
53004B48120k11L86M04P70J547J481J66j069j242j120j562j823q50Q59J938J952
52988B49746J440Q05K64K18Q32J594K057K351K408J632J44o68M7J146J103L50
52972B65469M99J740K601K260J572J537J911J907J323O13K25L46Q62J381J516
52957B85762J271Q89M37k05r84j589j753j496j163j213j771k306k148j411r75
$$ y = [239419, 239735, 239467, 238385, 237027, 235676, 234116, 232629, 232096, 232633, 233127, 232697, 231730, 230903, 230096, 228973, 227909, 227545, 227938, 228736, 229692, 230503, 230717, 230270, 229653, 229199, 228891, 229165, 230871, 233817, 236320, 237011, 236351, 235499, 234573, 233089, 231467, 230790, 231320, 232324, 233230, 234081, 234936, 235716, 236566, 237663, 238683, 239095, 238880, 238451, 238051, 237786, 237983, 238848, 239963, 240747, 241322, 242320, 243907, 245491, 246378, 246429, 246186, 246546, 247936, 249573, 250090, 249202, 248120, 247909, 248295, 248699, 249469, 251016, 252497, 252663, 251594, 250352, 249232, 247670, 245847, 244997, 245856, 247794, 249746, 251186, 251991, 252255, 252473, 253305, 254899, 256956, 259307, 261715, 263347, 263491, 262823, 262870, 264016, 265119, 265469, 265968, 267708, 270309, 272569, 274141, 275678, 277589, 279496, 280819, 281432, 281657, 282003, 282865, 284246, 285762, 287033, 287922, 288359, 288154, 287170, 285581, 283828, 282332, 281169, 279956, 278185, 275879, 273731, 272320, 271345]
52942B71345j298j811j791j397j334j847k452k500j705m13N00L54n06j078j040
52927B53027j101j739k259j743l82P85J106P44J57l09m32l06k76m79n80l03J65
52910B46075M98O35N27nq13j234q81k27M7p5j54oK52M96N18mr67j598j281l31
52890B41472M43O43L24m15j256j515q40J30N22L65L93Q42J177J026O84N94P92
52873B45381J023J053P55K57k4K17P11R33P98P51J107J641J895J617R18J78j48
52856B59063J20O44Q72N96P1m35r85j735k557l075l157l139l404l778l633k721
52840B32747j662j307j792k478k682k269j630j325j593j963j603l57R22J482J709
52825B16199K395L295L332K199Q99L73L43q7j109j998j949r65O2K39k70m00L65
$$ y = [271345, 270047, 268236, 266445, 265048, 263714, 261867, 259415, 256915, 255210, 254797, 255297, 255651, 255145, 254067, 253027, 251926, 250187, 247928, 246185, 245803, 246588, 247694, 248438, 248595, 248286, 247854, 247548, 247272, 246793, 246213, 245910, 246075, 246573, 247208, 247735, 247730, 246917, 245683, 244802, 244575, 244622, 244547, 244393, 244387, 244639, 245135, 245653, 245649, 244682, 243084, 241803, 241472, 241915, 242558, 242882, 242467, 241211, 239696, 238856, 238986, 239508, 239873, 240266, 241108, 242285, 243311, 243995, 244589, 245381, 246404, 247457, 248212, 248469, 248445, 248662, 249373, 250306, 251104, 251855, 252962, 254603, 256498, 258115, 259033, 259211, 259063, 259183, 259827, 260699, 261295, 261366, 260931, 259946, 258211, 255654, 252579, 249422, 246283, 242879, 239101, 235468, 232747, 231085, 229778, 227986, 225508, 222826, 220557, 218927, 217602, 216009, 214046, 212443, 212086, 213008, 214490, 216199, 218594, 221889, 225221, 227420, 228319, 228692, 229035, 228948, 227839, 225841, 223892, 222927, 222989, 223228, 222958, 222558, 222923]
52808B22923J235J332J064J390K236K678K483K164J707N32j057j863j513j067
52794B34244j340j781j615j069q00r22j220j556j594r04J88O67J87m46n58m04
52778B21077k21L86J475K191K036J718J906K038J349K44l63m37n00n21j89J83
52762B32372L3m91p75o68m46j99Q9K03J20J86M12J34q94j782j642q34k43R5O24
52743B26294J212J424J439J717K094K195K295K813L340L205K663K483K593K236
52729B58003J300M80J75J66L39Q06J254J063J59q58j468j586j349j046j086j441
52713B54911j468p97k8J01j85k05rj48o46j049j303j619j696j035J25R76J204
52696B47129J149J084J026J084J286J257P77L27L86O24N26L41N30P55N07K27N98
$$ y = [222923, 224158, 225490, 226554, 227944, 230180, 232858, 235341, 237505, 239212, 239744, 238687, 236824, 235311, 234244, 232904, 231123, 229508, 228439, 227639, 226717, 225497, 223941, 222347, 221443, 221631, 222298, 222485, 222039, 221481, 221077, 220856, 221242, 222717, 224908, 226944, 228662, 230568, 232606, 233955, 234199, 233836, 233399, 232899, 232378, 232189, 232372, 232405, 231914, 231139, 230471, 230025, 229826, 229915, 230118, 230238, 230424, 230836, 230970, 230076, 228294, 226652, 225818, 225575, 225670, 226294, 227506, 228930, 230369, 232086, 234180, 236375, 238670, 241483, 244823, 248028, 250691, 253174, 255767, 258003, 259303, 259783, 259958, 260124, 260463, 261269, 262523, 263586, 263745, 262887, 261419, 259833, 258484, 257438, 256352, 254911, 253443, 252646, 252618, 252719, 252534, 252329, 252320, 252172, 251526, 250477, 249174, 247555, 245859, 244824, 244949, 245925, 247129, 248278, 249362, 250388, 251472, 252758, 254015, 254792, 255119, 255505, 256129, 256655, 256996, 257526, 258281, 258788, 259015, 259613]
52679B59613J106O55o08j394j202p63n41j95K87K29m56r15o75l95o90j155j080
52662B51821m79J44M38L04j42m63k28L86Q02R24J169J680K187K654L280L812L619
52645B71908K591J193m12k396m295m993m101k549j435r30p14o99q67q90m85J50
52629B51076O42Q89R91J033J081J174J214J119R31O03j38j308k311k531k035j201
52613B51229o7J287K148J869R74O38J128J643J590J096L30o70j377j001L24J439
52597B62580J519Q57J40l65o33o04l31kL49O58N50j51p69m42N90J212Q92J68l48
52578B65870n54l74L50J320J809J499O38n21j791k619k504j805j273q70l4R88
52562B60129J203L66o80j311j715j987j723q81m8M56Q34R41K58r84j667j210k52
$$ y = [259613, 260719, 261374, 260766, 259372, 258170, 257407, 256866, 256671, 256958, 257187, 256731, 255816, 255141, 254746, 254056, 252901, 251821, 251342, 251486, 251924, 252228, 252086, 251623, 251395, 251781, 252583, 253507, 254676, 256356, 258543, 261197, 264477, 268289, 271908, 274499, 275692, 275280, 272884, 268589, 263596, 259495, 256946, 255511, 254581, 253867, 253168, 252301, 251411, 250926, 251076, 251718, 252607, 253598, 254631, 255712, 256886, 258100, 259219, 260150, 260753, 260615, 259307, 256996, 254465, 252430, 251229, 251162, 252449, 254597, 256466, 257440, 258078, 259206, 260849, 262439, 263535, 263865, 263195, 261818, 260817, 261141, 262580, 264099, 264956, 265096, 264731, 264098, 263494, 263163, 263161, 263510, 264168, 264718, 264567, 263798, 263356, 263946, 265158, 266050, 266218, 265870, 265316, 264942, 265292, 266612, 268421, 269920, 270558, 270037, 268246, 265627, 263123, 261318, 260045, 259175, 259141, 260129, 261332, 261698, 261018, 259707, 257992, 256005, 254282, 253401, 253353, 253809, 254643, 255584, 255842, 254858, 253191, 251981, 251729]
52545B51729M42P73P45J50p21j046o49l16n29p08k56N64J155J292R37J77l74k7
52527B53338Q81J235O92rm07p65r77m78L66L42o04r20J55J377J570J459K101K952
52509B62308K975K584K824L453L454K892K693K884K536J246m53k098l510m206
52495B79582l720k604k108k648l316l012j622QQ82O97J01l1L31N11L33M18J001
52478B64803J362J015N26M70M51j3m25o1Q04J373J502J540J500J320J431K132
52462B79730K845K879K515K485K715K518J653L62j249k984m108m097l517l288
52448B78459l382l192k790k724k814k291j135k37j40m67p24q42p98m33J26M33
52432B57049K43k84q49j182j052m93J73P99J533K177K025R03j93j95O59J287J158
$$ y = [251729, 252171, 252944, 253689, 253839, 253118, 252072, 251423, 251107, 250578, 249870, 249614, 250178, 251333, 252625, 253562, 253739, 253365, 253338, 254219, 255454, 256146, 256137, 255730, 254965, 253988, 253510, 253876, 254218, 253614, 252694, 252849, 254226, 255796, 257255, 259356, 262308, 265283, 267867, 270691, 274144, 277598, 280490, 283183, 286067, 288603, 289849, 289396, 287298, 283788, 279582, 275862, 273258, 271150, 268502, 265186, 262174, 260552, 260560, 261442, 262139, 262240, 262209, 262540, 263051, 263384, 263802, 264803, 266165, 267180, 267706, 268176, 268627, 268614, 268189, 268128, 268932, 270305, 271807, 273347, 274847, 276167, 277598, 279730, 282575, 285454, 287969, 290454, 293169, 295687, 297340, 297702, 296453, 293469, 289361, 285264, 281747, 278459, 275077, 271885, 269095, 266371, 263557, 261266, 260131, 259894, 259754, 259287, 258563, 257721, 256923, 256490, 256616, 257049, 257292, 257008, 256159, 254977, 253925, 253432, 253605, 254404, 255937, 258114, 260139, 261042, 260849, 260654, 261313, 262600, 263758]
52415B63758N97J47L23J492L204M118L490K302J998K696L628M818O877R412J1031
52400C19891J1056R966Q012M663j10m952q218r342q922p931p093o463n477l793
52386B91287j971p90j19P66J860K316J747P93K69M49J249K419L334L413K961K903
52370C12886L552M251M435M352M433M579M401L757K724J466L03m46q29j121j271
52355C47472r60k01N85J150J598J953J987J671J297J075J034J292J974K748L035
52340C67710K828K841L617M845N842O370O767P436Q403R329J0006J0767J2170
52327D58931J4197J6129J7445J8405J9415K0338K0926K1427K2113K2591K2344
52316F74261K1641K1135K0806K0184J9426J9214J9565J9682J9187J8660J8623
$$ y = [263758, 264355, 264502, 264825, 266317, 269521, 273639, 277129, 279431, 281429, 284125, 287753, 292571, 299448, 308860, 319891, 330947, 340913, 348925, 353588, 353478, 348526, 340308, 330966, 322044, 314113, 307020, 300557, 295080, 291287, 289316, 288526, 288407, 289173, 291033, 293349, 295096, 295889, 296158, 296607, 297856, 300275, 303609, 307022, 309983, 312886, 316438, 320689, 325124, 329476, 333909, 338488, 342889, 346646, 349370, 350836, 351139, 350693, 349864, 348743, 347472, 346512, 346311, 346896, 348046, 349644, 351597, 353584, 355255, 356552, 357627, 358661, 359953, 361927, 364675, 367710, 370538, 373379, 376996, 381841, 387683, 394053, 400820, 408256, 416659, 425988, 435994, 446761, 458931, 473128, 489257, 506702, 525107, 544522, 564860, 585786, 607213, 629326, 651917, 674261, 695902, 717037, 737843, 758027, 777453, 796667, 816232, 835914, 855101, 873761, 892384]
52305H92384J8659J7958J6302J4228J2487J1437J0722R615P895O172M966L832
52293A026657K016l72k617m598o802r160j0851j1426j1339j1146j0838j0231r321
52280I29972q052o314m357k603r23J310M246P191R409J0773J1560J2200J3221
52267I77633J4800J6251J6675J6243J6003J6340J6502J5909J5032J4419J3792
52256A149599J2759J1664J0994J0450R483Q328P684P549P102N704L442O97k254
52243A243201n123p609r674j1494j3009j3815j3698j3079j2665j2669j2606j1969
52231A105791j0904j0009r531r095q323p333o397n492m474l457k589j649l03J246
52217A027481K328K563K364K578L732N442O574O293N116M551N407O920P893Q110
$$ y = [892384, 911043, 929001, 945303, 959531, 972018, 983455, 994177, 1003792, 1011687, 1017859, 1022825, 1026657, 1028673, 1028301, 1025684, 1021086, 1014284, 1005124, 994273, 982847, 971508, 960362, 949524, 939293, 929972, 921920, 915606, 911249, 908646, 907723, 909033, 913279, 920470, 929879, 940652, 952212, 964412, 977633, 992433, 1008684, 1025359, 1041602, 1057605, 1073945, 1090447, 1106356, 1121388, 1135807, 1149599, 1162358, 1174022, 1185016, 1195466, 1204949, 1213277, 1220961, 1228510, 1235612, 1241316, 1244758, 1245455, 1243201, 1238078, 1230469, 1220795, 1209301, 1196292, 1182477, 1168779, 1155700, 1143035, 1130366, 1117760, 1105791, 1094887, 1084878, 1075347, 1066252, 1057929, 1050596, 1044199, 1038707, 1034233, 1030776, 1028187, 1026538, 1026235, 1027481, 1029809, 1032372, 1034736, 1037314, 1041046, 1046488, 1053062, 1059355, 1064471, 1069022, 1074429, 1081349, 1089242, 1097352]
52203A097352Q082P883P095N700M234L149K577K568K992L325L273L369M222N362
52189A161183N652M894M122M127M462M222L170J741L23j085k739m807p023q822
52175A169420r936j0663j1196j1152j0260r030q086p146n584l756k723k749k938
52162A074201k467j352Q9J710L286M480N212N524N126L783K035P33q0r74j877
52147A099429k084j514r49p46l97L88J129J528J871K172J841P97m2K1O26J332
52131A105402K539M667P171R232J0967J3060J5636J8257K0760K3463K6511K9577
52119A287242L2102L3607L3966L3539L2812L1852L0504K8994K7644K5937K2844
52108A621043J8423J4217J1414R414O971L979J267q26k606m011m480m000l497
$$ y = [1097352, 1105434, 1113317, 1120412, 1126112, 1130346, 1133495, 1136072, 1138640, 1141632, 1144957, 1148230, 1151599, 1155821, 1161183, 1166835, 1171729, 1175851, 1179978, 1184440, 1188662, 1191832, 1193573, 1193896, 1192811, 1190072, 1185265, 1178242, 1169420, 1159484, 1148821, 1137625, 1126473, 1116213, 1107183, 1099097, 1091951, 1086367, 1082611, 1079888, 1077139, 1074201, 1071734, 1070382, 1070471, 1072181, 1075467, 1079947, 1085159, 1090683, 1095809, 1099592, 1101627, 1102360, 1102280, 1101306, 1099429, 1097345, 1095831, 1094882, 1094136, 1093739, 1094127, 1095256, 1096784, 1098655, 1100827, 1102668, 1103465, 1103423, 1103444, 1104070, 1105402, 1107941, 1112608, 1119779, 1129011, 1139978, 1153038, 1168674, 1186931, 1207691, 1231154, 1257665, 1287242, 1319344, 1352951, 1386917, 1420456, 1453268, 1485120, 1515624, 1544618, 1572262, 1598199, 1621043, 1639466, 1653683, 1665097, 1674511, 1681482, 1685461, 1686728, 1685902, 1683296, 1679285, 1674805, 1670805, 1667308]
52095A667308l888n185o735q014q944r674j0287j0855j1649j3024j4933j6695
52083A547425j7538j7317j6389j4932j2759r752o088k141J456L966N318O490Q497
52070A476236J1112J3398J5207J7159J9149K0066J9395J8040J7083J6507J5740
$$ y = [1667308, 1663420, 1658235, 1651500, 1643486, 1634542, 1624868, 1614581, 1603726, 1592077, 1579053, 1564120, 1547425, 1529887, 1512570, 1496181, 1481249, 1468490, 1458738, 1452650, 1450509, 1451965, 1455931, 1461249, 1467739, 1476236, 1487348, 1500746, 1515953, 1533112, 1552261, 1572327, 1591722, 1609762, 1626845, 1643352, 1659092]
$$ [...]
##END NTUPLES=NMR SPECTRUM
##END=
