
##TITLE=AC1310_HONAH12126_6535079_WemgOAAI5z
##JCAMPDX= 6.0         $$ Bruker NMR JCAMP-DX V2.0
##DATA TYPE= NMR SPECTRUM
##DATA CLASS= NTUPLES
##ORIGIN= BRUKER
##OWNER= Administrator
$$ 1.72 TOPSPIN		Version 2.1
$$ 2012-07-16 20:49:50.875 -0500  Administrator@TOPSPIN
$$ Compression mode = diff/dup
##.OBSERVE FREQUENCY= 400.02188249412
##.OBSERVE NUCLEUS= ^1H
##.ACQUISITION MODE= SIMULTANEOUS (DQD)
##.ACQUISITION SCHEME= undefined
##.AVERAGES= 8
##.DIGITISER RES= 22
##SPECTROMETER/DATA SYSTEM= spect
##.PULSE SEQUENCE= zg30
##.SOLVENT NAME= COFFEE_meoh
##.SHIFT REFERENCE= INTERNAL, COFFEE_meoh, 1, 14.98509
##AUDIT TRAIL= $$ (NUMBER, WHEN, WHO, WHERE, PROCESS, VERSION, WHAT)
$$ ##TITLE= Audit trail, TOPSPIN		Version 2.1
$$ ##JCAMPDX= 5.01
$$ ##ORIGIN= Bruker BioSpin GmbH
$$ ##OWNER= Administrator
$$ $$ C:\Bruker\TOPSPIN/data/COFFEE/nmr/AC1310_HONAH12126_6535079_WemgOAAI5z/10/pdata/1/auditp.txt
$$ ##AUDIT TRAIL=  $$ (NUMBER, WHEN, WHO, WHERE, PROCESS, VERSION, WHAT)
(   1,<2012-07-16 20:49:43.109 -0500>,<Administrator>,<TOPSPIN>,<go>,<TOPSPIN 2.1>,
      <created by zg
	started at 2012-07-16 20:48:36.531 -0500,
	POWCHK enabled, PULCHK disabled,
       configuration hash MD5:
       6B 1B 68 BB D9 2E 58 E2 7F 35 AD 54 07 DF 0E 41
       data hash MD5: 64K
       FB EA 83 F4 D8 53 07 25 14 47 3F 56 C6 8D 5E 2A>)
(   2,<2012-07-16 20:49:46.265 -0500>,<Administrator>,<TOPSPIN>,<proc1d>,<TOPSPIN 2.1>,
      <Start of raw data processing
       efp LB = 0 FT_mod = 6 PKNL = 1 PHC0 = 0 PHC1 = 0 SI = 32K 
       data hash MD5: 32K
       C4 03 6D FF 80 04 6D FD 54 15 48 E0 17 8F CE 0D>)
(   3,<2012-07-16 20:49:46.625 -0500>,<Administrator>,<TOPSPIN>,<proc1d>,<TOPSPIN 2.1>,
      <pk PHC0 = 174.2926 PHC1 = 0 
       data hash MD5: 32K
       F2 57 8F 68 B7 55 4B 9D 53 FC 4D 92 FB 16 C9 B1>)
(   4,<2012-07-16 20:49:46.687 -0500>,<Administrator>,<TOPSPIN>,<proc1d>,<TOPSPIN 2.1>,
      <abs ABSG = 1 
       data hash MD5: 32K
       84 C9 9D 14 19 2E 1C AD F7 2D B6 E2 EB FF 16 52>)
(   5,<2012-07-16 20:49:46.718 -0500>,<Administrator>,<TOPSPIN>,<proc1d>,<TOPSPIN 2.1>,
      <abs ABSG = 2 
       data hash MD5: 32K
       61 22 22 26 1E FD 89 CD F8 50 24 90 71 2B 2B 0C>)
(   6,<2012-07-16 20:49:46.750 -0500>,<Administrator>,<TOPSPIN>,<proc1d>,<TOPSPIN 2.1>,
      <abs ABSG = 3 
       data hash MD5: 32K
       AC A8 D1 CC 72 E3 88 F5 53 01 FE 5A 4C 1A F2 A4>)
(   7,<2012-07-16 20:49:46.781 -0500>,<Administrator>,<TOPSPIN>,<proc1d>,<TOPSPIN 2.1>,
      <abs ABSG = 4 
       data hash MD5: 32K
       32 1C 1C CF 36 54 17 BC 9D 47 09 32 75 A9 08 C4>)
(   8,<2012-07-16 20:49:46.812 -0500>,<Administrator>,<TOPSPIN>,<proc1d>,<TOPSPIN 2.1>,
      <abs ABSG = 5 
       data hash MD5: 32K
       02 45 BF C0 03 97 F0 C7 53 BE 2E A0 CE FD 9E 2B>)
$$ ##END=
$$ 
$$ $$ hash MD5
$$ $$ 4B FA 08 39 E2 7B E7 0C DE 55 A9 A8 B3 D9 32 8E
##$RELAX= 
##$RELAX= 
##$RELAX= 
##$RELAX= 
##$RELAX= 
##$RELAX= 
##$RELAX= 
$$ Bruker specific parameters
$$ --------------------------
$$ [...]
150 150 150 150 150 150 150 150
##$TP07= 0
##$TPNAME0= <>
##$TPNAME1= <>
##$TPNAME2= <>
##$TPNAME3= <>
##$TPNAME4= <>
##$TPNAME5= <>
##$TPNAME6= <>
##$TPNAME7= <>
##$TPOAL= (0..7)
0.5 0.5 0.5 0.5 0.5 0.5 0.5 0.5
##$TPOFFS= (0..7)
0 0 0 0 0 0 0 0
##$TUNHIN= 0
##$TUNHOUT= 0
##$TUNXOUT= 0
##$USERA1= <user>
##$USERA2= <user>
##$USERA3= <user>
##$USERA4= <user>
##$USERA5= <user>
##$V9= 5
##$VALIST= <valist>
##$VCLIST= <CCCCCCCCCCCCCCC>
##$VD= 0
##$VDLIST= <DDDDDDDDDDDDDDD>
##$VPLIST= <PPPPPPPPPPPPPPP>
##$VTLIST= <TTTTTTTTTTTTTTT>
##$WBST= 2048
##$WBSW= 25
##$XGAIN= (0..3)
0 0 0 0
##$XL= 0
##$YL= 0
##$YMAX_a= 501680
##$YMIN_a= -628430
##$ZGOPTNS= <>
##$ZL1= 120
##$ZL2= 120
##$ZL3= 120
##$ZL4= 120
##$ABSF1= 14.98509
##$ABSF2= -5.573092
##$ABSG= 5
##$ABSL= 3
##$ALPHA= 0
##$AQORDER= 0
##$ASSFAC= 0
##$ASSFACI= 0
##$ASSFACX= 0
##$ASSWID= 0
##$AUNMP= <proc_prof1d_extract_pilot.lims>
##$AXLEFT= 0
##$AXNAME= <>
##$AXNUC= <1H>
##$AXRIGHT= 0
##$AXTYPE= 0
##$AXUNIT= <>
##$AZFE= 0.1
##$AZFW= 0.1
##$BCFW= 0
##$BC_mod= 0
##$BYTORDP= 0
##$COROFFS= 0
##$CY= 15
##$DATMOD= 1
##$DC= 0
##$DFILT= <>
##$DTYPP= 0
##$F1P= 0
##$F2P= 0
##$FCOR= 0.5
##$FTSIZE= 32768
##$FT_mod= 6
##$GAMMA= 0
##$GB= 0
##$INTBC= 1
##$INTSCL= 1
##$ISEN= 128
##$LB= 0
##$LEV0= 0
##$LPBIN= 0
##$MAXI= 10000
##$MC2= 0
##$MEAN= 0
##$ME_mod= 0
##$MI= 0
##$NCOEF= 0
##$NC_proc= -8
##$NLEV= 6
##$NOISF1= 0
##$NOISF2= 0
##$NSP= 0
##$NTH_PI= 0
##$NZP= 0
##$OFFSET= 14.98509
##$PC= 1
##$PHC0= 174.2926
##$PHC1= 0
##$PH_mod= 1
##$PKNL= yes
##$PPARMOD= 0
##$PPDIAG= 0
##$PPIPTYP= 0
##$PPMPNUM= 2147483647
##$PPRESOL= 1
##$PSCAL= 4
##$PSIGN= 0
##$PYNMP= <proc.py>
##$REVERSE= no
##$SF= 400.02
##$SI= 32768
##$SIGF1= 0
##$SIGF2= 0
##$SINO= 400
##$SIOLD= 32768
##$SPECTYP= <>
##$SREGLST= <1H.CDCl3>
##$SSB= 0
##$STSI= 32768
##$STSR= 0
##$SW_p= 8223.68421052631
##$SYMM= 0
##$S_DEV= 0
##$TDeff= 65536
##$TDoff= 0
##$TI= <>
##$TILT= no
##$TM1= 0
##$TM2= 0
##$TOPLEV= 0
##$USERP1= <user>
##$USERP2= <user>
##$USERP3= <user>
##$USERP4= <user>
##$USERP5= <user>
##$WDW= 1
##$XDIM= 32768
##$YMAX_p= 476883218
##$YMIN_p= -769210
##$CURPLOT= <Network HP LaserJet P1505>
##$CURPRIN= <$Network HP LaserJet P1505>
##$DFORMAT= <normdp>
##$LAYOUT= <+/1D_H.xwp>
##$LFORMAT= <normlp>
##$PFORMAT= <normpl>
##$SURQMSG= 1
$$ End of Bruker specific parameters
$$ ---------------------------------
##NTUPLES= NMR SPECTRUM
##VAR_NAME=  FREQUENCY,     SPECTRUM/REAL,   SPECTRUM/IMAG
##SYMBOL=    X,             R,               I
##VAR_TYPE=  INDEPENDENT,   DEPENDENT,       DEPENDENT
##VAR_FORM=  AFFN,          ASDF,            ASDF
##VAR_DIM=   32768,         32768,           32768
##UNITS=     HZ,            ARBITRARY UNITS, ARBITRARY UNITS
##FACTOR=    0.250966925370066, 1,           1
##FIRST=     8223.43324360094, 125618,       -294304
##LAST=      0,             49766,           -207836
##MIN=       0,             -769210,         0
##MAX=       8223.43324360094, 476883218,    0
$$ Real data points
##PAGE= N=1
##DATA TABLE= (X++(R..R)), XYDATA
$$ [...]
19551B52451b0208j00222A68911a18537e6433k66792a935j82308g2514j17827
$$ 252451 -20208 -120430 168911 -118537 -56433 -323225 -1935 -184243 -72514 -190341
19541a90341j36702f238l34263A29312h5199k13848c0244O593j9706B21830m9089
$$ -190341 -327043 -6238 -340501 129312 -85199 -299047 -30244 -23651 -43357 221830 172741
19530A72741F2243J8098M627K56342E386c04713D8798K29024i4426k00660O5240
$$ 172741 62243 80341 84968 341310 5386 -304713 48798 277822 -94426 -295086 -229846
19519b29846J13010r5652e0181j00128A19720c08982A0691d01341c3871L123A07837
$$ -229846 -116836 -212488 -50181 -150309 119720 -308982 10691 -401341 -33871 -30748 107837
19507D0407K98490b7348F6239C2024c65253A08696f5518j88606A21325N1709g164
$$ 40407 338897 -27348 66239 32024 -365253 108696 -65518 -254124 121325 173034 -7164
19495A6081h8635E0542J42057a6357A93777m7578a29989H6333l637D151L73873
$$ 16081 -88635 50542 192599 -16357 193777 146199 -129989 86333 82696 4151 378024
19484C78024l6558A2448O6936l6271b46411h392B0570K4497h5055L4328A79750
$$ 378024 341466 12448 79384 43113 -246411 -8392 20570 45067 -85055 -50727 179750
19472B0970a34973F0139a75031C4453i8480j0756a2559k07458l76141h1143C813
$$ 20970 -134973 60139 -175031 34453 -98480 -109236 -12559 -220017 -596158 -81143 3813
19460B56097a26932b4722l6514k5244A60289M5284a25715E9732b14979j09656
$$ 256097 -126932 -24722 -61236 -86480 160289 205573 -125715 59732 -214979 -324635
19450c24635e6330a1701k21660H010a50288h375l22938A15261B8554b69033e0084
$$ -324635 -56330 -11701 -233361 8010 -150288 -8375 -331313 115261 28554 -269033 -50084
19438a94265A06412b42460D6854g09341D8075F58J20005J36843a25285B41894
$$ -194265 106412 -242460 46854 -709341 48075 658 120663 257506 -125285 241894
19427A39858F5460c1971A24289f8575k9497k53419d9996k30603m6731g6404b4811
$$ 139858 65460 -31971 124289 -68575 -98072 -351491 -49996 -280599 -327330 -76404 -24811
19415a45814A24249a06034B02009G0921a21413n2296a1811l33464h9171A25545
$$ -145814 124249 -106034 202009 70921 -121413 -173709 -11811 -345275 -89171 125545
19404b08630A57415n8810B0480J75171A9612A12b60699M3423k38216A61750q0201
$$ -208630 157415 98605 20480 195651 19612 112 -260699 -217276 -455492 161750 81549
19393H1549c10390e6220j4007A5305a88802A15018f1730j15273j63528E5760a91402
$$ 81549 -310390 -56220 -70227 15305 -188802 115018 -61730 -177003 -340531 55760 -191402
19381d07743J0663J30872c0407l28098a06489M5457B85563D1600d9187r2176K0424
$$ -407743 -397080 -266208 -30407 -358505 -106489 -61032 285563 41600 -49187 -141363 -120939
19370a20939I8137L9956j5034a88224j0040g9873A7701R0912c3995j83128g8381
$$ -120939 98137 138093 123059 -188224 -198264 -79873 17701 108613 -33995 -217123 -78381
19358f0179k960A36175o4019d66389a41833b7963C25553d6371K1207D18609B9396
$$ -60179 -63139 136175 72156 -466389 -141833 -27963 325553 -46371 -25164 418609 29396
19346h6129B83547a27194k47697f4004j6093A40002a21724j7172E285e8176l6722
$$ -86129 283547 -127194 -374891 -64004 -80097 140002 -121724 -138896 5285 -58176 -94898
19335i4898j44229H6228d9737B01812a71608F7231c55087d2046A60657m4429c5289
$$ -94898 -239127 86228 -49737 201812 -171608 67231 -355087 -42046 160657 116228 -35289
19323b69006a1498l47968C3991b53113O8630P9983I3458k4172b66288A50768a30661
$$ -269006 -11498 -359466 33991 -253113 -184483 -104500 93458 69286 -266288 150768 -130661
19311C13015A44040k2662f3427n0052A9764f1610B5584J41527p8609N4069F7836
$$ 313015 144040 121378 -63427 -113479 19764 -61610 25584 167111 88502 142571 67836
19299B31509C9066b31611a06033l05316I7206a93232c3736k90632i6298a0131
$$ 231509 39066 -231611 -106033 -411349 97206 -193232 -33736 -324368 -96298 -10131
19288b96922A11535a88957B06729a78764D20926c8630j0870b4716A6710h262l03607
$$ -296922 111535 -188957 206729 -178764 420926 -38630 -49500 -24716 16710 -8262 -311869
19277c11869B60094C4839a7524A25718b19622E8116K12791j16623A5996K96712
$$ -311869 260094 34839 -17524 125718 -219622 58116 270907 154284 15996 312708
19267C12708k7360a82777e8403q2148d4703J4569k0855j41941Q9987A11340c21317
$$ 312708 285348 -182777 -58403 -140551 -44703 -30134 -50989 -192930 -102943 111340 -321317
19255F1449a01713l77321K06722H0293b66808B19683o7873K9745b84198a40577
$$ 61449 -101713 -479034 -272312 80293 -266808 219683 151810 181555 -284198 -140577
19244A92877b10885f2440A48228a10960a4134A23343n0034f9288k71587J41500
$$ 192877 -210885 -62440 148228 -110960 -14134 123343 73309 -69288 -340875 -199375
19234a99375j4731H0626a15960F8491a60869j71366B1582a82315r6859g5013j96040
$$ -199375 -214106 80626 -115960 68491 -160869 -332235 21582 -182315 -279174 -75013 -271053
19223b71053E6150c04022a3113n6417j8579B23101G5264f3489q9668J1600c6360
$$ -271053 56150 -304022 -13113 -69530 -88109 223101 75264 -63489 -153157 -141557 -36360
19211i7479J1934q8027j37366D5188b73671d7718j38555i598I7978a22458p0597
$$ -97479 -85545 -173572 -310938 45188 -273671 -47718 -186273 -9598 97978 -122458 -193055
19200a93055j5160h7716d3561K0939l5811j91736a1887o774k42850c7508j36793
$$ -193055 -208215 -87716 -43561 -22622 -58433 -250169 -11887 -18661 -261511 -37508 -174301
19189a74301L1382j38930e0895q7168M5017A65180g7010j32025L586j36096G3053
$$ -174301 -142919 -281849 -50895 -138063 -93046 165180 -77010 -209035 -205449 -341545 73053
19177b16092B4325b85653I4050c39200C1373E326G29K84298i1180A29238b14214
$$ -216092 24325 -285653 94050 -339200 31373 5326 729 285027 -91180 129238 -214214
19165E6403g6444B95929d4922j35471L149j24619A77010p5444o946L4453i6153
$$ 56403 -76444 295929 -44922 -180393 -177244 -301863 177010 101566 94620 129073 -96153
19153C26813b48753j12270k1530G6906b46601A16856Q3715A7433a97519j07002
$$ 326813 -248753 -361023 -382553 76906 -246601 116856 200571 17433 -197519 -304521
19143c04521B32135b8881j737j53576A06502a26902A66710a48393k15017I9206
$$ -304521 232135 -28881 -30618 -184194 106502 -126902 166710 -148393 -363410 99206
19132I9911M7655h8778p8780O0210c8716k42053B4279e4333B39916C9463L5766
$$ 99911 147566 -88778 -167558 -107348 -38716 -280769 24279 -54333 239916 39463 75229
19121G5229b40832h9489B11864p8356c06843a18049L532j47918I4575a28453k97189
$$ 75229 -240832 -89489 211864 133508 -306843 -118049 -114517 -262435 94575 -128453 -425642
19110d25642J27976h801j51244b5923A36680a9611C9722J6694d4056k65345i959
$$ -425642 -297666 -8801 -160045 -25923 136680 -19611 39722 56416 -44056 -309401 -9959
19098a71817A68654a29899M6325k15043A97910c31660e5632l684l13361A40423
$$ -171817 168654 -129899 -83574 -298617 197910 -331660 -55632 -59316 -372677 140423
19087A05157e706l89025a71187j76563M9819A52921b13786h3697a7186k27781
$$ 105157 -5706 -394731 -171187 -347750 -297931 152921 -213786 -83697 -17186 -244967
19077b44967q3348a6772A15423D1118m134A5629P5226b6029C00649G140q46a95137
$$ -244967 -328315 -16772 115423 41118 36984 15629 90855 -26029 300649 7140 6294 -195137
19064a429j07967q8497m4384N8860A38188a88398D07438a9400B66436i0020E3537
$$ -1429 -109396 -197893 -242277 -183417 138188 -188398 407438 -19400 266436 -90020 53537
19052A9744b43358J13699c537k50630A05945c6096r3078p6025e6690p8453e4598
$$ 19744 -243358 -129659 -3537 -254167 105945 -36096 -129174 -205199 -56690 -135143 -54598
19040B84968c49202G9712e4023m7491a9112G624J7803a5531j00447H4320a79949
$$ 284968 -349202 79712 -54023 -101514 -19112 7624 25427 -15531 -115978 84320 -179949
19028a8758A28953R7990f9558D2310P2024D882O5357J8473j8040R4335a60118
$$ -18758 128953 226943 -69558 42310 114334 4882 70239 88712 70672 165007 -160118
19016a32066O538E8921a67456J5432g4539K5428A7749b18999d5476A21116K1941
$$ -132066 -125528 58921 -167456 -152024 -74539 -49111 17749 -218999 -45476 121116 143057
19005A43057b06462A9653P810b15120e1145l98976e5470q9846n237l2517a077
$$ 143057 -206462 19653 27463 -215120 -51145 -450121 -55470 -145316 -150553 -183070 -1077
18993F7137c1846A03230a76507N6013B86802e5130I8078g4357i601j65844k22813
$$ 67137 -31846 103230 -176507 -120494 286802 -55130 98078 -74357 -9601 -175445 -398258
18982c98258D6837a47047L3055r7773i8777A34264F109P7190L9645D2430b35376
$$ -398258 46837 -147047 -113992 -211765 -98777 134264 6109 83299 122944 42430 -235376
18970h9766A36961c01095B69605b26540L3026O6682O2665I4951M5824k3377g7840
$$ -89766 136961 -301095 269605 -226540 -193514 -126832 -64167 94951 140775 117398 -77840
18958A02699c6381q8603A96757k9798a62752A0016a20994a2158k86272F192a01703
$$ 102699 -36381 -124984 196757 166959 -162752 10016 -120994 -12158 -298430 6192 -101703
18946i8628j821A45430n4963a70222C1465M4977J2757h6876J2716q1305j021f5074
$$ -98628 -100449 145430 90467 -170222 31465 76442 89199 -86876 -74160 -155465 -156486 -65074
18933a49252A9722L70720E3020J809Q1762I376d5018p3805A38556o5397a51097
$$ -149252 19722 390442 53020 54829 136591 9376 -45018 -118823 138556 73159 -151097
18921e6593I0738K26733a15136A4545J73921n3537c54330A55765a33336k5338
$$ -56593 90738 317471 -115136 14545 188466 134929 -354330 155765 -133336 -158674
18911a58674K4843l69210J33318J47470a1195n08035g9436A60786h1658k24557
$$ -158674 -133831 -503041 -369723 -222253 -11195 -519230 -79436 160786 -81658 -306215
18901c06215D4525F149P1685c59303C9685J20358c642A52364b57103i368k86644
$$ -306215 44525 6149 77834 -359303 39685 160043 -3642 152364 -257103 -9368 -296012
18890b96012a5146A81647o4374a58666c6993q0492A38060K527o4907J47666a0801
$$ -296012 -15146 181647 117273 -158666 -36993 -117485 138060 140587 75680 223346 -10801
18878e1065A8004Q5309a08175k68805I0362b09121C2649b18075d0533B18791C6643
$$ -51065 18004 103313 -108175 -376980 90362 -209121 32649 -218075 -40533 218791 36643
18866B73545b02540R0337B1593g1646j39362P3327B17284a9993l8708C60J83542
$$ 273545 -202540 -112203 21593 -71646 -211008 -137681 217284 -19993 -58701 360 183902
18855A83902q1252l2810e8631A4720a74102A78310a93389J2536n232F1420a92324
$$ 183902 102650 69840 -58631 14720 -174102 178310 -193389 -180853 -186085 61420 -192324
18843c0934k5832B0401M4024e7143B3511d59860A26243i6337M2306C0169a37981
$$ -30934 -56766 20401 64425 -57143 23511 -459860 126243 -96337 -54031 30169 -137981
18831A32978b83150O3424A31610A8917d9995q6502o8964e3270a3913q5729D3908
$$ 132978 -283150 -219726 131610 18917 -49995 -136497 -205461 -53270 -13913 -99642 43908
18819c303n4972A70254J81023l5771G8351j7425O4150J79585A29899h025A83443
$$ -3303 -58275 170254 351277 315506 78351 60926 125076 304661 129899 -8025 183443
18807g1876k0785K4846E8991K01121b43414A47007a10380F8929P1385a41887E6910
$$ -71876 -92661 -67815 58991 260112 -243414 147007 -110380 68929 140314 -141887 56910
18795B3495J2238K6858J16174a26336C5926Q9137F0821N1360G327N9315c7615
$$ 23495 35733 62591 178765 -126336 35926 125063 60821 112181 7327 66642 -37615
18783a17115q272O2578C03140b12677j0377j8517A92456b6480n1153B61244b34656
$$ -117115 -125387 -62809 303140 -212677 -223054 -241571 192456 -26480 -77633 261244 -234656
18771b69022f847o2141j05124B61893H8958l4613c49707f6985k27552H0232C6167
$$ -269022 -6847 -68988 -174112 261893 88958 54345 -349707 -66985 -294537 80232 36167
18759A18449e8052A523c60118B01908G3705K2632c21094B04691J25510A61556
$$ 118449 -58052 1523 -360118 201908 73705 96337 -321094 204691 330201 161556
18748b41962b610B77357A16888b04714B57043A04802b4762B17952c40275b4683
$$ -241962 -2610 277357 116888 -204714 257043 104802 -24762 217952 -340275 -24683
18737g7828F3310h1810j79721B76579b50036M2313I5998c8995l59471I8514b16130
$$ -77828 63310 -81810 -261531 276579 -250036 -207723 95998 -38995 -398466 98514 -216130
18725B21218a71522j60965c1295m5567K3446J3229l16844J45836Q6123o178A13038
$$ 221218 -171522 -332487 -31295 -76862 -53416 -40187 -357031 -211195 -125072 -131250 113038
18713I4041d09115R7500J01510A60128e5436B5395J94340c49063P8887i0543p4173
$$ 94041 -409115 -311615 -210105 160128 -55436 25395 219735 -349063 -270176 -90543 -164716
18702a64716c0227k87108A67820c5226q3650A80910b41231C5900f8805a8173j1738
$$ -164716 -30227 -317335 167820 -35226 -118876 180910 -241231 35900 -68805 -18173 -29911
18691b9911A83492a02698D1857b29382K2601F9394e3447D3658b18721e6261j08654
$$ -29911 183492 -102698 41857 -229382 -206781 69394 -53447 43658 -218721 -56261 -164915
18680a64915N7327C29669A30716J75811a71875P8923r3544B27430C4487c01981
$$ -164915 -107588 329669 130716 306527 -171875 -92952 -186496 227430 34487 -301981
18669b06947I2980g7389b7104p1889p4913N6442l0044B94171a45747j59848a8029
$$ -206947 92980 -77389 -27104 -98993 -173906 -117464 -147508 294171 -145747 -305595 -18029
18657A0753P2660J0843J46733K48908k17699a97241g2452C53084d74785a32007
$$ 10753 83413 94256 240989 489897 272198 -197241 -72452 353084 -474785 -132007
18646b74116R0774j8438q67c3009n3022j40806a12661K8656A4139e0147q0392
$$ -274116 -183342 -201780 -202647 -33009 -86031 -226837 -112661 -84005 14139 -50147 -130539
18635a30539b5892k29935O9092L1001B41079H8732J67431m6232a49520k36572
$$ -130539 -25892 -255827 -186735 -155734 241079 88732 256163 209931 -149520 -386092
18625c86092a82845h5863i068G1343a58583g1636F4200a38850F7307a97541A02260
$$ -386092 -182845 -85863 -9068 71343 -158583 -71636 64200 -138850 67307 -197541 102260
18613b2263l0815j95419A77285b09981P2116I354b565A8410d3858D6763c4795
$$ -22263 -53078 -248497 177285 -209981 -137865 9354 -2565 18410 -43858 46763 -34795
18601C6436c36674A0641a72063H1828l1638d1417j82769A14140J78671a75772
$$ 36436 -336674 10641 -172063 81828 50190 -41417 -224186 114140 292811 -175772
18590g4175A05432b3399j10077C05815c52498g0832J061m7241k18162a32096n928
$$ -74175 105432 -23399 -133476 305815 -352498 -70832 -69771 -117012 -335174 -132096 -138024
18579a38024A13181b36604i006B35499r5A3432b55647A83956c23069D9880M5796
$$ -138024 113181 -236604 -9006 235499 235404 13432 -255647 183956 -323069 49880 95676
18568I5676b27951g5383A34899b87845i0175k3397A09722b40159A19782a26899
$$ 95676 -227951 -75383 134899 -287845 -90175 -113572 109722 -240159 119782 -126899
18557b45644j10790q0595A78631p3150a54600m4590q1835n1747B29593b67580
$$ -245644 -356434 -437029 178631 105481 -154600 -199190 -281025 -332772 229593 -267580
18546E2408L0819c2688p0378L8841j22567f1387G7968c0121l13201J24542b2585
$$ 52408 83227 -32688 -103066 -64225 -186792 -61387 77968 -30121 -343322 -218780 -22585
18534c36089F2486a32395k51230C8039K41649A01297b26587f4332F1056b74192
$$ -336089 62486 -132395 -383625 38039 279688 101297 -226587 -64332 61056 -274192
18523A78720a6383l2824G0432c03119a8535j6160G9024c035j03926l0781A56321
$$ 178720 -16383 -49207 70432 -303119 -18535 -34695 79024 -3035 -106961 -137742 156321
18511H0043l5969c45005J04690f0228q8327A20277h9953j04599M4716A20128a42385
$$ 80043 44074 -345005 -240315 -60228 -148555 120277 -89953 -194552 -149836 120128 -142385
18499c8915A22335c47310A81735J1007b90939a28473N9017I6231j3943a91397
$$ -38915 122335 -347310 181735 192742 -290939 -128473 -69456 96231 82288 -191397
18488g2443A02896b31894C79410E5843a65958d7892j38035N45p5378A67586a43734
$$ -72443 102896 -231894 379410 55843 -165958 -47892 -185927 -185382 -260760 167586 -143734
18476A99581I5001L9409f0262K1704B36796a1055j79794c6247I3577l353J14232
$$ 199581 95001 134410 -60262 -38558 236796 -11055 -190849 -36247 93577 90224 204456
18465B04456E4843j1621N738J79219a30418A0924M0097M8300a16766d4903A25600
$$ 204456 54843 43222 48960 228179 -130418 10924 51021 99321 -116766 -44903 125600
18453F2881c7244r9960a375j84807B89596p3949b91113I7320c9596F4936O5689
$$ 62881 -37244 -137204 -1375 -186182 289596 215647 -291113 97320 -39596 64936 130625
18442A30625a29282A68553a97231A84608E8384a82485P4514n9544L509P7857A41784
$$ 130625 -129282 168553 -197231 184608 58384 -182485 -107971 -167515 -164006 -86149 141784
18430f7807A41669a80688I6858a49708C76558H8145Q6304a32033A49742a88419
$$ -67807 141669 -180688 96858 -149708 376558 88145 174449 -132033 149742 -188419
18419b3318n8381c8684Q638H138c13472A10925a65673M590E144J55436A8068f4009
$$ -23318 -81699 -38684 -30046 8138 -313472 110925 -165673 -161083 5144 160580 18068 -64009
18406H9933J15886f53923a53144A51349b32335F2900b22187a5090g311k2967k12895
$$ 89933 205819 -653923 -153144 151349 -232335 62900 -222187 -15090 -7311 -30278 -243173
18395b43173Q2724j64155B05141c59985g1901J9794J5325J4743j3391B58679c13898
$$ -243173 -160449 -324604 205141 -359985 -71901 -52107 -36782 -22039 -35430 258679 -313898
18383a33578O6753L068j00379J3414D69536e58868a46606O2325b6065C8127a81249
$$ -133578 -66825 -63757 -164136 -150722 469536 -558868 -146606 -84281 -26065 38127 -181249
18371A24336g5947B70103A13781c54738a75675N3801A34933E3445K24484a57531
$$ 124336 -75947 270103 113781 -354738 -175675 -121874 134933 53445 277929 -157531
18360b19537J8993A9553b6678q1565j13986A18306i6962j09C205b08704d5518
$$ -219537 -200544 19553 -26678 -108243 -222229 118306 -96962 -97071 3205 -208704 -45518
18348a33707C10540d4038A16122a32535c7946j47910k22246a7895C4585F184b07518
$$ -133707 310540 -44038 116122 -132535 -37946 -185856 -408102 -17895 34585 6184 -207518
18336A9862c52147f691j24873O59A83118o383Q7665n3349c81970F3390J9465O484
$$ 19862 -352147 -6691 -131564 -130905 183118 176735 264400 211051 -381970 63390 82855 89339
18324H9339R2763O2100b99367B26049b97142B8440R830e2270j07827K5655A79735
$$ 89339 182102 244202 -299367 226049 -297142 28440 38270 -52270 -160097 -134442 179735
18312b37784c6324l23146J71165H1427a53474k41794D3964h1435C19284p2281
$$ -237784 -36324 -359470 -188305 81427 -153474 -395268 43964 -81435 319284 247003
18302B47003A0045J04174b22300G9292K41066A20362D9271a90737b7497k19289
$$ 247003 10045 114219 -222300 79292 320358 120362 49271 -190737 -27497 -246786
18292b46786i5170A83279b01087k7119I529J33172b34214Q3877D305J78821a10722
$$ -246786 -95170 183279 -201087 -228206 9529 142701 -234214 -150337 4305 183126 -110722
18280b65875b6170A0444b37073J06347H8195b6386l9403j04690D3817b3320A06098
$$ -265875 -26170 10444 -237073 -130726 88195 -26386 -65789 -170479 43817 -23320 106098
18268A02839b8945G9187P1965a21082j72932g0501b9894C15673a71547A74490
$$ 102839 -28945 79187 151152 -121082 -294014 -70501 -29894 315673 -171547 174490
18257i2557A02996c01003I7624a13952B16936h2846D4998a38716A89566m2888
$$ -92557 102996 -301003 97624 -113952 216936 -82846 44998 -138716 189566 146678
18247A46678b31972k17139G4420J93392j8811K31075A35243L426a71113G987a86508
$$ 146678 -231972 -449111 74420 267812 249001 480076 135243 138669 -171113 7987 -186508
18235a76555C0186e3588j25564O383L2658E4953o82I453b4711B6015a85021k7581
$$ -176555 30186 -53588 -179152 -172769 -140111 54953 54271 9453 -24711 26015 -185021 -212602
18223b12602A86487K9044H750J99719a62928A15673c36887c830A8828a1024l06897
$$ -212602 186487 215531 8750 208469 -162928 115673 -336887 -3830 18828 -11024 -317921
18212c17921E5252O8161g115A72072b55511G3647a6859B89688d0018m1931B3259
$$ -317921 55252 123413 -7115 172072 -255511 73647 -16859 289688 -40018 -81949 23259
18200a37299f3063B8272c7840j08171I1562K5646a03826p2502n738B26530a43579
$$ -137299 -63063 28272 -37840 -146011 91562 117208 -103826 -176328 -182066 226530 -143579
18188b24829c7503k82360a0915G9253J16484a34562A59767J11693a24996K6299
$$ -224829 -37503 -319863 -10915 79253 195737 -134562 159767 271460 -124996 -98697
18178i8697O746C10169E8354d0329A581b90687A66950q2153J2315b63013G717
$$ -98697 -91951 310169 58354 -40329 1581 -290687 166950 84797 97112 -263013 7717
18166a0117A7591Q5633b74233i8191m9122n9764C3059b57002A79110k0615G0966
$$ -10117 17591 103224 -274233 -98191 -147313 -207077 33059 -257002 179110 158495 70966
18154a6779j00602A82425O0245f4065n4759G8483g5014r7012I1742b41772A44004
$$ -16779 -117381 182425 242670 -64065 -118824 78483 -75014 -172026 91742 -241772 144004
18142A00549J31341d4966C57400c05702c1492j14632A39994b62042Q4485N3659
$$ 100549 231890 -44966 357400 -305702 -31492 -146124 139994 -262042 -177557 -123898
18132a23898D8821L19512B9876a6837p8309A27630A649c22702J26931j05022B55765
$$ -123898 48821 368333 29876 -16837 -95146 127630 1649 -322702 -195771 -300793 255765
18120a14176j08114R6917A48643i0899L2950j11301A04844a59726d4716C62678
$$ -114176 -222290 -125373 148643 -90899 -57949 -169250 104844 -159726 -44716 362678
18109B80988c9308j56942A321b11726Q3977K8961B80498c33310a53842E5660c60393
$$ 280988 -39308 -196250 1321 -211726 -127749 -98788 280498 -333310 -153842 55660 -360393
18097A25604A7015J76167b0506C9473N6388J41569b47668M6936P9726A84499i6460
$$ 125604 17015 193182 -20506 39473 95861 237430 -247668 -200732 -121006 184499 -96460
18085g5276r1612k2422L143g8553j3096j4984K3797E6189c25350o3384B1622J19072
$$ -75276 -166888 -189310 -186167 -78553 -91649 -106633 -82836 56189 -325350 -388734 21622 140694
18073A40694c04945M3151c3730j10033O2260n6238k11104Q9194b7588A94622G4194
$$ 140694 -304945 -261794 -33730 -143763 -81503 -137741 -348845 -259651 -27588 194622 74194
18061a76607J2746a7291H6795A9396a23658e6892I5893C2527o541b55799K5571
$$ -176607 -163861 -17291 86795 19396 -123658 -56892 95893 32527 25986 -255799 -230228
18050b30228a00817j93267K4693B0878c82463a23260F2418d0666m8939I7320b71877
$$ -230228 -100817 -294084 -269391 20878 -382463 -123260 62418 -40666 -89605 97320 -271877
18038A39073L2400N2755k1888h3507n4820o2499A4073d1329k314j67308i7326
$$ 139073 171473 224228 202340 -83507 -138327 -200826 14073 -41329 -43643 -210951 -97326
18026b58556B79831a91622e4570j43438A910K0690H380K9084a04693A77726P3075
$$ -258556 279831 -191622 -54570 -198008 1910 22600 8380 37464 -104693 177726 250801
18015B50801d47052d7636C095M30823A07530J14065E8893d3062p588D9194b40661
$$ 250801 -447052 -47636 3095 433918 107530 221595 58893 -43062 -50650 49194 -240661
18003I7008D1166a76407r9924B23885r4418b41929R7732c1031H7142a65963n796
$$ 97008 41166 -176407 -276331 223885 129467 -241929 -144197 -31031 87142 -165963 -171759
17992a71759B3359P8908h6659B12720j9942J63748a00065k7578o4957F0398a7090
$$ -171759 23359 102267 -86659 212720 192778 356526 -100065 -127643 -192600 60398 -17090
17980A12315B2287J24274h2514B23722r7973i6215d3777A83265l0749K05735b28306
$$ 112315 22287 146561 -82514 223722 125749 -96215 -43777 183265 152516 358251 -228306
17968A49550b28889B43955C5637M1986B9666K01222q5077C6200j5111b09927A67114
$$ 149550 -228889 243955 35637 77623 29666 230888 145811 36200 21089 -209927 167114
17956g6199N276A6187e457H9652K3662Q9770H3032a68836o5853G0647J95063e8483
$$ -76199 -70923 16187 -5457 89652 113314 203084 83032 -168836 -234689 70647 265710 -58483
17943f1671b9960B7705M8099J92500i9717A02046B6195K9576P0129J20214a80431
$$ -61671 -29960 27705 75804 268304 -99717 102046 26195 55771 125900 246114 -180431
17931D0432J14665b14922M9442A95616B3545b30923g4333n453A56303b89146j33472
$$ 40432 155097 -214922 -165480 195616 23545 -230923 -74333 -79786 156303 -289146 -422618
17920d22618B0554J38311J55431F6473b88667P437A36683E5986J75550H4335b27855
$$ -422618 20554 158865 314296 66473 -288667 -281230 136683 55986 231536 84335 -227855
17908A1977a60710A40773K3116d3885H5267M3185d71433d7911D6237a78328d9535
$$ 11977 -160710 140773 163889 -43885 85267 128452 -471433 -47911 46237 -178328 -49535
17896a90246A00624J20766j09879a37844j21299a8138q1874k44230A97057f2916
$$ -190246 100624 221390 111511 -137844 -259143 -18138 -100012 -344242 197057 -62916
17885A78531a26842a4535j4627B506a70364a8478j21652E5888c20043D7952i031
$$ 178531 -126842 -14535 -29162 2506 -170364 -18478 -140130 55888 -320043 47952 -9031
17873a69569M2094o7586I7407L21326b13914B40997r5148g8476l24527i0485F3410
$$ -169569 -127475 -195061 97407 418733 -213914 240997 145849 -78476 -403003 -90485 63410
17861c15754A90628a03895D1895d6494r5390A55140h8138A77390j570D8361K84185
$$ -315754 190628 -103895 41895 -46494 -141884 155140 -88138 177390 175820 48361 332546
17850C32546f2476A80930o3844g8199o1314A42740B4553a35165A02013M7305a2563
$$ 332546 -62476 180930 117086 -78199 -139513 142740 24553 -135165 102013 149318 -12563
17838h271n3848d964E42832i7766B72769a66300O4398B8159e4089I4829C3176
$$ -8271 -62119 -4964 542832 -97766 272769 -166300 -101902 28159 -54089 94829 33176
17826A84643c6031F3238c13217D6809b43583B34587c9407F5303d6470D24033A94028
$$ 184643 -36031 63238 -313217 46809 -243583 234587 -39407 65303 -46470 424033 194028
17814A81522a26069A41715c29231e6040k88454J57709g4603A21898J25830d699
$$ 181522 -126069 141715 -329231 -56040 -344494 -186785 -74603 121898 247728 -4699
17803B31302E8115P6894o4654a45372B33961a30093r0857B8341b11157c2211j20446
$$ 231302 58115 135009 70355 -145372 233961 -130093 -220950 28341 -211157 -32211 -152657
17792a52657A07382k150M2100K3660e6839o7786j34912A0744m833P7673a68225
$$ -152657 107382 105232 147332 170992 -56839 -124625 -259537 10744 5911 83584 -168225
17780e9959C8052K65443a2654B6259e1074H6669a20644C2831J52349a16071J2274
$$ -59959 38052 303495 -12654 26259 -51074 86669 -120644 32831 185180 -116071 -103797
17769a03797j58466A84942a13761M593J2356B43815b42635L1202C9643J57447
$$ -103797 -262263 184942 -113761 -109168 -96812 243815 -242635 -211433 39643 197090
17759A97090n8819a07630A8077L94061F2776h8548B13405g248m8647m1125D9095
$$ 197090 138271 -107630 18077 412138 62776 -88548 213405 -7248 -55895 -97020 49095
17747E7557L2384b84583R6555q5119j6355B31883a66000A46968h2427c0070o8010
$$ 57557 89941 -284583 -188028 -273147 -289502 231883 -166000 146968 -82427 -30070 -98080
17736i8080J4707o3120G1229J27053F4386b87542C20429f7537a8464P969B50586
$$ -98080 -83373 -146493 71229 198282 64386 -287542 320429 -67537 -18464 -10495 250586
17724H3410K74K9312J91251l2801a94824A66087M8182B4310f5447j1262A78444
$$ 83410 83684 112996 304247 271446 -194824 166087 214269 24310 -65447 -76709 178444
17712C7398b26598n8567G3374a1757k08680P9141I7798K59940a52850l1365A048
$$ 37398 -226598 -285165 73374 -11757 -220437 -141296 97798 357738 -152850 -184215 1048
17700g8966A54437f9050A26837N6913a58201B7285N862O8477M4599J22058a52242
$$ -78966 154437 -69050 126837 183750 -158201 27285 33147 101624 146223 268281 -152242
17688g2631A31194h6244q4804n3728K363G1260N0450d8759A64724b67630j7904
$$ -72631 131194 -86244 -171048 -224776 -222413 71260 121710 -48759 164724 -267630 -285534
17677b85534F4668P9950A7387f3129B47865J50427D688d9031a5187j06580j33786
$$ -285534 64668 144618 17387 -63129 247865 398292 4688 -49031 -15187 -121767 -255553
17666b55553A1540R5883L1679b8745F5649K15400j08895l2427a02163L3050r4388
$$ -255553 11540 107423 139102 -28745 65649 281049 172154 139727 -102163 -69113 -163501
17655a63501A86554C8010M3724J09539b670A50233D1357i3228j45026b9871B40327
$$ -163501 186554 38010 81734 191273 -2670 150233 41357 -93228 -238254 -29871 240327
17643B29630D1744a84140G2132A7573f1895F4981b17231L2473q4675C1632J10187
$$ 229630 41744 -184140 72132 17573 -61895 64981 -217231 -184758 -269433 31632 141819
17632A41819B6646R7809l0291P7584j2885d9587o9921A77049b5622D2008a04300
$$ 141819 26646 124455 94164 171748 158863 -49587 -119508 177049 -25622 42008 -104300
17620A79843i5013A25012k1145J62783h3036G8531c261H5155a08151L0502A42023
$$ 179843 -95013 125012 103867 266650 -83036 78531 -3261 85155 -108151 -77649 142023
17608F6615m511a0115j18372j63969a00998A06643k0488J38026a20526p597A54689
$$ 66615 62104 -10115 -128487 -292456 -100998 106643 86155 224181 -120526 -128123 154689
17596b70773A12019D2402K57921I591e5471E4640R955Q6161a23297A28914C9736
$$ -270773 112019 42402 300323 9591 -55471 54640 64595 150756 -123297 128914 39736
17584a62326C1513K22991b7489A90720b3857p9631C33672i173A56763p4325n857
$$ -162326 31513 254504 -27489 190720 -23857 -103488 333672 -9173 156763 82438 76581
17573G6581M1455a59979P971j43061C0791C413a9974k01264A50371D2381J18148
$$ 76581 118036 -159979 -152008 -295069 30791 3413 -19974 -221238 150371 42381 160529
17562A60529p1467K4242J2263K16133j48321n4007B4000b0724A9021a12284C14936
$$ 160529 89062 113304 125567 341700 193379 139372 24000 -20724 19021 -112284 314936
17550D0707g3373n8191J9333j9738E3761b04012Q4962F3568B1752L83799J84458
$$ 40707 -73373 -131564 -112231 -131969 53761 -204012 -119050 63568 21752 405551 590009
17539E90009f4949J2378D6771K0411a51420I7478B8797M16157a59299A14880K8494
$$ 590009 -64949 -52571 46771 67182 -151420 97478 28797 444954 -159299 114880 143374
17528A43374h8884C04106j14560M5800a96473A96907q8599C8351K2664h9713c9621
$$ 143374 -88884 304106 189546 235346 -196473 196907 108308 38351 61015 -89713 -39621
17516i5193G4950Q9453D930J73554k2036J4668B1079d1513K448C6794J98656b82746
$$ -95193 74950 164403 4930 178484 156448 171116 21079 -41513 -39065 36794 235450 -282746
17503g2773J4136F4631b05159C34976A64414l2371B405f900G3758K34042c5546
$$ -72773 -58637 64631 -205159 334976 164414 132043 2405 -6900 73758 307800 -35546
17491D2984a49861B56794a97426b8970A39236c22868E6944P4267J60850A02630
$$ 42984 -149861 256794 -197426 -28970 139236 -322868 56944 131211 292061 102630
17480A22927F224K35129i0653A52471a47032C25730K1900j05446G2393J56676
$$ 122927 6224 241353 -90653 152471 -147032 325730 347630 242184 72393 229069
17470B29069J13809k1185j04023j3954b56975A73488J18058K3774d81C86671A11201
$$ 229069 342878 321693 217670 203716 -256975 173488 291546 315320 -481 386671 111201
17458E9411R9257c0213C02947A38203B9188J63868P8237o7608J06939n4133O8173
$$ 59411 158668 -30213 302947 138203 29188 193056 271293 203685 310624 256491 324664
17447C24664k8800j0968J19492c4857j78593A6180K43107K5477E0736J88885K2807
$$ 324664 295864 284896 404388 -34857 -213450 16180 259287 284764 50736 239621 262428
17436B62428K20045h4070B16270a44848B39817K42310A7607K72338l8214A00277
$$ 262428 482473 -84070 216270 -144848 239817 482127 17607 289945 251731 100277
17425E7411K61423j21134J59887A59519L4033H0079k1537Q2144g6624A23423J23017
$$ 57411 318834 197700 357587 159519 193552 80079 58542 140686 -76624 123423 246440
17414B46440A4023N61469D8853J56231e4105F28624B07399m0477G5683K32450
$$ 246440 14023 575492 48853 205084 -54105 628624 207399 166922 75683 308133
17404C08133p2700c60532A27124l3695b70173G7983O3915a1432r6424A59184Q3432
$$ 308133 235433 -360532 127124 93429 -270173 77983 141898 -11432 -107856 159184 242616
17393B42616I5868O4935E8577J56507m8901O077j2090g6929A20158J31465A05012
$$ 242616 95868 160803 58577 215084 166183 172260 160170 -76929 120158 251623 105012
17381D22988A43349l8259J09508m7273l1585R8166b64481G3013d7514b1492H5631
$$ 422988 143349 105090 214598 167325 135740 233906 -264481 73013 -47514 -21492 85631
17369D76127a60192e2951j03191l18C76745A25795K1840j0592L8805G8252b35427
$$ 476127 -160192 -52951 -156142 -156460 376745 125795 147635 137043 175848 78252 -235427
17357c0819A87005a6131A25598C2095P0164m1094k4776J76691j2039J0742B450
$$ -30819 187005 -16131 125598 32095 102259 61165 36389 213080 201041 211783 2450
17345B52813D1502Q0282C6177O2821h366K098o9567r4261A61720J52908A39090
$$ 252813 41502 121784 36177 98998 -8366 -6268 -75835 -170096 161720 314628 139090
17333A33573N7299m2605P6318m5374J60315A36095E7881J04060K73660b32376
$$ 133573 190872 148267 224585 179211 339526 136095 57881 161941 435601 -232376
17322A68929Q2298g5412A99704K3865b39324A56996A2990J05543l6696K4547a02004
$$ 168929 251227 -75412 199704 223569 -239324 156996 12990 118533 81837 106384 -102004
17310A36147J92215G2531b70086I2368b903A8477E587N4464M28809b43449H7795
$$ 136147 328362 72531 -270086 92368 -2903 18477 5587 60051 488860 -243449 87795
17298D38255A76110K9851G696a13434A75627f3276D9915K02984J3835E8428L30754
$$ 438255 176110 205961 7696 -113434 175627 -63276 49915 252899 266734 58428 389182
17287C89182b4862N296B93853r2256J24579G0521Q723B8471K94113g457p306H2633
$$ 389182 -24862 -19566 293853 201597 326176 70521 79244 28471 322584 -7457 -14763 82633
17274B16991A01341J43447c624l7515B07098J24620A44823R5144j10819m3673
$$ 216991 101341 244788 -3624 -41139 207098 331718 144823 239967 129148 85475
17264H5475h4551B30126i8856A17073J37428K27076j96952a36953k17101a21654
$$ 85475 -84551 230126 -98856 117073 254501 481577 284625 -136953 -354054 -121654
17253B9082M6237J63185A02643K18258H5662k3590i2008A9684J78025n8839F1591
$$ 29082 75319 238504 102643 320901 85662 62072 -92008 19684 197709 138870 61591
17241A9468K3139e2511A80836m6422L11643C6988M0956K77122r0763J65412e4034
$$ 19468 42607 -52511 180836 134414 446057 36988 77944 355066 264303 429715 -54034
17229a28784B01642E608O13116a39814A06966A5016L27450F954L08573c0569q3339
$$ -128784 201642 5608 618724 -139814 106966 15016 342466 6954 315527 -30569 -113908
17218a13908D47783K61644A80386q0415L90138j37687j50735E9149a11520A30379
$$ -113908 447783 709427 180386 99971 490109 352422 201687 59149 -111520 130379
17207H1274a06108L3375A91261p5368D6820P8708J20201J09512A55405a67810
$$ 81274 -106108 -72733 191261 115893 46820 125528 245729 355241 155405 -167810
17196C44754m9886q3565L3231r3412K46256q7068o1163L26928B50761J22064A57645
$$ 344754 294868 211303 244534 151122 397378 310310 249147 576075 250761 372825 157645
17184A24776J1792a75128C03014E8649J10204J16757n8505p786o2840j0124L79016
$$ 124776 136568 -175128 303014 58649 168853 285610 227105 219319 156479 146355 525371
17173E25371k30176R270K2587A46164D3863L56664q464o9763J28672m1940r8371
$$ 525371 295195 304465 327052 146164 43863 400527 392063 322300 450972 409032 310661
17162C10661n1985m0480K52911q1041n1574K59762A50662O5568L63785B81258
$$ 310661 258676 218196 471107 390066 338492 598254 150662 216230 580015 281258
17151C38585Q4220G140K29569O9965m6761j01635J0284J85793O1528o3992o2307
$$ 338585 422805 7140 236709 306674 259913 158278 168562 354355 415883 351891 289584
17140B89584A02820L70722A62767N29448j77672o4601o7367L16219A97784J08262
$$ 289584 102820 473542 162767 692215 514543 449942 382575 698794 197784 306046
17130C06046l1893k4288K71167o1486A28488J0719J56278K17249k8688H3263K84755
$$ 306046 274153 249865 521032 459546 128488 139207 295485 512734 484046 83263 368018
17119C68018n2646A06243L15841j89243L22757j31395M3975A33632K65553r7345
$$ 368018 315372 106243 422084 232841 555598 424203 468178 133632 399185 301840
17109C01840l131J38348k15927H6452M56934D0613D69K13868P1057p507M01664
$$ 301840 298709 437057 221130 86452 543386 40613 469 214337 285394 277887 679551
17098F79551B01087r5881L08586j81867L5686j01149J67903A15006J69940K454
$$ 679551 201087 105206 413792 231925 267611 166462 334365 115006 284946 287400
17088B87400D2957k1401L90112r1514L8023J07401n9655q5608L482r1911L98702
$$ 287400 42957 21556 411668 320154 358177 465578 405923 320315 323797 231886 630588
17077F30588k00257j90091M86249C51594P7296q3776J97347k15395L46964l09875
$$ 630588 430331 240240 726489 351594 428890 345114 542461 327066 674030 364155
17067C64155A31385J56767L7669J56964j22643J24887j46777q3494J09083L59697
$$ 364155 131385 288152 325821 482785 360142 485029 338252 254758 363841 723538
17057G23538j77064J03064k93761J29588k02212R196M70748k22078J5033M4410
$$ 723538 546474 649538 355777 485365 283153 292349 763097 541019 556052 600462
17047F00462j41490M8282j16016N862A89282P6847L68040j04600j29244K47512
$$ 600462 458972 507254 391238 397100 189282 266129 634169 529569 400325 647837
17037F47837o1740N181j97353j15098M9959J59095K3475O6602k88218K96447j39928
$$ 647837 586097 591278 393925 278827 328786 487881 511356 577958 289740 586187 446259
17026D46259p5869J84412p647N4114j23978N1229J68399J00753k7210L6943B94985
$$ 446259 370390 554802 547155 601269 477291 528520 696919 797672 770462 807405 294985
17014C64088J01158J67784Q9814C07318M02365B07709L92904L7953K34405l98323
$$ 364088 465246 633030 722844 307318 709683 207709 600613 638566 872971 474648
17004D74648R0575Q1129O6082j34249P2457J75951l0783J34433D28987M63714
$$ 474648 565223 646352 712434 578185 650642 826593 795810 930243 428987 892701
16994H92701j50962l03251N60641m23453J8427P6721l03508M50415m3658Q6380
$$ 892701 741739 438488 999129 575676 594103 670824 367316 817731 774073 860453
16984H60453J94407j56705j41367J01808J30574r0546p9955J7323K05003k14069
$$ 860453 1054860 898155 756788 858596 989170 898624 818669 835992 1040995 826926
16974H26926p6190J31038k90634M23911k09523j91104J59290l3611L22153k81666
$$ 826926 750736 881774 591140 1015051 805528 614424 773714 740103 1062256 780590
16964G80590K76801j43192P1912R6385k03999l919J07968p5382J00019j45308
$$ 780590 1057391 914199 986111 1082496 878497 874578 982546 907164 1007183 861875
16954H61875j44038M33068j57539K21169j937j60303K30732m03799K28920O8165
$$ 861875 717837 1150905 993366 1214535 1212598 1052295 1283027 879228 1108148 1176313
16944A176313j400K0955L8183k19197N8672P6403k89818L24786m05623N22455
$$ 1176313 1174913 1195868 1234051 1014854 1073526 1149929 860111 1184897 779274 1301729
16934A301729k52665k20831L36300r5615M2611j25945J82878K52703j89798M57527
$$ 1301729 1049064 828233 1164533 1068918 1111529 985584 1168462 1421165 1231367 1688894
16924A688894k72669k99882M76804p53031K62315M05733l1361J63140j99864k1923
$$ 1688894 1416225 1116343 1593147 840116 1102431 1508164 1476803 1639943 1440079 1418156
16914A418156j40994K16841J30615k23390K55611J50331l41346J5304J87853K85504
$$ 1418156 1277162 1494003 1624618 1401228 1656839 1807170 1465824 1481128 1668981 1954485
16904A954485l88748J64788j62543L0495Q7850J72863j20412M2161j80798M9726
$$ 1954485 1565737 1730525 1567982 1598477 1686327 1859190 1738778 1780939 1600141 1649867
16894A649867L30874l26200R0814K12585J280l29829L95092J67362m56912R5232
$$ 1649867 1980741 1654541 1745355 1957940 1959220 1629391 2024483 2191845 1734933 1830165
16884A830165q369O30840k93194K16618o60790N46853j95250K10324N6531j06216
$$ 1830165 1821796 2452636 2159442 2376060 1715270 2262123 2066873 2277197 2333728 2227512
16874B227512j65481P2353L15046l25874K41375j48346J14647M11929m91317P1973
$$ 2227512 2062031 2134384 2449430 2123556 2364931 2216585 2331232 2743161 2251844 2323817
16864B323817M26229j75210j78692L40505k30923M39496q8788k30883R0053K5339
$$ 2323817 2750046 2574836 2396144 2736649 2505726 2945222 2856434 2625551 2715604 2740943
16854B740943J28068K74477j82475K72722j1304q0531J80940p1854L0473J84626
$$ 2740943 2869011 3143488 2961013 3233735 3222431 3141900 3322840 3250986 3281459 3466085
16844C466085k20529m8519N26699m61229N20432M08712n23920M80705n21214R6603
$$ 3466085 3245556 3197037 3723736 3262507 3782939 4191651 3667731 4148436 3627222 3723825
16834C723825M92347k33032K41252M6549N6041j8403K47807R7859r2557o5257
$$ 3723825 4216172 3983140 4224392 4270941 4326982 4308579 4556386 4654245 4561688 4496431
16824D496431J99394J53213O2600O6866O9461J41198K17595Q0605K97725l97117
$$ 4496431 4695825 4849038 4911638 4978504 5047965 5189163 5406758 5487363 5785088 5387971
16814E387971K87852J96534J61951j16052M21761K76375j28515L91410M62683
$$ 5387971 5675823 5872357 6034308 5918256 6340017 6616392 6487877 6879287 7341970
16805G341970j14650J43343j11077r4085M75857L31622J31734K84703K35648m5831
$$ 7341970 7227320 7370663 7259586 7165501 7641358 7972980 8104714 8389417 8625065 8579234
16795H579234M31364J08941J33554N06623K04563O1361J90916L39087M58236K87222
$$ 8579234 9010598 9119539 9253093 9759716 9964279 10025640 10216556 10555643 11013879 11301101
16785A1301101L50767J54643K66669L23084O79883J66455N65976K86980N48683
$$ 11301101 11651868 11806511 12073180 12396264 13076147 13242602 13808578 14095558 14644241
16776A4644241M28827N70656M83384M35951R25644L01412P19305M80914O85233
$$ 14644241 15073068 15643724 16127108 16563059 17488703 17790115 18509420 18990334 19675567
16767A9675567J073865O07987P00461R30616P71335Q85400J090371P92669J769768
$$ 19675567 20749432 21357419 22057880 22988496 23759831 24645231 25735602 26528271 28298039
16758B8298039K72191K013743J101503J385150J472961J658017J934463J751260
$$ 28298039 28570230 30583973 31685476 33070626 34543587 36201604 38136067 39887327
16750C9887327J826824J974286K292279K363217K374261L289701K853754L087085
$$ 39887327 41714151 43688437 45980716 48343933 50718194 54007895 56861649 59948734
16742E9948734L559266L533973L926089M216194M727413M902196M936095N661029
$$ 59948734 63508000 67041973 70968062 75184256 79911669 84813865 89749960 95410989
16734I5410989O310428O089274O644101P104352P909270P549597Q392822P716994
$$ 95410989 101721417 107810691 114454792 121559144 129468414 137018011 145410833 153127827
16726A53127827Q341881Q441009P613615P145425O711925N862115M575579L284420
$$ 153127827 161469708 169910717 177524332 184669757 191381682 197243797 201819376 205103796
16718B05103796J875794J53973j192620k283264m061927n131867o264211o705871
$$ 205103796 206979590 207133563 205940943 203657679 199595752 194463885 188199674 181493803
16710A81493803p650542q342630p829221q748451q264122q106487p570514p569605
$$ 181493803 173843261 165500631 157671410 148922959 140658837 132552350 124981836 117412231
16702A17412231p208903o914113o346226n423007n743100n617477m832608m324856
$$ 117412231 110203328 103289215 96942989 91519982 85776882 80159405 75326797 71001941
16694G1001941l895370l940167l644720l313595k963537l006656k163821l023202
$$ 71001941 67106571 63166404 59521684 56208089 53244552 50237896 48074075 45050873
16686D5050873k269117j978404k218273j876500j702774j662273j160806j864685
$$ 45050873 42781756 40803352 38585079 36708579 35005805 33343532 32182726 30318041
16678C0318041j188900j497174r65127j228517j017526p22808j144303p74039
$$ 30318041 29129141 27631967 26666840 25438323 24420797 23697989 22553686 21779647
16670B1779647r63409p60566p44055p64609n27039q39518l52979j25936j366356
$$ 21779647 20816238 20055672 19311617 18547008 18019969 17180451 16827472 16701536 15335180
16661A5335180q0032o43054m84773n16503l49555l48027o93080k16913k96914
$$ 15335180 15255148 14612094 14127321 13610818 13261263 12913236 12220156 12003243 11706329
16652A1706329p97119L7381j32729m51558k31096o44043L55385n28158m51062
$$ 11706329 10909210 10946591 10813862 10362304 10131208 9487165 9842550 9314392 8863330
16643H863330P1624k46555l79740J76610l51200n29840L801k58478P1120m00915
$$ 8863330 8934954 8688399 8308659 8485269 8134069 7604229 7608030 7349552 7420672 7019757
16633G019757k87070R2280l99059j99369l48103J96864j45752j76904j02962m6587
$$ 7019757 6732687 6824967 6425908 6226539 5878436 6075300 5929548 5752644 5649682 5603095
16623E603095k45356o3540j70753l7722j10862L19342j85827l23899j66071j14540
$$ 5603095 5357739 5294199 5123446 5085724 4974862 5294204 5108377 4784478 4618407 4503867
16613D503867m12684L90887l35341J16685l30288J14217k92558L89790R375k92748
$$ 4503867 4091183 4482070 4146729 4263414 3933126 4047343 3754785 4144575 4153950 3861202
16603C861202j79053N7445j46221j44406L5251k99711L12863k08654l54133P0233
$$ 3861202 3682149 3739594 3593373 3448967 3484218 3184507 3497370 3288716 2934583 3004816
16593C004816J00418r0887L1073l28485P7365J59709k67551r9303j88904K23462
$$ 3004816 3105234 3014347 3045420 2716935 2794300 2954009 2686458 2587155 2398251 2621713
16583B621713J74530j94237n22995M54617p3702r1560J66602l35267L0866J01668
$$ 2621713 2796243 2602006 2079011 2533628 2459926 2368366 2534968 2199701 2230567 2332235
16573B332235K3231k71961J01788N8453l28167K9857j64755K50034O7116O6138
$$ 2332235 2355466 2083505 2185293 2243746 1915579 1945436 1780681 2030715 2097831 2163969
16563B163969k54937n7718R6076P3216m48619j14788L61354j96181J60944o039
$$ 2163969 1909032 1851314 1947390 2020606 1571987 1457199 1818553 1622372 1783316 1777277
16553A777277k33350J13369N79J37668j85355K82596m50007K91595m80149J03181
$$ 1777277 1543927 1657296 1657875 1795543 1610188 1892784 1442777 1734372 1254223 1357404
16543A357404J27166k15042K46659j54755N3651j32943J93907J4718k23098L94079
$$ 1357404 1484570 1269528 1516187 1361432 1415083 1282140 1476047 1490765 1267667 1661746
16533A661746m13457J78773o1405j70777j31085m9770J30781K52613N1897l4877
$$ 1661746 1248289 1427062 1365657 1194880 1063795 1014025 1144806 1397419 1449316 1414439
16523A414439j51503j63529J39489j53754p4688j60038K78612l42852L27068j72873
$$ 1414439 1262936 1099407 1238896 1085142 1010454 850416 1129028 786176 1113244 940371
16513I40371q5952J87534l93413N69747k11858k24754J26491J38714l66879K56173
$$ 940371 854419 1041953 648540 1218287 1006429 781675 908166 1046880 680001 936174
16503I36174L1994M88242j08000n16402K89744E55257M42080l93114P2302N0367
$$ 936174 968168 1456410 1348410 832008 1121752 555257 997337 604223 676525 726892
16493G26892K30885J84645l67947k34352M60948D73963K87267M6721o1763j38688
$$ 726892 957777 1142422 774475 540123 1001071 473963 761230 807951 746188 607500
16483F07500K87352P1391j75335J29695k42463J91328k9951l63020K70185J56050
$$ 607500 894852 966243 790908 920603 678140 869468 839517 476497 746682 902732
16473I02732k54822Q3664k9349M8723j95092J55874j30792r9866l921L13029k7015
$$ 902732 647910 731574 702225 750948 555856 711730 580938 481072 477151 790180 763165
16462G63165j11978k09993Q1479k11504O12326m51985O2287r594l5817K6204j80817
$$ 763165 651187 441194 522673 311169 923495 471510 533797 524203 488386 514590 333773
16451C33773J29081K47342p1348j14947M9124B01174N92283C61263M3417R7982
$$ 333773 462854 710196 638848 523901 573025 201174 793457 361263 404680 502662
16441E02662K47632j38684K0982j36220n898j7829Q2430k72470P6126N3427p2329
$$ 502662 750294 611610 632592 496372 490474 472645 555075 282605 358731 412158 339829
16430C39829K7472J19028j9335j10581L02930L1592o2914A07651K36654M13107
$$ 339829 367301 486329 466994 356413 659343 690935 628021 107651 344305 757412
16420G57412j69747k24840k3702j05704O7860L02434k68505J8774j41683K10687
$$ 757412 587665 362825 339123 233419 301279 603713 335208 353982 212299 422986
16410D22986J07696j52479j84295J95595Q587q0116O1406R5089o487J022j61106
$$ 422986 530682 378203 193908 389503 398090 317974 379380 474469 467982 469004 307898
16399C07898J03410m4551j40175J16750o2237P3867r8704J88876A85019J80455
$$ 307898 411308 366757 226582 343332 281095 354962 256258 445134 185019 365474
16389C65474K87452k09700J71849B42900J21797L11638k82739j76747J98210j70516
$$ 365474 652926 443226 615075 242900 364697 676335 393596 216849 415059 244543
16379B44543J05810A38900J67955o4218m9426O1377q8582K31249j08632D5805
$$ 244543 350353 138900 306855 242637 193211 254588 166006 397255 288623 45805
16368d8585E01256H0745J28105M902p0704P8732M7419E5139J46150G1637J85579
$$ -48585 501256 80745 208850 213752 143048 221780 269199 55139 201289 71637 257216
16357B57216J66057l2572M2801j66330Q860c0373D50755j87098J91683J45652
$$ 257216 423273 390701 433502 267172 276032 -30373 450755 263657 455340 600992
16347F00992k19829R8685j97983J40687J48168q9832A77365M06886B40683r5980
$$ 600992 381163 479848 281865 422552 570720 480888 177365 584251 240683 144703
16337A44703J04248M2615j27441K26716j55351J38775j00029A102L55197A55756
$$ 144703 248951 291566 164125 390841 235490 374265 274236 1102 356299 155756
16326A77995k8862E4697J18083N5451q2982J08681a2462B38647P6102m7408q4741
$$ 177995 149133 54697 172780 228231 145249 253930 -12462 238647 314749 267341 182600
16315A82600g7527I8071J07683P2918q683a40433A92577Q42K59833A10418K18572
$$ 182600 -77527 98071 205754 278672 269989 -140433 192577 193419 453252 110418 328990
16304C28990j20905O7321j20786b04153B69674J80390Q8779A70755J18811J40455
$$ 328990 208085 275406 154620 -204153 269674 450064 538843 170755 289566 430021
16294D30021A52386k5466C3897a32299o1792D04268G9424J61361N1492A5267Q9318
$$ 430021 152386 126920 33897 -132299 -194091 404268 79424 240785 292277 15267 104585
16283A04585J18444M6457K0400a0587E279J52557J30532b03126b0364B55527r145
$$ 104585 223029 269486 289886 -10587 5279 157836 288368 -203126 -20364 255527 246382
16272B46382j05102G773N23621d6147H2536C024N8317L54753A57485A1566b7488
$$ 246382 141280 7773 531394 -46147 82536 3024 61341 416094 157485 11566 -27488
16260F5638c56629A57792j642F8897h8965C40114q120a80562A44819o7586J47033
$$ 65638 -356629 157792 156150 68897 -88965 340114 331994 -180562 144819 77233 224266
16249B24266O3115A3139e7080G6262i9277d8701k04402A56904D4583Q5038d7723
$$ 224266 287381 13139 -57080 76262 -99277 -48701 -253103 156904 44583 129621 -47723
16237c07514f4053D7315K11867C3206c7123G5170J19815A9070M01858m6348j83905
$$ -307514 -64053 47315 259182 33206 -37123 75170 194985 19070 420928 374580 190675
16226A90675K06326o739H6799C9746A2036K01285Q1403C3087L3513R2721H663
$$ 190675 397001 390262 86799 39746 12036 213321 294724 33087 66600 159321 8663
16214E3911R5733j3193N7615a85443C1893J88742B5766M5891L1105a05235A74599
$$ 53911 149644 136451 194066 -185443 31893 220635 25766 71657 102762 -105235 174599
16202F3662L969J99610a72154C31087j39149a58286B5144d57071A08908J05556
$$ 63662 67631 267241 -172154 331087 191938 -158286 25144 -457071 108908 214464
16192B14464A00979a00524B95199M5859A41170a50533F7651K79220A32326M818
$$ 214464 100979 -100524 295199 341058 141170 -150533 67651 346871 132326 137144
16182A37144O0287A8159L35454C5340q245J6917g7925D1191I088a2992A12123
$$ 137144 197431 18159 353613 35340 27095 44012 -77925 41191 9088 -12992 112123
16170G5617B3001a65007B54244a77741j43898A56301A2626J30559b8359D6850
$$ 75617 23001 -165007 254244 -177741 -321639 156301 12626 143185 -28359 46850
16159B40667a85619j4303C37894a12221k1566B36942F2085a2647j786m6923B38323
$$ 240667 -185619 -199922 337894 -112221 -133787 236942 62085 -12647 -14433 -61356 238323
16147b0392A98906C0611O3269d1479n6743H1933K73327a45108B00197b31810N3765
$$ -20392 198906 30611 93880 -41479 -98222 81933 355260 -145108 200197 -231810 -178045
16136a78045P9203D2458h4316G1445a13678A27995a50342k865A48389a91192A03752
$$ -178045 -98842 42458 -84316 71445 -113678 127995 -150342 -153207 148389 -191192 103752
16124G8634J4208K01755a08068C8828a76221B86453i0492a6706o681j7943k4875
$$ 78634 92842 294597 -108068 38828 -176221 286453 -90492 -16706 -23387 -41330 -66205
16113f6205J0420j30121A82771b41383B7135K6755J1816c6380B09925h2050C3664
$$ -66205 -55785 -185906 182771 -241383 27135 53890 65706 -36380 209925 -82050 33664
16101a43812B40805D0704j8201J75100K2121e3606a408j84019h7305B89530e24469
$$ -143812 240805 40704 22503 197603 219724 -53606 -1408 -185427 -87305 289530 -524469
16089b00796n8900k301A72742e7240D4030e0892A23103A2980K48928K9925D1116
$$ -200796 -259696 -261997 172742 -57240 44030 -50892 123103 12980 261908 291833 41116
16077b54460A6094K474c48826A2238a62551f6698A08379b60493h322A53842m6092
$$ -254460 16094 18568 -348826 12238 -162551 -66698 108379 -260493 -8322 153842 107750
16066A07750d14391C15139d1665p1389F0198a28565J6418I2070d49794a49036
$$ 107750 -414391 315139 -41665 -113054 60198 -128565 -112147 92070 -449794 -149036
16055A30772a17580A47722O0679P6329h657j56181A96475b13769c7905A8738a00717
$$ 130772 -117580 147722 208401 284730 -8657 -164838 196475 -213769 -37905 18738 -100717
16043a55671A09052a52106F264J3559f7555G3337b62881a25438F7547K08029c6896
$$ -155671 109052 -152106 6264 19823 -67555 73337 -262881 -125438 67547 275576 -36896
16031I8592L2650g6155b788k64829R3206A01964a73665g1672k10592A72231B25
$$ 98592 131242 -76155 -2788 -267617 -174411 101964 -173665 -71672 -282264 172231 225
16019B667f7000j48451A30373i8465l7620B9754c3127j07520K6794c7502j11027
$$ 2667 -67000 -215451 130373 -98465 -136085 29754 -33127 -140647 -113853 -37502 -148529
16008a48529l7523A26489a15880k7609a521A00160a11179c6347j45479g1306F4290
$$ -148529 -186052 126489 -115880 -143489 -1521 100160 -111179 -36347 -181826 -71306 64290
15996h2722A88203g4178B53665J01920a19217C13683H7563e1526A08154C6430
$$ -82722 188203 -74178 253665 355585 -119217 313683 87563 -51526 108154 36430
15985D8902a5763j24963C49515R100e2249D7336a64175A07863A2134M3200b63349
$$ 48902 -15763 -140726 349515 358615 -52249 47336 -164175 107863 12134 55334 -263349
15973A02700h7106k23801e5551k74q5204q2422A3352a16923l0001A40564K1337
$$ 102700 -87106 -310907 -55551 -55825 -141029 -223451 13352 -116923 -146924 140564 161901
15962A61901b69268J19187N7760A67182p2593a8201j07644A69551J0248d20135
$$ 161901 -269268 -150081 -92321 167182 94589 -18201 -125845 169551 179799 -420135
15951A10508b21789K8564n1931B33572j8412a79292B45107b89086B5287b00019
$$ 110508 -221789 -193225 -245156 233572 215160 -179292 245107 -289086 25287 -200019
15940a93691A19106a62682D0584J2831K0215a84897E9060b0480C1044a9092j40727
$$ -193691 119106 -162682 40584 53415 73630 -184897 59060 -20480 31044 -19092 -159819
15929a59819A5567a66771N265D7228b65953A2027h1401k3301n5519C1675b4841
$$ -159819 15567 -166771 -161506 47228 -265953 12027 -81401 -104702 -160221 31675 -24841
15917a39707c3214q86C32465N8256A13209b42878d715B11564i3522c5516l42572
$$ -139707 -33214 -34100 332465 390721 113209 -242878 -4715 211564 -93522 -35516 -378088
15906c78088d8675C37925i3580C06301b59907E7898L14A3999i1997B8825M2183
$$ -378088 -48675 337925 -93580 306301 -259907 57898 58212 13999 -91997 28825 71008
15895G1008b46336A20282a66118D1325a32507A14797l8813a02683Q691J4193k4998
$$ 71008 -246336 120282 -166118 41325 -132507 114797 75984 -102683 -93992 -79799 -104797
15884a04797l4415E5601c93874A84937a91767A7006N4224a59743A93403J87485
$$ -104797 -139212 55601 -393874 184937 -191767 17006 71230 -159743 193403 380888
15874C80888G4817b27335A82177a63056l5403F3593a83707j43505B02284b02240
$$ 380888 74817 -227335 182177 -163056 -198459 63593 -183707 -327212 202284 -202240
15863a88686C1556h9886A08532c7250J3152j48854O9728j90582A47543D4430g8956
$$ -188686 31556 -89886 108532 -37250 -24098 -172952 -103224 -293806 147543 44430 -78956
15851a32078A49352a4383E026K5526Q2228O385a82265A41642L4879a08148B13341
$$ -132078 149352 -14383 5026 30552 112780 119165 -182265 141642 176521 -108148 213341
15839A4382b04726O2094C14166b70836J29714m8166M3407a8731m0492l4295F9620
$$ 14382 -204726 -142632 314166 -270836 -141122 -189288 -145881 -18731 -59223 -93518 69620
15827d7763b721B0564a85602j0059B4829b43620C44486a76744a1403k96765l2323
$$ -47763 -2721 20564 -185602 -195661 24829 -243620 344486 -176744 -11403 -308168 -340491
15816c40491F0619a19901r3094I8742b06746k65320I4375a65180A78020H3773
$$ -340491 60619 -119901 -212995 98742 -206746 -472066 94375 -165180 178020 83773
15805B31540B6230r914R2763E2162d0153B03244O7431E1345e191G1012i5725J4002
$$ 231540 26230 16316 109079 52162 -40153 203244 270675 51345 -5191 71012 -95725 -81723
15793h1723a6764j43797e1569I026f3505l9612k00221D1538j5301J52802a15981
$$ -81723 -16764 -160561 -51569 9026 -63505 -103117 -303338 41538 26237 179039 -115981
15781a27334j53272C8281c53868B42212F8191a81126B54664c51741J14466c7237
$$ -127334 -280606 38281 -353868 242212 68191 -181126 254664 -351741 -237275 -37237
15770b95950Q8476a8574j0119i572k35440M6775D16723d3478A23111m1065P178
$$ -295950 -207474 -18574 -28693 -9572 -245012 -198237 416723 -43478 123111 82046 89224
15759H9224Q6504A6569a30029F394J33042a85231E0177a15601A0745K16983e1107
$$ 89224 175728 16569 -130029 6394 139436 -185231 50177 -115601 10745 227728 -51107
15747A61550K04073a85932g0199F0384a36757j26853E2435a0767l4188j15043
$$ 161550 365623 -185932 -70199 60384 -136757 -263610 52435 -10767 -44955 -159998
15737a59998B775O8559M2481J4921A0893b2859o1887j81944e4211k9873H4306
$$ -159998 2775 71334 113815 128736 10893 -22859 -84746 -266690 -54211 -84084 84306
15725e8824K8763j00904m1529P2599l9431j13675B60516A0284b20509E5179h2306
$$ -58824 -30061 -130965 -172494 -99895 -139326 -253001 260516 10284 -220509 55179 -82306
15713F7690a40768l6884d1187A27524a31180A30358e7293J9176B75892F2587i4071
$$ 67690 -140768 -177652 -41187 127524 -131180 130358 -57293 -38117 275892 62587 -94071
15701E8167c26343c9677B7589b88978A95691O221E6823a67376I4189N3605k8748
$$ 58167 -326343 -39677 27589 -288978 195691 201912 56823 -167376 94189 147794 119046
15690A19046L0015m7513P3772i1816k110J5087j64884B23786p6870a84729r4437
$$ 119046 149061 101548 175320 -91816 -93926 -78839 -243723 223786 146916 -184729 -279166
15679b79166B66967c2371I2507C4947J64131m4197P9743b12367g7604B57182F1256
$$ -279166 266967 -32371 92507 34947 199078 154881 234624 -212367 -77604 257182 61256
15667a47753A07904a14145j38392A79086b75328A14450k3319j6843g3653j5900
$$ -147753 107904 -114145 -252537 179086 -275328 114450 91131 74288 -73653 -89553
15657h9553r3863B3504L50319f4620j57479G4617J25304c65916a53745B62683
$$ -89553 -183416 23504 373823 -64620 -222099 74617 199921 -365916 -153745 262683
15646F6364O3372d8500j55870B16343G268J09518J0302g7813k17627a12426K9504
$$ 66364 129736 -48500 -204370 216343 7268 116786 127088 -77813 -295440 -112426 -82922
15635h2922j45591l5190N785a25371k15816a66877k6734C2198a92939d2037q3820
$$ -82922 -228513 -263703 -257918 -125371 -341187 -166877 -193611 32198 -192939 -42037 -125857
15624a25857b2l1732j46900O3146L4941j75932A1377d84599K27521J09489E12
$$ -125857 -22 -31754 -178654 -115508 -80567 -256499 11377 -484599 -257078 -147589 512
15612c97880J40557a08059q9843L7026k3910A98283E8872a8708j39139j10159
$$ -397880 -257323 -108059 -197902 -160876 -184786 198283 58872 -18708 -157847 -268006
15602b68006B5743c21453g5332p4931B58940e3191a5762k80588F9733A4283i9323
$$ -268006 25743 -321453 -75332 -150263 258940 -53191 -15762 -296350 69733 14283 -99323
15590A8709a44767d298r3198A9500d3367C6301N0561b312k56702J28849G7930
$$ 18709 -144767 -4298 -97496 19500 -43367 36301 86862 -2312 -259014 -130165 77930
15578A25858J78658b19790A03718l7837i9041k23622D6946a21111k8958n9073
$$ 125858 304516 -219790 103718 65881 -99041 -322663 46946 -121111 -150069 -209142
15568b09142R0710C0365N3826I46J13383P2548I1687R2351e8198A66961b95969
$$ -209142 -118432 30365 84191 946 114329 186877 91687 184038 -58198 166961 -295969
15556A93658O8296h4431A7948O6358a28083j8440N2390k1701C1858h917k3175
$$ 193658 261954 -84431 17948 84306 -128083 -146523 -94133 -115834 31858 -8917 -32092
15545c2092E9200K37411i9627k23712A07342J08307j7897J08920g817j18203p3255
$$ -32092 59200 296611 -99627 -323339 107342 215649 197752 306672 -7817 -126020 -199275
15534a99275D3099h0725B24401E3599N948a05160k02420B8914a662A37231M1332
$$ -199275 43099 -80725 224401 53599 59547 -105160 -307580 28914 -1662 137231 178563
15523A78563c06775a483k71779J07135L0734B10951F3954i2801L9922B31272B4474
$$ 178563 -306775 -1483 -273262 -166127 -135393 210951 63954 -92801 -52879 231272 24474
15511A8205c9533o518C6081K12162a10288A39996F6535b92001a22268B33503b25532
$$ 18205 -39533 -46051 36081 248243 -110288 139996 66535 -292001 -122268 233503 -225532
15499a62641A57367a98044O1460A19215e2665B9022J43530C1483h9008D4158b31570
$$ -162641 157367 -198044 -136584 119215 -52665 29022 172552 31483 -89008 44158 -231570
15487c9526j25694P7276A56819a94009G1254B7424a96429A9048Q1673c01878R9546
$$ -39526 -165220 -87944 156819 -194009 71254 27424 -196429 19048 100721 -301878 -202332
15476b02332B78865F9277J13939a09549i819A86620l2196a57421A4374a6157j61254
$$ -202332 278865 69277 183216 -109549 -9819 186620 154424 -157421 14374 -16157 -177411
15465a77411A03100K72503a36774a787l858A53516c897k29661k7738h2983H1048
$$ -177411 103100 375603 -136774 -1787 -5645 153516 -3897 -233558 -261296 -82983 81048
15453A68596m1660n8563a34876J8557l3032A5896a03278M2271r7336r383k72935
$$ 168596 126936 68373 -134876 -116319 -149351 15896 -103278 -61007 -158343 -167726 -440661
15442d40661a35642j59837G2440K8804k6521b00480o0146a2308j63222A26774
$$ -440661 -135642 -295479 72440 101244 74723 -200480 -260626 -12308 -175530 126774
15431A90694C0600a91136R0477p4623j17156A6417B234a41874q1390e0646k6558
$$ 190694 30600 -191136 -100659 -175282 -292438 16417 2234 -141874 -223264 -50646 -77204
15420g7204i56l04431P0928J12501H4032d15607B06799i0284K4622E1850O7394
$$ -77204 -956 -305387 -234459 -121958 84032 -415607 206799 -90284 -65662 51850 119244
15409A19244b90259A72454J8025r1077C417a03506E4864a7689k7781G8453O0884
$$ 119244 -290259 172454 190479 99402 3417 -103506 54864 -17689 -45470 78453 139337
15398A39337d6094E30866c0043a87G8640Q4192d01854R9150i4401j23187H4398
$$ 139337 -46094 530866 -30043 -187 78640 162832 -401854 -302704 -94401 -217588 84398
15386A18927P4185J84608A20112a18416I405a67900I3989A7050K1881p588e11908
$$ 118927 193112 377720 120112 -118416 9405 -167900 93989 17050 38931 31343 -511908
15374b97027J37404C311O8846l1175e1186B84256k2350a64896C6358L24100A66695
$$ -297027 -159623 3311 72157 40982 -51186 284256 261906 -164896 36358 360458 166695
15362b18308r9707B75778j14841h7717A61484l2224j5858L4638b9296I8152M4161
$$ -218308 -318015 275778 160937 -87717 161484 129260 113402 148040 -29296 98152 142313
15351A42313F1573g8885A49356o3480L84214E9505g5183j31645A33742P097J4162
$$ 142313 61573 -78885 149356 85876 470090 59505 -75183 -206828 133742 140839 155001
15340A55001b59054J1721o6239G231J3129J01246c1307k10138B06015a44568D753
$$ 155001 -259054 -247333 -313572 7231 20360 121606 -31307 -241445 206015 -144568 4753
15328H626K59411E9226a56362c9839c486k222A55729E2016b3293j45640N8875
$$ 8626 268037 59226 -156362 -39839 -3486 -5708 155729 52016 -23293 -168933 -110058
15317a10058D2235h5465K096a4844A95802d5434F530c1122r7886A98825a3019
$$ -110058 42235 -85465 -83369 -14844 195802 -45434 6530 -31122 -129008 198825 -13019
15305A18028h8423l9373B7918a0487o2550C79481b02353B95639m8494a89762A69452
$$ 118028 -88423 -127796 27918 -10487 -73037 379481 -202353 295639 247145 -189762 169452
15293A37066a17968A59861J43051e1812q4461B7864b27834A37015d9604j19436
$$ 137066 -117968 159861 302912 -51812 -136273 27864 -227834 137015 -49604 -169040
15283a69040H1713f2456B97774j11572o1127a9412g10G0800l4436J44959o4889
$$ -169040 81713 -62456 297774 186202 125075 -19412 -710 70800 36364 181323 116434
15272A16434n3323b6864A28789D5359J08029R16k8749h5438K9972B70049b95359
$$ 116434 63111 -26864 128789 45359 153388 154304 125555 -85438 -55466 270049 -295359
15260d4436B21771A07980M1928d2495B88736j04550b01135E6395J21269N0306
$$ -44436 221771 107980 149908 -42495 288736 184186 -201135 56395 177664 227970
15250B27970J89166M33274L06997p6901K61906F08282k77874R0584D6404b50712
$$ 227970 417136 850410 1157407 1080506 1342412 608282 330408 420992 46404 -250712
15239A2995b03533B29447q1587m1737L9042C4351N450b1352j25841O2888B88458
$$ 12995 -203533 229447 147860 106123 145165 34351 39801 -21352 -147193 -84305 288458
15227a74491e350j86655h5730j67443M2946A14169e850C5144h4994n3958k0357
$$ -174491 -5350 -192005 -85730 -253173 -210227 114169 -5850 35144 -84994 -138952 -159309
15216a59309P0392B75344b6750A42696D133K52168A02066J1603L48803b18513
$$ -159309 -88917 275344 -26750 142696 4133 256301 102066 113669 462472 -218513
15205a47376C38768b3246A35290M6549L6881B7933K91724B9251j3588J35302o8346
$$ -147376 338768 -23246 135290 181839 218720 27933 319657 29251 15663 150965 82619
15194H2619l7988c3196r3024e9000E4594J25550J0181l1230J11940C7516J50262
$$ 82619 44631 -33196 -126220 -59000 54594 180144 190325 159095 271035 37516 187778
15183A87778F8965a74611B84411o7485K66879A28315k4571J74571H8255J17921
$$ 187778 68965 -174611 284411 216926 483805 128315 103744 278315 88255 206176
15173B06176n2595b28441b691A34135a75705A22138g243A51200m7028K22998d8419
$$ 206176 153581 -228441 -2691 134135 -175705 122138 -7243 151200 104172 327170 -48419
15161G029a28280A53661J72657j36534k1519B2519m781J79836e9372A8106L4775
$$ 7029 -128280 153661 326318 189784 168265 22519 17738 197574 -59372 18106 52881
15150E2881e5321A81652o3083R8824a49052P0831A05973A0068K13623a81732D8128
$$ 52881 -55321 181652 118569 217393 -149052 -78221 105973 10068 223691 -181732 48128
15138B50478j20119h3933A78002B3814K80805e7540C28195F4192R4555l7295k1384
$$ 250478 130359 -83933 178002 23814 304619 -57540 328195 64192 158747 121452 100068
15127A00068c03401H0454J88417o4172a77479B5240L19773J55988r1603A25254
$$ 100068 -303401 80454 268871 204699 -177479 25240 345013 501001 409398 125254
15116B39579m7285l5004K81493a15873j3753F1016j1189a31520G9786K03355A19533
$$ 239579 192294 157290 438783 -115873 -129626 61016 49827 -131520 79786 283141 119533
15104A2673K71479A2925K17932K180K1785b46374B93665R8304B4450K04284j6438
$$ 12673 284152 12925 230857 233037 254822 -246374 293665 391969 24450 228734 212296
15093B12296r6150J68530K8531A7118O8949K14119A30999K32174b3984C83640
$$ 212296 116146 284676 313207 17118 86067 300186 130999 363173 -23984 383640
15082B84848H6385R2883b03525C14452j51992f908C27905b3784A63743J73672
$$ 284848 86385 179268 -203525 314452 162460 -6908 327905 -23784 163743 337415
15072C37415A03506R26P7472K38937A4192O0981L4306N3560a80640P5189B66151
$$ 337415 103506 104432 181904 420841 14192 75173 109479 163039 -180640 -105451 266151
15060A61036j2970n9666c62488E7957J21353n3706K8012M1650e1146B65601D3015
$$ 161036 148066 88400 -362488 57957 179310 125604 153616 195266 -51146 265601 43015
15048B21531K34247a12183d0811H3059J89556A298M81526B5198K42266A11168
$$ 221531 455778 -112183 -40811 83059 272615 1298 482824 25198 267464 111168
15037C21721b2579D11909j62368b4419C18458E9275J43562J08982I7461f919B99755
$$ 321721 -22579 411909 249541 -24419 318458 59275 202837 311819 97461 -6919 299755
15025a64247B3978J51457D8431N54831A43329K24017n7657j0659p3906m3960L3198
$$ -164247 23978 175435 48431 603262 143329 367346 309689 299030 225124 181164 214362
15014B14362b5676B0264J76021N8194A06422L9895J11103Q0815H1981L24582j35096
$$ 214362 -25676 20264 196285 254479 106422 146317 257420 338235 81981 406563 271467
15003B71467O5249J2736p1972k7478j1372H4766E343a00223c0171k1161A06996
$$ 271467 336716 349452 277480 250002 238630 84766 5343 -100223 -30171 -51332 106996
14991C13511G0699e3281B28576J06356E8389J31997p3897J46780L35740I7320
$$ 313511 70699 -53281 228576 334932 58389 190386 116489 263269 599009 97320
14980B44905n9397q0084k9831L03083J54127A44136L43488B08365l4478F8700
$$ 244905 185508 105424 75593 378676 532803 144136 487624 208365 173887 68700
14969C32255j04741l9233N9394L6499F6742O0797h923A49128J67412o1172G5772
$$ 332255 227514 188281 247675 284174 66742 127539 -8923 149128 316540 255368 75772
14957B34587J07050H8011K88381j33834j24J04929A47869M8608L54113o1003j22623
$$ 234587 341637 88011 376392 242558 242434 347363 147869 196477 550590 489587 366964
14946C66964p8707J95318B41237l3308E2342J52389J62178m4617p1227m1228J67311
$$ 366964 288257 483575 241237 207929 52342 204731 366909 322292 251065 209837 377148
14935C77148B2394K58274r7110N7651J36169j27416J38281j10668a78739E11470
$$ 377148 22394 280668 183558 241209 377378 249962 388243 277575 -178739 511470
14924D69353k02376p0729J75781j85435C1961L76391j97219J25918J01260G252
$$ 469353 266977 196248 372029 186594 31961 408352 211133 337051 438311 7252
14913F3931L33358J27556E8215J04164J40598A33392K05962J8672A12803M4600
$$ 63931 397289 524845 58215 162379 302977 133392 339354 358026 112803 157403
14903A57403J58581K1448r2144R6927A63119L74027A24837N320J74165K81704
$$ 157403 315984 337432 245288 342215 163119 537146 124837 130157 304322 586026
14893E86026B52646A16418K45173j41637L56398k60030n4331l9744J45907j60249
$$ 586026 252646 116418 361591 219954 576352 316322 261991 222247 368154 207905
14883B07905k07K52734j53868j25671J89604l7398K68725j16310q2955J82627
$$ 207905 207698 460432 306564 180893 370497 333099 601824 485514 402559 585186
14873E85186k53293K55258r2021B00683J95093j48850K25695k13528J48596K37335
$$ 585186 331893 587151 495130 200683 395776 246926 472621 259093 407689 645024
14863F45024k94148j72041J53753k4671K56811j21046K50946A90131J36879I3290
$$ 645024 350876 178835 332588 307917 564728 443682 694628 190131 327010 93290
14852B75934N1639N2355L7855J01135j15707L53958j85418J6797k07655o5618
$$ 275934 327573 379928 417783 518918 403211 757169 571751 588548 380893 315275
14842C15275j2873j1943L07421l4781q8074N8569J09556k63962Q1981j18173K1333
$$ 315275 302402 290459 597880 563099 475025 533594 643150 379188 461169 342996 364329
14831C64329K63958N088B52609R949J11413A76370L25283L0236A67998K17597
$$ 364329 628287 633375 252609 262558 373971 176370 501653 531889 167998 385595
14821C85595k073P4000K55r7539Q92J33514j44667L26625j36938j13004K91287
$$ 385595 383522 457522 457777 360238 361130 494644 349977 676602 539664 426660 717947
14810G17947k47175K46053J02545j66231k99844r270J15784N1650j2148K7187
$$ 717947 470772 716825 819370 653139 353295 344025 459809 511459 499311 526498
14800E26498N1813J2803A85374P25445m38098k05285L67577j64281J8808n1937
$$ 526498 578311 591114 185374 910819 472721 267436 635013 470732 489540 437603
14790D37603o996O2360j6181j26579N66604k58483A42319O18281l24172K49689
$$ 437603 430607 492967 476786 350207 916811 658328 142319 760600 436428 686117
14780F86117J77847l97444k2527J37710O0837B46808L52520o472j0714J908K62200
$$ 686117 863964 466520 443993 581703 642540 246808 599328 592856 582142 584050 846250
14769H46250k53540R3566o7580J62379n1632k75919K19809O6628j42137k43423
$$ 846250 592710 686276 618696 781075 729443 453524 673333 739961 597824 354401
14759C54401N3158K84660A77738L01881J19441J62370P0395j75109p0533L19052
$$ 354401 407559 692219 177738 479619 599060 761430 831825 656716 586183 905235
14749I05235r1472m6047p9719j36254K79053j71059L6571J82663k92945J00031
$$ 905235 813763 767716 687997 551743 830796 659737 696308 878971 586026 686057
14739F86057J01241O5919m3078j37269J47100J71837m20287M55855r7334k48082
$$ 686057 787298 853217 810139 672870 819970 991807 571520 1027375 930041 681959
14729F81959k71919Q3735M27459o2254k97148K44090N8522L52843C83678K16553
$$ 681959 410040 493775 921234 858980 561832 805922 864444 1217287 383678 600231
14719F00231k19769O52054k11247J96283k37210Q2068K54915m41928K54677l06187
$$ 600231 380462 1032516 821269 1017552 780342 862410 1117325 675397 930074 623887
14709F23887n7835Q2724n9870K88487j58332L5416K83318m06129M64028p8470
$$ 623887 566052 648776 588906 877393 719061 754477 1037795 631666 1095694 1017224
14699A017224k09774K43960j11882L08351j05121m68519L63800j15945j81707
$$ 1017224 807450 1051410 939528 1247879 1142758 674239 1038039 922094 740387
14690G40387R5259Q624L8392L51356k26235k21057n4372L50379j42439l4965O5907
$$ 740387 835646 844270 882662 1234018 1007783 786726 732354 1082733 940294 905329 971236
14679I71236K61768l32161J45501l4362q0946m896k02711K19624N1434K73671
$$ 971236 1233004 900843 1046344 1011982 931036 926140 723429 943053 994487 1268158
14669A268158l01873O6485n9938N4041j32889r0293K16356j16189J96183R7271
$$ 1268158 966285 1032770 972832 1026873 893984 803691 1020047 903858 1100041 1197312
14659A197312o3549m1917m60582P00574l2609L8813j94533n6111J70038N7224
$$ 1197312 1133763 1091846 631264 1331838 1299229 1338042 1143509 1087398 1257436 1314660
14649A314660j37958J45326n2852q2281J89679M3911j05891k08890J79253J5050
$$ 1314660 1176702 1322028 1269176 1186895 1376574 1420485 1314594 1105704 1284957 1300007
14639A300007K9346K8271o3967M49537l98970J75565m08333O1771L76520n0524
$$ 1300007 1329353 1357624 1293657 1743194 1344224 1519789 1111456 1173227 1549747 1499223
14629A499223l17241J49277J61394k86274K31168K2660p7162P9807k5484q4841
$$ 1499223 1181982 1331259 1492653 1206379 1437547 1460207 1383045 1462852 1437368 1352527
14619A352527M3507K67799j50530k70875K5380L20412j52902K0585J34468K05812
$$ 1352527 1396034 1663833 1513303 1242428 1267808 1588220 1435318 1455903 1590371 1796183
14609A796183j83126k21588J02372N03697k19961k01899J21274n671k97646L02982
$$ 1796183 1613057 1391469 1493841 1997538 1777577 1575678 1696952 1691281 1393635 1696617
14599A696617j626l43859L65444j46226K01466L2066L30789o31325O51116q16139
$$ 1696617 1694991 1351132 1716576 1570350 1771816 1803882 2134671 1503346 2154462 1338323
14589A338323L80552K63116k91452L05149R3265j84784p940Q0098j16111r3848
$$ 1338323 1718875 1981991 1690539 1995688 2088953 1904169 1896229 1976327 1860216 1766368
14579A766368N30655j84865k02359L29377J31101m89725J72318j01886L51066
$$ 1766368 2297023 2112158 1909799 2239176 2370277 1880552 2052870 1950984 2302050
14570B302050K7898j84540L95610k98944J44922J09131j67996N83738M07876o86029
$$ 2302050 2329948 2145408 2541018 2242074 2386996 2496127 2328131 2911869 3319745 2633716
14560B633716K05174k14948L92864J36612K82093Q0817J82569J64540L80916N80411
$$ 2633716 2838890 2623942 3016806 3153418 3435511 3516328 3698897 3863437 4244353 4824764
14550D824764J215113J681124M575827J0369181J9475641J996126B1994253I769685
$$ 4824764 6039877 7721001 12296828 22666009 42141650 44137776 21994253 9769685
14541E097679j648012n03161l97392m78198j59259j47151L49141j6267k4476N1635
$$ 5097679 3449667 2946506 2549114 2070916 1911657 1764506 2113647 2097380 2072904 2124539
14531B124539R0102j02421K18123L87104n12904J73004R5501p1479O9038O5139
$$ 2124539 2214641 2112220 2330343 2717447 2204543 2377547 2473048 2401569 2470607 2535746
14521B535746j31745M19285M5010m59373K92690J25801j291m9561m5565M36890
$$ 2535746 2404001 2823286 2868296 2408923 2701613 2827414 2826123 2776562 2730997 3167887
14511C167887n63594L28642K56293j31421O2418m12273L00731P6519K46387j18736
$$ 3167887 2604293 2932935 3189228 3057807 3120225 2707952 3008683 3085202 3331589 3212853
14501C212853j51259K22837m709r0238P2444Q1015n1691M556K59977j33995J87476
$$ 3212853 3061594 3284431 3279722 3189484 3261928 3342943 3291252 3295808 3555785 3421790 3609266
14490C609266k06970k83446M83861M90111m53043L82216j93175M62172l15587
$$ 3609266 3402296 3118850 3602711 4092822 3639779 4021995 3828820 4290992 3975405
14481C975405K69532k66779o2333j51812N44150j88022J83086m7971n0452L28547
$$ 3975405 4244937 3978158 3915825 3764013 4308163 4120141 4303227 4255256 4204804 4533351
14471D533351p4750j21913J63004l6640L69817m45362N02628n9926K21858n61575
$$ 4533351 4458601 4336688 4499692 4463052 4832869 4387507 4890135 4830209 5052067 4490492
14461D490492K92681M63438K03115l23115J63880k5925K53646j89912J77128K60559
$$ 4490492 4783173 5246611 5449726 5126611 5290491 5264566 5518212 5328300 5505428 5765987
14451E765987L3574l72413J81568J52291L21476k00778L45298j31613m57314N04529
$$ 5765987 5799561 5427148 5608716 5761007 6082483 5881705 6227003 6095390 5638076 6142605
14441F142605j51084L44150j6745J80250O3661K8209K96979r4048O2324Q2376
$$ 6142605 5991521 6335671 6318926 6499176 6562837 6591046 6888025 6793977 6856301 6938677
14431F938677K29951L8598J12550j14466L81067j07838K20672K16614J00345J38806
$$ 6938677 7168628 7207226 7319776 7205310 7586377 7478539 7699211 7915825 8016170 8154976
14421H154976l8260K25670K07564k92393N03939M8786J84655l35824M37818r0816
$$ 8154976 8116716 8342386 8549950 8257557 8761496 8810282 8994937 8659113 9096931 9006115
14411I006115K57120K58946L57585J67153m24389L79431N44858m01253N93025
$$ 9006115 9263235 9522181 9879766 10046919 9622530 10001961 10546819 10145566 10738591
14402A0738591l62447Q35488K66535l20639J17933M44818L36890K2827M67192
$$ 10738591 10376144 11211632 11478167 11157528 11275461 11720279 12057169 12079996 12547188
14393A2547188m2461L36897q7260M73182J81865R053O89610l4141L72551O8609
$$ 12547188 12504727 12841624 12754364 13227546 13409411 13418464 14108074 14073933 14446484 14515093
14383A4515093K15059K210N38583J72034P52732J18826l8391N61435N17054K35934
$$ 14515093 14730152 14732362 15270945 15442979 16195711 16314537 16276146 16837581 17354635 17590569
14373A7590569L87293K13305M73825K9192R94297j45413M61414M68650M72856
$$ 17590569 17977862 18191167 18664992 18694184 19688481 19543068 20004482 20473132 20945988
14364B0945988M56896M28901N21217P27729M55665O9303Q42172O83572N40391
$$ 20945988 21402884 21831785 22353002 23080731 23536396 23605699 24447871 25131443 25671834
14355B5671834L74391P03376P82985L60806P38038J041321O40044P75793O51809
$$ 25671834 26046225 26749601 27532586 27893392 28631430 29672751 30312795 31088588 31740397
14346C1740397Q90583J030134N85265Q95283J148014J180237R30868Q29181J463124
$$ 31740397 32630980 33661114 34246379 35141662 36289676 37469913 38400781 39229962 40693086
14337D0693086J134194J145111J123970J141161J440184J647115J279161J723040
$$ 40693086 41827280 42972391 44096361 45237522 46677706 48324821 49603982 51327022
14329E1327022J187603K074622J572320K162599J711808K095843K093990K305681
$$ 51327022 52514625 54589247 56161567 58324166 60035974 62131817 64225807 66531488
14321F6531488K211896K577292K444737K782336L082344K624548L584357L173991
$$ 66531488 68743384 71320676 73765413 76547749 79630093 82254641 85838998 89012989
14313H9012989L580562L829818L807201M173594M543585M260488N379540N193055
$$ 89012989 92593551 96423369 100230570 104404164 108947749 113208237 118587777 123780832
14305A23780832N465208N514874O358601O948095O733234P496977P744591Q416051
$$ 123780832 129246040 134760914 141119515 148067610 154800844 162297821 170042412 178458463
14297A78458463Q418321R577580R327791J0388552J1007334J1645488J1531067
$$ 178458463 186876784 196454364 205782155 216170707 227178041 238823529 250354596
14290B50354596J2733769J3272460J3555859J4097804J4708259J4679957J5507963
$$ 250354596 263088365 276360825 289916684 304014488 318722747 333402704 348910667
14283C48910667J5264452J5343536J4676967J4865784J3819833J3086925J1927149
$$ 348910667 364175119 379518655 394195622 409061406 422881239 435968164 447895313
14276D47895313J0226837Q738272O371884L650912k06908l481703m235703n334415
$$ 447895313 458122150 466860422 473232306 476883218 476676310 473194607 468958904 463624489
14268D63624489n597557o198500q679070j0478032j2430522j3474586j4430172
$$ 463624489 458026932 451828432 443149362 432671330 420240808 406766222 392336050
14261C92336050j5055931j5376180j5550776j5751105j5384315j5026424j3892364
$$ 392336050 377280119 361903939 346353163 330602058 315217743 300191319 286298955
14254B86298955j4322731j3398038j2597123j2387704j1485304j1037923j0064083
$$ 286298955 271976224 258578186 245981063 233593359 222108055 211070132 201006049
14247B01006049r854259r299142q814845p517847p620862p507113o754595o723406
$$ 201006049 191151790 181852648 173037803 165519956 157899094 150391981 143637386 136913980
14239A36913980n875432n350503n215300n689368m316281m888814m304580m096930
$$ 136913980 131038548 125688045 120472745 114783377 110467096 105578282 101273702 97176772
14231I7176772l045925m031283l438089l323696l255930k497625l245734k335258
$$ 97176772 94130847 90099564 86661475 83337779 80081849 77584224 74338490 72003232
14223G2003232k783688k492016k253098j921230k235538j881412j982683j674686
$$ 72003232 69219544 66727528 64474430 62553200 60317662 58436250 56453567 54778881
14215E4778881j589456j418808j255994j760330j873137j181119j340002j263002
$$ 54778881 53189425 51770617 50514623 48754293 46881156 45700037 44360035 43097033
14207D3097033n16649j257170j239544j456516j011262p86007p69790p52097j307406
$$ 43097033 42580384 41323214 40083670 38627154 37615892 36829885 36060095 35307998 34000592
14198C4000592r01842r45727o93397q39814m17340q44457p66904n70809p92250
$$ 34000592 33098750 32153023 31459626 30619812 30202472 29358015 28591111 28020302 27228052
14189B7228052n02861o38121p79336n41887q37863j15910p55323m94759m96934
$$ 27228052 26725191 26087070 25307734 24765847 23927984 23812074 23056751 22561992 22065058
14180B2065058R5842j007930j25723k60706l46978p34766j47063o25564n65421
$$ 22065058 22160900 21152970 21027247 20766541 20419563 19684797 19537734 18912170 18346749
14171A8346749l16241r1986l92754j77176k99404m86299l28559k15001k08681
$$ 18346749 18030508 17938522 17545768 17368592 17069188 16582889 16254330 16039329 15830648
14162A5830648l39962k17379m17864j17379m76707J56204m06719k17655k6692
$$ 15830648 15490686 15273307 14855443 14738064 14261357 14417561 14010842 13793187 13766495
14153A3766495n68589n55635L83887k58840Q6342m83343j22435j62219o77774
$$ 13766495 13197906 12642271 13026158 12767318 12853660 12370317 12247882 12085663 11407889
14144A1407889L1739o3401k52810n70654l03688J18611K87008m46537J20283k17704
$$ 11407889 11439628 11376227 11123417 10552763 10249075 10367686 10654694 10208157 10328440 10110736
14134A0110736k04509k72898m2015k25021j12913k85226J8547k24294n5137K37187
$$ 10110736 9906227 9633329 9591314 9366293 9253380 8968154 8986701 8762407 8707270 8944457
14124H944457m18021j42448N1139m8107k98772J3583k25130k951n9407j20623
$$ 8944457 8526436 8383988 8435127 8387020 8088248 8101831 7876701 7873750 7814343 7693720
14114G693720k47152k25836L47697l98326n9697J14054l15281k12360K22785j51688
$$ 7693720 7446568 7220732 7568429 7170103 7110406 7224460 6909179 6696819 6919604 6767916
14104F767916j79027N8168l778k33400K9366n9646l55570N2798K03320l03871
$$ 6767916 6588889 6647057 6643279 6409879 6439245 6379599 6024029 6076827 6280147 5976276
14094E976276n7982O6820m32492j2223Q6217R8430j53289j87940K02325j99120
$$ 5976276 5918294 5985114 5552622 5540399 5626616 5725046 5571757 5383817 5586142 5387022
14084E387022l75804J11868M264L95427m19838j3357l34659L19716m05714j73857
$$ 5387022 5011218 5123086 5127350 5522777 5102939 5089582 4754923 5074639 4668925 4495068
14074D495068L21631J8012p5585k54269J76738M7051l10110l6445K06223j54771
$$ 4495068 4816699 4834711 4759126 4504857 4681595 4728646 4418536 4382091 4588314 4433543
14064D433543j4120k01425o1703J30466m4744M5069k48651Q9182J59562j77135
$$ 4433543 4419423 4217998 4156295 4286761 4242017 4287086 4038435 4127617 4287179 4110044
14054D110044l20080L50901l40544p4764P1321k27438R1316k74398J91464k40449
$$ 4110044 3789964 4140865 3800321 3725557 3796878 3569440 3660756 3386358 3577822 3337373
14044C337373M30744l73362K32749l24736n5884M4189K18460m03388J45630K7470
$$ 3337373 3768117 3394755 3627504 3302768 3246884 3291073 3509533 3106145 3251775 3279245
14034C279245j39718j28273K17258J8415K43159m51215K40890m85754K49374l62819
$$ 3279245 3139527 3011254 3228512 3246927 3490086 3038871 3279761 2794007 3043381 2680562
14024B680562L95045K4222k92205M7547K80285n63562O4586J8425J09706j13171
$$ 2680562 3075607 3099829 2807624 2855171 3135456 2571894 2636480 2654905 2764611 2651440
14014B651440M3447j62879J6907J40188n1156j71339J55033k77865L94782j10933
$$ 2651440 2694887 2532008 2548915 2689103 2637947 2466608 2621641 2343776 2738558 2627625
14004B627625j60745j74400n46945O04425k83793m7293K71656l44321M31934m40568
$$ 2627625 2466880 2292480 1745535 2349960 2066167 2018874 2290530 1946209 2378143 1937575
13994A937575K27255J69211p4685J74028P35311R71849K498836Q319534J9550158
$$ 1937575 2164830 2334041 2259356 2433384 3168695 4140544 6639380 14958914 34509072
13985C4509072R439561j7957089j1575430n750521k250539j274567p62528r49137
$$ 34509072 43948633 25991544 14416114 8665593 6415054 5140487 4377959 3428822
13977C428822O7828j42349k70649l20278M28290n71161M7160k2277J10170m2315
$$ 3428822 3496650 3354301 3083652 2763374 3191664 2620503 2667663 2645386 2755556 2713241
13967B713241j14824k20719L25588k37074m18191r4029O31935o42023L68038j39777
$$ 2713241 2598417 2377698 2703286 2466212 2048021 1953992 2585927 1943904 2311942 2172165
13957B172165L7249M04283o27685l3978M93332l51913j65149J68215J38812k38781
$$ 2172165 2209414 2613697 1986012 1952034 2445366 2093453 1928304 2096519 2235331 1996550
13947A996550q4891J39190k04202P2177k6215K3930J19457O8749j93172j3192
$$ 1996550 1911659 2050849 1846647 1918824 1892609 1916539 2035996 2104745 1911573 1898381
13937A898381k17202L79278l02129K65350k8607m40975L58741K3525p9752k7175
$$ 1898381 1681179 2060457 1758328 2023678 1995071 1554096 1912837 1936362 1856610 1829435
13927A829435j36711J94137m59232M8034q284J28946J30875j2031m26706M53036
$$ 1829435 1692724 1886861 1427629 1475663 1467379 1596325 1727200 1715169 1288463 1741499
13917A741499k05604j26990L07795j80634p5395j28848L22292k58221J15077j90361
$$ 1741499 1535895 1408905 1716700 1536066 1460671 1331823 1654115 1395894 1510971 1320610
13907A320610Q1781L66178k23047J32650m3810j43660j7024p8037q1821J75985
$$ 1320610 1402391 1768569 1545522 1678172 1634362 1490702 1473678 1395641 1313820 1489805
13897A489805l10661k5108J56218K32560k82987K1312p537l1849k50339N87513
$$ 1489805 1179144 1154036 1310254 1542814 1259827 1281139 1273602 1241753 991414 1578927
13887A578927l6457j99700l14727J62434M5081j01633j9312N00677k54964m57781
$$ 1578927 1542470 1342770 1028043 1190477 1235558 1133925 1114613 1615290 1360326 902545
13877I02545N83857n89930K51502K85886l12517J60785j72755J84171o696r0080
$$ 902545 1486402 896472 1147974 1433860 1121343 1282128 1109373 1293544 1286848 1196768
13867A196768j64498J68519J45335J27828O0714j40961m380k47240k44531L91024
$$ 1196768 1032270 1200789 1346124 1473952 1534666 1393705 1389325 1142085 897554 1288578
13857A288578J30901k37405n83790O01080j80771j06106J28709J11003k01690
$$ 1288578 1419479 1182074 598284 1199364 1018593 912487 1041196 1152199 950509
13848I50509P9021n6966K78622j72434J00407n6412j6048L4902q9859k9435N7137
$$ 950509 1029530 972564 1251186 1078752 1179159 1122747 1106699 1141601 1051742 1022307 1079444
13837A079444J7745k8105j2907K3244l8169l06954J34395m6942J56256K94863
$$ 1079444 1097189 1069084 1056177 1079421 1041252 734298 868693 821751 978007 1272870
13827A272870k88341j00588k64678K20380J75489k8375N236m00934L09295L52895
$$ 1272870 984529 883941 619263 839643 1015132 986757 991993 591059 900354 1253249
13817A253249m26217K94204q4441p4088J44188q4388k28357K34032N2971C37051
$$ 1253249 827032 1121236 1036795 962707 1106895 1022507 794150 1028182 1081153 337051
13806G51886q8931K85866j36872Q3751o8227K72297P1130l49043J39294K2948
$$ 751886 662955 948821 811949 895700 827473 1099770 1170900 821857 961151 984099
13796I84099k62543P8084q8977j23939M43438j63246K48103k81697j17714Q2101
$$ 984099 721556 799640 710663 586724 1030162 866916 1115019 833322 715608 797709
13786G97709K16111j88511D04323P06744m37808J81832L8054m34480L04529o4164
$$ 797709 1013820 825309 404323 1111067 673259 855091 893145 458665 763194 699030
13776F99030J47217k25125J94623J09624k39110o2947M03145k49660P580K3444
$$ 699030 846247 621122 815745 925369 686259 623312 1026457 776797 784377 807821
13766H07821j55125q4980K35297p0881M1143n3806B51392M38323P0859k78543
$$ 807821 652696 567716 803013 732132 773275 719469 251392 689715 760574 482031
13756D82031K25308J4707n5261L338j39654J94511q0660l1961K06154l70996J13982
$$ 482031 707339 722046 666785 670123 530469 724980 644320 612359 818513 447517 561499
13745E61499J3350J60304k18891J47761m2052K8878K20481C63127L87612L9919
$$ 561499 574849 735153 516262 664023 621971 650849 871330 363127 750739 790658
13735G90658l16290R9011L20155k82222q2655r4075M2620J85m4870K85382P6736
$$ 790658 474368 573379 893534 611312 528657 434582 477202 477387 432517 717899 794635
13724G94635l45363L80266l23519L80064k63189B56512K54861K1683J14856j04665
$$ 794635 449272 829538 506019 886083 622894 256512 511373 533056 647912 543247
13714E43247Q693L03206m01227q6697L80109o4622q8824m5390J58103l08076R9682
$$ 543247 551940 855146 453919 367222 747331 682709 593885 548495 706598 398522 498204
13703D98204K11560k35290J7836p0048K83318B33467M06683B70527R6427J30575
$$ 498204 709764 474474 492310 422262 705580 233467 640150 270527 366954 497529
13693D97529k11008J57573J58160B88686Q3181M4367K57303j63067K05735K47714
$$ 497529 286521 444094 602254 288686 371867 416234 673537 510470 716205 963919
13683I63919C87832J44335l6709J69925k81881J00340K90700B63378N6826J15648
$$ 963919 387832 532167 495458 665383 383502 483842 774542 263378 320204 435852
13673D35852M73716l28973k19025J91678m4203J88148J40060k68521J0845p2483
$$ 435852 909568 580595 361570 553248 509045 697193 837253 568732 579577 507094
13663E07094J43789j93361k10178M62532Q6902C11834M81690l88934q3352j8246
$$ 507094 650883 457522 247344 709876 796778 311834 793524 404590 321238 302992
13653C02992K45252j70705J40263j35114q3202K18654m9064o462J41928j04942
$$ 302992 548244 377539 517802 382688 299486 518140 469076 462614 604542 499600
13643D99600k4684j56961J01334o5438R5349J30317j04275R1832o6772K86290
$$ 499600 474916 317955 419289 353851 449200 579517 475242 567074 500302 786592
13633G86592C45208K39303B46588J50165j46912N14390k27622k27784A35518J08171
$$ 786592 345208 584511 246588 396753 249841 764231 536609 308825 135518 243689
13623B43689J96206L9352A11145J07538P4170k0027L39389B16527O9394J62980
$$ 243689 439895 479247 111145 218683 292853 272826 612215 216527 285921 448901
13613D48901p2068K38200o4295B07229J41505r1933J18761K59834k93283O1273
$$ 448901 376833 615033 550738 207229 348734 256801 375562 635396 342113 403386
13603D03386P2951j21892K06249j46983K70320F2570M83128j64682j3242R8784
$$ 403386 476337 354445 560694 413711 684031 62570 545698 381016 367774 466558
13593D66558J59409j45180q4833j06763o3385N15195C19534C1785L07164j50118
$$ 466558 625967 480787 395954 289191 225806 741001 319534 31785 338949 188831
13583A88831Q1039R0010r5305r7721K67956A78174K19209r6759J19468O3374h3434
$$ 188831 269870 359880 264575 166854 434810 178174 397383 300624 420092 483466 -83434
13571B28331A05132K24611J94907B07209K81023B04024E8254M7356K02524q2783
$$ 228331 105132 329743 524650 207209 488232 204024 58254 105610 308134 225351
13561B25351K19567l4298j98009o757R487P1509K23119k44692j2303A3175K30065
$$ 225351 444918 410620 212611 205854 215341 286850 509969 265277 252974 13175 243240
13550B43240L04371r2943n1518J25814k51511K61272B53772M5293k5603J23248
$$ 243240 547611 454668 403150 528964 277453 538725 253772 299065 273462 396710
13540C96710l0045j63413K94238A58009K11811J15150j89892k7440r4082H5736
$$ 396710 366665 203252 497490 158009 369820 484970 295078 267638 173556 85736
13529C52564A71651Q7354A18964b3800B02490J00360J47319j38420P2153j60264
$$ 352564 171651 259005 118964 -23800 202490 302850 450169 311749 383902 223638
13519B23638J39251J53026B39263D2722J12933R3431H8305K73413o5438r7833
$$ 223638 362889 515915 239263 42722 155655 249086 88305 361718 296280 198447
13509A98447A8179K71501Q3849A58479L17017j49054j12400J79158M14565C32043
$$ 198447 18179 289680 373529 158479 475496 326442 214042 393200 807765 332043
13498C39567Q7930k12877l2274o6958K58437A78223B1142K8057M9943l5691b1014
$$ 339567 427497 214620 182346 115388 373825 178223 21142 49199 99142 63451 -21014
13486A53806J65325G0798j2636i7129A99615K90657H3989K02036a70955C02010
$$ 153806 319131 70798 58162 -97129 199615 490272 83989 286025 -170955 302010
13475C70022J71522j27383F4100J51863d395E73931m1406B16122Q8316a7295D1379
$$ 370022 541544 414161 64100 215963 -4395 573931 532525 216122 304438 -17295 41379
13463B42696J44309A3880J65557M45689n8935j37573j55985O200j25345K61328
$$ 242696 387005 13880 179437 625126 566191 428618 272633 278833 153488 414816
13453D14816F7603J20659L53575D2597L6356J42325l8181p355F8744b18778B9525
$$ 414816 67603 188262 541837 42597 78953 221278 183097 175742 68744 -218778 29525
13441B56456o2271M7506g9970C16544K93622e814D00302A97461P2756J28538j81553
$$ 256456 194185 241691 -79970 316544 610166 -5814 400302 197461 270217 398755 217202
13430B17202F860B688L3742L9375J03153J35461q0645N9607o0966J44859G8512
$$ 217202 6860 2688 36430 75805 178958 314419 233774 293381 232415 377274 78512
13418C28572K56700B56695L06485i9459A71995j7372O0255K24482J1651A9648
$$ 328572 585272 256695 563180 -99459 171995 154623 214878 439360 451011 19648
13407F25703a09433C87229o527O0258C8417K03554J8055o3652J9086L741O0008
$$ 625703 -109433 387229 380702 440960 38417 241971 260026 196374 215460 219201 279209
13396B79209J83844j75984c1272B67269M5490k739K91367j89394g2932b7491B3590
$$ 279209 463053 287069 -31272 267269 312759 310020 601387 411993 -72932 -27491 23590
13384B4485M82672A93516J60493A43069J32345k1312J03507k6082j2355c48192
$$ 24485 507157 193516 354009 143069 275414 254102 357609 331527 319172 -348192
13373F60547I5491J05819J55892K82289A06496D152M737a9096E43512j23645r420
$$ 660547 95491 201310 357202 639491 106496 4152 8889 -19096 543512 419867 410447
13362D10447G0238M96202A31798N3281J66119a3133A98362J84869j48021a6061
$$ 410447 70238 566440 131798 185079 351198 -13133 198362 383231 235210 -16061
13351A93266J47075q576A50709K67304j75581J66505K2348j57167j19981l2688
$$ 193266 340341 331765 150709 418013 242432 408937 431285 274118 154137 121449
13341A21449a07787A70204J18890e987E48081k51620k6076P2390C8631J86304
$$ 121449 -107787 170204 289094 -5987 548081 296461 270385 342775 38631 224935
13331B24935J44230p3009R6477J35245A03688K9169Q4863J8231A13878K27570
$$ 224935 369165 296156 392633 527878 103688 132857 217720 235951 113878 341448
13321C41448n396O901M6797P743A61855K36937j1136A56994J271J19386k1005
$$ 341448 336052 342953 389750 397493 161855 398792 387656 156994 158265 277651 256646
13310B56646G6458Q488J8710d6934B33745j13794a99768C32549a12799B03979
$$ 256646 76458 84946 103656 -46934 233745 119951 -199768 332549 -112799 203979
13299G6589a28869A1292K51934I791J54285o7548J98512k0575A22254N2444D8282
$$ 76589 -128869 11292 263226 9791 164076 96528 295040 274465 122254 174698 48282
13287f6675B36106n217l4488K2456n4399D968J03377L0174a70704Q3177E3890
$$ -66675 236106 230889 196401 218857 164458 4968 108345 138519 -170704 -87527 53890
13275B32707m2666k6180Q9729j08538J15408j10268L35441A82184K04729J21785
$$ 232707 190041 163861 253590 145052 260460 150192 485633 182184 386913 508698
13265E08698A38043n6192L26021j7581A57778e9620A35824l5356L06555C1095
$$ 508698 138043 81851 407872 390291 157778 -59620 135824 100468 407023 31095
13254A31544L9719l9607J41550k1756g7560m4145A01891J173j1368l7616L19346
$$ 131544 171263 131656 273206 251450 -77560 -121705 101891 103064 91696 54080 373426
13243C73426e8561j01459b8674D54102C3533N7482K8944K3031b84j11161A31481
$$ 373426 -58561 -160020 -28674 454102 33533 91015 119959 142990 -284 -111445 131481
13231A77332E3753B6382f1156B24602M5871A1534a93619A02626a08660k0563A63129
$$ 177332 53753 26382 -61156 224602 270473 11534 -193619 102626 -108660 -129223 163129
13219A81411j846F9808L80849A23647a66317A51905p1323K66333C0370a88720
$$ 181411 179565 69808 450657 123647 -166317 151905 80582 346915 30370 -188720
13208a33694C07096A02315J31744o6927m3050J92525j17740J90269a50968c4862
$$ -133694 307096 102315 234059 167132 124082 316607 198867 389136 -150968 -34862
13197a70469B80736H4839a3496j28414B16521F8089K97537F8704K2883a07120
$$ -170469 280736 84839 -13496 -141910 216521 68089 365626 68704 91587 -107120
13186a74289C61895A61578l8302q055L06870A7847q526J13819G99K55274p1450
$$ -174289 361895 161578 123276 115221 422091 17847 9321 123140 799 256073 184623
13175A84623J05852A07123a63972H8018a4593A07969J07991g5063A59887m8003
$$ 184623 290475 107123 -163972 88018 -14593 107969 215960 -75063 159887 111884
13165A11884K1909g6196J7856k29233A57247o1699J53345H5509L17627A0098J40474
$$ 111884 133793 -76196 -58340 -287573 157247 95548 248893 85509 403136 10098 150572
13154A50572P3850a05259D8195J56493l6730k2081J50858R1467A65837k8289d5601
$$ 150572 224422 -105259 48195 204688 167958 145877 296735 388202 165837 137548 -45601
13142B04141c67904A59285h6084n7534B46737o5023c25361h5955H412a86253C03879
$$ 204141 -367904 159285 -86084 -143618 246737 181714 -325361 -85955 8412 -186253 303879
13130G1079k8744j3072a06656b3301D21434h1034C27470j14912n0786n4a2079
$$ 71079 42335 29263 -106656 -23301 421434 -81034 327470 212558 161772 161718 -12079
13118A12068J03994p9282f1336B5271B649d8313B57544f8184H4724P4425J38220
$$ 112068 216062 136780 -61336 25271 2649 -48313 257544 -68184 84724 159149 297369
13107B97369C7848J94835l5789K68270e4887C6379g4140D06221a01801C3277O8051
$$ 297369 37848 232683 196894 465164 -54887 36379 -74140 406221 -101801 33277 101328
13096A01328B1072K10213j02330P5092a38701A82548l6872C0573a26250I4443
$$ 101328 21072 231285 128955 204047 -138701 182548 145676 30573 -126250 94443
13085a2730I4292J84894q9656B4697J55585L2640a8339A24975C2332N4655J14070
$$ -12730 94292 279186 189530 24697 180282 212922 -18339 124975 32332 86987 201057
13074B01057I3876a15236D0042a11253E28228a10844C156L1092J30840K55430
$$ 201057 93876 -115236 40042 -111253 528228 -110844 3156 34248 165088 420518
13064D20518D7007N9916l6147K35093a5663F5567L29543O7629B15552b39895C14894
$$ 420518 47007 106923 70776 305869 -15663 65567 395110 462739 215552 -239895 314894
13052A24374g8416C0784N14160G6404b0397E6060J9605j7010J76477M1816E4434
$$ 124374 -78416 30784 544944 76404 -20397 56060 75665 58655 235132 276948 54434
13040a40830c9670D70189f0948A06844K4598J44528l9833c7457B20433h4499A44393
$$ -140830 -39670 470189 -60948 106844 131442 275970 236137 -37457 220433 -84499 144393
13028B49410a7645A29885m233J58676a32848f4853A98913r3034b2216k00861B20218
$$ 249410 -17645 129885 125652 284328 -132848 -64853 198913 105879 -22216 -223077 220218
13016C6635J35601a3728A04950L4833J15115K230C6120A4763M11193A66335q2743
$$ 36635 172236 -13728 104950 139783 254898 257128 36120 14763 425956 166335 83592
13005H3592a4900A39694J04292a73A70623K20836j66431M7558a71915G6597K6683
$$ 83592 -14900 139694 243986 -173 170623 391459 225028 272586 -171915 76597 103280
12994A03280a2257B10J57019i8792A76930P5691a03610B90564J65515A04206l2465
$$ 103280 -12257 210 157229 -98792 176930 252621 -103610 290564 456079 104206 71741
12983G1741J46116F166h2425D44088k12969a89358D2299e1742A03799e2136B73984
$$ 71741 217857 6166 -82425 444088 231119 -189358 42299 -51742 103799 -52136 273984
12971c50135D3284J07737p0105M5019k4949o659a57969B11894G0889K9219Q3977
$$ -350135 43284 151021 80916 125935 100986 94327 -157969 211894 70889 100108 184085
12960A84085a6303k02226Q5457k1264C09026c0103n6939E222a0518A69205L9294
$$ 184085 -16303 -218529 -133072 -154336 309026 -30103 -87042 5222 -10518 169205 208499
12949B08499G0672J68542d9151A35312g225C82663a19351j38173E5820b08167
$$ 208499 70672 239214 -49151 135312 -7225 382663 -119351 -257524 55820 -208167
12938e1437B3302a08206H1075J16832a59201A21278h6137F8051C0719J26209p2457
$$ -51437 23302 -108206 81075 197907 -159201 121278 -86137 68051 30719 156928 84471
12927H4471B1478L1871F884K35260f0995C2437J49389J32307a27479B44536b7594
$$ 84471 21478 53349 6884 242144 -60995 32437 181826 314133 -127479 244536 -27594
12915b9405H1921g3120B37160b513A46007f6980C67837H557b86732B26360O9850
$$ -29405 81921 -73120 237160 -2513 146007 -66980 367837 8557 -286732 226360 296210
12904B96210j19044a04850r608n4757e0468C11077M1670g5986j80666C25145A52542
$$ 296210 177166 -104850 -114458 -169215 -50468 311077 352747 -75986 -256652 325145 152542
12892b16811B45201q1823a940B16329q1756n6644K15057b34199b8059B83841a72644
$$ -216811 245201 163378 -1940 216329 134573 77929 292986 -234199 -28059 283841 -172644
12880a59593B4606J98053i048j15835j14959J15800A40734b5045C53763A61557
$$ -159593 24606 222659 -9048 -124883 -239842 -124042 140734 -25045 353763 161557
12869G8847D224J91030a99485C45981j31658r5840c6548a0761p3523L9862A57507
$$ 78847 4224 195254 -199485 345981 214323 118483 -36548 -10761 -84284 -44422 157507
12857G3611f2953j0951A53814g8075B99758j6961m7103b8181B73254p8715k9301
$$ 73611 -62953 -73904 153814 -78075 299758 282797 235694 -28181 273254 194539 165238
12846A65238J9887h962o6741C0705P1193J51110b4504C7216b0789j8492A06221
$$ 165238 185125 -8962 -75703 30705 101898 253008 -24504 37216 -20789 -39281 106221
12834A69474c17994h8592a557k38062A43666G1432a49017o8366N3310r4209c0293
$$ 169474 -317994 -88592 -1557 -239619 143666 71432 -149017 -217383 -164073 -258282 -30293
12822C2059K07813E2330K48218A11924e0192A56492c04725D12856A53991g8969
$$ 32059 239872 52330 300548 111924 -50192 156492 -304725 412856 153991 -78969
12811d8833j67913K0070C03328a15391C31833b09537m016C9015b72427H5278b58521
$$ -48833 -216746 -196676 303328 -115391 331833 -209537 -213553 39015 -272427 85278 -258521
12799a9183o2486n4003A75240b28784B0381N0336b8947H1868P9268g3554j30837
$$ -19183 -81669 -135672 175240 -228784 20381 70717 -28947 81868 161136 -73554 -204391
12788b04391g7869G3356Q664d3590B94798b61049M7192N8697B3751R1648h3485
$$ -204391 -77869 73356 82020 -43590 294798 -261049 -213857 -155160 23751 115399 -83485
12776B33132a48087j62982f4062A19188n79c2926A4893K89926j11118a38693B16611
$$ 233132 -148087 -311069 -64062 119188 118609 -32926 14893 304819 193701 -138693 216611
12764a5555j1571A50493d171k8509p9603A94128p6866c19815B68227E0994c02025
$$ -15555 -27126 150493 -4171 -32680 -112283 194128 117262 -319815 268227 50994 -302025
12752D2124a38493A16397j2642Q0834A7164Q3539o871O4959g0303C08970a598
$$ 42124 -138493 116397 103755 184589 17164 100703 93832 158791 -70303 308970 -1598
12740C55262h5904C60904D6768a29699D74630B08444B0216K19181A0849N4641
$$ 355262 -85904 360904 46768 -129699 474630 208444 20216 239397 10849 65490
12730F5490Q8307b7335n3153h037j91229A93014K6771i6666k9766o027C7379b54694
$$ 65490 153797 -27335 -80488 -8037 -199266 193014 219785 -96666 -126432 -132459 37379 -254694
12717A30362a01955A27317a1241A44593n7277D877J12326J45730d858o4616C49969
$$ 130362 -101955 127317 -11241 144593 87316 4877 117203 262933 -4858 -69474 349969
12705C72737A77045M12063f0629C74375G5293K83085H3186K30189A24308m2945
$$ 372737 177045 589108 -60629 374375 75293 358378 83186 313375 124308 81363
12695H1363Q2947K6101q5858b77681i7073D44763i845A27510B83a52847B55370
$$ 81363 164310 190411 104553 -277681 -97073 444763 -9845 127510 283 -152847 255370
12683f39B34551j13103L14368A70944L42895B23978n1642a00491B82345A17278
$$ -639 234551 121448 435816 170944 513839 223978 172336 -100491 282345 117278
12672C479a19148j2983N3109D3064a2066k94541c2630o4560n3773D05762A06449
$$ 3479 -119148 -132131 -79022 43064 -12066 -306607 -32630 -97190 -150963 405762 106449
12660C98301B058J32496C7897a29H0135h6581A89088Q820J57676j77617d826A26403
$$ 398301 2058 134554 37897 -129 80135 -86581 189088 197908 355584 177967 -4826 126403
12647B66926b62700i5575A97247a25530o1465B63155a41687R507k9664b918B21344
$$ 266926 -262700 -95575 197247 -125530 -186995 263155 -141687 -132180 -161844 -2918 221344
12635C8480J82002k9347J08154c8282H436L03840m7144P8801l3067O1386L1864
$$ 38480 220482 191135 299289 -38282 8436 312276 265132 343933 310866 372252 404116
12624D04116A88911G3473K54165j42712G4483J90012l8536P8977p1928q7298K4989
$$ 404116 188911 73473 327638 184926 74483 264495 225959 304936 233008 145710 170699
12613A70699f7344B77516C5989L5061D98J06549e5926a3552A18296J24951e4343
$$ 170699 -67344 277516 35989 71050 498 107047 -55926 -13552 118296 243247 -54343
12601c9506c747h80A06115J44423P1123K87912F9431a56900K9408D31931j50448
$$ -39506 -3747 -880 106115 250538 321661 609573 69431 -156900 -127492 431931 281483
12590B81483G5008J04530o7162a07654c1575I4354e9375A44210g3341k78274D1911
$$ 281483 75008 179538 112376 -107654 -31575 94354 -59375 144210 -73341 -351615 41911
12578b47168e6956b0207j27729K6073j31889m0925a29971A41886f1526A30354
$$ -247168 -56956 -20207 -147936 -121863 -253752 -294677 -129971 141886 -61526 130354
12567b25232D4750J7741c52133G3786a13667I0549K76184q4209H6122a10515c1799
$$ -225232 44750 62491 -352133 73786 -113667 90549 366733 282524 86122 -110515 -31799
12555A52214c454H4687J18264a8213A17891B5459a11194q3863B8431c2292l2273
$$ 152214 -3454 84687 202951 -18213 117891 25459 -111194 -195057 28431 -32292 -64565
12544f4565n4410M4964E8834a99898k66938f551A64899b41988E8508h0817A59028
$$ -64565 -118975 -74011 58834 -199898 -466836 -6551 164899 -241988 58508 -80817 159028
12532b72442I0494g6934k71350O0008O7390M3153D1294h9941a4205J242D5495
$$ -272442 90494 -76934 -348284 -288276 -220886 -177733 41294 -89941 -14205 -12963 45495
12520E7515K26358c22257L246a06174K3501B57832A07147g8858l9412C5470a54848
$$ 57515 283873 -322257 -319011 -106174 -82673 257832 107147 -78858 -118270 35470 -154848
12508G603a58627o6810b3894j18997A0933c03139A26516j0929a49489H5901a56690
$$ 7603 -158627 -225437 -23894 -142891 10933 -303139 126516 115587 -149489 85901 -156690
12496e9996B46180I20J58906a03157p7865j55882h4201p5141A01846a17481F552
$$ -59996 246180 920 159826 -103157 -181022 -336904 -84201 -159342 101846 -117481 6552
12484a85940K8522B8759L67445A24665E4122J03114D8996O3614c41853A8266g8866
$$ -185940 -157418 28759 396204 124665 54122 157236 48996 112610 -341853 18266 -78866
12472G2247J8663M065b57061R8354C76212f5671A6534a40608i48D4780b70029
$$ 72247 90910 94975 -257061 -158707 376212 -65671 16534 -140608 -948 44780 -270029
12460f437l6942A25794h4988A04136d5835m5093A62428a79564A42997f0350A20730
$$ -6437 -43379 125794 -84988 104136 -45835 -90928 162428 -179564 142997 -60350 120730
12448H6252a27607b3444C1556L05861e8356A53556a86551B00319D3501k1669J45493
$$ 86252 -127607 -23444 31556 337417 -58356 153556 -186551 200319 43501 21832 167325
12437A67325E4615N6933b26359A8905a34986B53301b22302N1788k1553A37520
$$ 167325 54615 111548 -226359 18905 -134986 253301 -222302 -170514 -192067 137520
12426a20135M342B9223M09611a12719C00953A27637N5610n7065F2039a07717A35715
$$ -120135 -115793 29223 438834 -112719 300953 127637 183247 126182 62039 -107717 135715
12414i3132o3327b758A47591b64039H729f9955q0588G6316k7032c0188r0002C41024
$$ -93132 -156459 -2758 147591 -264039 8729 -69955 -150543 76316 49284 -30188 -120190 341024
12401D4952J2898I354a86202b6772j71652H0333a64144j08843P2837B53916a57761
$$ 44952 57850 9354 -186202 -26772 -198424 80333 -164144 -272987 -200150 253916 -157761
12389e0871A53704b89946J30022H313a0359o4836B16063A8939J01928J30974A02171
$$ -50871 153704 -289946 -159924 8313 -10359 -75195 216063 18939 120867 251841 102171
12377e9221F7275K83272A52816k4230j8548E3430J49772r8513A3954a71369H0607
$$ -59221 67275 350547 152816 128586 110038 53430 203202 104689 13954 -171369 80607
12365A93513A2369a09583C2910P9837O1495f8735H3961P8467a12056D3709J07289
$$ 193513 12369 -109583 32910 112747 174242 -68735 83961 162428 -112056 43709 150998
12354A50998C2943l648N0057K35057g2494J4750A11348M35a16514A69399e125
$$ 150998 32943 29295 79352 314409 -72494 -57744 111348 111783 -116514 169399 -5125
12342b15636C4700h2446C4565d49986a39665B8925N6274A247L3990a6203j4672
$$ -215636 34700 -82446 34565 -449986 -139665 28925 85199 1247 35237 -16203 -30875
12331c0875l83864B50362j13559C4500C395f5603k91A31513Q2623a71559j1752
$$ -30875 -414739 250362 136803 34500 3395 -65603 -65894 131513 214136 -171559 -183311
12320a83311b1739I5635H304J56301a56469c3067A8513a27130A51567p2406B7799
$$ -183311 -21739 95635 8304 164605 -156469 -33067 18513 -127130 151567 79161 27799
12308C3659J70489a41457c0062l34898A08772d2202p6370e3835j04414l6128R4853
$$ 33659 204148 -141457 -30062 -364960 108772 -42202 -118572 -53835 -158249 -194377 -99524
12297i9524M3012a6070k78491E1090c24497a27354F6420J52807J49835d07032
$$ -99524 -56512 -16070 -294561 51090 -324497 -127354 66420 219227 369062 -407032
12286C11202e4371B71033c29945N4346m1871D1363Q7702k8775a45556A5976J13356
$$ 311202 -54371 271033 -329945 -275599 -317470 41363 129065 100290 -145556 15976 129332
12275A29332J95705J34579j75416j15184E3142f270j17336A06660N2801K68161
$$ 129332 325037 459616 284200 169016 53142 -6270 -123606 106660 159461 427622
12265D27622D3795M3340B3097q19R2189D0783L25813I8483k9746A852f1959D34974
$$ 427622 43795 87135 23097 22278 114467 40783 366596 98483 68737 1852 -61959 434974
12252B35974J44243F6076d3194B49856n5287q9574O4915f5607m0280o360B54198
$$ 235974 380217 66076 -43194 249856 194569 104995 169910 -65607 -105887 -112247 254198
12240H4343K13781H7590K00056G8847f9048I8965J47590a59360B36107I9263J10287
$$ 84343 298124 87590 287646 78847 -69048 98965 246555 -159360 236107 99263 209550
12229B09550j03891R8498J20322L6162p0054R6457a6017B00408F2465K07521b7316
$$ 209550 105659 204157 324479 360641 290587 387044 -16017 200408 62465 269986 -27316
12217F5127a7216q5971d4342A00401K46059A03482Q8741A6516K66473b88432D58027
$$ 65127 -17216 -103187 -44342 100401 346460 103482 192223 16516 282989 -288432 458027
12205B9946h0992H0847N0045n792e2174k15706g4479B01257r0877a40311B96051
$$ 29946 -80992 80847 130892 125100 -52174 -267880 -74479 201257 110380 -140311 296051
12193B89884A09984L789K148g9117B12654K7169m3500K27483j31504A1051M50600
$$ 289884 109984 113773 115921 -79117 212654 239823 196323 423806 292302 11051 461651
12182D61651A29786A4165L2918L27993j33545a37899A78797R156J00811a29799
$$ 461651 129786 14165 47083 375076 241531 -137899 178797 187953 288764 -129799
12171C12901o6054K00140A43316O2051J71571j77877J87292R407A85474P870b4314
$$ 312901 246847 446987 143316 205367 376938 199061 386353 395760 185474 193344 -24314
12159A45112D1075a02543E37972k38741j40031o9480a95548B8169O3222k6229
$$ 145112 41075 -102543 537972 299231 159200 89720 -195548 28169 91391 65162
12149F5162L637b7301B43945A08038c32240F7862e1674j11197d4588q3463l5229
$$ 65162 68799 -27301 243945 108038 -332240 67862 -51674 -162871 -44588 -128051 -163280
12138a63280D46529A90865P9103g4998L3351A30981a86353n4043a10300B48526
$$ -163280 446529 190865 269968 -74998 -41647 130981 -186353 -240396 -110300 248526
12127B7299a10493d1632n4291l6252A1446O3388B8752M0592a61560H47a96694
$$ 27299 -110493 -41632 -95923 -132175 11446 74834 28752 69344 -161560 847 -196694
12115d03438A10420B5819J69514E9604K67152j48547a29163C54319A1429L02717
$$ -403438 110420 25819 195333 59604 326756 178209 -129163 354319 11429 314146
12105C14146b14279J03908D97013D6411d650j48292C365a882j61867j04142f3251
$$ 314146 -214279 -110371 497013 46411 -4650 -152942 3365 -1882 -163749 -267891 -63251
12093B36247j00618E9730a14736B27422A5165J61801a15902A7531d0725M379I0436
$$ 236247 135629 59730 -114736 227422 15165 176966 -115902 17531 -40725 -36346 90436
12081A22054a7038H1785a14807A80288d8716A78890e2921A11252m908J027967
$$ 122054 -17038 81785 -114807 180288 -48716 178890 -52921 111252 106344 1134311
12071A134311N11621F13712A44555F1761b3998K640j47389C42332j08590e0729
$$ 1134311 1645932 613712 144555 61761 -23998 -21358 -168747 342332 233742 -50729
12060B67958j07004b69038h7306j263D9598k1081J77010F8388g3355J9302a5376
$$ 267958 160954 -269038 -87306 -88569 49598 28517 205527 68388 -73355 -54053 -15376
12048d64444c7569l2709B90066A13031k1784K5134f9181k91488A57251d3046k21498
$$ -464444 -37569 -70278 290066 113031 91247 116381 -69181 -360669 157251 -43046 -264544
12037b64544C2046f7997E710i7001I8076P1978G6631P4197l8031c8101H6140K2725
$$ -264544 32046 -67997 5710 -97001 98076 170054 76631 150828 112797 -38101 86140 108865
12025A08865a10891h433j67601H615L34720E9556L24988B112N0915b28000j90161
$$ 108865 -110891 -8433 -176034 8615 343335 59556 384544 2112 53027 -228000 -418161
12014d18161D08318A12600b7819j11376I602i5936L4857K2852C53588g1318G5943
$$ -418161 408318 112600 -27819 -139195 9602 -95936 -61079 -38227 353588 -71318 75943
12002g5931A7691N9732Q7847B1255d5720F4856c0061B23521b88487p719i2170
$$ -75931 17691 77423 165270 21255 -45720 64856 -30061 223521 -288487 -296206 -92170
11990H1018a17101A27023a43103E9753c5875m129m0121A01746a51936B08270b50431
$$ 81018 -117101 127023 -143103 59753 -35875 -40004 -80125 101746 -151936 208270 -250431
11978B99705a46319j82973a194k05066a29G574b07170c6534E0989J45765J41116
$$ 299705 -146319 -329292 -1194 -206260 -129 7574 -207170 -36534 50989 196754 337870
11967C37870c58223a68565G7793Q4949J06337d2606j9527b7409j63490e499A93345
$$ 337870 -358223 -168565 77793 162742 269079 -42606 -62133 -27409 -190899 -5499 193345
11955b04205h4502j06600A67776A904N7112d03796A2877K74020H4563a16646I4478
$$ -204205 -84502 -191102 167776 1904 59016 -403796 12877 286897 84563 -116646 94478
11943a78960j34476A09712b800A65925q0131A7145c96794o1540E8596c7614A09851
$$ -178960 -313436 109712 -2800 165925 85794 17145 -396794 -458334 58596 -37614 109851
11931A30320J57515j19928D6537j4891R50a19448c7834k17909f2693B45127A04078
$$ 130320 287835 167907 46537 31646 32596 -119448 -37834 -255743 -62693 245127 104078
11919B86925F5572c7218a4801H7488b4687n3852I5769a70500d8704e373m9479
$$ 286925 65572 -37218 -14801 87488 -24687 -78539 95769 -170500 -48704 -5373 -54852
11908e4852B7371a59568g7127q3302N036A24179J00711q1610b34119A50958n3046
$$ -54852 27371 -159568 -77127 -160429 -155393 124179 224890 143280 -234119 150958 97912
11897I7912J76575H8353c20091j19430G3333b50726A4357a15236N1449A42641
$$ 97912 274487 88353 -320091 -439521 73333 -250726 14357 -115236 -63787 142641
11886C03702d5033a0322E0224g6898A99999a37984E9275c44383n369a1018A01436
$$ 303702 -45033 -10322 50224 -76898 199999 -137984 59275 -344383 -349752 -11018 101436
11874a35590B73152b23461A19794a46265O2712A98900D0909j0297a13662k17047
$$ -135590 273152 -223461 119794 -146265 -83553 198900 40909 30612 -113662 -330709
11864c30709E6524i2820b7145o4919p2577F2117a59745B5117R6977h3822I8010
$$ -330709 56524 -92820 -27145 -92064 -164641 62117 -159745 25117 122094 -83822 98010
11852H6675b5128D26427b9249q3285j03650B19443h1210A45419a37670K2649k7346
$$ 86675 -25128 426427 -29249 -112534 -216184 219443 -81210 145419 -137670 -115021 -142367
11841a42367J6113B18755b24799h1065j0903G1718a21123A07273d47777Q3072
$$ -142367 -126254 218755 -224799 -81065 -91968 71718 -121123 107273 -447777 -364705
11831c64705P0733B22394f517D826a80287A07216M87929D058d43657P4134A60442
$$ -364705 -293972 222394 -6517 4826 -180287 107216 595145 4058 -443657 -369523 160442
11819B79194F2874g5720j36033A72187J6777e2045A7453R0584j9584M840B3929
$$ 279194 62874 -75720 -211753 172187 188964 -52045 17453 108037 88453 93293 23929
11807c3776j21454F2739J12468a14897D59148G8315a32298K486L9362r5574p7878
$$ -33776 -155230 62739 175207 -114897 459148 78315 -132298 -129812 -90450 -186024 -263902
11796b63902f503I6072b45540c8155D3394N6611b7754k9914J8565A16428a0346
$$ -263902 -6503 96072 -245540 -38155 43394 100005 -27754 -57668 -39103 116428 -10346
11784A07548M2503F8493K02194a59420O6665j18637A10258A8721P5471A7545L8194
$$ 107548 150051 68493 270687 -159420 -92755 -211392 110258 18721 94192 17545 55739
11773E5739a66041o7418A24090a66929n5608A90971p6354a74474D40627c13413
$$ 55739 -166041 -233459 124090 -166929 -222537 190971 114617 -174474 440627 -313413
11762A40329a08280C9843J68487d31312A62141b03298K7688A13351b63020G0077
$$ 140329 -108280 39843 208330 -431312 162141 -203298 -175610 113351 -263020 70077
11751a01176q4277A70379i0956q6950A3888b7411j8241d865A26373a23781C04730
$$ -101176 -185453 170379 -90956 -177906 13888 -27411 -45652 -4865 126373 -123781 304730
11739f0501A38797a46472A56949H669a68406f5866k38697E2633a39199j21102
$$ -60501 138797 -146472 156949 8669 -168406 -65866 -304563 52633 -139199 -260301
11729b60301A26762K69078j27874j1737D6958J58028o7337K04602b44880B33758
$$ -260301 126762 395840 267966 256229 46958 204986 137649 342251 -244880 233758
11718I4755C1430J63323M8946F3191L29389j59683M4327d35117A89014d3831B86865
$$ 94755 31430 194753 243699 63191 392580 232897 277224 -435117 189014 -43831 286865
11706C02126r8987B1517b97689J15697l8665A50916J04542a36928K0638F4839
$$ 302126 203139 21517 -297689 -181992 -220657 150916 255458 -136928 -116290 64839
11695c048j28553B3234a47054e2432J5484A84326a12211c0685j67176B64542a2434
$$ -3048 -131601 23234 -147054 -52432 -36948 184326 -112211 -30685 -197861 264542 -12434
11683c0582j16300I3094J86075F6896N3596a7268l9343A87252e8388B37456j09419
$$ -30582 -146882 93094 279169 66896 120492 -17268 -56611 187252 -58388 237456 128037
11672A28037c6932A81681K34238b6519B9908b75696a6209r8204m069B8946L1931
$$ 128037 -36932 181681 415919 -26519 29908 -275696 -16209 -114413 -118482 28946 60877
11661F0877Q1848J50165b829l9322b0411j10361B55905d2453q7353B79693e0794
$$ 60877 142725 292890 -2829 -42151 -20411 -130772 255905 -42453 -129806 279693 -50794
11649D47a18575J2875e2569j60575C46962b72987a22810j02540A0114J47470A8381
$$ 447 -118575 -105700 -52569 -213144 346962 -272987 -122810 -225350 10114 157584 18381
11637A6238J31492P332a31193P655K273N4980C46905a33601c9295A65363B1552
$$ 16238 147730 155062 -131193 -123538 -121265 -66285 346905 -133601 -39295 165363 21552
11625I6972g9790B25540j02845E9995K5681a30123F5569J47847b62077i7806A12002
$$ 96972 -79790 225540 122695 59995 85676 -130123 65569 213416 -262077 -97806 112002
11613i8828B8251b9038O289A94291G6528g2140A24545B5836J21360B0469K253
$$ -98828 28251 -29038 -22749 194291 76528 -72140 124545 25836 147196 20469 22722
11602B2722a7835q8142C00138a39609F8052K29508A23397c17359h5468b9687A3297
$$ 22722 -17835 -105977 300138 -139609 68052 297560 123397 -317359 -85468 -29687 13297
11590c6338B84272a95774D98580H8001J19188J02696A20054J56307d0694A00895
$$ -36338 284272 -195774 498580 88001 207189 309885 120054 276361 -40694 100895
11579B3375a06235A75394G4358K757M5899M8479I331K37916b83424e5499j31984
$$ 23375 -106235 175394 74358 77115 123014 171493 9331 247247 -283424 -55499 -187483
11568a87483B39573o5022J06789H2465a99243G6578P1460a70264B04348p5800
$$ -187483 239573 174551 281340 82465 -199243 76578 148038 -170264 204348 128548
11558A28548P8647B70a55906A52411a78392A05616J51842c4931A02565J21684
$$ 128548 207195 270 -155906 152411 -178392 105616 257458 -34931 102565 224249
11548B24249l9891J21960N3788c6371r2866B166J47142C564d4744H3894N4345
$$ 224249 184358 306318 360106 -36371 -129237 2166 149308 3564 -44744 83894 138239
11537A38239l3307O0844o8748b08452b8387k42765D31P2690g7849q5753j57698
$$ 138239 104932 165776 97028 -208452 -28387 -271152 431 73121 -77849 -163602 -321300
11526c21300a25327B6403f2827A45926o211a02991A42873a3133A37801n3513c3943
$$ -321300 -125327 26403 -62827 145926 139715 -102991 142873 -13133 137801 84288 -33943
11514A24724K08591j39194b38120R9214A56736l4512J19400r4561d0761G6525
$$ 124724 333315 194121 -238120 -138906 156736 122224 241624 147063 -40761 76525
11503B34987A07885g3712A95133N5336c4492A03126D5932i9353k71834C5898f5232
$$ 234987 107885 -73712 195133 250469 -34492 103126 45932 -99353 -371187 35898 -65232
11491a82008A35022c93j81116A15055K2774J54422j05349H3150K63180b2183C9372
$$ -182008 135022 -393 -181509 115055 137829 292251 186902 83150 346330 -22183 39372
11479B66352J73560a34261C80418A83853C5426J21433q117f6612A95250J14312
$$ 266352 439912 -134261 380418 183853 35426 156859 148742 -66612 195250 309562
11469C09562J5348n8842f64F0697A1040N0311J72087h2214F6626J42072M1281
$$ 309562 324910 266068 -664 60697 11040 61351 233438 -82214 66626 208698 249979
11458B49979A09007d3833o0328l390c5925A52942J90583c8474B20146K95164k42404
$$ 249979 109007 -43833 -104161 -107551 -35925 152942 343525 -38474 220146 515310 272906
11447B72906A03999m5056R2811k8896e5863j37653D04072k00821K55538g729B17854
$$ 272906 103999 58943 151754 122858 -55863 -193516 404072 203251 458789 -7729 217854
11435F2488B7569J12376k6128m3661b8513B11749a5119B5833d74462A09307b9376
$$ 62488 27569 139945 113817 70156 -28513 211749 -15119 25833 -474462 109307 -29376
11423B05402H7712N4437i5181m5594L5459A1145A289e484o0756B13267M7082L9986
$$ 205402 87712 142149 -95181 -140775 -105316 11145 1289 -5484 -66240 213267 260349 300335
11411C00335g5813k99601d8400a8196A45748a36613e3992F652K68613q6744O6496
$$ 300335 -75813 -375414 -48400 -18196 145748 -136613 -53992 6652 275265 188521 255017
11400B55017f8599a5286I1163e9425B35238B2904K8657A20a84358B23109p0723
$$ 255017 -68599 -15286 91163 -59425 235238 22904 51561 120 -184358 223109 152386
11389A52386m9681b96851C0088b3136D7113a2806I7361j9435J44861q0950a20189
$$ 152386 102705 -296851 30088 -23136 47113 -12806 97361 77926 222787 141837 -120189
11377E9167M6156m6972J68588A9470K51465n9657a74741A84251E9462L8753e3107
$$ 59167 105323 58351 226939 19470 270935 211278 -174741 184251 59462 98215 -53107
11365A50472a16409E5135m318a65821A16774J16904b8553k0390j1986j51042A01727
$$ 150472 -116409 55135 50817 -165821 116774 233678 -28553 -48943 -60929 -211971 101727
11353e0316B61795a1041k41512A92785A425a65196A7138K03366b30658F3085K83551
$$ -50316 261795 -11041 -252553 192785 1425 -165196 17138 220504 -230658 63085 346636
11342C46636p9301J55903I0390J80078E4321q069b10453a6013G9717b345l47374
$$ 346636 267335 423238 90390 270468 54321 46252 -210453 -16013 79717 -2345 -349719
11331c49719B2058b05577N616G5705R6210b67228B90142c84359D7147h0353n11805
$$ -349719 22058 -205577 -199961 75705 171915 -267228 290142 -384359 47147 -80353 -592158
11320e92158C2201a75054N5008j32707A97019k8287J64194j26348C1541b62491
$$ -592158 32201 -175054 -120046 -252753 197019 168732 332926 206578 31541 -262491
11309A54338b85926f3593B9003e733B12901h0493B60366F8252L53331a12843G2217
$$ 154338 -285926 -63593 29003 -5733 212901 -80493 260366 68252 421583 -112843 72217
11297C4566b55423J25311C6645f9872L183p721l76626K05065d0381k7015B27634
$$ 34566 -255423 -130112 36645 -69872 -66689 -74410 -451036 -245971 -40381 -67396 227634
11285B55414b19I5159J92577Q0266f0735K4019B4798K76463b18710h0860j64056
$$ 255414 -219 95159 287736 368002 -60735 -36716 24798 301261 -218710 -80860 -244916
11274b44916a00823G5005i7510A92280r5227c03586J45655C66136A494O2269a03665
$$ -244916 -100823 75005 -97510 192280 97053 -303586 -157931 366136 1494 63763 -103665
11262A3658b27004H874L5364n215K70818A31865d07462E4401c5027n0264n1030
$$ 13658 -227004 8874 44238 39023 309841 131865 -407462 54401 -35027 -85291 -136321
11251a36321j65465d0755j32557j4525l31396a38191k8335J9894M0250j81644
$$ -136321 -301786 -40755 -173312 -187837 -519233 -138191 -166526 -146632 -106382 -288026
11241b88026N7924f4439B44348e1344I2240K14829A4599b58320I8991a89575A58214
$$ -288026 -230102 -64439 244348 -51344 92240 307069 14599 -258320 98991 -189575 158214
11229b34690G2152f4143j5124k5755j76820g673B1138P405K39623F5067d17125
$$ -234690 72152 -64143 -79267 -105022 -281842 -7673 21138 28543 268166 65067 -417125
11217f8335j30992a2471l3966A53416B878g5451j50211b328j31351H3565A4995
$$ -68335 -199327 -12471 -46437 153416 2878 -75451 -225662 -2328 -133679 83565 14995
11205C32213a06438b8211E180a64511F1274P6014a31680c858l07B70737m7528
$$ 332213 -106438 -28211 5180 -164511 61274 137288 -131680 -3858 -4165 270737 223209
11194B23209a26544K6130A70755a85737j99872g4068A66049b09219j22267A03597
$$ 223209 -126544 -100414 170755 -185737 -385609 -74068 166049 -209219 -331486 103597
11183B1414G869K5818c59156d783l45873D9339g4816o4748k19188E2398M7389
$$ 21414 7869 33687 -359156 -4783 -350656 49339 -74816 -139564 -358752 52398 99787
11172I9787a90201c4646k98269A40385C3074a48933D1754O154d4111A25889C9625
$$ 99787 -190201 -34646 -332915 140385 33074 -148933 41754 47908 -44111 125889 39625
11160h4561A02246K04202A3357b29587B65604a69468b0662q7662B63643A09814
$$ -84561 102246 306448 13357 -229587 265604 -169468 -20662 -108324 263643 109814
11149D0210a94397A9327N4121L5825E2087K42832A816K64626b19378g6115a0605
$$ 40210 -194397 19327 73448 109273 52087 294919 1816 266442 -219378 -76115 -10605
11137G1156k672k8000A3576L05641p2598j3547a87453j21631D3581a03019F4067
$$ 71156 68484 40484 13576 319217 246619 233072 -187453 -309084 43581 -103019 64067
11125g9324C9985K64591K8744H2303r975J03670J3323g5841C70969a24687A02721
$$ -79324 39985 304576 333320 82303 72328 175998 189321 -75841 370969 -124687 102721
11113C17328a0685A08275a48469f6961i557A80788K6514M8028a21246A29816G028
$$ 317328 -10685 108275 -148469 -66961 -9557 180788 207302 255330 -121246 129816 7028
11101A11973K72299k6597A49583a1311B27186j00299i9818E6290N28045c2260
$$ 111973 384272 357675 149583 -11311 227186 126887 -99818 56290 584335 -32260
11090A98848k9576F0833J05839J96974a76044n4605C09510I3280K55110F6545
$$ 198848 169272 60833 166672 363646 -176044 -230649 309510 93280 348390 66545
11079C69712O0176j58547J64901j59419a12278A81054M0473J47587g4014B42219
$$ 369712 429888 271341 436242 276823 -112278 181054 221527 369114 -74014 242219
11068F372J64500K82543K74296B71168J30344K41722k56108j79433J34573M61052
$$ 6372 170872 453415 727711 271168 401512 643234 387126 207693 342266 803318
11058H03318n5083j72535K23426l74398K24355j47566L08866Q0900l16148K00779
$$ 803318 748235 575700 799126 424728 649083 501517 810383 891283 575135 775914
11048G75914B77703L88237J0447j27654J95638J19452k37717k660R1250q3485
$$ 775914 277703 665940 676387 548733 744371 863823 626106 623446 714696 631211
11038F31211J35452o0702p7919M32599k83395l73480L80778p0220P9139j7596
$$ 631211 766663 705961 628042 1060641 777246 403766 784544 714324 793463 775867
11028G75867k97983Q7569J96701R0633C86507M35829K5597C45873L02387p1350
$$ 775867 477884 565453 762154 852787 386507 822336 847933 345873 648260 576910
11018E76910o5916j6267Q7237K72211j24667L3928n5730j46660o6098J06890N1340
$$ 576910 510994 494727 581964 854175 729508 763436 707706 561046 494948 601838 653178
11007F53178J47072j12461k56011J91745J7262k5280K0563r6123P5886M25195
$$ 653178 800250 687789 431778 623523 640785 615505 636068 539945 615831 1041026
10997A041026j93302J076k01241j44062J59480L94120m88925J80329K26209l52224
$$ 1041026 847724 848800 647559 503497 662977 1057097 568172 748501 974710 622486
10987F22486J38226J35575L33380P5111r6312n09505M55337K81274J25482m1378
$$ 622486 760712 896287 1229667 1304778 1208466 698961 1154298 1435572 1561054 1519676
10977A519676J61477M04043K26857L92230J41471r0528K59641j69107k02896k10354
$$ 1519676 1681153 2085196 2312053 2704283 2845754 2755226 3014867 2845760 2642864 2432510
10967B432510L9428m20715m68680j82893K93949L07418p3173k50340j46684L27206
$$ 2432510 2471938 2051223 1582543 1399650 1693599 2001017 1927844 1677504 1530820 1858026
10957A858026j13428K39161m48626k75598J93608j71216m06917j43792j16638
$$ 1858026 1744598 1983759 1535133 1259535 1453143 1281927 875010 731218 614580
10948F14580r5069j67378J53107r3062A12147K38100o0180n8009O8417J88364
$$ 614580 519511 352133 505240 412178 112147 350247 290067 232058 300475 488839
10938D88839b8693k13972D66756B08662P6196a2308j70633l9179g5897A93275
$$ 488839 -28693 -242665 466756 208662 284858 -12308 -182941 -222120 -75897 193275
10927A49827b32492C83970j52552D1095K22902b7784k66948e2814B92473o6422
$$ 149827 -232492 383970 231418 41095 263997 -27784 -294732 -52814 292473 226051
10917B26051a18215d6620l0375q3767B8680e9079A87764R6488I2802e1079d276
$$ 226051 -118215 -46620 -76995 -160762 28680 -59079 187764 284252 92802 -51079 -4276
10905A61932C126a74761f6396K2737C5730a57562m8216A17500N2520d4876F2748
$$ 161932 3126 -174761 -66396 -43659 35730 -157562 -205778 117500 170020 -44876 62748
10893A28565K57666c28075F0115c646k71370d6410J8851B90406B0839m675K43588
$$ 128565 386231 -328075 60115 -3646 -275016 -46410 -27559 290406 20839 16164 259752
10882B59752A27836j7433n1472n424N8166c283C0993J10248d7397j04191c4562
$$ 259752 127836 110403 58931 53507 111673 -3283 30993 141241 -47397 -151588 -34562
10870B57366a69184P579K6077D8695L50699a63582A00353N6441K8290e1804B6811
$$ 257366 -169184 -161605 -135528 48695 399394 -163582 100353 156794 185084 -51804 26811
10858B81742j31741E548f2717B12609d00820A28258d7000k36136h2119k25781
$$ 281742 150001 5548 -62717 212609 -400820 128258 -47000 -283136 -82119 -307900
10848c07900F2214M6599g0920A21344h1569A13818a20573n7661c130k41504J10880
$$ -307900 62214 108813 -70920 121344 -81569 113818 -120573 -178234 -3130 -244634 -133754
10837a33754o6197m8871j5679i278k4106A81016J49031a85443l3228K6601G2283
$$ -133754 -199951 -248822 -264501 -9278 -33384 181016 330047 -185443 -218671 -192070 72283
10825D639b9854p6538G8015N2946i5519A87941n0357b64119F6205c69100A28250
$$ 4639 -29854 -106392 78015 130961 -95519 187941 137584 -264119 66205 -369100 128250
10813c29632J57873B23906a09014n7144D3678J97730b03342M0065P3404l5144
$$ -329632 -171759 223906 -109014 -166158 43678 241408 -203342 -163277 -89873 -125017
10803a25017j57288f6286a3425A71509m8246b05564I5547g3584l03137h2193b0127
$$ -125017 -282305 -66286 -13425 171509 123263 -205564 95547 -73584 -376721 -82193 -20127
10791A45635B6917J05038c87824a86674A23857n4674a90138C7480M5634a95310
$$ 145635 26917 131955 -387824 -186674 123857 69183 -190138 37480 83114 -195310
10780A56959e3255A27530P1940l6943a84707r1431J27642h80l59116a8583I0574
$$ 156959 -53255 127530 199470 162527 -184707 -276138 -148496 -880 -359996 -18583 90574
10768B46750a38476r9014P1551n725H0254a18667b6149N142j12634m0607N4650
$$ 246750 -138476 -237490 -165939 -171664 80254 -118667 -26149 -21007 -133641 -174248 -119598
10757a19598n7171A06801j7868a98630k8526e0683n4422B7894J0677b09388A08442
$$ -119598 -176769 106801 88933 -198630 -227156 -50683 -105105 27894 38571 -209388 108442
10745H2217P4133J1976a69549A40087b09574D5349h2282g858p2066r2667K748
$$ 82217 156350 168326 -169549 140087 -209574 45349 -82282 -7858 -79924 -172591 -169843
10734a69843j36476J35623G6464L00766a16920m5661l8363k3403M5496B9765N331
$$ -169843 -306319 -170696 76464 377230 -116920 -162581 -200944 -224347 -178851 29765 35096
10723C5096K0830K382a59645A50503e8034A80592H050c95555a42595j27165J23033
$$ 35096 55926 58308 -159645 150503 -58034 180592 8050 -395555 -142595 -269760 -146727
10712a46727b8908j50530d2965A98849d4853r7423f2667j09982N4815C05107a71607
$$ -146727 -28908 -179438 -42965 198849 -44853 -142276 -62667 -172649 -117834 305107 -171607
10700i7937b9172E0956a80169B43583i7125b6641j53837B05202c03028M5864C23045
$$ -97937 -29172 50956 -180169 243583 -97125 -26641 -180478 205202 -303028 -257164 323045
10688a49345M5954A24841b12072h2097I4993J94762D5180J04912C4383j0527A0600
$$ -149345 -103391 124841 -212072 -82097 94993 289755 45180 150092 34383 23856 10600
10676h713C2079M8366b62556A14501J3009a5486l1524C22858A02066J8819a69490
$$ -8713 32079 80445 -262556 114501 127510 -15486 -47010 322858 102066 120885 -169490
10664f9133E7688b22074a691j37380a2392A10692B125g2986k15559J25535o6203
$$ -69133 57688 -222074 -1691 -139071 -12392 110692 2125 -72986 -288545 -163010 -229213
10653b29213a03774A22706b24934A22426k9159r786i2921r5566h5335q2341D5544
$$ -229213 -103774 122706 -224934 122426 93267 83481 -92921 -188487 -85335 -167676 45544
10641A62852b73531i552k030k83721d4033l6693G9271k8838a7952H1358a54519
$$ 162852 -273531 -9552 -11582 -295303 -44033 -80726 79271 50433 -17952 81358 -154519
10629B35932b61064D5018K69922c4536A74193a51719A52863c8310b228B02310
$$ 235932 -261064 45018 314940 -34536 174193 -151719 152863 -38310 -2228 202310
10618A50621e2728l75762J59398A65084G3505B8613i5271j91068A09028b98573
$$ 150621 -52728 -428490 -269092 165084 73505 28613 -95271 -286339 109028 -298573
10607c0946a910l02195a15762B3379b43312C0193f9252D1926a23598I2400i2131
$$ -30946 -1910 -304105 -115762 23379 -243312 30193 -69252 41926 -123598 92400 -92131
10595a89077c9732j49538A72360E3772e2745j03927O540r2031A16072a12469b8452
$$ -189077 -39732 -189270 172360 53772 -52745 -156672 -150132 -242163 116072 -112469 -28452
10583a70992C51155B3535b80417A9608J533d7942l24331B4949m329c76773J33045
$$ -170992 351155 23535 -280417 19608 21141 -47942 -372273 24949 20620 -376773 -243728
10572b43728a03013E7986N0327a44174D23447a32041A16831K4098C1967g9424
$$ -243728 -103013 57986 108313 -144174 423447 -132041 116831 140929 31967 -79424
10561a05193M8948E4738e3412D6220O7447h1430K1034J4731q135a7409A27263
$$ -105193 -56245 54738 -53412 46220 113667 -81430 -60396 -45665 -53800 -17409 127263
10549d09444d0422F8855a86252A63002J09507A7222O8478L3520A9608L50327b46983
$$ -409444 -40422 68855 -186252 163002 272509 17222 85700 119220 19608 369935 -246983
10537g1299r8584A35198A9857Q0889b91211e2352B8469K81908d07172f3936I9067
$$ -71299 -169883 135198 19857 100746 -291211 -52352 28469 310377 -407172 -63936 99067
10525a42880M7934j59478C3817b03716H8690e3469I6869e9781A5192J59871a78957
$$ -142880 -94946 -254424 33817 -203716 88690 -53469 96869 -59781 15192 175063 -178957
10513a48123E908b11056H4919j6860P1494J3372b392r3180C7678i1292k39989
$$ -148123 5908 -211056 84919 68059 139553 152925 -2392 -95572 37678 -91292 -331281
10502c31281D5794L1878R3355h1912n1656B0095b4795E4674K26903g6292l74884
$$ -331281 45794 77672 171027 -81912 -133568 20095 -24795 54674 281577 -76292 -451176
10491d51176A7881K8521b93471I3249k5325b60082g6840C78096m6389A56656K63112
$$ -451176 17881 46402 -293471 93249 67924 -260082 -76840 378096 331707 156656 419768
10480D19768L18314C49512J92941E7642B5686i4031j67756g1327C9140J22318
$$ 419768 738082 349512 542453 57642 25686 -94031 -261787 -71327 39140 161458
10470A61458Q9573b12072e8086A70295a5399j07269A5209d2345j77639O2732A02700
$$ 161458 251031 -212072 -58086 170295 -15399 -122668 15209 -42345 -219984 -157252 102700
10458E6359K1423K49285c1618B22070D1563h8068a0473j44740A50320a19111j8208
$$ 56359 77782 327067 -31618 222070 41563 -88068 -10473 -155213 150320 -119111 -137319
10447a37319E5671c03413O6407B97171d06881R7229k0924g0616C60184a66585
$$ -137319 55671 -303413 -237006 297171 -406881 -309652 -330576 -70616 360184 -166585
10436b38635a6322A42757a23379e2144A6565b13245O090p8191b7257j76551B86826
$$ -238635 -16322 142757 -123379 -52144 16565 -213245 -207155 -285346 -27257 -203808 286826
10424a02705B26419A2836a16063M8597A5423c21709E4966J17231J12267I2172
$$ -102705 226419 12836 -116063 -67466 15423 -321709 54966 172197 284464 92172
10413I1943B9506i0866j54332i6141D3748P2446k5395b29213B58362M1679B8133
$$ 91943 29506 -90866 -245198 -96141 43748 116194 90799 -229213 258362 300041 28133
10401a07894j00578c7639A87395a25912O2435C73546j41066b1361j89975F3514
$$ -107894 -208472 -37639 187395 -125912 -63477 373546 232480 -21361 -211336 63514
10390A05994K7958J49056F6515J55135P7420o8975i7082E6865a4837l09169A50612
$$ 105994 133952 283008 66515 221650 299070 230095 -97082 56865 -14837 -324006 150612
10378B96066q0785q8045Q9977C3080K04533o7832G2399M51710k35089A32905J13840
$$ 296066 215281 127236 217213 33080 237613 169781 72399 524109 289020 132905 246745
10367B46745N47L43532k38793j13664r421J48550a62654B1493b00199C09921I5837
$$ 246745 247292 590824 352031 238367 228946 377496 -162654 21493 -200199 309921 95837
10355a51808f4679A16038P2173r973L13421J33905B59183j726L26468B48659K71847
$$ -151808 -64679 116038 188211 178238 491659 625564 259183 257457 583925 248659 520506
10344E20506B06841J58919j4432R0955F0749L9271M29587I3560J97835E6219P3151
$$ 520506 206841 365760 351328 442283 60749 100020 529607 93560 291395 56219 129370
10333A29370k3175K11072b19884P4454A71532n6360L69298D6031J0277a31556
$$ 129370 106195 317267 -219884 -145430 171532 115172 484470 46031 56308 -131556
10322H525K00065K3025P0860b1059A48921J16965r695r8337R6241C566e8148G8592
$$ 8525 208590 231615 302475 -21059 148921 265886 256191 157854 254095 3566 -58148 78592
10309C5198a23968C09743g0513A79766K9424b68772k3295i8025b1185D09785a76719
$$ 35198 -123968 309743 -70513 179766 209190 -268772 -292067 -98025 -21185 409785 -176719
10297g4227j48375A59617a62746j55645h5085I5508c6271k03067a00671j87424
$$ -74227 -222602 159617 -162746 -318391 -85085 95508 -36271 -239338 -100671 -288095
10287b88095A96483P959K43680d4267B56407C048a21532j27049B17843a09106
$$ -288095 196483 204442 448122 -44267 256407 3048 -121532 -248581 217843 -109106
10276b20407A17842i4464B62772a7843F3172a77586I4419a85469P3286A4972a8896
$$ -220407 117842 -94464 262772 -17843 63172 -177586 94419 -185469 -112183 14972 -18896
10264G6814e4942a2516H4281K00036r869J21061Q2203k33530K9091P8290j38213
$$ 76814 -54942 -12516 84281 284317 274448 395509 477712 244182 273273 351563 213350
10253B13350f7266b7187k38454J04914C5195J34118h6573B12544J07564A56988
$$ 213350 -67266 -27187 -265641 -160727 35195 169313 -86573 212544 320108 156988
10242G3657a71909p6582A91976B1772h3220b5663A72354a28208j46834P0443B62248
$$ 73657 -171909 -248491 191976 21772 -83220 -25663 172354 -128208 -275042 -204599 262248
10230A82755J86753b50981a03710q1401B53972a05139o274k540J8980d0927A08787
$$ 182755 369508 -250981 -103710 -185111 253972 -105139 -111413 -113953 -94973 -40927 108787
10218a3977j06740m8392d262A92088M2800p3914b30447M5765P3685A20259a41530
$$ -13977 -120717 -169109 -4262 192088 234888 160974 -230447 -184682 -110997 120259 -141530
10206F4556a66782l20566d6465n401H6445c40420a66559B23172L6295B8556a72337
$$ 64556 -166782 -487348 -46465 -51866 86445 -340420 -166559 223172 259467 28556 -172337
10194b60059A59899h3458j11611N9472A66475a0537j04028c013l189C91273L3322
$$ -260059 159899 -83458 -195069 -135597 166475 -10537 -114565 -3013 -6202 391273 424595
10183D24595a08060B1062a85783d4719C7347b07089b3960l58752J45889R72F0319
$$ 424595 -108060 21062 -185783 -44719 37347 -207089 -23960 -382712 -236823 -235851 60319
10171B99053k8912E2905e2936o6215l64679b39513o8072a6357r1204n1195J5025
$$ 299053 270141 52905 -52936 -119151 -483830 -239513 -307585 -16357 -107561 -158756 -143731
10160a43731F538a04039j55744A30413d2772J5862A48834a16034k69737C3661
$$ -143731 6538 -104039 -259783 130413 -42772 -26910 148834 -116034 -385771 33661
10149c05694J13102h8273j02532Q2405j19596L1113L700B02270a268B49858a81109
$$ -305694 -192592 -88273 -190805 -108400 -227996 -196883 -193183 202270 -1268 249858 -181109
10137a30391B1503M3767d41541i3706I9024J65282i3605A01592i3182k19284C41237
$$ -130391 21503 65270 -441541 -93706 99024 264306 -93605 101592 -93182 -312466 341237
10125A24880o1540A5577L3233J0960h6843j16458A05940D2053C06J48266a00934
$$ 124880 63340 15577 48810 59770 -86843 -203301 105940 42053 306 148572 -100934
10113f0452j1941B290L23568G0523a50528E745a78224B58832b25900e4135A5341
$$ -60452 -72393 2290 325858 70523 -150528 5745 -178224 258832 -225900 -54135 15341
10101a80760C46606b21710J09636b1330C9864j1164i2366I09a93007b1983I8779
$$ -180760 346606 -221710 -112074 -21330 39864 28700 -92366 909 -193007 -21983 98779
10089a80191B39467G168K37019A3510h0505j04396j41008N9114B1954b57148a19868
$$ -180191 239467 7168 244187 13510 -80505 -184901 -325909 -266795 21954 -257148 -119868
10077b56469C84428a22322G0943I964a423k81827i663k78049g3058j61749M4348
$$ -256469 384428 -122322 70943 9964 -1423 -283250 -9663 -287712 -73058 -234807 -190459
10066a90459R0994j17252B5105Q885M6153B5472J87801a50774G3730a63681A74088
$$ -190459 -99465 -216717 25105 33990 80143 25472 213273 -150774 73730 -163681 174088
10054B15238H1351b34979j66740J81471M2311j34989J47648K8731l4128D2501
$$ 215238 81351 -234979 -401719 -220248 -177937 -312926 -165278 -136547 -170675 42501
10043h0512A12369g932j31746A83360a36141b3183A28169g6567m3636N5173i704
$$ -80512 112369 -7932 -139678 183360 -136141 -23183 128169 -76567 -120203 -65030 -9704
10031b85952A81464a68426k54886a35555D8579e269F4431e6338B84945b01370
$$ -285952 181464 -168426 -423312 -135555 48579 -5269 64431 -56338 284945 -201370
10020B28866b65470g1518n62191i2383A28233f1346j00752A64225b31030j85035
$$ 228866 -265470 -71518 -633709 -92383 128233 -61346 -162098 164225 -231030 -416065
10010d16065b5512k10517F1200h4664a5495j63886B15250f5309l30006a09944
$$ -416065 -25512 -236029 61200 -84664 -15495 -179381 215250 -65309 -395315 -109944
9999G8607b63115o0645g813p9952j42106e4767p9682j31904q7924c5071k85405
$$ 78607 -263115 -323760 -7813 -87765 -229871 -54767 -134449 -266353 -354277 -35071 -320476
9988c20476h1609j80569g7954A03456J4699c48515H2381O8530b47977J17263l7284
$$ -320476 -81609 -262178 -77954 103456 118155 -348515 82381 150911 -247977 -130714 -167998
9977a67998I8036e371F8323N5479Q5464a40266N7511A1546b6143r6739j17860
$$ -167998 98036 -5371 68323 123802 209266 -140266 -82755 11546 -26143 -122882 -240742
9966b40742A5943d293A86623c6639A36680e5064l26257B71681E06a03486H2350
$$ -240742 15943 -4293 186623 -36639 136680 -55064 -381321 271681 506 -103486 82350
9954d1676o6476j47462B4743J05860b06202j72823a27150A66561J9684E0052b21921
$$ -41676 -108152 -255614 24743 130603 -206202 -379025 -127150 166561 186245 50052 -221921
9942e9430n1811l0894O9423J7998n7308N877J0675A10878a35131j82761D9848
$$ -59430 -111241 -142135 -72712 -54714 -112022 -106145 -95470 110878 -135131 -317892 49848
9930a36826d7462D2516L8793c9371k65282a27420r1056d0195G658c49009A79716
$$ -136826 -47462 42516 81309 -39371 -304653 -127420 -218476 -40195 7658 -349009 179716
9918D18443g7397F4022Q9273M4829b4322j27287p5742k09096a53127j53151g8750
$$ 418443 -77397 64022 153295 198124 -24322 -151609 -227351 -436447 -153127 -306278 -78750
9906a07544j1949j24061j00645a14435p7395D5437b59372m2081a05241j06889
$$ -107544 -119493 -243554 -344199 -114435 -191830 45437 -259372 -301453 -105241 -212130
9896b12130h4493k2521j66565I0410k5757b37309h8583c4067B28760b77055g3849
$$ -212130 -84493 -107014 -273579 90410 64653 -237309 -88583 -34067 228760 -277055 -73849
9884D4873a59431e0206B2955c91316I7459P3447H1422Q7846M1163p8721b70296
$$ 44873 -159431 -50206 22955 -391316 97459 170906 81422 169268 210431 131710 -270296
9872i6342M4042b015k01141B46361c06305E6000a47484C05792b49108A11985g3454
$$ -96342 -52300 -2015 -203156 246361 -306305 56000 -147484 305792 -249108 111985 -73454
9860i8191j08053r6393A36125b55757p664i5857L1235n3685D53279D50f0056A17992
$$ -98191 -206244 -302637 136125 -255757 -263421 -95857 -64622 -118307 453279 450 -60056 117992
9847d1713M860l25261h8082A735b05764R19p5505j16102a21551A19632D3469b92660
$$ -41713 -36853 -362114 -88082 1735 -205764 -204845 -280350 -396452 -121551 119632 43469 -292660
9834I3899J35858a63858j55918M5584A98658e9288n2717k43265l452a31671K3912
$$ 93899 229757 -163858 -319776 -274192 198658 -59288 -112005 -355270 -358722 -131671 -107759
9823a07759d7650I2788M3428d42439h9557p4270h1058B70878A07050F949a68954
$$ -107759 -47650 92788 136216 -442439 -89557 -163827 -81058 270878 107050 6949 -168954
9811F53a7407q2107A58771b75851R2412p3379g4732o2991B605J34927b30037I8951
$$ 653 -17407 -99514 158771 -275851 -183439 -256818 -74732 -137723 2605 137532 -230037 98951
9798b79776A6538P3522J330b46369c0537j53785r0600o4342A90735d1050m1707
$$ -279776 16538 90060 91390 -246369 -30537 -184322 -274922 -339264 190735 -41050 -82757
9787h2757A11596e5404r0021j56188I5380Q1997c07497j56574A10026J75413B1875
$$ -82757 111596 -55404 -145425 -301613 95380 177377 -307497 -464071 110026 285439 21875
9775c63213a28821J0703j32674i3602r2729l8860E0257P2338a91743m0194e0297
$$ -363213 -128821 -118118 -250792 -93602 -186331 -225191 50257 122595 -191743 -231937 -50297
9763c30129A47804c0690j94329A18694E2902J79088C3625a54134l2512f4439l40260
$$ -330129 147804 -30690 -225019 118694 52902 231990 33625 -154134 -186646 -64439 -404699
9752d04699A9137K9325K8504e3259l5633A46203o2377g8387F2258R2662a36155
$$ -404699 19137 48462 76966 -53259 -88892 146203 83826 -78387 62258 154920 -136155
9740c1761A85294a91582E6250M2144d633j25255j4648o8784k69540a91122D0382
$$ -31761 185294 -191582 56250 98394 -4633 -129888 -144536 -213320 -482860 -191122 40382
9728a40654E0346O8549i1512m41858b26091O8654p7742n2561j09362e1214r2993
$$ -140654 50346 118895 -91512 -533370 -226091 -157437 -235179 -287740 -397102 -51214 -144207
9717a44207N6063A79191C0101J96509D0777b02924h7387p224j05939d8804B33238
$$ -144207 -88144 179191 30101 226610 40777 -202924 -87387 -94611 -200550 -48804 233238
9705a16061C941a24553C28110E6890h0360a5020A28510n5089b38708i0930b8894
$$ -116061 3941 -124553 328110 56890 -80360 -15020 128510 73421 -238708 -90930 -28894
9693a46929k09904k2398a60254j63073a46718N7822p6681A16625K1106a50601
$$ -146929 -356833 -379231 -160254 -323327 -146718 -88896 -165577 116625 137731 -150601
9682C3875p607J14168a95665g5945H9599B9643j2249b12025A23956a52914j4417
$$ 33875 26268 140436 -195665 -75945 89599 29643 17394 -212025 123956 -152914 -167331
9671a67331B76497a10392k6669b9901n59550b16246k1204f4421a1661k57089G1980
$$ -167331 276497 -110392 -137061 -29901 -589451 -216246 -237450 -64421 -11661 -268750 71980
9659a26123B55369G8300K52698e3797K6718I307a11119j53974a16167L8638F8786
$$ -126123 255369 78300 330998 -53797 -27079 9307 -111119 -265093 -116167 -77529 68786
9647d2254k4529n3691G6012f8907A23439a21709n5881g8827k83746f876A51938
$$ -42254 -66783 -120474 76012 -68907 123439 -121709 -177590 -78827 -362573 -6876 151938
9635b29046C27805b24360r787B95040j04162b15435P8249j57910f1225l71572
$$ -229046 327805 -224360 -234147 295040 190878 -215435 -137186 -295096 -61225 -432797
9625d32797A96215J8176A06175J18531A03043c29368A297O463b1362l82311Q8560
$$ -432797 196215 214391 106175 224706 103043 -329368 1297 7760 -21362 -403673 -315113
9614c15113B281b85382C0025o849A0029e0059o1177k28996a30066k3457d8496
$$ -315113 2281 -285382 30025 23176 10029 -50059 -111236 -340232 -130066 -153523 -48496
9602B98994n972f7168l9505k21254Q6987A28804b19672B27356a38263j2281L8239
$$ 298994 293022 -67168 -106673 -327927 -240940 128804 -219672 227356 -138263 -150544 -112305
9591a12305b7782l31055L0770A59732l7412a72534A26026b84648J02928J621A2756
$$ -112305 -27782 -358837 -328067 159732 122320 -172534 126026 -284648 -181720 -180099 12756
9579a55872A37304b05041J4361g7400C31193b22724h3948L7846I9437a11737j07330
$$ -155872 137304 -205041 -190680 -77400 331193 -222724 -83948 -46102 99437 -111737 -219067
9568b19067f2563j21978P9947n3294B73312d64970b4965n298D633J79125a28566
$$ -219067 -62563 -184541 -104594 -157888 273312 -464970 -24965 -30263 4633 183758 -128566
9556b18136G4076a72307a5913j04775C35232A38313D3456A0742K6107b05949n6401
$$ -218136 74076 -172307 -15913 -120688 335232 138313 43456 10742 36849 -205949 -262350
9545b62350o544h7194k35846a55801i325j08955j82272o4097a58095A43045c18674
$$ -262350 -268894 -87194 -323040 -155801 -9325 -118280 -300552 -364649 -158095 143045 -318674
9533A08117C7226j437g7381a1473l67949e7299j2363j40698B05374N2077a07725
$$ 108117 37226 35789 -77381 -11473 -379422 -57299 -69662 -210360 205374 257451 -107725
9521C3422Q8435i0043A42520g9114b2678k92058A54699b57595d6937j91175I3518
$$ 33422 121857 -90043 142520 -79114 -22678 -314736 154699 -257595 -46937 -238112 93518
9509I7714B7535a55018b4650B16749H6759J11376h2422A67220a39393Q097I803
$$ 97714 27535 -155018 -24650 216749 86759 198135 -82422 167220 -139393 -131296 9803
9497A8648J0394p792b21222D7772d216H2373K47846q4561a99848P3125G7820f43
$$ 18648 29042 21250 -221222 47772 -4216 82373 330219 245658 -199848 -126723 77820 -643
9484c57840H8249n751j3367k429h6372c8623k12804M1275J6145B3218N6806h1250
$$ -357840 88249 82498 69131 66702 -86372 -38623 -251427 -210152 -194007 23218 80024 -81250
9471f6538j90707L7251j1151J12038C3125a1867k02662j73104C641a70031A41901
$$ -66538 -257245 -219994 -231145 -119107 33125 -11867 -214529 -387633 3641 -170031 141901
9459H0426l7475h7399Q435j39066B11634c22810J6487J14406B10720a05031d2155
$$ 80426 42951 -87399 -78964 -218030 211634 -322810 -306323 -191917 210720 -105031 -42155
9447a40999G9036c6563BL06453A0839i1976j82773P5884q5908a36497k14340a61615
$$ -140999 79036 -36563 2 306455 10839 -91976 -274749 -198865 -284773 -136497 -350837 -161615
9434a58006r6320A03392b2181l02702A41261a13221B39619c51405J28739G5024
$$ -158006 -254326 103392 -22181 -324883 141261 -113221 239619 -351405 -222666 75024
9423a46654d3857j03215C871J69872c30642B21284o3505b81311K0389J1440H4013
$$ -146654 -43857 -147072 3871 173743 -330642 221284 157779 -281311 -260922 -249482 84013
9411I0491J04544a36457L3634A960O8811d9428m213n297a3079n14504f4694L598
$$ 90491 195035 -136457 -102823 1960 70771 -49428 -53641 -58938 -13079 -527583 -64694 -61096
9399f1096k1618K2015b3404E9569J51426Q1569b07319O0394j39755E7071O9908
$$ -61096 -82714 -60699 -23404 59569 210995 292564 -207319 -146925 -286680 57071 126979
9388A26979g6719J9147k28725C09448f2241j34521F8628c45575F4989r909f8952
$$ 126979 -76719 -57572 -286297 309448 -62241 -196762 68628 -345575 64989 55080 -68952
9376h1003l9928k20341D18115e8597l11093A30704a84374n2664A89862c90324
$$ -81003 -120931 -341272 418115 -58597 -369690 130704 -184374 -237038 189862 -390324
9365I6054h3289n72j30806A10977B1814b37354f9231A837Q4584J26843F6463b48525
$$ 96054 -83289 -83861 -214667 110977 21814 -237354 -69231 1837 86421 213264 66463 -248525
9352i7334b1989B7996e17587b21475J1135a00055A87736f8374C1551a15917C94197
$$ -97334 -21989 27996 -517587 -221475 -210340 -100055 187736 -68374 31551 -115917 394197
9340i8778e680A25327a70405j9286A93179b03489O8113j32902a15951N3772A12482
$$ -98778 -5680 125327 -170405 -189691 193179 -203489 -135376 -268278 -115951 -62179 112482
9328A71373h1688k43094E6227a82853k6371A887J25956a98678m5523E5343b63159
$$ 171373 -81688 -324782 56227 -182853 -209224 1887 127843 -198678 -244201 55343 -263159
9316f3331k76910b4821j50437q7584A87824C4185b88128A94428a49935G9546a88976
$$ -63331 -340241 -24821 -175258 -262842 187824 34185 -288128 194428 -149935 79546 -188976
9304A24307c09983N9989A64258h0426h63A10267d1134j02700L8059j35453A8846
$$ 124307 -309983 -249994 164258 -80426 -863 110267 -41134 -143834 -105775 -241228 18846
9292a77280Q3320k22628J45849A29747J2936b56712B27180c55262E2845p001b21355
$$ -177280 -93960 -316588 -170739 129747 142683 -256712 227180 -355262 52845 45844 -221355
9280E5147a29216C2055P6094A4255e9737H7485O0703M8144a21161B61184b55472
$$ 55147 -129216 32055 108149 14255 -59737 87485 148188 196332 -121161 261184 -255472
9268c90449a38041k63720K3634a35032l73577A2241a76600j1053K2550D7667h8625
$$ -390449 -138041 -401761 -378127 -135032 -508609 12241 -176600 -187653 -165103 47667 -88625
9256A43245a48212N5344A22730b02998j0047F3688B9514e9566D6507c28168M7980
$$ 143245 -148212 -92868 122730 -202998 -213045 63688 29514 -59566 46507 -328168 -280188
9245b80188C08384b63994B88583a23214B12236m8640J60260a93652M5476H3654
$$ -280188 308384 -263994 288583 -123214 212236 163596 323856 -193652 -148176 83654
9234b87300f112F6188b04364K996C90774a75105f6120b7159k04777C65952a02640
$$ -287300 -6112 66188 -204364 -201368 390774 -175105 -66120 -27159 -231936 365952 -102640
9222a92136e5685B5825a65747o9885f7622b425C7197c19324F1620b47994J13940
$$ -192136 -55685 25825 -165747 -235632 -67622 -2425 37197 -319324 61620 -247994 -134054
9211a34054O4998M947m03835A07685c05815J47660g4252E3855b65972B24773p9070
$$ -134054 -69056 -64109 -467944 107685 -305815 -158155 -74252 53855 -265972 224773 145703
9200A45703d30825L7931E2059a70214f6484G433K30155a4942l23950J21143R3142
$$ 145703 -430825 -392894 52059 -170214 -66484 7433 237588 -14942 -338892 -217749 -124607
9189a24607A29856K9948k4690e6330j19810M53L5588c5098K070j5544a617k29380
$$ -124607 129856 159804 135114 -56330 -176140 -175687 -140099 -35098 -33028 -48572 -1617 -230997
9177b30997C17370b5679A6368a03900r147A03083b83284B06536c0770i347A22777
$$ -230997 317370 -25679 16368 -103900 -113047 103083 -283284 206536 -30770 -9347 122777
9165A9210a11954B38281g5878j47657B5948b11727K2267c8190j58162k3147C10513
$$ 19210 -111954 238281 -75878 -223535 25948 -211727 -189460 -38190 -196352 -219499 310513
9153b53017a02099I0734O6504f9065B12475p8460c63280d0080j44253b6681j04403
$$ -253017 -102099 90734 157238 -69065 212475 134015 -363280 -40080 -184333 -26681 -131084
9142a31084D3410J33398R6188a22007C856P9908f7857j25784a7736D5211k0416
$$ -131084 43410 176808 272996 -122007 3856 83764 -67857 -193641 -17736 45211 24795
9131B4795J67003d7062k54501a00710q737j31153a01703j09561N173J0385L0469
$$ 24795 191798 -47062 -301563 -100710 -109447 -240600 -101703 -211264 -206091 -195706 -165237
9120a65237k0690l3084O9057q2792A92672F099L15532A21434a13270H9105k9681
$$ -165237 -185927 -219011 -149954 -232746 192672 6099 321631 121434 -113270 89105 59424
9109E9424O9385a28417M9732B18272b32053j5653r2770O7689b9100E4976b76737
$$ 59424 128809 -128417 -78685 218272 -232053 -247706 -340476 -272787 -29100 54976 -276737
9097G0245o912k3410h0903B09387F3675K04645r2116G936d00889g9606r4413C3112
$$ 70245 63333 39923 -80903 209387 63675 268320 176204 7936 -400889 -79606 -174019 33112
9084b0208B27819A8247K7097Q8298c2372B91725i4435j0756q8357M3632j6949
$$ -20208 227819 18247 45344 133642 -32372 291725 -94435 -105191 -193548 -149916 -166865
9073a66865n589f5484k15195a9251B59553h1869j69075B68495a40848e0663J528
$$ -166865 -172454 -65484 -280679 -19251 259553 -81869 -250944 268495 -140848 -50663 -49135
9062d9135D5268a29873j70718e708H8936k5678a4495m0085A74412a94202C70621
$$ -49135 45268 -129873 -300591 -5708 88936 63258 -14495 -54580 174412 -194202 370621
9050A00735f6902k09539I5363J6141a57196P8340l46264E1838J9718j8912a6638
$$ 100735 -66902 -276441 95363 111504 -157196 -78856 -425120 51838 71556 52644 -16638
9038d8409G6145c7467G1825A2434a34183H0905k8450b32920J00219n8408B02650
$$ -48409 76145 -37467 71825 12434 -134183 80905 52455 -232920 -132701 -191109 202650
9026d59282b08967q3906A57377A1427J44230e09723C72095a75766D7899f2616
$$ -459282 -208967 -292873 157377 11427 155657 -509723 372095 -175766 47899 -62616
9015b20365I6673m6036h0128p2290j10219A30318b1841B02785g0452A7401P0761
$$ -220365 96673 50637 -80128 -152418 -262637 130318 -21841 202785 -70452 17401 88162
9004H8162b54581a2294j42326M6444A08352a32356A31145m2202a09707r04l6268
$$ 88162 -254581 -12294 -154620 -108176 108352 -132356 131145 88943 -109707 -110611 -146879
8993a46879d0796A63416E9828a6310l83283d5344B8153b37468A36410m4404a67202
$$ -146879 -40796 163416 59828 -16310 -399593 -45344 28153 -237468 136410 92006 -167202
8981i1971j54397P4101O0131c7318l03431h3449C4482a15853A36710a66077a7444
$$ -91971 -246368 -172267 -112136 -37318 -340749 -83449 34482 -115853 136710 -166077 -17444
8969A11667K0562i3005l9420J6627l71271a85216G2789b21513A1014b72681A64364
$$ 111667 132229 -93005 -132425 -115798 -487069 -185216 72789 -221513 11014 -272681 164364
8957b6013A37496a42474j72509g6352B30381n0081n1369J90106j11351l8812D5751
$$ -26013 137496 -142474 -314983 -76352 230381 180300 128931 319037 207686 168874 45751
8945D782R1448J62348f8779j24012H6840P2790j0112c43534J40895h635A33416
$$ 4782 96230 258578 -68779 -192791 86840 159630 149518 -343534 -202639 -8635 133416
8933a02328A37318b0173C15192B5241c0319j21989e5904A02450N7955M90862K074034
$$ -102328 137318 -20173 315192 25241 -30319 -152308 -55904 102450 160405 651267 2725301
8922B725301N936224C897500A331752A72183k2898a15025B33173A03442c68534
$$ 2725301 8661525 3897500 1331752 172183 149285 -115025 233173 103442 -368534
8912e7199k70464A1374N0652K43483d9242F0336j5083a55812C56646j67812d1298
$$ -57199 -327663 11374 62026 305509 -49242 60336 45253 -155812 356646 188834 -41298
8900f5539j86097L0698N5248j52121F7099L7890a00229A27201a18692q7495j77041
$$ -65539 -251636 -220938 -165690 -317811 67099 104989 -100229 127201 -118692 -206187 -383228
8889c83228C438a41470B8173J37161d1567j48056f9649m06833J83227C7254J01711
$$ -383228 3438 -141470 28173 165334 -41567 -189623 -69649 -476482 -293255 37254 138965
8878A38965e42287A34029f4604F1066a26112B2857e122k1709A89327b67784h474
$$ 138965 -542287 134029 -64604 61066 -126112 22857 -5122 -26831 189327 -267784 -8474
8866G2334K9829A6891a2667A88679b8431j14823M8310B42904b45688J01040k97597
$$ 72334 102163 16891 -12667 188679 -28431 -143254 -94944 242904 -245688 -144648 -442245
8855d42245a42471F280c3898j23333L0624j11227f1033J8077I6464b05223j8350
$$ -442245 -142471 6280 -33898 -157231 -126607 -237834 -61033 -42956 96464 -205223 -223573
8844b23573G5128b26644m5963e2572B4780J5225J01867B1654L1224e1342k83468
$$ -223573 75128 -226644 -272607 -52572 24780 40005 141872 21654 52878 -51342 -334810
$$ [...]
##END NTUPLES=NMR SPECTRUM
##END=
