
##TITLE=AC1311_NICAH12127_6615783_QRgXg3rtw9
##JCAMPDX= 6.0         $$ Bruker NMR JCAMP-DX V2.0
##DATA TYPE= NMR SPECTRUM
##DATA CLASS= NTUPLES
##ORIGIN= BRUKER
##OWNER= Administrator
$$ 1.72 TOPSPIN		Version 2.1
$$ 2012-08-03 01:51:54.953 -0500  Administrator@TOPSPIN
$$ Compression mode = diff/dup
##.OBSERVE FREQUENCY= 400.02188249412
##.OBSERVE NUCLEUS= ^1H
##.ACQUISITION MODE= SIMULTANEOUS (DQD)
##.ACQUISITION SCHEME= undefined
##.AVERAGES= 8
##.DIGITISER RES= 22
##SPECTROMETER/DATA SYSTEM= spect
##.PULSE SEQUENCE= zg30
##.SOLVENT NAME= COFFEE_meoh
##.SHIFT REFERENCE= INTERNAL, COFFEE_meoh, 1, 14.98509
##AUDIT TRAIL= $$ (NUMBER, WHEN, WHO, WHERE, PROCESS, VERSION, WHAT)
$$ ##TITLE= Audit trail, TOPSPIN		Version 2.1
$$ ##JCAMPDX= 5.01
$$ ##ORIGIN= Bruker BioSpin GmbH
$$ ##OWNER= Administrator
$$ $$ C:\Bruker\TOPSPIN/data/COFFEE/nmr/AC1311_NICAH12127_6615783_QRgXg3rtw9/10/pdata/1/auditp.txt
$$ ##AUDIT TRAIL=  $$ (NUMBER, WHEN, WHO, WHERE, PROCESS, VERSION, WHAT)
(   1,<2012-08-03 01:51:48.156 -0500>,<Administrator>,<TOPSPIN>,<go>,<TOPSPIN 2.1>,
      <created by zg
	started at 2012-08-03 01:50:41.281 -0500,
	POWCHK enabled, PULCHK disabled,
       configuration hash MD5:
       6B 1B 68 BB D9 2E 58 E2 7F 35 AD 54 07 DF 0E 41
       data hash MD5: 64K
       43 B9 39 E5 FC 42 4C 5E 62 46 24 B3 51 97 A0 4D>)
(   2,<2012-08-03 01:51:50.890 -0500>,<Administrator>,<TOPSPIN>,<proc1d>,<TOPSPIN 2.1>,
      <Start of raw data processing
       efp LB = 0 FT_mod = 6 PKNL = 1 PHC0 = 0 PHC1 = 0 SI = 32K 
       data hash MD5: 32K
       3E 6D 70 AB 5D 62 66 C0 6D A1 9A BD 9B ED 75 F8>)
(   3,<2012-08-03 01:51:51.281 -0500>,<Administrator>,<TOPSPIN>,<proc1d>,<TOPSPIN 2.1>,
      <pk PHC0 = 176.6052 PHC1 = 0 
       data hash MD5: 32K
       82 DA 16 ED CB 3F 56 FB A3 78 C2 C3 40 2D 32 73>)
(   4,<2012-08-03 01:51:51.375 -0500>,<Administrator>,<TOPSPIN>,<proc1d>,<TOPSPIN 2.1>,
      <abs ABSG = 1 
       data hash MD5: 32K
       5C 36 AA 96 D1 5E 8A 4C 47 A6 53 90 0B 22 CE 37>)
(   5,<2012-08-03 01:51:51.406 -0500>,<Administrator>,<TOPSPIN>,<proc1d>,<TOPSPIN 2.1>,
      <abs ABSG = 2 
       data hash MD5: 32K
       D3 5D 0D E3 B0 83 DA 8D C4 66 EC C4 D6 E1 5F C4>)
(   6,<2012-08-03 01:51:51.437 -0500>,<Administrator>,<TOPSPIN>,<proc1d>,<TOPSPIN 2.1>,
      <abs ABSG = 3 
       data hash MD5: 32K
       CB BD F7 8E E3 A0 38 A7 44 71 8E 1F 25 F8 B9 8B>)
(   7,<2012-08-03 01:51:51.468 -0500>,<Administrator>,<TOPSPIN>,<proc1d>,<TOPSPIN 2.1>,
      <abs ABSG = 4 
       data hash MD5: 32K
       B1 3F 68 D1 68 8D 55 6D 54 B8 35 4A CE E1 43 C0>)
(   8,<2012-08-03 01:51:51.484 -0500>,<Administrator>,<TOPSPIN>,<proc1d>,<TOPSPIN 2.1>,
      <abs ABSG = 5 
       data hash MD5: 32K
       71 22 8C C0 CC FC 97 39 8F 6A BE AA 01 3D 35 F7>)
$$ ##END=
$$ 
$$ $$ hash MD5
$$ $$ 94 FB 7D 12 86 E9 AF 80 7C 19 61 D3 2E EC BD 39
##$RELAX= 
##$RELAX= 
##$RELAX= 
##$RELAX= 
##$RELAX= 
##$RELAX= 
##$RELAX= 
$$ Bruker specific parameters
$$ --------------------------
$$ [...]
150 150 150 150 150 150 150 150
##$TP07= 0
##$TPNAME0= <>
##$TPNAME1= <>
##$TPNAME2= <>
##$TPNAME3= <>
##$TPNAME4= <>
##$TPNAME5= <>
##$TPNAME6= <>
##$TPNAME7= <>
##$TPOAL= (0..7)
0.5 0.5 0.5 0.5 0.5 0.5 0.5 0.5
##$TPOFFS= (0..7)
0 0 0 0 0 0 0 0
##$TUNHIN= 0
##$TUNHOUT= 0
##$TUNXOUT= 0
##$USERA1= <user>
##$USERA2= <user>
##$USERA3= <user>
##$USERA4= <user>
##$USERA5= <user>
##$V9= 5
##$VALIST= <valist>
##$VCLIST= <CCCCCCCCCCCCCCC>
##$VD= 0
##$VDLIST= <DDDDDDDDDDDDDDD>
##$VPLIST= <PPPPPPPPPPPPPPP>
##$VTLIST= <TTTTTTTTTTTTTTT>
##$WBST= 1024
##$WBSW= 4
##$XGAIN= (0..3)
0 0 0 0
##$XL= 0
##$YL= 0
##$YMAX_a= 481737
##$YMIN_a= -628540
##$ZGOPTNS= <>
##$ZL1= 120
##$ZL2= 120
##$ZL3= 120
##$ZL4= 120
##$ABSF1= 14.98509
##$ABSF2= -5.573092
##$ABSG= 5
##$ABSL= 3
##$ALPHA= 0
##$AQORDER= 0
##$ASSFAC= 0
##$ASSFACI= 0
##$ASSFACX= 0
##$ASSWID= 0
##$AUNMP= <proc_prof1d_extract_pilot.lims>
##$AXLEFT= 0
##$AXNAME= <>
##$AXNUC= <1H>
##$AXRIGHT= 0
##$AXTYPE= 0
##$AXUNIT= <>
##$AZFE= 0.1
##$AZFW= 0.1
##$BCFW= 0
##$BC_mod= 0
##$BYTORDP= 0
##$COROFFS= 0
##$CY= 15
##$DATMOD= 1
##$DC= 0
##$DFILT= <>
##$DTYPP= 0
##$F1P= 0
##$F2P= 0
##$FCOR= 0.5
##$FTSIZE= 32768
##$FT_mod= 6
##$GAMMA= 0
##$GB= 0
##$INTBC= 1
##$INTSCL= 1
##$ISEN= 128
##$LB= 0
##$LEV0= 0
##$LPBIN= 0
##$MAXI= 10000
##$MC2= 0
##$MEAN= 0
##$ME_mod= 0
##$MI= 0
##$NCOEF= 0
##$NC_proc= -8
##$NLEV= 6
##$NOISF1= 0
##$NOISF2= 0
##$NSP= 0
##$NTH_PI= 0
##$NZP= 0
##$OFFSET= 14.98509
##$PC= 1
##$PHC0= 176.6052
##$PHC1= 0
##$PH_mod= 1
##$PKNL= yes
##$PPARMOD= 0
##$PPDIAG= 0
##$PPIPTYP= 0
##$PPMPNUM= 2147483647
##$PPRESOL= 1
##$PSCAL= 4
##$PSIGN= 0
##$PYNMP= <proc.py>
##$REVERSE= no
##$SF= 400.02
##$SI= 32768
##$SIGF1= 0
##$SIGF2= 0
##$SINO= 400
##$SIOLD= 32768
##$SPECTYP= <>
##$SREGLST= <1H.CDCl3>
##$SSB= 0
##$STSI= 32768
##$STSR= 0
##$SW_p= 8223.68421052631
##$SYMM= 0
##$S_DEV= 0
##$TDeff= 65536
##$TDoff= 0
##$TI= <>
##$TILT= no
##$TM1= 0
##$TM2= 0
##$TOPLEV= 0
##$USERP1= <user>
##$USERP2= <user>
##$USERP3= <user>
##$USERP4= <user>
##$USERP5= <user>
##$WDW= 1
##$XDIM= 32768
##$YMAX_p= 467405973
##$YMIN_p= -713950
##$CURPLOT= <Network HP LaserJet P1505>
##$CURPRIN= <$Network HP LaserJet P1505>
##$DFORMAT= <normdp>
##$LAYOUT= <+/1D_H.xwp>
##$LFORMAT= <normlp>
##$PFORMAT= <normpl>
##$SURQMSG= 1
$$ End of Bruker specific parameters
$$ ---------------------------------
##NTUPLES= NMR SPECTRUM
##VAR_NAME=  FREQUENCY,     SPECTRUM/REAL,   SPECTRUM/IMAG
##SYMBOL=    X,             R,               I
##VAR_TYPE=  INDEPENDENT,   DEPENDENT,       DEPENDENT
##VAR_FORM=  AFFN,          ASDF,            ASDF
##VAR_DIM=   32768,         32768,           32768
##UNITS=     HZ,            ARBITRARY UNITS, ARBITRARY UNITS
##FACTOR=    0.250966925370066, 1,           1
##FIRST=     8223.43324360094, -166436,      -170161
##LAST=      0,             5356,            -140458
##MIN=       0,             -713950,         0
##MAX=       8223.43324360094, 467405973,    0
$$ Real data points
##PAGE= N=1
##DATA TABLE= (X++(R..R)), XYDATA
$$ [...]
23770 26625 67362 -209589 223288 -124048 -132404 187433 12044 70946 -261477 -130565 -52147
23758 -74370 98929 29583 -12018 -21989 17994 60707 286507 -105820 -211793 -133303 -35984
23746 28414 163578 -197812 180801 238445 -354775 -229303 -6602 192189 -52070 -11926 18811
23734 189272 -84979 111969 -82130 -271755 -172253 -117044 146561 -7942 124410 129164 -144321
23722 314079 -219707 254033 -8099 -5700 164301 25004 -168143 -27084 -41222 284052 -139029
23710 -291153 -306279 -51338 -20608 153309 -111321 -317366 -91953 -78360 2847 -377782 -247776
23699 -247776 52416 399807 -164423 -41371 60287 234056 103646 -444563 -31079 -72460
23689 -72460 -197607 -26694 -130081 -89596 -142631 -161812 190474 -191890 159398 32390 -14004
23677 -401996 199869 -258679 -94481 37403 51178 -493047 -240594 -154978 435348 -268628
23666 111490 -472595 143787 226293 299717 150388 -173167 226655 195663 264542 349181
23656 349181 -57662 -38934 218979 -92601 128973 139313 -168010 -55800 -359641 -140963
23645 -270644 -207265 -459244 156262 63627 -14251 -14548 13155 397360 -199702 25352 -225096
23633 119446 -69344 -57636 -17160 -135870 92920 -317274 201654 -97562 32377 -75292 -108147
23622 -108147 300780 -12013 -91783 -113693 165677 2549 -75449 -198472 -210706 190231 495714
23611 495714 -65548 -108433 -143657 132679 -101597 -196114 60248 203053 73440 -169738 198925
23599 -151040 -88485 330263 -60632 213146 329749 205976 280205 233805 264098 207143 340919
23588 340919 -264 188633 257488 160891 -8244 258575 268868 192937 -339265 371096 -68070
23576 -298488 204410 163427 127259 101509 133626 -232400 -92833 -45171 27184 160990 -163673
23564 20572 46740 -146778 -21486 -47085 -28513 -103112 34696 170750 107582 -124204 -117154
23553 -117154 -36904 -99588 -7853 -13738 70386 -218670 316515 2827 -42694 224212 8454 99496
23541 99496 48746 111909 196478 140445 -145783 -23154 -298659 204139 -100121 -134296 -176648
23530 -176648 156996 -251550 -39792 -89798 -171906 -45924 -280250 -245106 131076 195378 -139828
23518 211027 16473 376920 354692 -226462 84462 214501 37271 -258581 220824 -12899
23507 -92873 -147581 237307 113719 -52507 -249342 -184289 234950 -144951 -134524 188636
23496 271496 -339237 -55133 -77997 -251414 -84899 286641 -68945 430176 52166 -58886 -195297
23485 -195297 -418568 -18013 137637 96842 -135371 -139023 83084 -24668 -84465 -62932 24227
23473 146808 -176279 -5878 223048 270739 -256808 -16156 141068 -374986 95681 -364666
23462 -102942 262145 -96434 451844 -239806 -58230 16001 -104172 -308108 26478 184394
23452 184394 92965 -331316 -55559 -77023 15893 -203639 -29204 -163693 -106467 -8370 -94872
23441 -94872 -178217 -357110 -287726 -268857 -79000 76949 2266 -113243 217434 223447 54831
23429 -19170 -55128 -350139 -84018 -73471 -6485 -61164 36304 119515 -235756 130844 83731
23418 83731 -217064 -166869 65248 160628 -35308 100223 -180948 -162031 -157126 -408886 25311
23406 188778 -322885 -328010 29308 -85849 28578 -160705 -135317 -98915 190590 -253485 -230892
23395 -230892 -19601 333208 -146410 -69222 241139 -139779 91438 -21418 -153694 -135110
23385 -135110 -201283 -134440 56240 100552 -175891 -26582 -196082 -83930 10255 -53555 -23847
23373 -354216 -52744 60324 127400 -409732 128493 142516 -151830 60722 -232253 -382359
23363 -382359 -271408 -215154 142070 -2556 -181856 43444 -207919 -150429 67092 -122119 134210
23351 256527 -118415 -72471 -135617 -21120 149399 247497 18319 -164463 151482 -55855 -182414
23340 -182414 -195693 -44043 92670 -104989 -298914 -42370 328286 -544812 203869 -69711
23329 179473 4543 196290 -28746 311996 -59781 120090 302564 44989 -127899 41223 12021
23317 -367663 355052 175381 43705 -84519 -248942 95701 -107494 128099 -156238 -78462
23307 -78462 -566 -104030 341944 191482 -55273 186065 58366 -219326 165612 -289010 80755
23295 -394857 -199788 -245221 -164302 -78904 -112706 -174085 -58069 -269569 -132731 82912 32186
23283 77817 -40286 105547 -114543 260995 244412 -72975 -196807 60871 70852 82197 162385
23272 162385 146962 -80707 -295530 190723 -122985 -640419 -151708 98384 -115118 -241851
23262 -241851 -185822 -263076 -252014 250671 293440 -217819 -280903 -2428 -126440 111819 52518
23250 221589 -44764 111364 -150013 -144640 -77843 -159571 -86075 -43790 292130 370558 -40801
23238 209121 -95406 -157349 -213525 -70995 23354 109610 -37102 172478 -161228 -34213 -180954
23227 -180954 295231 -290188 6298 5686 176921 209046 297082 -80766 -21277 -149978 334919
23215 301032 -116690 -98296 115005 -40414 -399267 59897 157751 5310 -59100 237344 -25605
23203 -59890 -226376 198602 -122718 43218 133610 36070 -136691 -91093 -577353 83799 -21342
23191 -98487 -4775 -146422 -37208 -38853 -282918 -236423 -87513 -315224 135266 120529 42572
23179 -118239 457544 97165 71638 -4485 20046 166237 91229 -130413 -103798 -113176 -40006
23167 55149 -35634 -126881 -131216 -15186 89590 -240634 -85161 -21680 -482715 -66984 -186460
23156 -186460 68001 -195335 -8733 -150183 79164 -135284 55129 -305899 -154195 -41758 -190690
23145 -190690 -132224 -150351 157629 -8793 -118374 106119 -479016 213948 -485555 24020
23134 -70783 -17270 -12058 193584 269947 -7499 246942 126475 62921 -188490 160060 -221637
23122 17937 150922 -198859 104708 320838 -310622 52766 211184 -58329 91775 -92469
23111 -138995 -276154 12158 -255825 -118455 132111 -170476 361140 120723 -48313 -168580
23101 -168580 -18406 51836 -126889 234279 -118486 -254144 327494 232486 41791 -337775
23090 115580 -15794 343870 1867 125010 112319 17075 -904 -42721 207558 168490 118644
23079 118644 -145225 -209485 100963 116190 36996 270369 29065 -113837 -30207 19744 -138451
23067 -351502 148415 64677 198184 -124530 -121116 -160244 196002 -84112 59338 13991 197548
23056 197548 -194017 155484 360541 138107 -168668 29224 -80500 134863 -12025 -154651
23046 -154651 -169513 114504 164428 187108 148171 100371 -200083 -169233 -72002 -101242 24584
23034 -271407 62548 97401 119977 271798 -180980 48080 8887 240364 168811 36689 134750
23023 134750 -107971 237504 167893 192253 17715 316796 303715 -294333 115064 204161
23013 204161 -213127 89642 122849 2596 -84042 -167342 -332056 -25735 114271 75737 -114792
23001 -235540 -73366 -418970 183487 -280311 167224 -143453 -185378 -52874 -107421 -60133
22991 -60133 -218017 203990 180022 -127103 92220 -114414 -249607 -275396 -205017 -82747 -84518
22980 -84518 279348 3690 -96645 -188113 -154785 163946 -220984 -132857 -197876 259678 -18848
22968 -112765 189851 458748 -21778 88179 -35348 200859 -238815 74362 -47923 156021
22957 19964 -81720 -124620 -246246 -226522 -285571 -829 6090 17524 181769 44706 84007 296980
22945 296980 4173 -64076 -226276 -12309 -396311 58890 -73499 68785 14818 76524 134989
22934 134989 -132262 36365 -160988 49046 -110562 -274995 -141901 -119104 -4005 -180764
22924 -180764 -149758 -42536 -43002 84216 -143061 16415 74791 -208626 412720 121370 107645
22913 107645 127939 144872 15414 113068 -61772 -260406 66161 -236648 -179150 -20641 339027
22901 180567 210857 -48458 -229252 -95688 121043 85487 300408 159286 102433 -54357 -178051
22890 -178051 -109200 16185 -261366 62498 334045 -147061 -32305 -43670 -108151 -61556 -191552
22879 -191552 18877 10328 32252 254648 -1940 -358599 -123160 -538465 227639 5943 -179114
22867 -108139 13628 79613 872 -64798 114443 -97370 -166501 445530 -56181 -122330 -125720 -294642
22855 -294642 -160151 -31450 298593 237171 -32313 281117 156274 96889 113046 -156434
22844 -147697 -179938 119916 -337530 243745 287209 12245 -183708 90612 124647 -285168
22833 165407 411587 -373880 23251 -244191 30417 -49122 105339 -9126 -120759 -136581 6812
22821 -189374 231405 -46454 130363 -228672 68617 105632 159011 1113 -186670 -69176 94111
22809 84277 -62716 -114654 140813 -159772 -151852 -189441 -289431 -248178 122062 -57992 -149146
22798 -149146 -26042 -100262 356252 24383 -43344 82011 -100992 74335 110442 -69125 310827
22786 -239143 5499 -44644 15669 -267409 224324 365776 -200316 7275 989 -145902 151018
22774 -39741 -238789 50893 -103255 -53079 313563 243814 -300959 -350132 73306 -64493 37496
22762 157733 -320396 50044 -42512 39467 159152 -27612 -258335 -191046 -226545 106248 38194
22750 70701 -204999 -302567 -164941 -100381 -41582 -272152 -278204 -97065 15668 -327647 524585
22738 -408325 -108784 -25204 76112 44606 -118440 186352 125214 -73148 -15993 -89525 -67177
22727 -67177 -43506 -266370 -24284 40443 -14269 -107837 -206244 156708 -159487 -38723 87399
22715 80151 -72576 163461 -136584 -9133 185109 -80253 -392557 63604 56831 -64072 -67975
22704 -67975 -280401 9262 -250368 -102808 -273307 65194 212837 55806 -94303 45268 -361377
22692 -125284 -249812 106672 -134856 -26642 -21217 -147269 -3502 -421698 -129986 288141
22681 -96429 33490 -280416 -27748 -14175 -159894 116294 248230 -66060 -122848 -98065 -30397
22669 107133 -83230 -14061 -40601 -261628 -166697 210226 -3780 -98920 -55127 -14730 -92534
22658 -92534 -192797 59447 -57139 -97100 -59481 -80029 13242 101530 172853 -447386 9070
22646 -37327 82756 243217 159433 37219 -104546 147937 -42957 -222163 85550 -89889 -151704
22635 -151704 56747 54938 214760 384586 -147419 173617 296084 -100962 -65626 128340
22624 171621 112701 169272 -235932 -72059 90192 176018 80774 -59926 -122115 30588 282499
22613 282499 -1949 -87026 -282362 -377378 -260022 -22899 -66036 -378150 76296 -7862 -31750
22602 -31750 36991 -110441 167333 -451000 -78088 -110524 96437 -94652 -39856 187744 -215258
22590 -103152 -11785 -274961 -39877 71914 -332369 126601 -159061 -46616 -149086 164518
22579 145190 48654 -221847 316403 33157 -144872 24312 -83929 -196941 -10988 58652 32464
22568 32464 26010 57573 -232482 -18628 -71125 57293 -22556 -64983 164504 93424 148831
22557 148831 260767 -62807 95507 148651 -23272 -165245 -88046 -23980 -192930 -209174 215923
22545 -83856 74617 -122421 32410 -163316 2813 -129110 -87112 -129944 -220389 13839 85375
22534 85375 -156926 -160314 -150593 -276509 -80192 323914 174750 138182 -1370 -28610 -20884 -50508
22522 -50508 20691 -92001 121678 -123376 -391074 -12356 -163843 -110274 -191150 80211 -63526
22510 -61410 -250415 -120771 5490 200143 14554 175746 -458404 -25535 264175 -134819
22499 -473832 229832 310509 -72276 107047 -196532 130823 -243627 8903 127787 85823
22489 85823 -89386 -345302 -181230 -90394 -253435 -359688 -252244 -295372 -135318 -119457
22479 -119457 147516 156258 -268820 -99020 94089 121074 232768 -110449 -14949 289859 -243042
22467 -170920 -49959 -147754 62921 81748 230896 5437 -72617 -139304 -7644 -233557 -72358
22455 287693 105373 31046 -127865 75148 -83364 -6320 75923 42080 -267129 -230064 -34759
22443 240066 40362 -105911 -203113 -259793 364054 -62225 -72255 -495516 -246074 -3775 -48729
22432 -48729 -203699 -162509 -178421 111855 -12183 9559 137424 -5930 -160497 -191119 40924
22420 63592 -225430 -170330 -252573 -131479 -196989 -166481 116359 132904 247542 71342 10170
22408 150970 -54798 -66932 9080 -48099 184120 116851 -2901 53328 -130362 -121991 -99319 89253
22395 -36042 40802 -237073 78623 76814 24979 62189 223046 41183 -199705 -218165 -249786
22384 -249786 -207337 57954 -33956 91014 -150389 -25309 -278079 -347441 -26601 -104808 -109245
22373 -109245 17042 -200770 76018 19196 -139054 61604 118566 -61856 164638 -208363 -427363
22362 -427363 -65859 30260 76620 36462 -461021 45671 -51137 -78894 -113156 -37654 -38434 -134495
22350 -134495 -38175 -434848 -104697 40250 -146756 369230 -80181 -295319 -463428 -104199
22339 307259 -15260 -74869 76462 -167251 14372 -91208 -7431 -142523 128664 -246299 -181301
22328 -181301 -100334 74444 -2234 -15811 166155 -255707 -199080 -162080 -158362 -40956 302913
22316 149145 -111746 -40075 -235433 -64814 -138744 -51953 -21178 110417 -23884 -78003 -119457
22305 -119457 -58499 98581 -62301 -377450 -77945 138677 -113535 45915 -156236 44254 82040
22294 82040 -19471 98189 202729 30213 53651 -99500 151435 -39307 99945 -3867 264609
22282 35391 24271 -153203 245715 150786 81351 -148598 76109 -389797 -337021 -97446 -55205
22271 -55205 -286728 -270544 -282473 14604 657 -151657 -40675 -90683 312255 -247637 47069
22259 145522 -44421 -165067 -14630 -235498 -209797 170565 170971 111679 -177648 -162243 -83402
22248 -83402 -70444 67553 27394 17127 -167768 -117017 -10397 349895 -232409 -113555 -425424
22237 -425424 209856 127471 196883 -246504 -65888 68817 -31801 -10075 -59577 -35487 506269
22225 -258635 246339 27813 -38301 155189 -256014 237670 -46151 -422113 -216061 18717
22214 -146514 9447 129253 -224553 178519 154700 -170883 86184 -133714 181603 405039
22204 405039 -1246 -149654 331629 -191601 -116637 103525 -106154 12978 53409 -198304
22193 29877 -445501 -184911 190836 -88767 51237 -120052 -25074 -115073 -125537 -280394 330755
22181 -66869 6197 -179798 -116192 -110646 89358 -289551 55879 49814 -82188 -45600 -116021 -34888
22168 65439 180749 145401 137875 -2617 212319 -218194 -57137 -99418 122503 -55769 88441
22156 39125 -8187 -62838 -154062 -145089 -184157 21797 -118790 27514 -3214 -218295 -64805 110707
22143 -72167 180754 -97037 -116265 -164243 -179254 151587 -90090 -251490 68633 -188331 -379899
22132 -379899 220674 -63965 -15767 -38353 77881 53837 -90971 56281 -219498 -221185 -255761
22121 -255761 -62136 -3195 -106087 147097 -510096 -266652 -179264 -155396 -150837 -27653 -12287
22109 -152358 151711 99668 42502 -164012 -57717 -445688 -12093 -80514 -394437 -90785 -320881
22098 -320881 -49362 111866 -349721 15336 18631 -134583 163514 191068 210520 -8873 -185945
22087 -185945 31386 -213388 131708 40197 -64630 -48604 -291772 -97476 196971 -21551 317100
22075 136252 304032 172686 -234923 -159529 242280 -130974 -67498 -70295 41754 92952 -304410
22063 -112187 -134778 -416204 -219314 -125821 -86130 147109 -83209 -272304 33260 -27738 336304
22051 -118926 60105 -150058 -18451 -158162 396874 38928 106222 129196 -24685 -109831 -47683
22039 -235315 -180788 -210521 104853 214429 -164003 -231070 -9783 344776 -419124 -146447
22028 -187365 98610 146710 210606 76642 -331582 -287961 -192781 92039 -268672 -203841 -68455
22016 -385868 -221342 -108703 -117433 147048 -203430 -113279 60772 113338 235330 -113753
22005 -166776 -194156 -68733 -141146 -430182 -250057 163873 -57659 -366088 -228800 77067
21994 -2724 -81002 -285646 -51467 -44503 -17447 -32260 19580 33667 -146754 -79521 -67656 -64299
21982 -64299 -60415 -257020 125633 65336 -287573 10635 53098 -416591 -258288 81033 235880
21971 235880 -166795 -376402 -182771 50846 37525 -13213 458698 -324344 -130322 -42240
21960 -40489 261879 -49974 160948 22589 -68646 67192 -92350 321055 -185051 65399 -181901
21948 -250638 -86268 -10673 145044 -80805 -294745 -71471 165983 -141005 -37532 143716
21937 16909 -175393 -70875 18563 111787 -79929 32466 -143062 -67076 64582 -457686 -17044
21925 -280356 -93845 171180 -127700 185033 71349 -121985 -161395 -245449 18330 -97226 105513
21913 -127573 180685 -27898 -307506 -148655 -238807 52810 70790 106646 -3235 241287 -134211
21901 137766 -134452 25210 278575 -209227 245332 -70721 -25889 85926 -208683 -245522
21891 -245522 -36529 110937 235810 -107312 409741 12671 123146 16249 -55115 78205
21880 -272278 -215089 8751 196355 -68969 -126410 -53001 -158544 -233002 2560 139995 -251484
21868 48875 17284 -89761 -174829 -186492 -40809 -50549 -351413 31804 144540 -12472 -131624
21857 -131624 130230 -182429 -8211 64884 70874 -129361 -256100 -85701 244352 231037 82864
21845 38869 104964 -133462 202935 -268188 -45012 -105240 51187 24494 -122145 43618 -113190
21833 15308 152270 -49327 -620354 -74837 -16338 -168085 -430397 44545 -108072 261549
21822 223808 -155488 -140746 63107 377072 -79646 -155080 -278311 110702 84619 -231207
21811 349345 -92391 -127549 -101879 100916 17729 -242155 -262453 47777 -151035 -96683 -234459
21800 -234459 198996 -192229 -72142 -44581 -319778 4566 -90642 215275 99655 -463558 -32317
21788 -10288 19537 -183573 18468 -317018 130165 -238779 204720 -48117 187861 339672
21778 339672 135336 60780 131342 175283 -255857 -31905 -160131 -85859 -75351 197538 -101062
21766 -125558 2407 184523 -212654 62141 -130031 -44551 -2845 62053 142244 -266976 192951
21754 90348 167198 57983 85358 97800 -262154 -202596 -215617 119959 81890 -471104 -82210
21742 -18561 -153919 -108571 -32849 160209 -171280 -160807 281969 -11623 60938 -79737 54844
21730 -100720 406357 122351 -137500 143225 -121833 378 115316 235620 40172 -246774
21719 21880 -255489 -78501 72482 153925 -36674 -159359 -59732 473120 1907 204186 143611
21708 143611 -7861 138798 177112 138147 -76841 29618 -344573 175566 -392107 -399398 30611
21696 46018 -196680 15892 -161729 -1366 193517 58230 -18706 175235 -334384 32490 -89382
21684 -51481 -85036 48745 -188457 -25165 -133027 14417 77787 -43460 -45066 79219 -31523
21672 -35297 -162323 132590 69273 -141666 56169 -109901 252132 7718 33208 91051 -95417
21660 -73168 -64315 68230 -34666 -314647 -347320 -334898 -66517 22350 -152629 -153451 261276 82840
21647 -54496 -61452 -131955 -144783 -267937 155934 -74297 156781 -169517 -163490 -99673 -108332
21636 -108332 -39936 141681 -301811 -13099 -92192 -231027 301995 -184001 -107021 -192965
21626 -192965 -199320 -104578 -150607 -177933 -153334 -198295 125819 -273026 235907 -244546 -200458
21615 -200458 -103916 -267240 -233909 -100390 166857 -98010 -355386 -81717 -97213 -153303 -125003
21604 -125003 -298922 55169 -217883 -433359 52726 -298178 -338368 44415 -94408 -352738
21594 -352738 -143085 -28583 199791 -79488 196515 188288 163323 194912 54548 -184721 94975
21582 -382250 163139 -237356 -206627 -186893 -14985 -27292 225906 -113462 300657 -391089
21571 -263868 64299 -40603 -343603 268243 -146124 40502 142946 -98721 -31856 162586
21560 -131473 24418 -359972 -49997 -121418 167267 -242976 103700 -214555 131862 -305199
21549 -20394 -57992 -172026 -260811 -206806 -141221 106108 -210588 -34047 76481 -171055 323303
21537 101403 -3948 -41541 67451 -109159 -99872 57063 26394 -428290 -87648 -137077 107690
21525 -83885 230263 440546 -136215 -8095 37656 -272408 -205766 -87285 -27486 28429 190992
21514 190992 -41977 45788 242422 -49845 -15753 69520 140939 -62645 -2502 6982 -270825
21502 -151465 -25684 -656 39490 208373 121071 -211324 134941 -24100 -63038 -7174 -324849
21491 -324849 -206278 260585 -102524 -128758 -62357 -251032 -35201 -95257 141169 -213997
21480 -21014 -118854 -46117 -252915 12962 -385538 138155 -17767 -27743 55348 -372543 -61181
21468 -261199 -135621 42624 -209345 -89113 -131358 -9256 -48977 -184450 -263891 96826 -225141
21456 -586666 -317273 -284592 -342929 -232207 -131868 -165790 -62019 -17787 -362032 -287626 22684
21444 -122571 33180 -64226 193645 -102864 9557 36071 222875 111289 490729 630823
21434 630823 207569 398269 238003 -142411 267334 222472 103346 -70316 -20560 69807
21423 -134547 -134257 -104732 -185824 -319656 -166348 -65286 33157 -132590 630343 -250072 -42817
21411 -90016 140587 189553 -111134 10455 97047 -106211 123246 -101488 -77029 -212373
21401 -212373 -39924 -176275 -373146 -139369 -150052 -79167 -423631 53634 -31012 85552 227146
21390 227146 115688 -94780 -303015 -148351 -1429 -79205 14452 66556 -58218 -133599 95672
21378 -68562 -155297 -286505 106840 -161985 -285762 62675 33100 175060 -9463 -217964 -279324
21367 -279324 76439 -89861 -66784 -177164 -94838 -24503 -273384 23802 198775 -328930 -98125
21355 -168499 -115435 107367 -87003 94325 -18353 -139035 -129158 368645 -123053 -16299 -26952
21344 -26952 8867 -323242 13292 8360 -68888 -285573 -92945 -47788 -201116 -136330 -283849
21333 -283849 -234587 1768 -23600 106321 -14794 -158990 11055 -225861 -44088 139292 -16867
21321 148327 -72805 80925 -53827 168305 -52340 -301137 -89108 167410 77502 -221108 -336124
21310 -336124 -204926 -62172 97922 -74370 139451 -114512 -77979 -238647 -292219 12426 -2808
21298 -77533 -127063 -96343 -331641 -36080 -14105 50761 -180743 45873 -72065 -210687 -195237
21287 -195237 -57686 126673 64200 23866 -179849 -84746 -52804 -237296 -95205 -155930 -35495
21275 -215851 -287632 -287844 17839 47876 283309 -221191 157404 64550 -184843 -211064 281188
21263 -201211 85787 -215879 265432 -60361 -188531 208025 203331 -32670 -54162 -177470 33999
21251 -9776 137462 -130388 -62295 -14553 -139949 -75098 144488 -139876 -293070 -247915 -552743
21240 -552743 -6032 -132880 -232047 -347307 -348529 -105532 46230 -22646 -88430 -125952 -190017
21229 -190017 135293 29710 -10682 148948 -260827 -392970 -63120 299640 -270801 -194157
21219 -194157 -355145 280172 -285577 -276693 -346124 -170070 -37074 -436344 64724 115302 254908
21208 254908 -560328 -151188 176133 65528 -201206 -171465 -398708 -164125 -15794 183804
21197 33133 -29451 -213513 -27293 -28627 -34974 -221262 -344393 -333492 -38511 -100964 95143
21185 115024 -11834 28118 376767 -198273 38562 53975 89399 -151700 138070 38137 65000
21174 65000 133961 437054 181074 51483 177204 -38612 -359096 -9981 -47710 85324 35034
21162 -131274 -161000 -177025 15760 -323293 53042 -198780 -7446 35878 -59316 235880 71759
21150 95898 37255 -38622 -280867 -61677 -117014 -265011 20453 -80118 104342 -11609 135211
21138 49336 -70862 -347410 34385 70824 -327589 100305 -171568 69998 -171193 -179208 -31355
21126 -201217 -147864 441410 43815 -301680 -128767 -119216 155732 -93890 -265884 -350089 55952
21114 51157 -107727 203142 19015 -174284 29694 -248657 -107738 -27554 191061 285681
21104 285681 63758 169878 -407854 -121430 132203 -11895 -116699 -37903 15226 -272702
21093 -219823 186944 -72102 47211 -508988 -111577 -60250 21205 -124469 -131409 -100553 95279
21081 6139 -79104 -6215 203388 75213 -373098 128767 64703 122688 -169400 160934 247053
21070 247053 120212 298903 -100023 65676 95057 -37683 -133289 -39889 128856 -93194 130479
21058 -50605 56940 119195 -96117 -226252 126802 -171912 -81814 131517 -188077 -152491 -82949
21047 -82949 -112363 -19755 51355 -407 -206990 -313026 -83495 10284 403413 -270718 -184248
21036 -184248 207833 164505 -104853 56987 16974 18636 140360 197130 -283290 -355618 -97051
21024 345162 307175 -486751 -52107 417006 307933 -81260 -302166 -419931 -306569 -216488
21014 -216488 -152806 77696 197427 279243 47932 146802 492686 17070 391451 615575 543828
21003 543828 149272 202182 66535 -167973 256155 30589 145418 33753 -195576 111318
20992 -262739 -146600 5472 58695 224741 -233119 72433 58650 20288 -62004 -324073 258370
20980 2419 104980 -129805 6071 -22384 29786 403095 -258954 24509 89607 -276223 85137
20968 70338 355091 105541 -106097 -276601 -147885 14926 30421 184742 200615 -370237
20957 -60182 -20327 -136353 -52502 -186640 216150 -111664 -23917 -137580 -99856 -153767 198878
20945 -439793 193464 169493 537255 387522 277899 129276 62056 422080 -316532 -34241
20934 -237305 221669 -113164 -435046 217104 -94512 -287334 -272174 -26106 -306410 -84364
20923 -144761 -226009 -343330 -352360 168688 -122400 71056 -193473 -204041 -84504 122966 -329873
20911 97683 -216603 106219 -192279 215998 -152414 -310061 3395 -458500 -163579 -509873
20901 -509873 -131712 85911 224084 -70447 -346221 -355860 -250161 -76533 103473 -85836 134404
20889 31177 167140 98722 -146458 -105442 -264195 -87348 67471 -145159 -180603 30095 80983
20878 80983 -511784 -186738 100602 -294350 104389 -21068 -43512 173946 -194407 -6442
20867 -159817 -193392 247888 1169 -182730 -78541 -211115 -3136 -132853 -184999 -115621 -374227
20856 -374227 22616 -250082 74949 -31954 -212183 132375 -142746 45001 -168857 -474213
20846 -474213 -564014 -243841 -279294 171491 -159354 96076 10035 134490 93550 -99047 89294
20834 245930 -55902 -178927 -348370 117344 65251 -33639 -149898 -48108 200505 105673
20824 105673 236154 137256 62974 -56174 -14201 -924 206879 54349 -210329 -191257 -203923
20813 -203923 -95867 147958 -31648 85658 -3503 205183 -117756 -40419 15561 84033 -74361
20801 -171608 -230449 226421 96778 -79585 270408 -206795 162869 23953 -135795 132075
20790 -239538 -34052 -147782 46105 -127166 20058 -216978 -66461 -256184 -10021 -53373 -879
20778 11805 104679 -169555 -148814 -16833 4530 -7913 29104 -284727 -92279 -351030 -5814 84160
20765 -123584 162945 -4434 -150303 171835 -140195 -50094 257237 197782 371662 163235
20754 -126600 96526 298480 18199 -116915 -143289 -11698 -39478 -477022 -89476 -32093 73145
20742 200877 257181 -16889 -5601 -81228 -119043 -508560 -317459 -208631 121401 -143572 -356659
20731 -356659 134104 -165551 -133491 -398735 -328531 -242198 19101 178420 -192723 126328
20720 -31332 -195858 110940 133371 -220580 -177921 -188470 -179062 27965 -24950 46690 -168201
20708 -472156 -448695 264913 -109583 -138981 -146210 -25117 -438995 -184146 -323375 204352
20697 -404596 -37684 -47599 -40843 1618 -270161 -131189 -13941 -392563 -193842 150787 -172993
20685 3285 153680 -191805 -159724 85117 53619 -126000 -156729 202899 100190 -31103 -165722
20674 -165722 306762 -72396 264962 166358 11119 -164135 71065 -226932 -219306 14756 -80837
20662 -101870 -92866 -256753 -88787 -118758 274460 -156695 -82141 -139273 13646 -59926 -270416
20651 -270416 -215928 -147344 23863 3063 -30805 19397 -138160 -265815 -20610 -297608 65089
20639 -384054 -136196 -214449 -32460 -45776 146130 -300002 -65545 -59794 57227 -63473 141394
20627 234851 -179564 -148653 -89396 278816 -134909 16362 22517 -45392 -213604 -35477 84263
20615 -337812 -41342 -82592 244239 -17775 -187727 -185453 -51656 30892 -182119 -239488 -219097
20604 -219097 -362884 -113769 -30696 -15259 -141947 12354 160086 -162483 -9085 248519
20593 160130 -99227 116651 -78016 -44036 -228208 -8179 52158 179346 81855 -147783 -85636
20582 -85636 -90310 8760 20584 312517 -201148 133887 192461 -159205 107578 -263916 -227807
20571 -227807 -234898 84052 -276955 86264 100386 24515 -8111 -262075 -98649 -206256 10556
20559 -76516 -271119 -1494 -167934 -68409 -263039 -22643 -404051 14639 -226983 -65201 -190825
20548 -190825 -377238 -156277 -17977 173374 169161 -28933 -73321 -256291 -52299 -117761 -29600
20536 163507 -88408 1717 -19834 -150856 -26108 39765 -19729 -280027 -162676 275131 -270113
20524 -91190 -129605 -140417 -134721 -153485 8884 -414333 163873 316467 -171699 134774 -214082
20512 -116389 -160151 -165861 36772 -102934 -154030 -149140 -412049 202095 62527 -234031 81749
20500 -131150 -364564 7053 133612 -102826 28000 -157981 545357 47442 -178308 -1397 50342
20488 174486 317504 -58027 -147940 75713 -12837 -277846 164188 127690 240621 -233502
20477 126783 -131683 289581 14714 -30369 -19518 80345 -151288 -160091 -285432 81385 18619
20465 -69587 110033 -152800 -72622 -156438 -125654 -175355 -196302 -79462 -114898 -1776 42513
20453 -36084 219300 -202507 222948 -189562 32328 -117160 99781 -8738 -253578 -27997 -290422
20442 -290422 75999 46127 93174 -405544 -200221 3021 -119605 -176480 -18292 -64301 -35537
20431 -35537 -123808 -390129 203041 -65486 127405 41157 37303 212209 -18576 -125576 -143859
20420 -143859 -161443 -250884 161827 -137974 65971 -9706 -400810 -202101 -112546 -63292 94511
20408 230345 -2753 -180413 -117773 1498 -229367 -67506 218100 -81698 -6106 -329590 -107035
20396 -112703 -216704 -48237 -86248 -98773 80038 -81032 90206 -117993 -634484 -98841 81698
20384 -289094 -251478 -49707 -47807 24556 -173685 31369 5228 -264113 -160225 -174798 426498
20372 -14683 -75260 -233057 -454018 -43593 -77909 -110892 -10662 84217 -55561 -307304 79862
20360 -237098 2327 484336 92360 -156415 -91198 -25971 -25104 171979 72678 -60474 -179211
20349 -179211 156581 38479 73014 -455001 -219098 -99570 -151784 213141 8855 43368 -134360
20337 -143743 76353 -120730 156494 -327122 -66415 -85687 -32480 301068 -521890 -357243
20327 -357243 -103529 -338525 -179675 68978 -157275 -81053 -166322 -334522 -137311 224791
20316 -140024 249432 -112284 -11321 -398656 -222366 29785 -128581 -138580 17221 -140657
20305 276656 521969 -199363 -281627 -160794 82905 -4717 155845 -127976 -121216 367605 49673
20293 20115 -182245 -101288 -140866 -98013 -205941 177363 106792 186987 -106398 -223898 -8153
20281 -49536 -271158 -33306 -228047 28450 -71801 8946 250223 -76414 -239001 247782 158724
20270 158724 -401956 86466 46498 -209694 77 163859 122994 -151066 -177584 -362070 -281506
20259 -281506 -236188 -227751 -21428 -256110 50084 -161816 -49151 -35616 -147071 -132097 265096
20247 -170713 -225185 -151418 -162110 -237131 88613 -106854 -234103 -67147 130135 257491 22071
20235 -28657 -6521 -53524 -92373 -122461 -131530 98343 -73536 -43950 72671 -113535 -553846 -84839
20222 97283 35950 190776 -113766 -288826 -104945 -240603 227453 -452947 -373157 -213366
20212 -213366 -198448 -48753 -112381 -61424 61410 -270514 -361905 -341372 -75686 80017 143374
20201 143374 -109032 208224 -84720 116436 151338 -99970 98013 -67757 -283577 -174699
20191 -174699 147694 -224154 -173381 -56519 243398 25746 18361 -226661 -220888 83911 180333
20180 180333 16463 -232903 146129 192440 -327032 -74093 215465 40886 157084 67709
20169 178670 121067 180716 -220637 -348648 116980 -127114 -145233 -65133 -257140 -26618
20158 -161534 -71026 98957 101792 221545 366906 -284405 4361 -56188 117750 76065 159933
20147 159933 472236 452728 415493 553537 218254 65716 188471 50821 627287 602601
20137 602601 527059 313152 -40093 -89463 -209499 52596 169083 -101484 254728 -115454
20126 -276359 194324 -194558 20188 -144921 -195391 -181780 -265348 284650 102437 153942
20116 153942 -400071 -28859 65668 -143590 -106466 -24416 -62426 160575 186083 20686 252643
20105 252643 118221 -148241 -171193 97720 -362582 -159393 -445682 -143298 -175442 -67208
20094 166955 47868 -149427 271424 -42607 -256823 345134 -38564 37385 -117253 -33609
20083 155260 -123823 -9933 -107423 -241970 -97987 -36614 -150756 -133187 -228977 180723 -391864
20071 -138606 263944 -275076 -8931 -175045 -103538 -80854 -149984 -162350 -194301 145143 -34592
20059 341606 -79544 54766 -33243 -300453 -17001 -223404 -116020 -145686 -85074 -262311 103968
20047 -161897 -85015 -52782 53995 -183983 -59581 -4345 -128364 80926 -115793 -98512 -13320
20035 81315 -116437 -99380 -34693 -194482 -39679 -141154 84597 -407429 131090 61068 161038
20024 161038 164444 25012 -209044 -90006 -36618 -226926 -45027 -33969 210593 -234014 29687
20012 -305669 164385 141537 -204960 -150515 -121143 193626 -220542 -221674 -273010 89188 -10280
20000 61430 -62404 104570 248947 -31313 271549 346545 406453 -27280 416258 -93645 335504
19988 -54279 215008 99844 174576 74637 218240 45435 -91099 -182713 46236 -17028 -178097
19977 -178097 108694 -54750 -188548 -177925 85725 -126592 196383 -52754 91551 -64370 98366
19965 5092 47166 212314 490203 25031 74463 -26013 -59117 -146976 7453 122849 -167407
19953 -14520 202295 62578 399249 188570 152559 -69787 -14663 141470 -46288 -18357 1878
19941 203883 -285485 -76327 204700 1784 31036 -197410 79390 62018 -59752 -269930 -189818
19930 -189818 19949 -30608 -72113 -112584 154297 -53662 -245860 -239249 94453 127759 -144695
19918 -138636 35368 -305755 -24047 -64017 62735 -271649 112243 141311 -231676 34858 -118952
19906 198718 -220535 90883 -203636 -189980 125820 17273 -290827 -88807 -22504 -16532 81833
19894 -179279 74779 -118666 -135147 67018 128166 -158034 -63070 -145906 152959 153504 -75668
19882 249622 -19728 275922 125204 -269412 57779 -135472 -134153 -89442 -232255 -431935
19872 -431935 -3926 -65710 -136421 235005 91141 -4062 -365538 191080 136777 -185385 -174691
19861 -174691 71190 -121874 146012 -211596 -123113 -112136 -134347 -124942 -255795 4472 -22708
19849 -189666 170656 -142864 4932 -216716 -214296 -91293 -35530 -24451 -215982 19480 -296020
19837 178505 -411656 -105305 33154 -60472 -12465 182557 -49178 58921 127571 81554 -74865
19825 -275782 70131 -16943 9133 -22701 -33592 -265165 -82155 32341 34698 287055 -3704 -80903
19813 -80903 -28337 -75431 -75795 -162898 -303831 -231931 -192748 -24861 -171973 -185055 -21234 -349924
19801 -349924 317596 -82688 19022 -117099 55921 54840 -121005 -103821 -379180 -52876 102326
19789 205987 19549 -39312 12235 -201569 -172864 37976 -167014 -21715 185225 -226502 -287378
19778 -287378 -154114 -123799 -37309 -79441 -260456 -264501 110336 -501297 142711 -10423 26375
19766 -147161 -229903 -95283 -185994 -244526 29281 86046 -207245 -157887 -303331 -141284 51284
19754 -230395 -374090 -40341 -133112 19197 125044 -80068 -24124 152590 -264764 -81543 122983
19742 166374 -243103 -181108 150812 38886 115128 -47231 85324 -132358 95999 -86096 248332
19730 80852 355901 600927 567472 212499 141117 326246 205010 75961 -190623 143214
19719 -172264 -236441 99919 -94825 94044 207317 -179897 -57647 196522 194893 -118581 -174463
19708 -174463 115141 373631 -22110 16405 -144439 248537 -56543 24510 164756 21228
19697 205319 121119 466987 307606 251164 340843 74667 68971 -192289 -92870 -25711 -5804
19685 -27568 -15388 -91790 -22271 145722 -178443 -147042 -15528 -136868 -310069 -48057 -193085
19674 -193085 158134 51918 -14781 -470490 75917 56926 135885 -35725 -82356 6248 -129062
19662 182647 19721 354370 35664 219111 -14881 -267291 -114510 -79344 -24886 -132694
19652 -132694 77375 -384387 -21785 -235060 -118678 -153927 -176850 -326041 -346804 -161339
19641 42663 119042 -288819 -391921 -145428 257472 -97332 -109938 -89407 43299 -120162 -4694
19629 292063 226125 -147740 -38410 -105004 -30230 -84472 -314306 64612 -129483 122857 109602
19618 109602 157828 15794 -183181 -246077 -260972 27209 -96354 -112898 -81360 -470106 -188962
19606 37735 -20892 -33764 -315403 248430 -121610 -201420 -106185 -9210 -106090 -165146 116429
19594 -68305 67560 -200108 185306 -211051 -3092 -168856 -109554 -200707 -26758 -59630 325924
19582 -55013 -150838 -545290 -347875 -137882 -121652 -163145 -101529 -253598 117726 -129842
19571 313004 52774 12402 114335 -229227 -109608 -229638 -143238 -99551 -452349 -389453
19561 -389453 112988 -202223 215157 14479 -57868 21804 -173732 216133 31257 -43902
19550 -120576 -178254 146414 -18911 247065 -199120 -120771 -166593 109205 -220766 -267331
19540 -267331 170212 -253012 -193012 91489 118700 7527 69579 22704 132562 103969 -26859
19528 -89113 53096 -161755 65531 -156812 -165916 -67762 37362 8988 -100272 -196111 -133324
19517 -133324 -19717 -43111 -251274 -372365 -69812 -295007 59775 -79025 3799 -110691 4765
19505 -78754 -236562 70406 -267593 -258453 8556 137930 -237443 -70729 223146 85169 -165965
19493 179264 249434 -151820 -156394 33481 28477 -333721 165215 -82931 -60826 -122102 37377
19481 -46653 227527 -157850 -104634 -311483 -58526 149124 170562 -101079 -206717 -37867
19470 -232048 -103398 63770 -37247 179288 -4345 -107852 63822 -87736 49001 -280268 -448889
19459 -448889 -13018 48100 251216 -117290 -234553 68176 -233551 -234616 -146392 60006 -329591
19447 -172731 -227997 175632 -96390 -123961 -182144 -60538 544 -257653 -94031 14644 -315350
19435 -84732 -19882 -414467 -118782 159692 -84842 -176190 -153391 106573 -153562 -314369
19425 -314369 67377 98617 -243747 -167024 216405 -21382 37967 -230131 88326 301274 192291
19414 192291 -263058 136201 -4619 -219335 -131319 253609 184825 96955 64544 -405524 -298254
19403 -298254 -84078 241019 -66975 -283889 -64214 363023 -188084 -12198 131818 -232734
19392 113485 119606 -174674 608 -351463 -248056 -73240 109195 -269430 -68132 -122176 59821
19380 -162851 307918 -124366 -162485 92723 109017 69963 -98608 69143 -156103 66137 -57677
19368 -254728 248594 -173895 -100451 -281520 -16038 -66875 247960 85005 -39531 -41471 75817
19356 -49295 -18151 -203484 19074 -217202 -250379 -52043 70054 -286748 -208434 -156255 -149087
19345 -149087 -8938 -178676 -34004 25704 -167469 -278513 -12468 131449 261326 -77357 66176
19333 -389881 17398 93962 166981 91234 174170 -48087 -96497 -418433 -372918 -117712 12816
19321 -9814 49372 -401947 53128 -125735 227058 -33333 -205241 157218 -76432 -30523 -99074
19310 -99074 42328 -222828 30272 120565 185286 -39680 -22805 6921 -101167 73729 242115
19299 242115 -350077 52400 -329423 -116388 -337604 -215938 -30562 86563 -391962 -414358
19289 -414358 173047 -20553 -56001 -239400 -177622 -237298 9858 -257238 -349867 214561 -341947
19277 -265762 -131282 20517 114520 96929 -40517 -7270 -492981 -204894 25212 216089 -185075
19265 -176770 51623 -70297 -259902 120983 -191057 75672 -125966 -226128 -49284 -379206
19255 -379206 -186867 85286 90361 140545 -103858 -325676 202893 -341115 133982 87510
19245 87510 -55416 -45768 -110530 -146961 -313535 -403509 4200 -125117 -167163 -218183 -153933 -113385
19233 -113385 164665 -112261 -336000 -158133 74803 81476 74426 -60609 -45405 243850 46059
19221 -6697 -32971 -116040 -152317 164764 98172 35684 -157554 -294432 -171740 -477231 -98475
19209 -38294 -53991 304475 -126724 -82452 -170919 -276531 -194600 195506 -190228 37802 -206236
19197 -210083 -175763 43432 -123676 123629 -58172 -210432 118820 -81032 127201 81417
19187 81417 169271 42509 -209500 89456 -184694 -464339 -30275 -362590 117275 -193092
19176 15808 -146499 26882 56057 -106365 -262717 87625 -28984 -171723 384827 -206929
19165 53043 151712 18790 102559 88767 -26262 -264843 -29306 5025 -217089 -82519 58657
19153 -321610 64649 136541 -189227 7046 28224 -60240 128853 64408 -120779 -470235 -127352
19141 315353 67340 -130970 175686 123274 -71842 191308 57939 37512 149172 107853 -276501
19129 8606 -215537 -293794 -60236 -116031 176178 -124706 -170847 -136322 -174419 -102051 -177476
19118 -177476 -279591 -105663 -229509 201664 -479646 -25044 -168346 182920 103881 -302233
19107 -62105 -164924 106586 -84960 -150097 97266 -170976 -161810 117859 26799 134506 -19235
19095 -126214 -51435 -161317 -190003 16458 -435443 -277031 81823 9449 188322 -167873 -74984
19083 -196208 -160476 -395360 -237790 -193838 -194230 -138391 -127468 -175301 92227 112471 -55860
19071 -232755 145609 -113643 -117792 -62950 44523 -224126 262302 -111710 -353087 -185215
19061 -185215 55103 -80179 321249 -51196 -42828 -305650 49551 169274 -171767 -321127 -162152
19050 -162152 -98218 95942 -236174 190528 58794 15866 -278072 -97000 -72529 -150373 -113778
19039 -113778 178813 101350 -5477 -36567 25136 -219255 -37058 -26410 119920 301 236176
19028 236176 -181835 -395545 -145569 -161442 4065 -573020 -125903 -20021 97018 16373 -159379
19016 55424 227722 11 -278110 -137231 -39850 -293418 -118928 -312451 210153 260391 -9336
19004 94686 191707 39705 -42961 251023 -13996 196130 40129 -71782 -198622 122041 -83028
18992 -156394 -187333 -85860 -111907 -469903 -2549 -317314 -254940 -294828 -205812 -304056 -11788
18980 49967 9664 -310597 219196 -55247 13493 -37985 245365 215213 110432 323396 652526
18969 652526 398392 341865 -11947 176725 182402 -303331 210870 -63661 72385 -204649 94691
18957 -9888 -199380 210022 12785 -202834 -151842 -137400 -70976 -174101 18357 -160918 -46855
18945 272376 -222458 -115277 -377667 -271913 17745 -133120 -26435 248676 241973 112590
18934 -170601 -104152 211806 -215321 -200919 -227335 150196 -168044 319208 -10382 -71440
18924 -71440 55551 125029 77621 395974 -160711 -451315 -33037 184322 85140 103418 -9978
18912 -23688 133501 -186813 -21369 214609 327707 289820 859945 86022 141765 -326997
18901 43095 -82134 -113660 -232815 53346 144317 70330 -150613 -165239 -13369 325111 -157263
18889 9043 66273 -200794 132071 105926 -231175 -237004 119389 -106623 -119999 -247444 -67929
18877 -123165 -152501 -32212 26275 -14459 96267 -66702 -524700 -32702 -207345 -38100 -272752
18866 -272752 -30479 26646 -32623 -47605 -86441 59358 357214 -137181 25880 19847 -118342
18854 -78883 -110837 190611 -135423 28932 57014 -15576 -101434 -183619 -32265 87906 69153
18843 69153 -16216 70623 -24920 -15455 68730 -92891 9765 -72429 -169890 80077 216393 138654
18831 138654 -235650 -293205 -96706 -82795 -136359 41433 -103757 -44804 -4479 -141833 -4346
18819 -168924 -5310 -247133 35352 -1590 229315 -125494 100055 -60484 -44426 123046 188473
18808 188473 -949 193638 213565 123165 -17145 111256 -77801 -201145 245083 214987 -295930
18796 -99082 -45393 -42093 92137 -100687 -225386 137965 -27440 -237896 -307720 -2286 118306
18784 180119 -49703 -170015 -122481 -63973 -137606 -181031 248612 -214606 -2597 -301943 -312706
18773 -312706 100640 -93017 -145170 -110281 -101845 -182481 -261256 137468 -333825 -149946 81384
18761 -175009 83615 -86888 6493 222357 -126502 -77069 -196584 -85012 25411 169652 175668
18750 175668 -94493 3856 14752 70911 68735 -68261 -318885 -107531 256232 3583 -119953
18738 107413 -15655 68875 71592 -218572 -52910 -125858 144192 44683 51704 88338 47640
18727 47640 75574 138174 199334 -60660 263520 -280110 -130798 108302 -587775 -100962
18716 -316857 112744 -6553 82957 18310 171517 25966 65534 -87413 255923 -15481 -1647
18704 -5440 -337958 -236305 -90722 -175163 -307493 124086 262642 -28596 31357 3223 383123
18693 383123 44430 -287110 52110 -68678 -44355 171138 -110498 38869 -186015 42256 -154137
18681 -43073 -145355 -239324 -156695 -98279 -261440 -154879 -9943 -558793 144765 -67081 195352
18669 -126100 193799 -145969 54518 -268923 -285536 -6133 -134504 -261563 -32190 94921 -304141
18657 93307 53475 -28674 -235062 -236763 -84714 72219 397322 -232777 -87490 -433534 -205414
18645 -58645 -112346 -103635 -33149 -127415 -171471 -73183 -66889 -6948 -87353 -562 254919 119371
18632 66690 117831 -158424 43303 -312583 -1597 -191658 152409 77672 -62792 202087 52188
18620 -245409 57851 15146 -252782 -70432 -85150 -59709 82382 15675 -13993 -87180 -141540
18609 -141540 -484223 -296141 -137613 201115 216675 -151473 -296248 -37605 -193857 145726
18598 94937 -48143 70668 -326243 -9227 13649 142843 -248337 -253237 -392683 -35157 7025
18586 117372 -89054 -67692 -235543 -154709 -224880 168022 -104213 -301105 -248005 -121929
18575 2369 -78509 -131268 122850 -67537 68936 11161 -280431 -53575 163901 118150 -275720
18563 307855 -226313 -101758 -169108 -216329 112990 81715 114350 -69507 -334500 -314292 -98808
18551 -231079 -94396 -154219 232651 11587 -32230 -319702 -167903 -80308 -85302 39353 -241649
18539 -172936 -173797 -418632 -216044 -249766 201785 -132353 -206051 -18075 -7219 -132080 33136
18527 -82011 -170649 116509 198063 -103013 94053 -234477 -118304 62528 -248275 95574 -44446
18515 -187137 85809 -359307 -283050 -8455 -171502 129328 -71897 -31924 -23386 173536 189401
18504 189401 -328648 -445926 82446 81343 164503 -86493 -39556 -215653 -53729 -11105 326044
18492 78963 68513 -128778 8466 134602 115237 -25943 -161783 -7797 -155021 -146973 111374
18480 -218882 -27210 -119957 -18085 -137471 61917 -9739 -255933 -436384 12908 -261549 68889
18468 -198040 13030 -94042 -243369 239317 -136048 135508 -356311 114969 -354986 -259002
18458 -259002 -220470 -19155 41972 63687 -293911 59654 -34384 118916 -88723 50001 -142294
18446 -502 -6625 -121747 -38743 -74586 131536 -537802 4065 -28194 27943 75175 -58096 -323322
18434 -323322 269776 256469 63543 120846 164417 13369 187233 -78431 -121000 -2172 -127195
18423 -127195 -158599 -40854 -35918 -108973 -170959 -32723 -97708 272185 115673 40446 61570
18412 61570 60701 289786 101041 -91170 17232 36139 86497 8930 157024 -19808 -253367
18401 -253367 -286249 15793 -132304 -112955 28556 112861 32562 32136 -120332 -69883 -32097
18389 54461 69664 -67500 214592 -219395 173825 -101127 -96086 30376 220145 -77510 338220
18377 340749 -277278 -84013 -331741 -32697 -9253 -191128 -356526 -268968 165672 115648 38538
18365 -278378 -109983 -180594 -385536 89333 115209 -573 249053 -1517 143631 118187 388210
18354 388210 -43266 -91479 27530 172320 -59332 -165503 -111587 260570 97252 -469367 109479
18342 -27573 -108905 -278680 -18790 -229134 -161102 -20527 -204515 269608 -270175 168658
18331 110332 -315043 56046 -72427 106853 -216817 87115 150310 -297825 -312726 -71197 -136328
18320 -136328 188450 -124236 -86944 -155082 -360395 93118 -30741 -17580 -43755 200438 364918
18309 364918 -109672 112053 422111 -22995 -306013 -372004 -27000 -109227 -264289 -88936
18298 -170658 -151102 -145696 -260407 -210489 214467 -241115 232951 -153749 -166548 -52675 -67917
18287 -67917 39441 9636 -350253 122670 -73668 -7048 205449 -245969 122628 -1645 61316
18275 -205708 -35606 -90812 238806 10283 -327994 44368 -215441 366756 -133144 -124104 -68628
18264 -68628 -16491 123257 -367832 29263 187116 126443 -141499 -186199 69278 27288 75814
18253 75814 8780 -199148 22469 31990 -302227 -152596 -98577 -99252 -190155 -154484 -308635 -334554
18241 -334554 -48842 -347458 1482 -38233 140688 -168084 101374 -234557 189276 -404 -979
18230 -979 242517 46755 -126142 -286023 -207834 200000 -22250 237606 -316481 115482 18707
18218 215477 -139788 -160204 -139537 91570 176731 73628 122417 -199111 -155324 81387 -156006
18206 -167400 -20108 -82914 278605 262489 157668 3862 107933 -132825 169291 75612 -155786
18194 -90616 -27231 -90734 52159 53714 -15397 -8544 -28164 220341 61545 -341670 -361241 32850
18181 -97708 -83933 -124293 -15914 225891 -279642 159365 -313598 224588 -99239 253778
18170 -5270 -49675 47246 231859 -369829 -128955 -105965 26795 109389 69297 -254950 167080
18158 55857 -214698 -135578 -37259 -16913 -402319 289319 -399407 -65677 -288512 -88074 158
18146 -43291 200761 15404 108832 64931 -19387 -26017 -32151 -38246 222972 232573 208708 -73146
18133 -52745 -78784 -170070 57899 9258 -309750 -135914 186948 138264 -91525 -286131 -179388
18122 -179388 -31135 -258344 223371 156094 38386 76221 -164506 -256234 263770 264878 -143599
18110 -100606 -55601 -89911 133021 32033 -62055 -168153 113449 -102677 -40446 -148571
18100 -148571 -269823 15215 112741 162050 25705 -135428 167898 -109402 -124953 -72656 -41283
18089 -41283 -40369 -81372 182038 134336 -124282 -396878 140650 13663 -53959 125684 -30596
18077 -65508 36048 -162648 -223589 -109545 228381 -253197 867 -433790 -141673 231112 94066
18065 -106033 174477 243698 -179875 16187 -223178 -265158 -253748 35957 20475 237984 -224168
18053 -290207 11539 -122790 211390 -87007 -222127 -232096 137467 170142 137798 -253718 -256843
18042 -256843 -100309 258486 -29545 -203548 57408 -93049 162060 157605 159648 224634 214663
18031 214663 -187172 -285776 -77378 -21071 -23381 124207 -235604 -156838 -22744 -24396 21531
18019 -191214 -17792 112414 -149004 -230149 -61440 582810 188994 209488 159944 -35900 -231651
18008 -231651 -98911 -444300 -70358 29856 167107 -222238 -87929 225737 -279136 -65694
17997 183031 485032 -197506 180984 99569 197932 13332 -48865 163855 14181 -193445
17986 134926 -145474 276533 -52806 220202 120127 -226630 -132943 258527 60939 273960
17976 273960 167469 -132781 -175968 285465 -272721 -119298 35578 339071 -134883 26758
17965 -120925 -155234 -383 -46228 11621 9342 45554 94066 -67021 377068 -19537 197912 84789
17952 236395 71331 156726 -127917 168869 -113495 -55972 -62565 -108130 63638 126894 -325973
17940 -169495 -263015 -259028 145812 -229714 -54165 462658 248151 -102333 366320 -229684
17929 -186657 100828 266677 -72476 -99898 -148451 188006 -80288 31939 197772 -4072 37568
17917 138265 -117386 229462 172070 104108 -11729 -88187 -322568 72776 148139 -1776 59634
17905 -263898 -15797 -133995 -232061 -133110 -179390 86948 -38627 68816 -71077 -79880 -103635
17894 -103635 -119308 -92385 -43937 189517 -121681 -36854 -93375 332792 17008 -72456 133546
17882 232286 -384488 -239116 246960 -137322 196339 83748 -69899 -26264 104994 -70722
17871 -3368 51940 162935 73760 10708 13767 -35366 -61665 -124237 270283 98983 -287508
17859 460079 93041 188062 8181 3591 -120570 -196986 -225069 2720 -149280 -148526 83871 297693
17847 297693 -443085 -30855 272415 -288097 178271 9293 -315661 202710 22888 -178728
17836 -120293 219166 45603 335840 -134675 113271 76574 264754 145831 1814 -76406
17825 105763 55811 142305 33607 269630 183822 37583 -135081 -28679 194279 32727 6499
17813 3933 22006 225241 120995 84566 205079 83659 -74433 -112446 226387 39483 -177536
17801 91442 240281 -61300 25086 102382 -45683 203807 -838 -333903 69341 314270 242243
17790 242243 297298 -120240 35692 -109372 -304904 108637 16758 290982 -141740 -148564
17780 -148564 13422 228836 12315 -272098 -51046 -93797 88396 -122005 19405 -57381 1568
17768 -31892 -88873 -71818 -80542 16476 -297747 238346 -264420 196409 152487 183612 -75347
17756 -81393 -24910 -33755 150995 243440 409503 -25824 299326 142912 216347 -77238 14999
17744 640768 182617 49111 -11631 278468 -199303 416257 -78787 -54539 207088 183414
17734 183414 248881 90958 -117856 138697 -125713 19553 -17344 -53681 284300 37847 -148538
17722 156247 102459 244616 -25707 342083 5418 117136 301 355266 -13021 148725 65643
17710 83738 -240598 9261 295337 -129609 46086 185312 -141914 -51414 -106220 -110909 80003
17698 243300 279635 212805 163781 11465 -211224 92937 19518 -277465 25954 169531 15194
17686 173935 36664 282299 -70895 405866 179524 -92322 -114441 -38339 -64784 244211 91548
17674 84480 124683 -18677 57300 -106698 -78028 48047 65879 175571 136136 159812 -44095
17662 271733 -88456 -38697 36074 -190799 144706 28081 165395 112244 56909 -109425 277599
17650 -107950 196004 166760 384527 129564 -68996 -230965 110323 -2421 43889 -316635
17639 317766 308035 130417 133396 -29098 -10092 431195 265664 166200 96141 -304022 102131
17627 -722 200509 -14446 -4213 -184801 208755 116954 268610 188311 89690 147497 202532
17616 202532 -41166 599957 304864 79091 -199789 120309 89135 157372 56655 -131232
17605 82414 -29739 -83083 -175796 241034 198538 165952 -71493 -47792 187185 202156 201757 146782
17593 146782 -23731 104912 122407 236813 211814 213596 192706 -16767 252073 -255459 -108694
17581 -122490 -46823 358393 -96113 145618 138172 261434 368064 -67032 373386 126939
17570 115103 -82396 -162633 368430 114313 229133 -71450 60729 155437 10244 89110 3869
17558 271785 217631 -13032 -140966 230721 351509 73059 374082 347813 421930 146378
17547 71758 236480 121004 134370 341923 623087 343901 233513 240767 590134 251257
17536 602315 189717 156682 -104301 499259 413330 167315 105342 33493 604747 893293
17526 893293 868429 877393 924115 1173732 984705 788804 591985 442195 564014 337473
17516 337473 683172 83741 556164 355400 517716 586733 1058824 688986 1046233 851715
17506 851715 420484 470491 436105 332158 568844 -129852 215018 213150 494391 289438
17496 289438 431747 160138 4284 517194 169822 247816 81049 309892 197795 262658
17486 262658 482045 284732 97779 486175 562795 314064 317651 445961 272971 237656
17476 237656 -38078 498358 269947 91967 549491 505971 241755 353364 272111 115075
17465 204063 72650 549774 417227 169809 209454 136163 -54793 514124 483868 138562
17454 426271 368188 216701 207735 174046 412407 25778 483475 416315 513940 553811 348481
17443 348481 243170 130247 347272 565221 295640 483090 349434 438271 661090 156001
17432 339473 224878 491247 119309 362933 337481 208142 438237 296776 440599 107998
17421 315494 429843 382560 256328 169425 545049 365007 518223 193419 482200 435916
17411 435916 498146 323181 171380 120967 227806 530686 170159 27360 56837 609093
17401 609093 123055 371557 -126213 168837 231369 47227 324165 137286 3610 384314
17391 384314 101704 198483 357643 105320 173734 282833 214781 420061 505091 111221
17380 284952 441040 296622 436024 -62991 507962 168731 291334 123462 471832 264552
17370 264552 568719 303681 159463 466358 342062 298524 -185719 224641 359443 134034
17359 559665 295806 168354 105987 286993 -122153 256460 33287 51237 190724 256242
17349 256242 464465 274309 279019 296941 340239 -6890 -84035 431232 110282 447554 130604
17337 373574 84503 274089 477003 292995 445937 172900 60667 252034 293089 128012
17326 343443 384734 131785 630494 174168 573449 -31020 328428 157415 413562 261301
17316 261301 344824 200049 317956 423870 62231 545698 302623 221885 175840 382098
17306 382098 -311626 294933 271078 194373 247354 535089 -18204 -12615 63784 500332 318213
17295 318213 178696 342177 166148 513809 -93068 629965 68966 290199 230579 480755
17285 480755 170025 469148 470732 114410 414760 354505 236966 -62876 379139 16181
17274 458279 519074 572801 393249 503154 318263 315443 400700 369626 141106 334446 508430
17263 508430 72350 378354 416128 92564 349931 581880 585890 356827 236494 338122
17253 338122 396185 409061 267843 190894 27551 314978 563278 318010 545090 124545
17242 164467 325558 251118 355438 534322 218774 366333 634666 252255 416656 142296
17231 560354 431281 493041 157993 219061 115744 207189 50328 390117 615163 521182
17221 521182 561787 265894 459579 555141 347140 411030 456528 428376 276946 120079
17210 443180 438825 319513 138278 308938 235516 409371 516807 395950 437117 193238
17199 456711 477804 382398 401633 594739 407012 221472 241516 564016 533193 458483 395877
17188 395877 458853 477501 523619 380503 406091 150021 622638 543158 436903 322309
17178 322309 782857 430675 352031 646754 544735 736493 436530 84589 671429 652098
17168 652098 375759 505284 680548 816683 280176 401176 400731 562266 547941 776870
17158 776870 236946 227970 560219 420812 521679 416592 750051 660185 199626 623349
17148 623349 442905 540560 556755 424447 639808 552590 590119 636578 483328 512229 542339
17137 542339 582519 49055 526156 280075 568340 578858 541844 336975 552830 713534
17127 713534 460058 718076 647722 599362 960260 616211 282942 283545 771448 753681 629739
17116 629739 873677 755474 714296 317344 640408 742516 844325 486974 579347 924718
17106 924718 466046 737122 781378 813416 801972 835552 485721 975090 539379 601163
17096 601163 906368 809628 879131 577021 590120 429596 747557 714118 741040 841263
17086 841263 1042289 659019 552152 892224 777140 776089 770713 964252 789073 1014860
17076 1014860 920790 826275 757542 797185 1104884 498987 915367 668809 913870 629670
17066 629670 651962 584266 1015385 743213 666743 956239 951534 917978 694758 837048 571373
17055 571373 1052127 1056545 887139 725473 672089 1132391 1099266 893582 730416 912495
17045 912495 1051018 847772 1132218 692602 887609 853056 702894 837786 946312 956736
17035 956736 922484 851635 1119743 880584 1213645 826849 1231147 940487 1100934 1405308
17025 1405308 1186031 1143093 1187078 1127151 1013301 1374804 1177698 1217131 1411379 983399
17015 983399 1159717 1149626 1263984 1034010 1068847 1117930 1273436 1197546 1478959 1271262
17005 1271262 1327972 1268105 1295651 1423236 1196491 1210290 1229518 1577085 1224078 1009914
16995 1009914 1223154 1205723 1242445 904267 1121502 1302177 1359484 1434969 1658655 1082013
16985 1082013 1452066 1573244 1221049 1209074 1720365 1162927 1685134 1413372 1691815 1527440
16975 1527440 1268513 1484494 1546173 1844992 1389879 1701041 1529165 1237135 1549820 1696841
16965 1696841 1926156 1605736 1632375 1539600 1584953 1648203 1821409 1333937 1641686 1572126
16955 1572126 1628550 1711520 1787772 1710646 1632457 1908835 1980433 1972238 2067319 1859354 1995221
16944 1995221 1804772 1839162 1936683 2000976 1790934 1781460 1871737 2327279 2397605 2077485 2122883
16933 2122883 2466402 1993920 2176272 2205199 2239825 2223271 2330114 2329133 2296296 2586299 2324280
16922 2324280 2446567 2390529 2573539 2345161 2473672 2588834 2602325 2562991 2441373 2588366
16912 2588366 2411451 2823442 2696471 2818740 2908488 2926758 2484076 2602526 2809386 2998078
16902 2998078 2581696 2966491 3020618 3023783 3170447 3074068 2999477 3154494 3236063 3102052
16892 3102052 3498576 3493471 3246905 3088160 3378361 3412885 3745005 3417229 3400662 3693016
16882 3693016 3398875 3655790 3924121 3850730 3852830 3766038 3737867 4178910 3975322 4385319
16872 4385319 3840963 4044844 4457679 4244659 4298504 4566796 4632520 4741585 4543002 4991178
16862 4991178 4473851 4427660 4621633 5045950 5033771 5009591 5467729 5172893 5509004 5413683
16852 5413683 5290851 5158026 5570009 5494878 5667644 5705250 5952267 5930434 6334033 6430773
16842 6430773 6138192 6171706 6579253 6653746 6572144 7073908 6562467 7251634 7065183 7215450
16832 7215450 7529116 7325112 7783286 7840841 7980156 8375544 8105284 8217416 8678898 8634776
16822 8634776 8856749 9175100 8999674 9321612 9485932 9802307 9747033 9779098 10125566 10308190
16812 10308190 11115963 10949839 10940301 11347984 11210817 11615958 12019866 12214263 12320001 12892957
16802 12892957 13345684 13184578 13722722 13923743 13991297 14579935 14840143 15159401 15775926
16793 15775926 15895448 16727717 16811102 17477597 17849903 17913209 18811169 19205123 19269724 19661708
16783 19661708 20735220 21173823 22018438 22319452 22777351 23561828 24398526 24924650 25693954
16774 25693954 26561948 27085575 28004214 28991185 29510790 30826225 31557725 32410958 33337687
16765 33337687 34855012 35559637 36856856 38105370 39398543 40794055 41971818 43423711
16757 43423711 44816705 46543243 48090085 49655212 51627731 53392202 55391895 57281924
16749 57281924 59212285 61158798 63260202 65244604 68024987 70304291 72125620 74912735
16741 74912735 77599180 80087597 82554322 84951535 88070244 90742896 92968663 96099116
16733 96099116 98399102 100849721 103096352 105402089 107623105 109386647 111431608 112924686
16725 112924686 114530073 115461851 116392858 117213904 117440315 117263202 117293500 116905389 115692607
16716 115692607 115059472 113653210 112107080 110178899 108385667 106258248 104046018 101812159
16708 101812159 99160054 96172516 94189180 91315875 88601475 86163272 83265821 80424991
16700 80424991 77844669 75252081 72526162 70251206 68176940 65803708 63183041 60704495
16692 60704495 58720045 56939051 54839880 53197111 51105378 49374021 47624311 46144421
16684 46144421 44468062 43237905 41087415 40519234 38761580 37079311 36489638 34882559
16676 34882559 34118612 32997793 31865231 30788083 29853793 29087297 28255060 27648896 26638764
16667 26638764 25658416 25036256 24227226 23552063 22790481 22080575 21445635 20979302 20664280
16658 20664280 19867895 19453758 18862334 18293198 17622214 17414263 16931153 16723651 16004040
16649 16004040 16005768 15495387 14513243 14715045 14239023 13710027 13987723 13447477 13058170 12759604
16639 12759604 12532434 12303041 11776259 11663973 11587043 10995468 11000420 10562687 10434474 10128915
16629 10128915 9723949 10137209 9745004 9295730 9018121 9050565 9018880 8503965 8911339 8469770
16619 8469770 8523209 8157797 8182355 7986350 7692290 7648059 7291799 7386648 7266868 6733173
16609 6733173 6726725 7036301 6518353 6993579 6321195 6331913 5907830 6104922 5809974 5703822
16599 5703822 6035162 5709529 5449633 5696498 5399042 5378501 5799153 5135650 5144768 5353763
16589 5353763 5053121 5019557 4867399 5040378 4811690 4697937 4553217 4652345 4228810 4130540
16579 4130540 4293285 4233841 4524645 3914857 3961655 4001687 3866378 3860231 3761057 3961575
16569 3961575 3569396 3611282 3393806 3617722 3789710 3353361 3571226 3626310 3064933 3434637
16559 3434637 3326910 3170873 3204474 3323150 3339526 2946339 2962451 3011823 3106844 3100887 3068324
16548 3068324 3136003 2946214 2757986 3083528 2678223 2782750 2666946 2918791 2698120 2687986
16538 2687986 2911607 2646931 2632762 2489258 2542294 2531557 2638709 2323311 1999700 2476652
16528 2476652 2401148 2410336 2401626 2247367 2162294 2280572 2263147 2162773 2396542 2132761 2186957
16517 2186957 2109673 2199310 1998887 1713350 2100953 2158453 1955351 1834314 1671612 2008388
16507 2008388 2056662 1962954 1967819 2043507 2000949 1454577 1871694 1758603 1726827 1776262 1742173
16496 1742173 1743965 1358305 1776938 1502821 1526055 1755727 1568495 1379292 1973198 1443956
16486 1443956 1637773 1342447 1633072 1328191 1406493 1268600 1206741 1446751 1144414 1367104
16476 1367104 1360492 1220062 1373228 1549055 1426042 1458579 1252621 1234245 1365602 1604645
16466 1604645 1418188 1518245 1364961 1231091 1194237 1608688 1060500 1409533 1077183 1198809
16456 1198809 1184540 1277495 1202035 1168065 1024103 1114182 1084500 1334940 1191424 1067999
16446 1067999 1167993 1413584 1013945 968060 1238823 1070549 1068037 1434871 1421738 930404
16436 930404 1281018 1337516 919840 1030101 1143696 890034 1157770 901266 1155917 1170133
16426 1170133 554964 879582 1050912 1051957 504616 924242 692261 747807 1077148 850836
16416 850836 1244412 958043 909290 796244 891161 897748 828328 864150 856189 832106 662858
16405 662858 936455 932100 704008 802891 546067 1024120 948960 806059 731888 850541
16395 850541 711790 975892 787318 822019 403935 954148 918741 197048 830108 788271
16385 788271 1023756 677782 706712 1114961 664249 752521 807406 730270 868749 459473
16375 459473 521952 414850 578099 416326 681029 578967 779544 631439 530095 555310
16365 555310 366821 1047743 853604 923146 437978 389053 1015711 626542 819515 849028
16355 849028 515607 574178 394141 350524 431401 565651 687458 574679 334313 801350
16345 801350 646286 136213 626034 233990 437129 495289 647863 469887 657312 642266
16335 642266 475256 191468 409773 444144 772485 551520 406598 556005 573921 239530
16324 493937 667780 538454 646348 281428 528063 533556 362270 181043 208842 593884
16314 593884 681290 824038 544383 762546 245870 352676 465661 383378 476194 568341
16304 568341 180927 772252 337258 585600 595836 263473 134313 485956 468257 397241
16294 397241 192990 521165 531780 415002 486145 40317 514385 579934 346261 312174
16284 312174 352634 463911 302314 158141 253019 389813 184498 387492 109496 491723
16274 491723 478657 414956 618127 335137 337147 401141 -107306 414136 491499 86584 664716
16263 664716 -46906 354184 495687 290016 297399 394707 193339 342127 438513 394845 277751
16252 277751 122048 346932 52857 330383 13960 207049 169057 324494 8918 449816
16242 449816 243552 398765 226811 395425 394168 170805 131051 416825 447787 335660
16232 335660 495698 606918 138915 245142 170251 382112 163479 159082 205911 6651 214799
16221 214799 -74155 266443 87174 121616 371312 363459 340381 451095 109331 166409 289298
16210 289298 -52525 94332 331328 182009 264550 17646 163140 244338 277975 102418 356006
16199 356006 -1038 72838 297922 62435 334943 -7476 273095 -60562 179949 271747 306651
16188 306651 315303 71596 424057 52350 408026 109654 119230 67137 230415 -30949 253523
16176 368187 244602 77298 462383 286789 153076 48470 255704 277175 6641 60173 199616
16165 199616 238300 427699 324314 130890 160024 -380428 159403 178516 21885 30583 193372
16154 193372 59576 218769 280420 285755 179946 325163 182582 -80597 237008 188413 -199726
16142 221058 -8770 155117 -216341 -326032 43022 131673 40186 233589 85635 -61895 226216
16130 350888 197377 244735 68829 -52776 -31220 -43439 291664 43901 122244 -184265 436357
16118 225870 44286 -262321 11432 265388 283471 -146306 103358 357566 152955 250382
16108 250382 177885 79538 139903 332519 32857 -19824 -13257 98204 -1077 285011 190317
16097 190317 18551 123767 -259615 -3820 259656 210353 412789 353917 77601 146365 -303052
16085 -171359 226163 -106745 -12387 -77503 -100882 194647 -10665 184166 33386 -60851 -64842
16074 -64842 -18111 226176 -81304 198921 -111196 151846 4529 343572 -35635 -261530 97690
16062 38793 -21215 -205931 -221282 112014 437196 -60685 350601 173703 51579 57415 54978
16051 54978 298671 -84223 312511 225355 6687 -185514 -210977 161038 42584 277769 214044
16040 214044 -53477 -96899 -28004 -4999 180324 168679 -12681 18428 -64758 117012 -125605
16028 253649 75107 97982 62963 12266 -103358 -243345 87233 42023 -43933 84495 -106016
16016 433919 91190 104317 278767 45481 -209325 251560 215949 -194175 146747 18061
16005 150075 461047 187490 178964 -137134 209749 -215218 -122373 -132214 -22908 -165506 67724
15993 -11745 -80046 219218 -10810 369857 24679 226928 322825 557480 1328090 1060210
15983 1060210 1398829 1313192 1131867 700649 -28868 92838 232045 70731 -102242 77361
15972 31579 -178432 278627 -84701 -152170 -130238 275389 198348 103419 50935 69636 309877
15961 309877 226695 -80326 56386 107141 237141 -9863 118878 -26578 -266875 324902 -124328
15949 542853 -68559 -305382 -322656 163479 -148712 71571 33695 -174823 195108 -239662
15938 126550 127522 -201051 41253 -75814 81582 -102977 -55762 196650 400268 -157478 223265
15926 328930 12914 -93522 -112567 -75593 -86689 -264442 148708 33395 116827 3433 196385
15915 196385 -33481 78614 -13050 33113 224755 244934 -150439 -18592 48815 -171308 117719
15903 128762 128015 -509026 -50046 222645 7525 -116454 -219025 -10403 -10412 -305599 -41085 223572
15890 -45344 -221040 -37323 132435 -230800 -80520 -76460 131779 247255 115171 80099 -162179
15878 243720 -45391 -295305 -286723 -250741 -305883 -20055 -135009 7155 -153865 -164752 -140598
15867 -140598 87132 -2946 273476 201375 134490 105082 -141157 -24016 -251681 13136 -54180
15855 167318 -115056 -344556 -65724 120476 -148376 -47087 -290023 -292090 -82926 -275779
15845 -275779 -84082 -163779 285584 41681 -127314 -135209 30020 61214 -121076 49907 -64671
15833 48957 -239900 -45191 -378417 33376 -41883 250861 76813 100369 -24744 -221360 7007
15821 5311 167381 -339799 181442 -32080 -267714 122671 -129667 -80681 -361638 -157713
15810 -172838 16902 171962 -107560 160867 -94198 -354377 130606 -113758 -164950 107525
15799 -155646 65832 237161 199974 81029 -273679 -56994 250039 -80392 100383 192896 90568
15787 -128198 248479 -224478 -84993 10518 -88420 82710 -188976 -33674 37379 -183975 172150
15775 85580 26167 -339971 124753 485042 151717 -39238 -178253 139810 115126 357285
15765 357285 92347 13529 97913 -175943 -220704 -31517 176000 -58820 174096 207352 98276
15753 140952 -52409 -95967 -92477 -21627 -258336 -52701 177094 -123854 52450 -4804 -159207
15742 -159207 79344 228748 -2663 82947 96969 267588 -287359 -308139 -67419 -113076 20647
15730 -123268 -104843 373849 -106081 63633 110809 135620 192463 -94103 340719 71126 15157
15718 -87222 -104173 -57889 -11572 107152 -17851 -44695 -219015 -218098 -52914 -21851 -138965
15707 -138965 101097 -56857 -180386 -45378 -100393 13463 124673 -66618 -215463 -22173 161631
15695 -45316 -65082 -12781 158761 -148792 109613 132698 72598 -275293 -282518 48229 -95992
15683 113999 -8371 316060 -355095 -70124 76429 87204 102714 27523 307104 -156949 223972
15671 152497 65775 -13639 121012 -132350 -138828 116740 -122525 -370089 -176901 21680
15660 -61339 -98062 -57877 -179369 -267823 64145 -65541 -184754 -226005 112733 23759 -53310
15648 -228479 -78168 140588 68411 -75690 -15010 -386173 5348 195369 -128522 -97263 9108
15636 -459032 80789 -383936 62436 -75580 21442 17244 -97693 78161 -123625 -294732 77240
15624 158022 135029 117704 -10371 62114 -267561 91923 -241072 86255 17591 -2329 -663 166371
15611 -39313 -49643 -89688 -231830 -28980 -28849 -191427 253843 -165049 155690 -26199 -46030
15600 -46030 121316 69106 44053 -305358 379338 -287533 -260137 280790 265833 211183 -245287
15588 42589 79171 -28571 -229419 -116422 -167737 145507 220154 -82397 -80561 70042 59635
15577 59635 -222404 44843 -336538 353901 -109809 -80460 170992 -125475 -16651 -241433
15567 -241433 214717 -74157 -66366 103777 113185 -172395 74712 -168484 -230782 17895 -37855
15555 -88521 -127876 134789 227778 100426 25492 -15638 35805 271759 226846 276354 86010
15543 220451 95164 -363194 -110095 325203 44924 311050 -77647 88788 -238252 -144110
15533 -144110 -55503 7959 225152 -99073 158964 -72857 -18712 171620 95336 -380985 201556
15521 -116560 149981 508895 366667 198495 86975 87459 104757 447847 55931 402176 89832
15509 251399 82302 172428 181319 182676 -104658 147138 -80709 400450 86333 176120 102704
15498 102704 225949 214592 215109 116682 67162 -24807 239152 -125998 163252 -260537 218086
15486 199922 165631 -57008 -257027 -162858 -116016 165757 -72185 214791 206039 -165593 -7838
15474 336594 78009 658995 546617 424037 230596 86429 247746 132874 29741 114801
15464 114801 77538 73967 107184 -161049 332405 44181 177711 191954 -186940 -62210 258934
15452 126968 147762 170568 18180 -138534 -4498 182793 120071 -1585 319018 373863 954962
15441 954962 1155885 1383679 1321534 599976 324196 -71260 264811 53530 -200632 203335
15430 46356 107915 50137 -315238 268420 90772 -151852 -234966 117507 172669 119118 141642
15419 141642 13342 4394 -50623 -49011 188223 163850 -55984 118650 -207388 338845 155610
15407 206170 -160723 -29180 67014 303173 1035 -225755 -15748 183140 -201509 -11665 20750
15395 151634 -148979 150209 52822 -6762 -180634 -52496 62801 -29205 -47977 44861 268497
15384 268497 5280 -10202 27593 -101045 118749 1211 385166 202932 77079 286424 25617
15372 433636 174579 601603 -77987 43963 299346 10264 9857 138248 114153 43980 200481
15361 200481 -130824 355889 505293 -14979 61327 65308 293021 177340 -291302 -97393
15350 103682 133638 137178 543452 -186095 122402 349529 580193 154550 403635 104454
15339 320631 362888 477519 302115 322787 391696 -149133 -319421 389841 9689 203824
15329 203824 88159 4527 -93663 210686 114839 -63344 127721 149996 106183 37534 55997
15318 55997 -206822 258680 231204 10212 159299 -131942 53738 185202 296706 111076
15307 213302 -15274 135698 -86816 99068 -41344 49248 -103424 143445 1049 103233 97688
15296 97688 -140660 275734 57226 43862 330231 -294304 12286 -272306 -100265 129029
15285 -1624 110420 -48141 21054 313937 22252 260720 11175 213974 72361 -63602 218567
15273 -91617 -56277 17026 -98000 -337313 37739 72169 -269501 103121 -156551 74930 -5401
15261 63714 -75903 -183986 111238 -126937 205308 271432 -122580 -32428 245488 4280 -72416
15249 222820 -159118 156903 325973 -36463 256880 -115038 291069 506961 1632280 2081624
15239 2081624 1363261 1924385 1305778 582982 183108 174762 25956 316736 221823 -231064
15228 -44423 143156 205835 -283159 237572 304192 -273424 18247 -122577 -38152 103778
15217 175910 -135359 304160 -270525 124454 31542 126144 156536 363590 -10145 -10247 246765
15205 -52694 263545 73642 129921 87916 25715 -215581 252202 -119696 -27697 116345 179414
15194 179414 147584 -98881 116814 147602 165386 290241 56120 8269 -127192 164352 34336
15182 -73833 89288 -171651 148688 -50964 -252063 101910 210040 -17691 5352 -38439 -28038
15171 -28038 -109081 166175 -275909 -159970 114833 163220 -5530 -163463 242853 146313 -20317
15159 167319 233587 99082 -212523 -23771 -247816 284779 -59205 -10079 -144187 -200473 203029
15147 -139885 25611 368017 259401 -5751 108325 15131 186925 196446 -159989 100640 -38582
15135 160315 271046 105490 20697 23573 276774 -62234 122640 -37054 100144 13299 116894
15124 116894 213664 -12178 4582 -114368 105925 651117 444402 839772 231100 -92217
15113 -197895 295371 321752 278344 334814 -9749 -179046 190566 -28911 -363698 104892 192243
15102 192243 194082 281436 210653 99934 172094 356948 22589 211070 -137437 414892 20802
15090 161181 311703 86251 357534 145178 129802 348278 262006 98049 65794 61725 323818
15079 323818 146848 122225 117870 -99817 375702 -102135 234495 -208525 239868 161150
15069 161150 74160 215902 339948 287848 91031 328120 204338 189868 -26823 316766
15058 356248 67452 247237 518966 -2567 472633 378824 53016 304773 528087 446998 419632
15047 419632 318036 400594 97685 507811 313214 56686 44033 380686 528579 120174
15036 278085 238167 213159 574285 613444 227437 545510 600573 513235 588623 231394 568871
15025 568871 474475 229318 475915 239976 492386 468726 449196 364104 622650 32012
15014 324669 274707 150409 485708 533562 706220 312235 768864 383591 718478 288384
15003 344351 209733 328653 258295 344903 337488 716703 871540 178418 313306 483221
14993 483221 416996 432280 460032 491906 750977 345078 940062 236931 325542 517183
14983 517183 560245 883566 1202863 830774 1003356 673116 250590 377068 758488 189306
14972 775779 819719 642092 474769 208548 359353 281098 361006 616905 481810 582652
14962 582652 292304 416869 290280 410849 156574 518621 170324 -76788 354440 417331
14952 417331 137028 537328 264132 559871 830306 -1159 588550 323039 465704 718968
14942 718968 679348 732042 516755 387461 299364 718432 158615 600180 251069 689267
14932 689267 780150 1247665 1094890 1195298 1118845 1373548 1480852 1637976 1832576 1935293
14922 1935293 1449758 1669183 1368476 1618539 1515506 2166526 2391585 2387350 1148304 1236722
14912 1236722 1102540 1086031 1002229 377822 705245 468768 490182 326676 545929 369468
14902 369468 431699 404211 299778 638321 171105 491458 131832 346555 558249 409803
14892 409803 318695 290000 713019 543795 291178 533357 882160 652996 800404 807950
14882 807950 690573 839323 1009749 1008592 738931 809272 549838 325867 202806 271512
14872 271512 330098 429989 657076 616724 617337 448406 617724 877557 901143 506887 611393
14861 611393 637719 563851 249581 213792 353220 783204 658887 -1495 747675 347236
14850 397173 693860 332079 587372 693632 658609 1101005 1031844 1060623 1352457 1176406
14840 1176406 1019833 997871 823438 837044 636239 761678 848947 472409 656799 226681
14829 637743 770042 973048 488190 634478 438236 650533 801054 681620 399077 699260
14819 699260 687001 916736 728193 925785 716652 910420 352029 575166 510494 675030
14809 675030 609433 743253 797544 812576 770053 683059 990778 889688 669887 468833
14799 468833 555491 686037 137672 569633 398389 698337 1003455 298774 828187 617142
14789 617142 783649 499731 268573 714390 522325 632231 898144 649139 752831 677999
14779 677999 908450 796229 839435 690680 883175 1028562 836898 972843 881009 645394
14769 645394 670356 544091 698968 285166 307964 513910 584388 538166 601900 528527 482888
14758 482888 590100 557292 800653 482854 498027 816631 709386 629820 546044 1133506
14748 1133506 576345 820818 602365 601761 712991 570265 590781 814000 621017 743561
14738 743561 654110 747809 869721 935393 983997 1149216 1010475 1062168 1148500 1479249 1698647
14727 1698647 1999336 2160160 1642536 1480693 1241703 769565 1257426 770544 758218 1025697
14717 1025697 714532 869027 539440 1064358 815659 1019843 606266 1043574 1064745 560772
14707 560772 1163279 1001432 1131165 1172028 1534377 1699163 2038834 1750345 1648980 1599671
14697 1599671 1089653 945464 676044 861111 834538 1229160 871642 884809 937447 575130
14687 575130 904220 1095177 923583 744367 770535 929389 888267 953344 821374 915708
14677 915708 1012869 813422 841561 861049 831593 947764 993559 770937 1019115 842389
14667 842389 846601 1120953 956331 947807 1237335 791105 1300281 862798 1243556 1251597 688993
14656 688993 1243002 805764 997478 981080 1151357 1527109 1227266 1124018 977992 1090056
14646 1090056 873185 1055311 1093236 1150987 1021769 909126 1136246 1314811 1463097 1348170
14636 1348170 1106895 1260244 1029577 1281737 1042066 1352602 1138191 1187931 1361093 1109272
14626 1109272 1145487 1309811 1437453 1405564 1359091 1562016 1380631 1275043 1162758 1516539
14616 1516539 1058309 1139035 1347938 1437572 1409147 1116976 1454902 1332184 1133485 1899721
14606 1899721 1541679 1342716 1449609 804554 1314700 1418351 1398120 1761493 1508215 1632255
14596 1632255 1578303 1846739 1596818 1597038 1373724 1638775 1814565 1998750 1565406 1526500
14586 1526500 1647237 1475781 1714995 1775520 1910743 1751608 1887205 1782339 1714471 2144495
14576 2144495 2048110 2020099 2021451 1978739 2352754 1717609 2094395 1732489 2218724 2255142
14566 2255142 2012561 2443314 2486265 2379051 2454048 2537140 2543940 2633052 3060823 2905428
14556 2905428 3041597 3269798 3357438 3472139 3631000 4355203 5142360 6338858 10042904
14547 10042904 16977033 37844069 51049667 21089061 8377425 4423365 2991223 2447801
14539 2447801 2612460 2794333 3506527 6639969 3883612 2608527 2036640 2114651 2133462
14530 2133462 1976325 2056252 2192405 2086896 2008676 2019703 2474008 2417872 2161026 2102804
14520 2102804 2456624 2329349 2773325 2442974 2529928 2415756 2698899 2703053 2740890 2551614
14510 2551614 2377368 2374294 3017048 3023366 2929956 3167997 2819803 2996085 2858739 3175916
14500 3175916 3208000 2701827 3311354 3173710 3136676 3205225 2961281 3247547 3335072 3404194
14490 3404194 3461598 3451463 3337526 3249879 3479775 3711731 3802308 4082005 3807375 3851707
14480 3851707 3634015 4107599 3713931 3967546 3729046 4124937 3856261 4316586 4455881
14471 4455881 4384913 4121222 4386582 4180328 4327491 4387726 4199804 4272141 4479698 4612853
14461 4612853 4683553 4535204 4920980 4756587 4690408 4959468 5322062 4968124 5042574 4953099
14451 4953099 5166474 5482124 5388995 5461177 5581604 5287881 5693158 5884504 5794423 5750845
14441 5750845 5802840 5823589 6478966 6155441 6226556 6235893 6127119 6273930 6798201 6237310
14431 6237310 6851379 6924585 6713897 6739814 6784136 7187672 7404479 7448963 7435350 7676933
14421 7676933 7934220 8245488 8405949 8471827 8631238 8673774 8547499 8856316 8573988 8637413
14411 8637413 8814601 9289418 9324314 9136896 9675454 9910189 9913196 10268581 10299066 10053333
14401 10053333 10553257 10582596 10516410 10669251 10843861 11156475 11202690 11471386 11805378 11834483
14391 11834483 12343272 11928095 12517378 12763729 12969900 13041341 13504704 14149400 14044961
14382 14044961 14346304 14768929 15118381 15150846 15250428 15605390 15764323 16152249 16511313 16813836
14372 16813836 17078939 17554193 17846611 18115657 18558589 19119467 19516659 20157059 20017199
14363 20017199 20571700 20906224 21383890 21691086 22236265 22952806 23450340 24055014 24663214
14354 24663214 24922686 25588578 26195862 26891670 27832923 28392962 29041372 29600817 30678635
14345 30678635 31168356 32245347 32597884 33907972 34712229 35529673 36588967 37464775 38379883
14336 38379883 39911213 41261093 42123709 43685598 45038322 45977141 47768943 49222099
14328 49222099 51230218 52523523 54242141 55794263 57787676 59930255 62323358 64276408
14320 64276408 66613100 69150388 71446651 74171834 77102670 79767831 82697754 86270340
14312 86270340 89477200 93072783 96937507 100863059 105377774 110055050 115046385 120352928
14304 120352928 125855964 131432352 137651751 143989044 150753438 158069144 165684927 174095841
14296 174095841 182293156 191719360 201449804 211836852 222449380 233923548 245898742
14289 245898742 258395156 271489626 285269669 299352375 313837669 328689498 343637285
14282 343637285 358821983 374313383 389127384 403802522 417688951 430683892 442453732
14275 442453732 452574802 460303588 465016453 466971196 467405973 466510872 463530560 457615417
14267 457615417 451628730 444140507 434802016 423822742 410872374 396830458 381757548
14260 381757548 366425008 350580993 334878907 319050059 303806957 289000293 274706431
14253 274706431 260598914 247962932 235040328 223256544 211673593 200926142 192865546
14246 192865546 183861052 174478380 166429805 158541764 150914554 143928630 137054261 130691592
14238 130691592 125412952 119965067 114712526 109788828 105491625 100623793 96560843 93697367
14230 93697367 89617362 85896758 82452168 79372361 76126361 73414792 70352370 68238701
14222 68238701 65925330 63524298 61464363 59603618 57538700 55791755 53637391 52046556
14214 52046556 50858433 49615759 47696187 45928263 44474156 43510829 42261896 41812930
14206 41812930 40278273 39241920 38097825 36516812 35659550 34796199 34867012 33586514 32439381
14197 32439381 31501890 30564922 29620715 29365288 28842237 27789681 26871218 26627710 25974037
14188 25974037 25085498 24672497 24120325 23508113 23260845 22763749 22177746 21730691 21128251
14179 21128251 20706680 20295360 20071731 19612791 19212519 18876002 18493750 17789400 17869672
14170 17869672 17266229 16815331 16712915 16246593 16125077 15625331 15512896 15110600 14935304
14161 14935304 14902406 14352787 13727751 14188012 13878669 13415327 13368101 13165406 12790279 12778533
14151 12778533 12646256 12183815 12116313 11935281 11429691 11500957 11253960 11260871 10747293 10903175
14141 10903175 10585720 10336925 10303629 10207505 10271202 9907982 9767474 9297063 9725882 9256279
14131 9256279 9135035 9377451 8815821 8835570 8680740 8789713 8594795 8360545 8059840 8382771
14121 8382771 8273682 8075909 8269021 7926082 7626046 7426264 6849755 7553835 6912785
14112 6912785 7086150 7039606 6904146 6754436 6851953 6639359 6583858 6518036 6577601 6342817
14102 6342817 6188369 6531174 5957765 6234903 5872960 5980570 5814530 5602855 5599546 5532741
14092 5532741 5739382 5587217 5449489 5200518 5629346 5263494 5687759 5330389 5286970 4998657
14082 4998657 4807577 5122115 4736831 5032621 4856054 4765234 4708222 4876502 4348301 4462884
14072 4462884 4803928 4730955 4456058 4554342 4321837 4385576 4489066 4454645 4297007 4360945
14062 4360945 4153539 4368998 4432436 4088193 3899256 4127458 4098561 4213987 4145071 3921403
14052 3921403 3887697 3733544 3726485 3924879 3445186 3444648 3305321 3591515 3427756 3563442
14042 3563442 3211768 3148187 3398876 3454945 3495733 3309361 2988367 3065229 3185032 2831628
14032 2831628 3230338 3113681 3346699 2758867 3106130 3186649 2922674 3008502 2781940 2768229
14022 2768229 2614810 2958810 2624918 2713935 2458484 2609284 2690063 2750282 2776706 2807194
14012 2807194 2447354 2584918 2536105 2908907 2526140 2425295 2504387 2427543 1907559 2447134
14002 2447134 2418964 2093543 2310617 1916096 2078402 1983368 2188491 2026724 1917233 2170422
13992 2170422 2039385 2153913 2442803 3163507 4946968 9687448 26526587 54788242
13984 54788242 28729355 14638793 8717928 6208339 4955668 4456576 3614671 3369615
13976 3369615 3342431 2993275 3137646 2831413 2549075 2764308 2645496 2373452 2405212 2356019
13966 2356019 2589394 2432335 2034348 2346236 2198261 2417637 2340326 1937093 2233706 2317159
13956 2317159 1901618 2121895 2027885 1743127 1874266 2118750 1900682 1921042 1787431 2054069
13946 2054069 1921131 2146416 1927181 2106089 1945925 2128664 1807130 1786461 1741213 1774692
13936 1774692 1709243 1608822 1828694 1534863 1704963 1656274 1426507 1926376 1637078 1432109
13926 1432109 1627491 1943674 1591370 1497546 1585506 1338302 1567776 1478008 1243258 1593235
13916 1593235 1819641 1725604 1444071 1574637 1529549 1348427 1718684 1656459 1406544 1435994
13906 1435994 1632841 1638156 1531816 1160587 1410105 1408658 1346489 1431091 1136371 1584879
13896 1584879 1386961 1565266 1418751 1441546 1260883 1109427 1386269 1422979 1472344 1081978
13886 1081978 1287693 1017589 1269883 1588054 1475526 1469241 1806819 957622 979501 1573655
13876 1573655 1663790 1034250 1072135 1120169 1182179 742806 1509156 1339077 1173136 1226122
13866 1226122 1073959 1246335 646789 1156654 884474 942003 930034 1014226 1105549 1184472
13856 1184472 1061668 1235689 1027574 1292869 1066346 1219642 1111408 1106077 871844 1352244
13846 1352244 1180176 1117159 756957 1191636 956889 1151347 671294 842388 1167852 1044773
13836 1044773 1125539 1248844 977971 847080 1147332 370756 879727 1084032 1133428 902259
13826 902259 996327 1100735 870751 706384 855243 848880 920869 952027 1025958 963034 1121067
13815 1121067 946233 982138 856686 1103679 896830 943264 881460 702824 706661 1007984
13805 1007984 844199 852632 1139495 592463 1349721 1046717 750275 527142 1003225 914938
13795 914938 850455 906109 532921 827315 762283 431674 703318 700941 675095 660596 685457
13784 685457 667180 1153900 712604 673383 733507 1050656 823404 959229 607398 745548
13774 745548 591436 849786 398907 669652 1000228 736021 915215 886618 533026 570005
13764 570005 723046 811322 595161 813739 626806 654240 979918 622763 296065 638388
13754 638388 1024386 554913 697075 574618 850484 892567 561379 851067 862146 543588
13744 543588 593932 785514 381205 508764 1086787 655067 724285 500787 487627 641914
13734 641914 840578 646182 556195 683306 727827 603366 695097 706720 548394 352962
13724 352962 817817 472491 683387 512240 314793 576856 522756 368500 550286 723158
13714 723158 706478 309260 498283 618187 581745 134432 329291 446655 393068 514878
13704 514878 443818 684142 485944 654122 447063 657722 635507 416690 618010 626935
13694 626935 652675 795083 432116 479499 420397 442788 325636 481603 393999 463397 537114
13683 537114 656655 674755 460617 291422 389553 630818 807761 521370 1086095 381256
13672 552456 209163 611788 558815 499535 424002 480166 460465 659423 304600 482674
13662 482674 483778 390391 417088 579218 762031 610770 390178 437974 542812 150646
13651 416945 362573 96684 667779 416165 432732 429364 700530 133803 352679 710441
13641 710441 547646 595449 321260 363471 471030 406377 859696 473133 408912 617345
13631 617345 847508 475860 299753 255566 333825 324548 355735 375450 349589 601028 173731
13619 351410 393351 418724 582429 761013 423801 479540 129512 564675 291889 195968
13609 195968 187580 430648 204312 290464 534150 466138 338246 219425 414850 377887
13599 377887 535951 405638 400346 27773 328176 416569 551919 412615 161154 574370
13589 574370 376326 457186 258458 149488 552584 280399 670683 -145572 689119 442771
13579 442771 221670 322596 17862 296375 544497 280770 160865 349733 630577 269677
13568 452872 460787 676030 532671 344265 282409 472395 161427 428665 181701 -39895
13557 252813 548992 330800 416083 371186 433373 547395 256302 159100 182056 376479
13547 376479 486199 554109 188732 297806 240852 409691 304324 343088 463784 411454
13537 411454 262102 256140 421245 312559 515298 368805 370156 261376 378016 278878
13527 278878 633676 17780 435670 249990 95154 -50470 523427 588266 -7055 15351 478507
13516 478507 18483 249093 316137 -52131 -31441 384158 -74366 509067 350471 341534 507469
13505 507469 237246 399114 270301 137965 332362 185140 109909 289244 478758 565463
13495 565463 378746 151246 141255 204570 160807 67616 478622 268402 209566 185715 336313
13484 336313 82772 221631 -95974 -9546 24921 376089 442788 -63936 228712 334368 420093
13473 420093 139294 102461 335858 292930 172938 237580 182304 395069 221878 301108
13463 301108 218561 295891 144777 -31241 75701 143819 117284 59917 266898 339582 210128
13452 210128 150718 322312 119628 55959 211377 248248 496732 187927 410652 243712
13442 243712 -35727 336688 -65452 171518 53752 131047 -168627 244529 239927 266647 463113
13431 463113 -2017 163386 272101 446525 5839 -40124 196596 158880 139545 302299 270690
13420 270690 287494 239179 56895 -67452 323818 163681 86487 162219 110013 263115 287178
13409 287178 352618 74116 -1746 217329 277307 400419 264290 -287037 375582 213540
13399 213540 221015 375920 390597 203646 289327 38143 107772 404659 151857 279289 410672
13388 410672 198608 135208 -242852 -167181 138835 158024 469829 67309 277161 227160
13378 227160 145800 488784 406804 309505 304736 412049 -5455 -29659 289121 184341 138500
13367 138500 404326 211617 524119 648338 317526 175706 165320 88907 227418 373831
13357 373831 425419 179106 558846 88359 -8289 -62174 454194 255338 134689 150734 248066
13346 248066 104839 136350 156634 223379 455646 181822 336804 205590 404261 332577
13336 332577 80865 37554 -125461 32703 299284 432632 266134 251175 39379 272050
13326 272050 461589 -125793 98170 317182 295077 149418 595510 95514 41662 281005
13316 281005 190265 605235 495778 434015 341142 132938 549259 384543 285686 248585
13306 248585 236167 324750 160814 149365 477794 107253 207917 -272612 147363 13771
13295 -11278 558976 454149 298392 -165203 362975 344169 11977 155443 230020 147264
13285 147264 403058 259867 291773 165008 144231 -31205 -17317 127530 198741 -104772
13274 328558 86015 110522 232303 75037 169048 -241564 101246 86814 100758 259421 166035
13263 166035 343076 468491 104774 277623 -32674 225023 250548 70814 -7159 -57545 213475
13251 226979 123279 360309 -181051 -72501 94945 200430 -87127 278892 -187870 -18285
13240 201119 90543 183337 99743 77833 148281 -12244 400616 126251 212654 97821 39578
13228 114738 343072 253077 -106492 309966 214983 32455 276076 60175 236238 309846
13218 309846 165036 145589 323942 -13663 -20407 97495 217954 171773 -14419 509533 -12239
13206 120173 22344 284569 182148 -123971 73601 291882 295361 71644 345890 109730
13195 121039 189265 251744 87158 88242 337674 -22204 286682 270734 -17965 53587 166609
13184 166609 -110393 -70311 373351 344896 -53806 188632 -23123 11834 267834 178928 -14998
13172 114491 -154383 65572 434346 -18469 153113 -58550 -60906 451407 -9835 180789 -53237
13160 44247 -46821 106686 -287837 233394 -177487 121714 23143 184774 51132 219341
13150 219341 -10047 -60818 -255293 68926 -228033 -20744 37752 -51994 89084 273960 150353
13139 150353 49136 102861 189643 246428 -236895 244833 96047 118081 -105625 256189 36551
13127 82103 308755 757 139356 -302072 116320 -88959 -49228 76129 44119 198276 266277
13116 266277 279325 6553 144138 209925 -327302 175719 -84403 111654 163080 83994 20094
13104 18432 -51505 97796 235790 -294751 6249 215862 -200009 45248 -5868 -144120 -160445
13093 -160445 -10775 -134244 29054 167558 -23968 147818 150526 -462205 -45212 -49883 -62651
13082 -62651 176295 183187 20630 80754 190705 -1963 92268 338632 146794 87912 63259
13071 63259 -152025 431259 121156 -10821 212147 186210 362221 140194 183746 130320
13061 130320 288917 -151278 559316 135122 -76967 56764 107648 144188 -77125 97168 69571
13050 69571 181587 -103918 -177253 -26230 -205136 35272 2849 13384 -28105 72578 -4 188207
13037 370979 396038 22739 -18942 -131336 65978 176009 -7589 394181 156644 142990 -76876
13025 47492 157936 326221 -21510 19907 123933 73475 193221 163619 -47297 -8732 -348027
13014 -348027 85436 188878 39219 145479 227055 304816 -104013 -219798 122998 310035
13004 310035 113511 161812 71065 -59398 233420 279874 115737 249329 28876 176714
12994 176714 -137167 186605 137664 185414 349750 -174220 -270064 -67686 43436 -1376 70970
12982 -24331 88772 69505 329939 85680 38989 -43266 180903 152859 -173336 520900 145149
12970 95203 58324 232070 -12138 -211981 220113 368250 -202407 85393 141809 269303
12960 269303 -247678 116127 20687 -156141 -20887 41395 78289 -31100 580570 68832 -57431
12948 -277735 -13893 -23830 -25133 91659 6494 34160 101753 45783 197401 76262 -143895 197625
12935 55141 303453 -242515 92386 -43054 109972 -82281 -107292 13843 317006 115300 -271291
12923 33184 76595 253627 -238942 -146574 -148962 -110412 -280257 -95469 -118326 274645 -119027
12911 258794 160934 -27980 116225 -51805 138197 -335297 -392465 -101026 94550 -75942 -235251
12900 -235251 157784 26215 -218993 35871 -44662 -230273 -4815 2657 8764 478370 7189
12888 105882 27353 26224 -43133 4446 -57083 -28959 99995 158693 -47696 213126 -232077
12876 -365183 72781 -99700 -148649 132794 -101231 -195307 14867 297162 20037 95572 14658
12864 -467660 175805 -99307 227648 -116800 -118042 310483 148897 -74660 -42108 -17152 34700
12852 -8773 -29738 28379 142518 -3003 199988 -6049 -26001 205398 -78275 -113506 -187771 107818
12839 312362 -233071 264151 -34363 -94485 -14000 543363 -90579 249551 109828 -175316
12828 -15400 48948 277634 -198382 97485 19114 -64179 56932 -176423 16016 88750 173799
12817 173799 255158 254292 93719 -176001 -92178 -100663 -199968 -241858 -71952 -403253 134657
12805 231607 59395 -112435 -179803 -113870 -123805 76211 -284380 52193 179302 -6024 214109
12793 -166578 52776 25391 203151 150745 -240995 185596 35148 -229145 -50130 -83736 -119163
12782 -119163 -10679 75594 -129929 200520 35073 -2053 -10726 75264 -217039 227859 -38484
12770 206527 -76382 -355759 389857 -273799 100596 125131 982 -136481 -273622 240103
12759 -19173 12712 -179372 -161360 -248980 -58839 29025 -8145 -59519 26696 -85436 128253
12747 62509 64223 481739 -388542 172414 210338 -30824 -14927 -54768 -323888 528252 242419
12735 -176739 -85230 -1456 -119808 -113800 389599 123503 165669 51903 -351339 451433 168632
12723 -45111 -88299 -246294 -38769 -32970 114827 318159 -31494 9591 -185065 146321 23333
12711 20968 -1962 203949 24994 -90378 296392 59282 408621 434975 335582 128342 -1425
12699 34988 -107324 -61924 120374 187736 -24180 95788 31940 81938 222786 71669 55321
12688 55321 76219 -111038 -15825 86620 9173 -34581 147622 521224 245653 423008 267609
12677 267609 -35310 -62628 95358 -19849 79403 57862 -205510 -63799 69997 126962 46789
12665 -130404 79670 147936 328518 46820 -162570 -5724 119656 233529 125688 -89482 -122079
12654 -122079 114195 -1368 279384 8265 -79597 423498 -112299 -85300 20801 -27454 -436979
12643 -436979 236486 283548 -257057 11153 -176304 22300 141206 -118297 -4543 -90250 -80200
12632 -80200 93991 355108 -112580 -249109 323905 -104450 -6029 429674 263150 32180
12621 368562 39709 270426 90683 387022 193956 148531 155028 -4109 11309 -229588 44100
12609 -79166 88588 -173217 88599 -121304 99796 -61982 -2258 40059 -113867 177376 -28962
12597 246180 573306 108377 -73417 150536 -28682 79671 133590 75321 -81529 228371 200529
12586 200529 16180 -3211 98762 -13858 20681 137602 -188281 16775 -157290 -170124 160868
12574 206884 -64563 118161 19112 36397 144193 -349266 -440183 103665 -37758 -110884 23910
12562 -246147 50704 38104 -179477 297829 188005 -15658 119517 99392 67968 295633
12552 295633 77524 -267802 -97266 243033 -154315 99329 -23323 -144078 277460 -131434
12541 -143341 14217 23652 -128066 88410 29434 -35022 162049 -368528 -30199 -172863 30720
12529 -68281 -47731 -266284 135994 -151614 43783 -145346 -95219 254776 -167459 103407
12518 -98997 45013 20614 149220 189282 407519 528955 61251 26003 -131405 -183235 55289
12506 -205244 -191170 207417 5396 127296 -16342 162343 22944 85460 14434 -186947 -361687
12495 -361687 137137 -193616 -164089 -139040 -188350 -42219 142534 97769 36277 143293 21681
12483 79094 -170089 77262 -113080 -243841 -168115 184401 73089 89669 -72508 -19062 67804
12471 35472 -104413 -110046 48448 -86348 -112637 -160394 160895 -120923 88073 -301456 118516
12459 237597 -52983 -292988 -135940 -362508 -167929 -81915 133259 -249268 -5712 -92316
12449 -92316 -184774 145488 37761 287567 40477 36416 -39164 -202688 9669 -932 48534 78898
12437 78898 -195683 396112 -136018 -135011 -80702 -17951 3008 209310 -60331 127084 -79069
12425 97859 -281289 -77209 173562 -542490 -33765 247931 9183 -25890 -362819 -18377 -187485
12414 -187485 -125606 65382 162758 -21469 -243941 52953 -65376 -178903 -12828 286507 10807
12402 -96020 188904 339487 -37247 -200452 -33855 -129112 -78852 -100923 248336 98314 313532
12391 313532 -217432 83013 -89560 106024 79664 246682 145391 110049 242485 -72735
12380 -12993 245425 167345 -151353 241120 353234 511 112155 164365 -423526 143626 82532
12369 82532 29434 161438 41218 214158 -146210 6716 243564 83358 -255941 27739 -112572
12357 -119401 -127649 -158366 118203 13580 309665 67086 73664 -141958 21022 -243205 60457
12345 124466 -317871 14397 96707 150871 210033 -7043 -181495 -208060 -93481 104687 229169
12334 229169 353227 93236 401387 42231 30640 55623 136851 516537 176886 478079
12324 478079 468335 331998 94952 381176 -85543 345166 216914 -39505 395035 290801
12314 290801 225984 295945 62450 -271732 8488 379286 222132 -272834 -157907 231372
12303 66744 -115100 -74932 172622 282410 285416 -141074 -277503 383564 63917 293095
12293 293095 160369 77233 -32211 96563 -14881 -60101 14074 -61760 395337 -52633 175328
12281 322490 231456 -23338 224965 -151391 348655 173131 259217 293467 204630 203583 256333
12270 256333 82720 195061 463321 487990 -99687 245001 252284 30298 23393 283098 402615
12259 402615 -5650 89121 397667 -272287 -272010 245326 328803 -24615 67225 69407 194784
12248 194784 244007 129858 190747 55662 -34068 -51303 92283 105263 133463 66927 85902
12237 85902 96623 -350014 -37293 -46408 -17008 136641 134200 178512 -28744 181547 -73260
12225 232125 285612 -21337 581321 486659 304722 190062 564555 304607 109589 169571
12215 169571 463415 463014 309526 228413 204336 183753 268890 217747 216845 59263 -140382 252820
12202 308063 456342 326448 8224 168326 147055 386313 135140 348494 420891 246776
12192 246776 224436 402912 359877 177881 254939 314534 473162 291394 160575 88293
12182 88293 132405 470090 319682 67899 70381 142329 389294 602796 153506 80607 22140
12170 232539 319329 262142 284518 87494 415907 377386 215933 634946 161886 239357 168979
12159 168979 448690 -14252 75509 -6208 114402 -132386 -293634 -317416 60267 145528 -409480
12147 372354 239853 332587 271537 60390 154365 22157 48023 -273235 -85093 63277 451108
12136 451108 -21202 -121624 358537 -177361 -189202 -63673 59582 10081 405110 -154896
12125 -120023 -265011 197206 246300 -155053 -147399 99485 197903 364570 150684 -24941 60901
12113 -100399 18140 482509 305846 153266 -71060 309478 250643 -52937 -45333 65503 322066
12102 322066 72531 -54351 91103 318155 -77881 236554 329887 115852 44464 -79438 28370
12090 136199 203806 635698 29431 284289 321212 -52553 207683 48666 466631 248698
12080 248698 370079 90534 97379 26713 90761 -42351 52309 91599 255597 346299 329313
12069 329313 -106564 -48264 -30979 218378 -213914 177972 -47078 135946 384954 170228
12058 -7404 125059 -179732 438496 94141 -196360 147944 420520 -97992 -152005 30866 56693
12047 56693 -232897 -102507 17176 270772 236243 230609 -77915 36100 191114 -263222 -2809
12035 -294103 -139545 -112842 -145780 336449 -142081 -85873 202468 -11770 134808 -100692
12024 312220 -42990 105972 -159073 209389 190774 -13726 38670 106062 46071 135278 -4863
12012 458314 248690 -23697 -1022 267972 171920 -125477 259288 -74314 447153 132346
12001 -76802 268192 265332 -162002 154500 -102376 -86336 -177483 -292308 212719 180239 -58507
11989 -251787 44851 -201565 -43324 124278 2826 -55536 235235 258973 14043 -76819 -301781
11978 -301781 203700 61922 -211995 32406 217891 -7090 -246869 88670 -132201 -230084 245480
11966 128062 -88982 40232 161046 39563 -318654 66528 298043 -97039 -228257 -68276 -225707
11955 -225707 -152676 -154384 -276270 137626 100521 -12966 -28058 -153406 -334927 -50801 135946
11943 -387768 -79348 -109664 -2737 -206113 -198323 -43507 97119 -489396 58766 -12470 250574
11931 143990 33214 -104278 151228 71794 -130550 -34425 176257 -198598 -398601 -303813
11921 -303813 121199 -97206 -381457 102070 330183 -176532 161031 -164492 -123902 280132
11910 -283065 -251946 94115 192152 207335 376989 207001 -15306 -154007 274246 47282 -36001
11898 194580 -209968 34437 185524 -193479 82951 246995 -56648 178175 -27165 -210299
11888 -210299 55321 55327 -175336 -37177 -20977 -54989 -84953 -386474 93526 26708 327807 363836
11876 363836 103890 -7705 -360212 140332 -169332 -204729 -29027 -163994 150534 43320
11865 -221769 -88402 -145974 -118764 -269604 -159919 230563 31019 -40875 136165 203331 -214152
11853 -110183 -355523 -38247 -361025 -364242 232178 -188909 34521 -133341 80085 -138899
11842 -228732 -431186 -78831 150329 -8022 166143 123519 -126463 53227 16942 -16424 -102749
11831 -102749 -126149 -82985 -117720 -106696 -118280 -618854 -8223 -187450 -207356 -185695 -222790
11820 -222790 229253 -181965 61645 -88222 -69194 -224419 -18308 127796 156514 25198 -59644
11808 -81255 159592 -107228 -43417 109819 160657 -78792 42237 114630 -102394 -7813 -378837
11797 -378837 -56803 93924 248360 169917 169701 -339789 151438 -108798 -218215 -2284 -248082
11786 -248082 186003 146004 207679 136910 289701 10573 10671 227401 -263789 -277063 -216011
11775 -216011 -30401 -5481 166342 -221006 -16355 157123 -71566 316767 121837 23644 -77916
11763 -151311 -207971 -310780 32465 193209 70580 -25469 -70668 -255661 -101584 -111123 -126083
11752 -126083 -442043 85985 -73629 195014 70998 125491 206636 -110580 44470 -94609 120854
11740 92155 270457 -47196 -102913 -111301 330917 -122255 -76089 -19829 -41987 -94358 -115306
11729 -115306 -237192 -249706 6991 -7920 109813 -7577 -43093 397662 -111487 159734 -3744
11717 -2956 -352254 -73066 271523 -120818 -54179 207977 -159689 182603 54034 -51589 -27854
11706 -27854 3518 -33638 -30262 -63198 -43203 122283 40826 -22859 -87376 387059 -65518 74448
11693 167696 390012 177186 237540 332682 -245091 157399 247394 -235098 -254240 -57248
11682 71580 -157115 84557 416345 -84778 69891 267861 79347 -27988 11201 27860 122086
11671 122086 346931 236204 -134038 229357 -8040 -55833 66418 145945 -70131 48813 78700
11660 78700 -120335 -101643 -1848 137662 64709 68633 158461 329136 43212 49777 293219
11649 293219 60313 9850 66262 323346 156236 -183453 -289674 -278278 208114 102785
11638 105214 169831 58971 -214193 12575 -377582 -255445 125002 162903 -191991 181656
11627 -50115 -36603 -48095 295044 58904 -132069 292527 -306996 -130408 42018 -60287 2630
11615 1426 -87716 -181370 145173 -113853 147482 66830 -7449 189891 -145549 -174337 -50605
11603 81746 -48397 -158688 -531608 -322935 146555 -265575 -37796 -55600 3512 144589 11784
11591 299872 -91904 -58342 -103982 -90388 193945 -2709 -65596 -89789 376369 -13490 213231
11579 209735 95000 197964 171822 29074 -145060 125416 286272 67440 -6048 146528 158583
11568 158583 143598 94107 123824 29336 -33263 59166 -5458 193370 -41170 -99556 151511
11556 59902 -305752 216627 -68979 231980 197247 -18618 -175925 198203 -107602 21911
11545 40915 114110 242613 48084 373646 249226 102928 284346 95035 264652 227038
11535 227038 799509 -122181 71406 -174570 93965 85499 41148 248904 157216 -138881 -67293
11523 -23807 216338 -75677 88587 -118295 144213 90591 110786 128699 -48098 176183 385239
11512 385239 87176 447129 137230 -74570 -76614 372381 174304 364041 156315 -10657
11501 -223273 181187 -70306 82669 129117 12712 385291 -148392 -342106 55078 66105 118792
11490 118792 66267 48822 -26201 66665 9534 217865 37847 147901 27273 107299 -98573
11478 123272 -163231 -96180 516722 -144470 374475 10116 453008 368077 -188204 300638
11467 -47062 14356 -19359 169235 467508 133597 85167 110847 490520 280265 140676
11457 140676 63685 18765 26198 423863 390158 208715 -31440 90047 -51688 -95553 -39134
11445 238913 -126844 140795 302753 234355 250707 86544 -17976 79911 -102353 -197951 42483
11433 142803 307334 138240 130882 -298652 29884 130185 -100872 195754 -134281 -103984
11423 -103984 -146974 -268986 -72201 -355166 -121185 36839 297132 -294961 -21925 -198101
11413 -198101 12244 -149585 302759 -125817 214240 342281 130146 -102618 107068 -4266
11402 -200198 229827 -37292 119007 103304 70464 -61690 26119 168902 -47246 -48174 178948
11390 62354 50827 161454 -224034 -137457 -58502 136769 -156344 221131 -112112 -154562
11380 -154562 -160241 -68030 -53763 168399 169993 -179586 -98437 -180139 -218191 -166810 -43964
11368 32664 -37758 264284 183286 62028 6715 -257118 -62630 145498 73559 126841 74096
11357 74096 -34295 55427 -253009 109568 -283352 -389125 -127887 -105553 112450 -386290
11346 -354040 -266684 -210804 -111384 -145637 -56979 175496 230042 153140 266356 239097 168206
11335 168206 -372677 -123256 -327994 -213048 11619 248930 -174237 -228255 27703 -197176
11324 -95217 -10668 -13209 -200501 91502 -249850 -125377 39407 -277244 223604 114711 635
11312 -17222 409079 261188 -237818 -95915 -16851 -170245 -42277 -89200 -74584 88695 -315937
11300 -259132 -364337 -179408 -98124 -143821 39559 -367400 35061 -26470 -36961 -170806 313263
11288 -5341 178733 -17237 17506 10788 -1307 50680 7067 -122619 102068 -185805 -122965 33131
11275 286249 24138 -33752 143125 -4139 -30100 126906 53632 -3198 65046 -1036 148014
11263 -131468 186598 -157023 -141485 -65177 -1410 -59254 -98929 -135128 -15978 36495 -8822
11251 217307 104775 -171732 -107689 -76402 -196030 96262 129053 42474 6691 -41220 -10227
11239 45844 156369 -206465 -38019 -173794 -415406 170539 -57182 18128 55581 68300 25311
11227 26546 -189178 -41872 -128988 -315120 258711 222492 -50039 -168191 93745 55425 -227695
11215 -105936 -24920 -93721 167163 -80093 2003 -90824 -96990 103569 174242 -103845 -288703
11204 -288703 -138541 -405136 63531 -192950 -170719 147990 -183383 192357 -154440 -66841
11193 16708 -317943 -209537 237179 -186260 -54965 -254638 176558 52695 -365653 -188914
11183 -188914 113408 51441 78525 83634 -106307 -177269 -1975 40675 -8419 -152966 -62963
11171 47541 -53580 355766 256996 35452 144681 -75389 19918 -120780 -48782 -39925 -78410
11160 -78410 -173646 10110 -81089 -44930 -324107 -278876 -70383 -219754 -207515 184078 17183
11148 -112281 -364310 -263335 -107080 230975 -197694 130592 -225701 -141407 467038 -190893
11137 -133303 -44275 271001 -214373 -426501 387984 -274518 -37151 -132930 -228488 22828
11126 -49129 129582 281222 -165312 -278525 -283094 153174 -193120 -39778 -310529 117954
11115 143963 -3774 173528 73018 -117597 193934 31261 312379 19740 127590 250033
11105 250033 -64046 312980 143081 -157379 313192 109822 66877 225256 457731 48303
11094 264655 -41520 101464 331042 5318 94647 73226 52999 -47004 -31101 226745 350878
11083 350878 497190 32936 81369 541516 72341 -49039 42800 482671 246324 337395 318477
11072 318477 358605 481308 233761 78691 454225 310038 342455 467339 314378 401544
11062 401544 627123 343557 -124538 521399 613808 365338 684731 348466 609391 834234
11052 834234 597450 548170 632758 1105887 933222 492054 673335 577280 459719 662100
11042 662100 745970 769497 537075 1102259 712744 767070 911257 871044 965720 705547
11032 705547 285251 1014096 392226 1055614 667466 901489 985676 519501 703097 902621
11022 902621 609810 1006133 1126045 853948 699368 572943 615376 713801 797202 562546
11012 562546 749188 526878 680558 730824 722284 535991 646317 736316 826824 769495 990687
11001 990687 699023 392692 853989 504900 644189 583015 906723 915048 761099 686718
10991 686718 735517 833408 433998 513428 1100758 712516 791155 518731 1005432 945560
10981 945560 652238 965388 873963 1205578 1153437 1078999 1602848 1415018 1493542 1860920
10971 1860920 2065417 2498711 2721866 2591846 2928096 2478007 2836500 2902149 3056584 2783371
10961 2783371 2237394 2104142 1765233 1903883 1816616 2010240 1841272 1934421 1964394 1805199
10951 1805199 1481606 1606216 1359874 991819 771396 918219 706199 831136 573354
10942 573354 425972 537300 288416 138783 212323 211481 124823 257622 -51678 155529 152810
10931 152810 137048 62974 4994 110973 -109895 219549 -18419 134308 151306 220949 278163
10920 278163 129440 16894 89966 105502 -6699 189960 90230 44312 237057 98014 18938
10908 34839 -46130 108534 -87662 -105582 136942 228382 -73272 7013 37637 75473 149543
10897 149543 -123773 87122 -405136 -79518 98785 -11179 -226490 331705 -69864 -488704
10887 -488704 225982 87282 74505 -242554 309816 -34925 76974 4421 54637 -26492 -126016
10876 -126016 -100135 41936 -641408 -29635 -233059 130962 81732 -139863 -104294 -98797 -51093
10865 -51093 -269486 -179563 -141246 -49051 22795 27480 230561 -81740 283069 10110 -173179
10853 322337 261059 194364 15031 -176234 -60019 -10064 188401 -173052 -350823 -55130 7258
10841 110550 -270903 278588 -206098 23261 -112694 -204204 -18865 -316445 28920 -47382
10830 115933 -348 -117757 -12781 -329858 339066 14665 144796 117070 -112644 -224809 155085
10818 -204996 -50280 -208684 28484 96374 197403 59149 142326 131457 -474020 220096 -375552
10806 198737 -200015 -83913 23064 -356888 38665 -82700 59863 35372 -279127 -293943 127919
10794 26457 40897 -119007 -92309 -182858 343145 72187 -107506 254359 -393644 -78731 -149561
10783 -149561 -87138 -254162 68649 230828 -224541 -291328 -193012 4083 159687 -87680 -109610
10772 -109610 36951 -6615 13101 -19690 -165728 125684 -231822 80661 -242940 109060 53835
10760 58067 91643 -443919 83633 4834 -85338 -295375 211243 -231147 -550386 192700 64412
10748 -114102 84262 53135 145013 -308335 -67669 210220 -186651 196357 229747 -23333 -105249
10737 -105249 -193836 -140057 -532930 359835 135283 74070 183772 59554 134915 21407 -182545
10725 39363 -110574 -31142 244822 59030 25440 -273290 155538 -189491 150058 -84714
10714 222587 -51808 485373 10719 -62144 34456 254960 -77743 264555 -221837 -127679 189065
10702 -33544 -70116 -304929 -2736 -30837 -327032 262200 115499 -354405 -55675 -384045 -218265
10691 -218265 -177748 4252 -107368 -183518 192815 -63333 121479 50602 -454988 148308 87091
10680 87091 -120383 -100369 -188191 -177449 42718 -93172 208788 66630 -25830 297812 110539
10668 20229 -30595 -222640 -94313 -47633 -179692 -194317 -171663 269807 180427 115365 -7123
10656 72985 15802 116185 36759 -151633 30428 62507 -16200 -134049 129879 -85699 7473
10644 94556 -21075 -242189 20777 -141241 -73507 -225459 28667 -65394 88253 -153613 94602
10632 88836 23731 356179 -120003 -202978 -213343 102346 -237982 -245172 -234047 -139302 24307
10620 -118206 -9887 -285613 71068 -123091 -241128 232407 47763 71936 192168 -311326
10609 -68254 -217267 15140 124542 77199 6270 -201880 -120033 31084 245592 -262133 -311280
10598 -311280 -7129 -76030 -304047 -45095 -62486 -148917 107673 -110387 -324946 -292944 27056
10586 213708 -235334 -134000 54311 -192092 -33256 -404435 93006 -284510 -30350 113583
10575 64994 13139 -89519 -109818 -101810 -114167 -103499 -351627 243977 -1989 -14192 29 -57107
10562 51437 -95485 149350 -107375 91000 -341619 144422 44060 36596 -24665 -112521 -188033
10551 -188033 -219283 -87275 -176359 -191983 -266660 218713 49884 -80751 158328 76746 137784
10540 137784 148 -10671 113482 138454 9425 -74788 203177 168949 -46085 65877 -126208
10528 -19504 -337660 -157979 -119819 168117 -70904 -135687 -329675 42028 -163188 258928
10517 -163520 -170631 -90398 -205277 43169 -26566 -260701 363805 75046 124928 -1009 126329
10505 -29850 -109950 253173 -127544 10187 -267043 -258363 -129524 201614 -465567 -72481 -161561
10494 -161561 -245456 -42362 -209165 -66119 111235 -177858 187202 263478 197397 257601 225619
10483 225619 84006 76523 -208490 321181 7092 413086 118689 -52967 223190 355520 87699
10471 194562 223316 -44197 -233372 133953 83652 -95022 39682 -312336 174945 34068 47176
10460 47176 -198064 235887 -44945 5317 107232 216549 200763 556985 -43299 -26101 -191421
10449 -191421 -213762 16683 151284 137364 58405 43005 151771 -345101 -58559 13568 -202460
10437 8516 -325686 -28000 66677 207614 3959 -8696 -8671 298654 -188886 -14257 97362 96891
10425 96891 -33149 18886 62433 -192361 162084 385168 -5751 -4724 -169492 -42565 3906
10413 -321848 -189174 127060 98307 -1443 35463 116669 71650 -28910 -98745 -135482 115767
10401 158983 -185445 -12652 236157 -319064 -16896 292558 -304686 -362105 -85887 257719
10390 116107 163510 59362 166650 192338 306301 234795 -222712 84478 206687 189037 -25504
10378 -63336 -1469 421602 122260 46239 57440 -60952 122287 113248 286806 116636 509058
10367 509058 294083 194749 101006 223195 394135 721558 488888 449971 326047 357486
10357 357486 319634 352441 239340 40081 152911 357437 290859 400849 769289 431147
10347 431147 108471 534471 96580 407804 145020 68177 445914 152318 395242 179479
10336 198638 241631 658221 329642 21149 163025 6580 194422 28752 62129 -57731 -102157
10325 -102157 142019 -59174 169049 426574 466064 -54349 72539 106893 329761 -39066 518
10313 2476 -55278 19241 -376277 269731 -74668 -156910 48478 130894 -292385 -470771 320609
10301 -100232 -37474 -75355 -58482 -158649 421533 113136 -190188 68194 -213433 140097
10290 -19765 65078 -449673 -52187 96177 186290 34762 -174834 -83883 -215893 170953 43556
10278 -223957 -167306 -68935 -270113 -152028 19538 -73385 206590 -4431 -154220 190606 234433
10267 234433 -145188 293021 -16548 -36262 -244554 21734 -308028 37243 73612 122408 92912
10256 92912 -100817 170647 74617 417627 355161 302329 348587 243462 5055 248298 96171
10244 -253804 244033 10003 17483 -618619 -33974 64950 -195013 187623 -40648 25427 -215967
10232 -282479 -82422 21680 -16822 87874 250896 97844 -104865 -90377 154326 -167804 -116830
10221 -116830 3946 -344583 -24152 -35374 131024 -343233 -437082 -106300 219878 53096 -68552
10209 335344 -125305 253763 -62120 184538 44716 -183058 387596 186322 105528 -340385
10198 -191524 103479 -113297 -210082 -47496 92776 -19268 -7330 -116577 -264599 -18587 -18351
10187 -18351 130823 -144440 107075 -350201 -128226 -97486 -117462 9547 43269 -65966 -298366
10176 -298366 -144186 -493137 -14616 -255393 -3170 -193495 354925 22848 -63483 136376
10165 -122526 -30897 123490 -206442 -3867 -541702 -232326 148785 -144328 -102022 -143901
10155 -143901 50049 64874 -48967 297407 -167760 115539 -91821 -450007 53417 -10522 -48820
10144 -48820 -336408 124505 181944 -161136 -298346 -217317 98755 109744 -306994 -80556 19465
10132 41794 -32236 -218427 -444735 -131341 -83730 22612 -129736 322287 104273 -142325
10121 187126 -93565 86957 -42045 -453679 -180451 -84159 -153149 -67456 26305 11675 213753
10110 213753 -255080 -132020 -97940 14977 70448 -159217 -550449 -157908 38879 119721
10100 119721 218135 -228662 221133 64389 15086 95877 -179731 95317 233627 31959 31487
10089 31487 -75546 -83698 -3806 53888 84699 -203549 -222171 91970 -35325 -45235 -409516 -158003
10076 107067 12198 78275 -82968 158787 -149936 -103304 74025 -58944 -51952 -206702 -54932
10064 -212632 -66118 -98741 -391347 -46394 3808 16654 -211327 134962 102968 77770 216376
10053 216376 -20441 -59991 -205904 -320670 -186181 -238481 -281149 106458 -388258 -288786
10043 -288786 152319 -197269 34544 -21311 -359491 -41450 35804 289478 111202 -355339
10032 4390 41939 -139973 94081 420235 34992 95600 -128904 51546 -379960 -342404 124292
10020 253536 -150142 78496 -87032 1653 -189906 155956 135412 143847 63543 -636480 -64049
10008 -180940 -17222 -89878 -284115 -188675 -830 -73202 186548 73536 -55714 -177092 -52318
9996 -80340 226055 -176474 -61887 268191 -187033 -82500 134351 -430524 -124658 20093
9985 -268197 -246603 -172612 -48614 75256 -15222 147247 -124176 -32018 -176134 -51067 -303087
9974 -303087 -148781 -110245 -110490 -381377 6957 -226324 -176586 -87022 -6790 -2638 -201649 -442774
9962 -442774 -57392 -289111 -108526 -351246 149967 -214221 139408 -256081 186371 -115622
9951 -334807 13890 188542 -80186 -53011 -204180 88241 383380 131488 -313031 -37916 153781
9939 -120417 -217138 97231 -375873 11468 39760 -354647 -245334 94736 120653 -51966 113331
9927 122926 -361502 307749 137543 -115816 -67364 4671 -502880 6647 -161210 133365 -24900
9915 -96211 -209792 -30492 -83204 -112715 -201512 -132070 72225 160895 54091 51247 284633 84946
9902 71148 -47717 -321514 -422494 -162862 -206128 132163 76638 -29812 200351 52434 -204323
9890 -112686 -116728 -213922 139399 -158739 -304244 -277001 -59306 16437 -99893 -90229 6307 -96595
9877 255305 9661 31240 -256354 84704 34668 -205556 22124 -167778 53880 -30932 -67831
9866 -67831 -111552 83101 176635 399905 -248557 -441003 -71529 189968 -27659 -129505 6692
9854 328272 96419 83672 22165 433093 -351696 270089 -272159 -249384 -96816 -95203 235384
9842 -212768 348404 150775 -80122 -72664 -33007 -54805 133738 -184606 -59716 -316687 60832
9830 -433717 121621 161511 -373940 -1650 232214 133939 -29529 17451 32076 -198457 183294
9818 127177 62570 -146997 -235873 -25890 161582 45767 133682 -236596 -226361 -142125 -379254
9807 -379254 168729 -33834 -78973 39617 -188192 -192920 -286299 -151653 -203605 -13871 -144914
9796 -144914 -70795 -108107 -45057 -241640 -50667 -145983 319811 64569 -280675 247254 79094
9784 -110430 -79299 252316 68084 -125758 -150552 183470 126253 68459 116302 -6342 -230022
9773 -230022 -94020 -29057 -258050 2516 -530728 -166899 -163919 -90556 -58630 89083 -329209
9761 58252 -92646 -217935 -56523 55162 -437948 -95509 -207713 -71551 -114852 67921 100173
9750 100173 -197201 -107247 -63317 11734 -285314 -12901 -203435 96991 -154727 -160238 -84634
9739 -84634 -25133 -327202 110822 -188925 89251 -151446 12011 94245 26784 126220 103443
9728 103443 -129495 -356844 -235367 -175002 -49433 -107328 -156548 -146623 319039 -29608 -27154
9717 -27154 192454 -11337 -73186 184602 34833 -261326 -68151 6308 -123270 90993 -192728
9705 -175859 -145647 -288980 -295612 -18434 105441 -58555 -87045 51729 -111461 -78292 -131403
9694 -131403 -189642 -181318 -53408 80568 117091 -288366 -238421 -342069 -177136 -217705 -289055
9683 -289055 -136575 -184976 46454 24962 28152 -189232 16963 -207212 -162082 -179243 23899
9671 -274963 -273236 -93507 -298430 -98637 149722 -162537 -329120 -80428 -269216 -41303 -220243
9660 -220243 338410 -108977 42824 -108111 -239438 -268414 168049 40425 50853 -14220 46463
9648 -76764 -97993 17691 -21288 70438 -358929 -108800 -427506 87558 262330 -209580 -18612
9636 -313317 -6755 56594 -104518 38290 59491 246563 -97705 309384 9537 -296141 -39520
9624 -195329 -142590 -321213 92368 -23414 -416415 35699 -28071 -16953 -104718 120647 -88919
9612 223365 61329 341524 127784 -21681 162305 57200 123376 -426628 -87463 18859 235414
9601 235414 -267574 272375 83414 -151911 315016 39528 -191226 119471 65870 258413
9591 258413 -141823 -185203 -173214 130685 -14716 -180998 -11269 -346518 -84954 46982 -253415
9579 -67117 -414729 361388 -272149 31681 402 -301366 -100968 -76352 -229208 -79726 300118
9567 -6336 -34891 -153515 -283596 2280 -313665 -248060 -125619 -7758 122631 -127877 -230099
9556 -230099 -117317 -61514 58844 41190 50771 199794 -71766 -226521 -203907 -92495 -287024
9545 -287024 -137223 11425 170682 -77867 49908 -97136 -197265 18940 -279314 22575 -42146
9533 322286 -3777 -361339 -116513 -221572 169730 -103448 82101 -82073 -155194 23533 -117124
9521 -151993 -241735 109721 -79776 -299457 -48785 -71873 -103209 -72797 -206343 204628 -112192
9509 -178988 122981 243118 -21045 -279922 -149114 -118175 -97266 18478 -110184 -59489 -6985
9497 -360656 -66244 -189449 -88758 -173714 8240 -63055 -102252 -153732 132748 -139660 -173945
9486 -173945 -278546 -57292 -19146 133597 -55444 -159821 -118155 -407459 -339134 -187612 -14302
9474 -265898 -167541 -132301 -409689 -57662 -302443 35482 -98081 -209205 -285888 -38292 -168024
9463 -168024 -265028 -57081 -169877 251680 202605 -86937 -103981 -302337 -196696 -326870 -11696
9451 -110984 94859 135624 -232672 11124 -182089 79315 -101477 74055 316174 -68957 77941
9439 -15689 -66821 -221038 24183 -43511 -145800 -21475 -294728 96815 -107632 -101880 -244640
9428 -244640 67857 -279812 231910 -9052 63860 -188932 13510 -243222 -56249 97044 -391224
9416 54377 81486 104642 61092 497028 66992 -333512 -117736 -81581 266503 -11470 2347
9404 -138985 183970 -132828 -240202 53204 13689 -276895 -244372 -148593 326678 73039 -428554
9392 -106815 -110016 -88581 408282 -294015 112872 112058 -151472 -67330 -412580 -154810 33169
9380 108049 -315778 20890 -135530 -133836 -273844 170530 218214 -66901 445621 -77184 -13817
9368 164809 58940 36818 91584 21488 174767 -150619 -82763 -198705 -357935 84912 -254493
9356 -260189 -492957 -129529 201481 -91767 -466474 -88373 -22987 -400168 -203677 22451
9345 71060 86315 -151512 349003 62370 -205783 -95106 -85854 3667 189582 42355 471050
9334 471050 136119 164090 -64581 -153946 -186392 -183982 -24087 -202455 -82164 -336925 -321377
9323 -321377 78629 111903 -289840 -110791 51679 22529 109969 142308 -112201 62039 -22263
9311 -127572 -218112 -15334 55041 169020 -34431 -45519 -100441 -220027 90851 -245955 -249537
9300 -249537 202707 -195249 -202992 162342 85033 -175152 -312971 -240254 178130 -6066 106035
9288 93916 65638 -343533 -173751 40867 -161519 80971 194472 -327096 -155053 35240 -185923
9276 92065 214381 -60211 62792 482440 -217023 -86989 -158813 -106122 -99157 70885 184409
9265 184409 -261278 -74309 -162296 1297 -100474 334304 93786 163288 -56564 -466262 -407521
9254 -407521 -86351 -240080 -93096 -84350 -152857 64868 90292 -3051 36416 45257 -67207 -315974
9242 -315974 1342 -133482 -96840 146851 341705 39468 -164517 -342203 -83263 -210389 178785
9230 -48809 17264 -25207 -317803 -111276 -128531 13451 -83005 -157384 -69014 -7560 3429 -164190
9217 189882 -226009 -151648 -212879 -112925 -340527 4486 -73027 -95659 -304445 -393951 125001
9205 -143749 48335 -29589 222484 -256628 -299094 59549 -300694 -179107 68342 -109918 -326455
9194 -326455 -43680 -106996 -118285 123389 -162091 2621 -194090 97726 133020 166563 -102539
9182 258425 175951 -271570 -406471 20971 -35488 -120555 -201506 141114 34296 -81330 -85775
9171 -85775 -41509 120501 -145712 -207106 -33118 -179320 -16623 -19884 -30718 -169192 -12964
9159 -136855 -63555 110513 42153 -153538 -178453 70830 18136 16700 -161594 -36185 -97434
9148 -97434 -147690 -192657 -49835 -8098 -147844 2117 -254508 -11627 41797 -269850 -102056
9136 -227477 -166246 254874 -380135 -13677 -26799 -72097 172938 -262709 -180349 -27525 54325
9124 -16216 -22893 -120380 -26169 -82679 94165 239819 -197339 -312192 -158487 -397461 38647
9112 -198527 -49467 31964 -314195 226613 -124507 -292569 -229992 -183391 -4631 77472 -393646
9100 -86849 -201743 -176058 153927 -378077 -120917 -188031 188640 158370 199095 -82293 -230060
9089 -230060 -217613 155471 216926 167249 52999 130853 77730 -471895 228312 -44060 -334735
9078 -334735 -133252 112061 -294866 -291147 -167537 -152681 -29944 -138288 -9585 60700 191827
9067 191827 270161 -241338 249875 -32756 312889 -126311 -16638 -27332 -124159 -155960 -248705
9056 -248705 -263976 -44431 -172875 -66359 -210329 -123408 -27410 184495 191529 -157511 -212731
9045 -212731 51392 96287 1873 -40326 -85852 187764 -136220 7338 -322479 -175063 -149990
9034 -149990 -10209 -177913 -109102 191479 -14595 10605 -199166 -217232 -534915 -221320 -271610
9023 -271610 -217637 218267 -141962 39127 224398 -104389 -332670 -61668 -57341 69824 -288170
9011 87427 59427 -219531 -97077 209419 42853 -198734 479999 -189663 177475 59989 -37319
8999 138656 18388 -284642 49721 -59210 -188157 191065 33736 -199915 189660 -327287
8988 -415124 109491 -207745 28478 365985 32200 48914 116396 106376 240185 -110139 16038
8976 -262242 261078 18893 -372878 -14327 39889 -251406 -11894 -40417 -105116 -455810 167999
8964 238412 -206382 -217630 -231041 -24324 3707 -209662 -151522 -33953 -92467 -10412 -101845
8953 -101845 -257870 -34601 170959 285292 77823 -76994 11467 -195018 16158 -181641 -269524
8942 -269524 -111977 -66802 25118 -345693 292526 58311 107497 -182279 -239046 115630 75840
8931 75840 71378 274660 7510 -65053 -367115 -87625 96345 -143666 140433 295834 187714
8920 187714 2182634 10082375 3848920 1420424 480445 180146 -254647 -124328 84156
8910 261809 19295 -240340 -42115 401728 118919 118512 248607 143317 -17928 -237529 225271
8898 -102311 -179675 200258 84562 -244832 103872 -350556 -511158 -347110 1503 7979 17038
8887 17038 291700 35565 -331384 -36537 -179639 -103835 273355 -63885 -39760 -60086 -269159
8876 -269159 247843 -89091 -355060 -85931 236571 83715 1077 -211747 148799 146151 -154061
8864 55069 138994 216223 28315 -142581 133258 173386 -34289 109361 119702 -239301 -87934
8852 13913 74338 30613 -95964 -114360 -162177 293487 -194573 -117458 29208 -183265 113256
8840 111242 -109623 -167641 -5433 205163 -42412 -136529 -84930 -114865 114072 91791 273950
8829 273950 182016 273004 -36378 -284016 157070 -138451 -217735 -220483 49623 85797 -1985
8817 -192723 -96395 -195717 26889 -245911 -27975 -17768 -164619 -253626 57537 -148479 -107285
8806 -107285 68459 -78101 208807 18994 -132968 -201844 141402 -104693 81750 -45717 -265108
8795 -265108 -273597 -208273 -182497 -239617 -13931 447999 217245 -123125 7185 -106385 58344
8783 -78258 -44283 -156412 -82015 -326807 -132949 -210360 -29551 -193430 69082 -27419 4647
8771 -80304 151303 -32390 -124010 -117768 -97567 73058 -191664 -54375 -261681 -128354 -264200
8760 -264200 91678 -33248 -87674 -146278 -165494 -6856 155078 -66493 -96211 -277873 59381
8748 -500808 -179512 59633 -229452 -1004 -166821 -30531 -16205 -208932 132481 3605 262272
8737 262272 22344 225161 -236159 -61998 -5452 -59611 -62446 134801 -177938 -473436 -10375
8725 -252807 -511762 -32394 -124564 -191487 -345079 -22759 -77940 -185279 17785 -152331 72537
8713 -294604 268149 45112 3842 -188825 88008 -136307 106638 213124 107414 -245399
8702 -101148 -132390 -21082 -65589 -359892 -416120 -77174 -404262 264111 28717 75184 -41804
8690 -86495 16190 -129698 -146628 11099 135604 5630 5318 -178164 177794 -262186 -174909
8679 -174909 -222264 21480 -126861 -108520 2298 -236714 147082 -62407 93958 -126206 160167
8667 277373 127794 -122427 -18467 -304594 98687 -91308 -159501 -29256 -19712 -27522 43482
8655 301363 -56945 -126198 -534183 12827 431319 -478600 133967 255958 -19613 -26653 -160219
8644 -160219 -276708 7200 -165405 96924 103397 -171696 144365 -321181 25206 -64209 -203275
8633 -203275 -232553 -257746 -77014 -152107 135830 -435 -87865 -40768 -26744 107444 26586 -393126
8620 -215867 -102831 -286099 50368 29137 -45649 -153517 -92000 74558 -163772 19266 -210665
8608 -188406 -10980 -303531 -120379 -66152 -87965 -154346 214428 116301 -42272 -530000 -113706
8596 -193592 6781 2172 136700 133391 -156238 59164 160013 318876 252006 -100609 -48442
8584 -240558 -195482 -705 73928 -152930 6339 -11097 -152387 156226 48792 437985 16148
8572 -204060 -172811 -26975 -111831 -159815 -109490 297227 -156805 -45704 57732 -224134 -353850
8561 -353850 205033 -63956 124794 100324 -87642 -51828 -9216 -67840 -120695 -200697 -93027
8549 140897 -450241 92740 -290053 -73692 28002 -145889 105432 -236826 110652 363166
8539 363166 -82683 -28256 -118654 -167536 516761 -206704 64813 -402753 -80510 85140 86254
8528 86254 126420 -24398 -275947 34037 -86655 -20539 -114620 148975 14993 80411 -120867
8516 275122 -421715 6359 280246 -161683 109944 -102617 59293 -14530 277279 -352657
8505 -96684 -53237 -28240 225149 224119 -96831 69273 -145616 200276 -299879 209537 -172965
8493 -460821 173550 -27795 131021 47555 -21372 -97808 63309 107317 90650 256182 130053
8482 130053 -102027 -4463 266122 271709 -325155 -151763 -68131 135871 -182082 -20238 110074
8470 -306065 301145 58953 143273 -249594 -204138 -45434 -148911 64023 -42213 41246 8490
8458 446903 181795 -262820 72191 391948 -119679 -77087 -343586 -108497 -380186 -14534
8447 -49898 -46938 36635 -57576 -128149 -309011 35390 -229289 -342905 -65522 -85109 324658
8435 26115 -234130 196781 -63020 132552 -78703 -129476 -52009 308400 97631 119593 -49644
8423 -333723 -75590 175415 -55198 -73998 -239417 340812 -202318 -246402 -154090 -261891 -365877
8412 -365877 -32593 -194939 -103945 27012 202420 -113640 -57797 53844 172258 84972 218494
8401 218494 93128 -211016 -1750 -308940 -147695 -193490 -82027 154897 203125 240874 -37368
8389 -60001 -221114 20599 -162005 -41131 -59070 -98344 -335322 172622 -153582 -170936 -188582
8378 -188582 -17730 178904 -275578 -13546 -208576 -203066 -120718 -63477 -59185 168874 -367744
8366 -355422 215903 -47667 -87314 77847 10693 -6205 72299 -2829 141379 166046 165350 21343
8353 -159832 -259610 -96249 -120083 149383 23931 -356591 -430 22544 52129 -187156 -180086 -9690
8340 259536 102556 32979 110602 -237681 -47293 32816 -183797 10172 54131 40685 47911
8329 47911 -244909 212753 84008 -101442 15833 77503 -86356 -48136 -368893 97818 -145576
8317 -205313 -3393 -259825 -230548 765 -299183 -312564 -166708 -38820 -293501 63176 -28799
8305 -132537 -14432 18372 71326 -94636 -201023 -222651 36141 -38288 -42893 -165712 -72966
8293 -148160 -57391 340683 80104 10767 -164597 19600 -172823 89517 -61425 -239179 65923
8281 -228209 -102986 -14033 -55127 -125711 -195209 -266743 23199 90532 -135107 -276662 -89050
8269 -111454 87312 -48216 56443 -91462 -30915 -132826 -80297 73312 112967 -61719 227539
8257 -15946 -138620 135084 -69115 -230521 -70346 -75165 112957 -490247 -51285 -290434 -55699
8245 -51615 324972 162886 -272390 -32427 -132091 -228018 -104448 70781 -188296 -175592 -110242
8234 -110242 -218007 195587 -176503 -152535 197604 268930 237808 -343873 67376 33785 82603
8223 82603 38883 -201209 6018 824 257213 -246412 -342711 44673 156957 39968 152112
8212 152112 89260 61870 -113979 173526 -32841 -142011 27976 175510 180230 104852 89467
8201 89467 -146185 200283 129369 -124169 -193759 -191559 -84942 -144869 -270930 148742 -33971
8189 -144785 63466 -15181 -278335 -93950 -316683 157874 -44016 -197550 -75570 59601 -58787
8177 -7566 -375589 373038 -88236 -114109 -152357 -31863 10552 -144351 -519927 49175 -159106
8165 175927 357902 101767 -4675 81617 -65077 -26576 -187522 -177225 -77485 5897 -331631
8153 -53765 56339 47633 -46393 48700 -26148 33371 192140 235483 -46125 149087 201577 -86284
8140 88636 -89324 161427 -149989 241298 -265336 55679 -473710 173619 33328 -376681
8129 -29554 -122293 94343 83347 13545 -469308 -151074 76497 -357198 21948 187680 -15199
8117 58006 -111775 -168039 -214953 25174 -217271 -234797 104449 -158200 -348867 -114634 -225653
8106 -225653 299833 87810 65401 40922 138229 66320 -259916 -425286 -236058 71230 38889
8095 38889 66475 -195924 -52930 -85566 -169802 -21646 52484 113437 -41814 81482 -38720 -162789
8083 -162789 -128206 176784 -161450 -121015 25973 258642 -49126 -155156 -67314 5133 -291198
8071 -346490 150486 1675 -33720 108788 -22452 -109816 -64698 -55872 226995 -318580 55581
8059 -207733 134969 -187654 173460 101050 -338125 -260727 252052 254143 -35164 -159016 -186406
8048 -186406 130384 -225920 -163790 -301691 -33595 103284 -170951 -497804 351447 133248
8037 -160827 19268 -369035 -76268 81108 -108713 -119877 -15205 174576 -173940 97715 243964
8026 243964 -199993 -79989 98088 88246 -277425 -284335 -131950 -100364 172243 90960 -186287
8014 3601 -248962 148574 17808 163167 90787 -99403 -500053 80374 287699 -181424 -180842
8003 -180842 -218504 -55714 154025 -281516 62552 -188702 -396977 -96040 -89979 14921 -46623
7991 -61751 -83938 143960 29300 115395 18464 -119461 -19166 73984 -227218 -195401 -213216
7980 -213216 9442 -290940 -212263 279294 -9418 -75828 95049 -20052 -297927 119588 49261
7968 -273647 75043 -259483 -112162 -236278 -154963 -111737 340794 216127 -111513 44430
7957 -2329 -171566 -148657 -137032 12013 -1138 -8921 -20282 170453 -190498 -118598 320396 83847
7944 -284955 -392244 142537 146670 192465 -35138 -165820 -20230 97220 -8474 -111785 -127499
7933 -127499 80944 53176 312336 145282 38626 221716 -220951 102518 -201746 109733
7922 24091 250283 67480 -188349 -145469 145983 -360437 -142543 91219 84303 127292 93903
7911 93903 -6173 -173469 240472 242019 -52439 -42496 -119301 76985 93998 80093 -344295 -110380
7898 -79803 -30731 -232397 -221358 -115398 85021 70022 -128596 -273020 87952 84046 -183700
7886 134800 -153861 -208331 -640540 48146 -264740 59042 -165276 -254144 -149574 -284693
7876 -284693 70429 -194986 124822 -97938 115329 -129032 -402225 -354355 -228163 -160852
7866 -160852 91346 19427 -18429 306224 211032 -110369 -26030 -144023 -103897 88251 265246
7855 265246 101572 -81243 -75599 6731 175368 190905 -36322 501212 481616 -254562 6876
7843 -200741 84632 -410376 -228535 203497 209684 119413 -188866 443204 -14066 -14448 88366
7831 -88491 -130090 -87991 -30435 -219573 -281097 -139445 39585 -113219 -101860 -113285 -65359
7820 -65359 -156400 112163 -6942 -68171 72645 32709 202726 -55619 46958 -231880 -340158
7809 -340158 -213877 -353609 -57679 179155 -50896 295817 86896 20523 323413 -108758
7798 69544 348916 -178586 -182295 -113826 161903 258479 -152298 -77568 116346 -15110 3532
7786 -59686 -118492 -222438 -279149 -207562 255549 -209251 -93649 -53978 93455 -193286 -71728
7774 58616 -135760 -34420 -264043 -41824 25754 32713 -209695 -137402 -107473 -262789 451421
7762 126108 -188757 -122222 208025 -310990 -60965 -208706 61512 -329774 202620 -1647 208089
7750 -134668 52165 423709 248016 -291310 -176261 67006 190359 138109 -12878 172510
7739 -51195 235414 -213131 166124 19558 -245481 -68713 110198 -52683 264005 260813 -278807
7727 -45449 -122774 -134165 3138 202666 -11523 71521 8873 -242455 -33588 88773 42642 -135879
7714 -389617 121451 -100896 -117018 -211621 -250305 192262 -343916 -157004 -233870 -165872 -183106
7703 -183106 64291 117687 -59253 -60737 292793 28792 -144154 -51078 119127 116408 9186 -180014
7690 53146 91119 207847 -303685 -91766 -123010 -188898 55510 -56264 242624 -110329 -289054
7679 -289054 -181385 -108329 -11241 91831 -33749 -30952 -253507 -197832 -51039 -86147 -2449 -200588
7667 -200588 -81424 165820 -274686 -404935 -199919 157768 -132068 -63961 -90305 -107541
7657 -107541 -199092 151249 -4044 -63570 -446224 -64628 90871 -141028 -102100 28979 -286572
7645 153606 168856 -70032 -22938 188694 -194608 27273 292087 -46359 232785 148290 87351
7634 87351 -240196 130911 199893 303775 -127052 -114572 -470928 -26135 -257760 86943 -249458
7622 149173 111147 40868 -217782 171522 -269571 284262 -369433 -20074 307355 36229
7611 159499 49484 -344496 -97446 -199374 32995 111657 181600 -236826 373162 200525 28287
7599 19947 66447 -7313 203198 -95781 161498 120455 120357 10219 77050 -322305 -209822 252768
7586 184590 -84848 -261019 30408 204429 -99320 51993 -2459 2681 -309021 31630 -139083
7574 -231653 -106121 300560 104915 -211887 -206649 199408 76615 -13719 -35384 -31201 137531
7562 49264 100331 -19820 176528 -419971 23422 9527 -36449 40155 31260 -153646 44156 -233544
7549 -17922 41415 -21293 -236444 -452945 -31535 -123519 -111581 83061 -183453 252672 -129275
7537 -122041 31349 -250132 31807 -27971 -188925 -179519 143292 -78086 -272840 281348 -68189
7525 50887 38129 15159 -75880 115144 -70751 -99459 -30718 -377718 -75273 -44973 327657
7513 -100069 -121654 336752 -293007 188525 -110319 43283 94702 88214 201271 -101662 -100869
7502 -100869 -284386 253911 -192762 129225 -164834 -20072 -89525 -116276 -29648 -301839
7492 -301839 -70896 68416 216863 -161583 -4380 -159898 110787 254223 287169 -212217 -80807
7480 57321 -140188 -157046 -215367 31072 104979 -136943 134255 -69474 5702 87482 95391 -74388
7467 261736 -201106 -12152 -311004 148347 -74678 -59315 118529 67066 -9776 -138022 98773
7455 49295 26261 -226863 -142351 -70740 -291567 -4151 62282 -176015 -75062 -64745 32059
7443 -332249 -63840 -47580 177392 -19638 -36849 77180 -138530 92884 123134 186566 43783
7431 158600 209288 49089 176137 -153451 -201291 46810 -96726 -21966 -209681 21991 109595
7420 109595 -51572 -205427 30285 261704 2226 -26301 167731 62226 -333512 169872 104601
7409 104601 27632 -36921 -92531 82264 -140078 143449 -7246 -48933 -204252 179531 261603
7398 261603 -106021 81235 -68469 -221310 -105699 78196 -256191 33216 152676 -224107
7387 -168901 -123530 78708 -159802 -99739 174263 129816 -218309 -191153 -284831 188857 -196623
7375 -65059 51701 -204060 -309944 -202406 -171008 -10058 -379623 -280556 135378 -467978 85256
7363 127675 -99399 -30485 -5983 -114123 -49610 192688 -37027 131698 -14945 399891 13348
7351 -16273 -73155 -205419 -316330 -220248 13870 -229052 372557 157065 -268107 -68136 85396
7339 269955 -119855 23930 149691 -328223 140386 122714 68726 21370 50526 309555 244155
7328 244155 184861 -194406 -291131 -123768 -304984 -44652 -139684 1700 -73666 70617 -153259
7316 84311 -81797 -277459 -189754 169125 -177711 33965 -38840 62401 63490 6253 -40579 38924
7303 24906 -318382 -88770 -189767 -74609 13767 143068 19602 -175624 -257519 -267318 -520390
7292 -520390 23346 -26279 -168601 68014 -176232 -196257 -168342 289647 329566 71395 -154323
7280 256545 121687 337723 -66839 -533 -225835 395019 127107 488837 225428 48689 -175024
7268 303859 -132491 -572410 -31085 -111158 -34872 -174101 -126878 -304271 -23778 70367 2462
7256 -459167 263429 316504 97928 67720 -139634 -90651 128782 -11881 -10995 95378 47902
7245 47902 -26299 270041 1739 -212831 60370 290496 209351 81618 -55997 -76822 -25554
7233 203555 -184960 -55351 -48364 -823 398294 -122726 -15156 37083 -325448 -132964 137667
7221 -19977 109105 112230 -310498 -27202 -39042 -100181 -69845 -227824 -359 -235406 32922 -191772
7208 -87302 -51362 67460 8688 258342 194477 -144403 6622 176032 -97999 -132267 -110400 162933
7195 -141106 107709 61398 52705 9265 -48528 -192307 -67388 -173699 -183798 150341 25340
7183 165619 95138 -426374 -415981 -175690 -344289 -290869 -151892 -83914 -377575 -245641
7173 -245641 -347295 -187992 -375209 -425287 -7225 -358909 93038 96851 -57654 26384 -64340
7161 -91531 -86626 -104046 30481 108564 -17406 -260553 66967 -21051 -336465 -21933 -114775 -104774
7149 -104774 -95135 36620 -254008 -347545 65633 173368 -123090 46329 162339 -183753 305392
7137 -119388 -48899 77919 -62756 -163175 -192952 70410 -179644 3239 166559 -206903 98691
7125 -123835 -105937 -208271 98730 -107603 -39131 353560 17800 251984 -388232 212192
7114 -74138 -176315 -27624 140134 -108480 -327015 6717 41645 90049 -33706 -145357 403522
7102 120339 247572 -23223 134941 -293590 174029 88538 -126830 -182887 -194482 -93351 -198147
7091 -198147 71901 2009 101127 -93065 -30348 -149506 -97367 18790 161237 -200830 -12097
7079 -86150 -5177 -84304 -96334 66344 -66726 -56076 -131907 13314 -71534 34767 62565 19206
7066 -156682 85518 -54975 43672 140714 -102028 2669 -167228 194323 -184402 7049 4133
7055 4133 -42850 15554 251630 -48454 -261067 -297789 4178 132441 -366347 -79926 59561
7043 243001 45783 207840 -129739 -60987 -69129 48660 17807 78478 66097 -385554 -22656
7031 -211325 -254576 -188504 60834 91505 -125537 -245814 -272053 50569 -92410 155797 -180976
7019 -319071 20636 163273 55046 -59657 -159610 -470718 -380395 -112374 109151 151875 245036
7008 245036 112716 116018 -45860 36773 76658 -8966 175547 8850 89861 256491 -96175 32405
6995 -13565 -56495 -159182 -11492 -26426 -34693 -119893 61130 194526 425359 -43871 195977
6983 56821 107110 154111 -27148 -187273 136274 -114772 77054 -368514 110759 248787 87842
6971 -32075 -265791 -229611 99083 31064 268035 -133312 129214 -49982 -226055 13658 -76104
6959 48602 204271 141336 204970 52500 -82543 -88447 -27570 111673 286813 328889 173603
6948 173603 115988 -336384 25409 -225510 137371 15535 70356 52098 -143540 131073 -173744
6936 -138430 -23805 43683 -157303 177076 -293355 41440 217729 38922 -364545 -149751
6925 -122621 -184393 -284714 -65538 4473 -19934 -199198 -22811 81446 -35747 -189239 7871
6913 163568 -275286 191494 63885 120278 346490 -419605 -141480 78714 -19694 -10956 235410
6901 60806 92473 -272076 188748 149593 142952 83648 -185732 -60277 269518 34532 129186
6890 129186 128644 -111521 -159802 186124 92710 -179593 -1814 16732 220613 229141 -25365 364581
6877 -199232 -170868 -81817 -108959 -158477 -193642 -48264 -221196 -311232 154090 156619 -284616
6865 192750 81465 106103 584288 129249 -105218 -78939 -218376 11684 -56400 209391 -222316
6853 41476 -9280 -441350 7539 194202 -429725 138342 -31479 -22435 -97336 -341846 19691
6841 -93173 211251 333485 -213565 179275 126025 -140321 345267 -137916 -209774 39226
6830 204272 -218545 156866 -93253 261113 49676 -76511 -209119 -46464 341063 86400 -36975
6818 -136282 -60101 537302 -236624 -123266 -24257 -31362 91221 -1581 -14583 99732 -26024
6806 177055 -206122 -113191 26405 91650 -50444 -146467 -273272 237223 -58224 131465 -148850
6794 -20793 56101 63484 297365 -49729 72227 93339 57051 75935 52473 -381182 32048 423662
6782 423662 -14699 -144132 -263925 -122609 -136194 -283397 135156 60534 -291969 196405
6771 -139654 334689 166444 118754 163625 -199165 -243426 81609 57519 -169006 -54064 59716
6759 -462914 373396 -236460 294673 -272737 33486 115457 182402 -480445 -234178 -26536
6748 235281 -120399 -31770 79959 -70743 -90792 -124657 -131505 355547 9671 65615 152445 -58925
6735 -275522 -305340 -131269 199991 -95087 -136918 139821 44619 -227049 73163 -266768 -108757
6723 132701 5821 80309 186355 1588 -135376 45346 140958 -178994 -205246 63129 -53403
6711 77848 129422 -191919 138080 -26199 -34416 -118475 52595 -25629 -21404 -242918 65746 -60906
6698 -151032 -383692 -382470 -104418 135408 -154756 -465424 -164536 -10124 153775 -126525
6687 133163 -173416 -157598 72390 -146192 -234079 169283 -144481 -184438 62308 267906 -182543
6675 114496 -61443 168201 -92905 -6984 -83045 -7753 92141 -223031 19910 -234890 434515
6663 -7070 269479 107150 -33777 -34618 106891 -274156 -263888 -55817 -438323 -12044 -126559
6652 -126559 -160156 -354531 180274 -181144 -37487 -157660 133737 40783 64464 -166715
6641 474165 121591 120646 -30249 -133542 120516 -117156 -225333 -4649 -215547 -160799 143205
6629 349582 205369 -301715 -72793 -176387 81386 -219584 6589 -133967 54936 -36191 167847
6617 142893 -59364 -32916 148894 -146887 -74269 14400 -199544 -47598 -186382 221213 -170463
6605 31472 -230225 -78977 -39746 33959 -231864 -21052 87882 -87794 33882 39032 21063 -237273
6592 -79690 25263 -212978 103460 130268 -93176 -240804 -51576 126422 -420548 -56037 -104201
6581 -104201 56069 -11416 -282369 186610 -58059 1133 22241 -246668 56111 -258187 231548
6569 111562 5138 272182 65627 -42834 -118865 -130672 -11913 231681 -145355 -187275 -126184
6558 -126184 -163752 -214978 38100 -238936 -92374 44235 -212285 -97517 -300010 24861 -262301
6546 46220 89399 -298228 -107504 138534 264638 -19733 -131736 198565 48891 -281198
6535 -10042 59091 166805 366470 -33662 89877 -138515 -80318 146915 -191398 -58548 171741
6523 28830 354263 21035 -259138 400369 68591 83168 -315 -18795 -116097 -57790 -94276 79607
6510 -95651 68038 -189159 -173242 78019 -128713 13261 -133459 -6477 -50902 96061 -204813
6498 199330 -176197 -249438 -161708 166795 -157109 -217689 239285 97417 194670 -98111 -52846
6487 -52846 -203092 22785 107666 79446 93198 -50678 -101325 -160011 -172011 -214617 44231 67648
6475 67648 -233272 86817 1777 -46941 -229206 297452 71387 162607 -88601 215133 94052
6463 27484 54418 247672 132349 -349917 222565 127544 -54115 -357373 -64512 314189 -70240
6451 19804 240811 42238 -203073 -17087 -440968 101996 83066 -46784 -25568 -121906 171939
6439 102273 -46201 132579 23169 9089 -160705 3484 40375 65163 253314 -193240 -162650
6428 -162650 -90051 -5665 -45853 -73531 -205088 -128947 147645 137618 154318 -69642 -136742
6417 -136742 -307210 -139482 -374924 -23577 -162117 -179399 292997 -110443 47470 71821
6407 71821 -128897 -63323 42893 -236 -34837 247515 242095 -164114 -86203 -461857 59786 36899
6395 36899 225080 -168132 -120467 16796 -150198 250716 -144609 5303 149377 89564 201047
6384 201047 -280080 -14371 17075 245906 -67546 -28248 -31973 14569 -99372 -413408 -237362
6373 -237362 -130397 268861 -104484 -187225 96126 51922 -50577 50068 52399 28825 -252874
6361 1683 -52091 -25950 -342365 190545 113799 151586 -87912 56980 -21417 -100577 -172399 273135
6348 -216715 -54347 -28393 234993 -340179 590007 -66373 165960 66193 249734 -55425 -194526
6337 -194526 -517835 -43253 -184277 -148179 11227 286952 98304 27762 -327399 -34751 -124679
6326 -124679 8367 -314445 130153 -224964 21208 308111 44047 -46342 -93048 216007 178005
6315 178005 -101548 12665 2359 -2558 236027 -13420 199223 -107047 127230 -186632 -199274
6304 -199274 155647 -181582 -228976 -79204 -72246 -128099 173031 -163194 457218 -351090 23557
6292 -61658 37430 72194 114860 -63628 -74476 -178959 154555 63032 -234176 -89179 -22038
6280 74913 79979 114387 -217358 -149136 -104793 -53384 -29297 93879 262641 189823 240503 -184673
6267 445420 -286220 72142 -147572 215681 87394 34695 -14208 4939 16258 -23868 -132077
6256 -132077 -544492 164669 -136238 14228 56546 -225575 -51924 46136 -1651 -27318 77621
6244 -40595 -392485 -164222 15873 112557 45984 -96066 512587 51209 -387362 -1951 -329066
6233 -329066 141297 -196265 247391 51337 -198496 -127505 -205839 -23494 -87966 -107270 -332827
6222 -332827 113882 -53647 -13227 -14712 77429 -65357 -3113 -6695 -120311 27673 -9285 28684
6209 -102426 189457 -220366 -74510 220744 367410 45631 166068 -290543 -191017 158462
6198 -88468 -46804 -17740 -211255 317948 233776 177259 -189215 280588 204084 -17646 162933
6186 136251 -137573 63919 383546 -218 25025 -157533 -229311 -123534 1259 -12888 -157634
6175 -157634 70181 -239122 5896 199641 -255809 129670 -195266 131280 89079 -2726 -95698
6164 -95698 35768 -66227 -1551 -167591 -124277 -267791 -77734 358597 -18259 306939 48497
6152 232606 133875 117207 -184832 -221904 217676 129319 -35410 -144020 -132514 -42243 163240
6140 43521 106984 -147901 28867 -102384 189341 -184002 -209553 79370 -94471 14294 -34063
6128 -244632 -17693 -147134 -100296 255901 3763 373637 -131040 99899 -7019 -399502 51069
6116 -234536 168033 300626 -261632 242433 96415 2322 -63271 60999 139783 183967 -70025
6104 -84022 -38198 -132449 -118579 -116528 -190711 -72738 110678 -130778 52644 -24876 -55879 -146185
6092 -146185 -74899 -50024 -72418 -2317 212159 -101475 -248298 -188566 145922 -150520 -154555
6081 -154555 -310740 62814 -144983 12704 33418 -157383 91240 -184357 182830 -94121 -72342
6070 -72342 -30490 -190632 -27641 20069 -142678 253266 -274693 3058 124933 -247420 174068
6058 377465 202545 -335328 137419 134330 154793 6860 22043 290355 -78433 106048 -146941
6046 -95944 -73378 -81777 21376 38176 -149259 163223 221929 -250150 223426 -168804 -94230
6035 -94230 -27523 -194647 411291 -278681 127149 101134 111668 31246 271797 -188594 -184570
6024 -184570 -134042 -57230 95348 25401 -86310 -415373 -257713 -292115 -36099 -287535 -49715
6012 -99316 -284737 215113 -85705 345082 82224 -160196 -140529 -85293 -244329 -277133 -243263
6001 -243263 7063 -180641 450923 -83237 176678 429874 142919 278735 -300496 137607
5990 -49304 -130333 24983 7640 -170215 -135134 -150666 358433 -116615 -87902 98 -145868 223605
5977 37757 -273999 196529 -68405 205491 150591 -97472 -222295 -86585 146197 -279741 -169125
5966 -169125 -207746 -4886 -385670 96917 -86734 144003 -133870 135864 -11252 -157791 -35457
5954 106761 119748 -65108 -164923 -32945 -116755 -197966 -197681 -68456 -21030 -69651 164447 -24066
5941 3247 171894 99476 138306 -93459 -208558 -80343 -9011 -112598 42774 245716 44633
5929 103054 45384 48340 -9383 136523 234952 -109474 -37902 300326 -233651 105528 -142957
5917 -59092 -31934 3248 81218 -351962 5890 45341 83509 156150 45820 -102250 128654 -69137
5904 189900 -56286 -60351 269550 137514 215833 -167132 -63319 -111318 92370 -98172 -183605
5893 -183605 -133524 175603 -109665 155790 1511 -207246 26506 -20354 -26909 320701 -91235
5881 -14186 83931 178992 16451 158728 19407 -32296 -259729 109888 -70221 229071 -160398
5869 -89778 -30929 -195906 138584 -426829 -182504 -61000 -55436 134538 -279799 18639 216695
5858 216695 230450 56116 -28705 46009 -130573 -179086 2917 253443 84119 223736 275784
5847 275784 -29533 -248188 -196850 49528 -192704 35433 86668 324363 -165267 91341 -13325
5835 85984 -74557 200381 162032 317667 -214 -250371 132436 6248 105364 -199228 -94779
5823 63880 86067 -49119 263068 299484 -69044 -418015 156713 -265561 88379 -27869 -208086
5812 -208086 155434 182973 7439 63123 -144073 144641 90208 524804 -20785 326923 33303
5800 25252 -66683 97041 -42622 -252454 161832 174937 -209656 -235840 146607 -106504 60308
5788 132888 116251 -296145 183169 149294 -97586 -36989 -290528 251339 -40207 -154130 78275
5776 -244438 36745 27258 171432 2796 -184102 113857 57987 32655 384730 -168865 -272542
5765 -272542 86420 232171 175755 -10392 -189139 116429 57304 -106881 89954 34038 49399
5754 49399 -36590 349608 110161 -347994 100956 -291816 -313691 -116601 -68154 -111173 287546
5742 -46675 -17107 137206 -330757 180279 -151138 77377 418973 -17101 7556 75487 88999
5731 88999 6631 -110940 -248229 -211392 -60727 194546 161855 104601 292470 257235 -9692
5719 29031 -196073 -145973 -180239 -78697 77953 -79136 -74201 -163846 -57392 21709 -206334 106023
5706 -182559 -139188 -58547 95742 -175726 6774 -140748 414584 152837 23255 95990 61320
5695 61320 43102 200872 171887 105383 -380482 245222 -100218 119905 9114 -112159 -102804
5684 -102804 -196396 -107110 -199343 -418343 -19181 6393 -20560 -163842 7540 -309836 -162847
5673 -162847 -84616 -291685 -298853 122444 -218498 227955 -207968 45108 -2874 -35304 -244073
5662 -244073 51389 -25566 -216285 75755 141398 -150866 66535 -187811 -30813 -367407 -164095
5650 -149916 98923 -18711 -504175 12037 -199959 -278749 49481 71309 85508 134880 179079
5639 179079 -209618 -97097 106704 -36875 -46315 -146547 -21638 310977 185427 -63046 -4898
5627 -57706 253156 138038 -22323 -243952 -106630 -63407 144297 203910 148368 -149845 289030
5615 211783 32779 -171277 -148094 -68886 79869 -156186 -175468 117880 127651 -81367 81152
5603 -78170 103748 -58574 -117739 63958 -204371 -105791 218035 299350 23131 211993 387494
5592 387494 -114543 259371 -180056 131632 14333 296592 -11675 5237 262764 -303745
5581 263832 102505 129540 -60800 70501 212632 45973 173659 99020 9758 -223861 -176873
5570 -176873 -11316 67550 -20373 -241693 220874 -341876 -40118 -54496 -12754 -69038 -140854
5559 -140854 -185470 -140306 55633 211067 104237 209363 -244479 98069 -146058 -253574
5549 -253574 -209974 170795 355467 -198099 -229539 -386058 61233 151499 34766 -168586 -83668
5537 -152605 112551 -204450 18429 -29946 30485 -62153 196079 -50110 40043 134141 -13234
5525 -51898 -122800 -287946 -60412 13295 -234559 -336629 92913 23389 167910 -317434 -158463
5513 -50195 -188709 175189 -59909 -36598 363121 229707 -27851 -38114 312020 -197932 -111221
5502 -111221 140246 126110 -49704 -317062 219933 301827 -230886 -171707 125136 -77897 -40157
5491 -40157 31131 254293 32381 17076 -60698 82246 -53171 -253152 49913 -166923 -220154
5480 -220154 99030 65004 22341 -64719 230558 247832 -82997 59689 86666 95166 -35778 136336
5467 -271812 -9761 10474 -282720 -170625 -41562 26266 -334458 25377 -46450 -217006 -91228
5455 -28608 83526 -122345 120441 51571 -71298 273325 46975 116674 40142 -68318 122932
5443 162668 -100071 65119 -75757 92708 -16186 131761 -10886 300274 -340346 -154190 138447
5431 -246983 -151343 -300261 -343785 263991 -70737 169667 -242237 -75404 -169512 124705 106841
5420 106841 81707 -125135 417966 69602 89541 362992 57120 -166355 351645 -173676
5409 -5548 -406985 -245280 113359 130722 -126370 210372 -228476 260482 -144045 280807
5398 287609 104437 56795 114420 286985 282508 13323 29569 98114 180021 -60663 78943
5386 -80083 70753 -317265 -197834 -34823 153771 -36467 80788 -196583 -65275 -189044 -191614
5375 -191614 -171459 -9619 21310 115753 175300 59332 -20016 -108645 65015 41178 -175121 200860
5362 -1473 90953 219 -84186 178075 -81717 67895 218583 35018 -341749 -481588 -303966
5351 -303966 -134193 63684 23337 -181426 199743 -170123 30228 -25296 -43857 -320068 345295
5339 -169067 330290 84040 -123168 1860 -182056 176590 -415963 -71563 32621 80662 76866
5328 76866 69533 57862 16054 -154544 99111 -124754 131826 61328 67510 -169723 -1846 235610
5315 -28072 95969 35572 3758 59631 -99605 128342 118609 152107 -28636 -72053 -117021 131902
5302 -103907 24510 50172 72618 -21065 -118335 -195558 -13952 186686 -34228 192932 79682
5290 -16012 -221458 -14381 -25297 -170096 13039 -287077 24098 55185 239541 9249 225800
5279 225800 171862 -337860 -51747 324313 -240204 -28240 2821 -220817 -294581 42353 66200
5268 66200 9965 93416 249484 -355431 -228540 233867 197829 -118287 76111 -115367 -35097
5256 -143014 27099 -127669 -183983 -11084 19669 -83673 -132988 -93385 270638 197639 23622
5244 -230886 7399 -85601 195681 15817 -187973 -3040 -188301 208780 100734 338945 212385
5233 212385 60319 -142611 -125664 268762 -86748 126480 3403 -206347 -148648 -12288 -33393
5222 -33393 -96971 90756 -156305 -6983 -194757 185377 112374 50436 -9737 68896 -325138
5210 -160674 -9369 -239473 -71436 -173388 322425 -140332 -312916 130717 -41145 -74479 -104740
5199 -104740 -231018 -336638 -157735 261834 -21780 253656 -106403 354415 -24945 294424
5188 286497 122099 138162 -112493 58465 -22440 -91217 66197 139552 238471 -252070 204143
5176 -91030 -25333 -195848 199685 -111336 245807 -1728 314819 146721 191452 120519 175628
5165 175628 193011 49259 -7977 -195572 -173795 -41169 -24218 221961 -170794 80751 123027
5154 123027 -382098 429072 170861 352047 -132876 -36711 -117864 137111 -18857 -299922
5144 -299922 -20494 323396 44126 -178909 -14250 -65365 112943 -205991 267117 -58933 77711
5132 137511 -40490 -106698 229357 106082 193335 -309047 -155658 180065 27609 -118960
5121 614807 15750 -110161 -207870 54464 -16708 -72369 15841 -273535 -247308 -58099 152419
5109 -157613 -25755 157052 -102854 -118723 -285969 -48456 -219625 -83305 130928 -45940 -142259
5098 -142259 -229298 188593 53280 109571 121763 -75680 440018 400655 75566 472541 -7846
5086 -155360 -195368 -198401 87807 109653 77753 124885 139462 -181096 352824 -245847 -224010
5075 -224010 -276025 -36508 -44516 -65054 108710 17217 -97539 -145749 164878 170609 52662 121430
5063 121430 70660 -187213 20014 42223 -60211 -181057 46158 91801 233379 -4086 -20391
5052 -20391 97189 36562 71539 -342065 297190 -201324 3277 -61976 -141662 -53211 278579
5040 325419 294180 240880 -200429 115041 -41981 77327 503953 213937 387962 88277 287577
5029 287577 -153903 53093 -113121 -34915 185033 98933 41158 -58794 37494 48777 -139857
5017 -83218 -201837 84580 -133617 266898 55682 73217 203674 -51824 181607 -90109 77254
5005 35002 -115891 -27455 132427 40133 -6501 72617 -168817 51087 180705 -51207 222628
4993 -141949 -20044 76793 -123239 -113035 3268 -203478 91077 146713 -7061 -12862 29602 13593
4980 212147 85461 -25713 128923 229878 -33347 -104406 5381 342449 205814 65784 102512
4969 102512 -201286 -40353 -56771 102513 51914 143417 286839 27154 -66939 289242 131781
4957 -151934 -34862 -10668 154325 50461 -132822 216857 14348 -25399 56836 -95886 90194
4945 -72597 -26608 260619 1082 163313 98160 -84711 -57315 302303 44253 216535 -206584
4933 -7530 350731 -64487 2699 336119 -154363 140406 -30545 62596 -239516 202960 157248
4922 157248 -60499 91297 -87736 -41894 66363 6839 -303712 -53375 -187822 -149084 -388303
4911 -388303 -138611 26449 252838 -22267 110808 -64070 -371869 -326576 -97723 -90111 -32388
4899 172292 -236324 -113393 -122260 153421 -3725 -234006 -186068 -180720 -243653 345958 115574
4887 -116741 -107501 -111208 -107758 -38069 -52066 253779 141609 255379 190109 -200062 256121
4875 183329 307349 4861 90861 -71576 -348689 -289313 -258818 25906 -57425 28573 320529
4864 320529 -79745 263067 -71713 207672 78993 193502 56883 333246 75632 -330551 194965
4852 -247372 -35909 -344964 134780 -44961 -130467 116875 -171619 104804 -103781 25874
4841 20566 86524 -97537 -100346 17218 354216 -67669 -79661 -182972 202521 25826 53388
4830 53388 98544 -5097 19397 -199532 412630 -103139 167249 445316 -398886 -202347 -99155
4818 288686 -31275 -123662 -82527 -128762 -48458 174721 66301 -46459 -35025 -149767 -46684
4806 -104005 207342 175378 -1049 218906 254937 128164 40866 -94288 -24009 61168 -49209
4794 243285 -83536 -33582 -218555 99626 74963 -360855 -39330 98812 49660 -80103 -124656
4783 -124656 -2222 -187077 -232724 -119909 65909 235061 -8422 -73692 315973 -78835 198452
4771 74199 -321331 -148937 388563 -24195 -114732 268741 79639 -92262 303245 182236 33735
4759 45416 113320 -61723 278396 143763 320646 89609 108027 190005 -12716 -398803 -42778
4747 38100 33186 -264570 19445 188032 -133047 60331 -227018 338530 -229389 -79373 49197
4735 -235604 -23892 -112627 -5242 176939 -86835 179488 264069 -124245 65629 173739 242117
4724 242117 -191886 199723 20973 121624 21448 337675 -11892 -211085 167245 126381
4714 126381 19883 -7777 125304 60979 155668 6987 111597 -252328 108432 -255013 380439
4702 -76864 145873 55242 -62734 -9231 124544 61996 256858 -250021 210936 142844 -83487
4690 280190 -33395 131856 73653 -23626 -173264 16650 58967 87523 72994 -37952 12809
4678 226277 -74597 152493 -289630 92501 -12638 267543 113763 13822 115583 93625 -31859
4666 97978 74556 239892 147426 133096 267503 -29222 288823 -52502 208375 157152 -15506
4654 126182 -287393 -129420 -171137 -295953 -348165 -120183 -107229 23526 450624 17840 -247470
4642 -270863 68654 144901 -120863 66806 119529 133561 172192 92009 22079 -168537 378634
4630 -36917 104654 49090 -76902 66508 2353 -85379 58632 -196423 8764 -10849 -151318 -124093
4618 -124093 -358602 -9508 -89174 -23206 -228633 -130041 -260311 -210680 284015 33834 -59646
4606 -18592 -91778 -2129 -89800 -281233 -172281 -199538 174446 30423 369663 -55786 -103228
4595 -103228 -114522 1632 -18801 -9259 -69949 -8026 99987 -63233 7374 26583 -57823 -59748 29808
4581 105544 21184 74637 182864 -119823 211370 67044 247727 309927 -165215 31828 -47320
4569 -14766 42249 43600 124774 -35734 84930 72714 -244851 184521 54428 -74127 -78581 -200385
4557 -200385 305009 -272250 18167 -105697 7034 -231858 -97850 -290451 -250337 299796 79187
4545 -56355 157098 -9996 -92255 -304596 414471 -297095 80208 -80256 -173871 -84185 -53524
4534 -53524 -5401 -98809 -155878 20860 -68263 -32042 149811 -281822 212308 164532 -2660 -108130
4522 -108130 -229232 -124853 -151795 -76915 259541 -182926 182961 -209203 -171314 55781
$$ [...]
##END NTUPLES=NMR SPECTRUM
##END=
