
##TITLE=AC1311_NICAH12127_6615783_QRgXg3rtw9
##JCAMPDX= 6.0         $$ Bruker NMR JCAMP-DX V2.0
##DATA TYPE= NMR SPECTRUM
##DATA CLASS= NTUPLES
##ORIGIN= BRUKER
##OWNER= Administrator
$$ 1.72 TOPSPIN		Version 2.1
$$ 2012-08-03 02:04:58.890 -0500  Administrator@TOPSPIN
$$ Compression mode = diff/dup
##.OBSERVE FREQUENCY= 400.02188249412
##.OBSERVE NUCLEUS= ^1H
##.ACQUISITION MODE= SIMULTANEOUS (DQD)
##.ACQUISITION SCHEME= undefined
##.AVERAGES= 64
##.DIGITISER RES= 22
##SPECTROMETER/DATA SYSTEM= spect
##.PULSE SEQUENCE= noesygpps1d.comp
##.SOLVENT NAME= COFFEE_meoh
##.SHIFT REFERENCE= INTERNAL, COFFEE_meoh, 1, 14.96256
##AUDIT TRAIL= $$ (NUMBER, WHEN, WHO, WHERE, PROCESS, VERSION, WHAT)
$$ ##TITLE= Audit trail, TOPSPIN		Version 2.1
$$ ##JCAMPDX= 5.01
$$ ##ORIGIN= Bruker BioSpin GmbH
$$ ##OWNER= Administrator
$$ $$ C:\Bruker\TOPSPIN/data/COFFEE/nmr/AC1311_NICAH12127_6615783_QRgXg3rtw9/12/pdata/1/auditp.txt
$$ ##AUDIT TRAIL=  $$ (NUMBER, WHEN, WHO, WHERE, PROCESS, VERSION, WHAT)
(   1,<2012-08-03 02:04:54.187 -0500>,<Administrator>,<TOPSPIN>,<go>,<TOPSPIN 2.1>,
      <created by zg
	started at 2012-08-03 01:53:23.937 -0500,
	POWCHK enabled, PULCHK disabled,
       configuration hash MD5:
       6B 1B 68 BB D9 2E 58 E2 7F 35 AD 54 07 DF 0E 41
       data hash MD5: 64K
       10 5D 23 49 41 4C 03 16 45 CB 26 AC 16 5E 88 3F>)
(   2,<2012-08-03 02:04:57.000 -0500>,<Administrator>,<TOPSPIN>,<proc1d>,<TOPSPIN 2.1>,
      <Start of raw data processing
       efp LB = 0.3 FT_mod = 6 PKNL = 1 PHC0 = 0 PHC1 = 0 SI = 128K 
       data hash MD5: 128K
       C9 96 1D AF 65 0E F2 95 45 A1 31 7A 92 30 EE 69>)
(   3,<2012-08-03 02:04:58.109 -0500>,<Administrator>,<TOPSPIN>,<proc1d>,<TOPSPIN 2.1>,
      <pk PHC0 = -0.9997559 PHC1 = 0 
       data hash MD5: 128K
       B7 95 D1 6F 27 A5 3D D6 3B 32 4B 48 EF 71 CC FD>)
(   4,<2012-08-03 02:04:58.359 -0500>,<Administrator>,<TOPSPIN>,<proc1d>,<TOPSPIN 2.1>,
      <abs ABSG = 1 
       data hash MD5: 128K
       2C 61 47 3F 8C 4A 1D D0 D7 2B AE A8 E0 45 7B 84>)
(   5,<2012-08-03 02:04:58.437 -0500>,<Administrator>,<TOPSPIN>,<proc1d>,<TOPSPIN 2.1>,
      <abs ABSG = 2 
       data hash MD5: 128K
       82 36 CB 86 5C 94 0A 93 EE 0F 0F EF 81 16 5D BD>)
(   6,<2012-08-03 02:04:58.578 -0500>,<Administrator>,<TOPSPIN>,<proc1d>,<TOPSPIN 2.1>,
      <abs ABSG = 3 
       data hash MD5: 128K
       8D 94 9E CD 7C 78 56 66 63 0C 57 65 1F 49 95 38>)
(   7,<2012-08-03 02:04:58.750 -0500>,<Administrator>,<TOPSPIN>,<proc1d>,<TOPSPIN 2.1>,
      <abs ABSG = 4 
       data hash MD5: 128K
       FD 12 BB F0 36 65 48 F3 B3 F8 4C A4 26 6B FF A3>)
(   8,<2012-08-03 02:04:58.812 -0500>,<Administrator>,<TOPSPIN>,<proc1d>,<TOPSPIN 2.1>,
      <abs ABSG = 5 
       data hash MD5: 128K
       5F F2 70 1C 01 31 BF C1 FC AA BF 76 17 CE 5F 04>)
$$ ##END=
$$ 
$$ $$ hash MD5
$$ $$ 0C B3 44 A6 AE F0 53 71 93 A9 50 C2 0A 7C 96 7F
##$RELAX= 
##$RELAX= 
##$RELAX= 
##$RELAX= 
##$RELAX= 
##$RELAX= 
##$RELAX= 
##$RELAX= 
$$ Bruker specific parameters
$$ [...]
##$TP07= 0
##$TPNAME0= <>
##$TPNAME1= <>
##$TPNAME2= <>
##$TPNAME3= <>
##$TPNAME4= <>
##$TPNAME5= <>
##$TPNAME6= <>
##$TPNAME7= <>
##$TPOAL= (0..7)
0.5 0.5 0.5 0.5 0.5 0.5 0.5 0.5
##$TPOFFS= (0..7)
0 0 0 0 0 0 0 0
##$TUNHIN= 0
##$TUNHOUT= 0
##$TUNXOUT= 0
##$USERA1= <user>
##$USERA2= <user>
##$USERA3= <user>
##$USERA4= <user>
##$USERA5= <user>
##$V9= 5
##$VALIST= <valist>
##$VCLIST= <CCCCCCCCCCCCCCC>
##$VD= 0
##$VDLIST= <DDDDDDDDDDDDDDD>
##$VPLIST= <PPPPPPPPPPPPPPP>
##$VTLIST= <TTTTTTTTTTTTTTT>
##$WBST= 1024
##$WBSW= 4
##$XGAIN= (0..3)
0 0 0 0
##$XL= 0
##$YL= 0
##$YMAX_a= 16780497
##$YMIN_a= -10285062
##$ZGOPTNS= <>
##$ZL1= 120
##$ZL2= 120
##$ZL3= 120
##$ZL4= 120
##$ABSF1= 14.96256
##$ABSF2= -5.595622
##$ABSG= 5
##$ABSL= 3
##$ALPHA= 0
##$AQORDER= 0
##$ASSFAC= 0
##$ASSFACI= 0
##$ASSFACX= 0
##$ASSWID= 0
##$AUNMP= <proc_prof1d_extract.lims>
##$AXLEFT= 0
##$AXNAME= <>
##$AXNUC= <1H>
##$AXRIGHT= 0
##$AXTYPE= 0
##$AXUNIT= <>
##$AZFE= 0.1
##$AZFW= 0.1
##$BCFW= 0
##$BC_mod= 0
##$BYTORDP= 0
##$COROFFS= 0
##$CY= 15
##$DATMOD= 1
##$DC= 0
##$DFILT= <>
##$DTYPP= 0
##$F1P= 0
##$F2P= 0
##$FCOR= 0.5
##$FTSIZE= 131072
##$FT_mod= 6
##$GAMMA= 0
##$GB= 0
##$INTBC= 1
##$INTSCL= 1
##$ISEN= 128
##$LB= 0.3
##$LEV0= 0
##$LPBIN= 0
##$MAXI= 10000
##$MC2= 0
##$MEAN= 0
##$ME_mod= 0
##$MI= 0
##$NCOEF= 0
##$NC_proc= -2
##$NLEV= 6
##$NOISF1= 0
##$NOISF2= 0
##$NSP= 0
##$NTH_PI= 0
##$NZP= 0
##$OFFSET= 14.96256
##$PC= 1
##$PHC0= -0.9997559
##$PHC1= 0
##$PH_mod= 1
##$PKNL= yes
##$PPARMOD= 0
##$PPDIAG= 0
##$PPIPTYP= 0
##$PPMPNUM= 2147483647
##$PPRESOL= 1
##$PSCAL= 4
##$PSIGN= 0
##$PYNMP= <proc.py>
##$REVERSE= no
##$SF= 400.020009011277
##$SI= 131072
##$SIGF1= 0
##$SIGF2= 0
##$SINO= 400
##$SIOLD= 131072
##$SPECTYP= <>
##$SREGLST= <1H.CDCl3>
##$SSB= 0
##$STSI= 131072
##$STSR= 0
##$SW_p= 8223.68421052631
##$SYMM= 0
##$S_DEV= 0
##$TDeff= 65536
##$TDoff= 0
##$TI= <>
##$TILT= no
##$TM1= 0
##$TM2= 0
##$TOPLEV= 0
##$USERP1= <user>
##$USERP2= <user>
##$USERP3= <user>
##$USERP4= <user>
##$USERP5= <user>
##$WDW= 1
##$XDIM= 131072
##$YMAX_p= 458384321
##$YMIN_p= -11637
##$CURPLOT= <Network HP LaserJet P1505>
##$CURPRIN= <$Network HP LaserJet P1505>
##$DFORMAT= <normdp>
##$LAYOUT= <+/1D_H.xwp>
##$LFORMAT= <normlp>
##$PFORMAT= <normpl>
##$SURQMSG= 1
$$ End of Bruker specific parameters
$$ ---------------------------------
##NTUPLES= NMR SPECTRUM
##VAR_NAME=  FREQUENCY,     SPECTRUM/REAL,   SPECTRUM/IMAG
##SYMBOL=    X,             R,               I
##VAR_TYPE=  INDEPENDENT,   DEPENDENT,       DEPENDENT
##VAR_FORM=  AFFN,          ASDF,            ASDF
##VAR_DIM=   131072,        131072,          131072
##UNITS=     HZ,            ARBITRARY UNITS, ARBITRARY UNITS
##FACTOR=    0.0627417313425164, 1,          1
##FIRST=     8223.62146879497, -923,         -61665
##LAST=      0,             1259,            -62558
##MIN=       0,             -11637,          0
##MAX=       8223.62146879497, 458384321,    0
$$ Real data points
##PAGE= N=1
##DATA TABLE= (X++(R..R)), XYDATA
$$ [...]
60951C2712173j142740k200239k855813l094869l030765k786680k458121k115761
60943A3027185j800322j520928j273966j060869q84171p37980o13465n08945m26669
60934D199870l63814l13938k74131k44069k20525j99049j79332j63354j49674
60925B091984j34746j18598j04090r1615p9411o8426o1864n9935n9429n8522n7921
60914A197427n7243n4404m9200m3872l9496l5074l0552k7346k5399k2788j9040
60903G93013j5904j4273j3022j1491j0355r493p716n180l457k636j042J616L592
60890G03652M305N413P757R931J0920J1565J2308J1983J0147Q223O986N168J966
60877H10324j250l190m666o781r005j0535j1904j3663j4967j4990j4360j3848
$$ y = [32712173, 31569433, 29369194, 26513381, 23418512, 20387747, 17601067, 15142946, 13027185, 11226863, 9705935, 8431969, 7371100, 6486929, 5748949, 5135484, 4626539, 4199870, 3836056, 3522118, 3247987, 3003918, 2783393, 2584344, 2405012, 2241658, 2091984, 1957238, 1838640, 1734550, 1642935, 1563524, 1495098, 1433234, 1373299, 1313870, 1255348, 1197427, 1140184, 1085780, 1036580, 992708, 953212, 918138, 887586, 860240, 834841, 812053, 793013, 777109, 762836, 749814, 738323, 727968, 718475, 710759, 705579, 702122, 699486, 698444, 700060, 703652, 707957, 713370, 721127, 731058, 741978, 753543, 765851, 777834, 787981, 796204, 803190, 808358, 810324, 809074, 805884, 801218, 794437, 785432, 774897, 762993, 749330, 734363, 719373, 705013, 691165]
60865F91165j3020j1474j0039r411q879p692o394n539m381k279j60Q22J164K133
60851F16016L883N649P089Q342R499J0878J3065J5789J7747J8366J8819K0264
60839G65406K2113K2987K2616K1669K0443J8695J6318J3461J0419P811O190N280
60827I53408M406L746L999M614L947J704l59r21q15j390k597l717m802o233p910
60812I47080r785j2240j5138j7511j8864j9687k0161j9706j8482j7705j7614j6756
60800G43431j4386j1977j1008j0734r652p950o820o276n227l160n21K029L869
60787F61618M658N041O206Q154R559R957J0596J2186J3518J3535J3124J3419J3794
60774G95365J3239J2351J2242J2557J2383J2064J2360J2673J1977J0729J0142
$$ y = [691165, 678145, 666671, 656632, 647221, 638342, 630650, 624256, 618717, 614336, 612057, 611897, 612719, 613883, 616016, 619899, 625548, 632637, 640979, 650478, 661356, 674421, 690210, 707957, 726323, 745142, 765406, 787519, 810506, 833122, 854791, 875234, 893929, 910247, 923708, 934127, 941938, 948128, 953408, 957814, 961560, 965559, 970173, 974120, 975824, 975465, 974544, 973729, 972339, 969742, 966025, 961223, 954990, 947080, 937295, 925055, 909917, 892406, 873542, 853855, 833694, 813988, 795506, 777801, 760187, 743431, 729045, 717068, 706060, 695326, 685674, 677724, 670904, 664628, 659401, 656241, 655720, 657749, 661618, 666276, 671317, 677523, 685677, 695236, 705193, 715789, 727975, 741493, 755028, 768152, 781571, 795365, 808604, 820955, 833197, 845754, 858137, 870201, 882561, 895234, 907211, 917940, 928082]
60763I28082J0193J0008R633R732J0009R537Q306P061N941M621L334K509J820
60750A020786P81j94m41j76L8L64J077J598J250K60j014k960n695q174r525j0370
60734I87605j1574j2808j3586j4509j5894j6476j5206j3219j2064j1185r239o892
60722H34953n778n522m344k319j394k138k903k568j994k218l075m113n290o221
60708G85076o142n026l693k600j569o13R0R37K472M319N661O492P211P419O478
60693H06512M871L503J995p26m397p665j0153j2659j5289j7128j7922j8451j8979
60680F93512j8787j7572j6013j4662j3389j2054j0706r082o985n021l922l281
60668E62038k173o60N16J442K740M066M409L761L040K468J542N00K54Q33J308
$$ y = [928082, 938275, 948283, 957916, 967648, 977657, 987194, 995500, 1002561, 1008502, 1013123, 1016457, 1018966, 1020786, 1021567, 1021373, 1020932, 1020756, 1020794, 1021158, 1022235, 1023833, 1025083, 1025343, 1024329, 1021369, 1015674, 1007500, 997975, 987605, 976031, 963223, 949637, 935128, 919234, 902758, 887552, 874333, 862269, 851084, 841845, 834953, 829175, 823653, 819309, 816990, 815596, 813458, 810555, 807987, 805993, 803775, 800700, 796587, 791297, 785076, 778934, 773908, 770215, 767615, 766046, 765433, 765523, 766460, 768932, 773251, 778912, 785404, 792615, 800034, 806512, 811383, 814886, 816881, 816155, 811758, 804093, 793940, 781281, 765992, 748864, 730942, 712491, 693512, 674725, 657153, 641140, 626478, 613089, 601035, 590329, 581247, 574262, 569241, 565319, 562038, 559865, 559205, 559721, 561163, 563903, 567969, 572378, 576139, 579179, 581647, 583189, 583689, 583943, 584776, 586084]
60653E86084J333J410J691J906K381L656N162N766N539N520N818N548M625L937
60639F40376L698L280K839L416N152O952Q229R507J1091J2630J4165J6148J8150
60626G55633J9049J8813J8635J9056J9386J9219J8956J8496J6890J3779R941O039
60614I53892K078j705m744p151r562j1789j2929j2879j2422j1821j0746r520q842
60601H41860q256o665m481l369l725m275m499n398p212q415p880o395n109l975
60587G62206k574j139P6J240K155K183J503J113J183P34n54j729k215k558k979
60572G58645k741j659o96l72Q5J214K387L035L409L455K458N56r00j333j836l153
60556G62554m290m245l782m205n338n880n064l061m41K006L644M716O020P621
$$ y = [586084, 587417, 588827, 590518, 592424, 594805, 598461, 603623, 609389, 614928, 620448, 626266, 631814, 636439, 640376, 644074, 647354, 650193, 653609, 658761, 665713, 673942, 683449, 694540, 707170, 721335, 737483, 755633, 774682, 793495, 812130, 831186, 850572, 869791, 888747, 907243, 924133, 937912, 947853, 953892, 955970, 954265, 949521, 942370, 932808, 921019, 908090, 895211, 882789, 870968, 860222, 850702, 841860, 833604, 826939, 822458, 819089, 815364, 811089, 806590, 801192, 793980, 785565, 777685, 771290, 766181, 762206, 759632, 758493, 758569, 759809, 761964, 764147, 765650, 766763, 767946, 768680, 768126, 766397, 764182, 761624, 758645, 755904, 754245, 753549, 753177, 753262, 754476, 756863, 759898, 763307, 766762, 769220, 769776, 768876, 767543, 765707, 762554, 758264, 754019, 750237, 746032, 740694, 734814, 729750, 726689, 726248, 728254, 731898, 736614, 742634, 750255]
60542G50255Q890R980J1994J5305J9025K2694K7149L3133M0226M7612N4566N9599
60530A100428O0607N6636M8399L6652K1526M117j2854k6893l7144m3464m5584
60519A162426m3931l9849l4225k7103j9162j1990o226r69M134P949R859J0908
60507A011821J1857J1806J0136Q237P714Q274Q952J0311J3714J9204K5689L2680
60495A180395M0589M9788O0436P2700Q6273J00165J13696J27070J40401J53135
60485B124648J65191J77979J93662K14183K41286K75886L15811L54202L80644
60476D443492L84200L56805K96298K07229R8108k1946j42876k51700l35099l86063
60466D648448m06624m03519l83344l52258l16689k81308k47504k15540j86669
$$ y = [750255, 759145, 769125, 781119, 796424, 815449, 838143, 865292, 898425, 938651, 986263, 1040829, 1100428, 1161035, 1217671, 1266070, 1302722, 1324248, 1328365, 1315511, 1288618, 1251474, 1208010, 1162426, 1118495, 1078646, 1044421, 1017318, 998156, 986166, 979940, 978971, 983105, 991054, 1000913, 1011821, 1023678, 1035484, 1045620, 1053857, 1061571, 1069845, 1078797, 1089108, 1102822, 1122026, 1147715, 1180395, 1220984, 1270772, 1331208, 1403908, 1490181, 1590346, 1704042, 1831112, 1971513, 2124648, 2289839, 2467818, 2661480, 2875663, 3116949, 3392835, 3708646, 4062848, 4443492, 4827692, 5184497, 5480795, 5688024, 5786132, 5764186, 5621310, 5369610, 5034511, 4648448, 4241824, 3838305, 3454961, 3102703, 2786014, 2504706, 2257202, 2041662, 1854993]
60457A854993j61774j39828j19824j02688q9398p8597o8251n8544n1042m5826
60447I39221m1442l7047l2823k8760k4663k1005j8436j6824j5682j4935j4407
60436F73197j3545j2489j2262j2967j3102j1681r646q068o504m492k977k681k561
60423E60222j667r29j312j655m81J360K053J770J968K654K597J672Q74N13K19
60408E69858J93P10J070Q04J085K969N172N664M798M598N525O215O104N952N967
60393F26684N533M908N105N917N977M987M153M089L910K759R27q00j923k253k186
60378F67787k665l972m964m583l479k935k853k285j299o93l39M13J123P56m07
60363F39605j003n78J64Q41J594K042J645R80J153K028K485K322K443L246M217
$$ y = [1854993, 1693219, 1553391, 1433567, 1330879, 1241481, 1162884, 1094633, 1036089, 985047, 939221, 897779, 860732, 827909, 799149, 774486, 753481, 735045, 718221, 702539, 687604, 673197, 659652, 647163, 634901, 621934, 608832, 597151, 587505, 579437, 572933, 568441, 565464, 562783, 560222, 558555, 557626, 556314, 554659, 554178, 555538, 557591, 559361, 561329, 563983, 566580, 568252, 569126, 569639, 569858, 570051, 570761, 571831, 572635, 573720, 576689, 581861, 587525, 592323, 596921, 602446, 608661, 614765, 620717, 626684, 632217, 637125, 642230, 648147, 654124, 659111, 663264, 667353, 671263, 674022, 674949, 674149, 672226, 669973, 667787, 665122, 661150, 656186, 651603, 648124, 645189, 642336, 640051, 638752, 638059, 637720, 638133, 639256, 640012, 639605, 638602, 638024, 638188, 639029, 640623, 642665, 644310, 645290, 646443, 648471, 650956, 653278, 655721, 658967, 663184]
60348F63184N086O079P053P636Q042Q664R049Q511P375O469N698M472L012K025
60334G52355J475R62P78J290J824J609J266J894L280M518N732P459Q984R076P964
60319H10466O715N181K446j008l636n122o439p725q071p394o726o453n930m899
60305G61405l838k963k228k079k705l007j990o34n04j055m31J376K533K435K436
60290G48751L309M227M538M533M092K599O02l25J95J038J693K740L989M267L618
60275G89866L644M986O339O701O846P748R123J0365J1492J2458J2891J3081J4037
60262I09577J6017J8251K0432K3107K6318K9353L2185L5613L9655M3299M6347
60251A240154M9977N4963O0803O7025P3953Q1623Q9360R6929J04877J13223J21101
$$ y = [663184, 668270, 674349, 681402, 689038, 697080, 705744, 714793, 723304, 730679, 737148, 742846, 747318, 750330, 752355, 753830, 754792, 755570, 756860, 758684, 760293, 761559, 763453, 766733, 771251, 776983, 784442, 793426, 802502, 810466, 817181, 822362, 824808, 823800, 820164, 815042, 808603, 800878, 792807, 785413, 778687, 772234, 766304, 761405, 757567, 754604, 752376, 750297, 747592, 744585, 742595, 741961, 741457, 740402, 739971, 741347, 743880, 746315, 748751, 752060, 756287, 760825, 765358, 769450, 772049, 772651, 772326, 772521, 773559, 775252, 777992, 781981, 786248, 789866, 793510, 798496, 804835, 811536, 818382, 826130, 835253, 845618, 857110, 869568, 882459, 895540, 909577, 925594, 943845, 964277, 987384, 1013702, 1043055, 1075240, 1110853, 1150508, 1193807, 1240154, 1290131, 1345094, 1405897, 1472922, 1546875, 1628498, 1717858, 1814787, 1919664, 2032887, 2153988]
60240B153988J27877J33328J36630J36671J33604J28564J21674J11926R9333Q5416
60230C369011P1142N6087M0093K3998Q191p832k3765l7992m9421n8333o4698o7300
60218C259181o5399n9927n2275m3088l2824k2099j0771K062J6506L1461M6199
60207C069026O1054P6163R0923J05080J18831J31390J40920J46444J48377J46662
60197D234870J40104J28324J12836R5296P6011N4932L2813J0429j2255l5213n7478
60186D780669p7718r4918j08232j17105j21755j22570j19107j10897r9034q5450
60176C723883p0621n3682l4743j5277L903K3096M1888N8943P3893Q7364R8573
60165C937220J05113J05834J01989R4806Q4070O9893N3798L7008J9571K116j3554
$$ y = [2153988, 2281865, 2415193, 2551823, 2688494, 2822098, 2950662, 3072336, 3184262, 3283595, 3369011, 3440153, 3496240, 3536333, 3560331, 3568522, 3560690, 3536925, 3498933, 3449512, 3391179, 3326481, 3259181, 3193782, 3133855, 3081580, 3038492, 3005668, 2983569, 2972798, 2974860, 2991366, 3022827, 3069026, 3130080, 3206243, 3297166, 3402246, 3521077, 3652467, 3793387, 3939831, 4088208, 4234870, 4374974, 4503298, 4616134, 4711430, 4787441, 4842373, 4875186, 4885615, 4873360, 4838147, 4780669, 4702951, 4608033, 4499801, 4382696, 4260941, 4138371, 4019264, 3908367, 3809333, 3723883, 3653262, 3599580, 3564837, 3549560, 3553463, 3576559, 3618447, 3677390, 3751283, 3838647, 3937220, 4042333, 4148167, 4250156, 4344962, 4429032, 4498925, 4552723, 4589731, 4609302, 4611418, 4597864]
60154D597864k6716l8517m9346n7286o0504n9326n4636m6066l3334j7792r73J7082
60142D170450L6716N7191P7687R8574J20485J43273J67006J92651K20653K49971
60132E534657K79529L09322L39062L67202L92293M13910M31201M41991M44529
60123H953696M38635M24246M00407L66940L25574K78128K25094J67149J06374
60114A1686243M4489j8559q2830j46670k07931k65270l16638l58297l87274m03649
60104I543614m08862m03267l87092l62340l31556k95787k55643k13263j71138
60095F714666j29677q7851m5655m368L4941P1480J03991J31442J53715J70234
60085G112918J78745J77079J65425J45441J18137Q4441M7137J0124k4194n5458
$$ y = [4597864, 4571148, 4532631, 4483285, 4425999, 4365495, 4306169, 4251533, 4205467, 4172133, 4154341, 4153368, 4170450, 4207166, 4264357, 4342044, 4440618, 4561103, 4704376, 4871382, 5064033, 5284686, 5534657, 5814186, 6123508, 6462570, 6829772, 7222065, 7635975, 8067176, 8509167, 8953696, 9392331, 9816577, 10216984, 10583924, 10909498, 11187626, 11412720, 11579869, 11686243, 11730732, 11712173, 11629343, 11482673, 11274742, 11009472, 10692834, 10334537, 9947263, 9543614, 9134752, 8731485, 8344393, 7982053, 7650497, 7354710, 7099067, 6885804, 6714666, 6584989, 6497138, 6451483, 6447115, 6482056, 6553536, 6657527, 6788969, 6942684, 7112918, 7291663, 7468742, 7634167, 7779608, 7897745, 7982186, 8029323, 8039447, 8015253, 7959795]
60075G959795q3759j09009j31538j51811j69586j84420j96618k06551k13438k15996
60065F297069k14049k08486j99967j88649j74859j59084j41577j22643j02899
60056D784856q2710o1916m0616j9420J564K3089M5424O7586Q8545J08129J26074
60045E040605J41228J52473J59291J60828J55700J43708J26449J05481Q1053N3531
60035F320347K4405n129l5174o5499r4280j19617j41017j58191j69890j75251
60025E380704j75031j70372j61772j50273j37840j25095j10403r2808p4153n6542
60015D126415l9431k1216k110J6804L5981N6632P8532J00693J23236J46512J69259
60004D791307J89484K06282K18924K25347K23545K13621J96728J73202J43722
$$ y = [7959795, 7876036, 7767027, 7635489, 7483678, 7314092, 7129672, 6933054, 6726503, 6513065, 6297069, 6083020, 5874534, 5674567, 5485918, 5311059, 5151975, 5010398, 4887755, 4784856, 4702146, 4640230, 4599614, 4580194, 4581758, 4604847, 4650271, 4717857, 4806402, 4914531, 5040605, 5181833, 5334306, 5493597, 5654425, 5810125, 5953833, 6080282, 6185763, 6266816, 6320347, 6344752, 6339623, 6304449, 6238950, 6144670, 6025053, 5884036, 5725845, 5555955, 5380704, 5205673, 5035301, 4873529, 4723256, 4585416, 4460321, 4349918, 4257110, 4182957, 4126415, 4086984, 4065768, 4063658, 4080462, 4116443, 4173075, 4251607, 4352300, 4475536, 4622048, 4791307, 4980791, 5187073, 5405997, 5631344, 5854889, 6068510, 6265238, 6438440, 6582162]
59995F582162J10950P7615M3911Q942k6394o0304r2623j23561j50843j71021j83334
59984F015500j89529j90259j84523j72643j56946j39111j19174r7442p5155n2862
59974D637856l0150p346J4372L4782N4664P3800R0766J04887J16625J25763J31050
59963E347069J32038J29611J24316J15725J03907R0070P5337O0039M4487K9272
59953F251871J4708J075j0469j8273k1559k0454j4949m831R631K8037N0629P7738
59941F343154J08893J43485J81657K23386K67458L12602L58761M05596M50518
59932H795510M89826N20956N41657N47666N33614M96354M35816L53184K50630
59923A2965213J33114Q471j14894k29505l28719m07491m63905m98941n14638n13503
$$ y = [6582162, 6693112, 6770727, 6814638, 6823580, 6797186, 6736882, 6644259, 6520698, 6369855, 6198834, 6015500, 5825971, 5635712, 5451189, 5278546, 5121600, 4982489, 4863315, 4765873, 4690718, 4637856, 4607706, 4600360, 4614732, 4649514, 4704178, 4777978, 4868744, 4973631, 5090256, 5216019, 5347069, 5479107, 5608718, 5733034, 5848759, 5952666, 6042736, 6118073, 6178112, 6222599, 6251871, 6266579, 6267654, 6257185, 6238912, 6217353, 6196899, 6181950, 6177119, 6186750, 6214787, 6265416, 6343154, 6452047, 6595532, 6777189, 7000575, 7268033, 7580635, 7939396, 8344992, 8795510, 9285336, 9806292, 10347949, 10895615, 11429229, 11925583, 12361399, 12714583, 12965213, 13098327, 13106798, 12991904, 12762399, 12433680, 12026189, 11562284, 11063343, 10548705, 10035202]
59913A0035202m98982m74729m43182m05923l65023l22598k79420k35406j91227
59904F818712j48101j06441o6055k7069J0619M8058Q5791J22477J56458J87660
59894G082109K15907K38440K51532K53973K46395K27682J94945J47401Q7942K0696
59884H967022n0702j22270j89450k48628k97559l34352l57796l68791l69647l61936
59874F265891l46583l25698l02125k77151k50627k23360j97292j73135j49966
59865D019954j27470j06673q8205p1837n8075m8345m3114m1412m2375m5565m9650
59854C297233n2614n3660n3361n1817m8251m2446l4996k6151j6156o446J195O393
59842B918923R309Q537K330q296k0103l1287m2060n1681n7798n9458n8218n5503
$$ y = [10035202, 9536220, 9061491, 8618309, 8212386, 7847363, 7524765, 7245345, 7009939, 6818712, 6670611, 6564170, 6498115, 6471046, 6481665, 6529723, 6615514, 6737991, 6894449, 7082109, 7298016, 7536456, 7787988, 8041961, 8288356, 8516038, 8710983, 8858384, 8946326, 8967022, 8916320, 8794050, 8604600, 8355972, 8058413, 7724061, 7366265, 6997474, 6627827, 6265891, 5919308, 5593610, 5291485, 5014334, 4763707, 4540347, 4343055, 4169920, 4019954, 3892484, 3785811, 3697606, 3625769, 3567694, 3519349, 3476235, 3434823, 3392448, 3346883, 3297233, 3244619, 3190959, 3137598, 3085781, 3037530, 2995084, 2960088, 2933937, 2917781, 2911335, 2912530, 2918923, 2928232, 2936769, 2939099, 2930803, 2910700, 2879413, 2837353, 2785672, 2727874, 2668416, 2610198, 2554695]
59830B554695n1078m4890l8120l1424k4167j6187q500j452N983J4343K2906L1399
59818B413508M0677N0978O1047O9606P6151Q0046Q0704P9094P7240P5703P3265
59807C178019O9243O4073N7191M6654L1848J4879j328j4812k4177k8578k8784
59796C364228k6517k2200j4969n067N870J7295L0381M5652O2140P9471R8721J20529
59784C755534J44461J70890K01553K37441K78008L22880L72137M23882M72813
59775F379599N10978N27779N10009M46621L36788J92889L5206j15269k40975l30821
59765H252804l83026m03708m01018l81271l50065l13342k75328k37502k00864
59756E306680j67160j36851j08446q1351n7077l6328j7354J343J8992L4925N0602
$$ y = [2554695, 2503617, 2458727, 2420607, 2389183, 2365016, 2348829, 2340329, 2338877, 2344860, 2359203, 2382109, 2413508, 2454185, 2505163, 2566210, 2635816, 2711967, 2792013, 2872717, 2951811, 3029051, 3104754, 3178019, 3247262, 3311335, 3368526, 3415180, 3447028, 3461907, 3460579, 3445767, 3421590, 3393012, 3364228, 3337711, 3315511, 3300542, 3295475, 3301345, 3318640, 3349021, 3394673, 3456813, 3536284, 3635005, 3755534, 3899995, 4070885, 4272438, 4509879, 4787887, 5110767, 5482904, 5906786, 6379599, 6890577, 7418356, 7928365, 8374986, 8711774, 8904663, 8939869, 8824600, 8583625, 8252804, 7869778, 7466070, 7065052, 6683781, 6333716, 6020374, 5745046, 5507544, 5306680, 5139520, 5002669, 4894223, 4812872, 4755795, 4719467, 4702113, 4703456, 4722448, 4757373, 4807975]
59745D807975O7399Q4528J00978J17607J35462J54002J72805J93192K16269K41103
59735F291320K66712K94195L25063L59148L95944M36268M80593N27211N73781
59726I950235O19272O62447O99855P27249P41821P41576P24222O89036O39153
59717A6194866N80567N19871M63976M20047L93356L85702L96937M26550M72407
59708B0254279N29488N91700O53819P10338P54069P77700P75826P44513O80951
59699B6472683N85748M64454L25280J76535K7381j11286k29563l21734l85575
59690B7003923m20141m26133m06878l66557l08041k33903j48090n4320M6330J54513
59680B4840703K70079L91992N19720O52724P89002R25245J057117J177572J275551
$$ y = [4807975, 4875374, 4959902, 5060880, 5178487, 5313949, 5467951, 5640756, 5833948, 6050217, 6291320, 6558032, 6852227, 7177290, 7536438, 7932382, 8368650, 8849243, 9376454, 9950235, 10569507, 11231954, 11931809, 12659058, 13400879, 14142455, 14866677, 15555713, 16194866, 16775433, 17295304, 17759280, 18179327, 18572683, 18958385, 19355322, 19781872, 20254279, 20783767, 21375467, 22029286, 22739624, 23493693, 24271393, 25047219, 25791732, 26472683, 27058431, 27522885, 27848165, 28024700, 28052081, 27940795, 27711232, 27389498, 27003923, 26583782, 26157649, 25750771, 25384214, 25076173, 24842270, 24694180, 24639860, 24686190, 24840703, 25110782, 25502774, 26022494, 26675218, 27464220, 28389465, 29446582, 30624154, 31899705]
59671C1899705J337718J350859J302251J180524R79925P04835L70268m89l78384
59662C8747212p32574j036863j274473j437661j525528j543868j504619j421816
59654B8269810j307700j173612j032943r01089p93334p23758p03012p32562q00359
59645B0101441q84530r62657j018568j043979j038116j006279r56205q94377q25576
59636A1471154p54310o84555o18466n56773n00150m48936m02393l59614l20704
59627F825253k85964k54772k26335k00566j77183j55181j34348j15874j00120
59618E174910q5409p0708n7818m8907m3412l9571l7727l9587m5156n2845o1905
59607D591865p2464q3588r3499j01464j07722j11937j13372j12181j08996j03726
$$ y = [31899705, 33237423, 34588282, 35890533, 37071057, 38050982, 38755817, 39126085, 39125596, 38747212, 38014638, 36977775, 35703302, 34265641, 32740113, 31196245, 29691626, 28269810, 26962110, 25788498, 24755555, 23854466, 23061132, 22337374, 21634362, 20901800, 20101441, 19216911, 18254254, 17235686, 16191707, 15153591, 14147312, 13191107, 12296730, 11471154, 10716844, 10032289, 9413823, 8857050, 8356900, 7907964, 7505571, 7145957, 6825253, 6539289, 6284517, 6058182, 5857616, 5680433, 5525252, 5390904, 5275030, 5174910, 5089501, 5018793, 4960975, 4912068, 4868656, 4829085, 4791358, 4751771, 4706615, 4653770, 4591865, 4519401, 4435813, 4342314, 4240850, 4133128, 4021191, 3907819, 3795638, 3686642, 3582916]
59597C582916r6333q8047q0309p2969o4927n5877m6268l6473k7146j9301j2800
59586B982466o005J692Q640J3641J8091K3373K7981K9656K8922K7901K6908K4937
59574C208203K2558K1561K2260K3674K5876K9786L5142M0927M7289N5007O3649
59563C595932P2417Q2023R3499J05954J17952J30339J45119J62089J79411J97106
59553D881841K17055K39432K61822K82334L01222L19010L35011L48184L57636
59544G543547L61949L59695L51047L37596L20563L00490K78630K57227K38071
59535A0348815K21319K05280J86881J63960J38570J16892J04241J01039J04757
59526A1691754J13896J27788J43958J58243J66782J65869J51219J20192P4237
$$ y = [3582916, 3486583, 3398536, 3318227, 3245258, 3180331, 3124454, 3078186, 3041713, 3014567, 2995266, 2982466, 2976461, 2978153, 2986793, 3000434, 3018525, 3041898, 3069879, 3099535, 3128457, 3156358, 3183266, 3208203, 3230761, 3252322, 3274582, 3298256, 3324132, 3353918, 3389060, 3429987, 3477276, 3532283, 3595932, 3668349, 3750372, 3843871, 3949825, 4067777, 4198116, 4343235, 4505324, 4684735, 4881841, 5098896, 5338328, 5600150, 5882484, 6183706, 6502716, 6837727, 7185911, 7543547, 7905496, 8265191, 8616238, 8953834, 9274397, 9574887, 9853517, 10110744, 10348815, 10570134, 10775414, 10962295, 11126255, 11264825, 11381717, 11485958, 11586997, 11691754, 11805650, 11933438, 12077396, 12235639, 12402421, 12568290, 12719509, 12839701, 12913938]
59517A2913938J6945m9404j23169k00553k76364l46949m09882m61785m99407n22479
59507A0040891n32931n31915n20218n00586m76363m48196m15152l78823l42992
59498E893715l09336k76656k44599k14913j88504j64278j41595j21210j03063
59489D129561q5661o8376n2120l7122k2205o765Q541K3540L8972N4898P0665Q6668
59477D140596J04206J23419J43346J63992J86255K09832K33301K56268K79058
59468E840273L00286L17016L27378L30753L25393L08498K78983K37926J86124
59459H452630J23843N3485j9938r1614j58387k17462k66161l03603l30542l47216
59449F895035l53393l50639l42108l29656l13204k93255k71777k50221k28763
$$ y = [12913938, 12930883, 12881479, 12758310, 12557757, 12281393, 11934444, 11524562, 11062777, 10563370, 10040891, 9507960, 8976045, 8455827, 7955241, 7478878, 7030682, 6615530, 6236707, 5893715, 5584379, 5307723, 5063124, 4848211, 4659707, 4495429, 4353834, 4232624, 4129561, 4043900, 3975524, 3923404, 3886282, 3864077, 3857312, 3865853, 3889393, 3928365, 3983263, 4053928, 4140596, 4244802, 4368221, 4511567, 4675559, 4861814, 5071646, 5304947, 5561215, 5840273, 6140559, 6457575, 6784953, 7115706, 7441099, 7749597, 8028580, 8266506, 8452630, 8576473, 8629958, 8610020, 8518406, 8360019, 8142557, 7876396, 7572793, 7242251, 6895035, 6541642, 6191003, 5848895, 5519239, 5206035, 4912780, 4641003, 4390782, 4162019]
59440D162019k07875j88581j70865j53820j37590j23192j10378r7741q5032p3319
59430B813626o2883n3046m3944l6215k9155k1550j4044q101l023L187J0051J4806
59418B569709J6548J7323J8847K0955K3586K7591L3194L9991M8045N6104N9522
59407B931415N4121M2481L2568K9524L2402L9076M9698O3985P9812R6605J16159
59396C567846J37589J55315J65265J70604J78532J93604K16381K46179K82068
59387E313383L22504L66396M13851M64566N16635N67748O15726O56926O86107
59378I923842O99252O95048O73225O34026N80432N18529M54053L90295L29916
59369A4898618K75991K29692J89159J52000J16912Q1883M3386j062n1557j07996
$$ y = [4162019, 3954144, 3765563, 3594698, 3440878, 3303288, 3180096, 3069718, 2971977, 2886945, 2813626, 2750743, 2697697, 2653753, 2617538, 2588383, 2566833, 2552789, 2544688, 2541665, 2544852, 2554903, 2569709, 2586257, 2603580, 2622427, 2643382, 2666968, 2694559, 2727753, 2767744, 2815789, 2871893, 2931415, 2985536, 3028017, 3060585, 3090109, 3122511, 3161587, 3211285, 3275270, 3355082, 3451687, 3567846, 3705435, 3860750, 4026015, 4196619, 4375151, 4568755, 4785136, 5031315, 5313383, 5635887, 6002283, 6416134, 6880700, 7397335, 7965083, 8580809, 9237735, 9923842, 10623094, 11318142, 11991367, 12625393, 13205825, 13724354, 14178407, 14568702, 14898618, 15174609, 15404301, 15593460, 15745460, 15862372, 15944255, 15987641, 15986579, 15935022, 15827026]
59359A5827026j70814k38001l03706l61481m06962m36728m47775m40363m19185
59350A2602011l89831l56168l22309k94105k76141k69135k72037k84302l04144
59341I833839l26994l48318l66396l80429l88079l87285l78870l65054l46756
59332F545658l24351k99558k74352k49080k23413j98049j74009j51457j30531
59323D520858j11911r5378p9414o3443m8715l5763k3050r552L531J5272K7008
59312D099443L9882N2453O2903P1859Q0759Q8919R4422R6668R6157R2825Q6362
59301D962652P7107O5282N0552L3571J6496P22j4149k7956l8695m5079m8322m9571
59289D982610m7621m1171l1433k0336p662P840K5851M4961O4548Q4481J04067
$$ y = [15827026, 15656212, 15418211, 15114505, 14753024, 14346062, 13909334, 13461559, 13021196, 12602011, 12212180, 11856012, 11533703, 11239598, 10963457, 10694322, 10422285, 10137983, 9833839, 9506845, 9158527, 8792131, 8411702, 8023623, 7636338, 7257468, 6892414, 6545658, 6221307, 5921749, 5647397, 5398317, 5174904, 4976855, 4802846, 4651389, 4520858, 4408947, 4313569, 4234155, 4170712, 4121997, 4086234, 4063184, 4053632, 4057163, 4072435, 4099443, 4139325, 4191778, 4254681, 4326540, 4407299, 4496218, 4590640, 4687308, 4783465, 4876290, 4962652, 5039759, 5105041, 5155593, 5189164, 5205660, 5206382, 5192233, 5164277, 5125582, 5080503, 5032181, 4982610, 4934989, 4893818, 4862385, 4842049, 4834387, 4842227, 4868078, 4913039, 4977587, 5062068, 5166135]
59278E166135J22853J41194J58611J72970J82573J87448J87402J80830J66944
59269F666960J47295J23550R5925O5502L5532Q127j8360m6075p3299r5627j10099
59258F799431j16129j14103j05584r3783q1548o9629n8311m9191m3588m0777l9709
59247E987079m0908m4619m8708n0586m9963m7690m3251l5395k4033r568Q508L0641
59235E631507N6167Q4841J17949J56155J97871K41388K86852L34233L80923M23209
59225G911095M58210M82430M90510M77993M44173L90360L17285K26431J22153
59216A1320640J0016j05510k19582l25095m15031m85664n35707n64252n72076
59207H107739n63302n42953n13835m77721m37809l97443l57823l19343k83642
$$ y = [5166135, 5288988, 5430182, 5588793, 5761763, 5944336, 6131784, 6319186, 6500016, 6666960, 6814255, 6937805, 7033730, 7099232, 7134764, 7142891, 7124531, 7078456, 7005157, 6909530, 6799431, 6683302, 6569199, 6463615, 6369832, 6288284, 6218655, 6160344, 6111153, 6067565, 6026788, 5987079, 5946171, 5901552, 5852844, 5802258, 5752295, 5704605, 5661354, 5625959, 5601926, 5592358, 5600866, 5631507, 5687674, 5772515, 5890464, 6046619, 6244490, 6485878, 6772730, 7106963, 7487886, 7911095, 8369305, 8851735, 9342245, 9820238, 10264411, 10654771, 10972056, 11198487, 11320640, 11330656, 11225146, 11005564, 10680469, 10265438, 9779774, 9244067, 8679815, 8107739, 7544437, 7001484, 6487649, 6009928, 5572119, 5174676, 4816853, 4497510, 4213868]
59198D213868k51996k23339j96291j71680j50629j32055j14726r9967q9355q1372
59188B702458p3437o5786o0194n6150n1632m6599m2460l8891l4310k8834k3889
59177B180276j9531j4856j0289o718l164J931P825J2605J6422K0816K5674K9645
59165B240636L2948L6971M1590M5567M9130N3549N8751O3831O9289P6263Q4036
59154B852561R0885R6778J02813J08619J12711J14846J15662J14542J10188J02662
59144C922267R2709P9965O4123M6908L0454J4622j708j7670l1151m1516m9096
59133D109907n3170n3043n0093m5986l9884l0092j7391l957R966K5463M2141N8990
59121C952851P6960R7590J19831J41351J62210J84194K07331K30153K52593K75300
$$ y = [4213868, 3961872, 3738533, 3542242, 3370562, 3219933, 3087878, 2973152, 2873185, 2783830, 2702458, 2629021, 2563235, 2503041, 2446891, 2395259, 2348660, 2306200, 2267309, 2232999, 2204165, 2180276, 2160745, 2145889, 2135600, 2128882, 2125718, 2127649, 2135474, 2148079, 2164501, 2185317, 2210991, 2240636, 2273584, 2310555, 2352145, 2397712, 2446842, 2500391, 2559142, 2622973, 2692262, 2768525, 2852561, 2943446, 3040224, 3143037, 3251656, 3364367, 3479213, 3594875, 3709417, 3819605, 3922267, 4014976, 4094941, 4159064, 4205972, 4236426, 4251048, 4249340, 4231670, 4200519, 4159003, 4109907, 4056737, 4003694, 3953601, 3907615, 3867731, 3837639, 3820248, 3816291, 3826257, 3851720, 3893861, 3952851, 4029811, 4127401, 4247232, 4388583, 4550793, 4734987, 4942318, 5172471, 5425064, 5700364]
59111E700364K96718L13934L25900L32521L31169L17374K88838K46094J90257
59102H343169J23671N2365j5759p5569j25292j63613j89661k05418k14663k19513
59092G309717k20839k21323k24509k30873k37980k44329k49951k53800k54085
59083E172028k51243k47273k42206k34283k23519k11824j99825j86791j73468
59074C201596j61653j51054j39851j28215j18024j09269j00268r1232q3998p8231
59064B039801p1600o3858n7123n1790m5954l9312l3982l0719k7795k4443k2112
59053A571113k1455k1213k0848k1377k2869k3926k4176k4520k4593k2904j9765
59042A323467j7110j5080j1948p709m492k911j172J598M165N985Q210J1307J4403
$$ y = [5700364, 5997082, 6311016, 6636916, 6969437, 7300606, 7617980, 7906818, 8152912, 8343169, 8466840, 8519205, 8503446, 8427877, 8302585, 8138972, 7949311, 7743893, 7529230, 7309717, 7088878, 6867555, 6643046, 6412173, 6174193, 5929864, 5679913, 5426113, 5172028, 4920785, 4673512, 4431306, 4197023, 3973504, 3761680, 3561855, 3375064, 3201596, 3039943, 2888889, 2749038, 2620823, 2502799, 2393530, 2293262, 2202030, 2118032, 2039801, 1968201, 1904343, 1847220, 1795430, 1749476, 1710164, 1676182, 1645463, 1617668, 1593225, 1571113, 1549658, 1528445, 1507597, 1486220, 1463351, 1439425, 1415249, 1390729, 1366136, 1343232, 1323467, 1306357, 1291277, 1279329, 1271620, 1267128, 1264217, 1263045, 1264643, 1268808, 1274793, 1283003, 1294310, 1308713]
59029A308713J7392K1037K4718K6881K7741K8619K8692K5647J9632J3304P858
59018A550234K459k413m709m411l738l313j506J991N439Q379J2163J6662J9944
59005A597181K1664K3223K4169K2195J7316J2202P777K337m301r775j3237j6387
58993A684364j9458k0194j8127j5901j4911j3356j0093o707m218j346K277M690
58981A567020N035N244O648Q142R031J0548J3111J5245J6544J8534K1455K3480
58969A720037K4304K6095K9689L3210L5650L8285M1340M3010M3030M3508M4808
58958B122966M4596M2369M0956M1795M2775M2688M3814M7811N2939N7627O3106
58947B643442P0159P6875Q2142Q8004R6133J05209J14102J24264J36589J49231
$$ y = [1308713, 1326105, 1347142, 1371860, 1398741, 1426482, 1455101, 1483793, 1509440, 1529072, 1542376, 1550234, 1552693, 1550280, 1545571, 1541160, 1537422, 1534109, 1532603, 1534594, 1540033, 1548412, 1560575, 1577237, 1597181, 1618845, 1642068, 1666237, 1688432, 1705748, 1717950, 1725727, 1728064, 1723763, 1713988, 1700751, 1684364, 1664906, 1644712, 1626585, 1610684, 1595773, 1582417, 1572324, 1565617, 1561399, 1560053, 1562330, 1567020, 1572055, 1577299, 1583947, 1592089, 1601120, 1611668, 1624779, 1640024, 1656568, 1675102, 1696557, 1720037, 1744341, 1770436, 1800125, 1833335, 1868985, 1907270, 1948610, 1991620, 2034650, 2078158, 2122966, 2167562, 2209931, 2250887, 2292682, 2335457, 2378145, 2421959, 2469770, 2522709, 2580336, 2643442, 2713601, 2790476, 2872618, 2960622, 3056755, 3161964, 3276066, 3400330, 3536919, 3686150]
58937C686150J60959J73478J88086K03300K18282K35285K56081K79220L03519
58928E704360L30957L63336L99138M36763M77859N24334N74654O26232O79119
58919A0116752P34207P89802Q42661Q90222R29107R53259R56185R33456Q81373
58910A8027024P95730O74750N21846L44016J49582n1106k45753m23661n78041
58901A9214387p04234p98660q61260q96036r07341q97944q71815q35157p92532
58892A1649408p44899o93302o41146n90778n41321m92277m46112m04853l67305
58883F727415l32157l00774k74371k51488k30822k13560k00284j88583j76301
58874D559075j64342j53709j42905j30837j19247j09556j00316r0411q1594p5088
$$ y = [3686150, 3847109, 4020587, 4208673, 4411973, 4630255, 4865540, 5121621, 5400841, 5704360, 6035317, 6398653, 6797791, 7234554, 7712413, 8236747, 8811401, 9437633, 10116752, 10850959, 11640761, 12483422, 13373644, 14302751, 15256010, 16212195, 17145651, 18027024, 18822754, 19497504, 20019350, 20363366, 20512948, 20461842, 20216089, 19792428, 19214387, 18510153, 17711493, 16850233, 15954197, 15046856, 14148912, 13277097, 12441940, 11649408, 10904509, 10211207, 9570061, 8979283, 8437962, 7945685, 7499573, 7094720, 6727415, 6395258, 6094484, 5820113, 5568625, 5337803, 5124243, 4923959, 4735376, 4559075, 4394733, 4241024, 4098119, 3967282, 3848035, 3738479, 3638163, 3547752, 3466158, 3391070]
58864C391070o8898o1427n4575n0105m6118m0427l4362k9826k5443j9129j1967
58853B948793n949l52O340J3214J8862K4350L1132L8279M4588N1136N8879O6274
58841C295546P2126P8277Q6485R5433J03676J12777J24284J36506J47653J59438
58831D412201J74053J90275K06159K23116K43502K66506K90160L15403L44559
58822F665934L77693M13816M53817M98862N47708N98560O51659P07154P62421
58813A1677624Q14034Q59931Q96796R17894R16477Q88993Q32627P43121O18723
58804A9166220M63760K85653R1607j08716l01424m73991o20545p38781q25587
58795A6938196q79940r06557r11712q97989q67292q25713p80169p32565o82165
$$ y = [3391070, 3322172, 3260745, 3206170, 3156065, 3109947, 3069520, 3035158, 3005332, 2979889, 2960760, 2948793, 2942844, 2942492, 2948832, 2962046, 2980908, 3005258, 3036390, 3074669, 3119257, 3170393, 3229272, 3295546, 3367672, 3445949, 3532434, 3627867, 3731543, 3844320, 3968604, 4105110, 4252763, 4412201, 4586254, 4776529, 4982688, 5205804, 5449306, 5715812, 6005972, 6321375, 6665934, 7043627, 7457443, 7911260, 8410122, 8957830, 9556390, 10208049, 10915203, 11677624, 12491658, 13351589, 14248385, 15166279, 16082756, 16971749, 17804376, 18547497, 19166220, 19629980, 19915633, 20007240, 19898524, 19597100, 19123109, 18502564, 17763783, 16938196, 16058256, 15151699, 14239987, 13341998, 12474706, 11648993, 10868824, 10136259, 9454094]
58786I454094o31313n83750n39349m95668m53268m14757l80050l47148l16294
58777E292497k89100k64878k41948k21076k03797j89023j75117j63335j55215
58768C389008j48592j40370j31248j23609j16749j08598r9993r2814q5852p7094
58758B264089o8191o1944n7225n1071m4077l9001l5611l1656k7414k4623k2458
58747A800818j9105j5834j4893j4887j2960j0022r153j0271j1055j1745j4159
58736A656734j7373j9088k0026k2281k4667k4468k2495k1768k2378k2323k2070
58725A417797k3532k5775k6403k6002k6708k7849k7531k6772k7395k7626k4854
58714A127350k0923j9409j9377j7426j4229j3286j4357j4103j2269j1534j1915
$$ y = [9454094, 8822781, 8239031, 7699682, 7204014, 6750746, 6335989, 5955939, 5608791, 5292497, 5003397, 4738519, 4496571, 4275495, 4071698, 3882675, 3707558, 3544223, 3389008, 3240416, 3100046, 2968798, 2845189, 2728440, 2619842, 2519849, 2427035, 2341183, 2264089, 2195898, 2133954, 2076729, 2025658, 1981581, 1942580, 1906969, 1875313, 1847899, 1823276, 1800818, 1781713, 1765879, 1750986, 1736099, 1723139, 1713117, 1703964, 1693693, 1682638, 1670893, 1656734, 1639361, 1620273, 1600247, 1577966, 1553299, 1528831, 1506336, 1484568, 1462190, 1439867, 1417797, 1394265, 1368490, 1342087, 1316085, 1289377, 1261528, 1233997, 1207225, 1179830, 1152204, 1127350, 1106427, 1087018, 1067641, 1050215, 1035986, 1022700, 1008343, 994240, 981971, 970437, 958522]
58703I58522j0961q886q057q058o531m283m165n698o055n561o672q465p792n294
58689H62044m597o095p081p457r531j2570j3352j1848j0884j0521q411n242m126
58676G50329m739l813j137N06J027K820N221N098K911K279L589L891L133M400
58662G75515P754R734R385R047Q907O595K640N88J146J648J557K926N282N805
58648H48529M927O056R400J1714J2301J3629J5851J6640J6654J9179K4039K7742
58636A026661K9925L3645L9105M3272M6144N1029N8154O4335O9510P7250Q8141
58625A627171R9054J09693J23390J40578J57938J75032J95220K18908K42125K62951
58615C352060K82817L00160L09066L05589K89506K59121K11150J47412P5576J997
$$ y = [958522, 947561, 938675, 930618, 922560, 916029, 911746, 907581, 901883, 895828, 890267, 883595, 875130, 867338, 862044, 857447, 851352, 844271, 836814, 827283, 814713, 801361, 789513, 778629, 768108, 759697, 754455, 750329, 745590, 741777, 740640, 741146, 742173, 744993, 750214, 755312, 758223, 760502, 764091, 767982, 771115, 775515, 783269, 793003, 802388, 811435, 820342, 826937, 829577, 830165, 831311, 832959, 834516, 837442, 842724, 848529, 853456, 859512, 868912, 880626, 892927, 906556, 922407, 939047, 955701, 974880, 998919, 1026661, 1056586, 1090231, 1129336, 1172608, 1218752, 1269781, 1327935, 1392270, 1461780, 1539030, 1627171, 1726225, 1835918, 1959308, 2099886, 2257824, 2432856, 2628076, 2846984, 3089109, 3352060, 3634877, 3935037, 4244103, 4549692, 4839198, 5098319, 5309469, 5456881, 5532457, 5534454]
58605E534454p0348j36408j88869k25293k49264k63126k65754k58599k46981k33680
58595C396132k17418j98962j82237j68003j53099j37291j24248j14483j04117
58586A996274r2101q1697p3481o4073n3268m5113m0200l4359k6765k1692k0326
58575A443199j8547j5164j4399j7526j9889j9149j8892k0831k1083j7580j3931
58564A246208j2470j0539p151o259r699j3673j5710j8433k3037k5806k4686k2843
58552A055902k2196j9986j5037j0870r332p570m361k745l484k928l13jl332n757
58538I47990n256n916r597j1867j0233q733j0175j1330j0082r810j2234j3491
58526H29266j1729j1207j4197j6347j4820j3522j5239j6130j3321j0643j1288
$$ y = [5534454, 5464106, 5327698, 5138829, 4913536, 4664272, 4401146, 4135392, 3876793, 3629812, 3396132, 3178714, 2979752, 2797515, 2629512, 2476413, 2339122, 2214874, 2100391, 1996274, 1904173, 1822476, 1748995, 1684922, 1631654, 1586541, 1546341, 1511982, 1485217, 1463525, 1443199, 1424652, 1409488, 1395089, 1377563, 1357674, 1338525, 1319633, 1298802, 1277719, 1260139, 1246208, 1233738, 1223199, 1216048, 1209789, 1200090, 1186417, 1170707, 1152274, 1129237, 1103431, 1078745, 1055902, 1033706, 1013720, 998683, 987813, 978481, 970911, 966550, 963805, 960321, 957393, 957080, 957079, 953747, 947990, 942734, 936818, 927221, 915354, 905121, 896388, 886213, 874883, 864801, 854991, 842757, 829266, 817537, 806330, 792133, 775786, 760966, 747444, 732205, 716075, 702754, 692111, 680823]
58515F80823j1861r190o283o020n636k831p62j717k378m52P11q69j168K223M920
58500F39510L595J933L376M894L720L225O181Q980Q376P370Q679R189O589M617
58486G20234N980O962M872L666O227Q297O312M031N076O070L730J491K370K362
58472G87680k076p012q280q820j1973j4573j3623j2802j5131j6280j2505q210
58460F56395q183r233p102m698n726o983m776k331l214m069j522O41j129k639
58446E95431K68L570K812J709M721Q224P790P101J0724J4840J4299J2156J3042
58433F96687J3671R294L297J068M46k651n384l816j335k185k933O80M864M803
58419G16506L815O359Q812O681L966N568P447M320K19J103L932L460K844O763
$$ y = [680823, 668962, 659772, 653489, 647469, 641833, 639002, 638240, 636523, 634145, 633693, 634404, 633535, 632367, 634590, 639510, 643105, 645038, 648414, 653308, 657028, 660253, 666434, 675414, 683790, 691160, 699839, 709028, 715617, 720234, 726214, 733176, 738048, 741714, 747941, 756238, 762550, 766581, 771657, 777727, 781457, 782948, 785318, 787680, 785604, 778592, 770312, 761492, 749519, 734946, 721323, 708521, 693390, 677110, 664605, 656395, 648212, 638979, 631877, 627179, 621453, 614470, 609694, 607363, 604149, 600080, 598558, 599199, 598070, 595431, 595699, 599269, 602081, 603790, 608511, 616735, 624525, 631626, 642350, 657190, 671489, 683645, 696687, 710358, 719652, 722949, 724017, 724463, 721812, 716428, 712612, 711277, 709092, 706159, 706839, 711703, 716506, 720321, 726680, 735492, 742173, 746139, 751707, 759154, 763474, 763693, 764796, 768728, 772188, 775032, 781795]
58405G81795J0938R503O018O120O127M25o673q169o956r335j2517j0662p059p973
58391G51582j0326p746l075k656m061j697J389l86l233q66K852Q28l665l261l40
58376G15339j416l640m69M847N057K789N050R350Q905O257P933J0977Q752M665
58362G84396O104J0114R288O327Q293J2024J0187O249Q362J3613J3623J0468J1633
58349I10681J4487J1450N376M042M580n08p329o982k628l468p060m649J096J245
58335I20333j558J783Q584R214N574O810J1139J0121O403Q772J4081J2753P768
58322A021777R216J4658J4178J0253J2686J8541J7530J2853J5670K3103K3099
58311A193564J7107J6331J9307J5385O962N665R652P339N86J292P988Q943N510
$$ y = [781795, 792733, 802236, 808254, 814374, 820501, 820926, 814253, 806084, 799128, 789793, 777276, 766614, 759555, 751582, 741256, 733510, 730435, 727779, 723718, 722021, 723410, 723024, 719791, 718925, 721777, 722605, 718940, 715679, 715339, 713923, 710283, 709814, 714661, 719718, 722507, 727557, 736907, 745812, 752069, 760002, 770979, 779731, 784396, 790500, 800614, 809902, 816229, 824522, 836546, 846733, 852982, 861344, 874957, 888580, 899048, 910681, 925168, 936618, 941994, 946036, 950616, 950108, 942779, 935797, 933169, 929701, 922641, 917992, 919088, 920333, 918775, 920558, 929142, 938356, 943930, 950740, 961879, 972000, 978403, 987175, 1001256, 1014009, 1021777, 1030993, 1045651, 1059829, 1070082, 1082768, 1101309, 1118839, 1131692, 1147362, 1170465, 1193564, 1210671, 1227002, 1246309, 1261694, 1268656, 1274321, 1283973, 1291312, 1291898, 1293190, 1301178, 1310121, 1315631]
58298A315631Q942J6950J7455J2587J4671K1435K0196J3666J5717K4270K4825
58287A506345J8470J9424K6912K7073K1037K2947L1519L2058K5660K7499L6939
58276A795883L8719L3061L4804M3290M3423L6126L6839M4244M2166L2027L1003
58265B211585L8337L6893K7850K9392M0810M3346L7107M0837N4282N8141N2486
58254B671066N6880P0831P3605O5226O7253Q0549Q3809P6540Q0742R6846J01960
58243C525307R5281J00043J16882J21879J14753J20687J40159J47116J41293J50189
58233D773589J74388J85205J81815J93895K21955K34557K31262K45930K80283
58224F722879K99505L01900L24192L68544L96758M07233M41401N02073N45835
$$ y = [1315631, 1324573, 1341523, 1358978, 1371565, 1386236, 1407671, 1427867, 1441533, 1457250, 1481520, 1506345, 1524815, 1544239, 1571151, 1598224, 1619261, 1642208, 1673727, 1705785, 1731445, 1758944, 1795883, 1834602, 1867663, 1902467, 1945757, 1989180, 2025306, 2062145, 2106389, 2148555, 2180582, 2211585, 2249922, 2286815, 2314665, 2344057, 2384867, 2428213, 2465320, 2506157, 2560439, 2618580, 2671066, 2727946, 2798777, 2872382, 2937608, 3004861, 3085410, 3169219, 3245759, 3326501, 3423347, 3525307, 3620588, 3720631, 3837513, 3959392, 4074145, 4194832, 4334991, 4482107, 4623400, 4773589, 4947977, 5133182, 5314997, 5508892, 5730847, 5965404, 6196666, 6442596, 6722879, 7022384, 7324284, 7648476, 8017020, 8413778, 8821011, 9262412, 9764485, 10310320]
58215A0310320N69515O19201O99375P63603Q11089Q95635J021508J134356J234877
58206A8059479J389455J606793J826238K052694K369460K790097L245642L750494
58198C7090352M416805N269898O237165P361784Q815303J0661033J2874198J5657044
58190A08383582J9410904K4328603L0431088L7982579M6844306N4591715N6070911
58183C78043688M6584883K6338675J239070k1137817l6231817m3642367m5169455
58176C06024860m2875567l8531484l3535536k8678158k4187668k0151860j6715475
58169A01349112j3900706j1555487r572917p965442o692119n615096m666716l885649
58161C7494980l260165k697098k164771j711215j325413r26894m98002p9805L61367
$$ y = [10310320, 10879835, 11499036, 12198411, 12962014, 13773103, 14668738, 15690246, 16824602, 18059479, 19448934, 21055727, 22881965, 24934659, 27304119, 30094216, 33339858, 37090352, 41507157, 46777055, 53014220, 60376004, 69191307, 79852340, 92726538, 108383582, 127794486, 152123089, 182554177, 220536756, 267381062, 321972777, 378043688, 424628571, 450967246, 452206316, 431068499, 394836682, 351194315, 306024860, 263149293, 224617809, 191082273, 162404115, 138216447, 118064587, 101349112, 87448406, 75892919, 66320002, 58354560, 51662441, 46047345, 41380629, 37494980, 34234815, 31537717, 29372946, 27661731, 26336318, 25409424, 24911422, 24831617, 25192984]
58152B5192984R15985J599075K396225L381360M518836N316869M994256L210703
58144E1526293N09246k104818l926733m832269n023205m750764m243683l681194
58136B3472873l144503k644424k198274j832682j537940j284110j069435r05332
58128H856173p74709o51650n42000m63073m04857l49019l02930k78938k63681
58119D825316k41567k24116k23778k23893k06219j83156j71959j62226j39362
58110C049040j15367j05661r9121q1168o4013o4497p3170p3601p1664p8479q4557
58099B137742p7784o7999o8048o9105n9300m8164m8373n1463m5410l8343m1579
58088A522174m6511m1323l3776l5148l8090l2294k5781k9066l4021k9636k3304
$$ y = [25192984, 26108969, 27708044, 30104269, 33485629, 38004465, 43321334, 48315590, 51526293, 52035539, 49930721, 46003988, 41171719, 36148514, 31397750, 27154067, 23472873, 20328370, 17683946, 15485672, 13652990, 12115050, 10830940, 9761505, 8856173, 8081464, 7429814, 6887814, 6424741, 6019884, 5670865, 5367935, 5088997, 4825316, 4583749, 4359633, 4135855, 3911962, 3705743, 3522587, 3350628, 3188402, 3049040, 2933673, 2828012, 2728891, 2647723, 2583710, 2519213, 2446043, 2372442, 2300778, 2222299, 2137742, 2059958, 1991959, 1923911, 1854806, 1795506, 1747342, 1698969, 1647506, 1602096, 1563753, 1522174, 1475663, 1434340, 1400564, 1365416, 1327326, 1295032, 1269251, 1240185, 1206164, 1176528, 1153224]
58077A153224k5697k9805k5432j9469k1590k4554j8734j1731j3722j7538j2988
58066I31964o979r774j4786j1686o428q788j2717q411j874l369q018o575l994
58053H28565q799j5039j3202q534j0515j4487j1411n818o493r144n545l88k010
58040G17180n692k943J776J42l334j69N482N276L010O329J0704P868K068J983
58026G49680M410J678k602q94K870Q27l372j959J507n84m551k662J403l99m861
58011G40491m220j642m680r823q968n139o400r970p825k654k843o500n660j827
57997F62340k472o205o015l274m408p443n800j710k228n558m713j070r52k523
57983F07969N73N983O385L147L315O210N807L315M565P837O906L245K887M253
$$ y = [1153224, 1127527, 1097722, 1072290, 1052821, 1031231, 1006677, 987943, 976212, 962490, 944952, 931964, 924985, 915211, 900425, 888739, 882311, 873523, 860806, 852395, 850521, 847152, 839134, 832559, 828565, 819766, 804727, 791525, 782991, 772476, 757989, 746578, 740760, 734267, 725123, 719578, 719190, 717180, 711488, 708545, 710321, 710463, 707129, 706960, 712442, 717718, 720728, 727057, 737761, 745629, 747697, 749680, 754090, 755768, 753166, 752272, 755142, 755969, 752597, 750638, 752145, 751561, 747010, 744348, 745751, 745352, 740491, 736271, 734629, 729949, 720126, 711158, 706019, 699619, 689649, 681824, 679170, 676327, 669827, 664167, 662340, 659868, 653663, 647648, 644374, 639966, 632523, 626723, 625013, 622785, 617227, 612514, 611444, 610492, 607969, 608542, 614525, 620910, 624057, 627372, 633582, 639389, 642704, 647269, 655106, 662012, 665257, 668144, 672397]
57969F72397J453l443l946j833l768q164q082m551m321o751n625j858j877n132
57955F14499n493l418m515p664o703k549j680l793k879P34J232q49M88M767N624
57940E87801K764J900L241J364l626n855m585m736o703o171l901n211r741j1833
57926E34708j1057j2202j5089j4504j0324p774p588n571j798n19j143J005N137
57913D53281N952L819M270P529Q432O672P193J0304J1282R983J0996J3920J3349
57900E66982R114O863P783P272M443L438M455K985j092k936k131l435p256q700
57886E87785p038o964r247r410o860o268q366q486n726m660o298o126k961j050
57872D98325j557n02K967M642L517L811O803Q626Q064Q558J0725J0743Q084O968
$$ y = [672397, 673850, 670407, 666461, 664628, 660860, 652696, 644614, 640063, 635742, 628991, 623366, 621508, 619631, 614499, 609006, 605588, 601073, 593409, 586706, 584157, 582477, 578684, 575805, 576539, 577771, 576922, 577410, 582177, 587801, 590565, 592465, 595706, 597070, 593444, 587589, 583004, 578268, 571565, 565394, 561493, 556282, 546541, 534708, 523651, 511449, 496360, 481856, 471532, 463758, 456170, 450599, 448801, 448282, 447139, 448144, 453281, 459233, 463052, 467322, 474851, 483283, 489955, 497148, 507452, 518734, 528717, 539713, 553633, 566982, 576096, 582959, 590742, 598014, 602457, 605895, 610350, 613335, 612243, 609307, 607176, 603741, 596485, 587785, 580747, 573783, 564536, 555126, 548266, 541998, 533632, 525146, 519420, 514760, 508462, 502336, 499375, 498325, 496768, 496266, 499233, 503875, 507392, 511203, 518006, 526632, 534696, 543254, 553979, 564722, 572806, 579774]
57858E79774Q312P927M560K078J925R68j482k161q86j510m281m985l159l238n982
57843E77860o833m577l557n289n912m103l537n168n069k346j341l493m700l366
57829E18569l297n998p694o787o726q751r302p417p186j0000j1696j0385r626
57816D13704j0940j0675p496n528o644o988m571l043m292m523j597P30j78j237
57802C46722kR73j0M1K808N071M848N077P576R508R499J0913J5114J7747J5813
57787D51698J2514J0974R141N048J399N59K85j570l191l281m072o355p093n375
57773D60681n033p766r604q030o507p782q730o428l605l250l219j031J021M22
57759C91139o99J10J106N86R85M227P467P907P414Q212Q440O285M098M082M233
$$ y = [579774, 588086, 596013, 600573, 602651, 604576, 605544, 604062, 601901, 601015, 599505, 595224, 590239, 587080, 583842, 577860, 571027, 566450, 562893, 557604, 551692, 547589, 544052, 538884, 533815, 531469, 530128, 526635, 521935, 518569, 515272, 509274, 501580, 494793, 488067, 479316, 470014, 462597, 455411, 445411, 433715, 423330, 413704, 402764, 392089, 384593, 379065, 372421, 365433, 360862, 357819, 353527, 349004, 347407, 348137, 347959, 346722, 346720, 347693, 347683, 347724, 350532, 355603, 360451, 365528, 373104, 382612, 392111, 403024, 418138, 435885, 451698, 464212, 475186, 484327, 489375, 490774, 491333, 491618, 490048, 486857, 483576, 479504, 473149, 466056, 460681, 455648, 447882, 438278, 430248, 423741, 415959, 407229, 400801, 397196, 393946, 390727, 389696, 390717, 391139, 390440, 390550, 391656, 392242, 393227, 397454, 404921, 412828, 420242, 428454, 436894, 443179, 447277, 451359, 455592]
57744D55592K688J668K963M019K741J695L143M533L439K457M479P247P479O462
57730E10605O839P622O970O298P232Q024P210P118R594J2054J2054J1810J3852
57717F27282J6151J6127J5712J7714K0714K2219K3368K6047K8646K9264K9819
57706H73063L2593L5979L7978M0500M5790N2038N6957O2356P0595P9868Q7673
57695A475390R5783J07203J21179J35741J52094J71928J93374K14135K35602K59301
57685C161730K82050K98923L08009L07854K93563K60567K10172J47475P6791L282
57675E350416o4465j18761j57610j81525j88902j78798j54782j21594q2163m3437
57665D058379k0898k9170o8336j23864j78274k18950k38870k37684k22301k01294
$$ y = [455592, 458280, 459948, 462911, 466930, 469671, 471366, 474509, 479042, 482481, 484938, 489417, 496664, 504143, 510605, 517444, 525066, 532036, 538334, 545566, 553590, 560800, 567918, 577512, 589566, 601620, 613430, 627282, 643433, 659560, 675272, 692986, 713700, 735919, 759287, 785334, 813980, 843244, 873063, 905656, 941635, 979613, 1020113, 1065903, 1117941, 1174898, 1237254, 1307849, 1387717, 1475390, 1571173, 1678376, 1799555, 1935296, 2087390, 2259318, 2452692, 2666827, 2902429, 3161730, 3443780, 3742703, 4050712, 4358566, 4652129, 4912696, 5122868, 5270343, 5347134, 5350416, 5285951, 5167190, 5009580, 4828055, 4639153, 4460355, 4305573, 4183979, 4101816, 4058379, 4037481, 4008311, 3939975, 3816111, 3637837, 3418887, 3180017, 2942333, 2720032, 2518738]
57655B518738j78356j53811j29749j09006r1065p3832n8003m5515l5431k5602
57645A618368j6542r508k800N777J4842K2078K8780L7463M7262N6184O5588P7824
57633A945316R1621J04656J18473J35887J55570J74215J92263K12177K32530K48783
57623C611491K58531K61141K53610K31810J95059J45437Q4443J4941n5431j17941
57613D883091j69016k09038k37117k51990k56122k53662k45603k31616k14825
57604B814102j99392j84892j68376j50699j35453j22854j10204r7491q7164p9115
57594A478462p1161o3718n8820n5200m9723m2999l8343l5697l2031k7320k4587
57583I78863k4047k2630j9515j7006j5705j3687j0898r505r558q797p004o114
$$ y = [2518738, 2340382, 2186571, 2056822, 1947816, 1856751, 1782919, 1724916, 1679401, 1643970, 1618368, 1601826, 1592318, 1589518, 1595295, 1610137, 1632215, 1660995, 1698458, 1745720, 1801904, 1867492, 1945316, 2036937, 2141593, 2260066, 2395953, 2551523, 2725738, 2918001, 3130178, 3362708, 3611491, 3870022, 4131163, 4384773, 4616583, 4811642, 4957079, 5041522, 5056463, 5001032, 4883091, 4714075, 4505037, 4267920, 4015930, 3759808, 3506146, 3260543, 3028927, 2814102, 2614710, 2429818, 2261442, 2110743, 1975290, 1852436, 1742232, 1644741, 1557577, 1478462, 1407301, 1343583, 1284763, 1229563, 1179840, 1136841, 1098498, 1062801, 1030770, 1003450, 978863, 954816, 932186, 912671, 895665, 879960, 866273, 855375, 845870, 836312, 827515, 820511, 814397]
57571H14397n943m299j492j72n52k07J302K066K165L828O986R113R764J1061J3383
57556H61400J4900J5553J7246J9909K1522K2265K4409K7995L0855L2991L6617
57545A125662M1773M6241N0040N5681O3654P1931Q0122Q9887J01083J11833J22580
57534A960487J35755J51264J66551J81054J95936K09321K16461K14880K04789
57525C636498J84490J50745J04458N1238m213n9530j10355j50469j77750j95175
57515C429937k04702k05109j97091j85194j72596j58520j42640j27540j14805
57506A921740j02838r0586p9619p0726o2244n3525m6360m1347l6408l0411k4734
57495A282942j9945j4562q446l671p56K367O469R992J2884J7436K4017L0023L4450
$$ y = [814397, 808454, 804155, 802663, 802491, 801939, 801732, 803034, 805100, 807265, 811093, 818079, 827192, 836956, 848017, 861400, 876300, 891853, 909099, 929008, 950530, 972795, 997204, 1025199, 1056054, 1089045, 1125662, 1167435, 1213676, 1263716, 1319397, 1383051, 1454982, 1535104, 1624991, 1726074, 1837907, 1960487, 2096242, 2247506, 2414057, 2595111, 2791047, 3000368, 3216829, 3431709, 3636498, 3820988, 3971733, 4076191, 4127429, 4123216, 4063686, 3953331, 3802862, 3625112, 3429937, 3225235, 3020126, 2823035, 2637841, 2465245, 2306725, 2164085, 2036545, 1921740, 1818902, 1728316, 1648697, 1577971, 1515727, 1462202, 1415842, 1374495, 1338087, 1307676, 1282942, 1262997, 1248435, 1239989, 1236318, 1235562, 1237929, 1244398, 1254390, 1267274, 1284710, 1308727, 1338750, 1373200]
57482A373200L9501M6313N3251N9940O8654P9990R1329J01593J13423J28537J44846
57471B300577J60247J75396J90399K02349K08275K07137J96940J73734J36023
57462C951077Q7305L2444k5183q1413j30265j67875j94585k11384k17650k14273
57452B828198k05316j94126j80817j65455j50273j36622j23139j09155r6742q7213
57442A379340p8757o9790o1438n4634m8012m0894l5164l1910k9285k5871k3032
57431H80553k1763k0444j7962j5889j5203j4118j1579r646r855j0368r339q091
57419G16296q187q326o923n108m435m179l377k984l536l403j731m54q94j179M49
57404F62029K510L056K864L199L129J827R32J850L125L136L014M165N356N043
$$ y = [1373200, 1412701, 1459014, 1512265, 1572205, 1640859, 1720849, 1812178, 1913771, 2027194, 2155731, 2300577, 2460824, 2636220, 2826619, 3028968, 3237243, 3444380, 3641320, 3815054, 3951077, 4038382, 4070826, 4045643, 3964230, 3833965, 3666090, 3471505, 3260121, 3042471, 2828198, 2622882, 2428756, 2247939, 2082484, 1932211, 1795589, 1672450, 1563295, 1466553, 1379340, 1300583, 1230793, 1169355, 1114721, 1066709, 1025815, 990651, 958741, 929456, 903585, 880553, 858790, 838346, 820384, 804495, 789292, 775174, 763595, 753949, 744094, 733726, 724387, 716296, 708109, 699783, 692860, 687752, 683317, 679138, 675761, 672777, 669241, 665838, 664107, 663653, 662759, 661580, 662029, 664539, 667595, 670459, 673658, 676787, 678614, 679546, 681396, 684521, 687657, 690671, 694836, 700192, 705235]
57390G05235M323M781N590N352M745M826M829M046L710M643N323M575L781M137
57376G69896M271L056K155L105M439M398M057M928N938N625N006N420N819M977
57362H33090M170M785N601N175M630N269N825M992M332N580P367P737P616Q625
57348I14794R688R114Q004Q264R153R043Q623R201R763Q996Q306R484J1261J1477
57334A045171J0843J1154J1600J0446Q722Q633R733J0143J0134J1099J2333J2268
57322A172279J1705J2368J3535J3427J2754J3446J4939J5177J4372J4457J5562
57311A324021J6158J5969J5912J5923J5613J6005J7941J9923K0202J9805K0673
57300A518145K2278K3003K3389K4880K6676K7127K7025K8317L0636L2250L3308
$$ y = [705235, 709558, 714339, 719929, 725281, 730026, 734852, 739681, 743727, 747437, 752080, 757403, 761978, 765759, 769896, 774167, 777223, 779378, 782483, 786922, 791320, 795377, 800305, 806243, 811868, 816874, 822294, 828113, 833090, 837260, 842045, 847646, 852821, 857451, 862720, 868545, 873537, 877869, 883449, 890816, 898553, 906169, 914794, 924482, 933596, 941600, 949864, 959017, 968060, 976683, 985884, 995647, 1004643, 1012949, 1022433, 1033694, 1045171, 1056014, 1067168, 1078768, 1089214, 1097936, 1106569, 1116302, 1126445, 1136579, 1147678, 1160011, 1172279, 1183984, 1196352, 1209887, 1223314, 1236068, 1249514, 1264453, 1279630, 1294002, 1308459, 1324021, 1340179, 1356148, 1372060, 1387983, 1403596, 1419601, 1437542, 1457465, 1477667, 1497472, 1518145, 1540423, 1563426, 1586815, 1611695, 1638371, 1665498, 1692523, 1720840, 1751476, 1783726, 1817034]
57289A817034L5048L7033L8263L9743M2751M5876M7076M7335M8760N0419M9758
57278B299096M7063M4685M2678L8979L3244K6888J9972J1646L066l690r055j4828
57266B539744k0226k2668k2066k0700j9203j6335j2439r432p330m293k67K737
57254B387522M232N955Q713J1449J3516J5291J6510J6636J6696J8139K0241K1202
57242B556102K1318K2342K4253K5473K5760K6161K6635K6500K6558K7914K9521
57231B838537K9712K9296L0101L1530L1781L1471L2484L4259L4766L4386L5052
57220C193375L6313L6141L4910L4749L5450L5070L3968L4152L5123L4759L3896
57209C577906L5431L8862M0497L9462L8782L9882M0651M0041M0066M1759M3191
$$ y = [1817034, 1852082, 1889115, 1927378, 1967121, 2009872, 2055748, 2102824, 2150159, 2198919, 2249338, 2299096, 2346159, 2390844, 2433522, 2472501, 2505745, 2532633, 2552605, 2564251, 2567317, 2563627, 2554572, 2539744, 2519518, 2496850, 2474784, 2454084, 2434881, 2418546, 2406107, 2396675, 2389345, 2385052, 2384785, 2387522, 2391754, 2397709, 2406422, 2417871, 2431387, 2446678, 2463188, 2479824, 2496520, 2514659, 2534900, 2556102, 2577420, 2599762, 2624015, 2649488, 2675248, 2701409, 2728044, 2754544, 2781102, 2809016, 2838537, 2868249, 2897545, 2927646, 2959176, 2990957, 3022428, 3054912, 3089171, 3123937, 3158323, 3193375, 3229688, 3265829, 3300739, 3335488, 3370938, 3406008, 3439976, 3474128, 3509251, 3544010, 3577906, 3613337, 3652199, 3692696, 3732158, 3770940, 3810822, 3851473, 3891514, 3931580, 3973339, 4016530]
57198D016530M3083M2793M3225M3215M2289M1869M2380M2320M1261M0794M1463
57187D481222M1774M1193M1052M1646M1444M0119L9217L8982L7602L4568L1808
57176D910627L0505K9699K8784K8504K8708K8116K7008K7183K8690K9635K9661
57165E227120L0371L1834L2151L1105L0703L1334L1031K9280K8023K7912K7338
57154E558202K6066K6024K7275K7109K4516K1794K0266J8235J4794J1756R895
57143E785932P054K138k514n059p056j0127j2804j3264j2363j1574j0367p872
57131E702124m778j554K922R099J5325K0339K4854K9253L2245L3277L3763L4551
57119E931420L4739L4321L5185L8149M1881M5985N2077O0441O8975P6972Q6608
$$ y = [4016530, 4059613, 4102406, 4145631, 4188846, 4231135, 4273004, 4315384, 4357704, 4398965, 4439759, 4481222, 4522996, 4564189, 4605241, 4646887, 4688331, 4728450, 4767667, 4806649, 4844251, 4878819, 4910627, 4941132, 4970831, 4999615, 5028119, 5056827, 5084943, 5111951, 5139134, 5167824, 5197459, 5227120, 5257491, 5289325, 5321476, 5352581, 5383284, 5414618, 5445649, 5474929, 5502952, 5530864, 5558202, 5584268, 5610292, 5637567, 5664676, 5689192, 5710986, 5731252, 5749487, 5764281, 5776037, 5785932, 5792986, 5795124, 5792610, 5787551, 5780495, 5770368, 5757564, 5744300, 5731937, 5720363, 5709996, 5702124, 5697346, 5695792, 5698714, 5707813, 5723138, 5743477, 5768331, 5797584, 5829829, 5863106, 5896869, 5931420, 5966159, 6000480, 6035665, 6073814, 6115695, 6161680, 6213757, 6274198, 6343173, 6420145, 6506753]
57108F506753R9076J12935J28251J48707J77444K14275K59213L15149L84575M67548
57098H813926N65928O86156Q34900J015023J228319J477987J764615K083141K427032
57089B0897027K791113L165653L531467L865702M148543M359097M470994M462550
57081E1692146M328228M065622L647403L022362K163625J120014J1110j036407
57073F9014103j951666k727211l377780l901353m277374m489922m543432m459131
57065C9286234m265159l991715l668653l321411k968768k624751k300323k002180
57057A4143274j732588j492349j282432j102097r48043q16880p06452o13904n35062
57048D913467m67137m09733l62020l21377k86047k56389k32102k10799j90884
$$ y = [6506753, 6605829, 6718764, 6847015, 6995722, 7173166, 7387441, 7646654, 7961803, 8346378, 8813926, 9379854, 10066010, 10900910, 11915933, 13144252, 14622239, 16386854, 18469995, 20897027, 23688140, 26853793, 30385260, 34250962, 38399505, 42758602, 47229596, 51692146, 56020374, 60085996, 63733399, 66755761, 68919386, 70039400, 70050510, 69014103, 67062437, 64335226, 60957446, 57056093, 52778719, 48288797, 43745365, 39286234, 35021075, 31029360, 27360707, 24039296, 21070528, 18445777, 16145454, 14143274, 12410686, 10918337, 9635905, 8533808, 7585765, 6768885, 6062433, 5448529, 4913467, 4446330, 4036597, 3674577, 3353200, 3067153, 2810764, 2578662, 2367863, 2176979]
57039B176979j73150j57977j43716j29547j17075j07125r7701q7310p7631p0562
57029A015185o5106n9508n4183n0116m6491m2231l8066l5040l2706l0463k8758
57018E32517k7393k4906k1132j8023j6432j4753j2104r917q766o832l415n35J027
57005C69336L759R251J5511K0948K7366L6465M7151N9131P5258R7647J25981J61817
56993A049621K06631K48733K59027K11987J12398m943j02531j63032j88817j89648
56983A439426j75163j53382j30329j10238r6196q9034q6059q3217p8580p2243
56973C64985o4084n4108m3910l5137k7298j9451j2756q729o285l273L53L686P596
56960A01589J3172J9026K3463K7810L3752L8608L7244K8223J4673l8j3817k3941
$$ y = [2176979, 2003829, 1845852, 1702136, 1572589, 1455514, 1348389, 1250688, 1163378, 1085747, 1015185, 950079, 890571, 836388, 786272, 739781, 697550, 659484, 624444, 591738, 561275, 532517, 505124, 480218, 459086, 441063, 424631, 409878, 397774, 387857, 379091, 372259, 368844, 368309, 369336, 373095, 382346, 397857, 418805, 446171, 482636, 529787, 588918, 664176, 761823, 887804, 1049621, 1256252, 1504985, 1764012, 1975999, 2088397, 2083454, 1980923, 1817891, 1629074, 1439426, 1264263, 1110881, 980552, 870314, 774118, 685084, 599025, 515808, 437228, 364985, 300901, 246793, 202883, 167746, 140448, 120997, 108241, 99512, 93227, 89954, 90307, 93993, 101589, 114761, 133787, 157250, 185060, 218812, 257420, 294664, 322887, 337560, 337522, 323705, 299764]
56948B99764k8000k7123k4863k2733j9625j5345j1451q572n876l217j208Q18M264
56935A36833Q964J3748J8864K5479L3332M0969M7089M9292M3217K6627L809j7285
56923D30938l1845l9869m2633m1174l7572l4011l0452k5856k1095j7928j5939
56912I2564j3562j1211j0297r982q319n805m473m151l034j316p64j209r09R5L96
56897A8023L81J583L455M313M873P261J1078J4100J6464K0396K6194L2105L7665
56884A97891M3080M5681M1312K9762J5302J761r514j7209j9904j8694j6374j3634
56872B79460r402m638j809n79J931O429J0922J5108K1105K9328L7815M6521N8181
56859D90372P3283Q7107R2639Q4403O0418K4559j2894m1288n7286o4217o4964
$$ y = [299764, 271764, 244641, 219778, 197045, 177420, 162075, 150624, 142052, 136176, 132959, 131751, 132569, 136833, 145797, 159545, 178409, 203888, 237220, 278189, 325278, 374570, 417787, 444414, 448223, 430938, 399093, 359224, 316591, 275417, 237845, 203834, 173382, 147526, 126431, 108503, 92564, 79002, 67791, 57494, 47512, 39193, 33388, 28915, 24764, 21730, 20414, 19650, 18441, 17532, 17627, 18023, 18404, 19987, 23442, 27755, 32628, 39889, 50967, 65067, 81531, 101927, 128121, 160226, 197891, 240971, 286652, 327964, 357726, 373028, 374789, 365275, 348066, 328162, 309468, 293094, 279460, 270058, 265420, 263611, 263032, 264963, 271392, 282314, 297422, 318527, 347855, 385670, 432191, 490372, 563655, 650762, 743401, 827804, 888222, 912781, 899887, 858599, 801313, 737096, 672132]
56848F72132n9871n0871m2016l4597k6332j6371o842J429J0326K0528L0565M0974
56836E39054N4940P3637R5073J18026J41173J56327J49046J11248N0812j4134
56826A475202o7976j03521j20340j22303j15234j03649q9602p4795o1336m9544
56816E66902l7781k5677j4841n470M708J6968L0125M3844O0234Q0165R9974J12694
56804I31845J10757Q8436M6362n005n0363q0221r4828r8277r3424q3374p2465
56793E99443o2694n2544m1419l1759k4954j8879j1716m615J569Q691J8148K8622
56781D07893L9060N0106N9882O1980N1184K9142K268k3408m3449n4756n7528n5494
56769D66880n1846m6742m0182l4207l0150k6480k1716j6981j3702j1318r192q077
$$ y = [672132, 612261, 561390, 519374, 484777, 458445, 442074, 435232, 436661, 446987, 467515, 498080, 539054, 593994, 667631, 762704, 880730, 1021903, 1178230, 1327276, 1438524, 1489336, 1475202, 1407226, 1303705, 1183365, 1061062, 945828, 842179, 752577, 677782, 616446, 566902, 529121, 503444, 488603, 483133, 487841, 504809, 534934, 578778, 639012, 719177, 819151, 931845, 1042602, 1131038, 1177400, 1172395, 1122032, 1041811, 946983, 848706, 755282, 671908, 599443, 536749, 484205, 442786, 411027, 386073, 367194, 355478, 350863, 352432, 361123, 379271, 407893, 446953, 497059, 556941, 618921, 670105, 699247, 701515, 678107, 634658, 579902, 522374, 466880, 415034, 368292, 328110, 293903, 263753, 237273, 215557, 198576, 184874, 173556, 164364, 156287]
56757A56287p862o674m143k643l340m038k996j767k062k787k630k578l473l862
56743A05432k701j567j790k119j453j098k033k799k349k099k907k984j232L40
56729G8641O0n40J05O57k25j029l02M37l92j329o56L68j9q47n41J70K04M93J702
56710G6957K160P35p00m00K83k72q80j37O55P6n66J06P49Q3l55O90J266l61k114
56691G7975j449L07N48j69J63J051Q97K93N23P81K7m41N20J184j11j564r05O31
56673H0261O98q0L6K26r99k335j857o96j027k204k417k138k451k111M0J828P97
56656F5571j442j746m92j37n58J50J660K194K049K609L197K422J357J852L040
56641H1726K962K091J918J715K60j005k30J113N01j199j375k21J93r9K80P27j46
$$ y = [156287, 148425, 141751, 137608, 134965, 131625, 127587, 124591, 122824, 120762, 117975, 115345, 112767, 109294, 105432, 102731, 101164, 99374, 97255, 95802, 94704, 92671, 89872, 87523, 85424, 82517, 79533, 78301, 78641, 78701, 78161, 78266, 78923, 78698, 77669, 77367, 77804, 77412, 76083, 75427, 75795, 75776, 74929, 74388, 74558, 74762, 75255, 76957, 79117, 79852, 79152, 78752, 79035, 78763, 77883, 77746, 78401, 78477, 77911, 78017, 78766, 78849, 78494, 79184, 80450, 80089, 77975, 76526, 76833, 77381, 77212, 77375, 78426, 79323, 79616, 80139, 80920, 80947, 80506, 81026, 82210, 82099, 80535, 79630, 80261, 80959, 80879, 80915, 81141, 80142, 77807, 75950, 75254, 74227, 72023, 69606, 67468, 65017, 62906, 62946, 64774, 65571, 64129, 62383, 61891, 61754, 61196, 61346, 63006, 65200, 67249, 69858, 73055, 75477, 76834, 78686, 81726, 84688, 86779, 88697, 90412, 90672, 89667, 89437, 90550, 91051, 89852, 88477, 88256, 88449, 88350, 88630, 89357, 89211]
56624H9211j343j158o02j422k374j286O32O17q30r56N28J590J694J749J432R0
56608H7572q56J9J144M56p61j48J368J473Q49J547K702K190R79J354K295J206
56592A03389j055j528m23m07j549j536k02N42N93J350K266J807R24J518K569J905
56576A10163N51J017K550K619J904K935M917M880L195K944M362M794L824L634
56562A54289M592N005N002O196P915Q086P285P599Q254O925M582M247N651N913
56548B41541M802M427M426K534n31j941k021l502n962o335m691m183n306n521
56534B17737m587m967o651o880n314m500m941m642l617l900m963m336k688l077
56520A52674n128n405l610k839l488k758o17l43k284k904j073L49K15Q01K586
$$ y = [89211, 87868, 86710, 86108, 84686, 82312, 81026, 81658, 82275, 81445, 80489, 81017, 82607, 84301, 86050, 87482, 87572, 86716, 86735, 87879, 88335, 87574, 87426, 88794, 90267, 91116, 92663, 95365, 97555, 98534, 99888, 102183, 103389, 102334, 100806, 100383, 99976, 98427, 96891, 96689, 97231, 97824, 99174, 101440, 103247, 104171, 105689, 108258, 110163, 110714, 111731, 114281, 116900, 118804, 121739, 126656, 131536, 134731, 137675, 142037, 146831, 150655, 154289, 158881, 163886, 168888, 175084, 182999, 191085, 198370, 205969, 214223, 221148, 225730, 229977, 235628, 241541, 246343, 250770, 255196, 257730, 257199, 255258, 253237, 249735, 243773, 237438, 232747, 228564, 223258, 217737, 213150, 208183, 201532, 194652, 189338, 184838, 179897, 175255, 171638, 167738, 162775, 158439, 155751, 152674, 147546, 142141, 138531, 135692, 132204, 129446, 128829, 128486, 126202, 123298, 122225, 122574, 122789, 123590, 126176]
56505A26176K945J411Q75K179K658J393O84J052R2k242k622k04J564P73l56k41
56489A36137m03j444j380K31J052L78L61J602K037J356J795L464L726K295K013
56474A53220L420L695K097J317K178K295J223J565L512L847J916J140K911M397
56460A88733M097M092N060M641K582K009L637M195K475J324J758J034j360j882
56446B22395M24J568l76j860m30J153O11K91K051L273J713m75r84j203k596l715
56430B21840l682m288n893n842l489k134l354m292l155k321l270l527j617m1l53
56415A74582k38J569K413P69q67r37j635l863m684k834j547k745l671k488j738
56400A52086k951l259r91P25l23j368m0J389Q84N96K145L079J859J287L086M295
$$ y = [126176, 129121, 130532, 131407, 133586, 136244, 137637, 138321, 139373, 139465, 137223, 134601, 134397, 135961, 136734, 136378, 136137, 135734, 134290, 132910, 133141, 134193, 134571, 134932, 136534, 138571, 139927, 141722, 145186, 148912, 151207, 153220, 156640, 160335, 162432, 163749, 165927, 168222, 169445, 171010, 174522, 178369, 180285, 181425, 184336, 188733, 192830, 196922, 201982, 206623, 209205, 211214, 214851, 219046, 221521, 222845, 224603, 225637, 224277, 222395, 222819, 224387, 224011, 222151, 221721, 222874, 223485, 223776, 225827, 229100, 230813, 230338, 229354, 228151, 225555, 221840, 218158, 213870, 207977, 202135, 198646, 196512, 193158, 188866, 185711, 183390, 180120, 176593, 174976, 174935, 174582, 174344, 175913, 178326, 179095, 178228, 177291, 175656, 171793, 167109, 164275, 162728, 159983, 156312, 153824, 152086, 149135, 145876, 144885, 145610, 145287, 143919, 143879, 145268, 146152, 146748, 148893, 151972, 153831, 155118, 158204, 162499]
56384A62499K917J827L091L793J774K34J991M348M289L885N792P977P705O303
56370B18425N579L953N03j703o35P61j88j301l13O23n20j454k01Q64j79q71N60
56353B23903J384r9o31J848L680J969P6J442L365K405P74J691L260K681J895L443
56337B53086N194M607L769M915N657L885K588M447O510N687M546O073P803O899
56323C25666N927P632R084P224N136O360P986O045K940K715L531J750q80r38o4
56308C90114j308k862j954q12k185l311r46J941J327m60N84K517J598j60J027
56293C85110L292K906J655L201N864O207N957Q228J0742J0065Q727J0765J4033
56280D76752J4324J3331J5109J8291J9273J9497K2144K5350K6066K6762L0913
$$ y = [162499, 165416, 167243, 170334, 174127, 175901, 176135, 178126, 182474, 186763, 190648, 196440, 204417, 212122, 218425, 224004, 227957, 228460, 226757, 226122, 226883, 226695, 225394, 225081, 225704, 225184, 223730, 223529, 224393, 224214, 223343, 223903, 225287, 225188, 224557, 226405, 230085, 232054, 232130, 233572, 236937, 239342, 240116, 241807, 245067, 247748, 249643, 253086, 258280, 262887, 266656, 271571, 277228, 281113, 283701, 288148, 294658, 300345, 304891, 310964, 318767, 325666, 331593, 339225, 348309, 355533, 360669, 367029, 375015, 381060, 384000, 386715, 390246, 391996, 391116, 390178, 390114, 388806, 385944, 383990, 383178, 380993, 377682, 376736, 378677, 380004, 379544, 380128, 382645, 384243, 384083, 385110, 388402, 391308, 392963, 396164, 402028, 408235, 414192, 422420, 433162, 443227, 451954, 462719, 476752, 491076, 504407, 519516, 537807, 557080, 576577, 598721, 624071, 650137, 676899, 707812]
56269G07812L5809L7523L8875M4602N2659N8339O3108P1119Q0842Q8479R5910
56258A375077J06911J19216J28679J37496J49713J62315J69541J72378J75040
56249B696366J75738J69881J58895J46770J31499J09128Q2842N8761L6147J1172
56239C777199j3203l0949m3234n5197o5700p0172p0525p2145p3954p1608o7674
56228C142838o8307p2448p4644p5916q1290q9119r3563r5459j00064j06159j08168
56217B177701j07069j08350j10898j08794j02528r7731r4316q7648p8875p3283
56207A208209o9809o3033n4144m9136m7365m2858l5751l1550l0189k6719k1742
56196G35913k0192k0903j8230j2993j0943j1678r966o645o968r539q267m048l019
$$ y = [707812, 743621, 781144, 820019, 864621, 917280, 975619, 1038727, 1109846, 1190688, 1279167, 1375077, 1481988, 1601204, 1729883, 1867379, 2017092, 2179407, 2348948, 2521326, 2696366, 2872104, 3041985, 3200880, 3347650, 3479149, 3588277, 3671119, 3729880, 3766027, 3777199, 3763996, 3733047, 3689813, 3634616, 3568916, 3498744, 3428219, 3356074, 3282120, 3210512, 3142838, 3074531, 3002083, 2927439, 2851523, 2770233, 2681114, 2587551, 2492092, 2392028, 2285869, 2177701, 2070632, 1962282, 1851384, 1742590, 1640062, 1542331, 1448015, 1360367, 1281492, 1208209, 1138400, 1075367, 1021223, 972087, 924722, 881864, 846113, 814563, 784374, 757655, 735913, 715721, 694818, 676588, 663595, 652652, 640974, 631008, 624363, 617395, 607856, 599589, 595541, 592522]
56183E92522m553k673J952L307K024M037Q455Q984O316O771R693Q800N041N275
56169F55951Q905Q778M796L600N360L988K3j29K641J297l390l700M35J583n95
56154F89543R30O185P976O281Q352J3970J5329J2437J3778K0496K4732K4994K8418
56141H73421L6283M2105M5673N4358O8970Q3022R7046J18226J44413J64045J73443
56130A901005J78511J78343J64310J37998J13230R7035Q4505P4468P2768P6555
56120C078728P2627N6132L5395J5371p119k8848l8981l7190l6517m4025n4693
56109C010880o7425q8874j16983j38561j48348j53684j56462j48706j30620j14421
56099A746796j04753r3260p7517o6723o3115n6767m4776l6859l5968l2388k3267
$$ y = [592522, 587969, 585296, 587248, 590555, 592579, 596616, 605071, 614055, 620371, 627142, 636835, 645635, 650676, 655951, 664856, 673634, 678430, 682030, 687390, 691378, 691401, 691272, 693913, 695210, 691820, 688120, 688555, 690138, 689543, 690473, 696658, 704634, 710915, 719267, 733237, 748566, 761003, 774781, 795277, 820009, 845003, 873421, 909704, 951809, 997482, 1051840, 1120810, 1203832, 1300878, 1419104, 1563517, 1727562, 1901005, 2079516, 2257859, 2422169, 2560167, 2673397, 2770432, 2854937, 2929405, 3002173, 3078728, 3151355, 3207487, 3242882, 3258253, 3251134, 3222286, 3183305, 3146115, 3109598, 3065573, 3010880, 2943455, 2854581, 2737598, 2599037, 2450689, 2297005, 2140543, 1991837, 1861217, 1746796, 1642043, 1548783, 1471266, 1404543, 1341428, 1284661, 1239885, 1203026, 1167058, 1134670, 1111403]
56088A111403j8583k1193k0502j2861q574j1529j1640m982j544n173n785O11M082
56075I93730P48M92O769R213M417L378J0016J3329R156Q274J4379J6100R749P532
56061A107282J3887J6600J0937R154J6038J9001J3003J0995J8438K2190J6306
56050A273831J3853K0875K4126J7448J4557K2302K7021K1291J8179K4803K8235
56039A506521K2160K0536K9802L4924K8371K5107L3060L7378L0371K7631L7332
56028A833193M3471L7418L5403M6185N2803M5820M2546N2957N9344N1170M6620
56017B346930N7145O4668N7476N3941O6077P4852O7477O3264P5741Q5644P9270
56006C092485P6384R1072J03004R7599R5709J12251J25363J19288J16710J34614
$$ y = [1111403, 1092820, 1071627, 1051125, 1038264, 1029690, 1018161, 1006521, 1001539, 999995, 994822, 989037, 989648, 993730, 994478, 994970, 1001739, 1010952, 1015369, 1018747, 1028763, 1042092, 1051248, 1059522, 1073901, 1090001, 1099750, 1107282, 1121169, 1137769, 1148706, 1157860, 1173898, 1192899, 1205902, 1216897, 1235335, 1257525, 1273831, 1287684, 1308559, 1332685, 1350133, 1364690, 1386992, 1414013, 1435304, 1453483, 1478286, 1506521, 1528681, 1549217, 1579019, 1613943, 1642314, 1667421, 1700481, 1737859, 1768230, 1795861, 1833193, 1876664, 1914082, 1949485, 1995670, 2048473, 2094293, 2136839, 2189796, 2249140, 2300310, 2346930, 2404075, 2468743, 2526219, 2580160, 2646237, 2721089, 2788566, 2851830, 2927571, 3013215, 3092485, 3168869, 3259941, 3362945, 3460544, 3556253, 3668504, 3793867, 3913155, 4029865, 4164479]
55996D164479J50224J46200J46053J67670J86676J84571J86669K11688K32256
55987E776486K28250K29006K57359K84215K86445K95061L34947L73828L85442
55978H451039M04072M58608N14458N42332N79539O57432P36867P86152Q50092
55969A3980591R66053J089569J185660J310266J511035J737661J950038K217935
55961B5948808K603408L051258L519904M104371M890885N821065O860166Q153198
55953F4953063R835665J1876381J4340062J7592422K1965208K7501464L4367627
55946B02431892M2869245N1872427N7210185N3238831L7419570J3342171j1409616
55939D46974705l0405711m1418820m5532165m4831454m1242292l6382243l1372765
$$ y = [4164479, 4314703, 4460903, 4606956, 4774626, 4961302, 5145873, 5332542, 5544230, 5776486, 6004736, 6233742, 6491101, 6775316, 7061761, 7356822, 7691769, 8065597, 8451039, 8855111, 9313719, 9828177, 10370509, 10950048, 11607480, 12344347, 13130499, 13980591, 14946644, 16036213, 17221873, 18532139, 20043174, 21780835, 23730873, 25948808, 28552216, 31603474, 35123378, 39227749, 44118634, 49939699, 56799865, 64953063, 74788728, 86665109, 101005171, 118597593, 140562801, 168064265, 202431892, 245301137, 297173564, 354383749, 407622580, 445042150, 458384321, 446974705, 416568994, 375150174, 329618009, 284786555, 243544263, 207162020, 175789255]
55932A75789255k6674588k2385611j8626669j5505747j2937660j0761567q943736
55925E9953677p502054o345683n352054m512405l861384l343976k877544k470713
55917B3687864k164578j922363j683188j463585j306662j186289j053291r24477
55909A1983431q39348p76544o94639o10969n62821n32047m81303m25730l98853
55900F661177l84234l47971l04496k86009k78991k52654k19741k09661k09968
55891D167452j91802j66375j61033j64659j50244j27762j23107j27116j15224
55882B840130r6367r4188r9969r0837p5321p5673q3344p6060o1500o1292o8366
55871A957213o1845m8290m7630n3409m6563l4087l5393m4119m1114l1848l4175
$$ y = [175789255, 149114667, 126729056, 108102387, 92596640, 79658980, 68897413, 59953677, 52451623, 46105940, 40753886, 36241481, 32380097, 29036121, 26158577, 23687864, 21523286, 19600923, 17917735, 16454150, 15147488, 13961199, 12907908, 11983431, 11144083, 10367539, 9672900, 9061931, 8499110, 7967063, 7485760, 7060030, 6661177, 6276943, 5928972, 5624476, 5338467, 5059476, 4806822, 4587081, 4377420, 4167452, 3975650, 3809275, 3648242, 3483583, 3333339, 3205577, 3082470, 2955354, 2840130, 2743763, 2649575, 2549606, 2458769, 2383448, 2307775, 2224431, 2148371, 2086871, 2025579, 1957213, 1895368, 1847078, 1799448, 1746039, 1699476, 1665389, 1629996, 1585877, 1544763, 1512915, 1478740]
55860A478740m1982l7240k5790k5628l1364k5147j1730q465j1073k960J1187J3721
55848A282269O466L420Q80j3710l2371l7137l1729l2802l8341l4561k5665k6580
55836A020139l3481l1147k2695k3096k9667k7664j9258j8751k4335k2231j3977
55825G53837j2669j6707j3685n952o490j3397j3738q626r716j4898j2254m246
55813F21459l502q210n921J662J930l845l009L837M410j263j687L078K136m039
55799F07036m402P72N23n339o693l763o340j3341j4046q988r123j4798j5620j0896
55785D94982j0287j4354j3955q866p900j0699q191r28J598n77J287N950L219o395
55771D24884j1713j0730j2067j6470j5446r042o733r409q077j659J204q57l79
$$ y = [1478740, 1436758, 1399518, 1373728, 1348100, 1316736, 1291589, 1279859, 1271394, 1260321, 1257361, 1268548, 1282269, 1288735, 1292155, 1293035, 1279325, 1246954, 1209817, 1178088, 1145286, 1106945, 1072384, 1046719, 1020139, 986658, 955511, 932816, 909720, 880053, 852389, 833131, 814380, 790045, 767814, 753837, 741168, 724461, 710776, 704824, 698334, 684937, 671199, 662573, 652857, 637959, 625705, 621459, 617957, 609747, 603826, 605488, 607418, 603573, 600564, 604401, 608811, 607548, 605861, 608939, 611075, 607036, 602634, 603406, 603929, 598590, 591897, 588134, 581794, 568453, 554407, 545419, 536296, 521498, 505878, 494982, 484695, 470341, 456386, 447520, 439620, 428921, 420730, 419802, 421400, 420823, 422110, 428060, 431279, 424884, 413171, 402441, 390374, 373904, 358458, 349416, 342683, 333274, 325197, 323538, 324742, 323885, 323506]
55758C23506K609Jp438r642n323l831p496q654n771o019r931r740m968l820p194
55743B36289p076k616j893n838o249j947j057m850n090j73J807j081j052L871
55729B03045N949K634P23K200M91n605q529o059n007p439p060k661j364m801n656
55714A60861j700K67j960j891K290L742M53m63L724O510N110N513J0024J2223
55700B04703R163O556P228O084J175j769l95r8l052l933r06L28k407l554q34M20
55684B18709k031l039n17O20j227p90L431N779M438M899Q615R350M968J811K995
55669B58011L302J91j204J300K178j040k820l27J334n01r44K221L528L73j703
55654B63899M75J888o00k280k37P30k462n282m697n001q903j1846j0807r944j1934
$$ y = [323506, 326115, 326116, 318678, 309036, 303713, 299882, 292386, 283732, 277961, 271942, 262011, 252271, 247303, 243483, 236289, 229213, 226597, 224704, 218866, 212617, 210670, 209613, 204763, 199673, 199500, 201307, 200226, 199174, 203045, 208994, 211628, 212351, 214551, 215042, 209437, 200908, 194849, 189842, 182403, 175343, 172682, 171318, 166517, 160861, 159161, 159428, 157468, 155577, 157867, 161609, 162062, 161599, 165323, 171833, 176943, 182456, 192480, 204703, 213866, 220422, 227650, 233734, 234909, 233140, 232745, 232647, 229595, 225662, 224756, 225084, 222677, 219123, 218289, 218709, 216678, 213639, 213122, 213742, 212515, 211725, 215156, 220935, 225373, 230272, 238887, 248237, 253205, 255016, 258011, 261313, 261504, 260300, 261600, 263778, 262738, 259918, 259591, 260925, 260424, 259480, 261701, 265229, 265602, 263899, 264374, 266262, 265662, 263382, 263145, 263875, 261413, 256131, 251434, 246433, 237530, 225684, 214877, 204933, 192999]
55639A92999j2476q990o179p338q572o940n931p605p824m595k645m424n112j993
55625A02375l7k479m562k507l23j649k968j169J51j860l255q84J392Q0j599n98
55609H0108K9k137l450j333K71j629l273j467L64q37j822J34J584j95j483P70
55593F5634K936J614j94N38J021j087k370l05J439M0r72J124K484Q3k082l31J916
55576G1488Q68p03M15J492n5p45K257M866L259J097K836N835N985N310O977Q342
55560A19524O024K681J917J544j443m332l790k516m074o011m783k749l614n438
55546I2940m731l013k941k462Q24L842L078J088J870L876L771K819L468L852J743
55531A10024k06Q87K513J531Q4Q67J276j563m550l789j647k266m344m724m819
$$ y = [192999, 180523, 171533, 165354, 158016, 149444, 142504, 136573, 128968, 121144, 116549, 113904, 109480, 104368, 102375, 102338, 99859, 95297, 92790, 92467, 90818, 87850, 86681, 86832, 84972, 81717, 80833, 82225, 82305, 80706, 80108, 80137, 78000, 74550, 73217, 73488, 71859, 68586, 67119, 67483, 66646, 64824, 64958, 66542, 66347, 64864, 65634, 68570, 70184, 69990, 70528, 71549, 70462, 68092, 67787, 69226, 69266, 68294, 69418, 71902, 71985, 69903, 69572, 71488, 72356, 71653, 72068, 73560, 73505, 72760, 75017, 79883, 83142, 84239, 87075, 92910, 98895, 104205, 111182, 119524, 125548, 128229, 130146, 131690, 130247, 125915, 122125, 119609, 115535, 109524, 104741, 101992, 98378, 92940, 88209, 85196, 82255, 79793, 80617, 84459, 87537, 88625, 90495, 94371, 98142, 100961, 104429, 108281, 110024, 109818, 110705, 113218, 114749, 114833, 115700, 116976, 115413, 110863, 107074, 105427, 103161, 98817, 94093, 89274]
55516H9274o913q271n664j933j371k426j450J08j019l106k637r69j335k463j531
55501D8294j22r88k249j066L78j107l216k141L77N15m98O04K198P88j994k267
55485C7506j113k197m618m815l367l409m382l610k059k457A786a117j059p66q15
55470c757J337A602M025K406K187K579J205n03K01J865J478R1L38J069j0j225
55454A7308j02J282M3j620l23J831R24j432j156P34M98r49r3J932J301j198j735
55437A7245o28j119k589j844K94L26j219r94N69L50j059n34J232R97n56j21J610
55420A1960J120j089j318L94N78j008j260K25R66R70K417M535M492K851K590L516
55404C1939L124K005K621L821K463m28j153k4m63k361k532j135j372l175l367
$$ y = [89274, 82361, 74090, 68426, 66493, 65122, 62696, 61246, 61354, 60335, 57229, 54592, 53623, 52288, 49825, 48294, 48172, 47184, 44935, 43869, 44247, 43140, 39924, 37783, 38160, 38675, 38177, 38781, 40979, 41767, 39773, 37506, 36393, 34196, 29578, 24763, 21396, 17987, 13605, 9995, 7936, 5479, 1786, -1117, -2176, -2942, -3757, -2420, 1602, 5627, 8033, 10220, 12799, 14004, 13501, 13702, 15567, 17045, 17136, 17474, 18543, 18533, 17308, 17206, 18488, 18531, 16911, 16588, 18419, 19343, 17911, 16755, 17489, 17987, 17038, 16945, 18877, 20178, 18980, 17245, 16617, 15498, 12909, 11065, 11359, 11685, 10466, 9472, 10041, 10391, 9332, 8798, 10030, 11027, 10471, 10350, 11960, 13080, 11991, 10673, 11067, 11645, 10637, 9377, 9602, 10568, 11538, 13955, 18490, 22982, 25833, 28423, 31939, 35063, 37068, 39689, 43510, 45973, 45545, 44392, 44368, 43905, 41544, 39012, 37877, 36505, 33330, 29963]
55389B9963j809j372k097j404J99l61k597k856p77L44l19l61O16N55k42N47K195
55372B0224J689n68j236l2J99r38j177o34j496k992k327k41Jj257q19R42N64j778
55354H124k295m73K65r00j088L66Q45j05m0J181J081j66J85J775J411o73q70J061
55336I684J431m99j277J44P80l04l23J428J952K89o99J49M05q22j202j15m2j561
55318I418k011o16J22n84l86J232J675K81l44O18P91m45o19Q36J280p4o48M85
55300A1011R88J5k68P38P96m90o27P86R90p05j497l48L23m71n93N20N31r66j248
55281I485K99P87p32j460j71O84k3n4J399J817K28q42k11j2r50n89J669K802J476
55262A5602L39R08J014m81j260k19K29j089j738l92N90k09o80L78P91n50j270
$$ y = [29963, 28154, 26782, 24685, 23281, 23480, 23119, 20522, 17666, 16889, 17233, 16914, 16553, 17169, 17724, 17482, 18029, 20224, 21913, 21345, 20109, 20077, 20276, 19338, 18161, 17527, 16031, 13039, 10712, 10471, 10472, 9215, 8396, 9338, 9902, 8124, 5829, 5356, 5621, 4721, 3633, 3999, 4844, 4739, 4699, 5880, 6961, 6795, 6980, 8755, 10166, 9493, 8623, 9684, 11115, 10616, 9339, 9483, 10263, 9959, 9636, 11064, 13016, 13305, 12606, 12755, 13160, 12338, 11136, 11021, 10979, 9418, 7407, 6791, 6913, 6329, 5943, 7175, 8850, 9131, 8787, 9405, 10196, 9751, 9132, 9968, 11248, 11174, 10526, 11011, 11999, 12014, 11746, 12484, 13280, 12790, 12163, 12949, 13939, 13234, 11737, 11389, 11712, 11241, 10648, 11168, 11699, 10733, 9485, 9784, 10571, 9839, 8379, 8208, 8892, 8869, 8815, 10214, 12031, 12259, 11417, 11206, 11194, 10244, 9655, 11324, 14126, 15602, 15941, 16849, 17863, 17382, 16122, 15903, 16132, 15043, 13305, 12913, 13503, 13294, 12614, 12992, 13783, 13233, 11963]
55245A1963o7P19l45j083p8O25k61o77N28J101k23j082N1R74Q0o09N05J632J365
55226A5118J364K524K563L46j489j043l25j050j375J53J456Q24J57J101J748M01
55210B2473r13q4J360J281N54O30O31k56n78M54J004np50j56r6j617k588j658
55192A9686p93j280j118Q46K163J122j32J93K28j407k252m22J511Q48o11j64R96
55175A9414N03p41p99m91j207j676n04P00J96n77Q9Q25K5p86J11J193O76M9J044
55156A8044J921N78j306j065M03O22j62k92j18o51q67K53J083L4j333j009q5m18
55138A5632j067m11N16J16m98K67J179M61p52n17L99L51J36J170K340J957R80
55121B2259J142J713J205L83O17J077M95k36L1K86m86r42J7P50j30q62L40J796
$$ y = [11963, 11896, 12615, 12270, 11187, 11109, 11734, 11473, 10796, 11324, 12425, 12202, 11120, 11171, 12145, 12225, 11616, 12121, 13753, 15118, 16482, 19006, 21569, 21915, 20426, 19383, 19058, 18008, 16633, 16786, 18242, 19066, 19223, 20324, 22072, 22473, 21560, 21476, 22836, 24117, 24671, 25301, 25932, 25676, 25098, 25552, 26556, 26551, 25801, 25645, 25549, 23932, 21344, 19686, 18893, 17613, 16495, 17341, 19504, 20626, 20494, 20687, 20915, 19508, 17256, 16834, 18345, 19193, 18582, 18418, 19414, 19917, 19176, 18377, 17886, 16679, 15003, 14499, 15199, 15395, 14818, 14907, 15732, 15757, 14971, 15082, 16275, 16951, 17000, 18044, 19965, 20543, 19237, 18172, 18575, 19197, 19035, 18743, 18625, 17974, 17107, 17360, 18443, 18477, 17144, 16135, 16050, 15632, 14565, 14154, 14670, 14786, 14288, 14555, 15734, 16195, 15443, 14926, 15325, 15676, 15812, 16982, 19322, 21279, 22259, 23401, 25114, 26319, 26702, 27319, 28396, 28891, 28655, 28686, 28972, 28486, 27544, 27561, 28311, 28181, 27319, 27659, 29455]
55103B9455J276o3q4N18J51l06M43J003j66j339l39J420J348J69K35J259J352
55086C6332O52M04J47r48j619o81L45j24n97P04K206J693L56M87J320R09M7M41
55068D2074J011K9j098k47J201P25o01n7J676J854O76M78J128N19j194j958j658
55051D4558j755j964j021J54j98j172o16Q98J175L94L51Q02K73n09J95J477J084
55034D4126n12j036m85n92j144n52O00L56q99j064l3N41M75P53R45J45n19L65
55016D1470J410N42j175j331m26n40j133k72J198Q65p66j189m69o81j594j165
55000C4744K41L76o24o30K92J83p15l27J055J084k74o85L22R70R44J594K602K346
54982D3498J427J974L532L564J902Q32Q71L91n85l01R90J189L63O46K015K144
$$ y = [29455, 30731, 30668, 30584, 31102, 31253, 30947, 31390, 32393, 32227, 30888, 30549, 31969, 33317, 33486, 33721, 34980, 36332, 36984, 37388, 37535, 36587, 34968, 34287, 34632, 34508, 33911, 34615, 36821, 38514, 38870, 39357, 40677, 41586, 41633, 42074, 43085, 43114, 42016, 41769, 42970, 43695, 43094, 43037, 44713, 46567, 47243, 47721, 48849, 49368, 48174, 46216, 44558, 42803, 40839, 39818, 39972, 39774, 38602, 37986, 38884, 40059, 40453, 40804, 41606, 41879, 41370, 41565, 43042, 44126, 43614, 42578, 42093, 41501, 40357, 39805, 40405, 40761, 39862, 38798, 38765, 39306, 39781, 40534, 41479, 41624, 41105, 41470, 42880, 43422, 42247, 40916, 40490, 39950, 38817, 38545, 39743, 40608, 39842, 38653, 38184, 37503, 35909, 34744, 34985, 35361, 34737, 34107, 34399, 34582, 33867, 33540, 34595, 35679, 35405, 34720, 35042, 36012, 36956, 38550, 41152, 43498, 44925, 46899, 50431, 53995, 55897, 56729, 57600, 57991, 57406, 57105, 58095, 59284, 59647, 60293, 62308, 64452]
54966F4452P87K50J181J748J510K131L740M392L866M246O077P405P400P552Q692
54951A25429J0062J1604J3925J5735J4800J1632Q707O062J536m512q882j0527
54939A95571j1717j3470j3913j2315j0809j0722j0644r448q036o928n266l177
54927G9126k181k329j959q93p53j548j308K14R64M82Q25K654L929L637L464M515
54911H8839N606O073P189R485J1566J2732J3913J5006J4152J0792O680K863j516
54898B03380o542j0501j2498j3476j3830j2796j0768r415q844p575n734n160n840
54885H0401n573l898k840l071k816j530j044j907k157j019l29r36j131r4M19m96
54869E1979j084k49M35k79j195j224j228j747j683p37l88j032j003K11P29k94
$$ y = [64452, 65239, 65489, 66670, 68418, 69928, 72059, 75799, 80191, 84057, 88303, 94380, 101785, 109185, 116737, 125429, 135491, 147095, 161020, 176755, 191555, 203187, 211894, 217956, 219492, 214980, 206098, 195571, 183854, 170384, 156471, 144156, 133347, 122625, 111981, 102533, 94497, 87569, 82303, 79126, 76945, 74616, 72657, 71764, 71011, 69463, 68155, 68369, 69333, 69815, 70640, 73294, 77223, 80860, 84324, 88839, 94445, 100518, 107707, 117192, 128758, 141490, 155403, 170409, 184561, 195353, 202033, 204896, 203380, 196838, 186337, 173839, 160363, 146533, 133737, 122969, 113554, 104710, 97135, 91401, 86241, 80401, 74828, 70930, 68090, 65019, 62203, 60673, 59629, 57722, 55565, 54546, 54217, 53281, 52150, 52056, 52475, 51979, 50895, 50646, 51081, 50802, 49607, 48383, 47155, 45408, 43725, 42988, 42600, 41568, 40565, 40776, 41505, 41211]
54853D1211j042l82K10k43l28P97J494P33J31Q59J243j97j923j885o91n2%K15
54835D0150L18J5J13R39J323N87j03K82J000J110Q60M99m25j520j345J95J287
54818D5285R51L15L53N03M09P21J410J494J185J893L434L886K883K386L322M355
54802G4785M787N723P456Q683R300J0907J3526J4974J4518J3937J3831J2391R058
54789B13876N762L055j077o786j0638j0699r645j0353j1641j1162r384p922o647
54776A26739n119m393m893m911l487k252k314k079m28R11N86K98J605K927K632
54761A05822K258L668N551N978O018P578R767J0689J1067J2779J5359J6902J7084
54748B30520J6541J4648J0610N517Q97l483q228j2333j4707j6106j7387j7566
$$ y = [41211, 40169, 39787, 39997, 39754, 39426, 40223, 41717, 42450, 42581, 43440, 44683, 44486, 42563, 40678, 39987, 39935, 39935, 40150, 40468, 40483, 40596, 41535, 42858, 43445, 43342, 43624, 44624, 45734, 46594, 47093, 46668, 45148, 43803, 43998, 45285, 46236, 46551, 46904, 47407, 47816, 48537, 49947, 51441, 52626, 54519, 57953, 61839, 64722, 67108, 70430, 74785, 79572, 85295, 92751, 101434, 110734, 121641, 135167, 150141, 164659, 178596, 192427, 204818, 213876, 219638, 222693, 221616, 214830, 204192, 193493, 183848, 173495, 161854, 150692, 141308, 133386, 126739, 121620, 117227, 112334, 107423, 103936, 101684, 99370, 97291, 96863, 97774, 98360, 98658, 100263, 103190, 105822, 108080, 111748, 117299, 123277, 129295, 136873, 146640, 157329, 168396, 181175, 196534, 213436, 230520, 247061, 261709, 272319, 277836, 278733, 275250, 267022, 254689, 239982, 223876, 206489, 188923]
54736A88923j5780j3367j1845j0696r222q512r155r168o843l750k312k203j747
54723H4323j080j159j425j102j163k336k927j411M98L83q59n69J307K493K080
54708G7053J062L5j067j624j056j88L7K02R68J374N58l04L8O07M5p91m59L17M5
54689G6852p74p30k0L93P93J607J783O17l26M38J607J260J20L5P14Q13P82J734
54671H7698K724K179R48J033K204K695K412K655L521M102M630N810O815O344M928
54656A40698L893L020J522K73N33J500J556J047J367K294K700K889L770M684M586
54641A76332M372N484P171P689P205O978O636M887K089m37k763n597q163r358
54627B02525r936j1039j1725j0588q705q119q413p708o095n095m641l483j921
$$ y = [188923, 173143, 159776, 147931, 137235, 128013, 119501, 110346, 101178, 94335, 90585, 88273, 86070, 84323, 83243, 82084, 80659, 79557, 78394, 76058, 73131, 71720, 72218, 72601, 71742, 71173, 72480, 74973, 77053, 78115, 78150, 77083, 75459, 74403, 74215, 74252, 74454, 75422, 76796, 77354, 77050, 77088, 77695, 77740, 76949, 76490, 76807, 76852, 76078, 75348, 75328, 75721, 76514, 78121, 79904, 80521, 80195, 80633, 82240, 83500, 83620, 83655, 84369, 85182, 85964, 87698, 90422, 92601, 93549, 94582, 96786, 99481, 101893, 104548, 108069, 112171, 116801, 122611, 129426, 135770, 140698, 144591, 147611, 149133, 149406, 149939, 151439, 152995, 154042, 155409, 157703, 160403, 163292, 167062, 171746, 176332, 180704, 186188, 193359, 201048, 208253, 215231, 221867, 226754, 228843, 228406, 225643, 220046, 211883, 202525, 192589, 181550, 169825, 159237, 150532, 142413, 134000, 126292, 120197, 115102, 110461, 106978, 105057]
54614A05057j250j145l93N87O56N46J695L351L729L194L329L711K823J333J161
54599A28384J890J400l29j402j606k513m139m814m389m454n206n071l695k533
54585I1523k286k291k361k876l149k270j155j310k105j979j508k291l460k740
54571E9742n92K35q96j916j843j693j556k78J547J707Q2r80n43j80o81p89j8L43
54553E1691j42k55K96K63m14j30J380K221J456M12J52J86M29J760L718M275K939
54536G0237J750K176L312L996M422M782M535L886L920M472M045K403J071O15k14
54521A15408j890l093l152l229m049m640m385m241m811n101m251k863j720p64
54507F7219q9k73j110j541j329j239j323q12Q4J83n42q17l01k5l25m12k21n51
$$ y = [105057, 103807, 102662, 102269, 102856, 103512, 104058, 105753, 109104, 112833, 116027, 119356, 123067, 125890, 127223, 128384, 130274, 131674, 131345, 129943, 128337, 125824, 121685, 116871, 112482, 108028, 102822, 97751, 94056, 91523, 89237, 86946, 84585, 81709, 78560, 76290, 75135, 73825, 71720, 69741, 68233, 65942, 62482, 59742, 59150, 59385, 58489, 56573, 54730, 53037, 51481, 51203, 52750, 54457, 54539, 53559, 53016, 52836, 52155, 51366, 51348, 51691, 51549, 51294, 51590, 51853, 51439, 51309, 52689, 54910, 56366, 56778, 56930, 57116, 57545, 59305, 63023, 67298, 70237, 71987, 74163, 77475, 81471, 85893, 90675, 95210, 99096, 103016, 107488, 111533, 113936, 115007, 115622, 115408, 113518, 110425, 107273, 104044, 99995, 95355, 90970, 86729, 81918, 76817, 72566, 69703, 67983, 67219, 67130, 66857, 65747, 64206, 62877, 61638, 60315, 59503, 59587, 59770, 59228, 58411, 58110, 58085, 57760, 57348, 57127, 56576]
54489E6576j093n12J115K183K189K215K467J827L57k51N19J157Q81P94J397J345
54473G3166j50j794k243j822j215l03P71J065M01j26N2K48P9R4L14n0q99j036
54455F6552j62O14O57M68J50q09j898j774m89L79J65k78n55j181j794j251J40
54438E8934Q05N74Q08J487R38r75k131j477m79k58P9J130J729J084K79K73M37
54421F3237J34j07Rj26m72j19P52P77j17l43M74P89L5l07M56R44M16K43J312K382
54401G0369K521K809M131N380N513N366N892O411O126N598N417N029M144L555
54387A38261L470K896J621Q57R03L01j530l037l161l048l764m472m308m074m510
54372A16405m810m289l668l487l062k259k205k979k823j081L28k3q25n36M4l49
$$ y = [56576, 55483, 54971, 56086, 58269, 60458, 62673, 65140, 66967, 67324, 67073, 67592, 68749, 69630, 70424, 71821, 73166, 73016, 71222, 68979, 67157, 65942, 65639, 66410, 67475, 67876, 67750, 67802, 68050, 68129, 68223, 68537, 68487, 67588, 66552, 66390, 67004, 67661, 68129, 68279, 67470, 65572, 63798, 63309, 63688, 63853, 63575, 63020, 61839, 60045, 58794, 58934, 59739, 60313, 61121, 62608, 63546, 62571, 60440, 58963, 58484, 58226, 58305, 59435, 61164, 62248, 62527, 62800, 63237, 63371, 63264, 63273, 63147, 62675, 62556, 63308, 64085, 63968, 63625, 64099, 64888, 64923, 64616, 65072, 66016, 66432, 66675, 67987, 70369, 72890, 75699, 79830, 85210, 90723, 96089, 101981, 108392, 114518, 120116, 125533, 130562, 134706, 138261, 141731, 144627, 146248, 147105, 148008, 148309, 146779, 143742, 140581, 137533, 133769, 129297, 124989, 120915, 116405, 111595, 107306, 103638, 100151, 97089, 94830, 92625, 89646, 86823, 85742, 86070, 86047, 85222, 84686, 84730, 84381]
54356H4381j005p31p2n1k51L2K55j11k15O39J601J916K392L695M782M670M176
54339A06103M317M513L968L372L626M222M347M221M080L281J683L21m53j720l728
54324A42153m830m168l357l920m904m854m253m207m437m309m237m399l788k225
54310H4265j501k638l874l305j853j478k040k068j340o92k98k5l30j277j780j272
54294E8494q02j156j448r28m48o45n58L58P85j50j062p04k17r07j690j039K18
54277D8101M43pJ77P74P97M93M75J11j125k017j338N3P76J151J929K302J321l0
54259E4386l40o8k99n92p0O56P40Q28J535J714M20r08n08Q49J334R98R29R21L02
54240F2827k29J12L93l74j132o73k6n98j478j140l07m44r10m09J70p00k063j885
$$ y = [84381, 83376, 82645, 82573, 82522, 82271, 82303, 82558, 82447, 82232, 82871, 84472, 86388, 88780, 92475, 97257, 101927, 106103, 110420, 114933, 118901, 122273, 125899, 130121, 134468, 138689, 142769, 146050, 147733, 148054, 147601, 145881, 142153, 137323, 133155, 129798, 125878, 120974, 116120, 111867, 107660, 103223, 98914, 94677, 90278, 86490, 84265, 82764, 80126, 76252, 72947, 71094, 69616, 67576, 65508, 64168, 63476, 63178, 63153, 62823, 61546, 59766, 58494, 57692, 56536, 55088, 54160, 53712, 53067, 52509, 52867, 53652, 53502, 52440, 51736, 51519, 50612, 48922, 47883, 48101, 48544, 48537, 48714, 49488, 50285, 50778, 51253, 51364, 50239, 48222, 46884, 46937, 47713, 48864, 50793, 53095, 54416, 54386, 54046, 53978, 53679, 53087, 53017, 53673, 54413, 55241, 56776, 58490, 58910, 58002, 57494, 58343, 59677, 60675, 61604, 62525, 62827, 62598, 62710, 63103, 62729, 61597, 60924, 60898, 60300, 58822, 57682, 57375, 56931, 56021, 55612, 55782, 55082, 53019, 51134]
54222E1134n33J13m7J60M52j63q84l62M73j20j322r86N61J167O09N03R89P55l5
54203E2464m6L25m79j943k000o72j2m37k66R24J605J255J080J336P99o02j238
54186E2093m63N53J036J470J855J434M40L4K06j56j060j385j050j025j244p04
54170E2034L84P65M27M61P73K61q57j222p71o03n88L40J673J750O80J98N37K26
54152E6468q28r64J56Q95N95M50Q54N88o05j190m44M54P56J220K002J867M29q83
54134F1820j120j092j465j547q81k76l57o58q36j214j581j148j59J17n14q48l63
54117D7878R2J07L46R87J312J184J255J364O31o37j044m18j03n67p54j57M06N04
54099E2386O74Q78L78n02m78M48P85O6n34m34m66r38r60k90J02j18j33K53K47
$$ y = [51134, 50601, 50714, 50667, 50827, 51279, 51116, 50232, 49870, 50343, 50223, 48901, 47915, 48476, 49643, 50252, 50755, 51744, 52499, 52464, 52418, 52743, 52264, 50321, 48321, 47649, 47637, 47200, 46934, 47858, 49463, 50718, 51798, 53134, 53933, 53331, 52093, 51630, 52183, 53219, 54689, 56544, 57978, 58418, 58452, 58658, 58502, 57442, 56057, 55007, 53982, 52738, 52034, 52418, 53183, 53610, 54071, 54844, 55105, 54248, 53026, 52255, 51652, 51064, 51404, 53077, 54827, 55507, 55705, 56242, 56468, 55640, 54676, 54832, 55727, 56322, 56772, 57626, 58214, 57609, 56419, 55975, 56429, 57185, 58405, 60407, 62274, 62703, 61820, 60700, 59608, 58143, 56596, 55715, 55439, 55082, 54424, 53588, 52374, 50793, 49645, 49486, 49603, 49089, 48241, 47878, 47970, 48077, 48423, 49410, 50722, 51906, 53161, 54525, 55156, 54519, 53475, 53057, 52954, 52387, 51633, 51476, 51882, 52386, 53060, 53938, 54316, 53814, 53336, 53784, 54569, 54635, 54101, 53667, 53201, 52263, 51303, 51013, 51115, 50997, 50864, 51117, 51364]
54080E1364j90j92R6m13j463j477l01M67L00M83J383J572N61q5N08R93K82o18
54062E3270n15J26N27R34J470J456R17J041K094K608J677L59j59j32o8K71Q30
54045F6706R13O76J235K499K870J893J167J658K262K108K128L012L613L006K272
54030I8018K735L913M672N009N324N364N150N556O715P239O208M639L858L701
54016A68101L389K884K403J814J418J958L064L271K302J613J833J656L28p90n55
54001A94689n0o84j949k643k876l244l346k705k095k406l233l752l984m099l708
53986A53915k911k795l720m377l765k727k361k253j672j137j368j761j397o12
53972A21059k55k85k99m83r36j006l54K24O0l47m08m29n66j20J116J966J525N08
$$ y = [51364, 51174, 50982, 51078, 50665, 49202, 47725, 47424, 47891, 48191, 48674, 50057, 51629, 52190, 52105, 52613, 53606, 53888, 53270, 52755, 52881, 53408, 54342, 55812, 57268, 58185, 59226, 61320, 63928, 65605, 65964, 65805, 65673, 65605, 65876, 66706, 67619, 68295, 69530, 72029, 74899, 76792, 77959, 79617, 81879, 83987, 86115, 89127, 92740, 95746, 98018, 100753, 104666, 109338, 114347, 119671, 125035, 130185, 135741, 142456, 149695, 155903, 160542, 164400, 168101, 171490, 174374, 176777, 178591, 180009, 181967, 185031, 188302, 190604, 192217, 194050, 195706, 196034, 195244, 194689, 194639, 193955, 192006, 189363, 186487, 183243, 179897, 177192, 175097, 172691, 169458, 165706, 161722, 157623, 153915, 151004, 148209, 144489, 140112, 136347, 133620, 131259, 129006, 127334, 126197, 124829, 123068, 121671, 121059, 120804, 120519, 120220, 119737, 118801, 117795, 117441, 117665, 117725, 117378, 116970, 116541, 115975, 115855, 116971, 118937, 120462, 120970]
53954A20970j8j37k40L8R11J648J851K393L870N299N637N464N834O475O489O041
53938A72525N940O215O239N877N542N447N380M833L177M23k183l430l880m931
53924B07174o233o026m211k820k825k732j360L02J279K365M219N601N355M460
53910B04548M448N149N607N855O260O481O429O904P883P782N836L680K961K923
53896B82746K067O94j12o61j832l070l143k165j319j282k124l871n976p258p445
53881B45249p557p919p432n910n106n929o633n684m431m678n458m723k904k068
53867A68817k542k993l056l469m096m137l932m401n062m596l110j995j803j906
53853A21719j917j927j674r84n70j053j747j742j447j629j788j114k32l03j085
$$ y = [120970, 120952, 120815, 120575, 120613, 121524, 123172, 125023, 127416, 131286, 136585, 142222, 147686, 153520, 159995, 166484, 172525, 178465, 184680, 190919, 196796, 202338, 207785, 213165, 217998, 221175, 221598, 219415, 215985, 212105, 207174, 200941, 194915, 190704, 187884, 185059, 182327, 180967, 181269, 182548, 184913, 189132, 194733, 200088, 204548, 208996, 214145, 219752, 225607, 231867, 238348, 244777, 251681, 259564, 267346, 273182, 276862, 279823, 282746, 284813, 285507, 285395, 284734, 282902, 279832, 276689, 274524, 273205, 271923, 269799, 265928, 259952, 252694, 245249, 237692, 229773, 222341, 216431, 211325, 205396, 198763, 193079, 188648, 183970, 178512, 173789, 170885, 168817, 166275, 163282, 160226, 156757, 152661, 148524, 144592, 140191, 135129, 130533, 127423, 125428, 123625, 121719, 119802, 117875, 116201, 115217, 114647, 113594, 111847, 110105, 108658, 107029, 105241, 104127, 103895, 103592, 102507]
53838A02507j494j453j577j665j172n17m20n54k89m0l71o50j52L83m6q16p69k37
53820I0668k02l21K93J122J085O08Q15J321R06r6k49N34R88P19N68Q81J171J368
53802A02179J759K010J735J632K530L868M647N225O355P213O424M546L436L500
53788A57059L596L379L613M233M179L244K360J911J403P89N26L96j96q92q18j85
53772A84597O7j33k39n41j673l003l320k848k765l024k530j349p88j232j736j868
53756A57615k237k909l039k332j523j140j014j091j520j991k077k048k245k101
53742A30348j017K64N96J69q8k29p85j179m62Q28J382J240J389J728J413Q76J387
53725A37860K698L256K707K223K338K344J991J848J795J021l35j233j544k111
$$ y = [102507, 101013, 99560, 97983, 96318, 95146, 94629, 94209, 93655, 93366, 93326, 92955, 92305, 92153, 92536, 92490, 91674, 90905, 90668, 90466, 90145, 90438, 91560, 92645, 93253, 94068, 95389, 96295, 96199, 95950, 96484, 97472, 98191, 98759, 99640, 100811, 102179, 103938, 105948, 107683, 109315, 111845, 115713, 120360, 125585, 131940, 139153, 145577, 150123, 153559, 157059, 160655, 164034, 167647, 171880, 176059, 179303, 181663, 183574, 184977, 185766, 186292, 186688, 186492, 185600, 184782, 184597, 184664, 184531, 184292, 183751, 182078, 179075, 175755, 172907, 170142, 167118, 164588, 163239, 162451, 161219, 159483, 157615, 155378, 152469, 149430, 147098, 145575, 144435, 143421, 142330, 140810, 138819, 136742, 134694, 132449, 130348, 129331, 129595, 130191, 130360, 130272, 130043, 129258, 128079, 127617, 128445, 129827, 131067, 132456, 134184, 135597, 136473, 137860, 140558, 143814, 146521, 148744, 151082, 153426, 155417, 157265, 159060, 160081, 159746, 158513, 156969, 154858]
53711A54858k901k916k060j414j419j376r53o38n30j56M20P09R58J750K669K872
53695A49873K719L183L953L890L101K688K679K193J487J702K669L101K930L321
53681A89489M267M391L488K955L313L428K811K541L221L907L871L718L979M120
53667B39499L668K977K339J583Q81O62O10pr58j408j490k017k802l032k994l617
53651B33894m441m226l314l240l935l729k288j178j162j293j078j155j428q74
53637B00553J95J12j262j973j091k4J15Q6N19O48J38N7Q07J175N61J17N75R37
53619B02245N81N98J731K888L068K984L401L637L123K782L356L919L436K471K018
53604B42238K047K355L417N121O177O027N869O539O929N913M440M125M940N783
$$ y = [154858, 151957, 149041, 146981, 145567, 144148, 142772, 141819, 141181, 140651, 140495, 140915, 141624, 142582, 144332, 147001, 149873, 152592, 155775, 159728, 163618, 166719, 169407, 172086, 174279, 175766, 177468, 180137, 183238, 186168, 189489, 193756, 198147, 201635, 204590, 207903, 211331, 214142, 216683, 219904, 223811, 227682, 231400, 235379, 239499, 243167, 246144, 248483, 250066, 250947, 251609, 252219, 252212, 251254, 249846, 248356, 246339, 243537, 240505, 237511, 233894, 229453, 225227, 221913, 218673, 214738, 211009, 208721, 207543, 206381, 205088, 204010, 202855, 201427, 200553, 200748, 200860, 199598, 197625, 196534, 196510, 196625, 196711, 197230, 197878, 198016, 198073, 198880, 200055, 200616, 200733, 201308, 202245, 202826, 203424, 205155, 208043, 211111, 214095, 217496, 221133, 224256, 227038, 230394, 234313, 237749, 240220, 242238, 244285, 246640, 250057, 255178, 261355, 267382, 273251, 279790, 286719, 292632, 297072, 301197, 306137, 311920]
53590C11920O265O543O388N707N138N023M693L758L012L087L381L274L290L887
53576C75366M341L929L173K808K530J835J128R46J042J079J337J903K162J850
53562D05429J551J514J212P09R98K204K923K317J412J330J696J894K390L592M689
53547D35860M943M901N136N033M120L334L674M557M798M278L506K569J665J564
53533D89938K446L199K917K180J846J732J461J458K118K971L625M472N566O137
53519E32066O049O406P648Q620Q579Q649R951J1777J3011J3953J5240J6279J6417
53506F74645J6452J7419J8862J9825K0591K1890K3364K4361K5284K6775K8342
53495I17810K9206K9656L0324L1033L1615L2728L4505L5491L4489L2482L1197
$$ y = [311920, 318185, 324728, 331116, 336823, 341961, 346984, 351677, 355435, 358447, 361534, 364915, 368189, 371479, 375366, 379707, 383636, 386809, 389617, 392147, 393982, 395110, 396056, 397098, 398177, 399514, 401417, 403579, 405429, 406980, 408494, 409706, 410415, 411413, 413617, 416540, 418857, 420269, 421599, 423295, 425189, 427579, 431171, 435860, 440803, 445704, 450840, 455873, 459993, 463327, 467001, 471558, 476356, 480634, 484140, 486709, 488374, 489938, 492384, 495583, 498500, 500680, 502526, 504258, 505719, 507177, 509295, 512266, 515891, 520363, 525929, 532066, 538115, 544521, 552169, 560789, 569368, 578017, 587968, 599745, 612756, 626709, 641949, 658228, 674645, 691097, 708516, 727378, 747203, 767794, 789684, 813048, 837409, 862693, 889468, 917810, 947016, 976672, 1006996, 1038029, 1069644, 1102372, 1136877, 1172368, 1206857, 1239339, 1270536]
53484A270536L0703K9941K8770K7917K7577K7481K7689K8104K8091K7617K7754
53473A582180K8789K9158K7712K5689K4768K4383K2975K0869J9686J9566J9022
53462A844797J7289J5010J2882J1165J0177R825R034O919M097J580q37l754o666
53449A931518q781j0632j3179j5982j7901j9073k0560k2565k4541k6490k8624
53438A723190l0311l0912l1040l1452l1519l0451k9319k9766l1292l1914l1188
53427A384026l0472l0300k9609k7771k5514k3464k1400j9327j7822j7021j6322
53416A125004j5299j3938j2035r450o737m526k507j46K145L737N206P530J0307
53403A089291J2361J3810J5896J8811K1342K2820K3939K5474K7372K9343L1236
$$ y = [1270536, 1301239, 1331180, 1359950, 1387867, 1415444, 1442925, 1470614, 1498718, 1526809, 1554426, 1582180, 1610969, 1640127, 1667839, 1693528, 1718296, 1742679, 1765654, 1786523, 1806209, 1825775, 1844797, 1862086, 1877096, 1889978, 1901143, 1911320, 1921145, 1930179, 1937098, 1941195, 1942775, 1941938, 1938184, 1931518, 1922737, 1912105, 1898926, 1882944, 1865043, 1845970, 1825410, 1802845, 1778304, 1751814, 1723190, 1692879, 1661967, 1630927, 1599475, 1567956, 1537505, 1508186, 1478420, 1447128, 1415214, 1384026, 1353554, 1323254, 1293645, 1265874, 1240360, 1216896, 1195496, 1176169, 1158347, 1141326, 1125004, 1109705, 1095767, 1083732, 1074282, 1067545, 1063019, 1060512, 1060366, 1062511, 1066248, 1071454, 1078984, 1089291, 1101652, 1115462, 1131358, 1150169, 1171511, 1194331, 1218270, 1243744, 1271116, 1300459, 1331695]
53392A331695L2772L3903L5385L7963M1089M3509M5018M6615M9022N1984N4873
53381A803828N7075N8139N8469N9401O1663O4271O5955O6959O8178O9229O8970
53370B502137O7510O6153O5475O4884O3859O2274N9658N5515N0294M4994L9950
53359C142703L4980L0307K6200K2184J7706J3087Q681L884j773p388j2050j6455
53347C262066k1441k5910k8480l0516l4983m2416n0371n6890o2114o6266o8515
53336B774164o8579o7511o6091o4108o1861o0601o0696o0847o0011n8808n8242
53325B086809n8175n7781n6595n4522n1729m8871m6613m4635m2012l8690l5589
53314A551597l3110l0691k8057k5786k4347k3439k2608k1595k0032j7682j5009
$$ y = [1331695, 1364467, 1398370, 1433755, 1471718, 1512807, 1556316, 1601334, 1647949, 1696971, 1748955, 1803828, 1860903, 1919042, 1977511, 2036912, 2098575, 2162846, 2228801, 2295760, 2363938, 2433167, 2502137, 2569647, 2635800, 2701275, 2766159, 2830018, 2892292, 2951950, 3007465, 3057759, 3102753, 3142703, 3177683, 3207990, 3234190, 3256374, 3274080, 3287167, 3295848, 3299732, 3297959, 3290571, 3278521, 3262066, 3240625, 3214715, 3186235, 3155719, 3120736, 3078320, 3027949, 2971059, 2908945, 2842679, 2774164, 2705585, 2638074, 2571983, 2507875, 2446014, 2385413, 2324717, 2263870, 2203859, 2145051, 2086809, 2028634, 1970853, 1914258, 1859736, 1808007, 1759136, 1712523, 1667888, 1625876, 1587186, 1551597, 1518487, 1487796, 1459739, 1433953, 1409606, 1386167, 1363559, 1341964, 1321932, 1304250, 1289241]
53303A289241j2687j0583q185n701l744k122j38K185M263O093P925R215R425R493
53289A294680J0851J3181J4879J5698J7011J9296K1415K2772K4318K6697K9086
53278A509884L0720L2087L3705L4999L5280L4776L3973L2823L1343L0058K9211
53267A868859K8225K6514K4168K1620J9249J7378J5888J3929J0981Q033O527O135
53255B067506M944K001j650m725p109r200j1082j2910j5041j7352j9277k0748
53243A955357k2164k3488k4403k5344k7066k9206l0552l0889l1098l1391l0998
53232A648758k9918k9252k9373k9307k8514k7715k7283k6402k4701k3317k3271
53221A349705k3949k4200k3952k3762k3626k3174k2364k1255j9738j8119j7155
$$ y = [1289241, 1276554, 1265971, 1257786, 1252085, 1248341, 1246219, 1246081, 1248266, 1252529, 1258622, 1266547, 1275762, 1285187, 1294680, 1305531, 1318712, 1333591, 1349289, 1366300, 1385596, 1407011, 1429783, 1454101, 1480798, 1509884, 1540604, 1572691, 1606396, 1641395, 1676675, 1711451, 1745424, 1778247, 1809590, 1839648, 1868859, 1897084, 1923598, 1947766, 1969386, 1988635, 2006013, 2021901, 2035830, 2046811, 2054844, 2061371, 2067506, 2072450, 2074451, 2072801, 2068076, 2060967, 2051767, 2040685, 2027775, 2012734, 1995382, 1976105, 1955357, 1933193, 1909705, 1885302, 1859958, 1832892, 1803686, 1773134, 1742245, 1711147, 1679756, 1648758, 1618840, 1589588, 1560215, 1530908, 1502394, 1474679, 1447396, 1420994, 1396293, 1372976, 1349705, 1325756, 1301556, 1277604, 1253842, 1230216, 1207042, 1184678, 1163423, 1143685, 1125566, 1108411]
53210A108411j6976j6657j5491j3977j2983j2693j2928j3773j5219j6693j7585
53199I43436j7829j7667j7230j6624j6003j5381j4806j4593j4883j5159j4944
53188G68317j4713j5251j6286j6816j6716j6842j7601j8530j9292j9901j9937
53177E76432j8858j7161j5997j5490j4744j3649j3160j3518j3662j2937j2000
53166D15256j1433j0824r884r283r498r820r337q168p062o417o190o168n955n286
53152B99931m575m491m959n224m984m598m227l679l069k659k218j445q61j101
53138B51841j612j336n11l04q04q85q4R70K000L329M570M786M169L921M248M081
53122B78379L060K013J210j00j960l333l852m271m737m521l868m143n528o497
$$ y = [1108411, 1091435, 1074778, 1059287, 1045310, 1032327, 1019634, 1006706, 992933, 977714, 961021, 943436, 925607, 907940, 890710, 874086, 858083, 842702, 827896, 813303, 798420, 783261, 768317, 753604, 738353, 722067, 705251, 688535, 671693, 654092, 635562, 616270, 596369, 576432, 557574, 540413, 524416, 508926, 494182, 480533, 467373, 453855, 440193, 427256, 415256, 403823, 392999, 383115, 373832, 364334, 354514, 345177, 337009, 329947, 323530, 317340, 311172, 305217, 299931, 295356, 290865, 285906, 280682, 275698, 271100, 266873, 263194, 260125, 257466, 255248, 253803, 252942, 251841, 250229, 248893, 248382, 248078, 247274, 246389, 246305, 247275, 249275, 252604, 257174, 261960, 266129, 270050, 274298, 278379, 281439, 283452, 284662, 284562, 282602, 279269, 275417, 271146, 266409, 261888, 258020, 253877, 248349, 241852]
53108B41852o261n789n752n432m511l939m054l867l127l061l949m190l028k035
53094A82857k372k759j910r16j157j684j007J9m90k269l389l186k622k254j802
53079A55059j414j583k035k068j728j503j270o85q5K2j71l51p77j437j431l36
53063A38207P33O49lQN66O93K97Q7K23L43M58P39Q37M37nJ3J51J3NN41J078R65
53041A47035M46l9p17j642j973j238l86l66n91j28M67O6j063j669j483j222j134
53024A34363q32l39o5J7J49J07l13o11l54n5l11o74m49J4nk53M7Q13J285J176
53004A33710P34Q2n62n97J25P50O02K29L64P01O99P67J452K233K388K330K762
52987A48769L228K887K155K187L114M146N001N983O892P090O410N150L550K094
$$ y = [241852, 235591, 229802, 224050, 218618, 214107, 210168, 206114, 202247, 199120, 196059, 192110, 187920, 184892, 182857, 180485, 177726, 175816, 174900, 173743, 172059, 171052, 171071, 170581, 168312, 164923, 161737, 159115, 156861, 155059, 153645, 152062, 150027, 147959, 146231, 144728, 143458, 142773, 142688, 142710, 142539, 142188, 141411, 139974, 138543, 138207, 138940, 139589, 139586, 139594, 140160, 140853, 141150, 141237, 141460, 141803, 142261, 143000, 143837, 144274, 144269, 144282, 144433, 144446, 144451, 144992, 146070, 147035, 147481, 147442, 146725, 145083, 143110, 141872, 141486, 141120, 140529, 140401, 140868, 140934, 139871, 138202, 136719, 135497, 134363, 133531, 133192, 133127, 133144, 133293, 133400, 133087, 132476, 132122, 132067, 131756, 131082, 130633, 130647, 130642, 130389, 130436, 131249, 132534, 133710, 134444, 134526, 133964, 133367, 133492, 134242, 134844, 135073, 135437, 136138, 136837, 137604, 139056, 141289, 143677, 146007, 148769, 151997, 154884, 157039, 159226, 162340, 166486, 171487, 177470, 184362, 191452, 197862, 203012, 206562, 208656]
52973B08656J603K048J972K52k224l747l975l708l278k575k067k338k994l241
52959A84384l104l000k659j737q52p14q47m29J75P2n38q25q45j136j419j153q42
52942A64531j287j962j753q74m30m58q7O26O74j43r26j144r81m40N27J230R52
52925A58055K87L65R98J050L99p6k05o17j192j119n03l10n82l23O26J218R99P90
52907A59860J135J398J000M07L18P42J219J310P52j60m73L48J400J455P85P45
52891A72241J639K312J937J043N35O45J079J444J366Q69M92N83P58O66O18Q11
52875A89038P06J46P3J010J821J485R81J670K724K403J117Q83J994K760K542K591
52859B13944L482M104L873L782M400M687L833K554J665Q03m18j354j408j056r35
$$ y = [208656, 210259, 212307, 214279, 214531, 212307, 208560, 204585, 200877, 197599, 195024, 192957, 190619, 187625, 184384, 181280, 178280, 175621, 173884, 173032, 172318, 171471, 171042, 171217, 171289, 170751, 169926, 169081, 167945, 166526, 165373, 164531, 163244, 161282, 159529, 158655, 158225, 157767, 157680, 158306, 158980, 158837, 157911, 156767, 155786, 155346, 155873, 157103, 158055, 158342, 158707, 159705, 160755, 161154, 161078, 160873, 160256, 159064, 157945, 157442, 157132, 156550, 156227, 156853, 158071, 159070, 159860, 160995, 162393, 163393, 163800, 164118, 164860, 166079, 167389, 168141, 167981, 167508, 167856, 169256, 170711, 171496, 172241, 173880, 176192, 178129, 179172, 179707, 180352, 181431, 182875, 184241, 185110, 185602, 186185, 186943, 187609, 188227, 189038, 189744, 189890, 189963, 190973, 192794, 194279, 195260, 196930, 199654, 202057, 203174, 204057, 206051, 208811, 211353, 213944, 217426, 221530, 225403, 229185, 233585, 238272, 242105, 244659, 246324, 247127, 246709, 245355, 243947, 242891, 241956]
52844B41956r27q63j121j806k252k065j736j712j712j530j616k303l215l975m705
52829B10418n345n332m405l135k289k143k579l189l223k250q85j82l41p44j103
52814A73273j524j662j024j04Qp82j503j636j563j466j144r32j446k172j795k85
52798A54243P87M29n16r29r63j325k001k448k411k006j571j537j920k008j281
52783A34543m39m60r83q71j24K22J0P4L74j60j494k036j037J48M9r91j773j897
52765A23155j598r93l66l33r32j318j065r28j688k898l476k957j809r25r66j704
52749I9199k039j325m56o79j689k085j499q27m84n2K93k19j269j531q33n07j025
52732H2973j150k03O20K35n81o42j34K24O23J418K043J873J405J500K050K405
$$ y = [241956, 241029, 240166, 239045, 237239, 234987, 232922, 231186, 229474, 227762, 226232, 224616, 222313, 219098, 215123, 210418, 205073, 199741, 195336, 192201, 189912, 187769, 185190, 182001, 178778, 176528, 175643, 175461, 175120, 174376, 173273, 171749, 170087, 169063, 168959, 168967, 168185, 166682, 165046, 163483, 162017, 160873, 159941, 158495, 156323, 154528, 154243, 155030, 155459, 154943, 154014, 153051, 151726, 149725, 147277, 144866, 142860, 141289, 139752, 137832, 135824, 134543, 134104, 133644, 132661, 131790, 131666, 131888, 131898, 131972, 132346, 132186, 130692, 128656, 127619, 127767, 127816, 126825, 125052, 123155, 121557, 120564, 120198, 119865, 118933, 117615, 116550, 115622, 113934, 111036, 107560, 104603, 102794, 101869, 100903, 99199, 97160, 95835, 95379, 94700, 93011, 90926, 89427, 88600, 88116, 88064, 88357, 88138, 86869, 85338, 84505, 83998, 82973, 81823, 81620, 82240, 82475, 81894, 81252, 81118, 81342, 81965, 83383, 85426, 87299, 88704, 90204, 92254, 94659]
52716I4659K433K343K102J792J900K559L114L061K759K666K582K194J694J253
52702A27111N96m15j381j995k371k537k331k012k112k469k373j834j652k061k415
52687I9749k394k369k340j869j282j520k420k627j654n15J18P47J450J218k08
52672H4084j451j481j034j118j466j504j449j424q42K53O41k56j303j482j368
52657F8800j592j377j22J025P75j92m22M5K07J6P2J13m56j079o80N16J217R03
52639F7769J73l67n26j19P33J310J187J046J690K721L154K720J716K24j480k377
52623G9574j752l55M52L46q3n42j087j407j056k29M80Q02O83K6q93j339j059o39
52605G1922l96J84J242J848J398P46R20J619J987J984J912J471M56m13n33m80
$$ y = [94659, 97092, 99435, 101537, 103329, 105229, 107788, 110902, 113963, 116722, 119388, 121970, 124164, 125858, 127111, 127707, 127292, 125911, 123916, 121545, 119008, 116677, 114665, 112553, 110084, 107711, 105877, 104225, 102164, 99749, 97355, 94986, 92646, 90777, 89495, 87975, 85555, 82928, 81274, 80759, 80877, 81624, 83074, 84292, 84084, 82633, 81152, 80118, 79000, 77534, 76030, 74581, 73157, 72315, 72568, 73209, 72953, 71650, 70168, 68800, 67208, 65831, 65709, 66734, 67509, 67317, 66895, 66940, 67147, 67163, 67235, 67348, 66892, 65813, 65133, 65649, 66866, 67769, 67942, 67575, 67049, 66930, 67663, 68973, 70160, 71206, 72896, 75617, 78771, 81491, 83207, 83431, 81951, 79574, 77822, 77467, 77919, 78265, 78182, 77640, 76553, 75146, 74090, 73861, 74341, 75143, 75826, 75852, 74959, 73620, 72561, 71922, 71526, 71710, 72952, 74800, 76198, 76944, 77864, 79483, 81470, 83454, 85366, 86837, 87293, 86880, 86347, 85867]
52589H5867q98j163m21Q18J469J543J650J559P22k78l43M24R86J106J459K202
52573I6702K648K360J564O13j37j73O29J628K286K841L465L531K713J921J926
52558A24517J897P11r74j442l40J099J935K200K004J394R88J467K378K602J912
52543A42348R79J42p19j199o15P45J682J622J152R50J004R54N70j64q93j034m97
52526A47027L5J06J02L94N66K75P9N17J058J005O65O05M93j36p04m75L1j02n44
52507A50997l48K81L61j10l40l37q08j615j873j538j403j544j146l7R40J254J259
52490A43993J231R98O71P59J311J761J764J495J209J094J337J709J514O96L04
52475A61846R38J543R25k75n52J26N68M69O04J074J120O33L56M20K36j29J61J200
$$ y = [85867, 84969, 83806, 83385, 84203, 85672, 87215, 88865, 90424, 91146, 90868, 90525, 90949, 91935, 93041, 94500, 96702, 99350, 101710, 103274, 103887, 103750, 103577, 104206, 105834, 108120, 110961, 114426, 117957, 120670, 122591, 124517, 126414, 127125, 126151, 124709, 124369, 125468, 127403, 129603, 131607, 133001, 133989, 135456, 137834, 140436, 142348, 143327, 143469, 142750, 141551, 140936, 141681, 143363, 144985, 146137, 147087, 148091, 149045, 149615, 149451, 148558, 147524, 147027, 147062, 147168, 147270, 147664, 148230, 148505, 148584, 149101, 150159, 151164, 151829, 152434, 152927, 152791, 152087, 151612, 151643, 151541, 150997, 150649, 150930, 151291, 151181, 150841, 150504, 149696, 148081, 146208, 144670, 143267, 141723, 140577, 140540, 141480, 142734, 143993, 145224, 146222, 146893, 147652, 148963, 150724, 152488, 153983, 155192, 156286, 157623, 159332, 160846, 161542, 161846, 162784, 164327, 165252, 164977, 164425, 164551, 165119, 165588, 166192, 167266, 168386, 169019, 169375, 169795, 170031, 169902, 170063, 171263]
52457A71263K066K212J888J142j69j302r65Q37K593L220L128L036K959K760K644
52442A97312K673K595K413K387K365J955J318R30O04k47j458k343k913l734m652
52427A99205m848m224l547l142k642k099k033k254j905r74n39j169k168k756k871
52412A62034k581j727n47K34L29J75J28K10N29J097J283M72p41j066k33Q61J550
52395A62007J821J516N09l36J23J447J955J153M19Q79J968K623K539J742K53j214
52379A79404j349J00J712K139J638J309J568K025K244K132J959K157K774L106
52365B02918K559J677J481J987K342K281K336K625K652K411K486K985L386L574
52351B37700L895M179L882L257L130L475L488L091K966L046K539J635J576K625
$$ y = [171263, 173329, 175541, 177429, 178571, 178402, 177100, 176135, 176972, 179565, 182785, 185913, 188949, 191908, 194668, 197312, 199985, 202580, 204993, 207380, 209745, 211700, 213018, 213948, 214552, 214305, 212847, 210504, 207591, 203857, 199205, 194357, 190133, 186586, 183444, 180802, 178703, 176670, 174416, 172511, 171537, 170998, 169829, 167661, 164905, 162034, 159453, 157726, 157179, 157413, 157742, 157917, 158045, 158255, 158784, 159881, 161164, 161636, 160895, 159829, 159596, 160457, 162007, 163828, 165344, 165853, 165517, 165640, 167087, 169042, 170195, 170614, 171493, 173461, 176084, 178623, 180365, 180618, 179404, 178055, 178155, 179867, 182006, 183644, 184953, 186521, 188546, 190790, 192922, 194881, 197038, 199812, 202918, 205477, 207154, 208635, 210622, 212964, 215245, 217581, 220206, 222858, 225269, 227755, 230740, 234126, 237700, 241595, 245774, 249656, 252913, 256043, 259518, 263006, 266097, 269063, 272109, 274648, 276283, 277859, 280484]
52337B80484L555L593L315L121K431J169M64R35J591J401Q55J012J973L078L823
52322C12800L909L298K648K805L520L744L415L613M565N042M356L469L330L529
52308C64043L572M009N201O242O350O278P126Q623R724J0186J0464J0734J1049
52295D63601J1808J3135J4354J4799J4725J4765J5127J5853J7060J8331J8721
52284F32279J8031J7260J7195J7439J7484J7624J8043J7974J6783J5123J4004
52273H19239J3423J2734J1690J0351Q689P024O103O014N804M864L880L575L406
52260I16796K586J544J318J936K431K095J010k91j092r72m23m13r77j138o26m24
52244I23360r17q70O61K570L193K697K513L106L793M353N383P105Q982J0480J1384
$$ y = [280484, 284039, 287632, 290947, 294068, 296499, 297668, 298132, 299067, 300658, 302059, 302914, 303926, 305899, 308977, 312800, 316709, 320007, 322655, 325460, 328980, 332724, 336139, 339752, 344317, 349359, 353715, 357184, 360514, 364043, 367615, 371624, 376825, 383067, 389417, 395695, 402821, 411444, 421168, 431354, 441818, 452552, 463601, 475409, 488544, 502898, 517697, 532422, 547187, 562314, 578167, 595227, 613558, 632279, 650310, 667570, 684765, 702204, 719688, 737312, 755355, 773329, 790112, 805235, 819239, 832662, 845396, 857086, 867437, 876126, 883150, 889253, 895267, 901071, 905935, 909815, 913390, 916796, 919382, 920926, 922244, 924180, 926611, 928706, 929716, 929425, 928333, 927361, 926938, 926525, 925548, 924410, 923784, 923360, 922443, 921573, 922234, 924804, 927997, 930694, 933207, 936313, 940106, 944459, 949842, 956947, 965929, 976409, 987793]
52229I87793J1590J1328J1337J2005J2660J2415J1373J0229R190Q136P442P568
52217A113066Q093Q040P131N965N022M184L195J999O87m73j113j272j536k317
52203A150671l367m305n213o222o966p043o664o433o671p210p501o850n101l205
52189A067920k373k506k298j182q0J78Q9M26R37R93O29J68m73j250j504q73n1
52172A058750J89M0o0m03j293k036j785q97m02n32p66j050j875l275m647n538
52156A034420n996o174o208o376o837p254p051n977m347k880k353k882l612l626
52142I62847l169l213l890m357m335m489m988n052m386l834l951m203m304m930
52128I03746o230o938o201n074m930n472n629n437n579n838n527m933m923n454
$$ y = [987793, 999383, 1010711, 1022048, 1034053, 1046713, 1059128, 1070501, 1080730, 1089920, 1098056, 1105498, 1113066, 1121159, 1129199, 1136330, 1142295, 1147317, 1151501, 1154696, 1156695, 1157382, 1156909, 1155796, 1154524, 1152988, 1150671, 1147304, 1142999, 1137786, 1131564, 1124598, 1117555, 1110891, 1104458, 1097787, 1090577, 1083076, 1076226, 1071125, 1067920, 1065547, 1063041, 1060743, 1059561, 1059481, 1059659, 1059748, 1060174, 1061111, 1062104, 1062733, 1062901, 1062428, 1061178, 1059674, 1058801, 1058750, 1058939, 1058979, 1058919, 1058516, 1057223, 1055187, 1053402, 1052505, 1052103, 1051571, 1050805, 1049755, 1047880, 1044605, 1039958, 1034420, 1028424, 1022250, 1016042, 1009666, 1002829, 995575, 988524, 982547, 978200, 975320, 972967, 970085, 966473, 962847, 959678, 956465, 952575, 948218, 943883, 939394, 934406, 929354, 924968, 921134, 917183, 912980, 908676, 903746, 897516, 890578, 884377, 879303, 874373, 868901, 863272, 857835, 852256, 846418, 840891, 835958, 831035, 825581]
52114H25581n704n382m820m090k964j512n5J133J609R87J7L80K577N043O297O854
52098H25951P823Q860R101R157J0382J2674J4702J5932J6909J7891J8641J9338
52086I87361K0298K1026K0884K0391K0616K1439K1752K1129K0062J8812J7260
52075A211030J5714J4653J3782J2512J1032R837Q629O895N176M306L847K705J014
52062A321132k21j069k561m591n750n562n264n829o675o963o904p047p180o725
52048A248791n639m317l096k132j454r15m79m19q24j053l88R20J833J698P36l61
52032A232901p96j3J718L280L884L854L843L820L511L098K727K016Q63L9N2K82
52016A265079J72K58R64J359O55j32K23Q00k73k804m891n997p434r760j1861j3011
$$ y = [825581, 819877, 814495, 809675, 805585, 802621, 801109, 801054, 802187, 803796, 804783, 804800, 805180, 807757, 812800, 819097, 825951, 833774, 842634, 851735, 860892, 871274, 883948, 898650, 914582, 931491, 949382, 968023, 987361, 1007659, 1028685, 1049569, 1069960, 1090576, 1112015, 1133767, 1154896, 1174958, 1193770, 1211030, 1226744, 1241397, 1255179, 1267691, 1278723, 1288560, 1297189, 1304084, 1309260, 1313566, 1317413, 1320118, 1321132, 1320911, 1319842, 1317281, 1312690, 1306940, 1301378, 1296114, 1290285, 1283610, 1276647, 1269743, 1262696, 1255516, 1248791, 1243152, 1238835, 1235739, 1233607, 1232153, 1231238, 1230759, 1230340, 1229516, 1228463, 1228075, 1228995, 1230828, 1232526, 1233262, 1232901, 1232105, 1232092, 1233810, 1237090, 1240974, 1244828, 1248671, 1252491, 1256002, 1259100, 1261827, 1263843, 1264706, 1264745, 1264797, 1265079, 1265251, 1265509, 1266473, 1267832, 1268487, 1268355, 1268578, 1269378, 1269105, 1266301, 1261410, 1255413, 1247979, 1238219, 1226358, 1213347]
52000A213347j4020j5650j7561j9375k1376k3499k4976k5542k5928k6591k7062
51989I71767k6993k6879k7233k7816k8092k7802k6921k5783k5150k5401k5835
51978F77862k5528k4663k3960k3288k2045k0510j9428j8534j7041j5328j4514
51967D53023j4415j3697j2108j0766j0101r334q336q078q676q810p857o868o604
51954C27373o245n090m011m000m503m424l868l651l799l655k976k103j391j089
51940B76568j385k065k552k583k429k302k175k211k582k831k290j232o83r35j284
51925B47029j296j285j345j108o89p11j117j117n79k52l51k80r0p46k350l531
51909B30182l368k654k402k318j702p96l05l67q43j785k826l046k189j281j263
$$ y = [1213347, 1199327, 1183677, 1166116, 1146741, 1125365, 1101866, 1076890, 1051348, 1025420, 998829, 971767, 944774, 917895, 890662, 862846, 834754, 806952, 780031, 754248, 729098, 703697, 677862, 652334, 627671, 603711, 580423, 558378, 537868, 518440, 499906, 482865, 467537, 453023, 438608, 424911, 412803, 402037, 391936, 382602, 374266, 366188, 357512, 348702, 340845, 333977, 327373, 321128, 316038, 312027, 308027, 303524, 299100, 295232, 291581, 287782, 284127, 281151, 279048, 277657, 276568, 275183, 273118, 270566, 267983, 265554, 263252, 261077, 258866, 256284, 253453, 251163, 249931, 249248, 248313, 247029, 245733, 244448, 243103, 241995, 241306, 240595, 239478, 238361, 237782, 237530, 237179, 236899, 236809, 236063, 233713, 230182, 226814, 224160, 221758, 219440, 217738, 216942, 216637, 216270, 215427, 213642, 210816, 207770, 205581, 204300, 203037]
51894B03037j796k092k055j865j309m11N3m71j427j989k123k137j843j000o2L04
51878A82814L0n25j183j793k042j877j623j322n61O15J323R10j20p05l47O83J689
51861A75966J849Q84l66o68O5P61Q26P64R12O65l81j508j782j152q3J156K276
51844A80184K814K754K619K602K327J795J628J970K078J514Q18M13j00r93j732
51829B00691j924k021k375k455j699m57O51J491J999J814R52R1l71o59p23JJ289
51812A96295J927J497J180J872K728K657K086J891J708P91k10m2J059J532O88
51797B17659n73j208j066n14J00M28L06rj42j0L70R77J432J133L01J29J183K413
51779B22909K525J757J303J509J725J625J589J781J795J359Q09O33R52J476J855
$$ y = [203037, 201241, 199149, 197094, 195229, 193920, 193509, 193562, 193091, 191664, 189675, 187552, 185415, 183572, 182572, 182510, 182814, 182844, 182319, 181136, 179343, 177301, 175424, 173801, 172479, 171918, 172533, 173856, 174766, 174646, 173941, 173594, 174277, 175966, 177815, 178699, 178333, 177665, 177730, 178491, 179317, 180081, 180993, 181658, 181277, 179769, 177987, 176835, 176752, 177908, 180184, 182998, 185752, 188371, 190973, 193300, 195095, 196723, 198693, 200771, 202285, 203103, 203516, 203416, 202423, 200691, 198767, 196746, 194371, 191916, 190217, 189760, 190411, 191902, 193901, 195715, 196667, 196758, 196387, 195728, 195005, 195006, 196295, 198222, 199719, 200899, 202771, 205499, 208156, 210242, 212133, 213841, 214632, 214422, 214380, 215439, 216971, 217659, 217086, 215878, 214812, 214298, 214398, 214826, 215132, 215123, 214981, 214971, 215341, 216318, 217750, 218883, 219184, 219313, 220496, 222909, 225434, 227191, 228494, 230003, 231728, 233353, 234942, 236723, 238518, 239877, 240686, 241319, 242271, 243747, 245602]
51764B45602J991K132K448K745K881L189L873M240L520K233J640J852J851J473
51750B81670J786L011L797L346K779L240M100M269M111M594N517O023O151O471
51736C40865O799O519N696M709L373J577J52r0K79K69K33J304L365M959N127M197
51720C89333K848J489N07J80K96N93J275K306K679J367j150l371m589n311n980
51705C82472o238n610m204k692j976k634m218n455n636n365n391n412m798l868
51691C18975l367l200k714j979j707k047k382k226j532j98J877M302O340P389
51677C17531O953M662R75k611m832n799o216o124n210l830k679j817q79P2Q52
51662B91048J844L480N331O618P322P865Q094P577O442M949K612r86m847p339
$$ y = [245602, 247593, 249725, 252173, 254918, 257799, 260988, 264861, 269101, 272621, 274854, 276494, 278346, 280197, 281670, 283456, 286467, 290264, 293610, 296389, 299629, 303729, 307998, 312109, 316703, 322220, 328243, 334394, 340865, 347664, 354183, 359879, 364588, 367961, 369538, 369690, 369600, 369879, 370148, 370381, 371685, 375050, 380009, 385136, 389333, 392181, 393670, 394177, 394357, 394653, 395246, 396521, 398827, 401506, 402873, 401723, 398352, 393763, 388452, 382472, 376234, 370624, 366420, 363728, 361752, 359118, 354900, 349445, 343809, 338444, 333053, 327641, 322843, 318975, 315608, 312408, 309694, 307715, 306008, 303961, 301579, 299353, 297821, 297623, 299500, 303802, 310142, 317531, 324484, 329146, 330121, 327510, 322678, 316879, 310663, 304539, 299329, 295499, 292820, 291003, 290124, 290196, 291048, 292892, 296372, 301703, 308321, 315643, 323508, 331602, 339179, 345621, 350570, 353182, 352196, 347349, 340010]
51648C40010q295r060j0364j1365j1146j0029q883p941o908n752m871m568m609
51635B36219m380l582k743k699l444m072m061l850l863l681k910k092j925k191
51621A90726k224j937j623j242p08m05o35r90r77q10q78r71p98o60q19p96j56
51604A74097N93P00K62j30k56q0N46J267J152P7p18l74L05M03N28J485K452K152
51586A84461J080Q02J555K330K810L558M536N145N486O085O610O458O218O966
51572B44100Q266Q553P428N880M438K710P57p21j618k385k864k632k364l149m552
51557B61847n106m663m383m385l406j231O20J204J399K139L009L465L901M699
51543B59109N441N830O279O924P192O840O413O139N472M166K705J343j67j606
$$ y = [340010, 331715, 322655, 312291, 300926, 289780, 279751, 270868, 262927, 256019, 250267, 245396, 240828, 236219, 231839, 228257, 225514, 222815, 219371, 215299, 211238, 207388, 203525, 199844, 196934, 194842, 192917, 190726, 188502, 186565, 184942, 183700, 182992, 182587, 181952, 180962, 179985, 179175, 178297, 177326, 176528, 175868, 175049, 174253, 174097, 174690, 175390, 175652, 175522, 175266, 175186, 175732, 176999, 178151, 178228, 177510, 177136, 177441, 177844, 178372, 179857, 182309, 184461, 185541, 186343, 187898, 190228, 193038, 196596, 201132, 206277, 211763, 217848, 224458, 230916, 237134, 244100, 252366, 260919, 268347, 274227, 278665, 281375, 282132, 281411, 279793, 277408, 274544, 271912, 269548, 266399, 261847, 256741, 252078, 247695, 243310, 239904, 238673, 239293, 240497, 241896, 244035, 247044, 250509, 254410, 259109, 264550, 270380, 276659, 283583, 290775, 297615, 304028, 310167, 315639, 319805, 322510, 323853, 323686, 322080]
51529C22080k200j898j529j406j018k97J30K43P21J446J516J127J672L365M523
51514C28475M062K966K311J518j48j886k653k918l608m322m121l350l171l792
51500C09363m415m547m324l834l075k370j966j593j011n63n61o15k26M47R43J212
51484B82865J344J161O15J21L0K16O17J470K600L153K670J802J462J797K501L374
51468C07798M149M425M296M444N164N972O497O903P045O247M609L476L775M745
51454C79545N257N483O161O901O558M936L059J867J442J378J162L37j048k243
51440D20795k593k336k180k318k385k094j471n96M02J207J445R54j97j701l060
51425D03872m001m829n955p130p782q020q431q915q670p607o666o436o393o032
$$ y = [322080, 319880, 317982, 316453, 315047, 314029, 313732, 313862, 314105, 314826, 316272, 317788, 318915, 320587, 323952, 328475, 332537, 335503, 337814, 339332, 339184, 337298, 334645, 331727, 328119, 323797, 319676, 316326, 313155, 309363, 304948, 300401, 296077, 292243, 289168, 286798, 284832, 283239, 282228, 281665, 281104, 280489, 280263, 280710, 281653, 282865, 284209, 285370, 285985, 286106, 286136, 286352, 286969, 288439, 291039, 294192, 296862, 298664, 300126, 301923, 304424, 307798, 311947, 316372, 320668, 325112, 330276, 336248, 342745, 349648, 356693, 362940, 367549, 371025, 374800, 379545, 384802, 390285, 396446, 403347, 409905, 414841, 417900, 419767, 421209, 422587, 423749, 424086, 423038, 420795, 418202, 415866, 413686, 411368, 408983, 406889, 405418, 404822, 405224, 406431, 407876, 408830, 408633, 406932, 403872, 399871, 395042, 389087, 381957, 374175, 366155, 357724, 348809, 340139, 332532, 325866, 319430, 313037, 307005]
51411C07005n694n700n588m958m184l552k543q64N08M24p58j527j046J78J273
51396B72974J917K326K793L319L517L080K340J915J763J186j04j646l096m620
51382B87664o108o972p126p266p684p691o937o359o858p728p519o000m386l717
51368A95313l892m199m207m038m093m438m540l910l001k746l155l176k284j217
51354A46417p36n27o1L03o9r40j468j272o26J1J34o01j777k299j666o83l61o09
51336A33170o53k51J87L51L05J60Q7L26Q51J211J140R59J091J494J855K009J954
51319A46246J814J923K522L265L575L541L798M496N159N662O407P275P441O510
51305B09634N018L463J821L11n11q40j705l378m864n549o160p185p677o743n232
$$ y = [307005, 301311, 295611, 290023, 285065, 280881, 277329, 274786, 273922, 274430, 274854, 274096, 272569, 271523, 271701, 272974, 274891, 277217, 280010, 283329, 286846, 289926, 292266, 294181, 295944, 297130, 297026, 295380, 292284, 287664, 281556, 274584, 267458, 260192, 252508, 244817, 237880, 231521, 224663, 216935, 209416, 203416, 199030, 195313, 191421, 187222, 183015, 178977, 174884, 170446, 165906, 161996, 158995, 156249, 153094, 149918, 147634, 146417, 145681, 145154, 145093, 145396, 145327, 144387, 142919, 141647, 141021, 141032, 141166, 140565, 138788, 136489, 134823, 134140, 133779, 133170, 132517, 132266, 132453, 132804, 133109, 133269, 133356, 133682, 134533, 135744, 136884, 137843, 138934, 140428, 142283, 144292, 146246, 148060, 149983, 152505, 155770, 159345, 162886, 166684, 171180, 176339, 182001, 188408, 195683, 203124, 209634, 214652, 218115, 219936, 220247, 219736, 218896, 217191, 213813, 208949, 203400, 197240, 190055, 182378, 175635, 170403]
51290A70403m614m871m799l908k883k366k279k255k083j812j765k164k548k160
51276A29896j113m22n93j048j249j441j794j931j760j737j768j110O8M61k36n26
51260A13697N67J785J594M37l17m20l13J67J031J200J19p69N9J643J915Q52J91
51243A23438M77O28K19O6M04M53K0j66M9o6o08q33p01j076j971k089q16O68R75
51224A19071K82k77j19M55R16R27N27J39J29K79N9o53j547k298k496j635J24J551
51206A15434J578O44J5J26N22R77J601K078J912J385J221J432J420J085P91M20
51190A32641m02j232j160k31N35O46N63N54K20n61j237j399j260j114j000r81
51174A24582j054q60j92L49L8p91j151q08l52J0O05J316J520J108O53M22K32J79
$$ y = [170403, 165789, 160918, 156119, 152211, 149328, 146962, 144683, 142428, 140345, 138533, 136768, 134604, 132056, 129896, 128783, 128361, 127768, 126720, 125471, 124030, 122236, 120305, 118545, 116808, 115040, 113930, 113998, 114459, 114223, 113697, 114264, 116049, 117643, 118080, 117763, 117343, 117030, 117197, 118228, 119428, 119547, 118778, 118837, 120480, 122395, 123247, 123438, 123915, 124543, 124762, 124828, 125232, 125685, 125705, 125539, 125588, 125522, 124914, 124081, 123380, 122304, 120333, 118244, 117428, 118096, 119071, 119353, 119076, 118957, 119412, 120328, 121255, 121782, 121921, 122050, 122329, 122388, 121735, 120188, 117890, 115394, 113759, 113883, 115434, 117012, 117656, 117671, 117797, 118319, 119296, 120897, 122975, 124887, 126272, 127493, 128925, 130345, 131430, 132221, 132641, 132239, 131007, 129847, 129616, 130151, 130797, 131360, 131914, 132134, 131573, 130336, 128937, 127677, 126563, 125563, 124582, 123528, 122668, 122476, 122825, 122863, 122072, 120921, 120113, 119761, 119771, 120376, 121692, 123212, 124320, 124973, 125395, 125627, 125806]
51156A25806N41R13N60l16o99l76k99j075k092k528k342k002j902k262k868k817
51140A06242j424N83J666J363O81M87N70M77L11K71K81M33J056K068K909L318
51124A21292L437L172K299J285R78J250J004j35j146j139o22o19j275j962k170
51109A25649j783r33n9L06J09j51j57j39l26n03l38J98Q73J344J289P94M67P40
51091A27380J216J251R09O87N58J32l86l13L82R52R54O86M91L69L68N94P53M16
51073A37399k56o62n82k18L52J054J381J008O00R92J801J899J174N64M01O2o65
51056A46304j154j088q69o00Q8R62J197Q26R38J963K972L199L023K885K452J673
51040A64771J484K494L806M147L472K613J908J125K67l85q54j420k063k355j886
$$ y = [125806, 126347, 127260, 127820, 127504, 126805, 126429, 126130, 125055, 122963, 120435, 118093, 116091, 114189, 111927, 109059, 106242, 104818, 105401, 107067, 108430, 109111, 109598, 110168, 110645, 110956, 111227, 111508, 111941, 112997, 115065, 117974, 121292, 124729, 127901, 130200, 131485, 132463, 133713, 134717, 134582, 133436, 132297, 131675, 131056, 129781, 127819, 125649, 123866, 122933, 122874, 123180, 123289, 123138, 122981, 122842, 122516, 122013, 121675, 121873, 122746, 124090, 125379, 126173, 126640, 127380, 128596, 129847, 130756, 131443, 132001, 132133, 131747, 131434, 131816, 132768, 133722, 134408, 134899, 135268, 135636, 136230, 136983, 137399, 137143, 136481, 135899, 135681, 136033, 137087, 138468, 139476, 140076, 141068, 142869, 144768, 145942, 146506, 146907, 146969, 146304, 145150, 144062, 143193, 142593, 142681, 143643, 144840, 145666, 146604, 148567, 151539, 154738, 157761, 160646, 163098, 164771, 166255, 168749, 172555, 176702, 180174, 182787, 184695, 185820, 186087, 185702, 184848, 183428, 181365, 179010, 177124]
51025A77124o64P27J436J105K54n00j290k418l256k771j130K98P03O26P95J217
51009A72256J695K294K784K564J624Q84J092K051L112L821L878L278K724L045
50995B07102M027M592M328L950M085M553N132N947O813P206P232P651Q585R254
50981B90457R385R737J0732J1777J2502J3583J5594J8012K0206K2413K4979K7516
50969D86893K9649L1834L4662L7973M1422M5155M9147N2591N4851N6378N7942
50958I78497N9394O0005N9557N8298N6136N2645M7772M2117L6535L1639K7390
50947A509985K3110J8364J3795J0533Q822Q031P931Q912J0774J2477J3512J4398
50935A660644J5295J5168J2979Q857L530k613r282j6022k2777l0006l7718m5169
$$ y = [177124, 176460, 177187, 178623, 179728, 179982, 179482, 178192, 175774, 172518, 169747, 168617, 168915, 169618, 170244, 171039, 172256, 173951, 176245, 179029, 181593, 183217, 184101, 185193, 187244, 190356, 194177, 198055, 201333, 204057, 207102, 211129, 215721, 220049, 223999, 228084, 232637, 237769, 243716, 250529, 257735, 264967, 272618, 281203, 290457, 299842, 309579, 320311, 332088, 344590, 358173, 373767, 391779, 411985, 434398, 459377, 486893, 516542, 548376, 583038, 621011, 662433, 707588, 756735, 809326, 864177, 920555, 978497, 1037891, 1097896, 1157453, 1215751, 1271887, 1324532, 1372304, 1414421, 1450956, 1482595, 1509985, 1533095, 1551459, 1565254, 1575787, 1584609, 1592640, 1600571, 1609483, 1620257, 1632734, 1646246, 1660644, 1675939, 1691107, 1704086, 1712943, 1716473, 1713860, 1704578, 1688556, 1665779, 1635773, 1598055, 1552886]
50923A552886n1871n8066o3723o7952o9985o9921o8156o4987o1137n7572n4260
50912H65256n0236m5355m0759l7020l3256k8916k5008k2446k0393j7576j4262
50901E30029j1604r778q096o347m899l795k757j727p24L23J057Q03k19p13l2Q90
50885D82411J129J206J937K890L185K892K559K162J664J767K891M223M971N738
50871E21625P369R288J0382J0831J1565J2586J3320J4106J5802J8228K0532K2757
50859F88391K5580K8858L1902L5022L9334M5080N1452N7999O4925P2120P9191
50848A219854Q6482R4720J03531J11609J18442J24746J30912J36132J39270J39676
50838B405374J36979J30894J21551J09342R4508P7596O0140M4021L0094J8198
$$ y = [1552886, 1501015, 1442949, 1379226, 1311274, 1241289, 1171368, 1103212, 1038225, 977088, 919516, 865256, 815020, 769665, 728906, 691886, 658630, 629714, 604706, 582260, 561867, 544291, 530029, 518425, 508647, 500551, 494204, 489305, 485510, 482753, 481026, 480302, 480625, 481682, 482485, 482266, 481553, 481521, 482411, 483540, 484746, 486683, 489573, 492758, 495650, 498209, 500371, 502035, 503802, 506693, 510916, 515887, 521625, 528994, 538282, 548664, 559495, 571060, 583646, 596966, 611072, 626874, 645102, 665634, 688391, 713971, 742829, 774731, 809753, 849087, 894167, 945619, 1003618, 1068543, 1140663, 1219854, 1306336, 1401056, 1504587, 1616196, 1734638, 1859384, 1990296, 2126428, 2265698, 2405374, 2542353, 2673247, 2794798, 2904140, 2998648, 3076244, 3136384, 3180405, 3210499, 3228697]
50828C228697Q439J610j614j167K695R441J8046K7375L6658M5060N1071N2986
50816C479297M9756M0935K6522P691j3063l3706n4186p5226r6211j15517j32377
50805C083915j46815j58023j64501j65873j63255j57581j49009j38088j26111
50796A714659j13840j01170q8383p6596o6379n6970m7476l8028k9239k1229j3791
50785A061558o933q26M383Q436J1031J2204J2289J1502R957P968N784L184o4l523
50771A136950o532r073j1473j3599j5163j6564j8365k0180k1152k1431k2023k3059
50759I38336k3469k2500k0511j8066j5302j2556j0480r000p133m319j147J752
50747G95605M684Q228J2249J6187J9811K3164K6166K8733L1088L3644L6743M0573
$$ y = [3228697, 3237136, 3238746, 3237132, 3235965, 3238660, 3248101, 3266147, 3293522, 3330180, 3375240, 3426311, 3479297, 3529053, 3569988, 3596510, 3604201, 3591138, 3557432, 3503246, 3428020, 3331809, 3216292, 3083915, 2937100, 2779077, 2614576, 2448703, 2285448, 2127867, 1978858, 1840770, 1714659, 1600819, 1499649, 1411266, 1334670, 1268291, 1211321, 1163845, 1125817, 1096578, 1075349, 1061558, 1054625, 1053799, 1058182, 1066618, 1077649, 1089853, 1102142, 1113644, 1123601, 1131569, 1137353, 1140537, 1140473, 1136950, 1130418, 1121345, 1109872, 1096273, 1081110, 1064546, 1046181, 1026001, 1004849, 983418, 961395, 938336, 914867, 892367, 871856, 853790, 838488, 825932, 815452, 806452, 799319, 795000, 793853, 795605, 800289, 808517, 820766, 836953, 856764, 879928, 906094, 934827, 965915, 999559, 1036302, 1076875]
50735A076875M5092N0032N5352O1490O8646P6001Q2336Q7303R1375R4563R5997
50724A885062R4871R1100Q4893P6458O6269N4926M2486K8683J3995j77j2705k3473
50712B402388l2502l8944m1538l9894l4924k8057k0170j1361j748P631J5181K0016
50700B196078K2366K2414J9520J3160L840p764k1828l8376n5694p1097q3147r1938
50688A907534r7428r8954r6682r2142q6726q0552p3286o5153n6635m7942l9306
50677A072728l1202k3844j6916j0127l551K810R253J5967K2824K9641L6121M1526
50665A145230M5100M6998M8024M8313M6933M3184L7640L1613K6059K1320J7412
50654A557826J4142J1143Q068M798J514j297l161m167m874n349m701k205J556
$$ y = [1076875, 1121967, 1171999, 1227351, 1288841, 1357487, 1433488, 1515824, 1603127, 1694502, 1789065, 1885062, 1979933, 2071033, 2155926, 2232384, 2298653, 2353579, 2396065, 2424748, 2438743, 2438566, 2425861, 2402388, 2369886, 2330942, 2289404, 2249510, 2214586, 2186529, 2166359, 2154998, 2153250, 2160881, 2176062, 2196078, 2218444, 2240858, 2260378, 2273538, 2277378, 2269614, 2247786, 2209410, 2153716, 2082619, 1999472, 1907534, 1810106, 1711152, 1614470, 1522328, 1435602, 1355050, 1281764, 1216611, 1159976, 1112034, 1072728, 1041526, 1017682, 1000766, 990639, 987088, 989898, 999151, 1015118, 1037942, 1067583, 1103704, 1145230, 1190330, 1237328, 1285352, 1333665, 1380598, 1423782, 1461422, 1493035, 1519094, 1540414, 1557826, 1571968, 1583111, 1591179, 1595977, 1597491, 1596194, 1593033, 1588866, 1583992, 1578643, 1573942, 1571737, 1573293]
50641A573293N354Q744J2119J5685J9327K3192K7466L1564L4480L5908L6241L5612
50629A858985L3764L0784K7107K2832J7891J2797Q403M970K261L28o03p03J2K458
50615B021286P468J4202K0801K6455L1482L5476L7011L5430L1549K6301K0033
50604B307494J3275O684j58q421j7910k6890l4588m2344n1331o0555o8262p4087
50592A942907p8572q1580q2544q1678p9672p6686p2713o8430o4588o0837n6230
50581A139377n0853m5940m2253l9080l5253l0661k6355k3155k0546j7388j3590
50570G94303j0307q136o014k773R43L613N273P418J0535J3373J5017J6164J7814
50557H57223J9940K2192K4745K7743L0847L4048L7954M2600M6877M9920N2226
$$ y = [1573293, 1578647, 1587391, 1599510, 1615195, 1634522, 1657714, 1685180, 1716744, 1751224, 1787132, 1823373, 1858985, 1892749, 1923533, 1950640, 1973472, 1991363, 2004160, 2012563, 2017533, 2019794, 2020122, 2019519, 2018816, 2018828, 2021286, 2028754, 2042956, 2063757, 2090212, 2121694, 2157170, 2194181, 2229611, 2261160, 2287461, 2307494, 2320769, 2327453, 2327295, 2318874, 2300964, 2274074, 2239486, 2197142, 2145811, 2085256, 2016994, 1942907, 1864335, 1782755, 1700211, 1618533, 1538861, 1462175, 1389462, 1321032, 1256444, 1195607, 1139377, 1088524, 1042584, 1000331, 961251, 925998, 895337, 868982, 845827, 825281, 807893, 794303, 783996, 775860, 769846, 767073, 768016, 771629, 776902, 784320, 794855, 808228, 823245, 839409, 857223, 877163, 899355, 924100, 951843, 982690, 1016738, 1054692, 1097292, 1144169, 1194089, 1246315]
50546A246315N4652N6981N8221N7742N5535N1982M7885M4186M1228L8838L7271
50535A790836L7143L8291L9760M1282M3489M6249M8242M9009N0015N2595N6073
50524B292984N9164O2144O6086P0630P4149P5794P6149P5935P5041P2762O8319
50513C069157O1300N2159M1860L0617J7642K757j2627k6989m0379n3518o5903
50502C076076p6027q3142q7570q9425q8089q3015p4256o2311m8148l3226j8779
50491B332088n158P525J8506K6791L2186L5123L5716L3644K8709K0762R317n895
50479B569314k3963m2991o1143p7114q9943r9209j05257j08645j09393j07321
50469A744335j02902r7165r0854q4202p7327p0380o3401n6571n0348m4954l9901
$$ y = [1246315, 1300967, 1357948, 1416169, 1473911, 1529446, 1581428, 1629313, 1673499, 1714727, 1753565, 1790836, 1827979, 1866270, 1906030, 1947312, 1990801, 2037050, 2085292, 2134301, 2184316, 2236911, 2292984, 2352148, 2414292, 2480378, 2551008, 2625157, 2700951, 2777100, 2853035, 2928076, 3000838, 3069157, 3130457, 3182616, 3224476, 3255093, 3272735, 3275492, 3262865, 3235876, 3195497, 3141979, 3076076, 3000049, 2916907, 2829337, 2739912, 2651823, 2568808, 2494552, 2432241, 2384093, 2350867, 2332088, 2326930, 2334455, 2352961, 2379752, 2411938, 2447061, 2482777, 2516421, 2545130, 2565892, 2575209, 2569314, 2545351, 2502360, 2441217, 2364103, 2274160, 2174951, 2069694, 1961049, 1851656, 1744335, 1641433, 1544268, 1453414, 1369212, 1291885, 1221505, 1158104, 1101533, 1051185, 1006231, 966330]
50458I66330l4544k8936k3682j9161j5369j2211r547p044m473j966K85K337M276
50445H16295O057P820R876J2083J3808J4964J6368J8526K0777K2328K3559K5373
50433A007834K7780L0035L1880L3638L5351L6705L7721L8654L9250L9020L8283
50422A396151L8089L8908M0000M0308L9479L7857L6036L4655L4216L4764L5941
50411A806404L7444L9196M0996M2258M2367M1225L9394L7487L5474L2675K8659
50400B223579K3870J9076J4364R117K889m223j1972k0166k8526l6915m5699n5129
50388B090265o4362p1920p7258q0971q3338q3680q1530p7420p1996o5202n7011
50377A275577m8140l9375l0792k2247j3947n995J880R500J5854K0163K2592K3259
$$ y = [966330, 931786, 902850, 879168, 860007, 844638, 832427, 822880, 815836, 811363, 809397, 809682, 812019, 816295, 822352, 830172, 840048, 852131, 865939, 880903, 897271, 915797, 936574, 958902, 982461, 1007834, 1035614, 1065649, 1097529, 1131167, 1166518, 1203223, 1240944, 1279598, 1318848, 1357868, 1396151, 1434240, 1473148, 1513148, 1553456, 1592935, 1630792, 1666828, 1701483, 1735699, 1770463, 1806404, 1843848, 1883044, 1924040, 1966298, 2008665, 2049890, 2089284, 2126771, 2162245, 2194920, 2223579, 2247449, 2266525, 2280889, 2290006, 2292895, 2288672, 2276700, 2256534, 2228008, 2191093, 2145394, 2090265, 2025903, 1953983, 1876725, 1795754, 1712416, 1628736, 1547206, 1469786, 1397790, 1332588, 1275577, 1227437, 1188062, 1157270, 1135023, 1121076, 1115081, 1116961, 1126461, 1142315, 1162478, 1185070, 1208329]
50365A208329K1419J6512R377J412o844j5405k3562k9996l4080l6251l7266l7692
50353A035953l7840l7557l6332l4079l1545k9424k7538k5357k2936k0734j8892
50342G13719j7218j5603j4001j2324j0716r468q406o943m994l180j791l93J198
50329F09880K521L512M861O720Q191Q840R610J1287J3130J4110J4546J5240J5953
50316G38401J6085J6176J7282J9324K1329K2901K4336K5628K6492K7001K7258
50305I82213K6909K5934K5223K5356K5461K4448K2650K0982J9151J6247J2529
50294A227103R091O199L403R63m69j339k803n027p338r943j3816j8815k3353k6250
50280A137606k7629k7963k7517k6856k6625k6626k6229k5658k5619k5719k4737
$$ y = [1208329, 1229748, 1246260, 1255637, 1257049, 1250205, 1234800, 1211238, 1181242, 1147162, 1110911, 1073645, 1035953, 998113, 960556, 924224, 890145, 858600, 829176, 801638, 776281, 753345, 732611, 713719, 696501, 680898, 666897, 654573, 643857, 634389, 625983, 619040, 614046, 610866, 609075, 608682, 609880, 612401, 615913, 620774, 627494, 635685, 644525, 654135, 665422, 678552, 692662, 707208, 722448, 738401, 754486, 770662, 787944, 807268, 828597, 851498, 875834, 901462, 927954, 954955, 982213, 1009122, 1035056, 1060279, 1085635, 1111096, 1135544, 1158194, 1179176, 1198327, 1214574, 1227103, 1236194, 1242393, 1245796, 1246759, 1246290, 1244951, 1242148, 1237121, 1229783, 1219840, 1206024, 1187209, 1163856, 1137606, 1109977, 1082014, 1054497, 1027641, 1001016, 974390, 948161, 922503, 896884, 871165, 846428]
50269H46428k2610k0730j9927j9492j8586j7273j5742j3780j1513r612q201o583
50257F62379m486k609j417l59J188K982M421N334N832O021O142O502P029P478
50243G06437Q030Q906R507Q884P189N653M886M159K660O57j004j873k102k250
50229G59739l044m750o704p951q333q333q162p796p655q129q618q096o640n279
50215F60249m355l228j692m79L7M81J423K623L686M600N299N485N224M978M863
50200F89194M566M039L508K809J582J56p59j204j825k658l241l816n131o916p965
50185F72339q024q215r191j0198j0467j0337j0353j0453j0547j0887j1220j0683
50173E51764r171p783p266o976o040m614l253j943n29O47J173J151Q16J63p18
$$ y = [846428, 823818, 803088, 783161, 763669, 745083, 727810, 712068, 698288, 686775, 677163, 668962, 662379, 657893, 655284, 653867, 653508, 654696, 657678, 662099, 667433, 673265, 679286, 685428, 691930, 698959, 706437, 714467, 723373, 732880, 741764, 748953, 754606, 759492, 763651, 766311, 766968, 765964, 764091, 761989, 759739, 756695, 751945, 745241, 737290, 728957, 720624, 712462, 704666, 697011, 688882, 680264, 672168, 665528, 660249, 655894, 652666, 650974, 650495, 650532, 651013, 652436, 655059, 658745, 663345, 668644, 674129, 679353, 684331, 689194, 693760, 697799, 701307, 704116, 705698, 705854, 705095, 703891, 702066, 699408, 696167, 692351, 687220, 680304, 672339, 664315, 656100, 646909, 636711, 626244, 615907, 605554, 595101, 584554, 573667, 562447, 551764, 542593, 534810, 527544, 520568, 514528, 509914, 506661, 504718, 504189, 504836, 506009, 507160, 507976, 508139, 507421]
50158E07421j563k464l735n078n710n613n618o002o070n462m733m225l557k774
50144D44817k753l733m550m217l298k850k931k961k812k626k264j623j010n59
50130D06630P0R53J615J890K239K775K948K745L036M160N162N286N076N254N539
50115D55378N530N662O242O507N732M449L498K679J512M49J54L02L24N93J490
50100E00501K060J132o41j459q72p1K34O29J558K491L029L617M636N702O441P155
50084E36142Q165R041R177Q802Q846R789J1035J1538J0929R855R260R489J0241
50071F62309J1103J1758J1851J1323J0754J0857J1463J1723J1320J0818J0643
50060G85922J0508J0179R982J0104J0131R800R587J0010J0865J1608J1951J1785
$$ y = [507421, 505858, 503394, 499659, 494581, 488871, 483258, 477640, 471638, 465568, 460106, 455373, 451148, 447591, 444817, 442064, 438331, 433781, 429564, 426266, 423416, 420485, 417524, 414712, 412086, 409822, 408199, 407189, 406630, 406700, 407653, 409268, 411158, 413397, 416172, 419120, 421865, 424901, 429061, 434223, 439509, 444585, 449839, 455378, 460908, 466570, 472812, 479319, 485051, 489500, 492998, 495677, 497189, 497638, 497792, 498094, 498418, 499011, 500501, 502561, 503693, 503052, 501593, 500721, 500650, 500884, 501513, 503071, 505562, 508591, 512208, 516844, 522546, 528987, 536142, 544307, 553348, 562525, 571327, 580173, 589962, 600997, 612535, 623464, 633319, 642579, 652068, 662309, 673412, 685170, 697021, 708344, 719098, 729955, 741418, 753141, 764461, 775279, 785922, 796430, 806609, 816591, 826695, 836826, 846626, 856213, 866223, 877088, 888696, 900647, 912432]
50048I12432J1091J0341J0272J0810J0963J0213R249Q752Q265P043N308L850K857
50035A021446J970J107M87R3k85o89j080j418j373m65J166K753M049N863Q937
50020A042561J3012J7412K2010K7008L2479L8601M5667N3319O0419O6102P0085
50009A488675P1617O9232O2505N3087M3151L3603K4772J7792J3969J3324J4911
49998A906638J8079K2187K5559K5995K2346J4706L353j1483k8858m6983o3874
49987A887665p7791q7447r2550r3890r2373q8388q2431p5554o8556o1448n4397
49976A012840m8358m3807l9844l5560l1495k8451k5754k2236j8370j5731j4567
49965F88667j3517j1765r933q698p869p155o689o429n942n205m771n028n879p087
$$ y = [912432, 923523, 933864, 944136, 954946, 965909, 976122, 985371, 994123, 1002388, 1009431, 1014739, 1018589, 1021446, 1023416, 1024523, 1025010, 1025103, 1024818, 1024129, 1023049, 1021631, 1020258, 1019793, 1020959, 1023712, 1027761, 1033624, 1042561, 1055573, 1072985, 1094995, 1122003, 1154482, 1193083, 1238750, 1292069, 1352488, 1418590, 1488675, 1560292, 1629524, 1692029, 1745116, 1788267, 1821870, 1846642, 1864434, 1878403, 1891727, 1906638, 1924717, 1946904, 1972463, 1998458, 2020804, 2035510, 2038863, 2027380, 1998522, 1951539, 1887665, 1809874, 1722427, 1629877, 1535987, 1443614, 1355226, 1272795, 1197241, 1128685, 1067237, 1012840, 964482, 920675, 880831, 845271, 813776, 785325, 759571, 737335, 718965, 703234, 688667, 675150, 663385, 653452, 644754, 636885, 629730, 623041, 616612, 610670, 605465, 600694, 595666, 589787, 582700]
49951E82700q265q690q027p029o645o647o111n129m660m843m744l985l309l171
49937E01445k943k080r94j76O29J681K525K766K885L512M383M789M802N222O374
49922E34820P612Q179Q122Q107Q546R247R918J0716J1970J3545J4928J6003J7237
49909F78950J8927K0810K2664K4836K7745L1318L5371M0176M6115N3232O1486
49898A061630P1002Q1465R1574R9722J04911J06593J04200R7657Q8192P7825O8044
49887B052815N9385N2089M6656M3838M4343M8081N3359N7270N7445N3081M4043
49876B612405K9923J0909j1061l3122n3227p0341q3542r2205r6937r9264j00164
49865B013374r9696r8038r5909r3725r1101q7534q3104p8253p3229o8014o2601
$$ y = [582700, 574435, 565745, 557718, 550689, 544044, 537397, 531286, 526157, 521497, 516654, 511910, 507925, 504616, 501445, 498502, 496422, 495428, 495252, 495881, 497562, 500087, 502853, 505738, 509250, 513633, 518422, 523224, 528446, 534820, 542432, 550611, 558733, 566840, 575386, 584633, 594551, 605267, 617237, 630782, 645710, 661713, 678950, 697877, 718687, 741351, 766187, 793932, 825250, 860621, 900797, 946912, 1000144, 1061630, 1132632, 1214097, 1305671, 1405393, 1510304, 1616897, 1721097, 1818754, 1906946, 1984771, 2052815, 2112200, 2164289, 2210945, 2254783, 2299126, 2347207, 2400566, 2457836, 2515281, 2568362, 2612405, 2642328, 2653237, 2642176, 2609054, 2555827, 2485486, 2401944, 2309739, 2212802, 2113538, 2013374, 1913678, 1815640, 1719731, 1626006, 1534905, 1447371, 1364267, 1286014, 1212785, 1144771, 1082170]
49854A082170n7221n2186m7459m2546l7237l2220k8333k5354k2404j9457j7334
49843G00419j6062j4726j3334j3130j4287j4951j3898j2540j2686j3667j3591
49832E47547j2415j1595j1373j0670r343q447q157p436n979m814m524m433l874
49819D44487k982j982q42O0J93j11M1O83J047J030J276J808J957J817K306L538
49803D54326M463M561M530M938N436N708N959O056N406M197L525L888M608N237
49789E22838O291Q061R784J0799J1568J2930J5136J8051K1599K5541K9607L4135
49777G26340L9764M6344N3103N9957O7362P4511P9098P9540P6222P0019O0882
49766A433142M8975L6078K4743J6564J1953J0848J2759J6744K1983K7817L2698
$$ y = [1082170, 1024949, 972763, 925304, 882758, 845521, 813301, 784968, 759614, 737210, 717753, 700419, 684357, 669631, 656297, 643167, 628880, 613929, 600031, 587491, 574805, 561138, 547547, 535132, 523537, 512164, 501494, 492151, 483704, 475547, 468111, 462132, 457318, 452794, 448361, 444487, 441505, 439523, 438681, 438741, 438934, 438823, 438864, 439547, 440594, 441624, 442900, 444708, 446665, 448482, 450788, 454326, 458789, 463350, 467880, 472818, 478254, 483962, 489921, 495977, 501383, 505580, 509105, 512993, 517601, 522838, 529129, 537190, 546974, 557773, 569341, 582271, 597407, 615458, 637057, 662598, 692205, 726340, 766104, 812448, 865551, 925508, 992870, 1067381, 1146479, 1226019, 1302241, 1372260, 1433142, 1482117, 1518195, 1542938, 1559502, 1571455, 1582303, 1595062, 1611806, 1633789, 1661606, 1694304]
49755A694304L3901K9111J7965J638j8222l9528n9478p5432q6072r1486r2542
49744A314159r0431q6190q0203p2554o4059n6116m9245m2641l5726k9295k4518
49733F83181k1423j9091j6785j4304j1717r392p906p329o934o008m642l429k817
49720E51404k996l868m867n289n122n041n355n581n228m418l442k404j630j644
49706D94519k313k643j878l90Q37J213Q30K71K05O92R38L67k77J52J369J912J320
49689D97124O49O62Q82R14J221J893J986J045J17K19Q47R80O42L50p2r32j593
49672E06934j234k20L85L28J72J33k6k01j5M09N93N60P92J315J548J127M25R2
49654E13117L58Q50R87N91J19N3K15P1m14q34j162j636j963j546o38k79p32j097
$$ y = [1694304, 1728205, 1757316, 1775281, 1776919, 1758697, 1719169, 1659691, 1584259, 1498187, 1406701, 1314159, 1223728, 1137538, 1057335, 984781, 920722, 864606, 815361, 772720, 736994, 707699, 683181, 661758, 642667, 625882, 611578, 599861, 590469, 582563, 575234, 568300, 562292, 557650, 554221, 551404, 548408, 544540, 539673, 534384, 529262, 524221, 518866, 513285, 508057, 503639, 500197, 497793, 496163, 494519, 492206, 489563, 487685, 487295, 488132, 489345, 490175, 490446, 490651, 491343, 492281, 492648, 492371, 492523, 493892, 495804, 497124, 497773, 498435, 499317, 500231, 501452, 503345, 505331, 506376, 506493, 506712, 507559, 508539, 509181, 509531, 509459, 508527, 506934, 505700, 505480, 505865, 506193, 506365, 506498, 506472, 506271, 506256, 506665, 507258, 507818, 508610, 509925, 511473, 512600, 513025, 513117, 513475, 514325, 515312, 515903, 516022, 516075, 516290, 516361, 515947, 515113, 513951, 512315, 510352, 508806, 508168, 507889, 507157, 506060]
$$ [...]
##END NTUPLES=NMR SPECTRUM
##END=
