
##TITLE=AC1317_SSGAH12146_6609796_WrUB2G9DzH
##JCAMPDX= 6.0         $$ Bruker NMR JCAMP-DX V2.0
##DATA TYPE= NMR SPECTRUM
##DATA CLASS= NTUPLES
##ORIGIN= BRUKER
##OWNER= Administrator
$$ 1.72 TOPSPIN		Version 2.1
$$ 2012-08-01 22:09:21.437 -0500  Administrator@TOPSPIN
$$ Compression mode = diff/dup
##.OBSERVE FREQUENCY= 400.02188249412
##.OBSERVE NUCLEUS= ^1H
##.ACQUISITION MODE= SIMULTANEOUS (DQD)
##.ACQUISITION SCHEME= undefined
##.AVERAGES= 8
##.DIGITISER RES= 22
##SPECTROMETER/DATA SYSTEM= spect
##.PULSE SEQUENCE= zg30
##.SOLVENT NAME= COFFEE_meoh
##.SHIFT REFERENCE= INTERNAL, COFFEE_meoh, 1, 14.98509
##AUDIT TRAIL= $$ (NUMBER, WHEN, WHO, WHERE, PROCESS, VERSION, WHAT)
$$ ##TITLE= Audit trail, TOPSPIN		Version 2.1
$$ ##JCAMPDX= 5.01
$$ ##ORIGIN= Bruker BioSpin GmbH
$$ ##OWNER= Administrator
$$ $$ C:\Bruker\TOPSPIN/data/COFFEE/nmr/AC1317_SSGAH12146_6609796_WrUB2G9DzH/10/pdata/1/auditp.txt
$$ ##AUDIT TRAIL=  $$ (NUMBER, WHEN, WHO, WHERE, PROCESS, VERSION, WHAT)
(   1,<2012-08-01 22:09:11.718 -0500>,<Administrator>,<TOPSPIN>,<go>,<TOPSPIN 2.1>,
      <created by zg
	started at 2012-08-01 22:08:03.468 -0500,
	POWCHK enabled, PULCHK disabled,
       configuration hash MD5:
       6B 1B 68 BB D9 2E 58 E2 7F 35 AD 54 07 DF 0E 41
       data hash MD5: 64K
       B8 66 64 60 1A 0E 46 9B 32 AA 2D C6 D5 38 A3 F7>)
(   2,<2012-08-01 22:09:16.937 -0500>,<Administrator>,<TOPSPIN>,<proc1d>,<TOPSPIN 2.1>,
      <Start of raw data processing
       efp LB = 0 FT_mod = 6 PKNL = 1 PHC0 = 0 PHC1 = 0 SI = 32K 
       data hash MD5: 32K
       CF 5E 89 46 58 95 E8 29 D5 0B 3E 56 A1 8E CF 0A>)
(   3,<2012-08-01 22:09:17.218 -0500>,<Administrator>,<TOPSPIN>,<proc1d>,<TOPSPIN 2.1>,
      <pk PHC0 = 176.7865 PHC1 = 0 
       data hash MD5: 32K
       42 34 40 EC 0B 60 D3 1F 06 FB 2C 73 B3 BA 5A 73>)
(   4,<2012-08-01 22:09:17.281 -0500>,<Administrator>,<TOPSPIN>,<proc1d>,<TOPSPIN 2.1>,
      <abs ABSG = 1 
       data hash MD5: 32K
       35 49 4B BE 62 D4 FA 27 43 B2 F9 7A 57 8A 88 40>)
(   5,<2012-08-01 22:09:17.312 -0500>,<Administrator>,<TOPSPIN>,<proc1d>,<TOPSPIN 2.1>,
      <abs ABSG = 2 
       data hash MD5: 32K
       0E 6E AE D7 D9 D3 45 A8 56 1A 1D 96 CC 8F 3E BC>)
(   6,<2012-08-01 22:09:17.343 -0500>,<Administrator>,<TOPSPIN>,<proc1d>,<TOPSPIN 2.1>,
      <abs ABSG = 3 
       data hash MD5: 32K
       16 D2 1C 3B 96 15 63 2C 1E CA 19 A2 03 2A 87 C8>)
(   7,<2012-08-01 22:09:17.375 -0500>,<Administrator>,<TOPSPIN>,<proc1d>,<TOPSPIN 2.1>,
      <abs ABSG = 4 
       data hash MD5: 32K
       AC 74 08 92 46 6C C3 74 F0 DD 86 0D FF F8 D5 A6>)
(   8,<2012-08-01 22:09:17.406 -0500>,<Administrator>,<TOPSPIN>,<proc1d>,<TOPSPIN 2.1>,
      <abs ABSG = 5 
       data hash MD5: 32K
       32 C6 4E 61 9B 65 1C D7 69 9E F2 5C 9A 40 45 E3>)
$$ ##END=
$$ 
$$ $$ hash MD5
$$ $$ 68 D4 57 FB 5C E2 71 89 DE 65 62 DE 9C 11 B7 EF
##$RELAX= 
##$RELAX= 
##$RELAX= 
##$RELAX= 
##$RELAX= 
##$RELAX= 
##$RELAX= 
$$ Bruker specific parameters
$$ --------------------------
$$ [...]
150 150 150 150 150 150 150 150
##$TP07= 0
##$TPNAME0= <>
##$TPNAME1= <>
##$TPNAME2= <>
##$TPNAME3= <>
##$TPNAME4= <>
##$TPNAME5= <>
##$TPNAME6= <>
##$TPNAME7= <>
##$TPOAL= (0..7)
0.5 0.5 0.5 0.5 0.5 0.5 0.5 0.5
##$TPOFFS= (0..7)
0 0 0 0 0 0 0 0
##$TUNHIN= 0
##$TUNHOUT= 0
##$TUNXOUT= 0
##$USERA1= <user>
##$USERA2= <user>
##$USERA3= <user>
##$USERA4= <user>
##$USERA5= <user>
##$V9= 5
##$VALIST= <valist>
##$VCLIST= <CCCCCCCCCCCCCCC>
##$VD= 0
##$VDLIST= <DDDDDDDDDDDDDDD>
##$VPLIST= <PPPPPPPPPPPPPPP>
##$VTLIST= <TTTTTTTTTTTTTTT>
##$WBST= 1024
##$WBSW= 4
##$XGAIN= (0..3)
0 0 0 0
##$XL= 0
##$YL= 0
##$YMAX_a= 471031
##$YMIN_a= -614879
##$ZGOPTNS= <>
##$ZL1= 120
##$ZL2= 120
##$ZL3= 120
##$ZL4= 120
##$ABSF1= 14.98509
##$ABSF2= -5.573092
##$ABSG= 5
##$ABSL= 3
##$ALPHA= 0
##$AQORDER= 0
##$ASSFAC= 0
##$ASSFACI= 0
##$ASSFACX= 0
##$ASSWID= 0
##$AUNMP= <proc_prof1d_extract_pilot.lims>
##$AXLEFT= 0
##$AXNAME= <>
##$AXNUC= <1H>
##$AXRIGHT= 0
##$AXTYPE= 0
##$AXUNIT= <>
##$AZFE= 0.1
##$AZFW= 0.1
##$BCFW= 0
##$BC_mod= 0
##$BYTORDP= 0
##$COROFFS= 0
##$CY= 15
##$DATMOD= 1
##$DC= 0
##$DFILT= <>
##$DTYPP= 0
##$F1P= 0
##$F2P= 0
##$FCOR= 0.5
##$FTSIZE= 32768
##$FT_mod= 6
##$GAMMA= 0
##$GB= 0
##$INTBC= 1
##$INTSCL= 1
##$ISEN= 128
##$LB= 0
##$LEV0= 0
##$LPBIN= 0
##$MAXI= 10000
##$MC2= 0
##$MEAN= 0
##$ME_mod= 0
##$MI= 0
##$NCOEF= 0
##$NC_proc= -8
##$NLEV= 6
##$NOISF1= 0
##$NOISF2= 0
##$NSP= 0
##$NTH_PI= 0
##$NZP= 0
##$OFFSET= 14.98509
##$PC= 1
##$PHC0= 176.7865
##$PHC1= 0
##$PH_mod= 1
##$PKNL= yes
##$PPARMOD= 0
##$PPDIAG= 0
##$PPIPTYP= 0
##$PPMPNUM= 2147483647
##$PPRESOL= 1
##$PSCAL= 4
##$PSIGN= 0
##$PYNMP= <proc.py>
##$REVERSE= no
##$SF= 400.02
##$SI= 32768
##$SIGF1= 0
##$SIGF2= 0
##$SINO= 400
##$SIOLD= 32768
##$SPECTYP= <>
##$SREGLST= <1H.CDCl3>
##$SSB= 0
##$STSI= 32768
##$STSR= 0
##$SW_p= 8223.68421052631
##$SYMM= 0
##$S_DEV= 0
##$TDeff= 65536
##$TDoff= 0
##$TI= <>
##$TILT= no
##$TM1= 0
##$TM2= 0
##$TOPLEV= 0
##$USERP1= <user>
##$USERP2= <user>
##$USERP3= <user>
##$USERP4= <user>
##$USERP5= <user>
##$WDW= 1
##$XDIM= 32768
##$YMAX_p= 457240391
##$YMIN_p= -686036
##$CURPLOT= <Network HP LaserJet P1505>
##$CURPRIN= <$Network HP LaserJet P1505>
##$DFORMAT= <normdp>
##$LAYOUT= <+/1D_H.xwp>
##$LFORMAT= <normlp>
##$PFORMAT= <normpl>
##$SURQMSG= 1
$$ End of Bruker specific parameters
$$ ---------------------------------
##NTUPLES= NMR SPECTRUM
##VAR_NAME=  FREQUENCY,     SPECTRUM/REAL,   SPECTRUM/IMAG
##SYMBOL=    X,             R,               I
##VAR_TYPE=  INDEPENDENT,   DEPENDENT,       DEPENDENT
##VAR_FORM=  AFFN,          ASDF,            ASDF
##VAR_DIM=   32768,         32768,           32768
##UNITS=     HZ,            ARBITRARY UNITS, ARBITRARY UNITS
##FACTOR=    0.250966925370066, 1,           1
##FIRST=     8223.43324360094, -31691,       -149753
##LAST=      0,             -118287,         -158966
##MIN=       0,             -686036,         0
##MAX=       8223.43324360094, 457240391,    0
$$ Real data points
##PAGE= N=1
##DATA TABLE= (X++(R..R)), XYDATA
$$ [...]
23764 -214312 82101 -117499 99011 129033 -167957 -10809 -199266 -45095 -31561 99645 -854
23752 -63446 12645 9680 247646 -116903 236376 82645 -69476 200044 17165 88640 -84424
23740 26223 6208 192560 -176702 341015 -55607 -328164 23901 5589 81150 492834 82213
23728 -230574 183908 -282220 -189734 118341 -107165 -270789 -365719 -96362 -125511 271184
23717 -85964 15864 -78460 -258656 53648 70762 33998 -226720 -173795 -415680 -174607 -168929
23706 -168929 2876 -124147 43606 124935 -309719 -19374 -132872 98585 -222603 -31839 11486
23694 -74589 221127 108983 57211 219487 -55095 -95564 -13318 150406 238245 100947 112012
23683 112012 -217341 62674 -149455 70103 30688 156379 37853 -92920 37077 89061 134712
23672 134712 -90578 -235985 -23278 84547 -85706 28142 -181448 -91496 -31293 -73853 11991
23660 -196742 -110547 -55985 -252491 167240 -90887 -172322 -380036 154059 61455 -98919 32314
23648 -317678 65858 107245 344755 13840 332919 118218 -281748 158207 202000 -23574
23637 -31942 -247014 -15030 -116091 261990 -123154 -113700 -64207 -387418 115303 -131273
23626 34075 145567 212673 -134987 -304409 442120 -169404 -1904 213426 19600 -135580
23615 -244094 127218 -78390 -118946 295803 -56713 -423475 -133936 -216204 -265690 -332300 -193081
23604 -193081 -8517 -2460 -21374 226659 259765 46047 -286526 -33596 81581 -16110 159729
23592 110300 224639 63733 158156 69174 100155 314568 179240 -90713 -20850 70941 264807
23581 264807 251682 54577 -137065 444493 -6104 79572 166846 -39243 964 -115231 324291
23569 -44670 -16514 -174781 -47994 -189114 115902 39330 179238 -4394 77805 -26674 306793
23557 23022 -9824 -133773 268782 -349009 -189244 -23626 92893 2127 226255 251667 18978
23545 -121894 86665 18770 33976 117236 -139619 61092 -142688 -162600 -14249 -5609 -299349
23534 -299349 139486 -158189 -58279 273613 -43708 -137824 228628 387453 -228536 -271392
23524 -271392 -243590 -163176 62517 -294287 217012 225111 131693 -143375 96401 44119 29789
23513 29789 293277 26629 -46458 -159826 -90375 -172660 -135272 320855 -85023 -1716 279856
23501 -155363 15818 -75740 -80029 -206921 -269586 14056 138698 87769 -148797 -58427 50901
23489 102896 -27041 152560 173303 292576 -83614 -97918 -219328 24423 252672 99244 -139498
23477 172880 -168928 107765 84428 -14427 -187698 -33152 -201406 157466 -188675 150568
23466 -420101 32403 189515 128390 -195964 61141 -43487 -82912 84606 -141151 24601 -147308
23454 -153333 256549 120007 -80008 -142327 148614 80616 -212609 86694 101761 -207246
23443 251917 19583 135896 33885 -50426 266770 -20369 6859 -367004 143292 -236776 72039
23431 -118482 96660 112919 -183288 58502 -90782 -254013 -21026 -298724 291243 -76305 111464
23419 -39131 -7759 -213814 -137689 46641 -66580 -270249 -225505 -39107 -88082 -488557 290025
23407 -135215 -114865 -188041 -65883 -123279 80459 -82740 166835 -48794 274671 62651 173678
23396 173678 -294819 -166150 75992 -337468 289587 104129 692 -389131 -266700 -140990
23386 -140990 52956 -147524 236486 51194 20463 -156875 -222582 -53477 31490 126439 -236238
23374 94659 -162992 -218758 -92561 -33544 349322 -22044 213690 131870 -106985 53220 80271
23363 80271 202061 -51240 157286 -358612 -336273 -41687 -44867 -333109 241989 -3230 37532
23351 -371751 280763 -84766 273569 298589 249927 156506 43450 102286 -139837 108476 -12107
23339 73719 10923 219354 -210422 203110 -568576 -201512 -169413 -25023 61280 121457 -201963
23327 -94163 22055 183831 320950 604 -33591 161095 107902 -501453 71561 145448 -339884
23315 -88446 163420 193693 -13856 -185701 72888 -159731 100782 203434 86529 27724 -116802
23303 -252596 -159080 68440 52464 -378781 292859 41957 -6723 -38674 -352174 -197401 -189670
23292 -189670 -43500 101497 -93676 -61297 17559 -83777 -337224 -77953 -116075 5960 123446
23281 123446 -145892 -25813 -16244 -47060 231652 -32244 -163642 79530 -48209 150125 -140270
23269 -86354 174120 -230125 109179 120046 -43978 -146012 -96519 135705 -207954 -81483
23258 154804 -93026 125511 144901 182954 92651 -46488 -291707 -40589 123628 -119264 -198590
23247 -198590 -290567 12182 -78090 -78556 -340 54288 -16755 187265 189296 181178 -135886 64378
23234 332051 -135109 267917 -167882 83910 -75749 398228 -434134 163445 -187844 -92514
23223 -122401 -20196 -176002 161461 217768 -158577 -132782 -52020 -77740 -255331 -402481
23213 -402481 119382 107441 -140760 89295 -143249 -105569 -167165 -123947 7088 -131105 -348807
23202 -348807 98185 -403746 -327802 -110732 -66548 12340 -268485 -104916 215451 -243332
23191 99243 250132 15633 189353 75599 439331 156034 -227187 -75793 -140565 -217468 84033
23179 169982 -193841 113800 181439 -201330 -10741 65565 27660 31964 -174914 66789 -254090
23167 170233 -190554 -247618 -186611 24869 -152082 -85294 -73824 411157 -23092 -68095 225486
23155 -218729 220581 -157933 -88267 88496 -147801 112870 -212527 -51320 -298437 -238110
23145 -238110 46942 -67734 168218 213217 -140574 -3188 -240505 68297 60342 -236785 -221020
23134 -221020 184735 -64487 4010 508942 349359 -49116 -204052 146872 1619 -3242 -198390
23123 -198390 59110 -104233 97742 234616 -32207 128224 326701 -61142 -204621 13549
23112 24359 49632 34234 -184041 -293515 -48629 42618 -131129 -184214 -198148 -88926 -136369
23101 -136369 90224 34634 216177 -180572 197714 115109 57581 86972 310656 -190807
23090 34194 215468 7250 315162 -38369 93765 -85712 185201 -286248 220778 -993 -4710
23079 -4710 -160636 63553 251727 -120277 -156881 113369 -34491 -111508 -114664 -204167 -356185
23068 -356185 -28831 -115046 -49632 -19469 15965 -76039 195690 -263995 300240 56652 129775
23057 129775 400580 44755 -75960 395310 -270530 126566 -84746 14803 147379 -23770
23046 130076 -67738 -34599 290950 52700 -116640 -94173 105913 -95474 98750 -146770 -205187
23035 -205187 -101059 121918 23090 126822 196370 376723 -24742 -87464 162180 197650
23025 197650 133767 156427 -74678 -103554 -202561 62629 93445 -49784 -66904 94907 -230670
23013 -195596 -8040 -74960 -28550 -53404 202259 -1947 -260814 181552 -10554 53136 -91117
23001 85281 -91769 -35060 -73456 221152 -21219 119590 97639 77217 33007 212778 -230172
22989 -78852 -140068 102475 -84861 -286195 -75129 226646 -249721 78887 -174753 385598
22978 -310573 -131084 187357 145864 64863 -79753 91542 203378 -67058 -207256 -11636 242453
22966 -81531 206335 -23126 -134030 99182 -177751 -259669 87222 147815 -46482 -261620 149077
22954 -277821 79218 109189 -16638 -370711 -62037 -424652 58640 100565 -83068 262350 -386995
22942 -267885 -3409 113250 2466 -261203 -91777 90519 210138 27377 27850 74349 12106 -225642
22929 -149279 -74611 -141190 -206497 -45520 25483 -121218 -150904 135509 -219365 -60183 -55700
22918 -55700 -123563 -50514 178698 -153614 -337711 61984 -139015 90560 214863 -171762
22907 -315853 -134314 121312 23210 292741 -338840 -9388 25995 163577 26869 -228558
22896 -117906 159735 -270256 -211345 45017 36520 -50951 -215320 44256 12756 -132736 -111744
22885 -111744 -31077 150783 86206 136667 -243810 56280 -221675 169014 -37678 -116347 -67384
22874 -67384 -90833 115057 192097 195289 -100508 6166 154469 -428771 -127445 102887 175754
22863 175754 101084 -80165 -94907 -148142 -9877 -226771 -299765 -185528 -297097 -110525 164166
22851 -183482 102041 -13286 87023 196627 -32466 -68863 -32971 -281155 -17041 4206 -281819
22839 -27395 118796 12528 -167771 -210034 -92248 -85816 -264518 -1612 -41700 223274 74585
22827 -233595 213095 -405209 -244443 160967 -70393 -51722 -98646 217754 -17461 20755
22816 -175924 -222233 171989 -21060 -183453 -49112 -225623 -23821 208317 -406115 -423993
22806 -423993 129646 -161590 -141808 -60397 -131560 -53817 -111041 -258611 268522 171847 -17241
22794 -4212 -208413 -4377 -29860 136386 -46461 44411 21506 -306553 48912 -124099 -157046
22783 -157046 -267735 -54176 85317 -2536 64834 -496675 18843 305434 114862 26265 -61458
22771 119327 22405 136076 -94657 -59540 111772 -106414 60164 -204472 -176538 24781 289578
22760 289578 -77216 -142953 265413 -160730 225570 167964 72595 -123080 155829 -103850
22749 -51848 -242458 -96583 229040 -195374 -177327 342957 -20491 89671 272434 -41765 -16175
22737 -104757 103138 102469 -11209 -259242 -202174 -108817 282257 -98585 -5706 23829 -191206
22725 -316677 -12728 -145554 48854 -13540 -349596 -281487 -297704 -67009 -149680 78387 176751
22714 176751 -219473 317473 359135 18942 -41657 -136892 163449 173524 -204023 -62616 -171005
22703 -171005 -211827 234099 -286731 -346125 -258334 -154299 133029 -45258 119704 -11993
22692 -138037 -169576 -28927 -145681 267812 274497 -87564 -64808 188471 381082 125248 -334504
22680 -53799 29924 -92625 -68583 -174285 178858 38726 -62927 -299812 -73045 81117 83333
22669 83333 -274253 -376406 -96131 -33843 53825 -45509 12601 -10125 140345 -112745 44067
22657 163796 -14808 86604 405375 -20162 -40283 -43603 182639 93912 -104204 24801 120009
22646 120009 -190720 -129088 59316 -371181 20068 -295455 -243079 -337593 114325 14999 -44523
22634 19598 -79704 -26234 -86439 117404 43922 -7656 61626 9779 70194 -146665 180111
22622 -86054 -76053 -144692 -3477 90834 -283761 203262 -4444 108923 386414 26382 -237567
22610 318752 -103135 -368864 176099 -102344 -88510 -233378 -445586 176747 -65679 -78772
22600 -78772 12704 50876 15036 8563 82759 -183041 -321486 99338 353365 81942 -101586
22588 -395180 -135650 -93949 -81780 19426 -71625 -199435 91415 -244146 -204296 -209931 109844
22576 169062 -199224 -33310 -147726 68100 -148852 256165 -129017 132328 -362151 -130383
22565 -138452 6357 -194538 -243054 -221837 -139486 143265 -241125 311776 64146 -33197 93119
22553 5377 -78046 -134316 43983 -259699 -111312 2298 -81415 51832 -247477 271668 -124817
22541 -204010 -49310 7099 116772 -35596 66927 12319 -219001 -315651 -137386 310080 55005
22529 90367 276072 -27893 278677 70323 -70515 39130 -185483 -35368 -1287 -280176 -48126
22517 -239129 85665 97513 82394 -59425 -136768 -207497 -70998 113249 -91178 394427 -60484
22505 -305481 -102261 -105317 348394 -117881 -174167 -214449 -179948 173941 -77250 -326575 95293
22493 -154791 71557 -24786 -21791 -447075 31761 131858 63940 -119904 100228 -319415 80411
22481 -56556 -81281 -226393 -139037 218680 -201791 93164 152254 177639 -245745 -81069 -103549
22470 -103549 -90523 159183 25820 -95853 51308 -15638 244837 -105760 96921 123117 167299
22459 167299 -61775 37911 99062 -170604 141270 193573 -79215 4513 -144115 -293794 166776
22447 -138184 3883 -215824 -188987 59065 52890 -78439 -140001 218457 -202049 -336282 39485
22435 -173747 -45328 156808 -74666 -282996 -87433 -73448 89516 53155 94068 12252 229632
22424 229632 9596 340414 -319676 -185750 -356561 -204411 -125398 43422 122804 -42932 -319255
22413 -319255 -114379 -247961 85546 -27034 -43523 -47312 254342 -151727 123421 98703 187315
22402 187315 1611 16300 -39518 -52809 -336791 -145001 294228 -87706 -165999 -15569 -371393
22391 -371393 -28761 36631 -147817 -44082 16589 -46445 197828 -173762 -191652 84788 -123895
22379 -171630 -94676 46602 -87200 -19382 52688 -41130 -96167 58509 -152188 -120031 -69926
22368 -69926 -103861 78024 13142 134099 -137727 199008 126088 285939 -106999 -166713 260036
22356 -6190 4038 -53320 202788 -100802 -99315 38814 166299 -166038 48789 142309 8936 -45919
22343 -11867 -83125 -163528 -95475 167091 79809 -75712 9258 67665 -137772 -236229 58470
22331 -109924 -148553 12681 -492355 193770 116993 -238954 92412 -146558 -62295 11173 -151600
22319 -121203 -1834 231806 -13129 42383 51310 -406312 -36372 -269593 -492479 -49892 -171987
22308 -171987 -283837 -36524 -69735 -206351 164292 -5714 -50029 -44231 -36881 -129316 33115
22296 -26661 -5379 300218 -12619 -109672 -9587 2064 -266028 -159742 -137580 -103861 31590 -150560
22283 41303 -263852 357363 -405914 -75704 69875 -223011 -174216 214018 -147128 -238082
22273 -238082 173227 424033 -167861 -214108 -242534 186890 -130007 -27411 -356621 -316745
22263 -316745 104678 -61215 -108313 -214904 2715 160594 107587 -332696 37611 -41681 86386
22251 -12253 -158398 197026 -129334 431755 -302336 81307 -168382 81564 -20841 -90668
22241 -90668 -69597 126964 -6549 -186185 -302839 -513827 -124494 -160594 8729 124078 -423924
22229 -151823 -83863 69502 -208423 255605 -142228 -210941 -37774 -10256 232530 -8963 224553
22217 149914 -41 106419 473489 116419 258842 35813 77158 312373 -37322 -187153 120488
22205 164293 -173022 -286358 -3259 -280645 -125543 140237 -144255 21337 -8676 121880
22194 -80572 -206685 74755 -49630 82424 -278264 -87055 50801 -157080 244987 297326 -92936
22182 -32007 -228101 419989 -317012 101260 -77439 -177336 -134222 -240277 -106789 -36786
22171 -159898 -87068 -80587 248106 -191608 151860 92151 -91028 38462 304958 -282538 108518
22159 -103805 -166594 256888 258400 -220489 -103085 -64167 -124280 401064 79171 -57333 -381218
22148 -381218 106965 -195972 1316 -246919 -66800 149271 -4126 -222998 -21510 -330335 -67610
22136 84071 -110833 -106979 -181471 -211714 -21596 -140559 -187296 -195439 -47088 -149975 -103789
22125 -103789 -147395 52593 -101812 58797 -98411 -108040 32687 1067 -196390 -102842 61951
22113 -105792 -250271 147415 -240904 209573 1420 -138952 -392040 153908 -204826 -84098
22102 -68120 174592 -547700 -96909 -146711 120198 170891 -78163 -115498 376238 -192043 -125401
22091 -125401 -39281 42582 160233 192979 1296 -89417 -375579 -306937 -42875 -322047 -103705
22079 54622 -349605 218314 -162987 -112549 -88114 -140983 109984 -231804 -74288 127607
22068 -211411 -27727 193049 149206 -99349 60871 136292 119995 -167774 45875 14698 8020
22057 8020 246803 -364878 -49363 -40572 -267576 -130582 -290104 -15749 -41544 60226 128866
22046 128866 357731 201533 -170590 -392636 -230015 4397 -5445 -234976 -295652 93004 -78367
22034 -109732 166744 -484083 -131702 7362 80830 -60239 -291422 -114733 46742 -77896 -190106
22023 -190106 -3137 120788 -202769 -137974 -172499 37136 83225 -38677 -40814 36486 -61952
22011 -143315 -93784 -52441 73577 5228 -175619 -174491 -105408 -85390 -62344 -161503 -174334 154189
21998 309866 -9431 303658 -208847 -358461 312731 -354517 -185304 -499333 107424 -42312
21987 -165214 854 -5554 -157402 -35603 6738 205373 23637 102025 -320828 -121050 69737
21975 124012 -162677 109419 -130139 -422718 -229012 156694 115903 -104200 -88522 203685
21964 -52394 -93783 -245041 -185636 -103004 101163 186235 -27479 157501 -108756 -223209 -136841
21953 -136841 97434 41779 -254837 79758 212746 -378293 -1817 -218963 -181335 -240132 -312181
21942 -312181 -246152 63677 -17881 -200274 -108027 -221117 -117906 366708 -65987 -32201 -211037
21931 -211037 50213 45068 -167938 -286892 -153924 -99920 -20642 -194277 72017 -63619 -344289
21920 -344289 -141965 -97941 -190358 -253249 -322424 -264687 -147010 -51013 336045 -160867 57511
21908 -112076 72651 -14176 -207973 -109944 -191930 -90509 42272 -8139 -18634 -150949 -133330
21897 -133330 -116348 -28275 -7363 306515 -20644 -146846 214054 42878 -215699 180424 90811
21886 90811 -96578 81032 -99196 -65740 -338273 -165998 -51459 163066 205913 -104132 -161508
21875 -161508 -77840 -157710 -63720 213954 273170 -313044 97338 44679 53835 -138256 133740
21863 -91433 362507 -178144 -120060 -354888 -16745 -6956 17968 -173269 -174132 -204001 -3105 -10734
21851 -10734 345568 14178 305047 191222 -182886 -37585 62175 -122125 192392 -12800
21840 -229011 -71869 320123 48727 78711 -172772 -40109 -99105 -335423 36469 -64832 191043
21828 -104675 -226710 97904 162400 403689 201923 127424 -144020 15410 -264270 81272
21817 -58640 -57197 190293 -255042 113140 137703 -78534 420316 -234287 -152970 91688 156006
21806 156006 -445370 -17490 56841 84429 -83126 -400734 58295 -109669 111991 149611 60761
21794 -227282 397760 -2710 82877 -216803 -101140 -28869 306060 -117865 63917 249991
21784 249991 332609 -105792 -147312 270183 -476651 112248 -319520 -288267 -232864 -64601
21773 17296 -96044 128449 -58680 177707 -104149 -181150 -26553 -56261 -296017 110305 140581
21762 140581 150350 -237939 363802 42517 -44057 -131538 -88868 -8922 7948 -127968 74252
21750 -176127 93450 365664 239997 147122 267729 -30078 -124262 -392508 -49028 -124890 450788
21738 -26759 -72558 21452 196908 -5495 -131892 145734 -57085 72514 26823 -59452 -1380
21726 163195 271261 -152929 -78605 -119493 -151581 99047 -153805 -33448 -276124 -239207 32794
21714 88729 23057 102844 -99125 159765 -16764 -162135 -436938 395868 -223794 9946 -114659
21702 -82953 74361 -483737 124667 65700 37270 -139742 112111 -108527 159913 -206416
21691 -82343 -174908 -136555 -26597 -11405 -15589 88469 139632 -224037 -241855 149978 66264
21679 -291798 -150868 -93619 -146299 138810 54239 70601 -206953 -141126 22218 108298 -303110
21667 -25203 -144292 -10135 -29300 148220 -450127 -217959 -141910 -188660 215310 -314411
21656 44805 -169070 270435 -181660 71057 -143373 69935 -48787 -139962 -397697 248366
21645 -119216 -74503 -40675 30135 16780 -79124 88373 -207071 170317 251581 80346 -238428
21633 -270802 8507 50559 80792 -71864 21110 88360 -168190 -263063 -80936 137561 -138167
21621 -224835 -130937 -166113 -255264 834 165706 -187463 83679 -50099 -296824 60864 -61660
21609 39239 72846 -359453 189473 -50019 -140348 -415549 28634 -3418 -57715 -79686 -83955
21598 -83955 130135 98944 -119459 -137334 -6316 142997 48981 15813 71043 31089 107025
21587 107025 -539793 -265788 96838 172933 -184854 12853 -15638 -201968 -165621 -206154 68924
21575 -144615 156234 -255332 -121733 -50838 37105 -127908 68168 -112444 -287431 -438746
21565 -438746 -349070 142070 -46044 -123537 11939 -71809 164763 -23873 52714 -84115 6122
21553 199223 42357 -85106 13404 -13615 -207500 -85178 -160890 38092 1252 131491 -162361
21541 -218238 27715 131452 -149324 -133941 -144332 -12872 -8776 -229624 16963 -142900 205892
21529 -459778 -160767 124114 -6327 -117667 -305417 -145492 -4202 39526 19693 -144403 7236
21517 -62094 113304 71416 -264760 62291 19571 -242599 34795 -280521 -102259 -175093 -368372
21506 -368372 -177347 -11281 78499 111542 -259484 107541 57798 -354269 1429 51326 -40409
21494 -140866 207953 -28361 57215 -148059 63749 -113057 -357708 151654 -177203 -161671
21484 -161671 -200666 140358 78185 94120 -54938 60267 6410 1737 133241 -122219 13422
21472 186049 -92246 -331880 -247157 -190914 293657 54115 -37921 -79759 -215203 -56764 -52488
21461 -52488 -120980 -157030 -199485 -121243 -140737 62605 -65966 -53144 -128900 -174021 85629 -30657
21448 -68550 95105 105741 36084 -124063 -213073 -126534 45844 252303 191342 -261599 138890
21436 236271 95951 106360 405993 83921 433420 485770 93198 39661 27942 264135 -48006
21424 91272 149742 -201964 -22267 23023 101104 137407 -127916 -33807 28137 -138776 130025
21412 -142535 -240646 -148775 -96904 -14157 -211275 39758 231630 -27450 -19161 111740 -197046
21400 -260208 -232577 -149779 -259174 -54214 -146877 58724 167388 411866 -231632 134674
21389 330699 -161224 -61972 94441 132787 -32005 -4453 -312268 -86388 -87746 -78985 379636
21377 -70676 122559 23037 234870 -281666 -170144 -87076 -238256 -128234 -57099 84051
21366 -34278 -550635 -36022 -173703 15999 -41156 -324358 -262377 -82768 76729 111918 -120920
21354 -163556 -95993 -87192 -64155 -212323 -83364 -291257 147446 -13101 297311 -257961 111112
21342 -185771 -222042 165964 -98058 -394970 168278 127207 136987 -169468 161455 -354545
21331 -65692 142593 227897 -156136 -315106 -83253 150870 -30521 -63489 56432 -43660 -248802
21320 -248802 -73696 143130 380846 -180393 -138065 -53437 -321720 -124305 -394708 -184456
21309 -158285 172168 -429107 60339 -54144 -260058 322093 118456 -122591 -19859 -100017
21299 -100017 24282 -80758 -326533 75242 -165375 20248 130505 -18298 -109461 -82442 -159658
21288 -159658 4727 -197446 -110492 84766 122245 -215743 -170139 -187636 -93873 112300 162190
21277 162190 -257913 104386 -334012 -8558 -208472 -68988 9124 164516 -31393 -253467 -277708
21266 -277708 -187912 -50638 178460 -329786 -284924 108815 -292501 107809 97387 -247109
21255 -127044 -97947 -126783 205719 345547 -189609 82721 -57811 144244 52791 -226535
21244 -111405 36608 56040 -132469 88655 -16309 -25459 -167615 331914 -197531 -383961 -131666
21232 -424796 64162 -327911 -118503 148836 178221 -28367 -226561 -244367 8623 124227 -41062
21220 -38843 -55495 -192434 105307 22835 -228420 35996 -37625 -250347 102594 -331226
21209 -204961 187170 -27320 -21976 -131504 -67681 -200462 -259425 -197848 -152674 64039 266565
21198 266565 -150116 -12965 -269347 136011 -14215 -404141 -152093 -8856 -171424 -242178
21188 -242178 -131090 -83191 -9020 37324 -121257 -97520 -85627 162775 81608 -406216 126429
21176 46206 -13989 2686 8515 -181311 153790 -80457 -161403 -54562 274835 -93389 93037
21164 48877 -121542 95926 -20043 -224790 -60327 45499 -260053 -184492 297168 202172 101238
21153 101238 169477 -53523 -171431 -274146 -64332 -30226 104079 213365 111853 159478
21143 159478 -73842 115569 147261 105334 -160207 165001 123113 -174469 75724 -178305
21132 14471 -184714 65891 89514 64459 -107670 -224664 77920 -112897 -161155 -498087 -5460
21120 197082 -114725 -105479 -93498 -119460 172885 -365739 -80379 3930 -180324 -123634 -21343
21108 -45512 -78466 -93827 -46496 -110171 -209818 121036 -7204 139654 -78428 164107 -53908
21096 -237372 -3012 -157857 87385 -33932 -124159 164783 138144 -159239 -471926 52188 -251040
21084 56515 -212783 -24201 -137674 -196058 -136456 -209753 -374821 143525 48448 -144886 -99977
21073 -99977 -106112 -228471 -156763 184111 -58303 -302679 -348616 -1487 230682 19412 -203959
21061 -138367 -248149 61376 -454205 39283 -18491 36895 -137608 -284893 -255759 -511422
21051 -511422 -249569 -2778 8435 -47185 -49127 -130646 -208136 12419 -52753 -82868 -320344 110037
21038 143061 -275764 85694 -9396 113934 216737 51259 167705 144950 -104210 -112075 25014
21026 -233951 55294 -273002 282905 285107 -94090 248974 -83141 -142976 -115158 -128341 -131470
21015 -131470 145769 -69222 -125336 -92907 -308318 -72775 -14368 63991 269970 351298 224546
21004 224546 334009 315993 229488 134839 -3654 -235974 -473262 122152 -229946 15231 70606
20993 70606 107722 -187984 -28731 -124603 -18311 12562 15575 -79621 64324 -159925 -359176
20982 -359176 93693 72211 -294563 119524 -23449 -59097 7592 -48803 -253566 132112 -291782
20970 -319170 -340717 -47162 56256 239072 -3150 -17254 120333 -117753 107605 256743 -54408
20958 -1405 -117872 -88068 -34458 19715 106915 118704 49820 -49743 -211475 -153179 271911
20946 -312679 -146640 105897 251794 229496 511173 325998 345356 397168 296583 194009
20936 194009 213940 -141249 181883 109865 10821 -179211 -193760 294931 -326524 -85409
20925 67332 -139469 132175 -140293 -56820 6155 31858 -126888 88919 61919 146041 -48783
20913 -424370 -351463 -29120 29337 -263591 -141063 153415 132713 -438518 306361 -28527
20902 -740 246161 70342 142330 86033 128592 -42692 356501 61316 104792 162824 -57046 77190
20889 157371 -144869 -231583 -254181 245043 221944 -355672 60513 -398252 -47259 -505730
20879 -505730 134648 -49783 -291190 -234380 195004 -110192 -98312 -192791 109627 -257002
20868 -113274 -180233 -149073 38110 109806 -280667 -216566 -60241 142144 -479747 -15743 84276
20856 -142743 -267874 -334501 227053 47690 -51783 -29675 -194516 -17246 203038 -374211
20845 -135549 203934 -171862 -38071 -28904 -102501 -523954 8195 12721 -260254 -164386 91953
20833 -36207 151432 78642 -5011 -82195 80706 -213186 -50828 213650 -151004 17030 -126623
20821 -247101 74988 -263925 -266982 -127752 -334156 -76396 -224333 -37884 -86462 49545 -199469
20809 -45609 -231427 208343 -95820 -109780 -49758 -261099 241926 -181785 217040 -193922
20798 -178205 241165 -358036 -138596 -26275 -288622 36662 4963 -220578 -139152 -86889 -67587
20787 -67587 -22374 -45886 -221606 -165703 13890 42581 -248879 -274035 189669 -89177 71479
20775 -126495 -74073 170941 -380621 132402 -19622 -53794 -320016 -105186 -278218 -36500
20764 259314 118543 -151308 49728 79841 -245446 18967 68329 3257 118396 87707 -53423
20752 -18892 -318221 9847 12346 31466 35290 -266549 82072 64661 52781 179817 -153411
20740 -189089 -518211 43783 58299 -89389 -203359 -184711 -312022 -142001 -90386 -223276
20730 -223276 181942 107322 -158636 -75032 56977 27267 -268807 60150 10136 347239 392161
20719 392161 -22690 -151189 -22505 -48942 -53780 -44740 131505 -186791 -143525 -158802 -230175
20708 -230175 -130415 1378 -205537 -4281 152372 -18501 -126082 -144434 -384516 -288647 -30161
20696 -90204 -140119 -129430 11656 -89165 -145899 -203536 -63497 -344056 -27653 153221 -74463
20684 -283594 -433917 81579 -176527 -16365 -101393 -24390 -224131 -258973 -24929 -111668 -102126
20673 -102126 -313568 -72207 60621 78327 -10645 -119350 -48459 180168 40030 39349 -76335
20661 -364709 -126254 -19820 -166613 35433 -69416 -459916 -120970 -408217 28855 -40504
20650 -91889 40750 -187058 37221 -123074 -324999 -75511 -114931 1311 -9606 5960 99656 210589
20638 210589 -311641 -127615 -426905 -66869 -1874 -138824 141989 -176635 -94721 -62124
20628 -62124 -78947 70917 -183684 -344154 -185726 -107897 110711 -47236 -155796 -341749
20618 -341749 -285836 -4406 79991 -2136 87828 163139 -257257 -88296 -180011 91439 -48164 38948
20605 -92072 61296 -269238 -139375 84936 -220795 -109860 -67400 -25739 -10793 -194114 502106
20593 381385 179557 -190207 66960 -45227 108140 333851 -51265 60921 160261 -34482 69858
20581 -166699 14594 238773 195389 448205 265133 284913 6208 404168 -246573 -136632
20571 -136632 -101844 -146319 289367 62266 -174905 224627 -114951 -18321 7886 83707 -167002
20559 -91741 59643 279904 -490104 291917 221551 108077 -66016 119923 -155908 13970
20548 -145477 173363 46161 -265856 -234696 -307617 304367 -34693 -109836 -363185 79915 -266128
20536 -334788 -180299 -321682 57030 -106269 -54447 -1018 61541 -108602 194966 -79892 -112561
20525 -112561 -253072 -50479 -72684 -56751 217125 14846 -222685 -66055 -350615 -72798 -88951
20514 -88951 -214000 -102956 -110058 -154537 135737 -76324 61346 50841 131327 -28198 89564
20502 -155434 -152569 -223533 -299312 -241060 -51914 167800 -188303 -161353 -114076 -41693 91350
20490 -302463 315672 102828 -284383 -129200 -177271 82115 68542 93792 -41645 -210519
20480 -210519 -5528 65076 -100560 -40449 18470 -165694 -68503 -170784 109806 -82768 -259615
20469 -259615 19635 -18680 -38163 114492 -177459 -50985 -62611 122033 358826 -41107 -69725
20458 -69725 -46243 -130066 14322 -63152 237076 -118870 274026 142586 -22210 -93346 -87949
20447 -87949 -317146 -112893 269646 -148927 -312182 12702 30998 -201257 -416951 104741
20436 -3547 252295 264722 -59614 4244 -163857 -234472 -197774 -163965 139065 -125049 76900
20424 -204375 -324819 295316 -100362 -165734 -136372 -299498 59843 -222157 -117201 -21562
20413 -112840 -295680 -196519 234645 76318 314830 -53477 -52337 -445435 99863 -215019 -169007
20402 -169007 278695 -157027 117745 -148500 96874 -273548 -158771 -97423 48064 -186761
20391 210055 131187 32070 -42933 -292853 136288 33127 -213288 35161 -29981 -285321 -272506
20380 -272506 -352499 -109552 285254 91594 -70515 492872 49833 -137376 -65888 -201933
20370 -201933 -180888 66232 2281 85914 72617 -455531 163175 -66088 160768 -26973 36041
20358 40480 83409 96997 -284051 285813 428094 17565 -150969 -67465 6730 -176821 492656
20346 135414 33685 194134 -73462 -7842 -20069 184830 -90260 -318136 -218552 15845 -173820
20334 -37635 62709 -20316 -51460 -57720 -565853 145411 212299 -98967 -20394 24797 -196643
20322 -490731 40685 -140309 -274533 -168794 364273 28685 -228265 -3745 64688 181622
20312 181622 61255 127755 63617 -43664 -237744 -291969 -225668 110414 -100083 101438 -131831
20300 -144767 -92199 -11193 335831 -62810 -182812 -153209 -369642 -240248 214054 -167495
20289 -69816 48632 -229495 83406 66901 -169367 -368373 -243827 8921 174044 -123714 208210
20277 117076 -88938 -195406 -238935 -265011 -32474 -263164 -51524 -49105 -314868 39810 -19892
20265 64911 -72245 -315678 -163943 -149647 25287 -89889 -346000 -137520 -120052 -123213 199604
20253 -260093 -173291 -333446 -126040 24020 295677 -46423 235 -262418 -31413 -80086 5023
20241 110494 227938 16194 97005 81095 -13618 -400218 181123 -133763 180308 -114657
20230 -291540 -87413 -254845 20292 6190 4011 -232226 34966 -219032 -101064 -284736 -175527
20219 -175527 -182677 -72585 -140636 5088 -231306 -41781 -52841 -58263 295086 5827 -210234 78579
20206 91023 55747 -256704 -214135 -248970 344212 -60400 -19519 166866 155040 -212694 53971
20194 178013 -151441 -212624 31621 184264 -167831 -105386 22526 -59835 -127437 -194823 -4864
20182 -136038 -47093 123518 -35985 -150654 -183567 -28110 94082 -280665 262553 -32741 -43774
20171 -43774 -159755 18481 -134340 -68560 -15226 59365 340044 101941 -82121 37594 -27646
20159 -177503 -153712 168772 140451 186709 -206545 -110950 36655 -23410 -115655 121217 -181927
20147 420049 285239 381101 466599 517311 429578 155271 459528 449732 290279 133516 412076
20136 412076 734617 418935 222258 382398 185944 23772 -218954 -302488 256880 -33720
20125 53634 -84737 -196699 -23659 -251940 -92315 249771 -209222 -138749 -174456 101602 108557
20114 108557 -109717 -97064 -96108 121037 -245371 -210183 -523045 -19482 -25487 -93914 -176509
20103 -176509 109323 44074 86420 -74248 -28566 -168873 -186816 -67783 -80167 31906 -138743
20091 -153322 11214 197395 25842 -317590 7196 76934 33240 185243 -251394 111927 -143590
20079 29633 -415870 -122591 97644 -126821 112938 49991 51045 147051 -100983 8435 -31071
20067 -344738 -150 -47675 239346 211941 -561194 -110791 -118558 -104068 -168535 -78931 -257332
20056 -257332 -110255 -214916 285299 -323318 -153616 37884 24535 -77219 -3995 -212107
20046 -212107 -18734 107311 43799 -270828 -83155 212947 -34149 -77259 19341 117336 -148757
20034 -402845 -199889 -342059 108591 -175269 229 21338 -12620 61690 -87167 279108 -55580
20022 -283131 67085 -202749 5546 91572 203304 -233601 -23125 -13369 -114901 14383 264076
20011 264076 -205751 -19302 -311355 100596 -88686 -125975 -117991 -9064 -148004 -140637 -136128
20000 -136128 88583 -145833 -206595 -174486 -350675 -157287 615135 223137 74554 133687
19990 133687 103305 163564 -239651 14267 -266834 41545 108506 8492 139477 347864 143470
19978 26218 400811 159303 241888 184560 -24880 473358 -292367 -174566 108994 -58416
19967 3922 -193787 -80990 128471 16950 -29761 451398 61213 39125 489990 148683 37252
19955 4909 383594 -26575 -25794 256607 -2094 521755 -62829 293513 -38915 -83643 -107626 141832
19942 213512 -389019 3256 -220647 -16719 -262313 -59662 273240 -202480 155446 -141222
19931 171201 -51747 -286253 -243910 -378824 -4400 -67442 36881 63601 -356859 -265563 48059
19919 118171 19414 -110565 37487 176867 -160850 -106337 110819 58973 -142066 -2264 -336917
19908 -336917 -188012 -310153 -351835 -219222 234488 -184504 28851 175308 116957 237992
19898 237992 145172 -137705 360323 26421 -176078 -113868 -200624 -253291 -15533 -293281 134720
19886 -342528 87426 -274091 -194437 -17043 -166746 -115068 -156130 -139653 -16285 -75227 104828
19874 -161656 -249317 107324 -202698 -337686 -272966 -64152 116683 -113617 -67028 -111298
19864 -111298 -131947 -178349 -48260 274372 309289 13467 -287078 19597 -16006 -324673 -142624
19852 22787 -178477 -85943 -121238 -191924 402076 -247984 -237442 -351186 -23128 121114 42298
19840 -75988 -61849 -159798 -301621 -128135 -187165 130868 -360721 7156 -10028 -109091 193165
19828 -168295 -187195 -187489 -179501 41593 -111052 -198023 -91275 -316224 -342410 -13470 10226 -35296
19815 -110531 -26537 -363662 249669 -10841 272115 -66089 -219888 117311 -249270 85191
19804 -95811 56517 -80448 -112374 -77835 -39086 -46584 133955 -21928 17559 -171647 10961
19792 -179685 385100 -70045 -20974 -292721 -30968 -39355 -97544 180297 82955 33246 142298
19781 142298 111691 11055 20212 -262264 -86344 -155095 344383 -195108 -426295 82783 38534
19769 -193185 -7365 104519 -74363 -135609 -50253 33769 -6253 -214249 -205017 -108585 399111
19757 197445 -245500 92053 87455 -199449 -69255 73923 128027 117063 39446 -138760 29392
19745 -91304 -78283 3651 86574 150504 88690 367001 -240838 74527 -94690 24230 159635
19734 159635 149701 51 234524 96554 202682 271122 577108 546977 694049 418084 314019
19723 314019 395472 111701 68772 -6929 -228376 -265413 88613 -108628 -152415 -7546 -30567
19712 -30567 -32175 -147547 -24295 -149347 -63273 13916 70718 -157082 110511 -119858 77283
19700 158481 -210844 -141191 146035 180650 426945 388684 405612 157855 237471 -74239 -2374
19688 -72158 75105 39306 14598 -213132 -73827 11609 -124285 -208588 -141095 162869 132080
19677 132080 -213347 -117228 229457 -285123 -59375 -263307 -257939 52770 -261924 -133385
19667 -133385 -456510 243025 -59557 60203 -260450 -60506 173421 -154454 -235801 -325043
19657 -325043 -8018 -546 -129411 -145355 90327 -298355 -91313 297760 -356443 -224164 -146210
19646 -146210 104595 -4826 -84554 -359031 -54572 -73375 -90242 -70641 -70136 -233570 -162725
19635 -162725 -114712 197502 82094 135544 395060 -254496 184297 -60999 -62470 72928 153111
19624 153111 517 140646 -209418 134085 102293 115806 -250055 -167127 312138 -202178 261470
19612 68574 -198657 34432 -162691 -134521 77293 136850 -109231 -326051 19268 -62901 -233017
19601 -233017 -228368 -201883 -148655 -64387 -215394 -144300 -218235 182159 -203385 -271845 -26721
19589 -305827 -424022 117401 32098 -281950 139918 29302 -263669 -119848 16977 25804
19579 25804 91380 -167519 183738 26563 4114 -244848 56371 -56076 -145645 -35896 -171869
19568 -171869 -141542 -46072 -152508 -31869 -144835 -150458 186286 14615 -161189 137347 -94171
19556 -275809 -26051 -31759 -213578 169406 25340 124401 -67140 -161029 -172944 -402042 -279574
19545 -279574 -174962 -256465 -103979 -150037 305924 -69322 -215034 85053 61413 -361553
19534 -109130 -202540 55785 32812 -50525 41764 217752 -169414 -116142 -42955 -21436 -14167
19523 -14167 -204638 118620 110038 32757 109668 -56643 -206083 -245819 -159631 -137492 -91148
19512 -91148 -64361 52009 -50526 203111 -191068 -160027 -367680 17018 176359 -256730 -13428
19500 -191739 -360788 -206479 93030 -14193 -219533 108196 6453 113828 -124839 -246068
19490 -246068 50064 107148 84974 -181151 53192 -69994 74319 -90146 -81644 -256024 118554
19478 44487 -17677 267588 262845 100653 -237274 24373 -146216 -303993 -175674 58748 -276348
19466 67007 -199586 -85750 172229 22018 257958 -28850 213408 -13868 -313647 164357
19455 9543 -52095 -308260 -77847 -444717 -129706 -157945 -111248 -201101 -32664 -100564 -305701
19444 -305701 -40654 -81129 96220 176335 -241900 -55219 -324609 -289665 -293079 192826 -58839
19432 350026 -74721 -307794 155160 -308416 -66049 -207756 130418 -40602 11654 -103474
19421 -405643 -117623 70672 -563440 222274 -236932 -219290 -29596 -125450 121103 -94636
19410 -330610 -127705 18276 78725 210092 21170 413534 -295093 -344076 81234 24975 -337571
19398 -245642 35997 20731 -57154 -291998 -198662 -298686 -41519 -248571 -296099 -74605 -181677
19387 -181677 95570 -13289 -273012 152867 121010 187607 -32856 27285 117989 -220133 -18657
19375 -116991 -501299 -332895 -134151 -269975 -139512 -271559 48875 -311312 -201349 -1785
19364 23896 132423 -321252 -370205 88590 -118847 -330993 -367326 -119624 -118504 106297 -41521
19352 10964 -109744 -254525 305922 29215 -221466 -157620 230656 -23049 -214468 9286 -140251
19340 -50611 -68928 -103907 -204008 -50673 -215783 156137 -14674 -104827 8432 -246553 -146046
19329 -146046 -210385 460486 77960 105131 -164193 -509737 -22718 112594 1303 57310 -128725
19317 -260779 -88607 -146856 -372439 -365000 -128236 -106144 -134395 -32691 22674 131549 -128679
19305 -136481 -243390 36246 120169 -279956 61567 -87899 -79812 119818 50128 -332364 45087
19293 -51192 153935 -307466 -32899 -127469 -268014 -364770 80649 -221584 -19014 -21550 191891
19281 41484 -128548 66623 -176467 -253500 -78398 29180 -42238 -214072 -218234 81676 75607
19270 75607 -40730 -294264 -104219 -178383 186775 -269814 -91228 -434964 -57830 -275674
19260 -275674 -298517 -510372 257769 216176 -228561 -456626 -134742 51651 -254703 -313717
19250 -313717 -66398 -60638 5153 -14972 65385 -72182 -3668 72276 -153648 223563 -181730
19238 -276111 -376567 -2265 -107756 -29306 -3317 -18772 -56711 -205913 86874 133900 29720
19226 -142754 -157147 -167351 -258667 -251678 -139856 -103559 -136297 -269888 -44480 28881 161047
19215 161047 -1530 55624 -149172 -141844 -76218 134197 -8008 133408 -138866 173780 -11217
19203 65943 -159061 163838 -168069 50953 303663 -138406 -56664 -170515 78491 9546 21816
19192 21816 221223 -429183 -426717 -341826 -15718 -374370 -22386 -212434 -168684 17468 -192088
19180 89679 -120362 156245 62623 -439341 310021 -241227 -57829 183429 -237125 -17403
19169 -216790 156126 -168220 -122374 84682 131009 -37967 161868 -313068 138325 -117893
19158 -38691 108011 -268940 111211 -143250 -6490 -184475 -76797 131799 -38833 79545 19206
19146 -20055 254167 -233465 37329 -219782 -82137 -245987 7971 35412 70655 -128507 233600
19134 198749 -19131 -227410 -63206 -263871 -373599 -62322 73870 -176269 146367 -203757
19123 -19648 -171995 82440 38346 -48009 -1694 -192507 -60485 131185 -100594 -92543 55205
19111 -38086 39209 23799 174638 -169332 -310000 -134602 -45329 -249069 133081 -39410
19100 39401 125441 -59558 -334148 168242 -227457 91925 155561 -73278 19176 -262581 -120735
19088 -65791 194317 -186501 -72170 -134353 -200346 78696 -44891 52821 -189362 62443 169599
19077 169599 -334517 -206374 -100792 110188 53637 -133135 236086 -170206 69612 199315
19067 199315 25485 54933 35866 147202 -164485 181405 101560 -227259 -190353 358211
19056 307132 53720 80016 66588 -92957 102586 -56258 -72339 -114877 32847 -63332 -138339
19045 -138339 -193565 -87967 420005 70291 31635 -196370 -247660 163798 -196632 69539 -507705
19033 -77288 -235618 36118 -6557 -3939 331166 -263588 105383 180167 -103644 -139688 130203
19021 -161903 64861 -147439 270342 -42090 339227 231184 -173607 92299 -492581 -57309
19010 -42112 431284 -227115 48821 -91294 158605 -199671 -241189 -152131 96766 159966 -39670
18998 -165462 47319 5357 13823 -303190 117264 -100924 316077 -635155 71460 -225416 51324
18986 47271 272217 -11696 142403 -184123 -87415 -24420 -424096 194617 -104430 -55852
18976 -55852 87201 97783 -242035 -15149 -25827 185687 529677 860685 504755 353020
18966 353020 191172 77927 -83701 -134801 237215 -301951 -222927 278352 -145585 56236
18955 -347427 -158947 26353 -270266 -239651 336098 150297 -60457 44592 48331 -266157 -12820
18943 238282 -53288 -118113 -484195 -150593 -70965 97258 146640 -193946 -69387 97211 -241199
18931 -50288 99193 270829 5475 -347974 88347 -466240 -54995 6861 35574 152894 42766
18919 -152260 -132636 -252175 -206090 39907 -204928 -48815 286319 -1080 187881 63493 27712
18907 300001 209585 335636 270377 277753 156468 -64032 -263996 -196516 -62947 66177 123144
18896 123144 -517314 21096 -39035 8754 -152671 166174 -101887 203789 -38463 16144 -258047
18884 -165871 -55546 136152 -94182 190689 -180259 -66201 -123172 -31060 107391 -99613 -377699
18873 -377699 40196 -96926 -115649 -14642 133234 41351 11659 49490 -125150 -201957 131031
18861 -179033 53930 -71092 -163081 -145114 -90208 136546 -72774 -263831 -97712 103882 -105407
18849 -330337 -127548 -8900 -53964 -144118 -77259 40145 -228345 18642 12050 -78848 -9270 89704
18836 -170241 -401126 -128094 24903 61590 -538638 40132 70753 -94986 -82441 -36806 103133
18824 -112032 157295 -317318 -69109 -192182 109300 -178399 -119578 -162295 -109324 197300
18813 84868 80030 -269721 -82266 60346 -96953 -56217 184451 387675 365453 124629 -47745
18801 -94932 -244516 -152443 -178339 55346 -203849 71576 123557 -176066 92566 63676 243455
18790 243455 322341 -120101 70279 93276 -108565 -25674 67620 -130197 58683 -34774 -44648
18779 -44648 -136473 -2595 186512 -82446 40281 -215410 -291389 -326015 -72039 81372 -112055
18767 -145632 -261728 17457 -42705 29925 40165 126742 224992 -141427 -315279 -157098 -64373
18755 -51483 111502 -101099 50624 -86038 -179240 28289 -185777 254653 21495 -128082 -246030
18744 -246030 -140996 86681 -58337 -73309 -85598 38837 -25955 -27158 -401007 -190202 82937
18732 -380477 -66880 99397 -393808 -209819 -73025 125689 207195 -55604 -73380 -223875 -72586
18720 279515 -292405 -151908 -79713 -54239 -177797 -168513 -157195 312834 99678 151098 -9400
18708 -282864 85689 37670 55712 144048 241064 -27961 -389 533026 -83638 -15037 -49723 -109860
18696 -109860 -172372 167671 -154934 -8797 -203860 -121894 -254293 13323 -28363 -117511 -62491
18685 -62491 65811 148207 79174 22032 -139473 -151479 -160365 -286312 -251994 112017 -11046
18673 -161443 51025 -157249 -40143 96 33615 62872 51459 76706 20518 476759 -217402
18661 18320 78479 -177020 -190099 -252661 -176841 119808 -320027 34102 -64794 10614 -69463
18649 -306547 112407 -344111 -91420 -13959 -9869 -116259 61923 39749 -184505 189903 146955
18638 146955 -187233 160441 173167 38163 19476 -191901 -227796 -10611 -14343 52898 139133
18627 139133 -74053 -94469 104896 22154 -49173 174508 117244 35168 -81555 -224726 148698
18615 204208 123440 45691 -465655 17822 -290489 -11774 349939 8642 -149398 97168 -137166
18603 213135 -185900 187865 62430 -116164 -233511 -4208 14570 -85060 -145989 1261 69108
18592 69108 200238 -169081 195209 127263 68402 8678 109987 136273 -136188 -68212 41051
18580 -29055 -313663 -288347 -225512 -29289 -191191 -4606 -120804 47029 -88386 110688 -92931
18568 4457 193252 -191758 -1983 -197154 -79364 -27319 -62625 33810 86513 -82296 -230433
18557 -230433 69503 -37250 -185134 84882 -21639 -18709 -161512 -51577 -35389 40758 -379263
18545 -167424 -139082 -49667 -98062 113938 219915 -157608 -183868 10534 18186 -308302 257147
18533 76383 266589 -311784 -257605 126637 255321 -108 270482 18947 -194953 -127904 43745
18521 82464 104628 -125097 -240854 -58202 -135332 26278 -162202 25995 -227742 146521 -293501
18509 87749 23224 -150211 -54930 -216940 -509778 136876 -97635 -20941 -330790 200786
18498 -208324 -33275 -4696 -82844 44121 -291225 -29277 -116502 -317121 -267947 -137149 -1109
18486 4559 -109079 -340078 -99 -129812 -85348 -207750 126495 68575 13284 -16622 32072
18474 -630395 -4787 -104581 38922 -107102 85680 156942 -19495 -114617 133854 -26408 -136870
18463 -136870 -216683 -8519 -135634 -214968 -196111 -231801 -160279 27254 -207945 -39489 -64346
18452 -64346 218191 93601 -92619 21115 74881 -151876 -182233 -162164 -278913 35033 -329609
18440 -75140 -203020 127100 -30484 269013 -146660 -243342 -106811 109110 -33957 -296182
18430 -296182 -92857 -60834 45027 260135 15014 196400 -414298 -100597 10093 171406
18420 171406 243391 -107952 -102380 221865 -33159 -74503 29504 -130505 184639 -27518 135650
18408 105330 -249689 82506 -134316 -100854 -14805 -95038 -48628 70692 37209 81168 -280801
18396 -24836 -222476 -173274 -409957 -51716 -132806 53748 -234999 -139512 -196588 -315637 70595
18384 5729 192155 -26321 -143823 372422 -125079 79570 -114294 -266428 -50937 -124165 -5265
18372 -218730 -189759 238498 226570 136819 109662 -187728 -219709 -267399 67856 -49117 207108
18360 -57541 -82299 103744 345428 393444 -72716 301098 341399 129948 -450634 30384 67673
18349 67673 -90118 -89297 -151387 15478 74062 142210 135377 -25871 -213771 -200804 -9232 -192077
18337 -192077 -197783 -59255 -19110 -89551 -63910 -188283 -138747 126352 -253797 -323159 -390319
18326 -390319 41919 156955 80895 -143017 -213498 94680 -102141 -548366 -279421 5457 -145292
18314 110666 -372342 25714 19656 -135057 118375 -60629 103914 -334301 -27334 -213048
18304 -213048 75619 -124141 174985 190593 172858 -70602 270160 -97603 -115430 -368824 248781
18292 111279 252932 -16822 54755 -125339 64029 -134510 -37056 -48723 173728 -174731
18281 -131596 -94160 78340 -46208 -71391 248670 -47458 168523 91568 150974 -74644 9327
18269 -38230 85059 -97296 41679 -84472 -141192 -88813 102217 -16980 -100144 -111109 -2614 -304477
18257 -304477 280117 24849 353697 192645 95259 79529 -107334 -35787 225553 4890 -24820
18245 95909 180423 -208343 -26222 -299619 -103612 135722 109630 187824 -373206 93798 -79704
18233 -105113 -26722 -420316 105036 -116039 -84998 -82256 -102473 -107784 78042 -4845 83663
18221 -36418 -176717 40539 -80399 -351767 226128 29325 -288912 12034 150437 -221572
18210 -188827 219917 -38260 -113921 -82919 -131423 -76100 -117684 -126192 -15198 -317896 63006
18198 -85674 -304136 75065 88575 23473 -51723 -151315 170388 175410 143156 65741 118574
18187 118574 28043 -2875 -60872 -22084 -10611 204740 144491 -300488 12084 205584 -195696
18175 63159 172119 -122534 -62544 -221003 -303993 -175907 265290 -25758 1298 -126060 10016
18163 -55378 -114244 -367878 -50637 12706 13825 56373 223517 195932 -82007 295884 -49327
18151 -37471 -165955 43976 93562 -10818 -334344 -20996 72829 125547 -118895 -46362 44819
18139 -21740 -156658 38698 25294 -102162 3694 -729 13333 136120 131288 -97275 65280 -208703
18126 -38744 -137159 64126 -352782 216445 102643 77959 -156633 -452760 -274791 1425 -172335
18114 20472 -4522 -56648 -154548 160683 117141 -222301 -65386 -139672 -11233 331152 9821
18102 186149 -307675 -249075 -71113 -168561 -160268 127193 -251504 -28570 -28761 -23975 313853
18090 -129585 -129532 -72833 -113155 284761 15891 -193271 -67677 -166233 -27153 105914 296698
18079 296698 -146259 224559 24668 61637 28617 -157424 129314 -383054 -9803 9468 97255
18068 97255 123179 103272 401609 16224 39171 60679 216347 311867 -293501 143648 159122
18057 159122 129319 -165706 97684 -157687 111299 244655 195540 357510 -64383 89749
18046 93322 -452516 140074 -16940 -55250 -60667 -241595 -94783 -247162 -21884 -105540 -140286
18035 -140286 118433 23660 -40488 -136568 -55058 58473 -72670 181167 -6821 -82607 224018
18023 68394 60188 74745 -189825 114098 206452 -102374 8399 -95526 338004 -23497 146646
18011 18917 -174019 -93394 -158157 168350 26158 -94353 -159102 141290 -21074 -90237 -459
17999 -4758 63182 249823 39452 -98164 -176302 -31697 146966 -36161 53414 -85487 -291584
17988 -291584 247707 -229587 -28944 -20301 13997 174939 233884 -211667 -277 95368 148407
17977 148407 48094 75729 299106 34273 51725 -1069 -81212 287614 4218 -358321 85858
17965 231914 -173985 201309 -4622 -258246 -233309 95299 95448 130531 -29543 -170200 157058
17953 -151897 -36412 13004 232313 129268 -109663 -137290 -179120 247749 -130396 -31884
17942 106487 38403 54779 -403231 449 -244896 368016 102981 -139056 -96089 136326 70309
17931 70309 -250307 -89261 -62250 149526 149157 -26765 -331664 194786 109992 -175067 -60298
17919 228830 4067 -312750 25585 88175 -48982 124098 -1875 155219 229398 -11974 -39468
17908 -39468 30931 -9812 6218 24848 258525 -116144 180456 -68097 -71009 -144622 -13968 -10362
17896 -10362 -96367 -84381 388014 25793 -272264 227050 -144701 -123795 370080 -50055 165925
17884 206936 134651 76108 -242362 205184 -61540 -281763 74502 149613 -67965 116660 289900
17873 289900 5783 42698 147552 -267622 -167131 -132063 343961 -85349 -638862 136580
17862 33892 -270444 213404 127079 211991 -376317 -58287 37376 -45005 34760 -47315 -142316
17851 -142316 -107740 -69544 40983 -102815 -32882 108517 152234 13836 -67087 126105 425896
17840 425896 133756 153591 210306 -221726 139552 -223762 30729 30241 298720 223445 -271666
17828 -100542 65907 33679 172477 142705 -34237 202924 484 -490404 353487 94944 93613
17817 93613 -84352 2501 91143 313612 76071 -61012 156193 103958 21934 18439 133633
17806 133633 152716 68162 -61684 8613 233858 45188 88569 -254878 233118 72022 -167107
17794 -129183 314032 -99163 -83031 206451 41185 115734 248058 111188 143574 339351
17784 339351 137863 -50871 371730 -248558 -218008 -51066 116069 68641 -78767 -44736 -46523
17773 -46523 -119300 14759 -250941 -261734 -41612 -165214 67471 400763 -149888 -105688 23828
17761 126254 -108330 139301 302471 72205 440696 32101 147606 158452 -53312 249638
17750 54858 101154 -50129 -605 37490 -112674 95301 -74311 -25694 210188 132050 50779 134571
17738 134571 -14761 25086 134257 317114 161591 66129 -121961 -63376 18443 209603
17728 209603 -217124 -136786 -78964 -132407 -59458 131488 132137 18045 -68618 -154778 -147053 81073
17715 183017 380529 -34865 101119 155390 -23435 66110 84045 -144654 247896 5803 -239402
17703 144267 297968 -48966 354208 -61391 65970 -112948 79141 7777 -14235 168653 286196
17692 286196 103225 336445 164996 129719 -102878 -47348 -10861 -235725 106803 149334
17682 149334 -162941 -176569 -348237 -52995 241823 36653 -81113 428788 158370 229243
17672 229243 124504 259511 150323 105450 390693 184397 108945 61016 -199241 265043
17661 353739 160853 76064 512773 345520 134951 151894 -108206 -21986 537976 222076
17650 -179498 -16163 -26346 400777 185217 -209764 203882 493647 158243 -5736 -24104
17640 -24104 48716 62575 148033 116760 -45895 -102165 43523 26606 -87904 360479 202480
17629 202480 100157 132223 690 -109797 60197 56750 404478 223588 548749 53014 -105891
17617 278813 2063 -50041 237942 -94240 239225 150467 72554 254741 -7519 112776 335916
17606 335916 -12731 163195 145029 271321 252977 -60243 105442 66594 291324 -98170 248543
17594 81979 100601 164748 150185 284983 52385 -22870 192537 -233968 365149 6901 213067
17583 213067 162196 161086 -249506 -36418 134963 277617 486382 182787 366243 -18008
17572 166586 -25776 142703 33272 167377 794352 115046 74684 160965 446407 650729
17562 650729 87461 -48707 -256531 -69182 111242 179759 313297 90195 125694 98941 307041
17551 307041 50575 -145896 116317 171257 409885 238024 73573 289459 96337 163467
17541 163467 189946 241460 -68131 -57742 146173 137439 182088 257239 97613 70598 345425
17530 345425 549476 392997 354761 215421 482331 794703 856948 983536 945908 619382
17520 619382 453147 601360 563391 479579 562731 467064 455524 176909 453063 606794
17510 606794 446354 659666 1111398 984412 564611 406911 794303 349007 399105 501851
17500 501851 232095 230396 147496 160138 553413 128787 586797 620305 336498 495861
17490 495861 346469 72202 291579 573547 457876 326651 315739 -77151 215612 359071
17480 359071 152866 59347 305259 250261 362235 542344 25571 186722 247921 323881
17470 323881 448947 153236 94669 514781 166618 239892 14036 202173 65905 276800
17460 276800 218047 82418 8998 226408 84990 129564 114218 132163 379871 131569 238775
17449 238775 322632 102421 266506 303985 647439 377542 284615 539444 538139 499827 141978
17437 154811 457208 338062 167368 538862 248946 66487 -92042 -52659 351394 533067
17427 533067 262198 264324 218685 6263 620700 237195 100404 332358 447909 299438
17417 299438 167349 -80834 582877 549180 121454 371221 50127 170011 -148210 352973
17406 -2560 404269 65294 151282 286041 491347 -34036 91870 212715 121686 71969 147702
17395 147702 183134 266585 181750 298016 -10175 231059 182459 340133 400400 582255 351889
17384 351889 158386 92082 609299 100626 -82966 462813 207729 134346 156242 306948
17374 306948 426552 193417 610206 219468 180707 397446 123181 238461 -22762 295000
17363 285867 62043 -164872 144738 98022 95796 354024 89181 -8799 488422 186162 285396
17352 285396 302885 142976 121300 202236 292170 345044 236344 193145 456451 467915 221354
17340 -97656 245036 206788 143623 410128 343966 154009 226091 54036 324693 475972 321733
17329 321733 186349 385348 307830 434993 495251 70399 120328 132105 373208 244350
17319 244350 386847 295433 295069 371910 219234 372171 210551 184129 330866 163361 408789
17308 408789 445902 149845 143260 224123 209780 554014 198971 307087 305555 198162 286160
17297 286160 336233 250236 75092 210473 218614 530225 373885 -48307 539237 429533 275627
17286 275627 305304 229117 411644 -59186 557325 303445 309758 412948 465803 376968 126695
17274 91783 437308 241166 619671 422997 329772 173208 341693 269273 359533 375935
17264 375935 81806 -24842 181547 476605 678885 145342 225343 176774 429941 354766
17254 354766 459425 580968 229351 666282 84291 256648 306657 267375 233931 486450
17244 486450 299039 367208 260762 401026 195217 253406 628049 628791 379216 225217
17234 225217 541106 263248 138188 563799 432984 103110 232003 462206 184079 -96986
17223 281697 142816 388895 611079 218243 486471 161498 247442 292793 251530 338941
17213 338941 241780 334605 528266 170338 314031 451181 241906 453259 248827 376966
17203 376966 296428 358432 29320 647707 272178 421586 650965 478619 581387 172673
17192 304718 437077 519148 569422 663633 680975 349200 508567 494145 288433 713872
17182 713872 208528 375970 568901 365859 409194 647952 649709 750487 244287 163836
17172 163836 412594 26566 396291 640712 176189 617918 428791 516676 449013 645474
17162 645474 329445 498301 358359 575227 466815 253231 611565 76248 556026 557869
17152 557869 473637 625080 202449 617088 410365 323396 312037 496567 469773 676019
17142 676019 455088 239314 483901 644085 382187 360062 388436 471212 582425 400662
17132 400662 119164 453574 838055 667189 497378 791241 533730 423874 568416 289758
17122 289758 96073 698857 686270 785478 779648 432634 491644 585986 684827 437019 634685
17111 634685 650324 698017 413421 393817 618094 719929 351562 585819 702614 612771
17101 612771 457608 475917 522757 1064707 604981 670178 457621 865129 698028 1058257
17091 1058257 834148 693074 784766 1007621 1058843 728284 581418 647814 742785 752427
17081 752427 517335 668172 1011160 956497 700859 778394 1083261 790688 820675 706849
17071 706849 490988 899595 681918 622915 554739 942505 839056 655941 488792 613740
17061 613740 799264 1163146 642933 658220 674316 731989 689251 733316 577990 838401
17051 838401 535535 925811 936942 898623 1151754 822865 572382 922081 840052 674569
17041 674569 949838 923970 587556 1058500 977001 829007 875596 629155 1083595 933296
17031 933296 1106317 1188465 1068615 1216697 846370 1390268 945074 680738 1391324 916173
17021 916173 851608 1090929 1034556 693669 883606 884837 1015361 1401378 1433881 851817
17011 851817 1080424 1036305 1130696 1302219 781568 1179239 1043662 1033309 1296094 920468
17001 920468 1231850 1319446 973857 1093176 1384714 1146815 1364828 1137690 1333006 1488516
16991 1488516 1040622 1281369 1277213 1438770 1331692 1405801 1220441 1393047 1516515 1441650
16981 1441650 1277661 1425722 1302442 1595469 1441707 1494575 1451357 1413251 1502425 1188286
16971 1188286 1557558 1348854 1559307 1424897 1559367 1166355 1580544 1361113 1450458 1703532
16961 1703532 1412710 1172184 1529672 1287850 1310065 1498811 1488462 1421239 1298615 1538479
16951 1538479 1662478 1769906 1754762 2031966 1762138 1615958 1747332 1714321 1615752 1855290
16941 1855290 1896320 1936854 1915950 2115974 1785705 2005791 1625134 1917653 2141016 2243129
16931 2243129 2158607 2019756 2449762 2064366 2110928 2157148 1949658 2212263 1999399 1969586
16921 1969586 2375498 2547052 2590935 1996887 2407941 2373949 2516822 2315279 2287308 2376198
16911 2376198 2280075 2654109 2687340 2518950 2855121 2519894 2577612 2651793 2984722 2546260
16901 2546260 2938581 2674110 2937472 2874976 3166617 2884194 2865408 2825874 3260764 2944576
16891 2944576 2871619 3105978 3185246 3203772 3690151 3213918 3242042 3249747 3413463 3352555 3848025
16880 3848025 3696730 3820182 3585324 3899911 3813647 3471931 3581835 3601240 3802093 3907166
16870 3907166 4087826 4220882 4191859 4153034 4025294 4074875 4154845 4448170 4509559 4457281
16860 4457281 4381499 4715552 4721923 4523182 4880034 4841867 4968712 5188150 5011969 5216961
16850 5216961 5216569 5039783 5173887 5481889 5562084 5575416 5580513 5681673 5980056 5702521 6152834
16839 6152834 6195877 6292560 6284645 6444715 6592269 6449580 6836982 6749749 7359323 7239827
16829 7239827 7175733 7469146 7200564 7375859 7906439 7756767 7932878 8582782 8279988 8424492
16819 8424492 8369609 8716525 9189274 9155246 9005312 9704276 9970909 9996834 10414521 10045547
16809 10045547 10064142 10697878 10685714 10995043 11535919 11748246 11805379 11794260 12633871 12506646
16799 12506646 13022309 13393383 13656009 13659202 14097634 14471893 14775507 15088031 15573302 15972400
16789 15972400 16606665 16775695 17169670 17710679 17712884 18515782 19063849 19717282 19723501 20484164
16779 20484164 21023907 21856332 22411393 23107806 23630969 24523120 25002598 25853349 26691487
16770 26691487 27452605 28462979 29033073 30121654 30928992 31856539 33093056 33740699 35212868
16761 35212868 36345744 37886306 39119902 40230470 41781076 43104172 45016848 46253946
16753 46253946 47885825 49656840 51448830 53376252 55100906 57496870 59244086 61545168
16745 61545168 63860994 66172434 68611860 71092931 73638724 76369409 79113169 81844387
16737 81844387 84590266 87490775 90455217 93410885 96100406 98455166 101278762 104129554
16729 104129554 106965441 109276317 111282955 113183969 115159059 117088470 118484690 118778564
16721 118778564 119748044 120117179 120254669 120143809 119501695 118688186 117293521 115874969 114110362
16712 114110362 112418236 110491305 108288364 105145740 102459305 100060239 96966727 94096325
16704 94096325 90830606 88189729 85074059 82281074 79301792 76806713 73934856 71515384
16696 71515384 68595864 66299444 63510690 61360717 59290055 56888141 54975620 52732185
16688 52732185 50475918 49113084 47269981 45284354 43982722 42159940 40982228 39763191
16680 39763191 37854039 36888630 35407490 33942890 33132700 32140680 31132796 29733709
16672 29733709 29028926 28341785 26847409 26244892 25798075 24616401 23937305 23202673 22210243
16663 22210243 21945871 21071872 20593036 19901047 19753601 19059671 18379182 17851727 17497520
16654 17497520 17136779 16639988 15953305 15801106 15347814 14893065 14536440 14244296 13977086
16645 13977086 13551378 13390178 12932707 12330808 12349467 11966192 11820622 11300241 11196619
16636 11196619 11083835 10951726 10115439 10193769 10288137 9903882 10025078 9334592 9419522 9266668
16626 9266668 8972843 8878122 8547966 8586126 8169914 8201151 7885469 8226553 7749349 7346232
16616 7346232 7281514 7326481 7316117 7001927 6891761 6409277 6740756 6105116 6676845 6216830
16606 6216830 5883244 5832715 5825858 5929434 5685281 5738463 5836744 5426783 5322876 5207683
16596 5207683 5252635 5094072 4907927 5100705 4510423 5004133 4940621 5134336 4604371 4608132
16586 4608132 4438639 4456085 4454858 4452900 4000912 4456912 4278766 4237740 4031096 3733152
16576 3733152 3772091 3861867 3744731 3512211 3566256 3585421 3774022 3810746 3498908 3459744
16566 3459744 3341385 3131507 3026708 3368989 3246160 3206341 3194666 3381120 3092162 3249706
16556 3249706 3225217 2926141 3373165 3008767 2750179 2390566 3026057 2455860 2655815 2576816
16546 2576816 2486550 2830852 2730848 2700849 2663517 2622973 2434570 2496147 2423925 2592475
16536 2592475 2284289 2361982 2293325 2305830 1934828 2210013 2092774 2349285 2055030 2125923
16526 2125923 2001702 2222131 1763152 1929936 2061586 1756773 2182664 1892375 2016763
16517 2016763 2212647 1780156 2170277 2118744 1744609 1910413 1930333 1727725 1856245 2060957
16507 2060957 1515556 1741203 1525115 1642002 1791849 1710836 1624109 1754674 1695896 1583947
16497 1583947 1769486 1428344 1432731 1535544 1804728 1513671 1816736 1921377 1650295 1542624
16487 1542624 1424483 1076889 1717674 1538513 1392158 1411667 1841040 1155635 1663264 1545257
16477 1545257 1585408 1182792 1089346 1664409 1547798 1239965 1289725 1365700 1360955 1272187 1226770
16466 1226770 972662 1195230 1272226 1229471 1210247 1181087 742616 1335577 1025971 1121337
16456 1121337 1189496 1215664 1047597 1005655 1246026 1025736 1334824 1191651 1134231 1097736
16446 1097736 717494 1156144 616432 852893 852798 1004778 858583 884641 1004447 1185187
16436 1185187 1028992 1087499 890076 1129834 1106166 954109 898768 848369 1027237 798820
16426 798820 1274408 892617 924107 950989 1175264 623762 538564 818312 933454 540153
16416 540153 1042477 993646 813000 754524 626156 1017996 759404 996324 1069068 817278
16406 817278 978657 901580 861867 911122 677145 711843 759539 757272 589761 743710 762433
16395 762433 536168 727078 683591 702977 734931 494879 596438 607812 977467 567022
16385 567022 595609 559312 660065 854400 546107 754268 605781 515002 504525 428149
16375 428149 514597 862894 606750 742915 323011 270980 515663 803829 507121 643814
16365 643814 631058 720177 779173 556720 911144 547205 511621 452221 694561 171375
16354 358825 571477 798920 407959 659070 715864 762891 488414 506535 261976 369277
16344 369277 657965 384657 333642 435891 562890 448309 498214 440939 768135 604612
16334 604612 714017 423467 571786 343216 576241 340796 583936 531973 493168 345070
16324 345070 632914 819226 321697 738724 368349 698377 260425 430323 10534 296619
16314 296619 629255 76566 425261 811136 499577 883920 454117 596687 590606 379747
16304 379747 657037 720491 770608 351385 466178 362131 356986 275531 581074 544121 347870
16293 347870 630942 510544 330426 595052 334526 585840 130714 568970 472765 545588
16283 545588 215786 357497 352214 214353 380374 362169 480660 294774 279184 490870
16273 490870 519710 383168 434482 32546 314341 125326 185328 159395 272738 275702 477915
16262 477915 69999 758483 455674 333759 304968 330698 230720 570630 447066 405412
16252 405412 487921 539378 358260 305912 458033 279824 201327 303213 298546 158183 444419
16241 444419 195299 -57134 504681 -42219 74995 482949 287425 433234 84523 296721
16231 296721 501996 132714 383844 -80991 199077 360934 73668 359120 180292 277764
16221 277764 142691 503400 162567 269628 273072 346797 219514 197095 93187 -250854
16210 151774 381338 468683 255191 -77529 560373 -3159 157430 186399 344739 319850 125478
16198 25185 244068 202529 101320 -192783 293766 266032 377796 306890 517269 75120
16187 107043 490196 -52004 432458 148323 309870 -201312 4056 217211 -244631 189022
16176 270758 267852 369494 265027 -23019 261203 284951 -60878 178899 171242 73313 367712
16165 367712 234488 -49131 134345 150646 434390 267469 21375 -126295 8172 -50123 -22387
16153 14401 57796 -51777 338791 375325 91899 -109810 37001 330667 196725 325328 265864
16142 265864 179495 -41732 170794 61629 131582 70986 127578 -264719 -230601 234339 128396
16131 128396 259337 53728 -279888 414840 120954 232117 49956 165757 -184707 134508
16120 526729 32056 -29017 -193765 60521 335627 270744 73883 156519 -32615 93620 -124184
16108 227264 212107 178705 315728 -15052 -23999 119675 -5343 -54086 125934 306965 62909
16096 -82441 -162877 185109 41723 23725 465543 490544 487915 27511 66031 -4618 333086
16084 259414 -29782 19420 434246 -19801 -272796 -189505 234513 63778 342653 33059 170486
16073 170486 224680 -17963 109024 29344 172677 61791 252578 147052 66145 186905
16063 186905 159461 159654 -19071 159760 7155 177514 -66 129441 -184458 285021 176635
16052 176635 281336 12747 -345459 193519 220041 -311176 96072 181071 -137184 -125375
16042 -125375 171434 -10756 350111 -125264 -34508 -182842 18376 -159519 -55733 -56805 409308
16030 160648 -158699 387828 -78815 149346 272045 237473 167804 58371 76575 163562 -73007
16018 185778 288243 64594 -55937 198361 -233623 -140632 133728 -155852 -142560 -37977
16007 219424 80793 97061 149269 62734 76958 289490 -45545 27684 87978 460023 -195999
15995 30036 -320101 -72183 86096 158346 270622 96455 64142 448765 235735 464610 826568
15984 826568 928707 1085242 1207882 962238 463305 572155 137882 -84130 -298368 -61103
15973 -19022 -12633 -78621 -115645 567035 38313 -409535 -301151 -53643 -164698 263709 -36906
15961 -112814 88872 80236 -103361 7088 90685 15387 -74826 36881 190508 -86844 86479
15949 65295 -253359 186742 252600 174638 45420 111161 -211975 -254641 157876 200891 106115
15938 106115 149484 194795 -352290 148705 326085 29300 -58437 -30090 99126 90184 -187062
15926 -156200 104803 -44502 -220058 -48902 -320027 64368 -392522 272678 -293025 -339200
15916 -339200 -103493 176514 -26152 86324 39517 -170461 -232175 -73005 60713 13547 -70470
15904 -29507 91526 -149833 -152759 284011 -141653 -53758 -98744 -239084 33604 2428 45012
15893 45012 149994 -252865 197445 -32118 -340930 121463 118608 40936 16710 63873 181845
15882 181845 -14000 -86608 83577 -118340 15202 16022 -51926 -118729 1809 -71696 282368 62579
15869 -357976 57950 166209 -129937 -187761 -188740 -225237 -266144 243498 -66024 -85717 -97049
15858 -97049 -71044 -60063 101302 -126858 -388859 55447 228880 43261 -78589 -222754 89301
15846 -28031 -186061 -20589 10228 -27954 -182345 -40938 51129 -45704 -354132 -78305 133952
15834 90705 129242 -204152 73439 150654 93712 95911 -213382 35606 -320714 347159 -50680
15822 247921 -91274 -10621 346673 53168 -175806 25974 -115870 -154241 238361 -33689 -108568
15811 -108568 189500 -31340 132966 174720 -130828 -179576 -129505 144604 -236702 -29750
15800 82097 -74983 -109843 -7084 84969 122534 -57784 -57363 130171 156490 85551 -14501 2540
15787 -149912 166916 182117 -1751 67386 19643 -1965 245714 -182121 70553 73409 163722
15776 163722 167900 33373 -127867 -24127 188105 -162065 160440 -196496 191589 -119063
15765 -283978 -202094 73541 70275 120096 148495 223197 -7892 -100142 96794 133535 41328 113964
15753 113964 156004 298647 -11887 34074 -240353 62948 162106 -34664 90638 230392 199071
15742 199071 -12138 362344 -175104 157595 -77173 64212 75659 -78792 51900 86741 492206
15731 492206 36160 30950 -61425 361736 -217799 -39851 470460 36227 -275956 -204511 -328116
15720 -328116 -64184 -19821 -446973 -72277 -11680 -165749 57635 247766 -292908 -141015
15709 43559 -324733 294961 110300 -367761 -173333 554 -46182 -176675 226720 4717 -249585
15697 -132614 -346172 171455 129867 -129299 320757 139934 492653 61364 42394 122654
15687 122654 102641 5786 -34190 261698 -163685 -88518 43219 107769 -183532 32422 -94646
15675 -155638 2965 244073 -79063 254150 68040 157539 69257 80077 122054 -203698 -76784
15663 -53126 45824 -65255 3774 -462966 232019 84023 130820 279462 154192 -6965 101678
15651 265253 78046 -17480 -90712 -6461 -331989 155912 -106797 -54707 154364 204378 199329
15640 199329 182941 -401216 -212033 -186236 143883 -172568 97231 -225876 -126702 -227981
15630 -227981 67657 -122900 -51917 -220680 -177288 -216172 -56566 217301 19650 276505 -185467
15618 39322 -197868 -154671 -48887 -175790 -75924 69974 -196075 -65464 -292197 -213011 -292789
15607 -292789 -130437 -64531 179444 99095 125026 -62967 -159582 21851 27730 32029 111486
15596 111486 -215548 129980 10474 85286 103850 -142003 89773 39290 36951 -317547 -51833
15584 -233067 160419 40780 195376 4289 165695 -424601 -310603 -197453 -184351 37631
15573 -184080 27497 150842 -177216 135228 10101 31358 -156451 -2579 204227 -171772
15562 -312913 -10732 225575 -65842 -50425 131230 6659 -144755 104266 4031 -16638 -183113
15551 -183113 -82268 8294 -69870 17725 -1296 -294626 7246 -43268 167154 117911 17078 96854
15539 96854 348889 -11330 229 -182796 128332 332425 76297 7096 90832 9848 6155 18816
15527 18816 -24426 -175351 -194217 -8461 251501 -16359 111204 219195 -193075 366167 67417
15515 11787 394574 126596 194659 -102500 178817 208561 290733 204145 53728 171554 87350
15504 87350 200315 170911 111647 193553 200318 156874 361411 476639 409520 39567 103712
15493 103712 -251009 347209 179459 -24449 56777 285392 161349 22517 -22482 342018
15482 -22727 -74238 -201836 20242 77954 168796 261382 540457 360570 657970 804249 587290
15471 587290 399055 187330 -93538 316032 -106458 33857 -174866 -233227 316897 228871
15461 228871 -89352 59589 61250 -97706 42999 -7845 351466 136009 -43985 -229107 -29739
15449 132119 483250 -39512 477004 -193981 51667 188339 306572 609594 566766 1083095
15439 1083095 1161359 480493 524438 376799 116107 -24650 343119 85501 311016 -220936
15428 122699 -7718 12029 -55515 96833 -152869 3360 215707 367 -130704 -295268 34728
15416 -93622 -198734 -6804 212742 -159611 -85117 -115526 45471 186161 -149067 191131 -203854
15404 -84021 -23799 269181 66003 -78902 -252992 -69704 90564 -279560 -127396 172884 -51501
15392 368143 229615 -18282 -154667 -6828 -16721 345739 -93021 -141903 -254305 -200920 28343
15380 204008 125887 -159864 -292459 204739 -168898 158019 253997 514613 323678 173381
15370 173381 368850 85705 319271 508522 157465 163506 14326 -115417 150883 149860 3654
15358 389295 405736 252015 284318 296675 516588 169618 216011 503008 241605 403497
15348 403497 272633 41752 170288 204252 401329 358989 89090 -44737 90729 406649 122634
15336 49094 180603 329095 42781 -292857 370938 389984 23477 137637 531067 231415
15325 -123240 152288 211128 -39692 78285 157028 -187736 259272 124420 255537 210902
15315 210902 396845 5254 166389 97914 196992 300243 -199277 -62298 319357 83590 83299
15304 83299 81525 -162075 380930 -127579 -185995 -179213 -127928 -220352 109632 29508 9315
15292 -154805 71823 112084 250641 29565 13771 -190756 -202848 -22559 151902 137404 -47736
15280 315789 -82711 215588 -375599 -1249 145705 28005 50177 311727 -134973 137613
15269 -84563 98369 239312 -17804 135516 -161620 -52566 193886 212678 233911 -290430 7599
15257 -33619 67427 -66530 91671 -94178 -21768 77068 -114401 124216 -253431 114571 369999
15246 369999 163365 -72515 258435 340752 377817 1174214 2124050 1737000 2433196 1616810
15236 1616810 722912 518523 168434 186914 195842 -67839 211165 -4612 31995 391588 185112
15224 409216 279650 -104568 235984 388607 200675 132015 -83689 -102699 74883 156774
15214 156774 39695 -107237 95473 -111736 10329 157370 -250690 175588 -74792 -20879
15203 -28032 50238 -119965 151018 58754 96411 110814 10277 172159 253467 14662 -150719
15191 105830 168180 -84289 -218980 -82345 -80522 -320316 186531 243909 167153 115438 131171
15180 131171 124032 515202 164102 75200 122401 -10611 2608 101999 -33604 227881 240148
15169 240148 182994 -198264 -221214 -77633 326899 83964 12716 4537 76928 301753 268270
15158 268270 157811 212012 84704 8588 -40550 139081 -58912 48752 314657 92823 94082
15147 94082 71226 -167905 40904 92963 63476 -45380 -149353 -93554 287404 -53557 255881
15135 178375 18947 252268 16645 338464 133152 49801 159781 47363 140787 -78697 212331
15123 415436 463128 181572 142134 446696 342969 273114 448699 484038 -137900 278549
15112 414628 459691 155712 131718 19906 263495 459990 397724 492081 -66114 226304 -177943
15100 165470 99909 58937 -34787 -104620 204061 115933 259917 65564 33554 274344 192939
15089 192939 84654 363386 62250 54958 -72761 206942 197533 121933 347846 141602 16843
15077 98036 187315 160548 147784 -104078 346855 -251777 446166 2655 360467 321114 74463
15065 -1825 318097 160987 -39900 200801 98100 119987 214344 183382 224703 368138 774449
15054 774449 503739 40277 307850 119597 496136 707023 264158 244382 482262 338491
15044 338491 301733 478149 344860 415869 311547 161382 494552 691262 45422 517177
15034 517177 69854 263889 120036 441751 713702 904205 607658 1073434 674627 705762
15024 705762 622984 509422 341584 458379 844067 574438 645090 538627 282386 287218
15014 287218 194729 96240 400426 397913 163490 535471 403044 476481 225476 293245 290816
15003 290816 336278 348104 393617 88082 304363 323843 640946 700309 417092 490629 430281
14992 430281 30999 137363 564063 590688 618410 705312 80551 671777 348651 563303
14982 563303 641957 780760 852909 854408 762049 430912 250811 278316 617215 203717 544025
14971 544025 350151 490737 578643 711133 116807 109502 591220 185593 246654 377813
14961 377813 469606 599226 -1605 555514 187946 290850 59170 246654 67252 239947
14951 239947 572213 480948 419645 559634 228273 74121 437653 578548 242742 864494
14941 864494 414351 183664 418376 400024 471650 -78292 129914 350088 575365 712096
14931 712096 527031 755487 1195018 1019927 957935 1264359 1433530 1508405 1539597 1565807
14921 1565807 1493881 1262589 1212305 1977268 1774336 2054290 2333236 1838865 1545341 1324249
14911 1324249 1329497 832725 871350 465549 424178 566596 165237 451230 107592 315085
14901 315085 465267 375223 642360 721728 60983 562629 515866 94387 812246 545139
14891 545139 350735 339784 419247 516745 544722 471071 745313 929451 827719 898612 704498
14880 704498 805125 1092457 720029 882055 826150 412389 586930 745976 490375 511600
14870 511600 692957 545805 415795 299035 791937 701491 614761 710283 474126 376061
14860 376061 453138 500933 442897 643457 279523 455174 783202 270625 358715 823747
14850 823747 565167 588275 377007 461246 516355 412180 871427 822880 1061638 1020324
14840 1020324 1180986 744874 822532 809323 966703 841600 788674 845964 418841 856766
14830 856766 535407 489762 564608 360691 585031 660142 751483 373668 672747 770331
14820 770331 731796 669198 463553 700417 670827 716455 494439 856963 370046 478698
14810 478698 917359 1052891 580382 410721 1010962 788671 1194627 1065409 674523 1244288
14800 1244288 588377 730014 360538 519492 676907 789709 418278 415799 645808 761827
14790 761827 539372 717479 685859 533718 785013 835953 734592 686011 617559 287421
14779 998227 853925 701365 560805 959476 914922 1062655 971756 728334 632501 863756
14769 863756 660874 421873 579250 545223 519902 584020 489791 779000 416832 596824
14759 596824 623779 526447 530317 472954 539404 1069528 459075 98689 657966 734739 643954
14748 643954 586490 381697 542854 772824 672724 553462 621210 696285 612027 926099
14738 926099 769103 470412 889162 823973 808963 776107 1028887 1184515 943647 1213862
14728 1213862 1153043 1405796 1882863 1481678 1654652 1289951 1377676 1038919 853470 1039605
14718 1039605 1074311 730664 1187253 665686 604135 979477 899958 1223739 774928 952296
14708 952296 822012 1031155 839955 1091081 1330675 1208271 1290165 1815228 1798016 1779770
14698 1779770 1926381 1308383 1277621 1240436 1042622 751405 866884 822324 1009786 1059030
14688 1059030 922432 769494 875436 804788 816792 768989 1067820 893687 1057599 862104
14678 862104 1041436 804867 1020655 1136999 1262829 879150 1075278 766871 945168 978618
14668 978618 1173778 922164 1219460 1335253 1142617 857478 1201466 922454 1063097 803768
14658 803768 1083306 740521 1007300 1206358 1223389 1277382 1168404 864993 1622197 1015952
14648 1015952 1250537 812820 1655083 879764 1217357 1340808 1263639 1513339 1291950 1094103
14638 1094103 1372641 1475691 1439398 1333692 1262409 1097627 1511112 1278783 1122330 1361548
14628 1361548 1245232 1326888 1671518 1110186 1161014 1194483 1274245 1016714 980955 1449603
14618 1449603 1333358 1427667 1532477 1854181 1448324 1593677 1118193 1408236 1442089 1505273
14608 1505273 1761638 1595802 1454513 1876929 1472500 1309572 1501123 1482820 1694345 1649444
14598 1649444 1657987 1651053 1353015 1774317 1666689 1918864 1732708 1538958 1914543 1737416
14588 1737416 1579889 1845557 1747224 1778850 1967839 1913710 1926200 1819625 2234576 1965132
14578 1965132 2268206 2014531 2204311 2119673 1986867 2028459 2058787 2037184 2282426 2400436
14568 2400436 2595177 2141803 2443942 2255682 2284873 2469730 2632602 2760356 3063840 2938543
14558 2938543 2669152 2989404 3108189 2808383 3265042 3560916 4146469 4469040 5576989
14549 5576989 7086874 10641453 17593540 37070422 44265417 20179279 9222689 4890750
14541 4890750 3182792 2997382 2631190 2896692 3421687 6008813 4105789 2677585 2298439
14532 2298439 1948454 1919549 2190463 2178431 2227967 2326689 2432656 2183166 2270738 2426074
14522 2426074 2576187 2682515 2666327 2398738 2769810 2625376 2653839 2766452 2605666 2770643
14512 2770643 2587035 2960540 2662396 2865515 2464379 2798983 3165027 3019583 2854455
14503 2854455 3023701 2931630 2923373 2944766 3192201 2930333 3275295 3385942 3342892 3400743
14493 3400743 3256350 3501043 3426040 3552983 3600574 3273550 3440552 3581892 3883700 3610267
14483 3610267 3676529 3916677 4010130 3979352 3451340 4001778 3936271 4086209 4245847 4401963
14473 4401963 4413629 4206543 4237037 3966612 4343976 4522626 4318748 4530849 4482803 4489928
14463 4489928 4836811 4698958 4442508 4972742 4820007 5087736 4910242 4912512 5012578 5023310
14453 5023310 5151976 5141141 5236771 5152736 5720108 5582616 5786129 5817756 5762088 6137649
14443 6137649 5767657 5590691 6012167 6217899 5949077 6127812 6501074 6360747 6365713 6530790
14433 6530790 6604045 6936807 6967696 7033907 7189057 7235007 7084294 7111930 7594648 7540757
14423 7540757 7930344 7710321 8484613 7838095 8731781 8623392 8887480 8733495 9072372
14414 9072372 8593865 8923045 9153183 9286819 9248214 9289466 9499236 9604302 10131364 9989423
14404 9989423 10407332 10630587 10451081 10538135 10846508 10834007 11003074 11066558 11529326 11626125
14394 11626125 11687874 11944723 12148818 12586295 12518081 13236141 12785953 13258955 13463877 13995374
14384 13995374 14072534 14722094 14620008 14466422 15295321 15775190 15750297 16090340 16157525 16512516
14374 16512516 16763680 16998966 17285457 17724954 18391986 18419804 18829846 19329411 19874328
14365 19874328 20228309 20522166 21220855 21495537 21759286 22051034 22700082 23053086 24018426
14356 24018426 24246029 24952239 25542138 26076999 26804671 26989246 28264902 28545147 29143278
14347 29143278 30057212 30614463 31477980 32730739 33669976 34051094 35054664 35952922 36993208
14338 36993208 38010170 39193154 39999292 41368054 42774563 43708684 45082697 46930203
14330 46930203 48245858 49474329 51206760 52789194 54599589 56241690 57958943 59735471
14322 59735471 62025218 64348740 66472933 68947803 71576148 74079299 76668092 79670743
14314 79670743 82477119 85538873 89303193 92944510 96740921 100450475 104742697 108681157
14306 108681157 113597565 118817853 123923639 129687460 135104729 141280910 147967377 154843682
14298 154843682 162167993 170147524 178288552 187187508 196312294 205941220 216263424 226888937
14290 226888937 238407780 250106578 262659154 275766680 289150400 303022559 317259882
14283 317259882 331765026 346747508 361373395 375999807 390545898 404358619 417473612
14276 417473612 429789196 440693391 449100449 453996720 456018215 457240391 456378030 453227114
14268 453227114 447379004 443082126 435454613 425811898 415690885 404386064 391107805
14261 391107805 376109071 360502025 344624883 328903237 313078619 297805648 282874335
14254 282874335 268842552 254936591 241937110 229533139 217618947 206596712 195906023
14247 195906023 187311058 178900245 169921637 161768182 153874290 146667035 139918554 133111073
14239 133111073 127255074 121979639 116780564 111493508 106363992 101761307 97461708 93813283
14231 93813283 90471491 86751863 83531835 80304957 76895277 73812323 71196435 68550386
14223 68550386 66106016 63734719 61937763 59537045 57606387 55586837 53906335 52078388
14215 52078388 50370325 49079441 47792636 46377445 44393888 43255306 42026307 40971596
14207 40971596 40755073 39252142 37712388 36437464 35643203 34914717 34072996 33118933 32160292
14198 32160292 31441545 30500357 29623235 28928067 28412731 27975718 26783959 26237570 25733626
14189 25733626 24901180 24402154 23351569 23065694 22770015 22204999 21886567 21388471 20636109
14180 20636109 20322227 20048393 19442955 19173987 18666168 18307613 17871827 17973639 17477238
14171 17477238 16713142 16567415 16494531 15987883 15922286 15203910 15198211 14869428 14664173 14272349
14161 14272349 14199174 13721340 13770207 13473098 12756475 12742420 12505404 12676931 12044682 12083988
14151 12083988 11839422 11683576 11733150 11261616 11074322 11084417 10913184 10439851 10589576 10154529
14141 10154529 9912256 9927564 9731549 9747130 9650741 9250460 8940738 8999154 9342956 8666354
14131 8666354 8656964 9010365 8541228 8384343 8196618 8233033 8073499 8106154 7670974 7927821
14121 7927821 7276688 7638830 7308167 7303547 7366129 7630072 7080441 7168051 7243192 6742610
14111 6742610 6863209 6492266 6590378 6514774 6202162 6342009 6138923 6231931 6097143 6042347
14101 6042347 5775289 6044052 5676909 5929718 5679844 5507915 5433620 5525356 5425320 5379076
14091 5379076 5252194 5268101 5303518 5220486 4999872 5014592 4911169 4865743 4958477 4524196
14081 4524196 4725594 4851384 4403312 4793522 4576762 4573664 4655039 4572805 4438338 4407983
14071 4407983 4214282 4274209 4181834 4312566 4004460 3994889 4302527 3967962 4234062 3957513
14061 3957513 3992186 3725995 3927877 4155368 3868392 3817513 3901120 3972881 3728049 3813596
14051 3813596 3332095 3437081 3280913 3393840 3117600 3577011 3350607 3478987 3159765
14042 3159765 3403549 3327723 3142491 3213753 3133503 2994026 2953351 3181867 3311782 3290345
14032 3290345 3055498 3010076 3297464 2948073 2917265 2909399 2848391 2888893 2777598 2620403
14022 2620403 2920359 2784378 2463784 2707344 2441378 2626898 2547832 2549357 2380877 2773826
14012 2773826 2378731 2519384 2473158 2440530 2458266 2282752 2322494 2600891 2238000 2433416
14002 2433416 2220359 2061623 2195490 2072792 2239495 2062047 2185365 2101127 2039805 1965481
13992 1965481 2175791 2496725 2711932 3689895 5684925 10750360 28112129 46660356
13984 46660356 26804099 14389821 8818663 6152611 4998481 3765735 3334186 3235893
13976 3235893 3277572 2747464 2935318 2772602 2565935 3006206 2823876 2354798 2214235 2283638
13966 2283638 2400118 2155388 2121121 1934271 1756004 2245456 2219047 2247794 1994464 1947614
13956 1947614 1878362 1840639 1672344 2037584 2084107 1669013 1865943 1714680 1666369 1752925
13946 1752925 1846828 1733104 1802927 1697949 1675548 1682637 1795049 1406384 1807754 1799017 1875048
13935 1875048 1670968 1744921 1864489 1648966 1424257 1598200 1899257 1532223 1443090 1620851
13925 1620851 1491605 1401338 1349642 1475487 1447478 1568762 1883016 1460290 1608589 1370858
13915 1370858 1391708 1507903 1555836 1630356 1598910 1373796 1246563 1320642 1368532 1653042
13905 1653042 1640806 1382412 1301422 1447983 1403857 911142 1609970 1273568 1224931 1308426
13895 1308426 1602231 1283177 1260957 1298965 1021550 1401370 1142251 1337987 1344880 1267859
13885 1267859 1150382 1293696 1235747 834931 1179518 1358807 1183448 1312338 942812 813161
13875 813161 1024229 979003 1198814 1158631 1204039 1417721 1005011 1191425 1066347 1248440
13865 1248440 860569 1202327 1205800 1042140 1270440 789384 945421 1073337 929801 1198353
13855 1198353 1223320 1089536 1177489 808240 1031704 921655 492796 1046753 1079428 1123563
13845 1123563 974853 633959 1045896 965969 691581 1146975 1011647 855414 1141179 943846
13835 943846 633121 833598 1105144 856127 797422 1090305 1027496 817042 717360 1059666
13825 1059666 1009370 727734 945467 815889 1070936 527230 989721 946609 1079168 981046
13815 981046 895139 666237 1120721 836421 1072695 775917 1089357 960181 957285 804144
13805 804144 850777 1016466 873071 826506 982862 797952 728407 526688 909556 523921
13795 523921 666605 514902 694595 815182 878359 867686 898035 506790 643336 964108
13785 964108 990851 880628 696272 821202 606257 695378 612930 618093 693930 719953 769826
13774 769826 560637 385319 792885 744603 676890 912488 646564 504054 682492 583773
13764 583773 319896 698257 665841 698955 736558 392791 660998 727481 475056 433950
13754 433950 498248 513680 799457 721305 269442 655999 839954 596968 602762 317223
13744 317223 619499 594302 329826 430584 732282 715912 633950 454854 706477 287272
13733 342103 803621 393229 783489 498840 447839 651037 611362 649499 227517 415445
13723 415445 689488 691465 433045 536027 554482 451171 604688 377931 350060 278813
13713 278813 537675 606065 736653 651641 490783 658948 644956 557364 599336 411007
13703 411007 518024 576634 441273 437992 642470 936816 498560 511866 719854 180830
13692 577529 317912 449064 596861 622038 516479 579450 82040 775624 521583 338632
13682 338632 653734 380943 281026 278258 561257 497150 594680 377439 126968 525585
13672 525585 293140 282618 625411 501324 517021 443158 423383 551574 221854 651213
13662 651213 548694 177391 298079 709492 317157 360948 735286 221169 531072 504072
13652 504072 264800 515749 62347 535279 496620 592846 525073 141349 437385 500471
13642 500471 395002 370390 267272 647047 759142 192466 411438 602536 87690 669008
13632 669008 502473 386168 147919 185097 199431 270190 347991 388788 370192 -100388 610427
13620 561586 419245 561728 598791 194749 592010 493369 673367 379477 157740 572375
13610 572375 439307 286393 153617 115427 345512 508306 141546 152178 428004 495380
13600 495380 537410 272598 750186 384777 359676 395486 276233 161834 145087 590306
13590 590306 272153 387263 74895 247862 55613 260294 243586 248488 532237 316628
13580 316628 442879 350925 342444 464919 31566 261935 470286 558451 220320 373364
13570 373364 468308 174593 461255 240425 450475 570429 566488 746030 406199 380748
13560 380748 442413 309947 185297 259888 -73488 222603 637444 329846 378782 418919
13550 418919 286191 303929 270591 31099 582178 358401 165880 380034 110953 110547 454088
13539 454088 238007 447313 662144 325242 383850 342648 420236 351751 -142381 378471
13528 266982 95765 392790 147006 -6368 285594 -86938 253592 345658 320939 414799 393504
13517 393504 644236 119455 369475 -74579 328504 244946 127915 366387 634982 191304
13506 352552 69251 270139 271371 -179855 347978 180655 273689 391408 304436 356202 118084
13494 307404 149965 329848 35080 -35489 342204 550430 404229 412560 94972 357377
13484 357377 436593 219794 -3357 385619 -87734 232769 336429 541305 -77141 304830
13473 326298 282326 -26861 284108 81925 85182 134254 210586 -40392 78191 219751 520615
13462 520615 52566 140406 275164 -35605 709786 -13166 494358 -35808 220462 386493
13452 386493 -38748 211689 163788 91117 234179 100566 -5283 -57449 134239 164179 135547
13441 135547 -3007 97943 219067 400797 54666 78067 126953 -103998 174000 349390 -34172
13429 121853 -58354 189687 -11385 39306 143983 371033 328666 -61567 19564 178094 134280
13418 134280 192951 285582 77074 355048 288870 -45800 321723 105245 274508 261168 184150
13407 184150 38800 229443 106125 145944 -1609 10956 187395 1352 230913 169322 9623
13395 153198 231413 496094 58401 288014 -1747 164326 434505 55608 89654 174208 340217
13384 340217 288457 274870 493402 -1145 155774 -13400 347791 346475 292296 -84341 25093
13372 148298 560599 196422 41429 173464 68257 32541 212976 358572 88598 263400
13362 263400 89950 198247 6456 251720 152511 131849 38621 258854 53808 194540 334258
13351 334258 488038 178847 188248 279137 271159 32116 410838 266424 167064 208435 223119
13340 223119 601986 5962 128622 255401 919 -21304 -66234 458068 452633 260625 181484
13329 181484 32296 196169 332534 137835 87697 57986 178556 513302 291835 88442
13318 12455 -98598 258682 718518 317135 187243 345532 492201 121340 300084 139578
13307 -80098 315192 306580 473641 173480 77030 27789 31260 234980 268255 139022 10749
13295 380937 -171772 -4716 121314 93047 -1048 318911 171358 179365 234619 259525 -38816
13283 -101865 -193964 -168702 257119 252355 102296 353155 -69276 304518 205713 -140732 89466
13271 332467 -96690 341545 57714 56623 229087 -55365 369708 -74587 159285 63995 175401
13260 175401 -18291 336560 -103341 120078 20891 344194 -121750 240483 -172480 79478
13249 95024 -45005 48889 205837 170416 141464 251412 -50781 434852 292325 97814 21487
13237 155536 -145550 115633 99795 20344 26276 325635 -15025 -177620 30115 18028 -86019
13225 114211 229436 334610 -58101 9477 -40565 38643 -81543 49241 132671 265494 180841
13214 180841 78793 -259431 379473 397122 218799 -43236 103841 188295 13277 -154840
13203 -11081 284949 300795 20230 887 -107509 -74082 441559 -52277 80095 -67192 33007
13191 350041 125088 420024 -265485 92282 249833 97335 206631 129350 307990 270609
13181 270609 -280330 150982 285248 73732 195466 -8902 297770 56743 -75438 -94384 34537
13169 -75407 -13228 90761 -190045 128654 176291 89191 -64293 -113081 34324 -127311 16340
13157 140937 -63921 237722 43260 -403556 32443 183978 6117 -247102 33757 111635 -256394
13145 272182 -180421 -14439 164521 322469 -146287 329218 -46494 269999 91371 89774
13135 89774 63186 145817 -117721 -88601 65175 287317 115856 187339 -290617 122226 86314
13124 86314 186262 -91110 -11134 74087 227555 -151105 535968 245495 57912 236791 -29334
13112 105889 -97856 264419 264663 -22572 -79007 -237683 -80122 47399 -120802 78174 88409
13101 88409 139487 341228 257325 -330548 -108034 152071 225435 167028 -186087 -55162 -251545
13090 -251545 -178259 46224 -154076 -267102 -6554 317254 -28327 -111146 317692 72675 -29
13078 -7663 40297 117577 123730 152341 53884 -3703 35024 39914 -27678 -50975 220432 -27239
13065 115686 81793 218519 -37295 117226 245594 9785 86181 76421 622723 105205 -30258
13053 138231 100025 62436 81497 -194900 163633 -88953 85937 123457 -83109 447007 153175
13041 67523 140630 71359 14696 -127299 254675 236843 183504 50949 380048 -256684 -79528
13029 -11396 61867 -88620 -194391 432039 319058 -274711 245160 222637 405827 356682
13019 356682 21629 -105490 261704 -99284 66663 48864 -153507 -179056 -85655 -53978 109045
13007 53449 115016 225018 191524 -35604 53796 227471 203623 144562 67889 -91615 -381358
12996 -381358 -156931 -111547 231718 156388 -108542 43934 -285905 -103389 92373 -152548
12985 -261736 -88804 -97215 170007 298889 263074 -105486 402463 34643 114941 181444 37462
12973 86778 3159 320881 220058 51679 -4228 -250664 436800 180838 -161436 -187319 -27411
12961 92821 -8850 -49397 260275 43872 -76619 65888 124430 -78384 74437 12970 -140152
12949 58349 37607 36769 -95596 9090 164480 75035 -17447 -44543 192387 62767 142374 222855
12937 222855 298464 -100401 -220812 -80876 386266 15296 168855 148336 -267479 167408
12926 161520 -175567 174345 212327 149940 116512 -48750 -82245 -191201 234092 271651 140937
12915 140937 8554 -210903 140734 141812 30280 -18117 90779 10728 -107101 -15626 -31480
12904 -31480 -110185 351587 8787 -171711 134602 68046 293076 185664 78955 98603 -28590
12892 278700 223531 -131184 -39007 -97427 -300741 290305 223579 -19027 -189841 33430 -299793
12880 -69300 -93932 -187756 -108787 105248 74766 -205266 -35475 -78679 103303 -354757 -30259
12868 323561 -150685 188988 88468 -81963 355 -22604 -70539 -284519 34976 132182 75259
12857 75259 -232407 95345 75100 207177 -115841 -229369 -44888 -101110 54674 216615 -202159
12845 -115133 34071 -47919 32260 297424 -80921 303575 -67512 -157977 -278078 -17093 -69965
12834 -69965 22364 34464 7508 -1051 -232558 141824 -73813 -69912 -15559 -176373 -339664
12823 -339664 178616 230248 392490 -316008 277571 162 -128768 64531 146552 231376 -81644
12811 -405456 -124988 88839 203631 -116874 174949 -32310 -271326 -113921 34374 199057
12801 199057 314459 -57418 85978 -80814 59545 -87898 86003 35794 25300 69703 -27507
12789 142591 426554 17825 -65533 260554 -245734 -37792 -114062 -194666 12527 32737 -181657
12777 -63381 197513 19091 106871 152074 -132901 -212192 143469 -267822 -146892 -241451 147965
12765 8829 -42240 73433 -196124 -108545 -129979 260639 -371364 -49167 135911 -91147 -16306
12753 -157082 139028 -132703 -22912 -168271 -63439 -199861 64054 215826 324609 173348
12743 173348 -219342 -122000 84510 -18897 88582 82276 88501 66588 27137 -256468 183707
12731 -196948 183248 346335 -66234 -50547 -160065 -70792 -232271 97639 -60164 316821
12720 -6178 259181 -60085 -57425 -50694 122880 -77410 1427 118936 130205 -197895 -68639 310035
12707 61961 36796 190223 62901 -8708 313390 93948 110472 -10774 1483 102746 51055
12695 -168554 65267 11566 113813 103439 -166900 -205303 100172 -188235 6457 -190080 -106710
12684 -106710 -383806 142117 -29558 -388133 -20259 313019 127638 195923 77694 39426
12674 39426 26592 63954 355481 -182936 9467 171692 -12439 -10952 317109 -175120 232933
12662 197650 241852 83342 -261220 -156708 1312 418316 33982 46054 162155 -147969 2908
12650 258866 182965 9101 207381 10571 413918 364117 61551 -13609 -80314 205087 122251
12639 122251 42168 60225 77384 17822 111103 -88388 14365 61527 -116566 183637 73672
12627 80878 146104 163301 49001 31321 26506 -289169 28076 99758 146563 19722 255704
12616 255704 300738 173297 32242 25988 34309 242594 384466 150558 -375505 -188099 -103229
12605 -103229 -86427 16933 -89475 144164 149349 288571 -48432 343656 -350634 -389214 -8219
12593 102258 -22052 -252040 -16933 230180 124120 -119291 200486 -75884 -59016 -184797
12583 -184797 107090 -14194 -24417 -141812 -140139 199465 168634 168415 49522 7608 -145539
12571 -59708 -168618 -368690 57919 -191515 378360 85779 -131350 -87427 -186253 -139167 -163132
12560 -163132 -90598 -98175 -426556 319862 -185218 -160688 199485 -166918 -59907 -168987
12550 -168987 209514 110837 161344 4247 -108474 94939 57109 273834 30032 53304 -115074
12538 113182 -110369 -31748 -155005 -67978 51799 -10058 12044 -141633 -185288 -246451 84746
12526 -104403 -189987 -469485 48782 65552 -1629 -178686 -160651 -93789 -292837 -95556 32088
12514 -214849 -67702 -34976 246803 121210 275856 51048 22005 128396 212693 -40496 -24006
12503 -24006 95901 123553 -197930 342234 -10084 -56831 161553 456262 131615 5405 -105135
12491 20720 -57065 -39805 -134519 -124609 -171059 -190672 -276260 25569 -56624 -54936 236047 -400165
12478 -296769 -152056 305719 -12996 181935 184395 -60700 220368 -240801 -2725 18641 -56782
12466 -246016 10324 -69234 -241002 -271402 113944 173556 -153321 189268 80105 -120119
12455 185189 -497216 -226933 128486 -730 -220172 -63860 490066 41112 195627 81970 157835
12444 157835 234896 -62481 6141 -30955 -225916 -116395 5540 166705 250048 -8679 -100530
12433 -100530 -176448 73372 -230143 -84810 68673 -141043 76104 -26551 -151835 160008 -419039
12421 -212297 -131053 111616 -102450 7723 105534 56456 -68726 -183458 -182938 24550 123330
12410 123330 -124992 -9647 49743 30646 218037 -78601 145630 -8603 -118928 -280950 37789
12398 -121970 307290 281142 -55324 302452 -188154 -106336 349827 -52476 143410 -190311
12387 67641 457683 -96544 198686 113015 -167480 -25590 -16640 131439 165440 251669 93232
12375 97428 247157 -10750 -26240 -76555 130123 156592 -47865 79159 -36109 -206051 -498369
12364 -498369 234966 -179639 112277 -366947 94338 -208656 88383 52107 -44358 119621
12353 12250 -247483 143767 266410 -320015 190164 294026 440994 74837 -58709 -18310
12342 -1081 53424 208173 137739 -112924 218478 130144 253189 76677 -132615 -71473 -93231
12331 -93231 -132252 163710 327007 442777 290338 268675 43482 125055 346737 379050 56183
12319 269117 24799 233641 95806 214425 179046 409331 23371 32442 126006 375744 -172676
12307 -200183 -333589 45155 35764 251423 132249 106737 -81266 -171821 256227 -176345 140569
12295 -92193 391687 393347 230374 211255 -3592 -203783 345185 139917 -73692 51432 10593
12283 164272 86812 89125 -86730 27140 264322 126072 244671 77602 -15667 299703 280578
12272 280578 60320 418985 35634 -192225 -133835 491869 109127 10604 286873 11709
12261 -149871 172930 316488 65977 -47686 407720 135618 5900 86237 496927 -42003 -201107
12250 -201107 308883 199185 324925 485214 60307 257410 48169 142520 -63984 457208
12239 317150 46174 285542 -163614 191439 80296 73174 73094 273541 114337 128302 -295376
12227 -77083 -128075 -101992 58751 140147 363221 -66696 376312 451093 219540 312398 234067
12216 234067 -28404 -87675 198922 325834 221310 98019 131410 253686 481006 248612
12206 248612 64818 114110 95734 119383 46661 188023 185600 237752 -135100 122555 -33566
12194 212933 186849 326070 18826 754663 530971 218075 183930 363770 116332 497648
12184 497648 150246 96802 162914 -4157 231812 309852 -57584 379242 195673 87019 146432
12173 146432 -72095 316672 232263 143967 113460 163303 481083 400617 480137 21349 117859
12162 117859 255454 258358 -214105 74959 -17503 -14336 200539 1642 -346071 263260 320254
12151 320254 -49651 133755 -137509 -89217 198098 78100 -2780 91598 78217 -4876 204406
12139 -71047 16653 184896 -121995 218440 318589 77402 6413 213156 228236 369381 109026
12127 32710 195581 114707 98636 -176479 405971 203618 -78497 450453 300789 217563
12117 217563 159730 138019 -102964 172803 36244 -7949 53769 279483 -70905 62595 -44396
12105 194382 -120321 127335 185160 203392 458150 63615 426131 282621 263665 -171155
12094 -33142 -71345 68554 3636 -139967 480083 337572 134746 193110 361298 159226 -67057
12082 74722 202469 155360 23085 194899 33877 81863 76609 157099 -1004 -84483 84949 447457
12070 447457 29602 359205 -122096 -142116 19314 75473 -15778 114006 209976 36096 194809
12059 194809 241894 160301 -11898 337574 134534 85864 -23267 345904 232549 -180287
12048 38508 -240384 98198 -184231 -107483 -294475 -116785 270814 28391 -146779 -190354
12038 -190354 -89260 -26722 76579 79233 -112197 -126944 19417 216740 -153448 90639 15834
12026 38055 175698 -183605 -279840 260416 122973 282660 -158452 -145892 23799 151358
12016 151358 372383 -133141 348428 142278 -36864 -105644 -26428 111016 163119 42892
12005 23291 2733 -1987 66713 239269 273030 149503 -181023 29856 -247199 72193 -73813
11993 -101010 -207878 193494 -136590 -187021 -70118 -278100 -36400 -38402 -105222 -60579 103951
11981 124185 -330864 116299 24501 124277 -276649 -166151 129618 258152 213846 -190230
11970 238579 -41780 420615 89902 234461 -22327 -70640 8802 50884 -88452 142 -120075
11958 -141493 4848 -370128 131079 151384 -211669 -68235 -356116 27379 -280801 55608 84218
11947 84218 142880 -1709 150686 -107603 -43149 92804 -183714 -107847 178989 266885 -236160
11935 15989 -12395 -47380 7482 -141066 125980 87099 -154626 -56834 -178911 172319 98200
11924 98200 69883 188445 -144641 -13850 -109583 46841 18601 -181629 -240307 -54849 155239
11912 268708 -119103 19895 -130948 -150593 118736 173779 -64958 -300211 49008 85554 280857
11901 280857 -108773 -27876 14675 -427813 -98596 134687 40556 -471599 -46919 55774 78779
11890 78779 185721 218328 -97781 -96790 24686 75630 218821 110546 -234964 70614 -15056
11878 -91049 321036 -142616 12046 -126089 141269 241608 126907 23483 -168614 -39765
11867 -198248 -260079 -141389 -112710 -167138 -255043 13014 -108562 -15045 -27142 -12265 -122343
11856 -122343 -84679 37884 -22952 245297 -58958 -191992 -308395 113707 -60698 -68234 126242
11844 306796 -179265 -249453 -29511 265742 -186172 185557 -100691 -29448 63218 40222
11834 40222 -177493 -104891 -264367 50638 79020 -245347 -47549 -288179 110604 147540 -236180
11822 50842 -295207 -30102 -80548 -140588 -434284 -133770 6082 162686 -119620 -42036 -310883
11811 -310883 -109520 83304 221620 1226 46064 225343 179539 -207559 117444 -462621
11800 -33885 206734 -52881 -69699 122860 -324459 -351858 -204234 91944 -174401 -43354 -21607
11788 -117858 36017 -15943 21492 -210948 -14528 98944 -172546 -116873 -16739 16715 -155952
11776 112117 451493 128267 197058 -240238 -223136 79181 31168 283896 -22335 -112922 -30603
11764 -49361 105408 -5765 25237 -251615 -39002 174602 -37927 -156167 -266856 -354141 -153763
11752 112396 -56922 155868 131834 -159409 33583 99803 34319 27366 5421 1495 -149221
11740 -174257 -95523 92191 87832 -15020 134845 -58397 -289387 76392 350492 -314777 21876
11728 165204 -247692 -80077 -137631 241129 -480 102851 -113025 -25259 -322731 -4783 -121853
11717 -121853 -94359 274202 -198804 34912 -27403 -143851 -282442 3521 -44046 -125392 206775
11705 35291 -192076 -60731 113222 -15881 283267 17758 163929 -34784 -154694 142166
11694 -111991 -103687 107590 -56571 85994 25168 237568 -3123 -261754 -1787 99369 -126628
11682 -223827 174781 35263 108342 476172 258433 -15707 94704 241798 24143 -231256
11671 -51936 -26439 334605 -133989 -222260 -71843 -150273 -77647 -82055 -216374 -327508 -56796
11659 204434 304659 208206 -67409 128023 -26315 80748 345406 -81094 470 -144767 -11877
11647 86826 270954 266439 3563 107299 -44746 -39091 -125683 93007 49502 -34290 -40440 -252803
11635 -252803 181312 119223 -50774 -120190 162765 199839 134267 36219 -72903 -16980 317310
11623 -240277 133910 -71925 -328078 260805 80746 245922 134632 97640 -101401 -169 92980
11611 -95666 155537 78520 307730 29953 65352 -257149 -346679 112501 -212144 11251 163888
11600 163888 -17260 48690 -134617 150495 321814 241168 110537 281753 80678 -125893
11589 101149 72066 -42780 226014 301162 32941 103345 395232 -9578 154696 246689 166880
11578 166880 140994 36839 476197 -12546 126904 -8311 -23131 101471 -148966 -36315 -21616
11567 -21616 -57664 7664 -155223 -235404 112018 242875 42804 -111015 -96681 368061 252424
11556 252424 -94482 236932 129546 328316 64639 -49832 168725 -201468 93899 2539 171291
11545 171291 44872 -41910 -71882 114886 -123221 179736 -45299 -102665 117190 205953 287119
11534 287119 395464 233028 186214 14856 63303 286459 78052 33394 -103055 -115347 229330
11522 -243951 -75449 124303 -115544 -192694 177807 223047 -130184 105115 157611 -275086
11511 204806 -218501 77867 81550 176117 -55796 231776 227595 130843 205743 114492 5598 127673
11499 127673 80685 226429 82690 321420 -139748 118499 -24122 210994 125501 35411
11488 190049 -66523 154759 -73977 103260 403273 269709 -304699 -248453 257063 79091
11477 321434 -103540 58183 76517 118142 181260 341252 196707 155420 100381 216183 -41777
11465 -32284 426826 99509 63886 60042 499427 -108006 -64187 80974 -71599 -28263 -21043
11454 -21043 120319 217986 -114615 108801 -214015 74631 36697 334243 -76867 113812
11443 157943 -222669 -3193 160351 256522 229365 25756 247881 31756 -353188 104758 57123
11432 57123 149453 260819 253838 23595 45247 44948 56707 204269 97617 165263 -88530 -117255
11420 -117255 35427 196448 -74 11352 147437 -41757 100653 -182654 -480022 -131405 -7590
11408 -152985 -98858 199667 39994 -35580 87146 -29704 28551 -64562 -106539 127803 62960
11396 -163012 -131455 -11435 -253261 294536 65588 -115376 233752 -92068 -212946 -229916
11386 -229916 103023 -5853 -18408 92812 -137046 -69631 109230 -132656 -121335 279497 -153494
11374 91820 -206891 339653 255261 -304149 510335 -370158 275758 163602 -38545 -95151
11364 -95151 2731 -149499 -195827 -278731 54364 62110 -74623 -132693 -256796 -18673 -165622
11353 -165622 18365 -66498 138718 -267087 73867 112286 -114279 206181 -368415 -108798
11342 -248711 -10559 -134792 -203153 -44211 120761 41602 169432 -225006 -185189 205007
11331 -68948 366320 209414 -198237 141895 -147730 -206915 -16281 22494 -67458 154253
11320 168914 115632 -196145 213912 69892 -327842 210332 -253218 124121 68609 -81401
11309 95928 -206825 1040 -191886 -44410 -249711 65780 50881 -183824 44729 48576 -243686
11297 -216749 168648 -172613 24410 -9725 81505 125361 -89705 -134834 -194834 -346301 -31163
11285 -120799 -238113 -258176 -46761 -411079 83289 148741 140335 77251 36038 -374561 -250183
11274 -250183 -227037 -17450 152419 -252609 173580 161754 -338290 6997 93049 93819 106554
11263 106554 166226 -262303 67942 82639 61744 -50942 -164738 -264749 193350 48112 -25178
11251 -283374 -264774 -59575 -68268 -36133 133162 40864 65666 144652 173130 -148674 169425
11239 -135781 175573 147767 229101 59500 -175137 -376741 111041 -120388 141492 -83499
11228 -41273 -97321 70293 -59700 -26489 -21081 -45463 -159370 104493 17537 -28526 -12655
11216 109196 -276346 -188315 -74769 37561 29988 -146179 130101 87650 109770 -413634 -249918
11205 -249918 -20776 -148269 -13159 -212425 -291327 -252660 -153338 -66134 -34191 18422 -184986
11193 6803 351891 -377965 120290 -48700 -182820 130015 -103807 -2809 -288233 165202
11182 36144 -236249 -400314 -15910 448 -406375 12859 9322 -68016 -262064 49999 -130629
11170 87301 -99768 -53525 -44143 24709 27624 47883 289125 -111561 -95982 61242 157592 -289402
11157 -40909 15239 -16693 -169663 29622 -187096 64169 -200126 235328 304 -11899 -349617
11146 -349617 -48764 -173056 -114578 -158489 -50344 -272596 -236696 121400 164800 67919 214257
11135 214257 41846 160805 21501 -5572 339593 89759 -26040 14457 60594 -91411 99554
11123 195468 95837 -17123 -2847 180837 -135411 38631 116832 -268782 372741 -42475 122110
11111 -13582 291807 127966 -101027 -173236 -66627 -116098 193402 -107152 127432 -47152
11100 202957 16965 8140 -82126 207378 -113167 354380 215106 282668 -67813 172550 -100469
11088 109677 286210 115615 -208976 287148 324594 379238 90875 168843 333561 123466
11077 -169113 -69973 384853 80582 104387 -66422 34872 59214 317865 165383 331249 646467
11066 646467 341162 341754 270887 596886 210053 361172 510729 513632 489111 101237 526239
11055 526239 333604 381164 284398 519855 602165 428986 662189 356720 409088 567203
11045 567203 494913 999762 728608 835782 652448 815647 609183 753644 812472 929156
11035 929156 636770 830652 663389 440973 738799 530022 418195 428118 646765 617881
11025 617881 496585 911843 658603 602718 405958 703498 373386 345847 580130 690880
11015 690880 610194 555608 421425 970455 208872 610703 697047 1022406 1077348 296030
11004 713514 227599 465212 404868 666155 742388 556167 608367 618107 569654 476277 928868
10993 928868 606845 349022 324327 636079 473599 694646 765332 910733 337849 884591
10983 884591 986950 794108 1301927 1035757 1011733 1189712 1052444 1103786 1377025 1410940
10973 1410940 1240945 1756270 2318227 2568046 2609316 2313080 2554568 2340152 2320189 2131498
10963 2131498 2101416 1843909 1998488 1632818 1474363 1654507 1285954 1815446 1639262 1788631
10953 1788631 1461014 1615496 1558635 1589443 1398419 940598 1112319 844156 869707 477280
10943 477280 917087 377921 878822 448291 122035 -145058 334857 -96950 123837 110374
10933 110374 333443 442491 -139572 -1061 -24148 -115442 -236858 -42491 50356 25477 171668
10922 171668 -77971 28425 -230182 -126530 -235495 79111 -145699 -206855 -173615 155261
10911 -125542 248360 101687 93241 355627 -102616 26936 -41647 -77381 -68442 30054 309190
10900 309190 -10669 2752 173612 -394355 17508 -980 -352199 193296 40333 -242028 -197985
10889 -197985 -283720 95446 274926 -160831 -234064 258983 -95764 -224011 -324936 -2383 348608
10877 -227327 -148526 -139814 -152186 210765 -159571 -150353 91458 314337 -132887 -340213 -41600
10865 -35483 -164803 -246956 -356942 -116663 60120 116167 -283639 -309228 -302938 95934 43508
10853 243375 256835 18757 -2275 91957 -32117 61926 -43810 -83237 13937 -562471 -32856
10841 -3988 -200927 -69005 -124464 -82073 77806 -203899 33733 -35624 -130501 80824 15044
10829 277764 -35895 20690 -75036 39508 262511 -105188 232083 -80122 -104939 -109828 -18571
10817 -183529 -96852 -107997 -79133 103655 -92425 -166058 6425 31815 -41028 -186182 -220431
10806 -220431 -324896 191647 -100831 47678 231389 -19629 -236278 43796 -73253 97382
10795 52966 114941 -39779 7331 -343621 91479 91188 125723 -194974 -267706 -82600 374277 -370974
10782 -115193 -287318 -149013 -173736 -15441 -213516 -656802 -67299 57506 -78416 -26096 41532
10770 -84691 -183438 118334 188950 190109 -41336 -183851 -37246 -168480 -92181 -241996 -20707
10758 97926 84790 69144 -31511 -426697 -154134 -117790 -195979 -94 99733 -218949 122893
10746 -105173 13038 442680 191816 168213 -210352 88342 -116539 -247476 -183112 106885
10735 -228980 -183099 53809 58897 -44478 -55722 -154209 -41426 -2344 331735 -149394 -52663
10723 93832 68548 -291656 -51818 265437 -145526 2407 -259520 -36225 -327576 -26124 35384
10711 222791 -95026 -30717 -52240 -164995 -150176 -129363 -237758 -74156 330141 -115758 110832
10699 67350 -44714 27883 94717 -55644 -43996 -113303 -279606 -24039 -69385 102885 -216321
10687 -34208 -116464 -97553 201054 -108063 216701 -94478 -358259 -91339 32257 229147 -112598
10675 128442 -16956 -88102 -341000 63843 85634 -63846 -89580 270156 33094 -28900 -174698
10664 -174698 222322 -182015 -35314 -48928 54860 58257 -114781 -10238 -114264 130688 31212
10652 -138583 -88673 55180 -100656 172248 138700 -74552 62748 -65179 252238 16393 -21216
10640 -161156 -469150 229621 -195554 -58742 -32529 -96665 -153963 70489 -49374 -8735 246772
10628 -200529 81396 17588 -170762 71948 25237 -42585 34886 104525 79205 -11074 -99024
10617 -99024 353967 114936 19187 -106374 -46573 154681 -213851 -23401 152031 185732
10607 185732 -142414 -209873 369376 -363675 -159748 213506 215826 -115365 -121980 -199939 23053
10595 2029 187020 -54196 -244836 -184997 -201473 -158814 232135 -104354 -104557 -178624 58668
10583 -56382 -248644 126694 -39996 -161421 5005 -114562 -5770 -293268 -247226 130467 -325471
10571 433177 124067 -179505 -149189 -139348 -29075 -61551 99106 -253516 110251 -138274 -161602
10560 -161602 181354 -465645 -235360 -115144 143685 21450 146840 -156847 4188 47284
10550 47284 78494 -103177 22290 15114 150459 5017 157755 98758 -107351 -31238 102152
10538 -16208 -49723 220023 72094 -401518 144707 -9734 -312102 -178419 -423870 -134768
10527 19813 -67050 -267407 -372712 -175332 196043 218731 -462074 -296603 117980 -167913
10516 191579 -159071 -209303 -2051 207473 -279108 -277503 125615 -133018 -70827 41705 -65827
10504 -347014 -151646 -132645 -104184 7445 -175272 -414747 282579 -89976 -84247 -391200 241008
10492 184336 31512 -91130 -82235 124495 -184021 360735 -104406 170441 123084 -24580 471513
10480 120753 -185100 -232787 447657 406088 220686 582115 419955 543361 143935 438845
10470 438845 357114 214788 169048 -207387 160750 194927 142627 -155279 10885 68720 312945
10459 312945 130015 -538399 30333 -121470 56184 -88080 -137913 -145872 -286312 98480 -295440
10447 -453387 210769 -186939 -219504 -338107 -308822 -42153 -204763 -198570 -324040 307073
10436 30434 46384 -137505 -398657 -275686 -23200 42964 174996 -219555 260522 238389
10426 238389 -30156 238634 -16552 -266239 10198 -40798 216300 124143 -127126 -124839 -46305
10414 -33683 78719 70923 -64400 -94645 30988 112574 -254834 126641 -9534 -94342 -327821
10403 -327821 127853 -274011 -8594 366638 -266049 33474 150304 -67285 -14599 -111561 -177480
10392 -177480 -3788 279344 332045 16149 -70626 78996 85975 -324276 131235 -301303 -136903
10380 -170725 44834 14177 104340 67531 181846 -79155 444760 174969 721 54734 78089
10369 78089 112783 111730 312100 385752 72287 302037 504043 45831 137082 327385 441167
10358 441167 221318 849 -48081 -59992 56712 105849 78522 23131 409906 440764 327401
10347 327401 129395 235970 410254 128375 427126 456911 374884 528696 -26209 90685
10336 385455 295776 323710 211857 245716 105070 -45805 -74220 -377836 -137581 302468
10325 32203 50920 326094 266213 87137 -94448 161301 277630 308938 49651 318346 -202580
10313 180503 341439 -173999 -120699 4965 -281824 274643 102043 38938 11044 80866 -132534
10301 192599 28704 60155 -92030 26397 -252750 -15669 -210212 -136877 222178 41502 -66770
10289 -168698 -65899 217549 -98172 47590 -51002 -135774 29474 -44435 -13676 -366496 59691
10277 -272889 -238742 126496 -285044 -51952 21076 15341 -84246 142117 192884 -34157 -248782
10266 -248782 -164824 -51349 -15988 340813 -404877 134735 128845 275936 -224322 -17777 68147
10254 303803 427799 292597 103827 217365 152531 98535 -52365 328845 -261716 88447
10243 105629 103350 67871 -87354 208506 40067 65618 -29157 -339755 -333363 -97390 12743
10231 10171 -67728 7689 -87052 -18121 -83626 -273878 154424 -87294 284329 -22993 -89273
10220 -89273 -259939 108711 -212316 128099 -181620 53290 11774 182380 -106681 17855
10209 -338168 79230 -90152 -230562 -35199 -158489 -178093 -218415 184390 199060 109344 -142168
10197 12442 199862 -88196 -248999 -37596 87171 -203788 65883 -240488 -133674 -333448
10187 -333448 -247506 -244144 -193023 -202299 20932 122800 -57401 160587 254319 316673 -72079
10175 -17925 -208665 -71424 -109838 -10796 104330 -110607 -464602 153560 -88345 201505
10164 48104 -194666 63083 64032 -263457 -67515 -202112 -109812 70457 12372 -83738 -195423
10153 -195423 -176030 -320500 2162 -130394 -41633 -124758 -97610 -183998 320615 11762 -290588
10141 -23303 -33970 37564 -29745 -144452 59199 -73586 -149034 6296 -24472 129580 -421582
10129 71103 488461 -47179 -269834 -275380 54555 216450 8420 -100160 7241 -50241 183494
10117 -286318 -325193 197795 117032 -71424 -127823 -265709 -109980 19299 23901 -148351 174829
10105 405799 6549 -431349 -76577 152824 -82064 -188963 78572 9042 79311 -68508 132740
10093 -97281 -255003 -34128 85539 -205634 -232860 -7404 6498 -120164 -145518 -32423 79442
10081 193524 470466 -106886 61652 5737 -239551 -318448 -104699 -122854 -288388 15415 80376
10070 80376 210720 903 -111522 22615 -271315 -84642 -400175 -137495 93132 140644 182048
10059 182048 118954 118949 -73237 75310 -100636 143656 -149457 85907 17474 -297534 -43303
10047 -296702 -355188 -494355 -110035 -149358 -74984 -329324 211350 -169679 -83428 75483
10036 35072 173294 47124 -198297 -48365 -217474 -37636 -16521 -349748 -235879 324294
10025 11584 -180995 -90266 -89950 -168050 66532 -184101 -86857 -4604 -9429 368542 -117210 -81578
10013 -81578 3683 -168064 -25581 -209971 202949 56589 145381 172903 -262062 -70933 117808
10001 152630 -73955 -93979 54228 -35359 119903 -88381 -352812 372726 399097 432578 -68550
9989 83960 30480 -20450 -180208 -461461 -191027 148484 -22977 40750 -235719 -96289 -352790
9978 -352790 -332043 -139570 15782 -119954 156873 -112860 -111816 126366 -41713 217719 -57545
9966 -172009 -365470 -289719 281751 1654 -186124 -256151 -86479 -139321 103510 -91980 -14971
9954 -27435 -90 -59168 110752 131403 -71430 3944 -438978 -142908 2430 -229003 4710 51812
9942 51812 -110974 -122902 -398371 101181 -56367 -4155 -220357 -162762 -23284 -220251 -145849
9931 -145849 -61955 -92584 69448 -465250 -233422 245289 -84451 -113814 262786 -135363 19906
9919 -109850 -223616 -227109 79682 133269 240313 144987 4920 197924 54322 119363 -65055
9907 -101054 -157128 -530276 -424543 -250450 -352873 112419 122628 183973 196239 -172923
9896 -221106 -88620 -126245 565 -448505 -139684 -145649 79911 238426 -56355 -409849 72967
9884 -140632 222060 -34948 -414894 -280184 258984 151972 -175876 -219803 -176011 -232070
9874 -232070 -261557 -77163 -63877 -34493 -103918 105392 -8639 -153547 -116060 -16576 -340804
9863 -340804 -14560 275741 97712 204777 -283914 77865 -337019 -108848 97069 78523 -280610
9851 8889 -310314 -16938 32486 -117205 355199 -239661 193738 62180 56267 5214 -73176
9839 -112845 -229810 -118679 -11607 -9463 -99697 -254194 -119884 -5881 -143173 126538 -60863
9827 162551 74520 -15366 40372 16788 228272 -148799 -84858 -208427 -126685 -28957 41902
9815 -341547 119958 128877 -308142 -429635 -170922 258 -150885 127939 -53077 72431 -173111
9803 100638 -153420 -155201 -112938 16070 -64630 282243 -334945 -64473 87707 428570 -48222
9791 81669 -92926 -49735 -115680 154669 -311049 -198457 135110 250293 -47331 53659 -65560
9779 56817 -28437 -12075 137085 -314805 -89427 -199612 -160907 -4104 -138403 -133294 -346477
9768 -346477 -323713 -123675 168824 -116360 -355180 -256621 389790 156993 -33613 -267317
9758 -267317 -288761 -105588 -37609 -150726 13643 -153731 -198601 -155313 149324 -251041 -107340
9746 -93983 171003 -74949 -152331 -58485 -29412 -59292 51500 -215488 155042 80406 55781
9735 55781 165409 7275 122195 -130614 -69128 27076 67843 -94798 57646 -85847 -264206
9724 -264206 -52408 -442701 -107526 -118888 126650 -118060 14946 140321 -241983 -326175
9714 -326175 -183952 261078 -56095 80846 -58463 -153061 -46406 186498 -246664 -79605 161151
9702 -243583 13746 -35596 42391 24721 156314 244028 129919 125128 -155865 -40750 79165
9690 -95145 76568 82174 49668 -149076 329905 4997 -353978 -252894 -105796 -6045 6454 -150163
9677 20831 65725 -188267 -130899 -31263 -73826 -56016 -112000 -50229 -203826 -103467 -35097
9665 73826 237595 -204644 55030 17261 -125191 145673 -117375 -255548 -273803 145936
9654 45580 -219576 -86178 97688 -285402 -192503 -390546 -399442 -263740 -64509 -288444 -140420
9642 -287524 -14160 -138053 -178646 112139 -158636 -48123 -128188 73171 -215880 -211452 -29478
9630 -131040 -190588 -150345 -24938 -120917 163923 -54139 -99783 -183658 -278402 -22511 -185505
9619 -185505 -408560 23997 151371 107071 9785 -253164 207244 -186416 -147477 -109381 -102063
9608 -102063 -200380 -34581 288173 -101922 174045 74801 -239381 -97122 -83759 -77354 -199357
9597 -199357 -103413 -205663 105591 -96450 193301 148508 79932 70460 -9882 53859 -281644
9585 -505310 -150339 84238 -20739 102483 -265564 -125877 292031 -75956 228203 -141889
9574 -335454 -71862 -176323 255862 262316 -420026 -40156 439368 133626 75373 -145365 109912
9562 -149362 9689 -302227 -81599 -90930 -185773 79458 277427 -117108 -10652 144843 19803
9550 178041 94211 -66330 -27627 170197 -196691 -166233 -115177 -203176 -398965 67689 -82225
9538 -231183 212669 -43287 83259 -51183 95866 -374295 -275808 -44770 -142441 -88180 -48117
9527 -48117 -7264 150444 -193348 -50044 15119 -198484 -134914 -353540 226041 -214479 -44961
9515 -22240 72563 202049 199618 -221485 94495 60370 -186429 16336 -106688 -224135 114310
9503 -392838 -259422 -231165 -105957 -208659 111651 227971 -157885 -199863 -174297 10140
9492 -56133 -502745 -14792 -220858 -68665 -321366 -86968 63626 14245 -41517 -460493 -59915
9480 -60394 64329 -402450 -250079 93365 74240 105320 677 10619 -53933 -207916 -364252 -10596
9467 -158744 -31149 88422 -314459 6482 -14122 -125875 -199136 164391 103110 -60631 -10789
9455 -138004 157420 238765 -200014 -21188 -19008 -561831 129760 -108903 -190210 -175094 -13113
9443 188402 -501052 -47540 -151841 -313992 117616 215798 28382 -298476 -236571 32928 130142
9432 130142 64471 170924 -282839 -14640 -36548 -127437 242073 -243870 -91301 -6128 -34857
9421 -34857 175106 -241807 -330744 -62387 131118 -67277 -288506 145877 -17088 254487 11606
9409 -103472 -29026 -258503 234732 164476 -488908 204380 -52384 -110855 161243 -49412 218200
9397 -138010 112347 -249708 192170 -72791 -163313 19084 -217535 -287470 24213 -172509 -88701
9386 -88701 -111435 -503068 69140 228700 16166 -269403 303557 -298937 39184 2071 106653
9375 106653 -192896 -110078 -22252 20555 87604 -254455 -156369 95810 49926 -26219 40067
9363 -47589 -62660 -19550 -33230 -186426 12789 42582 -78845 -298724 103996 24993 48243
9352 48243 81369 -157227 32827 7778 148998 -114647 56142 80773 -119741 41917 55815
9341 55815 133094 -185769 -7404 -237094 -44184 -224617 20899 69260 -73842 72167 24699
9329 147652 -184266 59349 -247283 -177307 -22619 58074 -88719 -87536 353758 -110346 -143237
9318 -143237 -98419 16695 -31077 -154590 -153561 221658 -19700 -111572 -107256 -131826 73536 -340501
9305 -96830 135272 152034 -342496 116359 -157807 -117047 -59642 -197179 -264 -268799 -124441
9293 108964 -317770 -285895 135594 -296107 -16634 -347335 -151970 -211709 -256356 313450
9282 -146226 49586 -96829 48704 -222693 -150351 -22991 134529 -442193 -165555 -142511 -33936
9270 -211296 -153652 99570 -66875 106301 -90454 -158461 15761 115454 70350 -404397 301492
9258 -70485 -155954 208948 239564 184408 -183624 -17356 -140346 -148256 273629 -12285 141847
9246 -39488 -143924 -194222 -408815 -41468 -30317 -227919 -25726 66603 -126185 -26990 -33832
9235 -33832 -155345 -196772 13883 -8925 153447 -307225 193842 -64628 117583 405124 -321063
9223 -224025 -128064 9833 -425571 -209210 -435778 -109374 108893 -71248 -477 97907 -344633
9211 -339418 -52216 264477 -250659 -206726 -125637 -73886 -55316 30969 -267439 -142573 -323277
9200 -323277 -83043 -40741 245054 363904 -72720 143404 -19051 -305849 -345568 96053 -122518
9188 -372093 4156 147353 -51055 168361 -304468 -7818 -113040 -87617 6648 -203973 -8122
9176 -63920 -126275 226933 -105132 -44466 58341 -376492 111822 84969 -75998 19048 -134970
9164 304196 -3756 -362651 92261 -52045 -64980 -132358 -423710 350012 30644 -126437 158182
9152 126533 270830 132559 -77104 115091 118352 -302145 -173895 -139296 -494345 132094
9141 -259694 41601 -144218 43138 -200252 -371613 -216383 -38426 76086 121864 -88228 306862
9129 -121050 110655 292554 222627 239666 27372 -167807 186077 185075 11202 -5285 -107166
9118 -107166 -84612 -58931 148212 17165 -30304 -259199 268966 -41915 305375 144868 -359883
9106 -103040 -71299 -30058 -327614 30633 40946 -12051 -293088 -137614 170835 92618 44613
9094 271819 -155985 -126274 -75505 -131232 -127404 -35783 -26534 -126800 -285490 -41188 -313124
9083 -313124 -64760 152978 74836 80647 -169616 -148163 -23545 -260776 -50500 -167611 -33776
9071 -203475 -269036 -53051 -424907 -169106 -362917 151245 21877 -186159 -245228 -286271 -113132
9059 -167913 -344328 278446 -139228 -5630 69311 -141553 -241285 -224820 198384 265122 -37610
9047 -47197 -41158 193379 171016 -22256 -48939 -142800 -14729 -407322 -38938 -209360 -123888
9036 -123888 33454 56219 121785 -80061 -510563 -82021 -137008 -142078 92134 136588 -13184 -239498
9024 -239498 -90173 -63390 86008 65187 -87851 -349532 132372 -1372 -27980 319160 42682
9012 100659 61655 -9810 -191613 -47166 -374192 -119152 -71439 249975 -187185 -247172 -76355
9000 -88856 -33724 -249716 -102740 66468 1478 -188308 103548 -115836 -48317 -47966 142722
8988 94572 -103881 95815 -196526 -64320 -396868 -33072 -142544 -174026 -465422 -352438 -228116
8977 -228116 -94771 82440 -452450 104930 -161683 48524 -257361 -450269 -85066 -81930 -166673
8966 -166673 114507 -199363 -171920 -132957 -237671 63936 370163 -135534 -64455 -118370 -249104
8955 -249104 285144 -33157 -23850 -287357 -15469 -223031 -4031 -301114 -272791 -55717 27911
8943 58551 129859 -36251 267411 62284 112570 127124 -15509 -386440 -129560 157709 -66928
8931 412847 -10061 59238 -64908 245123 64844 -87255 20666 295488 349748 756044 1205650
8920 1205650 4747421 13197474 4604926 1987776 578092 355474 401111 375413 193062
8911 193062 -417387 186126 -67376 -321 -98865 275331 231615 -129555 -511 -17622 220948
8899 26945 -55529 42513 -94344 -366322 90900 84933 -210232 -222103 7900 -220984 58263 -137482
8886 -112672 -342095 -57787 -7625 -9203 -246705 -69227 -226832 -109721 -47881 -50774 465013
8874 -6727 258088 -190156 -108617 61767 -66529 -65099 325 294104 52589 -34385 -60938 -55762
8862 -55762 -234327 -12294 -217664 189476 -17785 -99298 53561 87163 180130 345808 232911
8851 232911 -126064 -174597 57320 80380 -316645 31145 -243144 88107 -285095 -53679 -108543
8840 -108543 -129816 -29395 216757 -290246 43336 -50342 -129890 -80528 41505 -84590 104169
8828 125712 58370 -57106 -114845 -97697 -95242 74908 -150403 -248971 157754 42255 -296115
8816 165791 -211092 26817 125876 -148076 -213289 27133 254005 -84015 -236335 -309627 -183323
8805 -183323 5752 64725 -26668 -226213 42662 11864 17559 123650 -186962 -124146 -168911
8794 -168911 -362029 -10290 -220842 -23859 -42541 162278 -147612 104095 107917 119971 -272474
8782 -30363 -139001 -219888 -89475 -173423 -49616 -161946 29513 -209926 -145815 -122930 55149
8770 83101 337889 -210879 7287 -168980 -13607 -241246 126136 -243744 156140 -86740 -254451
8759 -254451 -201844 -81988 -79799 13048 -7688 183248 -82616 51105 -207600 -247867 141209
8747 -122121 214939 -42610 -100815 267225 243646 -89334 -25869 -223916 -249423 -135899 -16332
8735 48472 16096 -16626 121874 18892 283942 -125833 79898 -207677 111571 12213 1485
8723 154161 -103851 -121221 -60145 -20519 -64723 24673 -84296 -114852 -91757 -201130 27790
8711 120388 -196232 -228578 -302977 25633 -202529 108332 252182 -58732 -100898 -110736 -291191
8700 -291191 -294491 -47433 -276201 260876 -4422 255452 -222838 192535 -247294 -317978 -33258
8688 -180644 -36384 -186379 -73174 177753 137077 -88964 -52856 -209244 -27638 -31354 -340992
8677 -340992 -53486 -55369 -61484 -182981 -262021 -368471 115725 -170851 54631 -218302 178562
8665 68596 -185343 -125258 -343723 20730 10828 48166 33359 -241743 119165 -183321 -345817
8654 -345817 -23147 86898 180725 -210415 220017 287733 143730 -294655 75402 -193189 85960
8642 -72686 -144518 39067 -179604 -317577 -100726 48250 -34490 -143293 117764 -187262 -3997
8630 -230827 3856 60532 62058 169838 -288973 -86590 136767 -78470 -57871 254190 -106256
8618 317961 -234040 9146 -260578 115800 -170400 -200913 -186465 -70208 -158200 61233 -36621
8606 -145340 -446595 168310 59552 52513 62022 56549 -104386 -115129 182156 62024 -125571
8594 6274 -297020 -115613 -82208 -151726 -99564 -133552 -189826 -176273 -49283 -387690 -2422 -160737
8582 -160737 164948 -144391 156758 -252065 -248752 -17582 68986 23136 -90631 -191661 -22947
8570 -179756 39603 198325 -171865 44213 -96928 -220848 -73683 408374 -4014 -198348 26471
8558 31734 319626 -239521 -75150 -13750 82406 -100117 -22103 -121027 45740 -44037 45012
8546 254565 148093 -40155 -190071 302709 -402105 327188 101866 -163600 -119589 3063
8535 -46476 23942 28623 -96570 59939 -141743 88496 81392 68343 -136733 -66163 217266 -121292
8522 -110896 -112777 -245981 -315633 12910 -137304 296869 -279994 228251 185783 60475 -189182
8510 -58332 -69907 -57114 -270551 -273611 18176 -11932 355250 71043 -182613 29909 -54045
8498 80423 -92017 -120888 -54768 14004 143122 52158 -7355 109609 12957 -234602 -245040
8487 -245040 -13650 -15311 288977 159982 129719 48534 147503 93935 42269 -19461 -103699
8476 -103699 130476 185390 -135716 -3568 285753 -78010 134685 -297 88592 48378 -49498
8464 -210250 -252612 -33381 -168466 -150572 -88202 -172109 -25261 -126753 -646 11914 29515 150398
8452 150398 132929 51412 54785 308800 -251141 11930 -44800 -367703 -52977 -87700 36409
8440 95538 89312 -116798 12286 -27925 -188773 7551 -144332 -66933 77215 -19011 44342 -219041
8427 355118 128874 133175 -324880 -77824 -74495 -298489 621 -70158 173842 -55174 54591 -205263
8414 107300 -267856 234121 -182069 -27180 70120 -82350 -114078 -304 54799 201499 -62689
8402 -45776 -200718 116402 151997 -53010 -217290 53989 61137 216288 -374797 299977 43374
8390 -269529 -11012 -87337 82503 -161301 51285 -52440 -281329 -69296 -36589 -103032 67020
8378 -157343 -119805 -96873 135584 -103719 -68764 189267 -180431 -115249 -337001 308948
8367 3568 -303215 189735 -127112 -286109 19064 -193199 59113 -110383 -237669 21005 196808
8356 196808 178533 -187993 -25789 -79685 -9334 -542588 -190039 -11073 -199954 -405691 71084
8344 519627 24667 42981 -19662 54958 -94692 -64923 84773 157323 -138741 -194414 -155900
8333 -155900 -61865 -92629 -32018 301363 136562 -273673 -270780 -147098 -48988 -12656 -57199
8322 -57199 -18595 -256102 189260 143703 -140662 -96907 -163934 -134991 -131434 -103427 -100448 180246
8309 -168846 -416029 -323096 -353544 110365 -157408 -372034 148737 60273 -346862 -142525
8298 -257089 135273 -162431 -202806 -123021 -93888 198205 -14359 61725 -271368 -135387 -109285
8287 -109285 -280413 67948 204020 -153324 98070 136973 8776 -64756 151429 -144898 -132900
8276 -132900 -220400 -56993 -101820 1681 -20840 -170574 -133961 -73379 15251 68687 -26140 -114019
8264 -114019 -8506 30500 -385066 190758 -128299 38175 217208 60270 3208 4363 -315742
8252 -146092 -87056 -238620 34649 31021 376918 -132370 -149621 -131418 231981 -95665 -81960
8241 -81960 179869 93025 3633 -330602 -26582 -288567 -152164 -193033 307076 -51643 139948
8229 -31857 71375 119458 148134 92124 -55036 -183656 -153109 -107811 25604 -110296 -80002
8218 -80002 -384608 48917 -62980 89364 -116183 233151 -400409 3886 46621 4096 -55749
8206 -63760 50558 55718 -92091 -155986 -342867 187857 -1982 -14981 -215835 74608 -15519 63942
8193 88796 208822 9874 -42170 -234334 -288459 -138166 126933 268917 57041 -192775 -207023
8182 -207023 -85615 -200310 -261107 377322 127835 -81330 -128278 -152059 120191 -57555 151652
8170 -423133 -158981 112043 -74402 -232599 -178172 154490 -103552 -80579 104027 -148708
8159 191877 -117497 -67074 -22456 286113 -23807 -274813 -50359 -125029 77349 24990 -50318
8147 -70496 -86417 -129093 56891 83869 109752 46520 -35930 -11081 -124263 -332783 118778
8135 69091 -67156 1338 -320041 -79996 -14625 23596 -119605 205437 -324067 -54390 -401587
8124 -401587 82751 -270992 -81325 58919 -116067 -291604 -261527 232244 212094 170904 149466
8113 149466 -59329 119572 52273 -85569 -44687 -229820 308940 -112747 -88981 -111452 -61200
8102 -61200 -35447 41749 104932 -175720 -30720 65632 -184474 -34746 -273599 -115021 -48909
8090 -93056 -337876 -39400 -46734 -119341 4929 48409 27533 -196500 90083 305156 81597 88698
8078 88698 -268844 -185063 326564 -291863 200063 183952 115599 -91907 -8500 102160 227339
8067 227339 210032 -5210 211907 40076 -59682 -18185 -281810 -196488 61295 182926 -230691
8055 164278 -30530 -41484 -108911 -240464 -21695 -232804 -224586 -112363 384850 -167733 -24638
8043 -129785 249025 126317 52434 104471 -81723 156031 75109 69010 -84697 -30697 107528
8031 141834 213615 -350708 -28231 -106855 -244823 8270 53754 -60824 -81555 -149827 -143141 46294
8018 46158 115806 -82296 -299175 13390 -96858 142456 -276707 -84158 92851 -124504 -190897
8007 -190897 167886 -161623 -48835 130622 91795 306834 -115130 154721 -168130 -62997
7996 65687 -21895 -169357 144613 -30592 131208 -6009 -117392 -246851 132268 -144549 -45649
7984 -87676 -10688 -135489 -49153 156446 84137 -283595 5915 -56708 94284 -705 13179 176662
7972 176662 -13479 -40950 149827 -197050 -213545 -198003 120078 54925 -152081 12056 -397651
7960 10001 -113386 161365 176148 348772 -57758 -272704 97621 223450 34091 190248 -88955
7948 -3273 -344890 108232 -159648 50516 -209732 14513 54559 -229409 -6901 -32503 -257986
7937 -257986 166863 146457 250519 7965 -241831 -81166 -101719 -144143 -677013 252088 -251809
7925 120425 -128660 84407 -63159 -68195 -105841 -34886 -419052 -248866 49292 135968 12048
7913 -198686 -306635 177368 383201 46253 -142975 14611 -71964 -322009 -334838 52768 -81871
7901 51162 -52560 -117202 -300676 -135714 -310824 -46556 -3603 7311 -186354 240292 -362874
7889 -137313 -309893 -125964 -138877 -32073 -127319 -62680 -53827 -204119 -36172 -112728 -262723
7878 -262723 -150665 -1759 -83270 -292077 122787 -171734 -75082 -98126 66010 175526 -141808
7866 268998 272786 -138901 -202799 -67226 140502 -191973 234426 35246 -95821 -151002 -11243
7854 -158171 81823 -60645 -71514 -104039 191159 24875 156934 -49591 73657 180086 -69646
7842 -205969 169155 -147544 -70129 -161544 -108052 13836 23599 280148 28197 187149 93123
7830 307109 -267318 46329 -15475 -190879 22711 453664 221437 -41479 503447 -262597
7819 25547 -74440 68811 -180746 107305 -415036 3184 -137044 5243 -263061 -36320 29675
7807 -322543 13877 295255 -274031 -260261 -33602 155344 350864 -207087 -192250 197797
7796 12151 -84985 -70034 -305135 -345138 -72075 -372622 62856 18409 -428625 310568 -329491
7784 50519 131060 21779 161881 191906 92823 -56588 84588 385390 176481 51250 72204
7773 72204 -215847 43260 155695 96728 -212102 -59004 -4195 72790 58993 -176901 -223472
7762 -223472 -39134 -171370 246227 206702 -83137 -114669 -15437 -340080 89486 223168 -108718
7750 -155341 -33257 -9503 27453 -181921 -155111 28194 -74428 220441 39191 -101988 -200136
7739 -200136 -112561 -63336 145681 151798 -93816 -192225 58609 -109057 -95595 45931 -49474
7727 -418045 -154647 24257 -321189 3007 -131060 -290445 -97315 -154625 -423922 -82898 149374
7715 -269195 -108956 115856 -43285 -304601 16360 -113327 35895 156162 164243 72781 239137
7704 239137 -85244 133489 149165 18309 59532 -298 -277895 -3634 -171451 -113259 -149245 97292
7691 217994 -231226 -31696 -288789 -63178 -78937 -45499 124647 25621 289590 -186374 7722
7679 7919 26006 -160075 267657 -116152 181788 -162599 286423 258805 -286621 30624 182687
7668 182687 -124235 155346 122127 -64600 -363722 -80738 189085 -289049 -50456 -66203 272183
7656 -145237 80077 17470 249949 74727 -99525 154951 12699 -328730 -42043 119834 -41799
7644 -14004 78200 -240379 210497 237443 130223 405606 -99293 48909 -16696 134656 26503
7632 -138220 -45236 49665 -8540 -302915 186838 -111753 20637 -53280 -208410 -278405 -37482
7620 192512 -35403 -16976 -46533 -210953 -169180 -119501 -253293 107892 -314055 123188 -221514
7608 -192263 -240544 -275266 -156581 -212533 -108554 3836 30107 35147 -151645 -13332 151385
7596 300305 -79617 245937 -157331 -287483 8497 -183527 84616 66467 172082 -307701 -138037
7584 7755 202610 327098 80155 -132549 -135966 219759 147010 -322170 -393884 102777 -178724
7572 29452 219891 290854 -142408 -5393 108522 -17806 -24641 -39433 166409 -156900 -20102
7560 -18759 125641 66432 236006 -160010 85076 -83057 -108263 141342 -4964 -198298 -35904
7548 236394 217156 35089 113167 -73054 -57441 -64278 -185883 -63133 -132136 -263915 -113510
7536 -107635 -6988 -32394 328147 147370 127569 102059 -5665 -540508 203078 -36621 -200397
7525 -200397 -598593 -14961 -296044 44037 87666 -263705 -22624 -10891 -39547 -254028 54869
7513 -117755 -50018 58208 161298 -64534 -154725 -184597 -109059 -155041 23493 -185728 -21171
7501 43054 -21496 -67711 65837 -223971 78668 -55147 275538 4143 -207957 452419 -359367
7489 -273710 257731 29901 -274467 -406748 170252 -74910 29931 6070 -165696 184778 61193
7477 -108492 -143529 191003 -169346 71032 216162 -115984 -93708 -21434 185021 298603
7467 298603 -49580 -208074 130669 97430 69300 -14105 208403 -103137 -132051 -108572 -138205
7456 -138205 -319520 18480 16960 111819 -107760 -3815 -319385 -129157 317124 33351 66021
7445 66021 -27114 -11624 4876 53100 32914 -238091 -384249 -194910 -71142 -203742 2006
7433 -275606 -99643 -187404 351947 -90523 127343 12702 -253186 142525 -230022 117453
7422 -148626 -114068 101533 148965 -87366 -45129 -34926 -163634 -87789 -119949 -105298 -129532
7411 -129532 98 234808 -543931 -298894 210481 -167713 -73351 151923 -23306 -223692 2781
7399 -174122 -105170 -37108 51951 -101025 49321 -162397 -41293 145544 -202680 -35682 65950
7387 -55727 136955 229680 352641 407881 17262 83516 -77328 -39048 -47575 -54036 -24496 72474
7374 -13857 140773 210544 46352 -7789 7173 -130885 205586 -204566 76509 81779 -20904 56168
7361 335038 -11536 184401 49524 152244 -470 171140 -518056 73377 -97256 77743 282011
7350 282011 108934 139816 71091 151376 -80615 -54584 -188837 39947 -155972 163786 41759
7338 -177761 -29811 -22914 -101137 26813 -171858 -146402 -111345 -55202 51121 -49344 40354 304494
7326 304494 84997 353334 -189434 27866 54716 -69224 109340 91129 -29038 278222 -12787
7314 -150951 48258 116094 -239329 -191583 -44985 65287 6809 -135586 -29854 -89060 -199499
7303 -199499 -186853 91136 -196069 -509292 120119 -10683 133394 427780 -378531 67632
7292 109516 -244605 4530 117801 -193068 57588 -204526 -226564 402508 -160755 -181645 -48740
7280 316138 76550 20323 30329 46672 -54766 -189742 70397 157073 -123484 -152945 -80354
7269 -80354 -260399 -3628 -346096 -48284 46781 4377 -133477 -192457 -142757 -57505 -280103
7258 -280103 -372342 -207168 -188196 -65092 17125 -163871 -74527 76926 29060 -78286 -110157
7247 -110157 42491 -299391 -120527 193142 110082 -189735 -20581 26318 11526 164356 160111
7236 160111 -95433 480489 -56976 -178000 -113208 69421 -332257 -160406 23234 -195038 -147114
7225 -147114 -156777 112447 62896 -190618 227316 -2987 -253222 -181509 -150409 80444 73507
7214 73507 -21962 54236 35245 23259 -93828 123648 27403 -149108 -208438 -120779 141647
7202 425160 -153579 244260 175328 -194453 -32070 -47104 -12384 -31666 -61936 35053 -24079
7190 -78767 393837 148646 -67736 -25149 104699 -10622 50282 -84389 199273 -162866 77322
7178 -44303 -196663 135647 -160775 -61467 -34412 -22485 -379667 -56811 -79581 -35949 -307827
7167 -307827 155378 -59149 -88826 -122306 -102848 245052 -190371 -40 223911 -346886 50769
7155 289384 -390674 25366 -46124 188770 -86400 -281833 -1201 54247 -152035 469281 -70653
7143 -9253 13208 69791 -266639 76839 -30027 56479 -94673 66870 -17826 108292 -311439
7131 145144 205865 182121 -73141 -411494 -316183 -212463 90702 -124376 -76297 59709 35840
7120 35840 209132 92161 223375 -28964 108100 -231249 -64084 -106256 -99997 252331 119860
7108 27108 -320285 -140943 -5842 -346 86825 35513 124554 123573 -336448 -315135 -3575 -125035
7096 -125035 -5260 134221 -154530 -276171 -291569 -307151 195576 6052 115814 129319 267968
7085 267968 -73836 -177923 -309203 290636 25847 22167 -40231 -159444 140816 -243319 -145517
7074 -145517 216474 3932 70310 -168972 -165114 -133823 -110644 -287692 -46696 31776 -149843
7062 315479 -179015 85795 -134235 -116982 -224735 -60539 -30686 -150450 -138729 168460 -180543
7050 -106341 28776 9730 86227 35554 -65100 -49357 24186 -304232 231206 89003 210077
7039 210077 -124551 233052 -17572 270898 -383366 305046 -5594 -191440 -58947 -40673 86021
7027 14061 13313 116620 -105159 -17396 -230563 114311 -88373 309481 -58994 -69635 -164440
7016 -164440 -197099 -66103 -198330 61953 49052 94235 -354592 -10235 -152189 213120 53596
7004 -71894 54816 84029 -309030 -41993 -27739 -220867 -7839 124859 42045 -35458 121846
6992 240908 156286 264535 118136 7846 115488 69496 -278812 -157493 -165556 -15694 196619
6980 -41247 -139644 216356 -7428 75919 -26003 -374589 -102812 79780 -344457 -107341 145004
6968 351243 5309 1524 -20681 39219 132301 -216783 -40850 -241366 67488 -15396 60762 43418
6956 43418 -2376 -64866 141370 -493915 -23815 -91865 -33171 -84386 -204305 248045 190597
6945 190597 -128349 110133 -134425 129318 210807 -139527 93239 -112752 86578 -46648
6934 38147 -161267 -33471 -17043 160996 -8225 89292 -219347 -163092 304756 8569 -266767
6922 -41698 -51693 -270942 -196454 -118412 234990 347928 -176699 88855 -186097 193152 84427
6910 -201365 -8551 -158472 87323 134233 -37290 186146 73495 -96964 59814 242499 351606
6899 351606 -40615 262772 -61870 369985 334874 -47219 45655 176 -69455 -133405 -60079 -58165
6887 -58165 -180952 -126592 -454219 -33802 -232146 -221298 -56040 40288 88428 78369 -61006
6875 -147215 45506 92554 231888 49930 -140579 63250 249732 -228683 83303 144759 -82107
6863 -168137 -311983 -162965 164598 45513 -196356 -30826 182015 224677 -6807 47422 -142362
6851 -36098 -292073 96923 -17036 -10702 -117938 112994 -7379 -20589 -55627 -182018 6697 79614
6839 79614 -34818 362075 52265 124671 46730 -105275 -114425 -24335 -102781 28258 243221
6828 243221 -128600 -281425 -113608 -242003 -192663 59560 -24074 -5460 175029 -189741 -90439
6816 -170251 158994 203344 973 -86477 -105635 58239 188592 -204591 276516 180667 -51985
6804 -245773 -93445 -239642 52433 5265 -52499 -211198 -196391 50211 -138696 -30683 -133473
6793 -133473 -147124 -12532 77577 55869 -125033 133323 252610 134262 -58224 144692 204719
6782 204719 -71879 -19278 -10775 -186149 225310 -39290 -225397 98201 80797 73376 -129896
6770 -236625 -41255 110758 -261768 -109935 -241015 -378945 -50933 -338169 132554 -70429
6759 -186414 -42950 210228 181832 -86341 -62685 7389 -40406 136594 10049 173392 48168
6747 -149818 -226643 102474 133461 -181125 119427 30250 217795 129442 -120109 -12171 -56737
6736 -56737 -183184 19743 187497 -162918 -159667 124997 160476 -25829 100041 -23355 90099
6724 195740 138512 36435 -372736 -99559 -257809 125635 71158 69335 -161152 -106569 -86105
6713 -86105 -31168 52193 195875 -121728 -550533 -291444 272013 158990 226022 -60473 15529
6701 177365 -31086 -80470 232642 -223270 -43147 13465 -40050 226818 -23069 190111 -196069
6689 -95599 176653 70136 -220914 76895 87173 92700 9051 146836 -145716 -111103 64350
6677 159760 121424 -96219 122180 -10747 371151 68859 82224 -78398 -529627 36330 121762
6666 121762 -167046 -25820 119325 -121110 -49145 263130 58708 200579 116957 -25764 168380
6654 -35061 -286970 -2012 -88225 306097 -3064 -3839 -123278 126334 38770 -71885 12612 198393
6642 198393 197861 -84398 188040 -122513 17239 39969 160260 -205794 -51142 114969 24104
6630 -2664 11822 -64525 205145 103654 148993 -47941 -5534 -32080 52549 22240 260416 230633
6618 230633 75203 -112987 -120070 60587 -181659 -113806 -262440 46736 95764 -11523 191331
6606 26897 314147 -28572 -2225 100256 -148953 -104827 71234 78032 -182188 -131615 -132424 42022
6593 22973 -126587 -33283 -174542 5850 -151702 -257494 142594 -182103 -95971 337684 -116613
6581 -283868 253724 73331 -105592 161860 -316836 -134911 56016 106135 -174838 -119820
6571 -119820 -283479 -105233 -180990 94957 -822 -152279 -80965 -154290 -280362 -184731 -65517
6559 -181714 79065 197485 186625 -239011 202653 -4096 -136290 223350 -181924 330703
6548 12616 209642 -129213 102672 8302 97341 48058 26932 -299487 -150427 106669 73138
6537 73138 -357472 -60734 -10378 21007 280521 17082 -171274 -390163 359271 -283424 -29578
6525 -342566 35257 38655 -68890 -112040 -220772 19924 -47567 -30527 188656 160581 5808 -128652
6512 -245048 129907 -283381 86916 -175759 -130959 -71434 181573 -126545 189830 239959
6502 239959 -134969 90539 54072 -117933 -206999 114817 29101 124811 20659 120917 -218828
6490 -12523 -42819 121045 126855 -352803 -103691 -4915 63857 -117484 4060 143007 -275848
6478 246523 -1243 -328133 -189714 74938 -134297 -39376 134818 -38321 -87374 125632 196630
6467 196630 -8810 -138225 -213908 -53148 21702 124538 -302750 49823 7396 -98899 -117286
6456 -117286 -171816 -19317 173348 -236192 98447 -219662 264662 -149670 375994 -217078
6445 -174215 -89317 56661 -22358 216033 -25137 8959 -291459 -72033 -178386 448467 -171922
6433 26607 -130889 296918 21653 2692 204458 112724 -54063 27346 -151676 37051 20536
6422 20536 -136929 -39611 18384 22023 -210796 -71225 5808 -19195 81289 -57085 -107389 -211251
6410 -211251 97716 -18172 -125707 217628 -63572 142984 -118965 211153 5112 125706 9175
6398 -276878 -47891 237566 61816 156323 -26546 -55852 -116331 196276 134859 -191366 -330255
6387 -330255 399042 292943 29906 203791 166854 -213493 -132007 269658 309676 99296 -18027
6375 -24199 -567251 289486 88944 -299141 -302948 -101681 -78879 -122019 -230286 117473 -214997
6363 98132 5610 -79373 -47287 -85248 -183367 -10877 -136935 205143 96087 -165409 60364
6351 39202 98246 157486 180504 -32716 -77171 -48266 -219945 -333032 16011 258853 83378
6339 27393 -72473 -167236 28598 23266 -58344 77474 -34248 -169681 92478 102961 -144587 -123959
6327 -123959 -30726 -125007 34642 160796 -58464 -343782 -252628 56520 136889 148760 36017
6315 -189302 325950 -128361 -319739 185167 4097 -100664 -104569 63549 -113115 -212001 151818
6303 -72327 4619 182412 -189223 -203598 26147 -75843 -364614 -76453 133004 76231 78561
6292 78561 -20841 176236 163410 231215 -78266 106893 -181989 -70780 141499 85278 74906
6281 74906 342713 66151 -274697 -26421 -199304 -221846 -114672 218723 -5476 179193 45994
6269 -81883 83555 -199056 43981 -175362 -264998 -73878 67112 -159346 26223 -174197 -111119
6258 -111119 140048 -68370 -192722 -15622 303228 -133086 176789 327994 -201051 -56020
6247 -27308 22536 -124569 97644 -37991 101106 -252243 -79673 -131570 152703 73094 -395861
6235 13010 -13763 -116664 -365570 61187 220679 -286359 -63240 -32256 -101600 215922 85202
6223 -199328 2939 -103160 77087 -13693 215399 9140 42538 178426 73395 11637 34515
6212 34515 -107330 43453 -230126 172965 312463 -19504 -158183 -124833 -56628 -35818 259759
6200 334345 412521 -847 215215 273401 -118883 38298 13289 37467 166938 -71652 -2404 -97077
6188 -97077 -243960 73608 251332 -53524 11306 -686036 1833 -408441 591 289330 -142011
6176 315698 -259115 -92434 -67426 -241287 16207 -121425 207973 -274316 -45303 -503439
6166 -503439 89692 -353032 447038 16233 260355 50468 85899 -28832 73868 16179 212784
6155 212784 -65150 -137790 -890 -108042 -20021 -54773 70702 -122760 -129172 -123177 -197268 -75526
6142 129963 123342 54626 217511 -222434 20196 -50322 -258197 -195663 -68984 -52415 280389
6130 120029 -60946 19955 11317 174550 151436 78944 -8715 -191680 9424 75590 -283208 52070
6117 107147 55102 30693 379085 -132837 -149468 108282 79837 -62913 178464 -131179 -237578
6106 -237578 294 103037 183247 -136385 179661 -470457 -22621 16457 125918 -151703 531184
6094 245758 -169025 53455 -283114 -184240 -4026 102208 -88444 29188 509546 225645 35574
6082 187434 302365 -194829 75438 111146 124929 9186 -67047 235224 343937 -217755 206103
6070 255765 -257948 349774 -307298 327363 286238 -47443 -316224 -109701 -36355 245754
6059 -80000 386855 4233 -190386 23794 269921 363148 -132872 47222 -193970 -123631 320327
6047 -17364 8948 -322088 129296 338407 77556 66947 -232156 238285 -170255 -36839 -162195
6036 -162195 -101473 -280111 54926 201456 -162086 -213651 -225008 -66223 -395641 111753 -2344
6024 80935 137396 -197534 -106464 -51161 -84891 153738 -14772 -58176 31058 407237 57641
6012 74281 25362 86174 44130 -158726 -201757 -18996 -36422 -23281 -165887 743 261867 -322585
5999 37153 -157697 -30195 -295792 -293861 171036 268409 -139156 -23143 -2674 -130627 256132
5987 -36224 93768 -243922 174446 -80803 -291508 25138 72021 -156213 -164776 109388 -150818
5975 -109807 380497 -116050 -71622 -6217 -141083 -202506 -74699 78166 156785 175254 -92168
5963 -382541 -23136 239910 -130173 93628 146844 -94321 -15545 9585 -47830 3656 10006 -234983
5950 -43119 -88113 56120 -195467 -43287 252863 -135994 161970 91868 -189468 -41894 12011
5938 -43740 230045 251435 -87445 -60549 -9076 83947 -4489 -239734 -201484 -110658 75122 34244
5925 -4624 189288 253863 263683 -111228 -103391 -160484 -181297 -59650 -339572 5817 247645 -197495
5912 -142588 -121573 -81350 -51864 52780 40838 -126296 -19825 94360 152871 54704 82389
5901 82389 133732 -37749 172708 -117881 154233 159764 48266 14088 46593 -26738 111375
5889 55855 21176 -206892 -80894 94496 201547 43793 -29459 -258346 -155614 -187033 -13066
5877 36044 9162 117257 -128565 -222578 -80478 -31435 53517 81079 120310 58087 170817
5866 170817 150999 -348951 -252126 -137945 65957 5861 -279658 378190 -279659 -68160 -266599
5855 -266599 -86585 142414 -49024 -22357 -152064 -47026 174015 -32094 89711 120746 -21366
5843 34896 -64263 122239 -82286 44395 -72042 173521 -253535 -154990 -40226 173513 -74981
5831 231470 -335651 -52418 32451 -278264 -95717 -91990 345563 -142737 73043 -90479 -68256
5820 -68256 155732 -161800 -87289 -269495 -209556 -241588 -67291 -189373 -41891 89397 154173
5809 154173 -181602 193995 128487 -202868 -246178 -253167 -63357 51607 -265702 80716 -3913
5797 -244400 76168 99333 -272139 -253352 85959 100093 128913 -125509 116518 242136 113011
5785 36408 -35218 -69072 -159721 -157333 -36043 229813 -68820 30396 247067 17969 -82906 -159615
5773 -159615 220823 372376 -6446 -82498 136582 249557 72912 -54178 113653 -120705 176142
5761 -9364 -275991 -42824 -44779 239907 79745 311145 -48638 27362 -419483 86637 129495
5750 129495 -174004 56509 -15924 241782 -50883 28773 71477 -240165 -135214 91177 -225917
5738 -110509 -107163 6124 113036 -177747 149096 -361605 -114115 -83721 -266662 -309041 -14511
5726 -7355 99935 71716 -200017 218090 -49848 16062 -329228 -39202 -69602 103981 15569
5714 235838 -31823 38290 111731 9491 -263188 -256804 -163894 88385 104181 -201635 -39936 196293
5701 -283548 -195441 3566 123049 3349 9180 86025 317240 356563 -2760 -331515 95889 -92578
5688 -169552 138522 -143107 187593 60275 -19265 146727 23985 143779 19676 -75891 55744
5676 174551 -97458 10780 35168 198559 62685 97364 -104682 -52096 -119607 -11394 60567
5664 -51908 113419 -193572 -54700 -159172 68051 -68326 -299472 -28309 -339003 193069 -59268
5652 -109639 374298 270984 211211 -18881 -222987 -45003 95499 -171636 207717 158509 169377
5641 169377 -215808 -68014 -112273 -183950 139009 395232 -17802 194328 -340327 92522 81070
5630 81070 -195376 36563 180203 -77890 195965 -37415 -154161 -106387 -12805 111791 272572
5619 272572 61765 26447 18047 -161155 201224 101260 -218893 -107111 -142626 -27641 -479324
5608 -479324 -135833 -179217 -103019 -136771 18274 154743 79196 -199707 -124163 -42023 53475
5596 123491 -7888 19426 41928 67025 -57132 -271407 296145 93471 -42156 50859 -203667
5584 196117 57610 -105507 -70294 189727 -229573 -44026 -138166 66900 -155739 158129 10453
5572 -7984 167412 -56931 -54127 -2648 85632 -44043 -196718 -251254 6182 -79064 170202 -44719
5559 -59834 -73911 -229001 -36778 -74970 533462 -81405 -189255 -43402 139772 10532 -8669
5547 -17341 114074 -93394 16674 129257 193261 -70432 165845 -254769 -241120 -256964 142715
5535 -38287 43812 -169073 59241 25842 339285 204248 148856 65755 365498 321521 -99611
5523 108772 -249389 -51591 111931 110485 131006 -50451 125134 -170664 -65351 279655 -28515
5511 278957 -77750 -68399 83553 -17868 -63099 -179608 81416 -62184 292229 -215046 313787
5499 -327224 289528 156321 -88229 -21064 81789 284894 123919 78668 -143140 -168130 35392
5487 97406 159128 -35650 212551 -258214 188449 59350 85640 136380 161443 -278246 -68145
5475 111738 180888 -400079 192407 -61803 58714 55677 85773 4557 59364 -269111 -95677
5463 292794 -68136 107127 -135335 -187250 -49699 -200572 206127 -71238 -115042 90099 -81815
5451 47069 -235855 -5608 5433 -184964 148024 361897 42675 -85729 114154 -246560 -211094
5440 -211094 100625 84416 -184540 147226 -52818 15234 31813 -92647 -18266 409591 41816
5428 6043 19521 120197 -229898 -344254 -54238 -35221 159452 -190084 -77217 97479 -386899
5416 -167813 109830 68023 -243725 104521 -261485 194784 244605 216523 7920 -56181 -567159
5405 -567159 -55262 206944 -188363 47933 -167767 55401 -137026 -104706 -23397 -210347 49885
5393 -284095 -179569 271506 68002 81209 -156798 4004 171915 -59271 -135854 240230 -148608
5381 -162842 78601 47419 281000 -11641 187291 -31710 -170488 164625 102538 12585 -152441
5369 89564 -67814 23449 104901 105150 -124445 -114968 197771 -292578 182844 123005 152902 -249758
5356 112265 -40220 -233473 121696 -89935 31462 153886 161812 -158555 -13177 135669 342297
5345 342297 -192290 -122572 53200 214190 267042 -41083 -93064 -102228 -447002 -138029 -166436
5334 -166436 -461771 -117886 114231 -26358 -152440 175963 223187 -220316 115412 -370295
5323 -38979 -331383 -10245 231579 156971 -2299 -160707 46231 -216548 169713 -75076 -270159
5312 -270159 -67878 -159293 -249612 38089 -125030 -11504 -46787 -124094 312428 -65825 34398
5300 70593 -11999 -204592 -81557 -35940 -241047 26182 -137710 322671 204974 102755 -321743
5288 -346572 141509 -81784 -14775 -229511 201730 -107241 81634 -17416 -252159 103586
5277 281675 179849 108442 220641 -132459 211313 178031 203401 103882 190824 154371 -264970
5265 259267 133140 152326 60083 267872 -489188 -212114 -173242 -236729 16876 273474 -158971
5253 114575 103795 107449 -165264 -91710 58834 208680 -180294 175575 30853 -152680 116166
5241 -179298 -32637 -93366 119754 144565 33083 -100242 112152 -530862 -176392 -466421
5231 -466421 258602 -304006 123439 208000 42332 -151689 280611 -206820 -152844 -17957
5220 -365154 41267 -153760 119994 147817 -88315 -90272 -88263 -66787 255607 -88728 -189215
5209 -189215 399901 63748 103742 -1877 184253 431429 -59166 -64604 -11442 97828 -10978
5197 -233256 290393 -18417 182871 -300792 53768 -96381 -10851 335221 -70020 -61749 128103
5185 -184190 312471 188531 16017 -110247 -192313 -27178 30503 -151787 -62506 -140783 -86990
5174 -86990 240198 177384 -59903 58459 -300292 27663 -202530 103609 -155876 8333 -81705
5162 245153 67231 26466 -93356 171530 -91512 283623 -73390 -96335 124520 19711 -48415
5150 -316686 -89014 272391 -49045 -200481 -90416 184631 29592 35705 115606 51290 -3876
5138 74914 169781 -33268 141744 355510 205474 140531 498925 21852 -236389 192058 394612
5127 394612 131965 117875 107751 -4799 -261463 -187744 186940 108956 240438 96771 264035
5116 264035 -112723 -218374 -41575 -250257 -198970 -142665 113069 35617 87588 125180 -34801
5104 -102508 -108804 -90056 -22801 -164968 224824 -21818 -60136 72076 -153488 32860 59185
5093 59185 214838 165056 231192 -14500 194681 -40663 -299787 61114 -207254 77021 -106465
5081 194760 -46599 -35303 -175545 10625 -151957 -3890 -184982 210746 -27493 47499 -295441
5069 4284 18294 24806 262857 -273833 -89362 194491 47054 109792 13893 350033 128119
5057 249825 -148685 208501 79850 -168526 1017 268425 52009 69611 -355851 414649 52833
5045 -230312 30932 -237433 -89735 133971 -82670 -85100 -139695 -59244 -176667 273184 -160829
5033 70606 -91125 -86721 18201 27022 -98729 -195894 91150 77127 364062 214373 -384462 126521
5020 125056 145388 -196759 128978 -190709 427195 210742 162489 434234 298631 -59465
5009 -43279 -101409 34425 -285596 -224389 140244 204422 -95201 -149425 -65545 -48095 -45196 206619
4996 -463254 -111002 -99336 -130541 80157 -261840 177839 -18338 -274536 -6735 -208587 200608
4984 182112 57116 80000 193990 81688 -70390 247365 59114 -24942 22650 111956 241162
4973 241162 -174614 49967 75598 178998 -175765 -30047 -123189 -223289 157903 -30172 -31456
4962 -31456 80140 -195132 193400 -190296 -81766 61630 -157886 -242820 19060 50031 227924
4951 227924 -296606 -19957 -289983 -76158 181181 90790 -76880 -59599 225422 164990 -10425
4939 350324 118222 479330 139228 135469 -130014 189702 -37790 88059 36446 31706 228800
4928 228800 152478 -203580 -148933 475803 -188815 103906 -221381 -316430 11479 64306 -12658
4916 -113880 -7971 119336 114134 -116373 113985 35443 165012 -266770 -65443 -298783 309278
4904 -168958 -290388 -258750 -192141 -121480 25704 -147576 179230 -35802 -2787 220823 153012
4893 153012 55554 -139265 120371 79887 184012 21111 -217182 182521 -266600 77168
4882 -56631 -229363 72902 -14880 178445 -224655 151316 116952 -130548 27529 -111209 50061
4870 138020 51124 181322 172092 -70125 -14343 -47676 297702 367721 -241675 -96558 306541
4858 78409 -168168 -51176 -90789 -149647 -139057 -50476 195807 -53696 -63354 94428 279309
4847 279309 71690 280096 50 -383174 -49487 81322 120693 -211478 -85679 -82559 284227 100474
4834 366040 334828 -68283 -292151 -266835 74479 167239 -189827 266623 -91493 264680 -31845
4822 132497 98449 154980 -288165 74477 125226 1248 20709 -52662 183722 -146965 28139
4810 -156520 -36302 -138621 -163286 78998 131984 181751 -49652 86185 53630 -5262 386084
4798 65620 -377854 -149754 -370946 -96627 103863 -19510 -415060 132040 -50293 -137494 537833
4786 -2150 -310678 -274017 -240384 237929 -93233 244083 -17608 92122 53778 269629 218094
4775 218094 -305759 405110 38069 114654 -158900 -103271 143417 -98222 242031 -314275
4764 58497 -266 140039 38083 178387 569045 68965 -60909 -9219 -134768 12433 61108 145009
4752 145009 -105413 -131931 -141344 -84477 -309163 -43555 80270 129655 -81412 193917 -99638
4740 -107812 200158 -81319 -53900 -286072 70950 -33043 -52310 83062 115460 137298 76457
4729 76457 58612 -104047 -146749 -138919 250398 -61856 -145770 234850 -299752 130632 -77716
4717 -110282 -50084 8951 167252 178302 -261712 84822 -7940 -86847 117588 174605 -86844
4705 60326 -253558 -296758 -224049 -200774 200552 61188 343718 117029 -36240 279542 237947
4694 237947 103063 194151 83467 -67345 272049 40462 -168265 20080 207463 260112 -93135
4682 -130629 106613 -104863 -46683 -68021 90077 -40721 170280 -13600 134083 103635 -25908
4670 121730 -6470 31868 -248326 -307057 -211994 -157968 -171402 57569 -9449 49698 131742 5390
4657 -223991 130633 51426 13078 174506 283393 -169288 -229352 125730 -195895 -29046
4646 -156170 -70557 -17795 163629 192152 88260 88421 70367 -297586 -51459 301175 249902
4635 249902 -59164 -28280 -148336 80021 200870 169013 -258210 -148640 286357 197697 -44105
4623 113810 105317 149588 487839 384778 286838 -29401 -107792 83997 158461 107936 241644
4612 241644 -349857 -189720 -417620 -175351 -102829 -165699 147626 359997 -342774 -320465
4602 -320465 172586 -424074 205488 154994 299766 -183885 -152933 -494769 18701 238075
4592 238075 -30249 197464 40100 -56136 18072 147825 -39127 109249 -125651 -72927 282460
4580 -177291 -208479 64989 -131975 287176 121894 110660 -126252 -417440 -116475 -186451
4570 -186451 -7704 146802 -19569 128093 -25678 -196293 -93453 -50372 -411325 -358264 -102389
4558 -100912 -68303 42477 -98963 -217680 272565 57760 -180960 193315 14335 67909 107220
4547 107220 -188948 125582 24824 256661 86258 146185 -192760 459296 -30668 228374
4536 111069 138408 -130596 -139816 14039 -88426 -134282 29765 -208207 96113 227861 115985
4525 115985 239870 -159946 -162746 -193629 144432 -193831 72389 -248776 -21270 176179 -24812
4513 141985 541 77195 -52976 62099 -116565 -7149 -84764 -189259 5519 -49546 -56847 162729
4500 -159271 40148 -8102 -177580 -45198 44585 -1699 -1742 -33696 383669 210357 170691 145259
4488 145259 214828 -62832 -42305 -3269 -67361 139918 68451 133104 289752 -153737 87392
4476 77140 273359 219435 -79766 -408913 125127 20657 -176489 -34398 -108879 -52086 -272896
4465 -272896 52188 -270215 -105799 142904 -70063 -32886 -99618 299833 211948 93036 -328552
4453 273981 -286330 -46038 44922 161543 -134682 161086 18034 347168 377091 -331976
$$ [...]
##END NTUPLES=NMR SPECTRUM
##END=
