
##TITLE=AC1317_SSGAH12146_6609796_WrUB2G9DzH
##JCAMPDX= 6.0         $$ Bruker NMR JCAMP-DX V2.0
##DATA TYPE= NMR SPECTRUM
##DATA CLASS= NTUPLES
##ORIGIN= BRUKER
##OWNER= Administrator
$$ 1.72 TOPSPIN		Version 2.1
$$ 2012-08-01 22:22:25.640 -0500  Administrator@TOPSPIN
$$ Compression mode = diff/dup
##.OBSERVE FREQUENCY= 400.02188249412
##.OBSERVE NUCLEUS= ^1H
##.ACQUISITION MODE= SIMULTANEOUS (DQD)
##.ACQUISITION SCHEME= undefined
##.AVERAGES= 64
##.DIGITISER RES= 22
##SPECTROMETER/DATA SYSTEM= spect
##.PULSE SEQUENCE= noesygpps1d.comp
##.SOLVENT NAME= COFFEE_meoh
##.SHIFT REFERENCE= INTERNAL, COFFEE_meoh, 1, 14.9624
##AUDIT TRAIL= $$ (NUMBER, WHEN, WHO, WHERE, PROCESS, VERSION, WHAT)
$$ ##TITLE= Audit trail, TOPSPIN		Version 2.1
$$ ##JCAMPDX= 5.01
$$ ##ORIGIN= Bruker BioSpin GmbH
$$ ##OWNER= Administrator
$$ $$ C:\Bruker\TOPSPIN/data/COFFEE/nmr/AC1317_SSGAH12146_6609796_WrUB2G9DzH/12/pdata/1/auditp.txt
$$ ##AUDIT TRAIL=  $$ (NUMBER, WHEN, WHO, WHERE, PROCESS, VERSION, WHAT)
(   1,<2012-08-01 22:22:20.218 -0500>,<Administrator>,<TOPSPIN>,<go>,<TOPSPIN 2.1>,
      <created by zg
	started at 2012-08-01 22:10:49.718 -0500,
	POWCHK enabled, PULCHK disabled,
       configuration hash MD5:
       6B 1B 68 BB D9 2E 58 E2 7F 35 AD 54 07 DF 0E 41
       data hash MD5: 64K
       63 5D 01 76 0F A1 72 DB 7D 2E 03 20 77 D6 26 72>)
(   2,<2012-08-01 22:22:23.062 -0500>,<Administrator>,<TOPSPIN>,<proc1d>,<TOPSPIN 2.1>,
      <Start of raw data processing
       efp LB = 0.3 FT_mod = 6 PKNL = 1 PHC0 = 0 PHC1 = 0 SI = 128K 
       data hash MD5: 128K
       57 82 CB 14 E0 2C D9 7C CF D4 3D D0 8C 07 65 6B>)
(   3,<2012-08-01 22:22:24.234 -0500>,<Administrator>,<TOPSPIN>,<proc1d>,<TOPSPIN 2.1>,
      <pk PHC0 = -0.1757813 PHC1 = 0 
       data hash MD5: 128K
       92 99 1B 68 FE C6 B9 71 18 F4 F9 69 1F 1E 6C B4>)
(   4,<2012-08-01 22:22:25.296 -0500>,<Administrator>,<TOPSPIN>,<proc1d>,<TOPSPIN 2.1>,
      <abs ABSG = 1 
       data hash MD5: 128K
       FD FE 5A 86 FE AB 8D 9D 41 B1 AC 97 4D E1 86 93>)
(   5,<2012-08-01 22:22:25.375 -0500>,<Administrator>,<TOPSPIN>,<proc1d>,<TOPSPIN 2.1>,
      <abs ABSG = 2 
       data hash MD5: 128K
       77 46 1B 03 06 92 05 73 F7 BE EF 3E 49 CB 1D 3E>)
(   6,<2012-08-01 22:22:25.437 -0500>,<Administrator>,<TOPSPIN>,<proc1d>,<TOPSPIN 2.1>,
      <abs ABSG = 3 
       data hash MD5: 128K
       60 F4 E7 57 7F 05 A6 10 E1 79 65 47 5E 2E 5C 91>)
(   7,<2012-08-01 22:22:25.500 -0500>,<Administrator>,<TOPSPIN>,<proc1d>,<TOPSPIN 2.1>,
      <abs ABSG = 4 
       data hash MD5: 128K
       5A 3C 27 5D 67 21 94 0C 3F 7E D9 7F 99 40 00 61>)
(   8,<2012-08-01 22:22:25.562 -0500>,<Administrator>,<TOPSPIN>,<proc1d>,<TOPSPIN 2.1>,
      <abs ABSG = 5 
       data hash MD5: 128K
       C6 21 86 91 5A 26 FF B9 99 C0 B2 20 88 2D FA 02>)
$$ ##END=
$$ 
$$ $$ hash MD5
$$ $$ DB 56 D7 33 99 14 85 E8 1C 1C DD 2F 39 49 92 B4
##$RELAX= 
##$RELAX= 
##$RELAX= 
##$RELAX= 
##$RELAX= 
##$RELAX= 
##$RELAX= 
##$RELAX= 
$$ Bruker specific parameters
$$ [...]
150 150 150 150 150 150 150 150
##$TP07= 0
##$TPNAME0= <>
##$TPNAME1= <>
##$TPNAME2= <>
##$TPNAME3= <>
##$TPNAME4= <>
##$TPNAME5= <>
##$TPNAME6= <>
##$TPNAME7= <>
##$TPOAL= (0..7)
0.5 0.5 0.5 0.5 0.5 0.5 0.5 0.5
##$TPOFFS= (0..7)
0 0 0 0 0 0 0 0
##$TUNHIN= 0
##$TUNHOUT= 0
##$TUNXOUT= 0
##$USERA1= <user>
##$USERA2= <user>
##$USERA3= <user>
##$USERA4= <user>
##$USERA5= <user>
##$V9= 5
##$VALIST= <valist>
##$VCLIST= <CCCCCCCCCCCCCCC>
##$VD= 0
##$VDLIST= <DDDDDDDDDDDDDDD>
##$VPLIST= <PPPPPPPPPPPPPPP>
##$VTLIST= <TTTTTTTTTTTTTTT>
##$WBST= 1024
##$WBSW= 4
##$XGAIN= (0..3)
0 0 0 0
##$XL= 0
##$YL= 0
##$YMAX_a= 16555737
##$YMIN_a= -9942774
##$ZGOPTNS= <>
##$ZL1= 120
##$ZL2= 120
##$ZL3= 120
##$ZL4= 120
##$ABSF1= 14.9624
##$ABSF2= -5.595781
##$ABSG= 5
##$ABSL= 3
##$ALPHA= 0
##$AQORDER= 0
##$ASSFAC= 0
##$ASSFACI= 0
##$ASSFACX= 0
##$ASSWID= 0
##$AUNMP= <proc_prof1d_extract.lims>
##$AXLEFT= 0
##$AXNAME= <>
##$AXNUC= <1H>
##$AXRIGHT= 0
##$AXTYPE= 0
##$AXUNIT= <>
##$AZFE= 0.1
##$AZFW= 0.1
##$BCFW= 0
##$BC_mod= 0
##$BYTORDP= 0
##$COROFFS= 0
##$CY= 15
##$DATMOD= 1
##$DC= 0
##$DFILT= <>
##$DTYPP= 0
##$F1P= 0
##$F2P= 0
##$FCOR= 0.5
##$FTSIZE= 131072
##$FT_mod= 6
##$GAMMA= 0
##$GB= 0
##$INTBC= 1
##$INTSCL= 1
##$ISEN= 128
##$LB= 0.3
##$LEV0= 0
##$LPBIN= 0
##$MAXI= 10000
##$MC2= 0
##$MEAN= 0
##$ME_mod= 0
##$MI= 0
##$NCOEF= 0
##$NC_proc= -2
##$NLEV= 6
##$NOISF1= 0
##$NOISF2= 0
##$NSP= 0
##$NTH_PI= 0
##$NZP= 0
##$OFFSET= 14.9624
##$PC= 1
##$PHC0= -0.1757813
##$PHC1= 0
##$PH_mod= 1
##$PKNL= yes
##$PPARMOD= 0
##$PPDIAG= 0
##$PPIPTYP= 0
##$PPMPNUM= 2147483647
##$PPRESOL= 1
##$PSCAL= 4
##$PSIGN= 0
##$PYNMP= <proc.py>
##$REVERSE= no
##$SF= 400.020009078431
##$SI= 131072
##$SIGF1= 0
##$SIGF2= 0
##$SINO= 400
##$SIOLD= 131072
##$SPECTYP= <>
##$SREGLST= <1H.CDCl3>
##$SSB= 0
##$STSI= 131072
##$STSR= 0
##$SW_p= 8223.68421052631
##$SYMM= 0
##$S_DEV= 0
##$TDeff= 65536
##$TDoff= 0
##$TI= <>
##$TILT= no
##$TM1= 0
##$TM2= 0
##$TOPLEV= 0
##$USERP1= <user>
##$USERP2= <user>
##$USERP3= <user>
##$USERP4= <user>
##$USERP5= <user>
##$WDW= 1
##$XDIM= 131072
##$YMAX_p= 412582658
##$YMIN_p= -12968
##$CURPLOT= <Network HP LaserJet P1505>
##$CURPRIN= <$Network HP LaserJet P1505>
##$DFORMAT= <normdp>
##$LAYOUT= <+/1D_H.xwp>
##$LFORMAT= <normlp>
##$PFORMAT= <normpl>
##$SURQMSG= 1
$$ End of Bruker specific parameters
$$ ---------------------------------
##NTUPLES= NMR SPECTRUM
##VAR_NAME=  FREQUENCY,     SPECTRUM/REAL,   SPECTRUM/IMAG
##SYMBOL=    X,             R,               I
##VAR_TYPE=  INDEPENDENT,   DEPENDENT,       DEPENDENT
##VAR_FORM=  AFFN,          ASDF,            ASDF
##VAR_DIM=   131072,        131072,          131072
##UNITS=     HZ,            ARBITRARY UNITS, ARBITRARY UNITS
##FACTOR=    0.0627417313425164, 1,          1
##FIRST=     8223.62146879497, 100,          -57955
##LAST=      0,             1227,            -59007
##MIN=       0,             -12968,          0
##MAX=       8223.62146879497, 412582658,    0
$$ Real data points
##PAGE= N=1
##DATA TABLE= (X++(R..R)), XYDATA
$$ [...]
60958C1567564n69390m20541q564N29336R71677J039510N62322l68834j438246
60949C1864834k311903k820614k980604k895980k670475k381877k084119j805143
60941A1914119j549903j316612j108628r30081p78971o50782n44511m60485l95700
60932D178446l45236l05724k74376k47335k22080j99370j80209j62925j45519
60923B095672j28651j13832j00674q8430p8441p2393o9404o7150o4754o2555o0155
60912A189233n6799n2802m8838m4634l9829l5167l1403k8068k4617k1647j9670
60901G85759j7877j5519j3274j1923j0943r777q966q656p518m871k286j263q51
60888F72035M45J889J996J467K081L531L913K813J492M24j032k692l573l785m420
$$ y = [31567564, 30998174, 30577633, 30569069, 31098405, 32070082, 33109592, 33671914, 33303080, 31864834, 29552931, 26732317, 23751713, 20855733, 18185258, 15803381, 13719262, 11914119, 10364216, 9047604, 7938976, 7008895, 6229924, 5579142, 5034631, 4574146, 4178446, 3833210, 3527486, 3253110, 3005775, 2783695, 2584325, 2404116, 2241191, 2095672, 1967021, 1853189, 1752515, 1664085, 1585644, 1513251, 1443847, 1376697, 1311943, 1249388, 1189233, 1132434, 1079632, 1030794, 986160, 946331, 911164, 879761, 851693, 827076, 805429, 785759, 767882, 752363, 739089, 727166, 716223, 706446, 697480, 688824, 681306, 676435, 674149, 672886, 672035, 672480, 674369, 676365, 677832, 679913, 683444, 687357, 690170, 691662, 692086, 691054, 688362, 684789, 681004, 676584]
60873F76584n532o162o350p152q585r443r261q784q273p107n309l857l166k713
60859E84890k383k621l039k413m96J597L095M348N595O413O823P546Q700R519
60845F27574R867J0714J2463J4120J4914J5570J6953J8357J8288J6437J3967J2023
60833H01247J0652R143O974M455K483J608J486J501J641K129K407J420r67l507
60819H42672m860m914m638n002o148p338p787p675q046r409j0933j1593j1530
60806G42799j1539j1699j1517j1078j0896j0752r838q166o792o343o187n456m220
60793F28316l209k761k425j369O87K893L981L898M077N555P530Q660R020R598
60779F74451J0357J0320R450Q909R267R772R721R375R137Q874Q484Q269Q283Q136
$$ y = [676584, 671052, 664890, 658540, 651388, 642803, 633360, 624099, 615315, 607042, 599935, 594626, 590769, 587603, 584890, 582507, 579886, 576847, 574434, 573938, 575535, 578630, 582978, 588573, 594986, 601809, 609355, 618055, 627574, 637441, 648155, 660618, 674738, 689652, 705222, 722175, 740532, 758820, 775257, 789224, 801247, 811899, 821042, 828016, 832471, 834954, 836562, 838048, 839549, 841190, 843319, 845726, 847146, 846179, 842672, 837812, 832898, 828260, 823258, 817110, 809772, 801985, 794310, 786264, 776855, 765922, 754329, 742799, 731260, 719561, 708044, 696966, 686070, 675318, 665480, 657314, 650522, 644179, 637992, 632536, 628316, 625107, 622346, 619921, 618552, 619239, 622132, 626113, 630011, 634088, 639643, 647173, 655833, 664853, 674451, 684808, 695128, 704578, 713487, 722754, 732526, 742247, 751622, 760759, 769633, 778117, 786386, 794669, 802805]
60765H02805P746P513P499P187O368N479M820M184L485K942K423J473K69l40n9
60750H63794M10N05M80N80M43q9m36j84J01l56j532k914m337n881p314q190q351
60733H26729q001p501p274p536q000q163p933p536o845n467l629k212j649j479
60719G43504j258j205j572k067k326k463k726l085l371l420k869j556k49k12j544
60704G13581k818k796j864j083o36o2O16R25Q76Q95R72O32k51j349k605m340o474
60687F94219q254r114r323r504r800r895r710r584r765j0080j0198r926r087p519
60673E62460n510l916l273l032k250r42J28Q54J955L509M514M546M630N560O401
60658E75634N861M339L207K741K249J830K263L234L396K486J861K509L719M342
$$ y = [802805, 810551, 818064, 825563, 832750, 839118, 844597, 849417, 853601, 857086, 860028, 862451, 863924, 864193, 863853, 863794, 864204, 864709, 865189, 865769, 866212, 866123, 865687, 865503, 865604, 865248, 863716, 860802, 856465, 850584, 843270, 835080, 826729, 818728, 811227, 803953, 796417, 788417, 780254, 772321, 764785, 757940, 752473, 748844, 746632, 744983, 743504, 742246, 741041, 739469, 737402, 735076, 732613, 729887, 726802, 723431, 720011, 717142, 715586, 715337, 715125, 713581, 710763, 707967, 706103, 705020, 704384, 704322, 704938, 705863, 706739, 707634, 708606, 709238, 708987, 707638, 705033, 700693, 694219, 685965, 676851, 667528, 658024, 648224, 638329, 628619, 619035, 609270, 599190, 588992, 579066, 569979, 562460, 556950, 553034, 549761, 546729, 544479, 543537, 543665, 544519, 546474, 549983, 554497, 559043, 563673, 569233, 575634, 581495, 585834, 589041, 591782, 594031, 595861, 598124, 601358, 604754, 607240, 609101, 611610, 615329, 619671]
60644F19671M250L922L599L391L497L823M048M271M860N559N706N558O228P985
60630F86368R698J0481J0782J1342J2102J2852J3756J4572J4331J2746J1013J0212
60618H30255R749Q301N716K877L09k043m027n363o247p104p864q270q487q711
60604G99091q438p009m751k745j472m41P24J441P89j318l802n268n224m433l915
60589G53229l759l272k194j075l88k7K47M94R82K022L115L152J933O77M13P45
60573G56294Q24P27R78J403J493J410J687K228K502K462K415K196J274l78k244
60558G75271l908n149n628n227m520m200m090l407j928k51J126K289L460M666
60544G48504N958P480R187J0895J2735J5266J8944K3664K8877L4106L9445M5380
$$ y = [619671, 623921, 627843, 631442, 634833, 638330, 642153, 646201, 650472, 655332, 660891, 666597, 672155, 678383, 686368, 696066, 706547, 717329, 728671, 740773, 753625, 767381, 781953, 796284, 809030, 820043, 830255, 840004, 848305, 854021, 856898, 857207, 855164, 851137, 845774, 839527, 832423, 824559, 816289, 807802, 799091, 790653, 783644, 778893, 776148, 774676, 774235, 774959, 776400, 777189, 775871, 772069, 766801, 761577, 757144, 753229, 749470, 746198, 744004, 742929, 742541, 742514, 742761, 743255, 744237, 746259, 749374, 752526, 754459, 755136, 755549, 756294, 757118, 757845, 758823, 760226, 761719, 763129, 764816, 767044, 769546, 772008, 774423, 776619, 777893, 777515, 775271, 771363, 766214, 760586, 755359, 750839, 746639, 742549, 739142, 737214, 736963, 738089, 740378, 743838, 748504, 754462, 761942, 771129, 782024, 794759, 810025, 828969, 852633, 881510, 915616, 955061, 1000441]
60532A000441N1868N7502O0107N8383N2541M3319L1080J6405Q54j3624k5809l5163
60520A297904m1102m3108m1460l7230l1511k5025j8382j2149o616j816K172N188
60508A046865P244Q591R578J0457J1261J1814J2146J2869J4727J7851K1829K6589
60496A211821L2562L9838M7856N6290O5672P6673Q9216J02567J15808J28019J38632
60485B104954J48140J58108J70307J86281K07761K36390K72361L13433L55000
60476D152735L89937M08484M00507L60059K88010J90219P4603m9150j68851k71794
60466E774759l48813l96597m16994m15085l97251l69313l35694l00024k65520
60457B529468k33928k05004j78232j54501j34983j19052j04857r1724q0529p1704
$$ y = [1000441, 1052309, 1109811, 1169918, 1228301, 1280842, 1324161, 1355241, 1371646, 1372500, 1358876, 1333067, 1297904, 1256802, 1213694, 1172234, 1135004, 1103493, 1078468, 1060086, 1047937, 1041321, 1039505, 1041677, 1046865, 1054109, 1062700, 1072278, 1082735, 1093996, 1105810, 1117956, 1130825, 1145552, 1163403, 1185232, 1211821, 1244383, 1284221, 1332077, 1388367, 1454039, 1530712, 1619928, 1722495, 1838303, 1966322, 2104954, 2253094, 2411202, 2581509, 2767790, 2975551, 3211941, 3484302, 3797735, 4152735, 4542672, 4951156, 5351663, 5711722, 5999732, 6189951, 6264554, 6215404, 6046553, 5774759, 5425946, 5029349, 4612355, 4197270, 3800019, 3430706, 3095012, 2794988, 2529468, 2295540, 2090536, 1912304, 1757803, 1622820, 1503768, 1398911, 1307187, 1226658, 1154954]
60447A154954o4245n6960m9573m2409l5913l0700k7145k4757k2655k0712j9439
60436G60446j8789j8012j6726j5238j3777j2246j0822r890r253q263o901n836
60424F14693n319m794l879k879k174j778j722k090k465k068p82N96J326J460J437
60409E89562J520J769K060K078J719J469J804K388K637K841L748N079N553M712
60395F28939L680L727M815O088O966P324P121O464N648M805L785K566J362J89
60381F93479j118k383l120l250l261l502l805l934l803l236k136j010o32r13r00
60366F56476j60N68N15O8J53R37J678J794J532J612K343L259L652L501L588M462
60350F85978N673O514P056P822Q703R031Q649Q104P695P128O269N533N296N422
$$ y = [1154954, 1090709, 1033749, 984176, 941767, 905854, 875154, 848009, 823252, 800597, 779885, 760446, 741657, 723645, 706919, 691681, 677904, 665658, 654836, 644946, 635693, 627430, 620529, 614693, 609374, 604580, 600701, 597822, 595648, 593870, 592148, 590058, 587593, 585525, 584743, 585339, 586665, 588125, 589562, 591082, 592851, 594911, 596989, 598708, 600177, 601981, 604369, 607006, 609847, 613595, 618674, 624227, 628939, 632619, 636346, 641161, 647249, 654215, 661539, 668660, 675124, 680772, 685577, 689362, 691928, 693290, 693479, 692361, 689978, 686858, 683608, 680347, 676845, 673040, 669106, 665303, 662067, 659931, 658921, 658289, 657376, 656476, 656316, 656884, 657399, 657467, 657620, 658557, 660235, 662029, 663561, 665173, 667516, 670775, 674427, 677928, 681516, 685978, 691651, 698165, 705221, 713043, 721746, 730777, 739426, 747530, 755225, 762353, 768622, 774155, 779451, 784873]
60336G84873N430M803L242J158l05m36R9J74k80n18m08l87j65J108L214M728M846
60319H11176M178L384K222M81j337k869m359n674n987n158m364m499m912m617
60305G77665l827l304k980k401j887k024k501k510k060j865k021j841r60J77J020
60290G48681J453J604J656J889K485L284L961M335M312L770K919K419K782L801
60276G89351M797N259N066M496M200M741N853O638O744O819P496Q559R590J0769
60262H80378J2412J4221J5708J6957J8320J9774K1230K3219K6413L0635L4950
60251A114217L8693M1994M5412M9521N4646O0584O6741P2904P9555Q7006R4556
60240A805829J01130J06433J10887J14584J16965J17445J15786J11818J05365
$$ y = [784873, 790303, 795106, 798348, 799506, 799201, 798765, 798864, 799038, 798758, 798240, 797832, 797445, 797280, 798388, 801602, 806330, 811176, 815354, 818738, 820960, 821441, 820104, 817235, 812876, 807202, 801215, 796057, 791693, 787194, 782282, 777665, 773838, 770534, 767554, 765153, 763266, 761242, 758741, 756231, 754171, 752306, 750285, 748444, 747484, 747661, 748681, 750134, 751738, 753394, 755283, 757768, 761052, 765013, 769348, 773660, 777430, 780349, 782768, 785550, 789351, 794148, 799407, 804473, 808969, 813169, 817910, 823763, 830401, 837145, 843964, 851460, 860019, 869609, 880378, 892790, 907011, 922719, 939676, 957996, 977770, 999000, 1022219, 1048632, 1079267, 1114217, 1152910, 1194904, 1240316, 1289837, 1344483, 1405067, 1471808, 1544712, 1624267, 1711273, 1805829, 1906959, 2013392, 2124279, 2238863, 2355828, 2473273, 2589059, 2700877, 2806242]
60231B806242R6551Q5922P4136O1712M8874L5476K1245O458p844k0524l1043l9284
60219C137921m5168m8771n0461n0340m7890m2745l5557k7469j8799q907K640J5295
60207B779749K8122M0762N3516O6712Q0123R2956J04351J13791J20966J25392
60197C606440J26481J23994J18046J08671R5868Q0214O2876M4667K5546N389j5180
60186D383012l5083n3531o9989q3782r4238j01058j04204j03639r9515r2393q2872
60175C462708p1249n7838m3299k8255j2820L103J9222L4873M9475O2609P3812
60164C492341Q2544Q8192R0081Q7725Q1347P1866O0206M6980L2830J8600M827
60153D157539q407k0857l1768m0324m5962m8026m5841l9581l0436j9501p065O742
$$ y = [2806242, 2902793, 2988715, 3062851, 3124563, 3173437, 3208913, 3230158, 3236616, 3228772, 3208248, 3177205, 3137921, 3092753, 3043982, 2993521, 2943181, 2895291, 2852546, 2816989, 2789520, 2770721, 2761814, 2764454, 2779749, 2807871, 2848633, 2902149, 2968861, 3048984, 3141940, 3246291, 3360082, 3481048, 3606440, 3732921, 3856915, 3974961, 4083632, 4179500, 4259714, 4322590, 4367257, 4392803, 4398192, 4383012, 4347929, 4294398, 4224409, 4140627, 4046389, 3945331, 3841127, 3737488, 3637973, 3545580, 3462708, 3391459, 3333621, 3290322, 3262067, 3249247, 3252350, 3271572, 3306445, 3355920, 3418529, 3492341, 3574885, 3663077, 3753158, 3840883, 3922230, 3994096, 4054302, 4101282, 4134112, 4152712, 4157539, 4149132, 4128275, 4096507, 4056183, 4010221, 3962195, 3916354, 3876773, 3846337, 3826836, 3819771, 3826513]
60141C826513K1456L7033N4238P3487R3914J14432J35152J56960J80215K04684
60131D898084K30189K56368K82251L06994L30448L52028L69599L80783L85061
60122G791805L83132L74553L57700L32270L00212K63544K22570J76997J27608
60113A0330391P5844K2455l2314q7530j41315j91722k37237k76560l08354l31293
60103H822365l44238l46654l39151l23584l02242k76810k48009k16108j81746
60094F243823j46253j11046p6679m2714q798K4332N5158Q2362J05091J22498J33606
60083F381380J37713J34584J24298J07387Q5168N9584L2572N667k0031m3926o5942
60072F938454q6220j04860j21967j37579j51201j61824j68898j72935j74650j73875
$$ y = [3826513, 3847969, 3885002, 3939240, 4012727, 4106641, 4221073, 4356225, 4513185, 4693400, 4898084, 5128273, 5384641, 5666892, 5973886, 6304334, 6656362, 7025961, 7406744, 7791805, 8174937, 8549490, 8907190, 9239460, 9539672, 9803216, 10025786, 10202783, 10330391, 10406235, 10428690, 10396376, 10308846, 10167531, 9975809, 9738572, 9462012, 9153658, 8822365, 8478127, 8131473, 7792322, 7468738, 7166496, 6889686, 6641677, 6425569, 6243823, 6097570, 5986524, 5909845, 5867131, 5858333, 5882665, 5937823, 6020185, 6125276, 6247774, 6381380, 6519093, 6653677, 6777975, 6885362, 6970530, 7030114, 7062686, 7068353, 7048322, 7004396, 6938454, 6852234, 6747374, 6625407, 6487828, 6336627, 6174803, 6005905, 5832970, 5658320, 5484445]
60062E484445j70028j63336j54758j44748j32998j19443j04739q9409p3212n5701
60052D276073l6996j7663J817K1221M0418N9245P7449R4644J10250J23303J32314
60041D882075J35865J33804J27366J17615J04155Q6154O4126L9813J4458j1673
60031E693758l8079o3449q6648j07317j24980j38458j46780j50202j49640j45564
60021D542641j37990j27338j14613j00811q6492p1965n7446m2989k8354j3112
60011C761531L012J9859L7048N4549P2774R1941J11539J30746J48981J65518J78873
60000D776371J87284J89848J86621J77645J62720J42264J17791R1088O3304L4933
59990F129869O188k2897n2133q0547j06314j27649j43642j54157j59272j59071
$$ y = [5484445, 5314417, 5151081, 4996323, 4851575, 4718577, 4599134, 4494395, 4404986, 4331774, 4276073, 4239077, 4221414, 4223231, 4244452, 4284870, 4344115, 4421564, 4516208, 4626458, 4749761, 4882075, 5017940, 5151744, 5279110, 5396725, 5500880, 5587034, 5651160, 5690973, 5705431, 5693758, 5655679, 5592230, 5505582, 5398265, 5273285, 5134827, 4988047, 4837845, 4688205, 4542641, 4404651, 4277313, 4162700, 4061889, 3975397, 3903432, 3845986, 3802997, 3774643, 3761531, 3764543, 3784402, 3821450, 3875999, 3948773, 4040714, 4152253, 4282999, 4431980, 4597498, 4776371, 4963655, 5153503, 5340124, 5517769, 5680489, 5822753, 5940544, 6031632, 6094936, 6129869, 6136057, 6113160, 6061027, 5980480, 5874166, 5746517, 5602875, 5448718, 5289446, 5130375]
59980E130375j53820j44129j31007j15679r9040q1324o2585m3318k4255n632J2763
59969D282349L0824M7965O3840P8541R1907J03094J11195J15861J17081J14884
59959E157541J09577J01843R2214Q0729O7454N3085L8741K5289J3146K569o071
59948E736117j2147j4802j3331p626J972J5389L2995N4825Q0049J07608J37230
59937F118279J69417K04485K41891K80525L19259L56964L92047M22116M44170
59928H949153M55031M51622M31250L92234L34720K60839J74035P8540k0438j16745
59918A1390241k04440k79269l38984l82625m10112m22474m21849m10831l91782
59909H127875l66636l36914l03850k68612k32380j96011j59807j23889q8681n4745
$$ y = [5130375, 4976555, 4832426, 4701419, 4585740, 4486700, 4405376, 4342791, 4299473, 4275218, 4269586, 4282349, 4313173, 4361138, 4424978, 4503519, 4595426, 4698520, 4809715, 4925576, 5042657, 5157541, 5267118, 5368961, 5461175, 5541904, 5609358, 5662443, 5701184, 5726473, 5739619, 5742188, 5736117, 5723970, 5709168, 5695837, 5688211, 5690183, 5705572, 5738567, 5793392, 5873441, 5981049, 6118279, 6287696, 6492181, 6734072, 7014597, 7333856, 7690820, 8082867, 8504983, 8949153, 9404184, 9855806, 10287056, 10679290, 11014010, 11274849, 11448884, 11527424, 11506986, 11390241, 11185801, 10906532, 10567548, 10184923, 9774811, 9352337, 8930488, 8519657, 8127875, 7761239, 7424325, 7120475, 6851863, 6619483, 6423472, 6263665, 6139776, 6051095, 5996350]
59899E996350k2168R565M1067P2528J03405J32360J57746J78359J93468K01942
59889G064622K01901J91759J71204J40698J00598N1760l256o0496j16187j67473
59879G575130k11985k47847k74394k92108l01604l03279k97973k87270k72782
59870E085888k55673k36910k17309j97151j76368j55336j34977j15930r8271q2108
59860C415855o7899n5974m6422l9551l5822l4988l5922l7488l9059m0026l9630
59849B943074l7616l4387l0173k4650j7814j0600m126J054M486N157K145m281
59837B792269j2705k1659l0287l8100m4518m8779n0285m9098m6081m2258l8018
59826B370481l3121k7391k1063j4547q210k295L399R665J7201K5811L4620M2845
$$ y = [5996350, 5974182, 5983747, 6024814, 6097342, 6200747, 6333107, 6490853, 6669212, 6862680, 7064622, 7266523, 7458282, 7629486, 7770184, 7870782, 7922542, 7919286, 7858790, 7742603, 7575130, 7363145, 7115298, 6840904, 6548796, 6247192, 5943913, 5645940, 5358670, 5085888, 4830215, 4593305, 4375996, 4178845, 4002477, 3847141, 3712164, 3596234, 3497963, 3415855, 3347956, 3291982, 3245560, 3206009, 3170187, 3135199, 3099277, 3061789, 3022730, 2982704, 2943074, 2905458, 2871071, 2840898, 2816248, 2798434, 2787834, 2783708, 2784762, 2789248, 2794405, 2796550, 2792269, 2779564, 2757905, 2727618, 2689518, 2645000, 2596221, 2545936, 2496838, 2450757, 2408499, 2370481, 2337360, 2309969, 2288906, 2274359, 2266149, 2263854, 2267253, 2276918, 2294119, 2319930, 2354550, 2397395]
59814B397395M9831N4799N7477N8849O0398O2574O4802O6781O8498O8937O6039
59803C076380N8550M7117L3397J9081N932m454j1587j5921j7487j5793j1294n574
59791C158347O50Q352J8266K9520M1205N4035O9026Q5668J03020J21853J44078
59780C834020J70446K00303K33270K69635L08934L49204L87326M18541M35369
59771F607048M28444L89917L17080K14323R3108l0520j40871k27467k86564l19386
59761G045112l29962l23798l06459k82094k53338k22435j91681j62590j35403
59752D837352j09773q5541o2888m2143k3513o588R701K6128M2389N7835P2697
59741D715656Q7890J03810J20146J36809J54229J72695J92235K13132K35851K60452
$$ y = [2397395, 2447226, 2502025, 2559502, 2618351, 2678749, 2741323, 2806125, 2872906, 2941404, 3010341, 3076380, 3134930, 3182047, 3215444, 3234525, 3240457, 3236003, 3224416, 3208495, 3191008, 3175215, 3163921, 3158347, 3158997, 3167349, 3185615, 3215135, 3256340, 3310375, 3379401, 3465069, 3568089, 3689942, 3834020, 4004466, 4204769, 4438039, 4707674, 5016608, 5365812, 5753138, 6171679, 6607048, 7035492, 7425409, 7742489, 7956812, 8049920, 8019400, 7878529, 7651062, 7364498, 7045112, 6715150, 6391352, 6084893, 5802799, 5549461, 5327026, 5135345, 4972755, 4837352, 4727579, 4642038, 4579150, 4537007, 4513494, 4506906, 4516607, 4542735, 4585124, 4642959, 4715656, 4803546, 4907356, 5027502, 5164311, 5318540, 5491235, 5683470, 5896602, 6132453, 6392905]
59731F392905K86841L15509L47128L81406M17379M54865M94459N35535N75303
59722A0201330O10311O38059O56560O63439O56666O36029O03320N61643N15264
59713A5742621M69698M30738M02888L88696L89093M03626M30342M65956N06328
59704A9629986N46765N82115O07140O17014O07675N76210N21619M45369L51150
59695B4485043K44235J31196J9631q2967j70760k40183k89254l16888l23124l09546
59685B3147383k78774k33329j75185j06324k9066N4652J44088K39332L40102M45290
59675B3548169N53489O63123P71438Q73574R62941J032075J072652J075161J029908
59666C1582530R29546P71518N59364L03154J9182k71876n48572p92469r90314
$$ y = [6392905, 6679746, 6995255, 7342383, 7723789, 8141168, 8596033, 9090492, 9626027, 10201330, 10811641, 11449700, 12106260, 12769699, 13426365, 14062394, 14665714, 15227357, 15742621, 16212319, 16643057, 17045945, 17434641, 17823734, 18227360, 18657702, 19123658, 19629986, 20176751, 20758866, 21366006, 21983020, 22590695, 23166905, 23688524, 24133893, 24485043, 24729278, 24860474, 24880105, 24797138, 24626378, 24386195, 24096941, 23780053, 23456929, 23147383, 22868609, 22635280, 22460095, 22353771, 22324705, 22379357, 22523445, 22762777, 23102879, 23548169, 24101658, 24764781, 25536219, 26409793, 27372734, 28404809, 29477461, 30552622, 31582530, 32512076, 33283594, 33842958, 34146112, 34165294, 33893418, 33344846, 32552377, 31562063]
59657C1562063j134462j222629j257592j246246j197748j121622j027119r23949
59649B2430696q23199p37004o76733o50342o59854o99889p58329q19503q68876
59640A5736967q96934r00623q82208q46743p99588p45180o87097o28426n71496
59631H778672n17432m66554m19298l76360l37921l03252k71439k42210k15781
59622E628425j92185j71004j51615j33405j16009r9526q4528p1577o0807n2018
59612D495751m5080m0208l7950l8838m2857m9168n6580o4282p1970p9371q5931
59601C883516r0909r3602r3579r1138q7333q3137p8590p3220o7038o0532n3817
59590C010621m6611l8980l1393k3977j6562r508l525J552O762J2429J7509K1018
$$ y = [31562063, 30427601, 29204972, 27947380, 26701134, 25503386, 24381764, 23354645, 22430696, 21607497, 20870493, 20193760, 19543418, 18883564, 18183675, 17425346, 16605843, 15736967, 14840033, 13939410, 13057202, 12210459, 11410871, 10665691, 9978594, 9350168, 8778672, 8261240, 7794686, 7375388, 6999028, 6661107, 6357855, 6086416, 5844206, 5628425, 5436240, 5265236, 5113621, 4980216, 4864207, 4764681, 4680153, 4608576, 4547769, 4495751, 4450671, 4410463, 4372513, 4333675, 4290818, 4241650, 4185070, 4120788, 4048818, 3969447, 3883516, 3792607, 3699005, 3605426, 3514288, 3426955, 3343818, 3265228, 3192008, 3124970, 3064438, 3010621, 2964010, 2925030, 2893637, 2869660, 2853098, 2843590, 2840065, 2841617, 2848379, 2860808, 2878317, 2899335]
59578B899335K3221K4809K5805K5935K5358K4302K2729K1027K0318K1303K3509
59567C157651K6415L0490L6212M2868M9500N6396O4467P3641Q3171R3121J04186
59556C818118J16258J28604J41479J56174J73133J91156K08888K26131K43208
59547E403149K59790K74828K87094K95466K99255K98562K93985K85799K73827
59538G971755K58263K40273K21529K03191J85029J65268J41887J14959Q7617O4169
59528I653940M7221L7013L2927L4626M1918N4585P2419R4440J17799J38300J52185
59517A0477373J56901J50348J30706R7642N3025k23n9536j22754j87371k50282
59507A0445829l08082l57510l96172m23191m39050m44635m40668m28072m08347
$$ y = [2899335, 2922556, 2947365, 2973170, 2999105, 3024463, 3048765, 3071494, 3092521, 3112839, 3134142, 3157651, 3184066, 3214556, 3250768, 3293636, 3343136, 3399532, 3463999, 3537640, 3620811, 3713932, 3818118, 3934376, 4062980, 4204459, 4360633, 4533766, 4724922, 4933810, 5159941, 5403149, 5662939, 5937767, 6224861, 6520327, 6819582, 7118144, 7412129, 7697928, 7971755, 8230018, 8470291, 8691820, 8895011, 9080040, 9245308, 9387195, 9502154, 9589771, 9653940, 9701161, 9738174, 9771101, 9805727, 9847645, 9902230, 9974649, 10069089, 10186888, 10325188, 10477373, 10634274, 10784622, 10915328, 11012970, 11065995, 11065772, 11006236, 10883482, 10696111, 10445829, 10137747, 9780237, 9384065, 8960874, 8521824, 8077189, 7636521, 7208449, 6800102]
59498F800102l83398l55151l25313k95093k65171k36121k08746j83633j60547
59489D386929j38844j18323r9289q1857o5718n0419l5361j9831l647J2432K7677
59478C813749M2561N8177P4700R1454J08369J26234J45258J64408J82676K00192
59468E007778K17511K34346K49351K60687K66489K65299K56279K38788K11887
59459G208415J74992J29149P7044K1600l4861r0115j41674j87250k25197k54422
59449F677681k74590k86531k91678k90867k84412k73369k59699k44853k29030
59440D242652k12251j95254j78838j63080j47867j33540j20407j08174r6477q5516
59430B801248p5636o6628n7974m9430m1092l3163k5942j9647j4073q800l860M01
$$ y = [6800102, 6416704, 6061553, 5736240, 5441147, 5175976, 4939855, 4731109, 4547476, 4386929, 4248085, 4129762, 4030473, 3948616, 3882898, 3832479, 3797118, 3777287, 3773640, 3786072, 3813749, 3856310, 3914487, 3989187, 4080641, 4189010, 4315244, 4460502, 4624910, 4807586, 5007778, 5225289, 5459635, 5708986, 5969673, 6236162, 6501461, 6757740, 6996528, 7208415, 7383407, 7512556, 7589600, 7611200, 7576339, 7486224, 7344550, 7157300, 6932103, 6677681, 6403091, 6116560, 5824882, 5534015, 5249603, 4976234, 4716535, 4471682, 4242652, 4030401, 3835147, 3656309, 3493229, 3345362, 3211822, 3091415, 2983241, 2886764, 2801248, 2725612, 2658984, 2601010, 2551580, 2510488, 2477325, 2451383, 2431736, 2417663, 2408863, 2405003, 2405404]
59418B405404M150Q002J1970J5332J7824K0246K3503K7841L3114L8639M2278M1138
59406B689441L4524K5586J8972J7208J9990K6129L4789M5305N7110O9950Q3149
59395C122153R4641J01939J04649J05578J09007J17943J32909J52641J75635K01216
59385D418311K29536K60858K95136L32170L71627M12701M54168M94883N33474
59376G802864N67182N91720O03160N99915N82747N53512N14587M68915M19561
59367A2704163L69114L19878K74202K33675J98069J65627J34422J02947O9670
59358A4571767L2889q660n5303j06388j60069k13161k61797l02652l33654l53907
59348A2809065l63763l65148l61288l55647l50975l49037l50627l55539l62715
$$ y = [2405404, 2409554, 2417556, 2429526, 2444858, 2462682, 2482928, 2506431, 2534272, 2567386, 2606025, 2648303, 2689441, 2723965, 2749551, 2768523, 2785731, 2805721, 2831850, 2866639, 2911944, 2969054, 3039004, 3122153, 3216794, 3318733, 3423382, 3528960, 3637967, 3755910, 3888819, 4041460, 4217095, 4418311, 4647847, 4908705, 5203841, 5536011, 5907638, 6320339, 6774507, 7269390, 7802864, 8370046, 8961766, 9564926, 10164841, 10747588, 11301100, 11815687, 12284602, 12704163, 13073277, 13393155, 13667357, 13901032, 14099101, 14264728, 14399150, 14502097, 14571767, 14604656, 14595996, 14540693, 14434305, 14274236, 14061075, 13799278, 13496626, 13162972, 12809065, 12445302, 12080154, 11718866, 11363219, 11012244, 10663207, 10312580, 9957041, 9594326]
59339I594326l70694l77899l82661l83368l78973l69495l55909l39410l20601
59330F315316k99489k76282k51983k27868k04524j81807j59738j38913j19885
59321D454827j02601q6660p1741n7532m3704l0294j7819o621L715J4027K4812
59310D080409L5895M6606N6099O3880P0138P5304P9084Q0391P8452P3568O6535
59299D806361N7747M7296L5565K3242J0941q60j1652k0965k8403l3468l5621l4743
59287D815440l1230k5447j7442p381M239J7093L1261M6626O2432P7957R3204J08427
59275E175179J23184J36319J46618J53139J55236J52696J45751J34585J19108
59266F441815R9619P7354N3784K9458M036k2386m8270p0948q7879r7813j01041
$$ y = [9594326, 9223632, 8845733, 8463072, 8079704, 7700731, 7331236, 6975327, 6635917, 6315316, 6015827, 5739545, 5487562, 5259694, 5055170, 4873363, 4713625, 4574712, 4454827, 4352226, 4265566, 4193825, 4136293, 4092589, 4062295, 4044476, 4037855, 4041570, 4055597, 4080409, 4116304, 4162910, 4219009, 4282889, 4353027, 4428331, 4507415, 4587806, 4666258, 4739826, 4806361, 4864108, 4911404, 4946969, 4970211, 4981152, 4980292, 4968640, 4947675, 4919272, 4885804, 4850183, 4815440, 4784210, 4758763, 4741321, 4733940, 4738179, 4755272, 4786533, 4833159, 4895591, 4973548, 5066752, 5175179, 5298363, 5434682, 5581300, 5734439, 5889675, 6042371, 6188122, 6322707, 6441815, 6541434, 6618788, 6672572, 6702030, 6706066, 6683680, 6635410, 6564462, 6476583, 6378770, 6277729]
59255F277729r8718r2131q2825p2986o4771n8986n5017n2238n0873n1199n2732
59244E545253n4798n7194n9626o1015o0212n7054n1911m4527l4152k0691m849
59233E039224J2973L3229N6547Q3004J12323J44253J78509K14547K51590K88739
59223F414938L24805L57934L85299M03304M08475L98359L71716L28224K68724
59214I661778J95679J12624K2903p0526j63798k51524l28254l90287m35851m64320
59204G888424m76151m73351m59162m37010m09773l79619l48022l16094k85056
59195D304186k56069k29471k04792j81819j61117j43107j27375j13390j01230
59186B785816r0931q1752p2874o4350n6584m9372m2315l5648k9773k4367j8934
$$ y = [6277729, 6179011, 6086880, 6004055, 5931069, 5866298, 5807312, 5752295, 5700057, 5649184, 5597985, 5545253, 5490455, 5433261, 5373635, 5312620, 5252408, 5195354, 5143443, 5098916, 5064764, 5044073, 5039224, 5052197, 5085426, 5141973, 5224977, 5337300, 5481553, 5660062, 5874609, 6126199, 6414938, 6739743, 7097677, 7482976, 7886280, 8294755, 8693114, 9064830, 9393054, 9661778, 9857457, 9970081, 9992984, 9922458, 9758660, 9507136, 9178882, 8788595, 8352744, 7888424, 7412273, 6938922, 6479760, 6042750, 5632977, 5253358, 4905336, 4589242, 4304186, 4048117, 3818646, 3613854, 3432035, 3270918, 3127811, 3000436, 2887046, 2785816, 2694885, 2613133, 2540259, 2475909, 2419325, 2369953, 2327638, 2291990, 2262217, 2237850, 2218916]
59175B218916j3866r874o595k884J563N991R999J4080J8557K2953K6833L0417
59163B316090L4015L7561M1040M4789M8994N3433N8016O3028O8538P4055P9077
59152B918636Q3613Q7841R1667R4807R6995R7772R6439R2517Q6139P7822O8062
59141C892310N7150M5126L1844J7434K809j0650k2065l1434l8873m3888m5837
59130C853926m4934m2314l8946l4698k8635k0177r712J907J4158K6950M0252N4007
59118C771784O8300Q3138R8060J12424J26204J40039J54359J68929J83397J97822
59108E104456K12326K26533K39579K50246K56914K57815K51547K37062K13332
59099G249810J79900J38116R1109M2044p036n4444r7993j35834j67548j93703
$$ y = [2218916, 2205050, 2195176, 2188581, 2185697, 2187260, 2193251, 2203250, 2217330, 2235887, 2258840, 2285673, 2316090, 2350105, 2387666, 2428706, 2473495, 2522489, 2575922, 2633938, 2696966, 2765504, 2839559, 2918636, 3002249, 3090090, 3181757, 3276564, 3373559, 3471331, 3567770, 3660287, 3746426, 3824248, 3892310, 3949460, 3994586, 4026430, 4043864, 4046673, 4036023, 4013958, 3982524, 3943651, 3899763, 3853926, 3808992, 3766678, 3727732, 3693034, 3664399, 3644222, 3634510, 3636417, 3650575, 3677525, 3717777, 3771784, 3840084, 3923222, 4021282, 4133706, 4259910, 4399949, 4554308, 4723237, 4906634, 5104456, 5316782, 5543315, 5782894, 6033140, 6290054, 6547869, 6799416, 7036478, 7249810, 7429710, 7567826, 7658935, 7700979, 7693943, 7639499, 7541506, 7405672, 7238124, 7044421]
59089G044421k14742k30971k43051k51607k56653k58122k56598k52843k47037
59080D832797k39288k30401k21256k11680k00974j89310j77701j66631j55734
59071C039822j44848j34458j24883j15858j07168r9078r1777q4947p8203p1624
59061A986978o5591o0297n5556n0942m6174m1443l7226l3661l0437k7426k4992
59050A513233k3379k2269k1372k0958k1277k1860k1986k1522k0792j9910j8718
59039A279190j7086j4815j1744q415o006m947m170k489j76J809L568O056R325
59026A230100J2224J3948J4870J5541J5714J4757J2485R315N883K756K87j350
59014A346530k041j797j015j42R45K723N056P204Q948J0741J2415J2851J1563
$$ y = [7044421, 6829679, 6598708, 6355657, 6104050, 5847397, 5589275, 5332677, 5079834, 4832797, 4593509, 4363108, 4141852, 3930172, 3729198, 3539888, 3362187, 3195556, 3039822, 2894974, 2760516, 2635633, 2519775, 2412607, 2313529, 2221752, 2136805, 2058602, 1986978, 1921387, 1861090, 1805534, 1754592, 1708418, 1666975, 1629749, 1596088, 1565651, 1538225, 1513233, 1489854, 1467585, 1446213, 1425255, 1403978, 1382118, 1360132, 1338610, 1317818, 1297908, 1279190, 1262104, 1247289, 1235545, 1227130, 1221124, 1216177, 1212007, 1209518, 1209342, 1211151, 1214719, 1220775, 1230100, 1242324, 1256272, 1271142, 1286683, 1302397, 1317154, 1329639, 1338954, 1344837, 1347593, 1347880, 1346530, 1344489, 1342692, 1341677, 1341535, 1342480, 1345203, 1350259, 1357463, 1366411, 1377152, 1389567, 1402418, 1413981]
59001A413981R540P651N430K452k92j793k827m756p255q798q886q186o907m748
58987A384606k249m69O54K123M047N434N898O216O974P955Q992J0298J1774J3027
58973A465280J4123J5398J6722J7941J9703K2586K5740K7823K8982L0344L1868
58962A716510L2391L1791L1241L1162L0738K9786K9354K9963L0867L1622L2831
58951B058256L4782L6799L8605M0960M4315M8121N2089N6833O2574O8492P3970
58940B615796P9471Q5617R2466J00012J08353J17000J25337J34049J44739J57762
58930C760602J71829J86143K01382K18209K36564K56983K80715L07745L36384
58921E956556L65889L97763M33297M71565N11100N51991N94661O37803O79090
$$ y = [1413981, 1423521, 1431172, 1436602, 1439054, 1438762, 1436969, 1434142, 1429386, 1422131, 1413333, 1404447, 1396261, 1389354, 1384606, 1382357, 1381888, 1382542, 1384665, 1388712, 1394146, 1400044, 1406260, 1413234, 1421189, 1430181, 1440479, 1452253, 1465280, 1479403, 1494801, 1511523, 1529464, 1549167, 1571753, 1597493, 1625316, 1654298, 1684642, 1716510, 1748901, 1780692, 1811933, 1843095, 1873833, 1903619, 1932973, 1962936, 1993803, 2025425, 2058256, 2093038, 2129837, 2168442, 2209402, 2253717, 2301838, 2353927, 2410760, 2473334, 2541826, 2615796, 2695267, 2780884, 2873350, 2973362, 3081715, 3198715, 3324052, 3458101, 3602840, 3760602, 3932431, 4118574, 4319956, 4538165, 4774729, 5031712, 5312427, 5620172, 5956556, 6322445, 6720208, 7153505, 7625070, 8136170, 8688161, 9282822, 9920625, 10599715]
58912A0599715P16827P49156P72412P81923P73982P45918O95002O18967N17737
58903A6971639L93979K52590J00406n4284k03348l40176m59624n57864o33256
58894A5470062o86658p19995p35060p34052p20096o96232o64603o27305n86962
58885I299099n45628n04091m63114m24355l89022l56732l26733k99386k75264
58876E714774k53873k34505k17490k03292j91082j79458j67979j56816j45656
58867C964623j34166j22908j12591j02963r3527q4681p6930o9730o2413n5580
58857C049134n0124m5454m0145l4090k8491k3850j9302j4028q187k304L375Q858
58845B795392J4333K0073K5989L1660L7173M3284N0223N7206O3794P0773P8837
$$ y = [10599715, 11316542, 12065698, 12838110, 13620033, 14394015, 15139933, 15834935, 16453902, 16971639, 17365618, 17618208, 17718614, 17664330, 17460982, 17120806, 16661182, 16103318, 15470062, 14783404, 14063409, 13328349, 12594297, 11874201, 11177969, 10513366, 9886061, 9299099, 8753471, 8249380, 7786266, 7361911, 6972889, 6616157, 6289424, 5990038, 5714774, 5460901, 5226396, 5008906, 4805614, 4614532, 4435074, 4267095, 4110279, 3964623, 3830457, 3707549, 3594958, 3491995, 3398468, 3313787, 3236857, 3167127, 3104714, 3049134, 2999010, 2953556, 2913411, 2879321, 2850830, 2826980, 2807678, 2793650, 2785463, 2783159, 2786534, 2795392, 2809725, 2829798, 2855787, 2887447, 2924620, 2967904, 3018127, 3075333, 3139127, 3209900, 3288737]
58834C288737Q7364R5544J03738J12579J21721J30830J40866J52799J65946J79278
58824D579402J93672K10952K31112K52538K74833K99509L27728L59137L93249
58815G122132M30293M70134N11686N53968N96582O38589O77786P11472P36967
58806A2449609P50923P48983P26852O81507O11460N16684L98883K61930J12105
58797A7258936m2197j92066l30445m52996n56532o37816o94941p29195p44142
58788A2878606p43090p28587p03761o72329o36999n99046n59670n20619m83104
58779G231401m47138m12424l79220l48065l19296k93092k69555k48598k30111
58770D283902k14071k00173j87612j75711j64397j53576j42620j31240j20341
$$ y = [3288737, 3376101, 3471645, 3575383, 3687962, 3809683, 3940513, 4081379, 4234178, 4400124, 4579402, 4773074, 4984026, 5215138, 5467676, 5742509, 6042018, 6369746, 6728883, 7122132, 7552425, 8022559, 8534245, 9088213, 9684795, 10323384, 11001170, 11712642, 12449609, 13200532, 13949515, 14676367, 15357874, 15969334, 16486018, 16884901, 17146831, 17258936, 17216739, 17024673, 16694228, 16241232, 15684700, 15046884, 14351943, 13622748, 12878606, 12135516, 11406929, 10703168, 10030839, 9393840, 8794794, 8235124, 7714505, 7231401, 6784263, 6371839, 5992619, 5644554, 5325258, 5032166, 4762611, 4514013, 4283902, 4069831, 3869658, 3682046, 3506335, 3341938, 3188362, 3045742, 2914502, 2794161]
58761B794161j11095j03399r6126q8533q0632p2555o4561n7367n1500m6482m1473
58750A980438l6587l2613k9689k7138k4476k1772j9217j7074j5762j5224j4598
58739A726288j3299j2004j1642j1979j2270j2770j4255j6301j7453j7144j6350
58728A570821j6199j6910j8155j9579k0852k1976k3464k5641k7943k9543l0385
58717A320174l0900l1153l0993l0592l0009k8765k6691k4576k3071k1628j9581
58706A022215j7550j6551j6283j5659j4423j2993j1313r333p978q065q814q992
58694H74261q960r710j0502r563o954m587l297k040j89J406K151K624L037K505
58680H30182N14k200m813p082q515q351o914n515m584l278j440l23o08j196r38
$$ y = [2794161, 2683066, 2579667, 2483541, 2395008, 2314376, 2241821, 2177260, 2119893, 2068393, 2021911, 1980438, 1943851, 1911238, 1881549, 1854411, 1829935, 1808163, 1788946, 1771872, 1756110, 1740886, 1726288, 1712989, 1700985, 1689343, 1677364, 1665094, 1652324, 1638069, 1621768, 1604315, 1587171, 1570821, 1554622, 1537712, 1519557, 1499978, 1479126, 1457150, 1433686, 1408045, 1380102, 1350559, 1320174, 1289274, 1258121, 1227128, 1196536, 1166527, 1137762, 1111071, 1086495, 1063424, 1041796, 1022215, 1004665, 988114, 971831, 956172, 941749, 928756, 917443, 908110, 900132, 892067, 883253, 874261, 865301, 855591, 845089, 835526, 828572, 823985, 820688, 818648, 818459, 819865, 822016, 824640, 827677, 830182, 830696, 828496, 823683, 816601, 808086, 799735, 792821, 787306, 782722, 779444, 778004, 777681, 777073, 775877, 774939]
58665G74939k32O8K26J062K553L932M543M010K203l66k636l895m168l578k070
58650G76591M0K060L684N164O634P962R257J0749J2210J3301J4351J5873J7575
58637H95451J8958K0548K3219K6499K9044L0768L2950L6183L9733M3157M7002
58626A243512N1639N6866O2935P0500P9200Q7889R6617J06860J19330J33207J48005
58615B256560J64358J82211J99817K15518K28941K39325K44056K40149K26275
58606D197210K02449J68802J25915P5717K1317l3567q4646j27889j61246j85078
58596D198984k00444k07966k08630k04384j96990j87189j75567j63255j51042
58587B503517j38741j26146j13759j02024r0762p9970p0185o1492n3220m5260
$$ y = [774939, 774707, 774775, 775001, 776063, 778616, 782548, 787091, 791101, 793304, 792938, 790302, 786407, 782239, 778661, 776591, 776631, 778691, 782375, 787539, 794173, 802135, 811392, 822141, 834351, 847652, 862003, 877876, 895451, 914409, 934957, 958176, 984675, 1013719, 1044487, 1077437, 1113620, 1153353, 1196510, 1243512, 1295151, 1352017, 1414952, 1485452, 1564652, 1652541, 1749158, 1856018, 1975348, 2108555, 2256560, 2420918, 2603129, 2802946, 3018464, 3247405, 3486730, 3730786, 3970935, 4197210, 4399659, 4568461, 4694376, 4770093, 4791410, 4757843, 4673197, 4545308, 4384062, 4198984, 3998540, 3790574, 3581944, 3377560, 3180570, 2993381, 2817814, 2654559, 2503517, 2364776, 2238630, 2124871, 2022847, 1932085, 1852115, 1781930, 1720438, 1667218, 1621958]
58577A621958l8543l3512k9226k4902k1253j9220j8311j7357j6349j6329j7727
58566A369229j9727k1173k1571k1268k1082k1617k2674k3570k4022k4374k4940
58555A123211k5592k5975k5658k4344k2341k0454j8819j6522j3258j0551r969
58544I09728j0755j0833r712q613q084p505o888p098q026q403p955p853q562r029
58530G90412q637q187q254q185p487o854o962p555q199q811r050q484p579p199
58516F78969p009n984m537m200n012n261m166k842k091j372m90j58k56L78J722
58501F37691K350K060K351L497L748K536J854K960M265M126L521L990M986N255
58487F85190N109N330N343M348K970K174J742J255J222J883K317J990J676J765
$$ y = [1621958, 1583415, 1549903, 1520677, 1495775, 1474522, 1455302, 1436991, 1419634, 1403285, 1386956, 1369229, 1349502, 1328329, 1306758, 1285490, 1264408, 1242791, 1220117, 1196547, 1172525, 1148151, 1123211, 1097619, 1071644, 1045986, 1021642, 999301, 978847, 960028, 943506, 930248, 919697, 909728, 898973, 888140, 878428, 869815, 861731, 854226, 847338, 840240, 832214, 823811, 815856, 808003, 799441, 790412, 781775, 773588, 765334, 757149, 749662, 742808, 735846, 728291, 720092, 711281, 702231, 693747, 686168, 678969, 671960, 665976, 661439, 657239, 652227, 646966, 642800, 639958, 637867, 636495, 636005, 635847, 635591, 635969, 637691, 640041, 642101, 644452, 647949, 651697, 654233, 656087, 659047, 663312, 667438, 670959, 674949, 679935, 685190, 690299, 695629, 700972, 705320, 708290, 710464, 712206, 713461, 714683, 716566, 718883, 720873, 722549, 724314]
58473G24314J256l09j778k495l552n569p207p465p362p748p534n932m358m050
58459F60211l788k188m07k25j081j335j032j097j157m48L36K48j37m6k41j412
58443F46201k306j647m20j04o1J035K646L567M267N574O400N410L698L175L374
58428F80809K532R46M33J220J918K137K592L105K893K381K622L312L464L435M271
58413G18070N562O008N591N267N109M575L985M001M339M546N069O031O139M592
58399G88884K731J940J337l18k016k076r75j90M17J629K537J897O87P13J675K123
58383H00995K249L107M067L700K392J565J293J009J483L506N732O392O107O530
58369H50127P440P816Q347J0003J1438J0823R110Q446Q611Q087P313P625Q119
$$ y = [724314, 725570, 725261, 723483, 720988, 717436, 711867, 704660, 697195, 689833, 682085, 674551, 668619, 664261, 660211, 656423, 654235, 653828, 653603, 652522, 651187, 650155, 649058, 647901, 647453, 647789, 648037, 647900, 647854, 647613, 646201, 643895, 642248, 641828, 641724, 641663, 642698, 645344, 648911, 653178, 658752, 665152, 670562, 674260, 677435, 680809, 683341, 684287, 684720, 685940, 687858, 689995, 692587, 695692, 698585, 700966, 703588, 706900, 710364, 713799, 718070, 723632, 729640, 735231, 740498, 745607, 750182, 754167, 758168, 762507, 767053, 772122, 778153, 784292, 788884, 791615, 793555, 794892, 794574, 792558, 790482, 789507, 789317, 789734, 791363, 793900, 795797, 796484, 797197, 798872, 800995, 803244, 806351, 810418, 814118, 816510, 818075, 819368, 820377, 821860, 825366, 831098, 837490, 843597, 850127, 857567, 865383, 873730, 883733, 895171, 905994, 915104, 923550, 932161, 940248, 947561, 955186, 963305]
58356I63305P050N380N452P043Q031Q163Q733R459R018P956P664P395N656L579
58342A063884L312M090L605K379K867M975O438O985Q190R812J0229J0010J1110
58329A147886J2941J3187J2088J1983J3066J3535J3414J4229J5434J5215J4369
58318A297347J5205J7185J7818J7281J7772J8948J8596J7205J7110J7668J6199
58307A488334J3366J2496J3800J4381J3786J4337J6008J6435J6038J7652K0766
58296A657399K1754K0314J9997K1802K2797K2003K1980K3515K4199K3461K3783
58285A903004K5754K7027K7130K8237L0426L1423L1663L4186L8803M1975M3090
58274B262718M5106M8403N0013M9671N0498N2802N3516N2571N3346N5929N6543
$$ y = [963305, 970355, 975735, 981187, 988230, 996261, 1004424, 1013157, 1022616, 1031634, 1039590, 1047254, 1054649, 1060305, 1063884, 1067196, 1071286, 1074891, 1077270, 1080137, 1085112, 1091550, 1098535, 1106725, 1116537, 1126766, 1136776, 1147886, 1160827, 1174014, 1186102, 1198085, 1211151, 1224686, 1238100, 1252329, 1267763, 1282978, 1297347, 1312552, 1329737, 1347555, 1364836, 1382608, 1401556, 1420152, 1437357, 1454467, 1472135, 1488334, 1501700, 1514196, 1527996, 1542377, 1556163, 1570500, 1586508, 1602943, 1618981, 1636633, 1657399, 1679153, 1699467, 1719464, 1741266, 1764063, 1786066, 1808046, 1831561, 1855760, 1879221, 1903004, 1928758, 1955785, 1982915, 2011152, 2041578, 2073001, 2104664, 2138850, 2177653, 2219628, 2262718, 2307824, 2356227, 2406240, 2455911, 2506409, 2559211, 2612727, 2665298, 2718644, 2774573, 2831116]
58263B831116N4735N4341N6350N7673N7966O0437O4780O6872O6673O8766P3763
58252C513472P7250P8502Q1884Q8013R2319R4172R8445J05950J11509J13869J18147
58241D573532J26011J33091J38489J46804J58030J66107J70471J78105J90859
58232E981499K02171K09784K19862K34623K48331K59900K76573L00181L22975
58223H255899L42228L65376L95361M25218M52984M86967N30074N74606O19093
58214A2447806O73623P41607Q14041Q89220R79229J089264J211313J346823J513238
58205B1706164J719094J957696K235766K580948L009447L516614M111620M826401
58197D5663750N677157O660851P812033R222514J0991771J3218870J6064409J9736571
$$ y = [2831116, 2885851, 2940192, 2996542, 3054215, 3112181, 3172618, 3237398, 3304270, 3370943, 3439709, 3513472, 3590722, 3669224, 3751108, 3839121, 3931440, 4025612, 4124057, 4230007, 4341516, 4455385, 4573532, 4699543, 4832634, 4971123, 5117927, 5275957, 5442064, 5612535, 5790640, 5981499, 6183670, 6393454, 6613316, 6847939, 7096270, 7356170, 7632743, 7932924, 8255899, 8598127, 8963503, 9358864, 9784082, 10237066, 10724033, 11254107, 11828713, 12447806, 13121429, 13863036, 14677077, 15566297, 16545526, 17634790, 18846103, 20192926, 21706164, 23425258, 25382954, 27618720, 30199668, 33209115, 36725729, 40837349, 45663750, 51340907, 58001758, 65813791, 75036305, 86028076, 99246946, 115311355, 135047926]
58189A35047926K4358549K9878104L6001666M1852711M5458684M3966202L5221089
58182C91784931J9735413J062314j6100713k8464944l5244432l7427378l6515612
58175B58829579l3829186l0350823k6693037k3130900j9776147j6734793j4092447
58168I4222246j1847716r951198q374957p091620o032778n128947m359505l716550
58160C7718975l155775k631694k147062j717062j315356r04432m85936o5189M03873
58151B5700342R78738J663995K449109L351550M283353M865215M544069L050189
58143E0886560P30853j642987l409590m356467m636255m497913m133888l674773
58135B5265540l206940k768429k362945j993614j673583j408585j188971j003617
$$ y = [135047926, 159406475, 189284579, 225286245, 267138956, 312597640, 356563842, 391784931, 411520344, 412582658, 396481945, 368017001, 332772569, 295345191, 258829579, 225000393, 194649570, 167956533, 144825633, 125049486, 108314693, 94222246, 82374530, 72423332, 64048375, 56956755, 50923977, 45795030, 41435525, 37718975, 34563200, 31931506, 29784444, 28067382, 26752026, 25847594, 25361658, 25296469, 25700342, 26679080, 28343075, 30792184, 34143734, 38427087, 43292302, 47836371, 50886560, 51617413, 49974426, 46564836, 42208369, 37572114, 33074201, 28940313, 25265540, 22058600, 19290171, 16927226, 14933612, 13260029, 11851444, 10662473, 9658856]
58127I658856q49518p24300o20265n31532m59534m05824l64893l29463k98829
58118E074698k76324k61189k48235k34080k18835k02486j84120j64701j46652
58109C138076j30305j14092r8286q5430p6940p2293p1405p4328p8546q0119p8122
58098B178210p4852p1434o6701o0733n5681n2149m8332m3844m0857m0194l9634
58087A583799l7643l5530l4416l3213l1278l0063l0341l0572k9725k9055k9362
58076A232601k9198k7585k5869k5079k3944k1400j8673j6934j5262j2781j0668
58065A005208j0058j0002r302q443p993p118n322l831l657m182n015p037j0162
58052I13086j2290j2225j1458j1402j1048r211o962n800n357m797m660n320n511
$$ y = [9658856, 8809338, 8085038, 7464773, 6933241, 6473707, 6067883, 5702990, 5373527, 5074698, 4798374, 4537185, 4288950, 4054870, 3836035, 3633549, 3449429, 3284728, 3138076, 3007771, 2893679, 2795393, 2709963, 2633023, 2560730, 2489325, 2414997, 2336451, 2256332, 2178210, 2103358, 2031924, 1965223, 1904490, 1848809, 1796660, 1748328, 1704484, 1663627, 1623433, 1583799, 1546156, 1510626, 1476210, 1442997, 1411719, 1381656, 1351315, 1320743, 1291018, 1261963, 1232601, 1203403, 1175818, 1149949, 1124870, 1100926, 1079526, 1060853, 1043919, 1028657, 1015876, 1005208, 995150, 985148, 975846, 967403, 959410, 952292, 946970, 943139, 939482, 935300, 930285, 923248, 913086, 900796, 888571, 877113, 865711, 854663, 845452, 838490, 832690, 827333, 822536, 817876, 812556, 807045]
58039H07045m343l032k824k872k074j206j240j326m71L89M1q35j089j187j890
58024G83086k372j697q20j026j675j475p61n65o55l83k78r52j604j517j706l207
58008G62393m980n528n357n771o358n910m781m145l785k829j828j942k729k861
57994G03589k486k733l389l253k416k173k750l049k641k228k084j587n22M51P75
57979F73504N77K92M42J386K601K855J868J019J491K643L235L263L246K791J310
57964G02523m81j358j280j067q99m78p5j58n10q10j498k870m032l975l123k627
57948F77282k682k616k060r57Q59L096M756N395N751O293O224N058L821L362K741
57933G16323Q33j615l229m244n716p486q728r716j1153j2458j2572j1829j1177
$$ y = [807045, 802702, 799670, 796846, 793974, 791900, 790694, 789454, 788128, 787657, 788046, 788087, 787252, 786163, 784976, 783086, 780714, 779017, 778197, 777171, 775496, 774021, 773260, 772695, 772040, 771657, 771379, 770427, 768823, 767306, 765600, 762393, 757413, 751885, 746528, 740757, 734399, 728489, 723708, 719563, 715778, 712949, 711121, 709179, 706450, 703589, 701103, 698370, 694981, 691728, 689312, 687139, 684389, 681340, 678699, 676471, 674387, 672800, 672278, 672729, 673504, 674081, 674373, 674815, 676201, 678802, 681657, 683525, 684544, 686035, 688678, 691913, 695176, 698422, 701213, 702523, 702042, 700684, 699404, 698337, 697438, 696960, 696885, 696727, 696217, 695407, 693909, 691039, 687007, 683032, 679909, 677282, 674600, 671984, 669924, 668967, 669826, 672922, 677678, 683073, 688824, 695117, 701341, 706399, 710220, 713582, 716323, 717156, 715541, 712312, 708068, 702352, 694866, 686138, 676422, 665269, 652811, 640239, 628410, 617233]
57920F17233j0241p973m744j946l0J336J849J255Q12J921L804M668M813O187R027
57905F27971J1328J1864J1479J1014J0027Q267O558N514M815M261M115M036L142
57892G24391J503J78o02j783l621n030n322n261n603n896n558n041n067n404n228
57877F66656m252k942j964j618j592j234l11P17J565K666M289N758O444O851P699
57862F88732Q524Q430P615O853N958M292K411J478J269M61j137k329k587k690
57848G27280l027k949k220j642j723j933j822j625j383o63M36J124J173J221J496
57833G13743J367N91j28k97l56q58j763k922m337n698o529o968p529q073p979
57818F62264p390p065o964o262m958m114m113m045l250k233j522q58l0N85Q88
$$ y = [617233, 606992, 599019, 594275, 592329, 592299, 593635, 595484, 596739, 597551, 599472, 603276, 607944, 612757, 618944, 627971, 639299, 651163, 662642, 673656, 683683, 691950, 698508, 704022, 708837, 713098, 717213, 721249, 724391, 725894, 726072, 725470, 723687, 720066, 715036, 709714, 704453, 698850, 692954, 687396, 682355, 677288, 671884, 666656, 662404, 659462, 657498, 655880, 654288, 653054, 652743, 653460, 655025, 657691, 661980, 667738, 674182, 681033, 688732, 697256, 705686, 713301, 720154, 726112, 730404, 732815, 734293, 735562, 736023, 734886, 732557, 729970, 727280, 724253, 721304, 719084, 717442, 715719, 713786, 711964, 710339, 708956, 708293, 708729, 709853, 711026, 712247, 713743, 715110, 715701, 715573, 715276, 714920, 714062, 712299, 709377, 705040, 699342, 692813, 685845, 678316, 670243, 662264, 654874, 647809, 640845, 634583, 629625, 625511, 621398, 617353, 614103, 611870, 610348, 609490, 609460, 610045, 610933]
57803F10933J413K204K430J777J223J805L398N266O949Q174Q804R376J0896J3528
57789F88176J6181J7638J7326J4994J0950O842M771M813M751K943L32j264j670
57776G86783k097l176m484n526o220o679p069p380p047n437l019j275r69j250
57762G25155r57O6J344K624L668M065L904L951M523N005M968M957N418N783N444
57747G79918M939N136N824O061N560M916M683M883N192N159M580L953M157N290
57733H50251O430O830O759O746O768O695O799P251P734Q072Q631R556J0366J0805
57719I59693J1401J2477J3387J3504J3322J3844J5268J6938J8130J8456J8053
57708A124473J7838J8959K1349K3697K5264K6912K9593L2853L5793L8594M1995
$$ y = [610933, 612346, 614550, 616980, 618757, 619980, 621785, 625183, 630449, 637398, 645572, 654376, 663752, 674648, 688176, 704357, 721995, 739321, 754315, 765265, 772107, 776878, 781691, 786442, 789385, 789717, 788453, 786783, 784686, 781510, 777026, 771500, 765280, 758601, 751532, 744152, 737105, 731668, 728649, 727374, 726405, 725155, 724198, 724264, 725608, 728232, 731900, 735965, 739869, 743820, 748343, 753348, 758316, 763273, 768691, 774474, 779918, 784857, 789993, 795817, 801878, 807438, 812354, 817037, 821920, 827112, 832271, 836851, 840804, 844961, 850251, 856681, 863511, 870270, 877016, 883784, 890479, 897278, 904529, 912263, 920335, 928966, 938522, 948888, 959693, 971094, 983571, 996958, 1010462, 1023784, 1037628, 1052896, 1069834, 1087964, 1106420, 1124473, 1142311, 1161270, 1182619, 1206316, 1231580, 1258492, 1288085, 1320938, 1356731, 1395325, 1437320]
57697A437320M5910M9828N4065N9392O5699P2249P9145Q7468R7909J10126J23499
57686B282610J37828J53263J70015J88006K06354K23435K37816K48563K54198
57677D102088K52067K39652K16245J82980J42170R7641N4933J9570n113j8246
57667E283987k1017j8172j9408l6077p3798j27668j84865k31934k60700k69803
57657D040545k62852k45423k22618j97987j73563j50330j28763j09280r2258p7552
57647B379919o4512n2749m2484l3836k6188j8866j1957n862l87N097J0837J6799
57635B155811K3305L0840L9286M8024N6811O5894P5339Q4883R4611J05255J17585
57624B897644J31683J46739J61481J74884J86563J96088K01767K00708J90544
$$ y = [1437320, 1483230, 1533058, 1587123, 1646515, 1712214, 1784463, 1863608, 1951076, 2048985, 2159111, 2282610, 2420438, 2573701, 2743716, 2931722, 3138076, 3361511, 3599327, 3847890, 4102088, 4354155, 4593807, 4810052, 4993032, 5135202, 5232843, 5287776, 5307346, 5302233, 5283987, 5262970, 5244798, 5225390, 5189313, 5115515, 4987847, 4802982, 4571048, 4310348, 4040545, 3777693, 3532270, 3309652, 3111665, 2938102, 2787772, 2659009, 2549729, 2457471, 2379919, 2315407, 2262658, 2220174, 2186338, 2160150, 2141284, 2129327, 2123465, 2123078, 2128175, 2139012, 2155811, 2179116, 2209956, 2249242, 2297266, 2354077, 2419971, 2495310, 2580193, 2674804, 2780059, 2897644, 3029327, 3176066, 3337547, 3512431, 3698994, 3895082, 4096849, 4297557, 4488101]
57615D488101J70618J41313J03261N8082R240l9036q3534j22125j52809j74093
57605D399018j86330j91581j91828j87955j80395j69812j57158j43642j30681
57596B859636j19119j08499r7914q7524p8459p1147o4710n8240n1821m5981m0817
57585B035405l6094l1658k7406k3322j9785j7403j6220j5410j4029j1863r439
57574A812776p464o216n234l716j528M40J362J652K386L779N002N548N896O679
57560A821362P889R173J0401J1599J2796J4144J5816J7641J9239K0581K2018K3637
57548B006296K5105K6222K7322K8923L1281L4245L7346M0138M2828M6381N1494
57537B397581N7687O3950P0137P6975Q4866R3490J02699J12826J23879J35116
$$ y = [4488101, 4658719, 4800032, 4903293, 4961375, 4970615, 4931579, 4848045, 4725920, 4573111, 4399018, 4212688, 4021107, 3829279, 3641324, 3460929, 3291117, 3133959, 2990317, 2859636, 2740517, 2632018, 2534104, 2446580, 2368121, 2296974, 2232264, 2174024, 2122203, 2076222, 2035405, 1999311, 1967653, 1940247, 1916925, 1897140, 1879737, 1863517, 1848107, 1834078, 1822215, 1812776, 1805312, 1799096, 1793862, 1790146, 1788618, 1789058, 1790420, 1792072, 1794458, 1798237, 1803239, 1808787, 1814683, 1821362, 1829251, 1838424, 1848825, 1860424, 1873220, 1887364, 1903180, 1920821, 1940060, 1960641, 1982659, 2006296, 2031401, 2057623, 2084945, 2113868, 2145149, 2179394, 2216740, 2256878, 2299706, 2346087, 2397581, 2455268, 2519218, 2589355, 2666330, 2751196, 2844686, 2947385, 3060211, 3184090, 3319206]
57527C319206J45791J55573J63956J69770J71690J68589J59087J41502J15072
57518D710236Q1188M2946L666l3955o7796r6163j17895j32480j40074j41595j38614
57507C969464j32851j25499j16948j07182r6568q6232p7310o9745o2333n4302
57497C040494m6336l9537l3878k8422k2772j7313j2233p206k259K048N595R101
57485B847282J3144J7441K1441K5173K9019L3130L7479M2220M7564N3512N9914
57474C227319O6639P3615Q0939Q9016R8282J08663J19592J30581J41404J51615
57464D287665J60188J65683J66543J61258J48703J28482J00915O6963K8538j1298
57454E403640m9087q2055j08478j27514j39323j45062j45964j42548j35296j25677
$$ y = [3319206, 3464997, 3620570, 3784526, 3954296, 4125986, 4294575, 4453662, 4595164, 4710236, 4791424, 4834370, 4838036, 4804081, 4736285, 4640122, 4522227, 4389747, 4249673, 4108078, 3969464, 3836613, 3711114, 3594166, 3486984, 3390416, 3304184, 3226874, 3157129, 3094796, 3040494, 2994158, 2954621, 2920743, 2892321, 2869549, 2852236, 2840003, 2832797, 2830538, 2832586, 2838181, 2847282, 2860426, 2877867, 2899308, 2924481, 2953500, 2986630, 3024109, 3066329, 3113893, 3167405, 3227319, 3293958, 3367573, 3448512, 3537528, 3635810, 3744473, 3864065, 3994646, 4136050, 4287665, 4447853, 4613536, 4780079, 4941337, 5090040, 5218522, 5319437, 5386400, 5414938, 5403640, 5354553, 5272498, 5164020, 5036506, 4897183, 4752121, 4606157, 4463609, 4328313, 4202636]
57444D202636j15481j05327r4782q4032p4181o5703n7782m9701m1990l5561l0448
57433C447648k6049k1975j8150j4498j1046p981n320k888p70P78J986L465N281
57420C350481O860Q073R589J1729J3771J4902J5219J5284J5314J5308J5410J5630
57408C507570J5775J5967J6645J7635J8071J7716J7546J8315J9383J9782J9746
57397C704151K0213K1290K2203K2455K2204K1754K1399K1583K2427K3269K3342
57386C946290K2771K2283K2227K2466K2960K3715K4334K4318K3820K3507K3741
57375D202432K4350K5013K5411K5161K4274K3492K3608K4460K5185K5440K5746
57364D474572K6518K7324K7444K6901K6577K7237K8545K9376K9191K8704K8764
$$ y = [4202636, 4087155, 3981828, 3887046, 3803014, 3728833, 3663130, 3605348, 3555647, 3513657, 3478096, 3447648, 3421599, 3399624, 3381474, 3366976, 3355930, 3347949, 3342629, 3339741, 3338971, 3339749, 3341735, 3345200, 3350481, 3357341, 3365414, 3375003, 3386732, 3400503, 3415405, 3430624, 3445908, 3461222, 3476530, 3491940, 3507570, 3523345, 3539312, 3555957, 3573592, 3591663, 3609379, 3626925, 3645240, 3664623, 3684405, 3704151, 3724364, 3745654, 3767857, 3790312, 3812516, 3834270, 3855669, 3877252, 3899679, 3922948, 3946290, 3969061, 3991344, 4013571, 4036037, 4058997, 4082712, 4107046, 4131364, 4155184, 4178691, 4202432, 4226782, 4251795, 4277206, 4302367, 4326641, 4350133, 4373741, 4398201, 4423386, 4448826, 4474572, 4501090, 4528414, 4555858, 4582759, 4609336, 4636573, 4665118, 4694494, 4723685, 4752389, 4781153]
57353D781153K9002K8497K7502K7355K8411K9397K9349K9044K9547L0405L0402
57342E100064K9410K8317K7681K7510K8009K9311L0765L1490L1455L1209L0864
57331E426085L0321L0033L0415L0813L0331K9402K9234K9846L0138K9942L0375
57320E756935L1756L2740L2271L1090L0443L0387L0398L0745L1988L3679L4729
57309F107161L4852L4733L4870L5120L5377L5902L6728L7366L7462L7407L7855
57298F504833L8817L9590L9743L9840M0800M2552M3925M4114M3808M4286M5705
57287F968013M7054M7706M8220M9331N0832N1925N2214N1928N1411N0811N0120
57276G519565M9113M7318M4270L9902L4566K8752K2875J7223J1971P233L100l39
$$ y = [4781153, 4810155, 4838652, 4866154, 4893509, 4921920, 4951317, 4980666, 5009710, 5039257, 5069662, 5100064, 5129474, 5157791, 5185472, 5212982, 5240991, 5270302, 5301067, 5332557, 5364012, 5395221, 5426085, 5456406, 5486439, 5516854, 5547667, 5577998, 5607400, 5636634, 5666480, 5696618, 5726560, 5756935, 5788691, 5821431, 5853702, 5884792, 5915235, 5945622, 5976020, 6006765, 6038753, 6072432, 6107161, 6142013, 6176746, 6211616, 6246736, 6282113, 6318015, 6354743, 6392109, 6429571, 6466978, 6504833, 6543650, 6583240, 6622983, 6662823, 6703623, 6746175, 6790100, 6834214, 6878022, 6922308, 6968013, 7015067, 7062773, 7110993, 7160324, 7211156, 7263081, 7315295, 7367223, 7418634, 7469445, 7519565, 7568678, 7615996, 7660266, 7700168, 7734734, 7763486, 7786361, 7803584, 7815555, 7822788, 7825888, 7825549]
57264G825549k948m506m836m117k949j844p13R77L499O479R232J1406J3191J4955
57250G863375J6778J8442J9889K1323K2737K3663K3805K3647K3874K4352K4425
57239H106310K4052K3891K4087K3931K3104K2302K2051K1709K0362J8168J5987
57228H345954J4176J2508J0858R245P492N574L983L090K460J476L25m14q02j402
57214H414523k254k752k452j359L83K508M527O227Q082J0503J3003J4798J5916
57201H481653J7009J8291J9407K0123K0363J9805J8245J6148J4134J2148R904
57190H667230P720O069M659K921J111j39j035k308l841m847n204n451n601n239
57176H656045m828n486p348r351j0918j2576j4604j6290j6957j6717j5774j3990
$$ y = [7825549, 7822601, 7818095, 7813259, 7809142, 7806193, 7804349, 7803636, 7804613, 7808112, 7814591, 7823823, 7835229, 7848420, 7863375, 7880153, 7898595, 7918484, 7939807, 7962544, 7986207, 8010012, 8033659, 8057533, 8081885, 8106310, 8130362, 8154253, 8178340, 8202271, 8225375, 8247677, 8269728, 8291437, 8311799, 8329967, 8345954, 8360130, 8372638, 8383496, 8392741, 8400233, 8405807, 8409790, 8412880, 8415340, 8416816, 8417141, 8416727, 8415925, 8414523, 8412269, 8409517, 8407065, 8405706, 8406089, 8408597, 8413124, 8419351, 8427433, 8437936, 8450939, 8465737, 8481653, 8498662, 8516953, 8536360, 8556483, 8576846, 8596651, 8614896, 8631044, 8645178, 8657326, 8667230, 8674950, 8681019, 8685678, 8688599, 8689710, 8689571, 8688536, 8686228, 8682387, 8677540, 8672336, 8666885, 8661284, 8656045, 8651217, 8645731, 8638383, 8629032, 8618114, 8605538, 8590934, 8574644, 8557687, 8540970, 8525196, 8511206]
57164H511206j1562r217p391o027n329n677o694p474p913q711r872j0570j0727
57151H404042j1340j2811j4394j5834j8039k1365k4673k7008k9010l1655l4856
57140H163057l8296m2542m8136n4431o0480o6247p1786p6019p7571p6369p3393
57129G477787o9348o4544n9546n4857n0175m4813l8736l2663k7611k4958k6258
57118F984278l2067m0970n0246n7319o0404n8553n1784m0986k7370j2260K912
57107F555231J7387L2056M8744O8510R1834J20554J58133K07500K69857L45890
57097G915696M36518N41962O61854P97088R49896J121346J310569J516907J739987
57088A6991823J975435K211720K431745K614996K737920K777535K719014K557129
$$ y = [8511206, 8499644, 8490427, 8483036, 8477009, 8471680, 8466003, 8459309, 8451835, 8443922, 8435211, 8425339, 8414769, 8404042, 8392702, 8379891, 8365497, 8349663, 8331624, 8310259, 8285586, 8258578, 8229568, 8197913, 8163057, 8124761, 8082219, 8034083, 7979652, 7919172, 7852925, 7781139, 7705120, 7627549, 7551180, 7477787, 7408439, 7343895, 7284349, 7229492, 7179317, 7134504, 7095768, 7063105, 7035494, 7010536, 6984278, 6952211, 6911241, 6860995, 6803676, 6743272, 6684719, 6632935, 6591949, 6564579, 6552319, 6555231, 6572618, 6604674, 6653418, 6721928, 6813762, 6934316, 7092449, 7299949, 7569806, 7915696, 8352214, 8894176, 9556030, 10353118, 11303014, 12424360, 13734929, 15251836, 16991823, 18967258, 21178978, 23610723, 26225719, 28963639, 31741174, 34460188, 37017317]
57080C7017317K287624J903169J406620Q27322K15540l82176r36990j427084j823899
57071C9087443k099558k247787k291886k270989k219881k158216k090578k012069
57063B1696479j915921j800019j668505j528530j386704j248502j118989j002222
57055A0027087q99749q10226p30807o58967n93411n33707m79541m30480l86281
57046D503918l46977l12548k82623k56458k33059k11582j91922j74568j59578
57037B334603j46089j33350j21724j11891j03469r5396q7456q0387p4452o8898
57027A311491o3016n6895n1023m5869m1871l8989l6288l2842k9032k6044k4050
57016H65572k1958j9109j6091j3584j1408r136o836m748k832q76J531M940R296
$$ y = [37017317, 39304941, 41208110, 42614730, 43442052, 43657592, 43275416, 42338426, 40911342, 39087443, 36987885, 34740098, 32448212, 30177223, 27957342, 25799126, 23708548, 21696479, 19780558, 17980539, 16312034, 14783504, 13396800, 12148298, 11029309, 10027087, 9127338, 8317112, 7586305, 6927338, 6333927, 5800220, 5320679, 4890199, 4503918, 4156941, 3844393, 3561770, 3305312, 3072253, 2860671, 2668749, 2494181, 2334603, 2188514, 2055164, 1933440, 1821549, 1718080, 1622684, 1535228, 1454841, 1380389, 1311491, 1248475, 1191580, 1140557, 1094688, 1052817, 1013828, 977540, 944698, 915666, 889622, 865572, 843614, 824505, 808414, 794830, 783422, 774286, 767450, 762702, 759870, 758994, 760525, 765465, 774761]
57003G74761J3586J7289K1751K8741L8066M8488O0861P8122J01940J31660J66218
56992A481483K02447K28913K26004J79089R3452o269r2521j50165j78377j83687
56982A800369j74372j58505j42243j28117j15746j04489r4591q6050p7859o9082
56972F49315n9953n1243m2982l4674k6527j9626j4552j0575o661k668J049M669
56960C85572Q699J3005J7053K0907K4800K7537K6541K0317J0258n10r565j6019
56948E28595j9808k1223k0960j9844j8279j6219j3626j0652p585m770k430l53
56936C72846K042N067Q570J2493J7286K3230K9369L3396L2716K5953J3921n69
56924E76320j4146k4401l0395l2347l1337k9003k6588k4166k1244j7965j4994
$$ y = [774761, 788347, 805636, 827387, 856128, 894194, 942682, 1003543, 1081665, 1183605, 1315265, 1481483, 1683930, 1912843, 2138847, 2317936, 2411388, 2405119, 2312598, 2162433, 1984056, 1800369, 1625997, 1467492, 1325249, 1197132, 1081386, 976897, 882306, 796256, 718397, 649315, 589362, 538119, 495137, 460463, 433936, 414310, 399758, 389183, 382522, 379854, 380903, 385572, 394271, 407276, 424329, 445236, 470036, 497573, 524114, 544431, 554689, 554179, 544614, 528595, 508787, 487564, 466604, 446760, 428481, 412262, 398636, 387984, 380399, 375629, 373199, 372846, 374888, 379955, 388525, 401018, 418304, 441534, 470903, 504299, 537015, 562968, 576889, 576320, 562174, 537773, 507378, 475031, 443694, 414691, 388103, 363937, 342693, 324728, 309734]
56913C09734j2403r683p033n497n428n745n343m340l275j951n6J749K447K150
56899B55326J932K355K986L471M169N451O971Q075Q735R725J1840J5086J8673
56886C54795K1834K4311K5802K5174K0994J3146L508n331j1830j5838j7707j7594
56874D21264j5625j2342q724n540k736M01M238Q292J2014J5798K0563K6601L3521
56861D97725M1256N0227N9948O7811O9677O1969M3964J8944o989k8134m1898m8671
56849G85829m9828m6666m0685l3443k5810j8020j0480l589L187J0966J9995K9608
56837F21064L9736N1416O5477Q1587R8335J12515J17993J07638P8673L6111r808
56826A400737m9339p6855r1175r4541r0877q3548p4218o3726n3104m2997l3080
$$ y = [309734, 297331, 287648, 280615, 275118, 269690, 263945, 258602, 254262, 250987, 249036, 248980, 250729, 253176, 255326, 257258, 259613, 262599, 266070, 270239, 275690, 282661, 290736, 299471, 309196, 321036, 336122, 354795, 376629, 400940, 426742, 451916, 472910, 486056, 489564, 484233, 472403, 456565, 438858, 421264, 405639, 393297, 384573, 379033, 376297, 376698, 380936, 389228, 401242, 417040, 437603, 464204, 497725, 538981, 589208, 649156, 716967, 786644, 848613, 892577, 911521, 904532, 876398, 834500, 785829, 736001, 689335, 648650, 615207, 589397, 571377, 560897, 557308, 560495, 571461, 591456, 621064, 660800, 712216, 777693, 859280, 957615, 1070130, 1188123, 1295761, 1374434, 1410545, 1400737, 1351398, 1274543, 1183368, 1088827, 997950, 914402, 840184, 776458, 723354, 680357, 647277]
56815F47277k2972j3136l942N416J5996K7639L9489N1509O4055P5644Q1979P7766
56803A046720N9955L0184n129l7645o1329p4555p8768p6257o9564o1467n3878
56792F18267m6796l9320l1405k3861j7020j0397l604L245R974J6670K3560L0795
56780E30108L7859M2693M2050L3741J8611P3j7927l2269m1193m4767m4754m3115
56768D81110m0629l7145l2741k7983k3443j9579j6738j4732j2865j0848r194q229
56756B26984p353o015m664l982l715l177k357j692j192o39k94m83q72q92n81l29
56740A88747k58m79j324k592l203k472j180m90n14p61j234j980k311j711r96j263
56724A65979k181k651k633k965l687l999l684l308l006k322j215j16Q71J821K291
$$ y = [647277, 624305, 611169, 607227, 612643, 628639, 656278, 695767, 747276, 811331, 886975, 968954, 1046720, 1106675, 1136859, 1131730, 1094085, 1032756, 958201, 879433, 803176, 733612, 672145, 618267, 571471, 532151, 500746, 476885, 459865, 449468, 445864, 449109, 459083, 475753, 499313, 530108, 567967, 610660, 652710, 686451, 705062, 705135, 687208, 654939, 613746, 568979, 524225, 481110, 440481, 403336, 370595, 342612, 319169, 299590, 282852, 268120, 255255, 244407, 235213, 226984, 219631, 213616, 208952, 204970, 201255, 198078, 195721, 194029, 192837, 192198, 191904, 191421, 190549, 189657, 189076, 188747, 188489, 188010, 186686, 184094, 180891, 178419, 177239, 176749, 176235, 175474, 174240, 172260, 169949, 168238, 167242, 165979, 163798, 161147, 158514, 155549, 151862, 147863, 144179, 140871, 137865, 135543, 134328, 134212, 135083, 136904, 139195]
56709A39195J945J470J642J868J027m78j073l36N57P35N42L76M2m28n48k56K8
56692A46308L33R50J413R15j28l59M89J188R66N02O06J113J533J764J750J439
56676A60782J182J272J080p1j323j099M30J411J085O52Q53P22l84j354j201q02
56660A63235j316k243k526k521l182m090l967k731j576j171j078q81p76r20j109
56645A33148j189j228j237j210j299j503j360m11J078K358K940K854K360J781
56631A37082J422J323J217R34O56O44R01J230J420J356J159J184J485J495P36
56616A54244k95n86P8R59J495J782J885J521P41J70J21J11l66j038j306j032n79
56599A57905l24m27p32r03p77n19j47O92J956K680J989M67m37j91M98R54J118
$$ y = [139195, 141140, 142610, 144252, 146120, 147147, 146669, 145596, 145260, 145817, 146552, 147094, 147470, 147512, 147084, 146536, 146280, 146308, 146641, 147591, 149004, 149919, 149791, 149432, 149921, 151109, 152075, 152577, 153183, 154296, 155829, 157593, 159343, 160782, 161964, 163236, 164316, 164245, 162922, 161823, 162253, 163664, 164749, 165401, 166254, 166976, 166592, 165238, 164037, 163235, 161919, 159676, 157150, 154629, 151447, 147357, 143390, 140659, 139083, 137912, 136834, 135953, 135177, 134257, 133148, 131959, 130731, 129494, 128284, 126985, 125482, 124122, 123711, 124789, 127147, 130087, 132941, 135301, 137082, 138504, 139827, 141044, 141978, 142634, 143278, 144179, 145409, 146829, 148185, 149344, 150528, 152013, 153508, 154244, 153949, 153363, 153441, 154400, 155895, 157677, 159562, 161083, 161824, 161994, 162115, 162226, 161860, 160822, 159516, 158484, 157905, 157581, 157154, 156422, 155519, 154742, 154223, 154076, 154768, 156724, 159404, 161393, 161860, 161423, 161232, 161730, 162684, 163802]
56582A63802R93N90M07R03J458J085J92K84J652K739K346J234Q70J627K904M095
56566A87181M742M559L914L632L923M195M222M486N036N139M636M488N251O025
56552B51429N775M843M156L729K983J995J379J205Q69n2j364k562l207l257l229
56537B64692l686m432m722m409m170m429m735m524l795k720j385k64j38j058k019
56522B18206k155j680j250j026q51p59q58j127j570k206k781k943k767k501k002
56507A91730j162o54j234k319k504j560o85n83o40l42j89n93j054r97n07K25J123
56490A78055J629J042j25m17N22J434J480J277J378J288Q74J142K518L699L538
56475A99334K765K613K804K400J685J701K481L113L218L224L446L763L978L860
$$ y = [163802, 164795, 165385, 165792, 166695, 168153, 169238, 169430, 169714, 171366, 174105, 176451, 177685, 178555, 180182, 183086, 187181, 191923, 196482, 200396, 204028, 207951, 212146, 216368, 220854, 225890, 231029, 235665, 240153, 245404, 251429, 257204, 262047, 266203, 269932, 272915, 274910, 276289, 277494, 278363, 278311, 276947, 274385, 271178, 267921, 264692, 261006, 256574, 251852, 247443, 243273, 238844, 234109, 229585, 225790, 223070, 221685, 221421, 221283, 220225, 218206, 216051, 214371, 213121, 212095, 211244, 210485, 209627, 208500, 206930, 204724, 201943, 199000, 196233, 193732, 191730, 190568, 189914, 188680, 186361, 183857, 182297, 181612, 181029, 180389, 180047, 179858, 179265, 178211, 177214, 176707, 176932, 178055, 179684, 180726, 180601, 180184, 180706, 182140, 183620, 184897, 186275, 187563, 188437, 189579, 192097, 195796, 199334, 202099, 204712, 207516, 209916, 211601, 213302, 215783, 218896, 222114, 225338, 228784, 232547, 236525, 240385]
56461B40385L276K677K873L838M526M280L533K703J579L09k24J85N24K59K89J217
56445B72229J989J479K78l92m65m50r0R36J759J335J04p34j041j568k378k777
56429B70214k528k042j675j581j939k503k534j920j596k127k698k462j959k124
56415B40526k651k609k022j696j874k173k335k220j590o68k81o51q40k06M97L71
56399B19578j95k94J10N83J112J651J646J027P51J393K122K044J564J411J425
56384B35928J332J554K105K020R89K45N18N99n20j593j079L04J008J363K565M038
56368B51376M182L171K660L093L374K914K153J362O43O71J686K341J395o8p6J176
56352B82053J791J227O82P18P54P71J429K372K449J736J480J924K085J738J765
$$ y = [240385, 243661, 246338, 249211, 253049, 257575, 261855, 265388, 268091, 269670, 269979, 269755, 269940, 270464, 270723, 271012, 272229, 274218, 275697, 275975, 275583, 275118, 274668, 274578, 275514, 277273, 278608, 278712, 277978, 276937, 275369, 272991, 270214, 267686, 265644, 263969, 262388, 260449, 257946, 255412, 253492, 251896, 249769, 247071, 244609, 242650, 240526, 237875, 235266, 233244, 231548, 229674, 227501, 225166, 222946, 221356, 220688, 220407, 219756, 218916, 218710, 219207, 219578, 219383, 219089, 219199, 219782, 220894, 222545, 224191, 225218, 225969, 227362, 229484, 231528, 233092, 234503, 235928, 237260, 238814, 240919, 242939, 243928, 244173, 244691, 245290, 244770, 243177, 242098, 242402, 243410, 244773, 247338, 251376, 255558, 258729, 261389, 264482, 267856, 270770, 272923, 274285, 274928, 275599, 277285, 279626, 281021, 280953, 280877, 282053, 283844, 285071, 285753, 286471, 287225, 287996, 289425, 291797, 294246, 295982, 297462, 299386, 301471, 303209, 304974]
56337C04974K371K732K698L088M024M594M490M485N006N648O270P156P981P997
56323C73514P373P062P268P329P039O781O516N967N613O018O471N850M611M252
56309D61664M869M900L495J419l92j724k419k306j932k059k381k033j187p82q53
56294D58279n57K79J092J855K943L971M227M067M399N134N620O189P589R359J0561
56279E25007J1699J3853J6333J7374J7094J7496J9394K1545K3134K4958K7696
56268G35583L0873L4168L8075M2711M7468N2202N7485O3455O9769P6668Q4655
56257A333112R3164J01081J08493J16281J24086J30346J34301J36322J36290J33312
56247B546788J27073J17854J05362Q9207P0492N1172L2050J3004n202k1074l4144
$$ y = [304974, 307345, 310077, 312775, 315863, 319887, 324481, 328971, 333456, 338462, 344110, 350380, 357536, 365517, 373514, 380887, 387949, 395217, 402546, 409585, 416366, 422882, 428849, 434462, 440480, 446951, 452801, 457412, 461664, 466533, 471433, 474928, 476347, 475955, 474231, 471812, 469506, 467574, 465515, 463134, 461101, 459914, 459132, 458279, 457722, 458001, 459093, 460948, 463891, 467862, 472089, 476156, 480555, 485689, 491309, 497498, 505087, 514446, 525007, 536706, 550559, 566892, 584266, 601360, 618856, 638250, 659795, 682929, 707887, 735583, 766456, 800624, 838699, 881410, 928878, 981080, 1038565, 1102020, 1171789, 1248457, 1333112, 1426276, 1527357, 1635850, 1752131, 1876217, 2006563, 2140864, 2277186, 2413476, 2546788, 2673861, 2791715, 2897077, 2986284, 3056776, 3107948, 3139998, 3153002, 3147800, 3126726, 3092582]
56236C092582m4734n2439n6818n9038o0754o1778o1132n9792n9841o1212o2043
56225B453001o2137o3311o6143o9197p1741p4586p7764p9937q0653q0802q0469
56214A646261p8648p5483p2369o9498o5753o1297n7652n4808n0927m5515m0256
56203I74055l6101l2111k7933k4764k2961k1137j8620j6466j5210j3802j1737
56192G33213j0037r276q594p449o425n680m582l220k397j853n22J356K569L311
56178F80414M761O417O699O158P038R411J0859J0481J0066J0740J1569J2113J3208
56165G99934J4442J4026J1987J0426R844Q524O284N384O543P450O653N730O239
56152I13466P488Q764J0701J3167J4700J5382J7378K1452K5844K9744L4759M1742
$$ y = [3092582, 3047848, 2995409, 2938591, 2879553, 2818799, 2757021, 2695889, 2636097, 2576256, 2515044, 2453001, 2390864, 2327553, 2261410, 2192213, 2120472, 2045886, 1968122, 1888185, 1807532, 1726730, 1646261, 1567613, 1492130, 1419761, 1350263, 1284510, 1223213, 1165561, 1110753, 1059826, 1014311, 974055, 937954, 905843, 877910, 853146, 830185, 809048, 790428, 773962, 758752, 744950, 733213, 723176, 713900, 705306, 697857, 691432, 685752, 681170, 677950, 675553, 673700, 673178, 674534, 677103, 680414, 685175, 691592, 698291, 704449, 711487, 720898, 731757, 742238, 752304, 763044, 774613, 786726, 799934, 814376, 828402, 840389, 850815, 860659, 869183, 875467, 880851, 887394, 894844, 901497, 907227, 913466, 920954, 929718, 940419, 953586, 968286, 983668, 1001046, 1022498, 1048342, 1078086, 1112845, 1154587]
56140A154587M9377N7193O6940P9748R4795J11793J31274J51272J67124J75793
56130B239896J77299J71222J56229J34578J13027R6942Q6635Q0459P7239P3832
56120C407358O4879M8044K6647N327j3505k7839l5425l7738m0777m9335o3512
56109C284124q2065j04610j28167j46327j55209j56692j53354j44397j29456j12186
56099A971661r6473q2472o9302n8104m9590m2210l5559l1834l1229l0006k6069
56088A418813k2282k1113k0296j7342j4033j2621j1450q303m540k147k42K073
56076A286517L048J997J830M369O952P238P337R512J1890J2322J2426J3902J4907
56063A394247J4035J3733J5802J7748J7575J7721K0066K1765K0524J9288K0855
$$ y = [1154587, 1203964, 1261157, 1328097, 1407845, 1502640, 1614433, 1745707, 1896979, 2064103, 2239896, 2417195, 2588417, 2744646, 2879224, 2992251, 3089193, 3175828, 3256287, 3333526, 3407358, 3472237, 3520281, 3546928, 3552255, 3538750, 3510911, 3475486, 3437748, 3396971, 3347636, 3284124, 3202059, 3097449, 2969282, 2822955, 2667746, 2511054, 2357700, 2213303, 2083847, 1971661, 1875188, 1792716, 1723414, 1665310, 1615720, 1573510, 1537951, 1506117, 1474888, 1444882, 1418813, 1396531, 1375418, 1355122, 1337780, 1323747, 1311126, 1299676, 1291373, 1286833, 1284686, 1284444, 1286517, 1289565, 1291562, 1293392, 1297761, 1304713, 1311951, 1319288, 1328800, 1340690, 1353012, 1365438, 1379340, 1394247, 1408282, 1422015, 1437817, 1455565, 1473140, 1490861, 1510927, 1532692, 1553216, 1572504, 1593359]
56052A593359K2570K1387J9652K0539K2222K1911K1369K3019K4823K4414K4049
56041A839314K6139K8257K8050K8454L2353L6671L7747L7982M1089M5159M6691
56030B227906M7189M9462N1765N1772N2030N5333N9129O0539O2064O6231O9776
56019B853196O9486O8507P0277P1966P0754P0463P4684P9441Q0415Q1049Q5537
56008C675775R0399R1572R3137R9863J07738J11366J14161J21404J29954J35056
55998D770425J40444J51073J62615J69253J75004J86014J98704K07261K15539
55989F376332K29351K44574K55592K67685K87746L10739L29192L47659L73422
55980I022292M01885M26562M54089M93073N37865N80537O28492O91860P64441
$$ y = [1593359, 1615929, 1637316, 1656968, 1677507, 1699729, 1721640, 1743009, 1766028, 1790851, 1815265, 1839314, 1865453, 1893710, 1921760, 1950214, 1982567, 2019238, 2056985, 2094967, 2136056, 2181215, 2227906, 2275095, 2324557, 2376322, 2428094, 2480124, 2535457, 2594586, 2655125, 2717189, 2783420, 2853196, 2922682, 2991189, 3061466, 3133432, 3204186, 3274649, 3349333, 3428774, 3509189, 3590238, 3675775, 3766174, 3857746, 3950883, 4050746, 4158484, 4269850, 4384011, 4505415, 4635369, 4770425, 4910869, 5061942, 5224557, 5393810, 5568814, 5754828, 5953532, 6160793, 6376332, 6605683, 6850257, 7105849, 7373534, 7661280, 7972019, 8301211, 8648870, 9022292, 9424177, 9850739, 10304828, 10797901, 11335766, 11916303, 12544795, 13236655, 14001096]
55971A4001096Q36876R17302J018225J135257J261361J409256J595873J819001
55963B3994247K075261K385713K775701L246660L797941M455678N246347O168059
55955E4145607P231828Q509356J0101599J2100263J4635216J7908795K2097494
55948A46730158K7233910L3165284L9337194M4253403M5273013L9688974K6776214
55941D02458150Q974945r199463k3698397l2735284l6695699l6960551l4953091
55934B37190610l1796521k8244864k4688836k1287165j8144092j5357092j2960469
55927H4711571j0923776r213170p804758o651091n690600m889754m236447l699528
55919C1602447l234133k821409k467258k166484j900290j664277j467338j304778
$$ y = [14001096, 14837972, 15755274, 16773499, 17908756, 19170117, 20579373, 22175246, 23994247, 26069508, 28455221, 31230922, 34477582, 38275523, 42731201, 47977548, 54145607, 61377435, 69886791, 79988390, 92088653, 106723869, 124632664, 146730158, 173964068, 207129352, 246466546, 290719949, 335992962, 375681936, 402458150, 411433095, 402233632, 378535235, 345799951, 309104252, 272143701, 237190610, 205394089, 177149225, 152460389, 131173224, 113029132, 97672040, 84711571, 73787795, 64574625, 56769867, 50118776, 44428176, 39538422, 35301975, 31602447, 28368314, 25546905, 23079647, 20913163, 19012873, 17348596, 15881258, 14576480]
55911A4576480j159725j028673r20471q32373p50669o72989o08046n55154n04380
55902G544000m55234m15858l85317l54671l23839l00285k82806k63054k41291
55893D521645k24790k12507j96712j78139j64522j55621j44222j30650j22039
55884B992443j18160j11657j01767r4847r1745q7129q0881p8106p8099p4891o8500
55873B006661o4524o3079n8925n2236m8461m7741m4861l9662l7316l8258l7590
55862A474008l4550l3094l3100l0302k5135k2523k2623k0484j5078j0298o887
55851A219934j653N123R370J0181R495N637m532j7638k6311k9384l1524l3455
55839A115243l1389k6030k2892k2951k1667j8248j7303j9984k1777k0855k0709
$$ y = [14576480, 13416755, 12388082, 11467611, 10635238, 9884569, 9211580, 8603534, 8048380, 7544000, 7088766, 6672908, 6287591, 5932920, 5609081, 5308796, 5025990, 4762936, 4521645, 4296855, 4084348, 3887636, 3709497, 3544975, 3389354, 3245132, 3114482, 2992443, 2874283, 2762626, 2660859, 2566012, 2474267, 2387138, 2306257, 2228151, 2150052, 2075161, 2006661, 1942137, 1879058, 1820133, 1767897, 1719436, 1671695, 1626834, 1587172, 1549856, 1511598, 1474008, 1439458, 1406364, 1373264, 1342962, 1317827, 1295304, 1272681, 1252197, 1237119, 1226821, 1219934, 1218281, 1223404, 1232774, 1242955, 1252450, 1258087, 1253555, 1235917, 1209606, 1180222, 1148698, 1115243, 1083854, 1057824, 1034932, 1011981, 990314, 972066, 954763, 934779, 913002, 892147, 871438]
55828H71438k2600k3040k0802j9283j9808j9396j7208j6478j7982j8124j5728
55817F60989j4428j5903j6746j4589j1744j0321q928o565m903m510l327p75J049
55804E49299J721L465O473P880O882O185O944O763M167P05k713p060j1652j3842
55790E65217j3577j3865j5496j5810j3863j2217j2142j1598r593q137q101p270
55778D23548m390j314M31J523J886k62m878r165j1531j3056j4133j3477j1442
55765C43740j0379j0462r123n759l129k748k918k617l311n331o425n663n085n785
55751B65005o024m849m039m654n128m500m185m864m972l925l533m543n024l893
55737B00872k848l079l200k141j080q11j62J305K009J249N36N48j95k219l726
$$ y = [871438, 848838, 825798, 804996, 785713, 765905, 746509, 729301, 712823, 694841, 676717, 660989, 646561, 630658, 613912, 599323, 587579, 577258, 568330, 561765, 556862, 552352, 549025, 548250, 549299, 551020, 554485, 560958, 568838, 575720, 581905, 588849, 595612, 599779, 600484, 597771, 590711, 579059, 565217, 551640, 537775, 522279, 506469, 492606, 480389, 468247, 456649, 447056, 438919, 430818, 423548, 419158, 417844, 418275, 419798, 421684, 421422, 416544, 407379, 395848, 382792, 368659, 355182, 343740, 333361, 322899, 313776, 308017, 304888, 302140, 299222, 296605, 293294, 287963, 281538, 275875, 270790, 265005, 258981, 254132, 250093, 245439, 240311, 235811, 231626, 226762, 221790, 217865, 214332, 209789, 204765, 200872, 198024, 194945, 191745, 189604, 188524, 187713, 187551, 188856, 190865, 192114, 192650, 193198, 193003, 190784, 187058]
55722A87058l861m223n540o023m735l505l654l784k711j635j498r71Q40K449K696
55707A50903K824L917M837M658M610N621O293N325L730K764J834L51n18J68J355
55692A98672J850K115K732L060K815K906L451L102J587N64P54O35n90j331m96
55677B21826N37M64J71N74P53l5p29n71o17j456j742o65L57J53k29K27O24K13
55659B19855O0Q32J268O61N34J834K867K143R48Q16P26p54k546l013k961m085
55643B19185n916o845o941p344p955p950p656p808p893p082n869n205m929m552
55629A25240m392m614m450l690l529m456m926l682j810q95p00l38j86q34j555
55614H5183j551j406j774j991j511j109j241r15K05N53p30j850j219k78j062k613
$$ y = [187058, 183197, 178974, 173434, 167411, 162676, 159171, 155517, 151733, 149022, 147387, 145889, 144918, 145758, 148207, 150903, 153727, 157644, 162481, 167139, 171749, 177370, 183663, 188988, 192718, 195482, 197316, 197667, 197149, 197317, 198672, 200522, 202637, 205369, 208429, 211244, 214150, 217601, 220703, 222290, 222854, 223608, 224243, 223653, 222322, 221826, 222363, 222827, 222998, 223572, 224325, 224290, 223561, 222990, 222373, 220917, 219175, 218510, 218867, 219020, 218791, 219018, 219642, 219855, 219915, 220747, 222015, 222676, 223210, 225044, 227911, 230054, 231002, 231818, 232544, 231790, 229244, 226231, 223270, 219185, 213269, 206424, 199483, 192139, 184184, 176234, 168578, 160770, 152877, 145795, 139926, 134721, 129792, 125240, 120848, 116234, 111784, 108094, 104565, 100109, 95183, 91501, 89691, 88796, 88096, 87758, 87572, 86738, 85183, 83632, 82226, 80452, 78461, 76950, 75841, 74600, 73685, 73890, 74443, 73713, 71863, 70644, 70366, 69304, 66691]
55598F6691k544r26J55Q2J34R20J648J718J192%j694k793k384j104j73J73K36
55581F1331j59r32j117k99M23J30m18k64Q9q6k53R6J41o39r95J54J705K153K077
55562F3137K755L576L037J441M13L83L88m6n50q75q96l59K92j40j605k229j048
55545F7674K71N3p49n14J54j58q24l10R21J216O71P12J420J674J488J857K615
55528G8171K652K012J806K181K275J858J353O33n41j444j474j578k804m196m128
55513G6776l006k524k838k695k001j927k701l317l382l386l272k618j948k074
55499C9087k370j631l14M0o78j129r04q05r07m01M92M71p27j893k284k296k118
55482B1633j384l82J0j61K1O13N83m72j686k199j905j015oK44n02r70K6J590J886
$$ y = [66691, 64147, 63221, 63376, 63458, 63592, 64512, 66160, 67878, 69070, 69070, 67376, 64583, 62199, 61095, 60922, 61095, 61331, 61172, 60240, 59123, 58824, 59247, 59377, 58959, 58695, 58784, 58698, 58445, 58541, 58682, 58043, 57048, 57202, 58907, 61060, 63137, 65892, 69468, 72505, 73946, 74359, 74742, 75130, 75084, 74534, 73659, 72763, 72404, 72696, 72556, 70951, 68722, 67674, 67945, 67998, 67249, 66735, 66889, 66731, 65907, 65597, 66518, 67734, 68405, 69117, 70537, 72211, 73699, 75556, 78171, 80823, 82835, 84641, 86822, 89097, 90955, 92308, 92941, 92400, 90956, 89482, 87904, 85100, 80904, 76776, 73770, 71246, 68408, 65713, 63712, 61785, 59084, 55767, 52385, 48999, 45727, 43109, 41161, 39087, 36717, 35086, 34772, 34812, 34134, 33005, 32101, 31296, 30389, 29988, 30480, 30951, 30224, 28331, 26047, 23751, 21633, 20249, 19867, 19877, 19716, 19737, 20350, 20933, 20461, 18775, 16576, 14671, 13656, 13650, 13894, 13392, 12422, 12448, 14038, 15924]
55463A5924Q79J66L40M60J05K0M67O96L97K37N19O31J79m72r05r67m45M53O86
55444A9370m14j750j758o27J55J75K48M80M7j045j676j374q54n83k19L06M82K18
55426A1181jn4k33m46m02l45n01k62Q30J851J741J128J253J714J225J24n1Q03
55408A9555J344J281J563K058J411l29j329p22K66O12Q21J267J147Q0r48j185
55392B6892j164j387j434j121j108j600j751j114l72k4L15P51O62M7j27M11N99
55375A8475j20p51l83L49L67l30j085j558j549q69M6K26m30q73m73J13J46j17
55357A1184j88j53k00j18J19J08k34m95n38o68q27o40l48n25q28k66J084J946
55339H413J772J340J144O69k08n81j2O55O55K85p3o71j427j493o21J66O5m03m57
$$ y = [15924, 16803, 16969, 17309, 17769, 17874, 17894, 18361, 19057, 19454, 19691, 20210, 20841, 21020, 20548, 19643, 18676, 18231, 18684, 19370, 18956, 17206, 15448, 14821, 14976, 15151, 15399, 15879, 15926, 14881, 13205, 11831, 10977, 10394, 10175, 10481, 10963, 11181, 11180, 11126, 10893, 10447, 10045, 9700, 9199, 8937, 9767, 11618, 13359, 14487, 15740, 17454, 18679, 18803, 18752, 19555, 20899, 22180, 23743, 25801, 27212, 26883, 25554, 24832, 25098, 25710, 26531, 27798, 28945, 29025, 28077, 26892, 25728, 24341, 22907, 21786, 20678, 19078, 17327, 16213, 15841, 15817, 16132, 16883, 17545, 17592, 17465, 17876, 18475, 18355, 17604, 17221, 17570, 17937, 17607, 16522, 14964, 13415, 12546, 12592, 12818, 12388, 11515, 11042, 11155, 11301, 11184, 10996, 10843, 10643, 10525, 10644, 10752, 10518, 10023, 9485, 8817, 7990, 7350, 7002, 6477, 5649, 5383, 6467, 8413, 10185, 11525, 12669, 13338, 13130, 12549, 12537, 13192, 13847, 14132, 14059, 13388, 11961, 10468, 9847, 10013, 10078, 9675, 9218]
55320I218j88O8M46R39J033O28M06O95Q87O34N00Q80J210R43L71j49q09j588j843
55301A4281j283m59J27N85Q49M83l22p09m90l61m54n4P97R52J26l98J34P27M89
55282A5020J53N02P59Lj083j390j284j699k208j626oJ403J869J610R90L47K28
55265A3588P14R64L31n33o56k54k33o38p75n19l80m63k93L12R55J214R62L81l8
55246A4639P5K44m64j909k592j520M14J735K172K260J992J089Q4j35L29N30M0
55229A8983o57j003q36k44M24N54k1n70l26M37Q53O73L86L63N30P71J018J028
55211B2363N80r8m63k44L27P37N73q0n91m71j9J35JK1M7n23j514j873j138p6M63
55190A8157M37M9o18j058n27O65J119L03n78l29O47J365J777K269K540K131J443
$$ y = [9218, 9030, 9098, 9544, 10483, 11516, 12144, 12550, 13245, 14132, 14766, 15266, 16146, 17356, 18299, 18670, 18521, 17712, 16124, 14281, 12998, 12539, 12666, 13251, 14100, 14583, 14261, 13552, 13062, 12701, 12247, 12193, 12990, 13942, 14068, 13670, 13804, 14531, 15020, 15173, 15675, 16434, 16437, 15354, 13964, 12680, 10981, 8773, 7147, 7141, 8544, 10413, 12023, 13013, 13360, 13588, 14302, 15266, 15597, 15064, 14408, 14154, 13921, 13283, 12508, 11989, 11609, 11146, 10853, 11165, 12120, 13334, 14296, 14677, 14639, 14714, 14958, 14494, 12585, 9993, 8473, 8887, 10622, 12794, 15054, 17046, 18135, 18219, 18084, 18413, 18943, 18983, 18326, 17323, 16487, 16243, 16667, 17221, 17200, 16630, 16304, 16741, 17594, 18267, 18653, 19016, 19546, 20317, 21335, 22363, 22943, 22845, 22382, 22138, 22465, 23202, 23775, 23695, 23104, 22633, 22614, 22749, 22750, 22771, 22818, 22295, 20781, 18908, 17770, 17694, 18157, 18594, 18643, 18025, 16967, 16440, 17105, 18224, 18527, 17949, 17620, 18267, 19632, 21409, 23678, 26218, 28349, 29792]
55173B9792J144J116R27P84J091J495J301N10l58j024j470j655j809k452l441
55158B5951l688k554q74J00K24J39J00j1q9j5p3m48p51o37l52j65J16N52P72P63
55138A9060J066J630J480L50n13j15P67R72P42R01J204J019P67J219J934J965
55122C4448J561J682K226K215J447N59k72j293k075j952j282r68q60j50Q35P85
55106C6906m38j401j146l54j3j50l81o77j020j066o31J0O25J164J429J200P83
55089C4840P65J113J221Q91O15P34R40P53J10o51r84n73J87M52O0j38M20J045
55071D1800R14M32M59P79N79kr2L54N24J86r0j17k87n53m03K8L4l78l99K13P62
55050D4743R00J051J330J079Nj202j773j570o94P08J917K006J132N26P58R80M46
$$ y = [29792, 30936, 32052, 32979, 33763, 34854, 36349, 37650, 38160, 37802, 36778, 35308, 33653, 31844, 29392, 25951, 22263, 19709, 18835, 18935, 19159, 19298, 19398, 19387, 19298, 19283, 19210, 18762, 18011, 17374, 17022, 16857, 16973, 17525, 18297, 19060, 20126, 21756, 23236, 23586, 23073, 22958, 23725, 24697, 25439, 26340, 27544, 28563, 29330, 30549, 32483, 34448, 36009, 37691, 39917, 42132, 43579, 44138, 43866, 42573, 40498, 38546, 37264, 36296, 35436, 35286, 36121, 36906, 36468, 35067, 33921, 33567, 33554, 33404, 33023, 32346, 31326, 30260, 29629, 29639, 30264, 31428, 32857, 34057, 34840, 35605, 36718, 37939, 38830, 39445, 40179, 41119, 41872, 41982, 41331, 40347, 39774, 39961, 40413, 40473, 40335, 40755, 41800, 42714, 43146, 43605, 44384, 44963, 44961, 44869, 45223, 45747, 45933, 45843, 45726, 45439, 44886, 44483, 44511, 44545, 44167, 43768, 43981, 44743, 45643, 46694, 48024, 49103, 49108, 47906, 46133, 44563, 43869, 44577, 46494, 48500, 49632, 50158, 50916, 51896, 52342]
55033E2342k55k37K39L14j44n62o45n44l16R2N49R08J307J805J993J426L46m96
55015E8122o59l20J25M55N63L75n3m78p00q09j024j298j212n50K30M73J37l01
54997E3076p33j487k382k565j684n18J33M90J064J506J160K49m08o41r34j359
54981D4967j428r85m26L0O12J449K329K991L228K827J867R88P58J030J320J577
54965F3134J958K260K219K132K411K857L066L251L838M558M876N037N724O890
54951A14211P837Q357Q885R612J0381J1291J2433J3189J2776J1391R756P636M068
54938B41823q83n796r545j2168j3901j4519j4079j3218j2319j1193r945r092q539
54925A06626p411n453l673l037l284l507l197k231o51J032J952J894J651J960
$$ y = [52342, 52087, 51850, 52089, 52403, 52259, 51697, 51052, 50508, 50192, 50284, 50833, 51741, 53048, 54853, 56846, 58272, 58618, 58122, 57463, 57143, 57268, 57723, 58286, 58661, 58608, 58130, 57430, 56621, 55597, 54299, 53087, 52537, 52767, 53240, 53377, 53076, 52343, 50856, 48474, 45909, 44225, 43707, 43840, 44330, 45394, 46900, 48060, 48309, 47901, 47260, 46326, 44967, 43539, 42554, 42128, 42158, 42770, 44219, 46548, 49539, 52767, 55594, 57461, 58449, 59207, 60237, 61557, 63134, 65092, 67352, 69571, 71703, 74114, 76971, 80037, 83288, 87126, 91684, 96560, 101597, 107321, 114211, 122048, 130405, 139290, 148902, 159283, 170574, 183007, 196196, 208972, 220363, 230119, 237755, 241823, 240940, 235144, 225599, 213431, 199530, 185011, 170932, 157714, 145395, 134202, 124257, 115165, 106626, 99215, 93762, 90089, 87052, 83768, 80261, 77064, 74833, 74182, 75214, 77166, 79060, 80711, 82671]
54911H2671K692L392M032M788N674O849Q632J0905J2993J4431J5311J5563J4665
54898B02598J2362R028M999L09m551q427j0675j1853j2736j3300j3202j2568j1676
54885A30308j0416q770p269o334n634m793m186m277m535l977k578j274o11j98
54871F5456L16N69J58m80m45M53J394J516Q70J52k65n89q61p37k63k76j336k694
54853F2938l126k584k099k192k287j868j315j167j285j186p86l50p9k1j84m49
54837D1960o19n77k73L18R22R24O9r22j053k44P36J412J967K499K710K406J731
54820E3966Q48m0m05J11J005J451J478J768K316K307J438L90k40m91k98O93K236
54803F8533L377L717L927M511N061N237N565O608Q111R678J1455J3498J5108J5722
$$ y = [82671, 85363, 88755, 92787, 97575, 103249, 110098, 118730, 129635, 142628, 157059, 172370, 187933, 202598, 214960, 223988, 228987, 229296, 224745, 216318, 205643, 193790, 181054, 167754, 154552, 141984, 130308, 119892, 111122, 103853, 97519, 91885, 87092, 82906, 78629, 74094, 70117, 67539, 66265, 65654, 65456, 65772, 66341, 66499, 66019, 65574, 66027, 67421, 68937, 69807, 69959, 69694, 69105, 68244, 67507, 67244, 66968, 65632, 62938, 59812, 57228, 55129, 52937, 50650, 48782, 47467, 46300, 45015, 43829, 43043, 42693, 42614, 42593, 42409, 41960, 41341, 40764, 40491, 40809, 41731, 42655, 42724, 41802, 40749, 40505, 41241, 42653, 44620, 47119, 49829, 52235, 53966, 54814, 54774, 54369, 54480, 55485, 56936, 58414, 60182, 62498, 64805, 66243, 66633, 66393, 65902, 65604, 66297, 68533, 71910, 75627, 79554, 84065, 89126, 94363, 99928, 106536, 114647, 124325, 135780, 149278, 164386, 180108]
54789A80108J5749J5726J5124J2930R067M503J30l748p026r507j1085j1807j1817
54776A98347j1397j0838j0070q793p053n352l996k878k081k031k635k909k009
54763A26305k79J226J913K049K277L112M681O670Q617J0330J1805J2982J4043
54750B05731J5681J8323K1105K2558K2198K0637J8066J3902Q169K043l596r012
54738C55805j4411j8882k1372k1917k1254j9897j8271j6924j5826j4216j1862
54727A60973r692q495p777o761n725n324n247m664l561k610k028j542j163j114
54713I5270j163q67l23L0P6r3o03j352j618r39n5k9p03r13k37N20N91K12J00N11
54693H8415J110J385J083M37r8m00p42j186j378j149q06n03K2P76J218J180J299
$$ y = [180108, 195857, 211583, 226707, 239637, 248704, 253207, 253337, 249589, 242563, 233056, 221971, 210164, 198347, 186950, 176112, 166042, 157249, 150196, 144844, 140848, 137970, 135889, 133858, 131223, 128314, 126305, 126026, 127252, 129165, 131214, 133491, 136603, 141284, 147954, 156571, 166901, 178706, 191688, 205731, 221412, 239735, 260840, 283398, 305596, 326233, 344299, 358201, 366370, 368413, 364817, 355805, 341394, 322512, 301140, 279223, 257969, 238072, 219801, 202877, 187051, 172835, 160973, 151281, 142786, 135009, 128248, 122523, 117199, 111952, 107288, 103727, 101117, 99089, 97547, 96384, 95270, 94107, 93240, 92917, 92947, 93023, 92930, 92327, 90975, 89357, 88418, 88363, 88334, 87631, 86718, 86481, 87001, 87592, 87804, 87904, 88415, 89525, 90910, 91993, 92430, 92332, 91932, 91190, 90004, 88626, 87477, 86671, 86168, 86190, 86966, 88184, 89364, 90663]
54676I0663J896K204J563O82P46J748K729L263L645L920L824L591L801M334M433
54661A33042L834L080K652K447K220J943J684J625K090L081L920L995L611L566
54647A72790M107M927N978P473R266J0941J2502J4285J6257J7940J8952J9024
54635C14442J7651J4439R700M160j737p642j2708j6071j7823j8738j9133j8693
54623B47847j7422j5891j4495j3135j1717j0344q940p314n623m227l118k116j424
54610A32081j309j335p82K11P21M03j40m84r52j777k442k440k072k075k726l670
54594A11212m275m071l146k270k201k820l317l244k824k348j856j534j643j874
54580G3789j538o65k70r77k012k139j185o8M21K74o5j67K47J113J839J724P22
$$ y = [90663, 92559, 94763, 96326, 97008, 97754, 99502, 102231, 105494, 109139, 113059, 116883, 120474, 124275, 128609, 133042, 136876, 139956, 142608, 145055, 147275, 149218, 150902, 152527, 154617, 157698, 161618, 165613, 169224, 172790, 176897, 181824, 187802, 195275, 204541, 215482, 227984, 242269, 258526, 276466, 295418, 314442, 332093, 346532, 356232, 360392, 358655, 351013, 338305, 322234, 304411, 285673, 266540, 247847, 230425, 214534, 200039, 186904, 175187, 164843, 155903, 148589, 142966, 138739, 135621, 133505, 132081, 130772, 129437, 128655, 128866, 129587, 129990, 129850, 129366, 128414, 126637, 124195, 121755, 119683, 117608, 114882, 111212, 106937, 102866, 99720, 97450, 95249, 92429, 89112, 85868, 83044, 80696, 78840, 77306, 75663, 73789, 72251, 71586, 71316, 70339, 68327, 66188, 65003, 64935, 65356, 65630, 65565, 65398, 65645, 66758, 68597, 70321, 71043]
54563G1043m06q66o05j98j34l84n89m23J93R29J113L53p55j049k48N97O07M48
54545F9626J296K839L575K972K150K117K641L251M106N154N634N299N164O005
54531A21829P037P179O891P409Q681R343Q500O383L450L1l238n618o988p686p851
54516A55352p663p768q470q894q068o484n424m984m190k953k393k889l302k636
54502G9234j401p51j012j677k130k023j452r97j010r49r3J104J457P90J65J41
54486F9396J04l05l72L75J131J041N88P52J419J622J010J55l70m97l08J17N08
54469G6366N58L36K51N00P97O95J17n19p68p30r13j408j648j244o17l08r4M21
54451G1792Q21L70o89j327j190q50o20j46N78Q59L50m75j174j764k008j312Q6
$$ y = [71043, 70637, 69771, 69166, 68968, 68834, 68450, 67861, 67438, 67631, 68560, 69673, 70026, 69271, 68222, 67974, 68571, 69178, 69626, 70922, 73761, 77336, 80308, 82458, 84575, 87216, 90467, 94573, 99727, 105361, 110660, 115824, 121829, 128866, 136045, 142936, 150345, 159026, 168369, 176869, 183252, 186702, 186733, 183495, 177877, 170889, 163203, 155352, 147689, 139921, 131451, 122557, 114489, 108005, 102581, 97597, 93407, 90454, 88061, 85172, 81870, 79234, 77833, 77082, 76070, 74393, 72263, 70240, 68788, 67791, 66781, 65832, 65739, 66843, 68300, 69090, 69255, 69396, 69500, 69195, 68823, 69198, 70329, 71370, 71958, 72710, 74129, 75751, 76761, 76916, 76546, 76049, 75741, 75858, 76366, 76924, 77260, 77511, 78011, 78808, 79503, 79620, 79101, 78333, 77603, 76690, 75282, 73634, 72390, 71773, 71465, 71371, 71792, 72613, 72983, 72294, 70967, 69777, 68927, 68307, 68161, 68739, 69598, 69948, 69473, 68299, 66535, 64527, 63215, 63301]
54434F3301Q32J54r78j194n20K5O1Kk0l43r04j039m02M63P35K27m82o58j21O11
54414E9750R09P23N22O44R97J352J604J748J877K226K806L133K784K157K117K838
54398H8187L657M110M360M476M076L086K180J943K095J971J418Q24N23N03M43
54383A23852j24j321k510k776k028j192j129j807k719l472l728l182k043j134
54369I4687j055j516j803j602j074m92p7J6j19k14k17l67p98j304j563j328m94
54352H0680O88J528J521J059R81J478J955J952J667J517J794K681M006M986M921
54337A13414M118L396K810J768L32o96j110j564k226k327j582r12j113j767k130
54322A10411k313k720l153l218l115l231l446l444l251k964k445j765j427j627
$$ y = [63301, 64133, 64287, 63309, 62115, 61595, 61620, 61681, 61683, 61663, 61320, 60416, 59377, 58975, 59438, 60173, 60400, 59918, 59260, 59139, 59750, 60659, 61382, 61904, 62548, 63545, 64897, 66501, 68249, 70126, 72352, 75158, 78291, 81075, 83232, 85349, 88187, 91844, 95954, 100314, 104790, 108866, 111952, 114132, 116075, 118170, 120141, 121559, 122383, 122906, 123409, 123852, 123728, 122407, 119897, 117121, 115093, 113901, 112772, 110965, 108246, 104774, 101046, 97864, 95821, 94687, 93632, 92116, 90313, 88711, 87637, 87145, 87068, 87084, 86965, 86751, 86534, 86167, 85369, 84065, 82502, 81174, 80680, 81368, 82896, 84417, 85476, 86457, 87935, 89890, 91842, 93509, 95026, 96820, 99501, 103507, 108493, 113414, 117532, 120928, 123738, 125506, 125838, 125142, 124032, 122468, 120242, 117915, 116333, 115421, 114308, 112541, 110411, 108098, 105378, 102225, 99007, 95892, 92661, 89215, 85771, 82520, 79556, 77111, 75346, 73919, 72292]
54308G2292j877j716j322r41m97j63n15j546k300k170j809j994k303j823n42P18
54292E1492J362J303O62j19l63L7L89K61J22L55M75L2m63m70m53r67j479j213
54274E0963n66m66p71o62k22k62p42o65L60J609K364K510K032R65o4k52K25M38
54256E6794J52J26O44Q57P5j065j372o05L70O48K03k46r3M84Q09O43M49N09L94
54237E9776j95o60l19M48O86L12J09M04O26K93l51q65j192j484j792k015j900
54220E1881j202j73L71ro97q14m28k10k63r6L65O51O48Q13J301J634J421Q47L04
54201E6344J9M0K09J45k50m56j9O05N64j87q42q58l82K79Q92J063N78m7j59Lk90
54180E7251q03m34J032K333K364J516Q29N13P3o56j253j323q65k03K20J53k18
$$ y = [72292, 70415, 68699, 67377, 66436, 65939, 65776, 65261, 63715, 61415, 59245, 57436, 55442, 53139, 51316, 50774, 51492, 52854, 54157, 54819, 54700, 54337, 54374, 54763, 55024, 55146, 55501, 55976, 56008, 55545, 55075, 54622, 53655, 52176, 50963, 50397, 49931, 49160, 48498, 48276, 48014, 47272, 46607, 46967, 48576, 50940, 53450, 55482, 56447, 56383, 56131, 56356, 56794, 56946, 57072, 57716, 58573, 58648, 57583, 56211, 55606, 55976, 56624, 56827, 56581, 56488, 56972, 57781, 58424, 58873, 59382, 59776, 59581, 58921, 58602, 59050, 59736, 60048, 60157, 60561, 61187, 61480, 61129, 60264, 59072, 57588, 55796, 53781, 51881, 50679, 50506, 50877, 50868, 50171, 49357, 48929, 48719, 48456, 48360, 48725, 49376, 50024, 50837, 52138, 53772, 55193, 56040, 56344, 56363, 56403, 56612, 56757, 56507, 56051, 56032, 56637, 57201, 57014, 56172, 55314, 54932, 55211, 56103, 57166, 57744, 57697, 57538, 57541, 57251, 56448, 56014, 57046, 59379, 61743, 63259, 64088, 64601, 64674, 64018, 62765, 61442, 60577, 60374, 60594, 60747, 60529]
54163F0529n01o13p87j025j004n46J15O39P87M21k75p10m45J75N04N75R63J719
54145F0521K198K039J577J124N34k01o61n98l30j78r8o3k12l85q9N79O92l25j705
54126F4419k184j595r80j207j940k102j106M87J567J671J346J191R41M1j199j770
54110E7580j323n54j35k9n3l79r60j195p02M1M18N34P91R90O20j61n57k04L42
54091E5064L93m5m75o03n65n09k82K86R78J280R92M53Q7o2j25p9P1M1l31o27l00
54070E5642M92R39N69k66q75q41j72P10J154Q51K74J79O82J209J344J194R74P34
54052F4793N67N44L82k83j188j512p98N40J741K312K083J287O56Q76J732K338
54036G6070K334K288K757L525M112M422M563M548M523M786N203N180M588M157
$$ y = [60529, 60028, 59415, 58628, 57603, 56599, 56053, 56168, 56807, 57594, 58015, 57740, 57030, 56585, 56760, 57264, 57839, 58802, 60521, 62719, 64758, 66335, 67459, 67993, 67792, 67131, 66533, 66203, 66025, 65927, 65864, 65652, 65267, 65178, 65757, 66449, 66124, 64419, 62235, 60640, 59660, 58453, 56513, 54411, 53305, 53792, 55359, 57030, 58376, 59567, 60508, 60549, 59350, 57580, 56257, 55703, 55568, 55539, 55486, 55107, 54147, 52952, 52250, 52291, 52709, 53243, 54034, 55024, 55644, 55483, 54926, 54722, 55064, 55457, 55412, 54937, 54334, 53769, 53260, 52978, 53264, 54242, 55522, 56514, 56967, 57054, 56992, 56867, 56788, 56859, 56900, 56569, 55942, 55642, 56134, 57073, 57642, 57376, 56501, 55660, 55488, 56198, 57352, 58203, 58477, 58656, 59338, 60547, 61891, 63085, 64059, 64793, 65360, 65904, 66286, 66003, 64815, 63303, 62505, 63045, 64786, 67098, 69181, 70468, 71124, 72000, 73732, 76070, 78404, 80692, 83449, 86974, 91086, 95508, 100071, 104619, 109142, 113928, 119131, 124311, 128899, 133056]
54022A33056M406M771M464L769L605M028M053L084J724R07P76Q39Q08P17M38l62
54006A71083j578k527k732k525k512k645k409j824j535j814k181k314k591l193
53992A38703l399k553j227n32o63r72j181j525j813j468n78j6k64r40j551j929
53976A18092j825r55K73R20P24L56K31km75n07L29J374J739J449J034N89j16r29
53958A22301j403j307p09J72Q73Q97L88R8L75O44L58j45k07K27Q31J519K193K355
53940A29460J757J225J901L681N121N061L886K893K743K849K263R36k08m92m07
53925A62669q61j778k151j495m37K76P29J339K082K680L113L476L681L694L720
53910A80737L898M164M636N605O817P370O787N703N041M914M763M118K833J042
$$ y = [133056, 137462, 142233, 146697, 150466, 154071, 158099, 162152, 165236, 166960, 167867, 168643, 169482, 170290, 171007, 171445, 171083, 169505, 166978, 164246, 161721, 159209, 156564, 154155, 152331, 150796, 148982, 146801, 144487, 141896, 138703, 135304, 132751, 131524, 130992, 130329, 129357, 128176, 126651, 124838, 123370, 122792, 122776, 122512, 121572, 120021, 118092, 116267, 115312, 115585, 116505, 117229, 117585, 117816, 117814, 117339, 116832, 117161, 118535, 120274, 121723, 122757, 123346, 123230, 122301, 120898, 119591, 118882, 119054, 119927, 120824, 121212, 121310, 121685, 122329, 122687, 122542, 122335, 122562, 123393, 124912, 127105, 129460, 131217, 132442, 134343, 138024, 143145, 148206, 152092, 154985, 157728, 160577, 162840, 163776, 163568, 163076, 162669, 161808, 160030, 157879, 156384, 155947, 156223, 156952, 158291, 160373, 163053, 166166, 169642, 173323, 177017, 180737, 184635, 188799, 193435, 199040, 205857, 213227, 220014, 225717, 230758, 235672, 240435, 244553, 247386, 248428]
53896B48428o07j232p72k77n43j025q29k97n93j947l322l859l894m248n137o087
53880B13759o568o428n927n493n388n525n520m958l742k456k139l202m702n215
53866A46496m438l306k551k039j672j871k692l324l148k543k058j571r91r35j766
53851A11591k673k648j917j366j120p38m33q20j633j911j424q74o31l10K51N34
53835I3878J77m93j041j378j480j276j000j040j258j038k08O84J147J246J180
53820H8100R11M85K36L73O98R44J107J251J247R32L90J6J93Q49J314J068O03R68
53802A01685K207L028K595J791J819K379K437K267L110M936O141N836M950M507
53788A49688M153L180J987J441J544J694J768K010K186J855J240J027J279J319
$$ y = [248428, 247821, 246589, 245817, 245540, 244997, 243972, 243143, 242846, 242253, 240306, 236984, 233125, 229231, 224983, 219846, 213759, 207191, 200763, 194836, 189343, 183955, 178430, 172910, 167952, 164210, 161754, 159615, 156413, 151711, 146496, 142058, 138752, 136201, 134162, 132490, 130619, 127927, 124603, 121455, 118912, 116854, 115283, 114292, 113357, 111591, 108918, 106270, 104353, 102987, 101867, 101129, 100696, 99876, 98243, 96332, 94908, 94034, 93403, 93093, 93344, 93878, 94055, 93562, 92521, 91143, 89663, 88387, 87387, 86347, 85089, 84051, 83843, 84527, 85674, 86920, 88100, 89011, 89496, 89732, 90105, 90803, 91747, 92854, 94105, 95352, 96284, 96674, 96690, 96883, 97732, 99046, 100114, 100717, 101685, 103892, 106920, 109515, 111306, 113125, 115504, 117941, 120208, 123318, 128254, 134395, 140231, 145181, 149688, 153841, 157021, 159008, 160449, 161993, 163687, 165455, 167465, 169651, 171506, 172746, 173773, 175052, 176371]
53774A76371P68K1m59p68j172j568j741j828k144k550k520j933j410j560k123
53759A55384k286j846j451j611j984j983j625j278r52m09J77L44N1k73m27o90
53743A39141j194j530j234m05L40M22k33j136j671j648j363j132r68q83j032j341
53727A24133j346q71m20m78p23n18J05O63J042J436J573R49j62p64m01L28O73
53710A25219N82L53J08r1m2L72J026J792K595L174L204K771K346K200K261K478
53694A50348K883L245L236L036L189L717L962L538K862K479K324J990J339N84
53680A88732O1R4O87J266J186O23M35R36J419J078Nj129j845k031j795j474j407
53663A86841j423r79o0O19O17M19N24N33j74j275j829j567j105q89o94k92L9l8
$$ y = [176371, 177139, 177160, 176701, 175933, 174761, 173193, 171452, 169624, 167480, 164930, 162410, 160477, 159067, 157507, 155384, 153098, 151252, 149801, 148190, 146206, 144223, 142598, 141320, 140368, 139959, 140136, 140480, 140531, 140258, 139831, 139141, 137947, 136417, 135183, 134778, 135118, 135540, 135307, 134171, 132500, 130852, 129489, 128357, 127389, 126506, 125474, 124133, 122787, 121916, 121496, 121018, 120295, 119777, 119882, 120545, 121587, 123023, 124596, 125545, 125383, 124619, 124218, 124546, 125219, 125801, 126154, 126262, 126171, 126129, 126501, 127527, 129319, 131914, 135088, 138292, 141063, 143409, 145609, 147870, 150348, 153231, 156476, 159712, 162748, 165937, 169654, 173616, 177154, 180016, 182495, 184819, 186809, 188148, 188732, 188793, 188887, 189574, 190840, 192026, 192649, 193084, 194020, 195439, 196517, 196522, 195393, 193548, 191517, 189722, 188248, 186841, 185418, 184439, 184379, 184998, 185615, 186034, 186558, 187091, 186917, 185642, 183813, 182246, 181141, 180252, 179558, 179266, 179305, 179267]
53645A79267l93o15m83J3Q31J716K048J308k07j440j535o46M36J220J759K064
53629A85343J871J193O11O50J114J446J501J530J656J824K061K358K488K416K629
53614B10691L427M160L869K673J741J898K873L915M474M273L432K690K698L052
53600B55866K814K035J812K607L609M199M900O079O834O202M783L979M072M179
53586C13970L858L640L870M130M001L654L327K808J856Q03L08O40J418K011K143
53571C52437J957J518N11j176k666k633q25J435K690K742K245J599Q80L90M04
53556C61508N73M20J90M93J175J442J128R14J116J112M77j61K7Q23J311J142Q18
53539C74508P49P23M46J67M48J509K893L838L943L547L405L882M613N115N478
$$ y = [179267, 178874, 178259, 177776, 177789, 178620, 180336, 182384, 183692, 183485, 182045, 180510, 179864, 180300, 181520, 183279, 185343, 187214, 188407, 189018, 189668, 190782, 192228, 193729, 195259, 196915, 198739, 200800, 203158, 205646, 208062, 210691, 214118, 218278, 222147, 224820, 226561, 228459, 231332, 235247, 239721, 243994, 247426, 250116, 252814, 255866, 258680, 260715, 262527, 265134, 268743, 272942, 277842, 283921, 290755, 296957, 301740, 305719, 309791, 313970, 317828, 321468, 325338, 329468, 333469, 337123, 340450, 343258, 345114, 345917, 346225, 346865, 348283, 350294, 352437, 354394, 355912, 356423, 355247, 352581, 349948, 349123, 350558, 353248, 355990, 358235, 359834, 360714, 361104, 361508, 362081, 362501, 362691, 363184, 364359, 365801, 366929, 367843, 368959, 370071, 370548, 370387, 370414, 371237, 372548, 373690, 374508, 375257, 375980, 376426, 376593, 377041, 378550, 381443, 385281, 389224, 392771, 396176, 400058, 404671, 409786, 415264]
53524D15264O082O749O806O261O227P602R701J0980J0971J0668J0922J1430J1705
53511E31368J2124J3216J4533J5178J5154J5286J5944J6699J7233J7752J8405
53500G02892J9067J9845K1049K2469K3425K3789K4185K4855K5151K4650K3987
53489I55364K3918K4236K4216K3687K2919K1886K0460J9087J8523J8948J9929
53478A193173K1004K1826K1924K1129K0065J9596J9705J9586J8804J7780J7011
53467A411603J6474J5920J5181J3977J2047R729P881O857N987M515K566Q14n62
53454A522989j970l736n855q305j1011j3464j4956j5394j5434j5611j5756j5610
53442A385887j5552j6208j7590j9117k0357k1219k1580k1357k0982k1080k1562
$$ y = [415264, 421346, 428095, 434901, 441162, 447389, 454991, 464692, 475672, 486643, 497311, 508233, 519663, 531368, 543492, 556708, 571241, 586419, 601573, 616859, 632803, 649502, 666735, 684487, 702892, 721959, 741804, 762853, 785322, 808747, 832536, 856721, 881576, 906727, 931377, 955364, 979282, 1003518, 1027734, 1051421, 1074340, 1096226, 1116686, 1135773, 1154296, 1173244, 1193173, 1214177, 1236003, 1257927, 1279056, 1299121, 1318717, 1338422, 1358008, 1376812, 1394592, 1411603, 1428077, 1443997, 1459178, 1473155, 1485202, 1494931, 1502812, 1509669, 1515656, 1520171, 1522737, 1523551, 1522989, 1521019, 1517283, 1511428, 1503123, 1492112, 1478648, 1463692, 1448298, 1432864, 1417253, 1401497, 1385887, 1370335, 1354127, 1336537, 1317420, 1297063, 1275844, 1254264, 1232907, 1211925, 1190845, 1169283]
53431A169283k1599k0784j9643j8680j7598j6021j4239j2629j0889q752o922o269
53419I95258o343n809m331l004k634k580j738O0K063L554M391N068O407Q885J1962
53404A011209J4514J6002J6762J7238J7555J7963J8996K0780K2773K4489K6066
53393A224347K7876K9962L2095L4000L5413L6342L7309L8790M0512M1898M3153
53382A621697M4932M7097M8791M9951N1485N3531N4774N4185N2436N0819M9681
53371B179379M8717M7918M7271M6219M4324M1830L8799L4591K9105K3707J9718
53360B601578J6671J3233R300N737K511j396o278j1292j5829k0059k3969k6979
53348B543228k8873l0281l1910l4057l6885m0359m3755m5984m6683m6338m5365
$$ y = [1169283, 1147684, 1126900, 1107257, 1088577, 1070979, 1054958, 1040719, 1028090, 1017201, 1008449, 1001527, 995258, 988915, 983106, 978775, 975771, 973137, 970557, 968819, 968879, 970942, 974496, 978887, 983955, 990362, 999247, 1011209, 1025723, 1041725, 1058487, 1075725, 1093280, 1111243, 1130239, 1151019, 1173792, 1198281, 1224347, 1252223, 1282185, 1314280, 1348280, 1383693, 1420035, 1457344, 1496134, 1536646, 1578544, 1621697, 1666629, 1713726, 1762517, 1812468, 1863953, 1917484, 1972258, 2026443, 2078879, 2129698, 2179379, 2228096, 2276014, 2323285, 2369504, 2413828, 2455658, 2494457, 2529048, 2558153, 2581860, 2601578, 2618249, 2631482, 2640782, 2646519, 2649030, 2647634, 2641356, 2630064, 2614235, 2594176, 2570207, 2543228, 2514355, 2484074, 2452164, 2418107, 2381222, 2340863, 2297108, 2251124, 2204441, 2158103, 2112738]
53337B112738m3846m2138m0899m0241l9598l8693l7978l7813l7860l7526l6604
53326A679542l5232l3701l2383l1409l0362k8702k6482k4214k2114k0045j8085
53315A376813j6475j5109j3713j2514j2052j2322j2741j2986j3143j3120j2588
53304A230050j1596j0510r359p981o712o083n737m694k785r55J36Q42J590K238
53290A168444K778L788N523P424R034J0758J3024J5386J7203J8593K0038K1445
53278A313438K2356K2787K3131K3377K3066K2052K0798J9841J9161J8226J6636
53267A544869J4699J3194J2353J1368R331O451L790J959P25k45j118k340m355
53254A610681o710q374r256j0399j2313j4181j5261j6093j7442j8972j9906k0407
$$ y = [2112738, 2068892, 2026754, 1985855, 1945614, 1906016, 1867323, 1829345, 1791532, 1753672, 1716146, 1679542, 1644310, 1610609, 1578226, 1546817, 1516455, 1487753, 1461271, 1437057, 1414943, 1394898, 1376813, 1360338, 1345229, 1331516, 1319002, 1306950, 1294628, 1281887, 1268901, 1255758, 1242638, 1230050, 1218454, 1207944, 1198585, 1190604, 1183892, 1177809, 1172072, 1167378, 1164593, 1163638, 1163774, 1164616, 1166206, 1168444, 1171222, 1175010, 1180533, 1187957, 1196991, 1207749, 1220773, 1236159, 1253362, 1271955, 1291993, 1313438, 1335794, 1358581, 1381712, 1405089, 1428155, 1450207, 1471005, 1490846, 1510007, 1528233, 1544869, 1559568, 1572762, 1585115, 1596483, 1605814, 1612265, 1616055, 1618014, 1618739, 1618494, 1617376, 1615036, 1610681, 1603971, 1595597, 1586341, 1575942, 1563629, 1549448, 1534187, 1518094, 1500652, 1481680, 1461774, 1441367]
53242A441367k1270k2556k3470k3512k2955k2347k2033k2046k1978k1203j9706
53231A198291j8406j8134j8589j8718j7944j6572j5284j4708j5160j6247j6970
53220A011559j6650j5609j4549j3658j2702j1659j0709r908r351r320r838j0459
53208H67147j0972j1835j3310j4679j5162j5156j5688j6855j7735j7781j7367
53197G00607j6895j6203j5108j3836j2713j1897j1583j1937j2660j3124j3042
53186E51609j2731j2583j2715j3049j3479j3784j3862j3925j4130j4109j3350
53175D03892j2033j0964j0579j0465j0006r094q139p588p554p638p244o268n265
53162B91055m724m478m193m098m503m998m848m163l788m119m677m913m726m129
$$ y = [1441367, 1420097, 1397541, 1374071, 1350559, 1327604, 1305257, 1283224, 1261178, 1239200, 1217997, 1198291, 1179885, 1161751, 1143162, 1124444, 1106500, 1089928, 1074644, 1059936, 1044776, 1028529, 1011559, 994909, 979300, 964751, 951093, 938391, 926732, 916023, 906115, 896764, 887444, 877606, 867147, 856175, 844340, 831030, 816351, 801189, 786033, 770345, 753490, 735755, 717974, 700607, 683712, 667509, 652401, 638565, 625852, 613955, 602372, 590435, 577775, 564651, 551609, 538878, 526295, 513580, 500531, 487052, 473268, 459406, 445481, 431351, 417242, 403892, 391859, 380895, 370316, 359851, 349845, 340751, 332612, 325024, 317470, 309832, 302588, 296320, 291055, 286331, 281853, 277660, 273562, 269059, 264061, 259213, 255050, 251262, 247143, 242466, 237553, 232827, 228698]
53148B28698l178k341k128k269k038j516j578k336k644j701k96L40Q2m49j122
53133B05524k083k794k342p69P24J115N20j90l18J49O21N26P1J17J001J890J855
53116B05617J195R55J395J784J701J594J866K190K087J602J003L50k80o75r09
53101B21475j443k333k857k493j891k186l517m815n089m370l389k801k823l221
53087A78247l460l199k670k369k367k284j898j382q66k59K92K70n42j641k349
53072A53523k538k439k065j275k86L57L63r1o15r04q30o39q57j652k362k138j010
53055A34542R6M76K57q6l42m61m14l32m89p78p13j51L45K97PK6K51J44l41o87
53035A31647o50n52o42p44p82j106j918k703k658j676n03Q8N5n5J61N54O97M00
$$ y = [228698, 225520, 223179, 221051, 218782, 216744, 215228, 213650, 211314, 208670, 206969, 206673, 207013, 207095, 206646, 205524, 203441, 200647, 198305, 197536, 198260, 199375, 199895, 199705, 199387, 199536, 200157, 200683, 200754, 200871, 201872, 203762, 205617, 206812, 207767, 209162, 210946, 212647, 214241, 216107, 218297, 220384, 221986, 222989, 223339, 223059, 222384, 221475, 220032, 217699, 214842, 212349, 210458, 208272, 204755, 199940, 194851, 190481, 187092, 184291, 181468, 178247, 174787, 171588, 168918, 166549, 164182, 161898, 160000, 158618, 157752, 157493, 157785, 158055, 157513, 155872, 153523, 150985, 148546, 146481, 145206, 144920, 145277, 145640, 145549, 144934, 144030, 143200, 142561, 141704, 140052, 137690, 135552, 134542, 134638, 135114, 135371, 135285, 134943, 134482, 134068, 133736, 133247, 132469, 131756, 131605, 131950, 132247, 132254, 132280, 132531, 132675, 132334, 131647, 130997, 130445, 129803, 129059, 128277, 127171, 125253, 122550, 119892, 118216, 117713, 117801, 117856, 117801, 117962, 118516, 119213, 119613]
53017A19613j50o43q45o15J6P12J032R09P50Q89J112J060P88O22N55K95j07j80
52999A25813K22N54K23o89j613k076j852q94M52J373J280N82K46O22J092J082
52983A26417P73O47P28P72Q59J238J775K059K088K320K959L586L690L243K620
52968A55774K189K184K631L267L719L919M137M419M432L981L345K791K058Q09
52954A99655o60j634j881j847k010k331k479k253j745j263j122j337j609j706
52940A75778j730j819j809j513j149j107j364j530j382j018n63j35K9j85m35l04
52924A59764O1J97J32L69J000J440J280Q18N91P22R69J022O22j28n29P8J262J735
52906A71405R07l15p00j12O92J114J089P83M59M66Q57J178R75L30l76r30j204
$$ y = [119613, 119463, 118820, 117975, 117360, 117376, 118088, 119120, 120029, 120779, 121668, 122780, 123840, 124628, 125250, 125805, 126100, 125993, 125813, 126035, 126589, 126812, 126123, 124510, 122434, 120582, 119688, 120140, 121513, 122793, 123375, 123621, 124243, 125335, 126417, 127190, 127837, 128565, 129337, 130196, 131434, 133209, 135268, 137356, 139676, 142635, 146221, 149911, 153154, 155774, 157963, 160147, 162778, 166045, 169764, 173683, 177820, 182239, 186671, 190652, 193997, 196788, 198846, 199655, 198995, 197361, 195480, 193633, 191623, 189292, 186813, 184560, 182815, 181552, 180430, 179093, 177484, 175778, 174048, 172229, 170420, 168907, 167758, 166651, 165287, 163757, 162375, 161357, 160794, 160659, 160688, 160503, 160068, 159764, 159825, 160022, 160154, 160523, 161523, 162963, 164243, 165061, 165652, 166374, 167343, 168365, 168987, 168859, 168330, 168408, 169670, 171405, 172312, 171997, 171297, 171185, 171877, 172991, 174080, 174863, 175322, 175788, 176645, 177823, 178798, 179128, 178752, 177822, 176618]
52889A76618r24j7J073J783J964J764J278O46J88P2P6K8J96Q23J561J829J488
52872A90446P79r0q63j008k41R02J489J214N31M0N3O43J590K357K491K045J364
52855B03742O50O7r9K39P70J300K087L163L828L530K885K993L883M522M320L716
52839B41596L287L063K859K533J732J73j667k789k870k588k601k838l042l250
52825B33598l417l194k552k068k201k748l352l950m358m101l152k338k327k682
52811A91158k524j831j323j325j487j604j978k749l450l478k727j562m29L31N08
52796A65530J30m20o35l51K0j02p87j498j797j906k256k671k519j711r85r83j484
52779A45575j843j858j760j600j125k17Q49J638J859J457O49j90q05j259j685
$$ y = [176618, 175694, 175677, 176750, 178533, 180497, 182261, 183539, 184185, 184373, 184445, 184521, 184549, 184745, 185568, 187129, 188958, 190446, 191225, 191135, 190272, 189264, 189023, 189925, 191414, 192628, 193159, 193199, 193252, 193895, 195485, 197842, 200333, 202378, 203742, 204392, 204459, 204360, 204599, 205369, 206669, 208756, 211919, 215747, 219277, 222162, 225155, 229038, 233560, 237880, 241596, 244883, 247946, 250805, 253338, 255070, 255243, 253576, 250787, 247917, 245329, 242728, 239890, 236848, 233598, 230181, 226987, 224435, 222367, 220166, 217418, 214066, 210116, 205758, 201657, 198505, 196167, 193840, 191158, 188634, 186803, 185480, 184155, 182668, 181064, 179086, 176337, 172887, 169409, 166682, 165120, 164691, 165022, 165530, 165660, 165240, 164605, 164254, 164274, 164172, 163385, 161887, 160090, 158184, 155928, 153257, 150738, 149027, 148042, 147059, 145575, 143732, 141874, 140114, 138514, 137389, 137172, 138021, 139659, 141518, 142975, 143624, 143434, 142629, 141370, 139685]
52764A39685j953j796j349j255j945k915l093k132r84q31j666k483k711k719k710
52749A09143k141p98K92J3j208j949j716j317j328j321q17q5M17N89L46m88j527
52732I6105j846j198m66l67l81K63J214J422N94o09j554k015j793p86N21J252
52716I0356J045K93m01o34k38N63J075P04l06j105j176o64K8N41N52O8k61K87
52698I0727J491K356K361K091K307K897L117K602J739J169J205J611J799J302
52684A18774K41p68j218j188j120j278j553j732j775j828k007k242k325k111j642
52669I6228j158r75j263j821k182k138k065k344k594j973m59P36M63r62k131k118
52653G3244j274n43m79q60r88l84O52J240R08J23m09o51r36j082n38O10J421J165
$$ y = [139685, 137732, 135936, 134587, 133332, 131387, 128472, 125379, 123247, 122263, 121432, 119766, 117283, 114572, 111853, 109143, 107002, 106204, 106496, 106509, 105301, 103352, 101636, 100319, 98991, 97670, 96853, 96768, 97185, 97774, 98120, 97632, 96105, 94259, 93061, 92595, 92228, 91847, 92110, 93324, 94746, 95340, 94731, 93177, 91162, 89369, 88583, 89104, 90356, 91401, 91694, 91293, 90659, 90421, 90984, 92059, 92763, 92457, 91352, 90176, 89512, 89540, 90081, 90633, 90701, 90440, 90727, 92218, 94574, 96935, 99026, 101333, 104230, 107347, 109949, 111688, 112857, 114062, 115673, 117472, 118774, 119015, 118247, 117029, 115841, 114721, 113443, 111890, 110158, 108383, 106555, 104548, 102306, 99981, 97870, 96228, 95070, 94095, 92832, 91011, 88829, 86691, 84626, 82282, 79688, 77715, 77256, 77992, 78455, 77493, 75362, 73244, 71970, 71427, 70948, 70088, 69100, 68716, 69368, 70608, 71516, 71639, 71230, 70579, 69643, 68561, 68023, 68633, 70054, 71219]
52635G1219J49o67o10K99J442K048J808J154O75L43k14q14p59Q7R22J016N54J16
52617G8768j68m72p15p02o20q30j238j345q45N5R14J412J490J307J007N02k43
52600G8277p25j84J303K522K390J164p6p66j016q30m0R73J356Q55J71k1J96M57
52582H6006P55J214J708K134K602K951K593J416M17O80J903K727K495J901J704
52567A13206J643J050M5n40k42N48J177J419J483J607J771J754J373P76L76M55
52551A27901Q19J002Q21N49N24O66O07J98k40k91R3O12R75J063P92J88m06n32
52533A35341k13l1l54p82p13k00K07K95K65J40k45n72j31J071K026J938J203N74
52515A39819m9j173k426k663j496O7Q37O72K52N1No0q4P5L47L71j01p56q66j87
$$ y = [71219, 71368, 70701, 70091, 70390, 71832, 73880, 75688, 76842, 77517, 77860, 77646, 76832, 76073, 76160, 77082, 78098, 78652, 78768, 78600, 78128, 77413, 76711, 76091, 75261, 74023, 72678, 71833, 71888, 72802, 74214, 75704, 77011, 78018, 78520, 78277, 77552, 77368, 78671, 81193, 83583, 84747, 84671, 83905, 82889, 82059, 82019, 82992, 84348, 85203, 85374, 85353, 85549, 86006, 86761, 87975, 89683, 91817, 94419, 97370, 99963, 101379, 101796, 102476, 104379, 107106, 109601, 111502, 113206, 114849, 115899, 115944, 115404, 115162, 115710, 116887, 118306, 119789, 121396, 123167, 124921, 126294, 127070, 127446, 127901, 128720, 129722, 130543, 131092, 131616, 132282, 132889, 133087, 132847, 132556, 132649, 133261, 134236, 135299, 136091, 136279, 135873, 135341, 135128, 135097, 134743, 133961, 133248, 133048, 133255, 133550, 133815, 133955, 133710, 133138, 133007, 134078, 136104, 138042, 139245, 139819, 139770, 138597, 136171, 133508, 132012, 132079, 132916, 133588, 133840, 133891, 133896, 133836, 133752, 133827, 134174, 134545, 134444, 133688, 132822, 132635]
52495A32635N74N35j90o22j97O13J045R58P34O87Q21R35P72L25P5N39J483K014
52477A43736J700J059O89M43n0n06l74J60L09j65o54o50l83k42q6M61J302J898
52459A48647J877J420R52P23O86O77N64K40m23j361k050j737k06J760L001L075
52443A57845K459J749J077M38J37M40R80J049M50l01p37r88j369j760j847j763
52427A57859j988k552k861k475j714j201j116j187j210j173j040q55q95j296j581
52412A34715j086J13J170J475J270J070R51P53N76O66R83J293J519J688J651J183
52396A49990L74l47o11m08m2P5k21n56k72P69J837K071J522J039J177J620J761
52379A59778J488J177J174J507J938K125J822J140N36M30Q13J366J843K224K527
$$ y = [132635, 133209, 133744, 133554, 132932, 132735, 133348, 134393, 135351, 136085, 136772, 137593, 138528, 139300, 139625, 139700, 140239, 141722, 143736, 145436, 146495, 147184, 147627, 147577, 147071, 146697, 146857, 147166, 147001, 146347, 145697, 145314, 145072, 144986, 145447, 146749, 148647, 150524, 151944, 152896, 153619, 154305, 154982, 155546, 155786, 155363, 154002, 151952, 150215, 150009, 151769, 154770, 157845, 160304, 162053, 163130, 163568, 163705, 164145, 165125, 166174, 166624, 166323, 165586, 164598, 163229, 161469, 159622, 157859, 155871, 153319, 150458, 147983, 146269, 145068, 143952, 142765, 141555, 140382, 139342, 138487, 137592, 136296, 134715, 133629, 133742, 134912, 136387, 137657, 138727, 139678, 140431, 141007, 141673, 142656, 143949, 145468, 147156, 148807, 149990, 150364, 150017, 149406, 148998, 148956, 149031, 148810, 148254, 147982, 148751, 150588, 152659, 154181, 155220, 156397, 158017, 159778, 161266, 162443, 163617, 165124, 167062, 169187, 171009, 172149, 172685, 173115, 173928, 175294, 177137, 179361, 181888]
52364A81888K722K845K983L064K852K256J541R82N61K66M57J411K518K679J788
52349B10813J148J874L362M026L324K198J633J618J665J633J645J714J829K043
52335B40525K234K168J961K002K238K052J236N06O47J537K491L134L429L290K757
52320B72207K339K531L162L714M018M173M020L436K921L153L945M485M570M899
52306C23573N833O743P007P034P621Q716R509R690R929J0940J2439J3441J3440
52293D45915J3014J3119J4052J5310J6325J6965J7290J7325J7310J7766J8887
52282F23278K0095K0659K0581K0480K0676K0831K0480J9555J8371J7372J6777
52271H39155J6298J5341J3779J2273J1396J0773R639Q044O690N700M400K541R32
$$ y = [181888, 184610, 187455, 190438, 193502, 196354, 198610, 200151, 201133, 201694, 201960, 202417, 203828, 206346, 209025, 210813, 211961, 213835, 217197, 221223, 224547, 226745, 228378, 229996, 231661, 233294, 234939, 236653, 238482, 240525, 242759, 244927, 246888, 248890, 251128, 253180, 254416, 254922, 255569, 257106, 259597, 262731, 266160, 269450, 272207, 274546, 277077, 280239, 283953, 287971, 292144, 296164, 299600, 302521, 305674, 309619, 314104, 318674, 323573, 329406, 336149, 343156, 350190, 357811, 366527, 376036, 385726, 395655, 406595, 419034, 432475, 445915, 458929, 472048, 486100, 501410, 517735, 534700, 551990, 569315, 586625, 604391, 623278, 643373, 664032, 684613, 705093, 725769, 746600, 767080, 786635, 805006, 822378, 839155, 855453, 870794, 884573, 896846, 908242, 919015, 928654, 936698, 943388, 949088, 953488, 956029, 956961]
52258I56961L48L88p7j531l354m537m642m152l958m406m869m612l904l609l800
52243I10246l522k213n23P54J841L409N320O767P434P846Q628R917J1481J2888
52229I80273J3692J3869J4063J4861J5874J6018J4779J2858J1378J0782J0544
52218A128991R784Q141O206M997M753M446K914L03k121l579m608o114q153j0053
52204A135907j1297j1933j2247j2484j2848j3408j3977j4295j4338j4324j4360
52193I90396j4185j3426j2024j0364q946p935p178o583o278o207n820m644l094
52180H83712k299k825l961m548m275l714l308k879k243j751j879k483k908k755
52166H41884k307k102k356k820l101l049k865k873l095l167k768k142j926k371
$$ y = [956961, 957309, 957697, 957620, 956089, 952735, 948198, 943556, 939404, 935446, 931040, 926171, 921559, 917655, 914046, 910246, 906724, 904511, 903988, 904742, 906583, 909992, 915312, 922079, 929513, 937359, 945987, 955904, 967385, 980273, 993965, 1007834, 1021897, 1036758, 1052632, 1068650, 1083429, 1096287, 1107665, 1118447, 1128991, 1138775, 1146916, 1153122, 1158119, 1162872, 1167318, 1170232, 1170535, 1168414, 1164835, 1160227, 1154113, 1145960, 1135907, 1124610, 1112677, 1100430, 1087946, 1075098, 1061690, 1047713, 1033418, 1019080, 1004756, 990396, 976211, 962785, 950761, 940397, 931451, 923516, 916338, 909755, 903477, 897270, 891450, 886806, 883712, 881413, 878588, 874627, 870079, 865804, 862090, 858782, 855903, 853660, 851909, 850030, 847547, 844639, 841884, 839577, 837475, 835119, 832299, 829198, 826149, 823284, 820411, 817316, 814149, 811381, 809239, 807313, 804942]
52152H04942k973l047k527j950j792k082k665l453m236m623m439m093m204m871
52138G57987n523n585n010m158l379k920k909l219l400l138k670k521k858l372
52124G07325l745l881l675l122k713l142m283m965m325k979k169k070j766q54
52110F63636p3l3j07P52K543M118M560M184M186N462P757R991J1490J2668J4182
52095G45316J5701J6316J6155J6624J8539K0880K2178K2512K3123K4402K5391
52084I67137K5337K4758K4565K4825K4905K4402K3439K2235K0837J9264J7650
52073A219354J6103J4515J2684J0635Q713P165N708L864J690k43j748l378n579
52060A289483p901r508j0127j0112r862r658r810j0407j1086j1466j1593j1530
$$ y = [804942, 801969, 798922, 796395, 794445, 792653, 790571, 787906, 784453, 780217, 775594, 771155, 767062, 762858, 757987, 752464, 746879, 741869, 737711, 734332, 731412, 728503, 725284, 721884, 718746, 716076, 713555, 710697, 707325, 703580, 699699, 696024, 692902, 690189, 687047, 682764, 677799, 673474, 670495, 668326, 666256, 664490, 663636, 663563, 663530, 663423, 664175, 666718, 670836, 675396, 679580, 683766, 689228, 696985, 706976, 718466, 731134, 745316, 761017, 777333, 793488, 810112, 828651, 849531, 871709, 894221, 917344, 941746, 967137, 992474, 1017232, 1041797, 1066622, 1091527, 1115929, 1139368, 1161603, 1182440, 1201704, 1219354, 1235457, 1249972, 1262656, 1273291, 1282004, 1289169, 1294877, 1298741, 1300431, 1300188, 1298440, 1295062, 1289483, 1281582, 1272074, 1261947, 1251835, 1241973, 1232315, 1222505, 1212098, 1201012, 1189546, 1177953, 1166423]
52048A166423j0937r659q320p588p055n755l693j961j256j120p62J35J572L376
52034A113400M924N516N359N554O717Q238R227R535R459R046Q275P503P144P149
52020A217046P036O304M657K255q8j497k050k675l856n064n818o569p941r644
52006A192096j0904j1661j2742j4832j7664k0190k1455k1552k1729k3104k5222
51995I91041k6535k6410k5765k5493k5289k4675k4204k4630k5554k5952k5623
51984G10911k5134k4672k3957k3045k2319k1760k1118k0609k0487k0072j8354
51973D69384j5650j3666j3524j4424j4703j3591j1658j0004r309r366r353q748
51961C25388p869p218o624n656m592m180m409m470l973l384l068k700k006j333
$$ y = [1166423, 1155486, 1145827, 1137507, 1129919, 1122864, 1117109, 1113416, 1111455, 1110199, 1109079, 1108317, 1108452, 1110024, 1113400, 1118324, 1123840, 1129199, 1134753, 1141470, 1149708, 1158935, 1168470, 1177929, 1186975, 1195250, 1202753, 1209897, 1217046, 1224082, 1230386, 1235043, 1237298, 1237210, 1235713, 1233663, 1230988, 1227132, 1222068, 1216250, 1209681, 1201740, 1192096, 1181192, 1169531, 1156789, 1141957, 1124293, 1104103, 1082648, 1061096, 1039367, 1016263, 991041, 964506, 938096, 912331, 886838, 861549, 836874, 812670, 788040, 762486, 736534, 710911, 685777, 661105, 637148, 614103, 591784, 570024, 548906, 528297, 507810, 487738, 469384, 453734, 440068, 426544, 412120, 397417, 383826, 372168, 362164, 352855, 343489, 334136, 325388, 317519, 310301, 303677, 298021, 293429, 289249, 284840, 280370, 276397, 273013, 269945, 267245, 265239, 263906]
51947B63906j097j236j533j958k351k370k058j936k171k274j979j754k020k434
51933B36735k528k476k646k867k813k658k690k630k097j441j330j662j703j260
51919B05934r44j137j452j391j005n49r6K57J74m98j342j777j702j470j290j021
51903A90691n23o3q4o21j138j076n91l62o53q79m17M42Q03K95n67j114j165q94
51885A82084n69n47j058j776k017j655j361j569j685r16M76J430J418Q24Q5p48
51869A72416j378j093K15J530J858J507J466J818J619M41q32j067k14Q92J584
51854A80762J851J919J882J774J650J541J389J109P18L56K00J90K8m48r11q70
51838A93140l46J18J48r0k76l15j85K49R55J583J857J880J810J555J086P62Q78
$$ y = [263906, 262809, 261573, 260040, 258082, 255731, 253361, 251303, 249367, 247196, 244922, 242943, 241189, 239169, 236735, 234207, 231731, 229085, 226218, 223405, 220747, 218057, 215427, 213330, 211889, 210559, 208897, 207194, 205934, 204990, 203853, 202401, 201010, 200005, 199456, 199360, 199617, 199791, 199293, 197951, 196174, 194472, 193002, 191712, 190691, 190168, 190105, 190021, 189400, 188262, 187186, 186595, 186233, 185580, 184701, 184284, 184726, 185529, 185824, 185257, 184143, 182978, 182084, 181515, 180968, 179910, 178134, 176117, 174462, 173101, 171532, 169847, 168931, 169407, 170837, 172255, 173079, 173164, 172416, 171038, 169945, 170160, 171690, 173548, 175055, 176521, 178339, 179958, 180399, 179567, 178500, 178286, 179178, 180762, 182613, 184532, 186414, 188188, 189838, 191379, 192768, 193877, 194595, 194951, 195151, 195341, 195369, 194921, 194010, 193140, 192794, 192912, 193060, 192970, 192694, 192379, 192194, 192443, 193398, 194981, 196838, 198718, 200528, 202083, 203169, 203931, 204809]
51821B04809J128R77N10L62Q42J479J602J001qr14j250q65j10M23M39J32j95m31
51803B09931n48m34l4N03R41J204J432J764K104K118J513M50m76p42m23r6k23
51786B18984o47o84K06J708K752K593J746J392J839K122J428K62l10p9L60P09
51770B34381J197J821K171K147K149K350K412K149J883J798J580J108R80J852
51756B59978L530N188O249O606O299N489M689M416M547M458L862L076K382J510
51742C22279Q5j693l150l843l911l699l380k987k597k221j710j009m58m56q54
51727B90396r92n56k9o0o32j188j351j181q40m30j71l63j009j722k082j985j711
51710B74094j738k375l307l658k836j298j53j1n57j204j725k100k196j878j289
$$ y = [204809, 205937, 206914, 207424, 207786, 208628, 210107, 211709, 212710, 212702, 211788, 210538, 209673, 209563, 209986, 210425, 210557, 210362, 209931, 209383, 208949, 208915, 209418, 210359, 211563, 212995, 214759, 216863, 218981, 220494, 220944, 220468, 219726, 219303, 219207, 218984, 218337, 217653, 217859, 219567, 222319, 224912, 226658, 228050, 229889, 232011, 233439, 233701, 233391, 233312, 233672, 234381, 235578, 237399, 239570, 241717, 243866, 246216, 248628, 250777, 252660, 254458, 256038, 257146, 258126, 259978, 263508, 268696, 274945, 281551, 287850, 293339, 298028, 302444, 306991, 311449, 315311, 318387, 320769, 322279, 322364, 320671, 317521, 313678, 309767, 306068, 302688, 299701, 297104, 294883, 293173, 292164, 291706, 291250, 290396, 289404, 288848, 288819, 288759, 288127, 286939, 285588, 284407, 283567, 283137, 282966, 282603, 281594, 279872, 277790, 275805, 274094, 272356, 269981, 266674, 263016, 260180, 258882, 258729, 258718, 258161, 256957, 255232, 253132, 250936, 249058, 247769]
51695B47769p25l83k64k45j66m2q1l71n64k08O56J567K303L093M101N135N950
51678B67525O427O250M889K309n97k671l498l517l379l463l796m106l958l215
51664B55200k393k271l054m056m328l580k434j836k162k963l444l156k234j209
51650B16080o77r69j825k513k571k271k125k064j628q56m08o36j042r81m52J06
51634A95168M14M28O6o30j267j429j188r97j098j247j110o80l10l44p54j178j341
51617A82503j381j488j450q51K37J213J659J747J687J296L79p18j381j319p23
51602A81410L2N75O57M34L87P51J188J329J296J419J670J841K030K420K714K416
51586B02569J690J356J876K717K987K373J315M68K10M80Q31P86K61l98q58j130
$$ y = [247769, 247044, 246661, 246397, 246152, 245986, 245944, 245863, 245492, 244928, 244720, 245376, 246943, 249246, 252339, 256440, 261575, 267525, 273952, 280202, 285091, 287400, 286803, 284132, 280634, 277117, 273738, 270275, 266479, 262373, 258415, 255200, 252807, 250536, 247482, 243426, 239098, 235518, 233084, 231248, 229086, 226123, 222679, 219523, 217289, 216080, 215403, 214434, 212609, 210096, 207525, 205254, 203129, 201065, 199437, 198581, 198173, 197537, 196495, 195514, 195062, 195168, 195582, 196010, 196076, 195446, 194179, 192750, 191562, 190565, 189467, 188220, 187110, 186430, 186120, 185776, 185022, 183844, 182503, 181122, 179634, 178184, 177333, 177570, 178783, 180442, 182189, 183876, 185172, 185551, 184833, 183452, 182133, 181410, 181442, 182017, 182674, 183108, 183495, 184246, 185434, 186763, 188059, 189478, 191148, 192989, 195019, 197439, 200153, 202569, 204259, 205615, 207491, 210208, 213195, 215568, 216883, 217351, 217561, 218041, 218872, 219658, 219919, 219521, 218663, 217533]
51570B17533j411j712j749j260m02K66K63k13m12J15R82J511J679J968K392K238
51554B21788J126j31l35O88J946K530K497K419K565K792K879K637J953J021L54
51539B46729K12K54J05L2N52J473K015J876J597J654J865J894J787J611J184N73
51523B65413K97N18O08P3o31q66q76j191j471j008j21Q2o44j437j735j913k216
51506B52882k226j739j275j184j079o46k21n0J84N53M74k73q75o93l65p87j598
51489B41082j702q84O4N84P55P07N63Q36J935L250L631K887K042J935K301K469
51473B62455K305K076J898J643J238Q42Q92J773L146L887L242J916J391K097K984
51458B93785K992K262J546J069N20j42m95k73K20M39K12j75m64p53j143j300q95
$$ y = [217533, 216122, 214410, 212661, 211401, 210999, 211265, 211528, 211315, 210903, 211018, 212000, 213511, 215190, 217158, 219550, 221788, 222914, 222783, 222448, 223136, 225082, 227612, 230109, 232528, 235093, 237885, 240764, 243401, 245354, 246375, 246729, 246941, 247195, 247300, 247332, 247884, 249357, 251372, 253248, 254845, 256499, 258364, 260258, 262045, 263656, 264840, 265413, 265710, 266228, 266836, 266909, 266278, 265412, 264536, 263345, 261874, 260866, 260745, 260827, 260183, 258746, 257011, 255098, 252882, 250656, 248917, 247642, 246458, 245379, 244733, 244512, 244462, 244646, 245199, 245673, 245400, 244525, 243832, 243467, 242680, 241082, 239380, 238496, 238560, 239144, 239899, 240606, 241169, 242005, 243940, 247190, 250821, 253708, 255750, 257685, 259986, 262455, 264760, 266836, 268734, 270377, 271615, 272457, 273349, 275122, 278268, 282155, 285397, 287313, 288704, 290801, 293785, 296777, 299039, 300585, 301654, 302174, 302032, 301537, 301264, 301484, 301923, 302135, 301960, 301496, 300743, 299600, 298300, 297405]
51441B97405l74o56j827k888l164l217l730m228l865k966k663l201l752l846l828
51426B53200l847l475k737k422k855l222k739j766j129r69q78o90m93k50M8J54
51410B25930QK7M83R41R16O37O79J043J280J234J011L93r38k562l475l323k908
51393B21376l148l986m690m908m916n002n005m578l713k813k352k480k947l324
51379A67514l327l056k892l093l391l210k396j530j244j375j169l63L80L21l93
51364A40776r63r77q79j290k124k633k307j500r43q24o95k73J01J28J22N04J000
51347A27223R59L67j00o4Q3j36n64o55j49O93J286J121L12k89M6R43J307Q37M75
51328A33695J065K152K640K226J588J420J788K350K739K759K448K008J462O25
$$ y = [297405, 297031, 296375, 294548, 291660, 288496, 285279, 281549, 277321, 273456, 270490, 267827, 264626, 260874, 257028, 253200, 249353, 245878, 243141, 240719, 237864, 234642, 231903, 230137, 229008, 228039, 227161, 226471, 225978, 225728, 225776, 225930, 225938, 225965, 226448, 227389, 228305, 228942, 229621, 230664, 231944, 233178, 234189, 234582, 233644, 231082, 227607, 224284, 221376, 218228, 214242, 209552, 204644, 199728, 194726, 189721, 185143, 181430, 178617, 176265, 173785, 170838, 167514, 164187, 161131, 158239, 155146, 151755, 148545, 146149, 144619, 143375, 142000, 140831, 140468, 140848, 141169, 140776, 139813, 138836, 137957, 136667, 134543, 131910, 129603, 128103, 127160, 126336, 125641, 125368, 125469, 125597, 125719, 126223, 127223, 128182, 128549, 128449, 128385, 128468, 128332, 127768, 127113, 126964, 127657, 128943, 130064, 130376, 130087, 130133, 131076, 132383, 133220, 133695, 134760, 136912, 139552, 141778, 143366, 144786, 146574, 148924, 151663, 154422, 156870, 158878, 160340, 160965]
51314A60965n06j513k029k214k491k970l418l578l277k466j476j029j530k433
51300A30035k753k129j106l86k30n05r51j263j208q15l41j8M2j39l28j40M70R29
51282A19164N91m24j253j220m72L38O96M64j57p64j027r96r64r88p90k89Q2j26
51264A11865o60p13J06J213J589Q92k07q06p04m06l35l32JO73J219J149L99o25
51246A14318j371j570j390j097p19j79K96L46J04J79P93J325J121M18o1j01o5
51229A12347j10j9K13K43K4lM49J073J462J577J505J233Q68P38Q71Q71O20O88
51211A24650J456K276K224J420P93O78M93q3n70n81m24l75l5Q43J585J391N56
51194A36297O0J75L38K82M08Q72J119P12j9m71n07l25q3M7r6k62J36J126J777
$$ y = [160965, 160459, 158946, 156917, 154703, 152212, 149242, 145824, 142246, 138969, 136503, 135027, 133998, 132468, 130035, 127282, 125153, 124047, 123661, 123431, 122926, 121975, 120712, 119504, 118689, 118348, 118330, 118372, 118233, 117905, 117765, 118235, 119164, 119755, 119331, 118078, 116858, 116386, 116724, 117420, 117884, 117727, 116963, 115936, 114940, 113976, 112988, 112198, 111909, 111991, 111865, 111205, 110492, 110598, 111811, 113400, 114292, 114085, 113279, 112575, 112169, 111834, 111502, 111503, 112176, 113395, 114544, 114943, 114318, 112947, 111377, 109987, 108890, 108171, 107992, 108288, 108634, 108738, 108917, 109710, 111035, 112156, 112574, 112513, 112412, 112347, 112237, 112218, 112431, 112674, 112698, 112695, 113144, 114217, 115679, 117256, 118761, 119994, 120862, 121600, 122471, 123342, 123962, 124650, 126106, 128382, 130606, 132026, 132819, 133497, 133990, 133907, 133337, 132756, 132332, 131957, 131922, 132765, 134350, 135741, 136297, 136357, 136532, 136870, 137152, 137560, 138432, 139551, 140263, 140244, 139773, 139266, 138941, 138858, 138905, 138809, 138547, 138683, 139809, 141586]
51175A41586J261j6r00r06o12o72j060j320j207r40r68j513k197k350j840j319
51159A25027j287j332q08O5M74K37q8k85p83j658k108j535m43K56M48O39R34R33
51141A18686N60K50J96L0m07n44K02J420K019J591Q44M93K87l59j172j280o32
51124A22184k24o11j018n27L99M79n82j713j862j016J72J159J663J662J417J233
51108A22815J061P37M93O85J042Q62P9n19l94Q4L78N42Q26J058J003Q77J041J419
51090A34089J702J878K144K523K913L229L232K546J195j76j032j516j895j875
51076A48957j089N3P19P46P19R22R44M75m9j7N42J044J147J075J125J121O00m08
51058A58626j155j014l68j29m32m20M38J471J754J319P86K53o35j589j704o78
$$ y = [141586, 142847, 142831, 141931, 141025, 140413, 139741, 138681, 137361, 136154, 135214, 134246, 132733, 130536, 128186, 126346, 125027, 123740, 122408, 121600, 121665, 122139, 122376, 122288, 122003, 121220, 119562, 117454, 115919, 115476, 115732, 116180, 116819, 117753, 118686, 119246, 119496, 119692, 119722, 119315, 118771, 118973, 120393, 122412, 124003, 124847, 125340, 125627, 125268, 124096, 122816, 122184, 121960, 121349, 120331, 119804, 120203, 120682, 120100, 118387, 116525, 115509, 115681, 116840, 118503, 120165, 121582, 122815, 123876, 124613, 125106, 125791, 126833, 127695, 127774, 127255, 126861, 126945, 127323, 127865, 128691, 129749, 130752, 131629, 132670, 134089, 135791, 137669, 139813, 142336, 145249, 148478, 151710, 154256, 155451, 155275, 154243, 152727, 150832, 148957, 147868, 147921, 148640, 149386, 150105, 151027, 151971, 152446, 152397, 152380, 152922, 153966, 155113, 156188, 157313, 158434, 159034, 158626, 157471, 156457, 156089, 155960, 155528, 155108, 155546, 157017, 158771, 160090, 160876, 161129, 160494, 158905, 157201, 156523]
51042A56523O07J137Q70M59L06K87K25J94L24O50J091J527J853K043K195K351
51026A72642K277J595L78n22j82J184K172J740N20k7M54R70Q16N89J101K101K728
51009A90536K711K386J979J635J828K896M201M552L667K558K230K589K940L157
50995B29865L839N308O931P635P138O370O385P106P623P706Q182R532J0897J1267
50981C35784J1084J1696J3459J5392J6761J8033J9918K2333K4783K7264L0183
50970E46690L3682L7571M1752M6308N1084N5599N9496O2992O6648P0665P4544
50959A147031P7524P9163P9277P7574P3922O8943O3488N7361M9400L9378K8961
50948A842022J9977J2338M757k997r846j5185j9578k3362k5826k6327k5399k4039
$$ y = [156523, 157130, 158267, 159137, 159596, 159902, 160189, 160414, 160608, 160932, 161582, 162673, 164200, 166053, 168096, 170291, 172642, 174919, 176514, 176892, 176370, 176188, 177372, 179544, 181284, 181804, 181777, 182231, 183201, 184017, 184606, 185707, 187808, 190536, 193247, 195633, 197612, 199247, 201075, 203971, 208172, 212724, 216391, 218949, 221179, 223768, 226708, 229865, 233704, 239012, 245943, 253578, 260716, 267086, 273471, 280577, 288200, 295906, 304088, 313620, 324517, 335784, 346868, 358564, 372023, 387415, 404176, 422209, 442127, 464460, 489243, 516507, 546690, 580372, 617943, 659695, 706003, 757087, 812686, 872182, 935174, 1001822, 1072487, 1147031, 1224555, 1303718, 1382995, 1460569, 1534491, 1603434, 1666922, 1724283, 1773683, 1813061, 1842022, 1861999, 1874337, 1879094, 1876097, 1866251, 1851066, 1831488, 1808126, 1782300, 1755973, 1730574, 1706535]
50936A706535k2569k0791j8764j7010j6159j6757j8962k2192k5534k8743l2355
50925A466699l6648m1110m5235m9122n2724n5245n6019n5453n4399n2966n0731
50914I17047m7780m4713m1730l8548l5149l1924k8974k5991k2923k0124j7668
50903E61523j5166j2533j0322q914p807o280m465l203k894k918k318q59O81J221
50889D85746M70o14n95J011L171M435M464M117M180M552M906N478O618P894Q487
50874E44320Q422Q662R747J1055J1818J2273J3153J4576J6144J7849K0004K2374
50862G10397K4311K5919K8253L2046L6876M2075M7742N4303O1546O8873P6361
50851A208702Q4831R4729J05528J16332J26663J36435J45524J53744J61046J67431
$$ y = [1706535, 1683966, 1663175, 1644411, 1627401, 1611242, 1594485, 1575523, 1553331, 1527797, 1499054, 1466699, 1430051, 1388941, 1343706, 1294584, 1241860, 1186615, 1130596, 1075143, 1020744, 967778, 917047, 869267, 824554, 782824, 744276, 709127, 677203, 648229, 622238, 599315, 579191, 561523, 546357, 533824, 523502, 514588, 506781, 500501, 496036, 492833, 489939, 487021, 484703, 483844, 484525, 485746, 486216, 485602, 485007, 486018, 489189, 493624, 498088, 502205, 506385, 510937, 515843, 521321, 527939, 535833, 544320, 552742, 561404, 571151, 582206, 594024, 606297, 619450, 634026, 650170, 668019, 688023, 710397, 734708, 760627, 788880, 820926, 857802, 899877, 947619, 1001922, 1063468, 1132341, 1208702, 1293533, 1388262, 1493790, 1610122, 1736785, 1873220, 2018744, 2172488, 2333534, 2500965]
50841B500965J72567J75722J75987J72473J64271J50719J32000J09409Q4703N9191
50831C898007L3687R191j2963l1931m7818o0923p0806p6454p7169p2990o4618
50820C425213n3601m2312l2986k6603k3133k2707k5784l2186m0792n0650o1714
50809C012745p4028q6749r8545j08719j17278j24120j28732j30688j30031j27027
50799A886828j21855j14683j06009r6713q7711p9373p1340o3119n4875m7341m0968
50788A002841l5407l0025k4645j9596j5276j1822r078o669m269j944j28P97P80
50775H45559K4j063j895k054j809j913k743l912m857n473n943o337o626o777o600
50760G87581n796m438l025j819m78J313L210M689N860P233Q855J0229J1075J1696
$$ y = [2500965, 2673532, 2849254, 3025241, 3197714, 3361985, 3512704, 3644704, 3754113, 3838816, 3898007, 3931694, 3940885, 3927922, 3895991, 3848173, 3787250, 3716444, 3639990, 3562821, 3489831, 3425213, 3371612, 3329300, 3296314, 3269711, 3246578, 3223871, 3198087, 3165901, 3125109, 3074459, 3012745, 2938717, 2851968, 2753423, 2644704, 2527426, 2403306, 2274574, 2143886, 2013855, 1886828, 1764973, 1650290, 1544281, 1447568, 1359857, 1280484, 1209144, 1146025, 1091150, 1043809, 1002841, 967434, 937409, 912764, 893168, 877892, 866070, 856992, 850323, 846054, 844110, 843982, 844779, 845559, 845583, 844520, 842625, 840571, 838762, 836849, 834106, 830194, 825337, 819864, 813921, 807584, 800958, 794181, 787581, 781785, 777347, 774322, 772503, 772025, 773338, 776548, 781237, 787097, 794330, 803185, 813414, 824489, 836185]
50746H36185J2522J3714J5238J6995J8833K0688K2812K5593K9147L3243L7765
50735A082735M2980M9296N6804O5080P3373Q1049Q7958R4268R9913J04348J06988
50724A944792J07703J06569J03357R7566Q8942P7680O4066M8229L0375J1154q252
50713B672181k6401m1966n4078o2365o6815o7652o5311o0369n3451m5274l6794
50702B091705k9016k2514j7364j3633j1782j2452j5983k2224l0578m0171n0095
50691A825893n9597o7847p3750p6511p6478p4874p2496o9156o4620n9424n4241
50680A076899m8976m3247l7385l2199k7875k3793j9419j4742r902m997l45L657
50668H17676P074J0347J3574J6454J8883K1008K2567K2920K2158K1493K1922K3035
$$ y = [836185, 848707, 862421, 877659, 894654, 913487, 934175, 956987, 982580, 1011727, 1044970, 1082735, 1125715, 1175011, 1231815, 1296895, 1370268, 1451317, 1539275, 1633543, 1733456, 1837804, 1944792, 2052495, 2159064, 2262421, 2359987, 2448929, 2526609, 2590675, 2638904, 2669279, 2680433, 2672181, 2645780, 2603814, 2549736, 2487371, 2420556, 2352904, 2287593, 2227224, 2173773, 2128499, 2091705, 2062689, 2040175, 2022811, 2009178, 1997396, 1984944, 1968961, 1946737, 1916159, 1875988, 1825893, 1766296, 1698449, 1624699, 1548188, 1471710, 1396836, 1324340, 1255184, 1190564, 1131140, 1076899, 1027923, 984676, 947291, 915092, 887217, 863424, 844005, 829263, 819361, 814364, 814019, 817676, 824750, 835097, 848671, 865125, 884008, 905016, 927583, 950503, 972661, 994154, 1016076, 1039111]
50656A039111K3729K3769K3891K4515K5250K5742K6278K7134K7864K7788K7017
50645A322088K6404K6539K7174K7756K8159K8698K9702L1356L3714L6548L9223
50634A657361M1089M2021M2326M2046M0649L7616L3104K7827K2354J6805J1083
50623B014281N292k21n077r080j2169j4212j4945j4196j2042q671m205J064O385
50610A932204J0809J3773J5305J5737J5454J4771J3626J1447P701K579l323r948
50598B040135j7751k6670l5774m4208n1853n8704o4251o8003p0123p0952p0342
50587A461504o8122o4815o1301n7889n4325n0489m6538m2552l8619l5093l2181
50576I09580k9463k6349k2903j9621j6570j3482j0512q085o047l765j215Q78K226
$$ y = [1039111, 1062840, 1086609, 1110500, 1135015, 1160265, 1186007, 1212285, 1239419, 1267283, 1295071, 1322088, 1348492, 1375031, 1402205, 1429961, 1458120, 1486818, 1516520, 1547876, 1581590, 1618138, 1657361, 1698450, 1740471, 1782797, 1824843, 1865492, 1903108, 1936212, 1964039, 1986393, 2003198, 2014281, 2019573, 2019352, 2014275, 2005195, 1993026, 1978814, 1963869, 1949673, 1937631, 1928960, 1924755, 1925819, 1932204, 1943013, 1956786, 1972091, 1987828, 2003282, 2018053, 2031679, 2043126, 2050827, 2053406, 2050083, 2040135, 2022384, 1995714, 1959940, 1915732, 1863879, 1805175, 1740924, 1672921, 1602798, 1531846, 1461504, 1393382, 1328567, 1267266, 1209377, 1155052, 1104563, 1058025, 1015473, 976854, 941761, 909580, 880117, 853768, 830865, 811244, 794674, 781192, 770680, 762595, 756548, 752783, 751568, 752446, 754672]
50563G54672L568N606Q057J0160J1691J2954J4235J5709J7578J9859K2235K4502
50551I20826K6880K9576L2309L4652L6629L8510M0235M1479M2242M2888M3532
50540A329758M3865M3746M3670M4298M5701M7285M8485M9280M9977N0771N1774
50529A848610N3357N6032N9873O4375O9120P4246P9983Q5898R1123R5223R8420
50518B676260J00857J02113J01541R8807R3793Q6322P6277O3905M9746L4198J7413
50507C501232l91j8596l6297n2711o7359p9897q9932r7089j01110j01640r8223
50496B757987r0889q0610o8680n5552m0927k5086r444M561J6534K6526L3972L7918
50484B506310L7944L4095K6152J3774k632k1739m1877o1242p7952r0802r9945
$$ y = [754672, 758240, 763846, 771903, 782063, 793754, 806708, 820943, 836652, 854230, 874089, 896324, 920826, 947706, 977282, 1009591, 1044243, 1080872, 1119382, 1159617, 1201096, 1243338, 1286226, 1329758, 1373623, 1417369, 1461039, 1505337, 1551038, 1598323, 1646808, 1696088, 1746065, 1796836, 1848610, 1901967, 1957999, 2017872, 2082247, 2151367, 2225613, 2305596, 2391494, 2482617, 2577840, 2676260, 2777117, 2879230, 2980771, 3079578, 3173371, 3259693, 3335970, 3399875, 3449621, 3483819, 3501232, 3500841, 3482245, 3445948, 3393237, 3325878, 3245981, 3156049, 3058960, 2957850, 2856210, 2757987, 2667098, 2586488, 2517808, 2462256, 2421329, 2396243, 2386799, 2391360, 2407894, 2434420, 2468392, 2506310, 2544254, 2578349, 2604501, 2618275, 2615643, 2593904, 2552027, 2490785, 2412833, 2322031, 2222086]
50473B222086j06158j09449j09281j06062j01377r6452r1275q5539p9509p3440
50463A263544o7017o0048n3139m7017m1632l6585l1912k7784k3822j9488j5015
50452H40085j1239q588o751n207l606j655P33L157N061O354P446Q652J0016J1707
50438H56165J4034J6797J9084K0153K0420K1157K3061K5438K7097K7826K8491
50427A099723K9584L0435L0324K9811L0048L1007L1367L0364K8766K7684K7366
50416A426479K7682K8910L1108L3333L4654L5721L8198M2557M7308N0669N2264
50405A848883N2798N2751N1982N0292M7778M4596M0750L6176L0992K5406J9374
50394B301778J2311L414p520j9731l2034m3636n4229o3563p1320p7340q1563q3711
$$ y = [2222086, 2115928, 2006479, 1897198, 1791136, 1689759, 1593307, 1502032, 1416493, 1336984, 1263544, 1196527, 1136479, 1083340, 1036323, 994691, 958106, 926194, 898410, 874588, 855100, 840085, 828846, 820258, 813507, 808300, 804694, 803039, 803772, 806929, 811990, 818344, 825790, 834442, 844458, 856165, 870199, 886996, 906080, 926233, 946653, 967810, 990871, 1016309, 1043406, 1071232, 1099723, 1129307, 1159742, 1190066, 1219877, 1249925, 1280932, 1312299, 1342663, 1371429, 1399113, 1426479, 1454161, 1483071, 1514179, 1547512, 1582166, 1617887, 1656085, 1698642, 1745950, 1796619, 1848883, 1901681, 1954432, 2006414, 2056706, 2104484, 2149080, 2189830, 2226006, 2256998, 2282404, 2301778, 2314089, 2317503, 2309983, 2290252, 2258218, 2214582, 2160353, 2096790, 2025470, 1948130, 1866567, 1782856]
50382A782856q3436q0740p5997o9461o1187n1629m1839l2729k4286j5846p062
50371A238644J645R472J5745J9979K1778K0920J7512J1951M751l537j2270k0719
50359A325871k8259l4534l9465m3043m5160m5637m4550m2503m0365l8584l6827
50348H86944l4570l1937k9552k7567k5351k2483j9551j7461j6178j4807j2804
50337F34683j0542q611p147n966m846l475j614M40K010K927L837N283O945Q217
50323F22141R146J0155J1117J1492J1319J1411J2264J3409J4175J4696J5598J6955
50311G73878J8113J8643J8952J9633K0560K1069K0862K0225J9307J7784J5533
50300I84559J3159J1366J0093Q738P037N176L260J195q09k265l000l354l693m237
$$ y = [1782856, 1699420, 1618680, 1542683, 1473222, 1412035, 1360406, 1318567, 1285838, 1261552, 1245706, 1238644, 1240289, 1249761, 1265506, 1285485, 1307263, 1328183, 1345695, 1357646, 1362397, 1358860, 1346590, 1325871, 1297612, 1263078, 1223613, 1180570, 1135410, 1089773, 1045223, 1002720, 962355, 923771, 886944, 852374, 820437, 790885, 763318, 737967, 715484, 695933, 678472, 662294, 647487, 634683, 624141, 615530, 608383, 602417, 597571, 594096, 592482, 592922, 594932, 597859, 601696, 606979, 613924, 622141, 631287, 641442, 652559, 664051, 675370, 686781, 699045, 712454, 726629, 741325, 756923, 773878, 791991, 810634, 829586, 849219, 869779, 890848, 911710, 931935, 951242, 969026, 984559, 997718, 1009084, 1019177, 1027915, 1034952, 1040128, 1043388, 1044583, 1043774, 1041509, 1038509, 1035155, 1031462, 1027225]
50286A027225n304p242r949j2937j5872j8512k0198k0244j9086j8129j8091j8255
50274H43406j7864j7329j7343j7574j7224j6405j5891j5706j5054j3627j2065
50263F67324j0969j0187r301q194o921n539m172k937j679k60J025J751K131K815
50249F14887L942M925N341N397N384N247N024N023N256N152M290K976J716N53
50235F75113o05j433j604j517j990l237m691n757o280o279n805n209n019n315
50221F20372n555n337m827m282l487k229r49l45m01l97J28J015K090L443M846
50206F04085N576N263M429L716L073K308J916K454L416L656K932K075J623J126
50192F47648J06j190k314l181l755l867l738l991m737n324n491n963p248q581
$$ y = [1027225, 1021921, 1014679, 1004730, 991793, 975921, 957409, 937211, 916967, 897881, 879752, 861661, 843406, 825542, 808213, 790870, 773296, 756072, 739667, 723776, 708070, 693016, 679389, 667324, 656355, 646168, 636867, 628673, 621752, 616213, 612041, 609104, 607425, 607165, 608190, 609941, 612072, 614887, 618829, 623754, 629095, 634492, 639876, 645123, 650147, 655170, 660426, 665578, 669868, 672844, 674560, 675113, 674508, 673075, 671471, 669954, 667964, 664727, 660036, 654279, 647999, 641720, 635915, 630706, 625687, 620372, 614817, 609480, 604653, 600371, 596884, 594655, 593706, 593361, 592960, 592563, 592691, 593706, 595796, 599239, 604085, 609661, 614924, 619353, 623069, 626142, 628450, 630366, 632820, 636236, 639892, 642824, 644899, 646522, 647648, 647754, 646564, 644250, 641069, 637314, 633447, 629709, 625718, 620981, 615657, 610166, 604203, 596955, 588374]
50178E88374q972q669q617q908q842q211p488o737n500l801k368j557q76R0R96
50163E08914J396J427J426J249M97q42k338l619m708n844p026p791p598o548n403
50148D63192m730m355l963l738l879l940l385k556k232k390k341j991j991k451
50134D19250k500j561k26O83J183J693K131K121J757J599K042L047M288N211N335
50119D46053M754M103L793L601L252K930K894K963K798K385J876J307P87N82O50
50104D84728M74j92p84o90j59J57K95Q67J979K978L358L245K930K491K172K576
50088E06425M024O047P852R093R909J0378J0375R941R539R694J0525J1673J2676
50075F28151J3279J3485J3434J3359J3551J4212J5232J6130J6288J5384J3697
$$ y = [588374, 579402, 570733, 562116, 553208, 544366, 536155, 528667, 521930, 516430, 512629, 510261, 508704, 507828, 507918, 508914, 510310, 511737, 513163, 514412, 514909, 514067, 511729, 508110, 503402, 497558, 490532, 482741, 475143, 468595, 463192, 458462, 454107, 450144, 446406, 442527, 438587, 435202, 432646, 430414, 428024, 425683, 423692, 421701, 419250, 416750, 415189, 414963, 415646, 416829, 418522, 420653, 422774, 424531, 426130, 428172, 431219, 435507, 440718, 446053, 450807, 454910, 458703, 462304, 465556, 468486, 471380, 474343, 477141, 479526, 481402, 482709, 483496, 484078, 484728, 485202, 485010, 484226, 483536, 483377, 483534, 483829, 484696, 486675, 489653, 493011, 496256, 499186, 501677, 503849, 506425, 510449, 516496, 524348, 533441, 543350, 553728, 564103, 574044, 583583, 593277, 603802, 615475, 628151, 641430, 654915, 668349, 681708, 695259, 709471, 724703, 740833, 757121, 772505, 786202]
50064G86202J1996J0929J0528J0360J0122R823R401Q715Q048Q100R018R879R781
50051I12902R031Q588Q618Q543Q402R046J0650J2180J2819J3126J4046J5519J6933
50038A060403J8404K0556K3315K5852K7716K9076K9721K8745K5649K1181J6573
50027A327191J2372Q500N168L088K635L258M059M741N618O573O527M309j65o016
50013A387858j2558j9686k6992l3285l7497l9725m0757m0869l9703l7248l4199
50002A025339l1196k8167k4809k1404j8806j7565j7303j7015j6053j4688j3749
49991H04584j3708j4318j4990j5266j4943j4139j3373j3256j3770j4172j3894
49980F48755j3224j2787j2558j1958j0778r535q772q393p884o965n821m869m358
$$ y = [786202, 798198, 809127, 819655, 830015, 840137, 849960, 859361, 868076, 876124, 884224, 893242, 903121, 912902, 921933, 930521, 939139, 947682, 956084, 965130, 975780, 987960, 1000779, 1013905, 1027951, 1043470, 1060403, 1078807, 1099363, 1122678, 1148530, 1176246, 1205322, 1235043, 1263788, 1289437, 1310618, 1327191, 1339563, 1348063, 1353231, 1356319, 1358954, 1362212, 1366271, 1371012, 1376630, 1383203, 1389730, 1394039, 1393874, 1387858, 1375300, 1355614, 1328622, 1295337, 1257840, 1218115, 1177358, 1136489, 1096786, 1059538, 1025339, 994143, 965976, 941167, 919763, 900957, 883392, 866089, 849074, 833021, 818333, 804584, 790876, 776558, 761568, 746302, 731359, 717220, 703847, 690591, 676821, 662649, 648755, 635531, 622744, 610186, 598228, 587450, 577915, 569143, 560750, 552866, 545901, 540080, 535211, 530853]
49967E30853m196m034l566k768j880j238j095j353j515j115l20J82L5l43l83j44
49951E07120r6l59n74m84l02l81p76j103q49J16J281J961K174K669L907N398O492
49934E26194P352Q604J0253J1701J2788J4006J5588J7119J8425K0276K3572K8166
49922G14044L3005L7379M1517M5868N0133N3295N4530N3880N1978M9275M5793
49911A230697M1598L7171L3201L0174K8384K8034K8968L0399L1255L0764K8542
49900A579187K4216J7473Q477k010j3036k3719l3265m1101m7118n1562n4594n6245
49888A306703n6709n6401n5593n4332n2700n0908m8991m6766m4130m1143l7780
49877G61250l4035l0370k7578k5789k4106k1643j8693j6326j4974j3968j2577
$$ y = [530853, 526657, 522623, 519057, 516289, 514409, 513171, 512076, 510723, 509208, 508093, 507773, 507955, 507990, 507647, 507264, 507120, 507024, 506665, 506091, 505607, 505305, 504924, 504148, 503045, 502196, 502312, 503593, 505554, 507728, 510397, 514304, 519702, 526194, 533546, 542150, 552403, 564104, 576892, 590898, 606486, 623605, 642030, 662306, 685878, 714044, 747049, 784428, 825945, 871813, 921946, 975241, 1029771, 1083651, 1135629, 1184904, 1230697, 1272295, 1309466, 1342667, 1372841, 1401225, 1429259, 1458227, 1488626, 1519881, 1550645, 1579187, 1603403, 1620876, 1629353, 1627343, 1614307, 1590588, 1557323, 1516222, 1469104, 1417542, 1362948, 1306703, 1249994, 1193593, 1138000, 1083668, 1030968, 980060, 931069, 884303, 840173, 799030, 761250, 727215, 696845, 669267, 643478, 619372, 597729, 579036, 562710, 547736, 533768, 521191]
49866E21191j0928r614q791q088p311o752o687o869o817o441o092n993n915n465
49852D19428m461k982j326p9J62o34j753k432k567k499k354j986j421r80r14j237
49836C91965j814k319k281j563p21m38o69p66l93J90P09J100J177P28J58L10J342
49819C86715K365K675K693L161M005M661N191O194P732R046R524R443R624J0618
49805D73647J2285J3984J5270J6522J8657K1970K5650K8811L1578L4569L7596
49794G30539L9726M0414L9756L7623L3573K7971K2325J7917J4764J2390J1007
49783A028005J1143J2526J4165J5427J6158J5835J3312P752n83j0612k1094l0827
49771A071207l8785m4468m8017m9729m9636m7745m4501m0631l6614l2526k8430
$$ y = [521191, 510263, 500649, 491858, 483770, 476459, 469707, 463020, 456151, 449334, 442893, 436801, 430808, 424893, 419428, 414967, 411985, 410659, 410580, 410742, 410108, 408355, 405923, 403356, 400857, 398503, 396517, 395096, 394116, 393202, 391965, 390151, 387832, 385551, 383988, 383267, 382829, 382160, 381394, 381001, 381191, 381900, 383000, 384177, 384905, 385063, 385373, 386715, 389080, 391755, 394448, 397609, 401614, 406275, 411466, 417660, 425392, 434438, 443962, 453405, 463029, 473647, 485932, 499916, 515186, 531708, 550365, 572335, 597985, 626796, 658374, 692943, 730539, 770265, 810679, 850435, 888058, 921631, 949602, 971927, 989844, 1004608, 1016998, 1028005, 1039148, 1051674, 1065839, 1081266, 1097424, 1113259, 1126571, 1134323, 1133740, 1123128, 1102034, 1071207, 1032422, 987954, 939937, 890208, 840572, 792827, 748326, 707695, 671081, 638555, 610125]
49760F10125k4642k1495j9010j6919j4948j3005j1136r382p691n994m375l131
49748D58397k475k221j956j591j450j648j666r46K26R68R71Q53J148J479J266
49733D51355P47O90J282J961K243K128J677R12K26J86P16J093R98R07J064R21
49717D69106J52m79j04Q59J271Q80M44M45O37Q64J301J737J546P07Mn0J99M02
49699D79921P87J485K012K030J974K332K849L048K973K807K245J098Mk64P5J60
49683E05536k38n98n40j33N51J310J492O85l32l63M67P27l82k046l091l245k768
49666D97032j755n03J93k8l59K26J541K400K067R38j09n73n49m85p63j282j534
49649D96457j174m04K99O14N22K92L47P68J005N66j8L10J563K461K177J454J347
$$ y = [610125, 585483, 563988, 544978, 528059, 513111, 500106, 488970, 479588, 471897, 465903, 461528, 458397, 455922, 453701, 451745, 450154, 448704, 447056, 445390, 444444, 444670, 445638, 446609, 447462, 448610, 450089, 451355, 452102, 452792, 454074, 456035, 458278, 460406, 462083, 462995, 463221, 463407, 464123, 465216, 466214, 467121, 468185, 469106, 469258, 468779, 468675, 469534, 470805, 471685, 472129, 472574, 473211, 474075, 475376, 477113, 478659, 479366, 479370, 479320, 479519, 479921, 480708, 482193, 484205, 486235, 488209, 490541, 493390, 496438, 499411, 502218, 504463, 505561, 505565, 505301, 505376, 505536, 505298, 504700, 504160, 504027, 504578, 505888, 507380, 508065, 507733, 507370, 507837, 508564, 508182, 506136, 503045, 499800, 497032, 495277, 494774, 494967, 494939, 494580, 494806, 496347, 498747, 500814, 501752, 501643, 501070, 500521, 500036, 499273, 497991, 496457, 495283, 494879, 495178, 495792, 496314, 496606, 496953, 497721, 498726, 499292, 499274, 499584, 501147, 503608, 505785, 507239, 508586]
49632E08586J689J687J411J603K221K382J724R51P61J034J308J517J897K522L191
49617E34484L626L690L603L816M391M734M287L341K772L022L830M792N698O419
$$ y = [508586, 510275, 511962, 513373, 514976, 517197, 519579, 521303, 522254, 523015, 524049, 525357, 526874, 528771, 531293, 534484, 538110, 541800, 545403, 549219, 553610, 558344, 562631, 565972, 568744, 571766, 575596, 580388, 586086, 592505]
$$ [...]
##END NTUPLES=NMR SPECTRUM
##END=
