
##TITLE=AC1317_SSGAH12146_6535293_p0zfnNsTiN
##JCAMPDX= 6.0         $$ Bruker NMR JCAMP-DX V2.0
##DATA TYPE= NMR SPECTRUM
##DATA CLASS= NTUPLES
##ORIGIN= BRUKER
##OWNER= Administrator
$$ 1.72 TOPSPIN		Version 2.1
$$ 2012-07-17 19:13:56.328 -0500  Administrator@TOPSPIN
$$ Compression mode = diff/dup
##.OBSERVE FREQUENCY= 400.02188249412
##.OBSERVE NUCLEUS= ^1H
##.ACQUISITION MODE= SIMULTANEOUS (DQD)
##.ACQUISITION SCHEME= undefined
##.AVERAGES= 64
##.DIGITISER RES= 22
##SPECTROMETER/DATA SYSTEM= spect
##.PULSE SEQUENCE= noesygpps1d.comp
##.SOLVENT NAME= COFFEE_meoh
##.SHIFT REFERENCE= INTERNAL, COFFEE_meoh, 1, 14.96088
##AUDIT TRAIL= $$ (NUMBER, WHEN, WHO, WHERE, PROCESS, VERSION, WHAT)
$$ ##TITLE= Audit trail, TOPSPIN		Version 2.1
$$ ##JCAMPDX= 5.01
$$ ##ORIGIN= Bruker BioSpin GmbH
$$ ##OWNER= Administrator
$$ $$ C:\Bruker\TOPSPIN/data/COFFEE/nmr/AC1317_SSGAH12146_6535293_p0zfnNsTiN/12/pdata/1/auditp.txt
$$ ##AUDIT TRAIL=  $$ (NUMBER, WHEN, WHO, WHERE, PROCESS, VERSION, WHAT)
(   1,<2012-07-17 19:13:51.218 -0500>,<Administrator>,<TOPSPIN>,<go>,<TOPSPIN 2.1>,
      <created by zg
	started at 2012-07-17 19:02:21.078 -0500,
	POWCHK enabled, PULCHK disabled,
       configuration hash MD5:
       6B 1B 68 BB D9 2E 58 E2 7F 35 AD 54 07 DF 0E 41
       data hash MD5: 64K
       31 71 15 BE 11 34 2F 99 28 5F B1 CC A1 34 40 65>)
(   2,<2012-07-17 19:13:54.109 -0500>,<Administrator>,<TOPSPIN>,<proc1d>,<TOPSPIN 2.1>,
      <Start of raw data processing
       efp LB = 0.3 FT_mod = 6 PKNL = 1 PHC0 = 0 PHC1 = 0 SI = 128K 
       data hash MD5: 128K
       45 E5 F7 B7 C1 72 A1 78 0B 62 A4 B9 0F 89 8D A7>)
(   3,<2012-07-17 19:13:55.218 -0500>,<Administrator>,<TOPSPIN>,<proc1d>,<TOPSPIN 2.1>,
      <pk PHC0 = 2.081909 PHC1 = 0 
       data hash MD5: 128K
       7E 3D 8E 17 DF A2 F3 3B C9 CC 7A 38 75 B2 A1 D8>)
(   4,<2012-07-17 19:13:55.968 -0500>,<Administrator>,<TOPSPIN>,<proc1d>,<TOPSPIN 2.1>,
      <abs ABSG = 1 
       data hash MD5: 128K
       4C DD 4E C7 DF 96 D4 9B 67 5F 56 C5 FA 76 AB 46>)
(   5,<2012-07-17 19:13:56.031 -0500>,<Administrator>,<TOPSPIN>,<proc1d>,<TOPSPIN 2.1>,
      <abs ABSG = 2 
       data hash MD5: 128K
       24 63 7E 3F EE 83 13 5D 85 4E 1A 93 00 CA A1 43>)
(   6,<2012-07-17 19:13:56.093 -0500>,<Administrator>,<TOPSPIN>,<proc1d>,<TOPSPIN 2.1>,
      <abs ABSG = 3 
       data hash MD5: 128K
       00 EC 41 1B 3B 92 BE E8 C2 1E 97 7A EB 0C E2 5B>)
(   7,<2012-07-17 19:13:56.156 -0500>,<Administrator>,<TOPSPIN>,<proc1d>,<TOPSPIN 2.1>,
      <abs ABSG = 4 
       data hash MD5: 128K
       0D 4E 97 4B 30 89 38 73 A7 06 86 BB D5 63 D5 FC>)
(   8,<2012-07-17 19:13:56.218 -0500>,<Administrator>,<TOPSPIN>,<proc1d>,<TOPSPIN 2.1>,
      <abs ABSG = 5 
       data hash MD5: 128K
       40 9D F6 4D 5D 92 43 EE 83 EE B0 B7 6B 8B 72 AB>)
$$ ##END=
$$ 
$$ $$ hash MD5
$$ $$ 0C 8A 60 C2 0B 4D 6E 74 7E 86 BA 8C B5 E6 B1 B6
##$RELAX= 
##$RELAX= 
##$RELAX= 
##$RELAX= 
##$RELAX= 
##$RELAX= 
##$RELAX= 
##$RELAX= 
$$ Bruker specific parameters
$$ [...]
##$TP07= 0
##$TPNAME0= <>
##$TPNAME1= <>
##$TPNAME2= <>
##$TPNAME3= <>
##$TPNAME4= <>
##$TPNAME5= <>
##$TPNAME6= <>
##$TPNAME7= <>
##$TPOAL= (0..7)
0.5 0.5 0.5 0.5 0.5 0.5 0.5 0.5
##$TPOFFS= (0..7)
0 0 0 0 0 0 0 0
##$TUNHIN= 0
##$TUNHOUT= 0
##$TUNXOUT= 0
##$USERA1= <user>
##$USERA2= <user>
##$USERA3= <user>
##$USERA4= <user>
##$USERA5= <user>
##$V9= 5
##$VALIST= <valist>
##$VCLIST= <CCCCCCCCCCCCCCC>
##$VD= 0
##$VDLIST= <DDDDDDDDDDDDDDD>
##$VPLIST= <PPPPPPPPPPPPPPP>
##$VTLIST= <TTTTTTTTTTTTTTT>
##$WBST= 2048
##$WBSW= 25
##$XGAIN= (0..3)
0 0 0 0
##$XL= 0
##$YL= 0
##$YMAX_a= 12208621
##$YMIN_a= -9187375
##$ZGOPTNS= <>
##$ZL1= 120
##$ZL2= 120
##$ZL3= 120
##$ZL4= 120
##$ABSF1= 14.96088
##$ABSF2= -5.597301
##$ABSG= 5
##$ABSL= 3
##$ALPHA= 0
##$AQORDER= 0
##$ASSFAC= 0
##$ASSFACI= 0
##$ASSFACX= 0
##$ASSWID= 0
##$AUNMP= <proc_prof1d_extract.lims>
##$AXLEFT= 0
##$AXNAME= <>
##$AXNUC= <1H>
##$AXRIGHT= 0
##$AXTYPE= 0
##$AXUNIT= <>
##$AZFE= 0.1
##$AZFW= 0.1
##$BCFW= 0
##$BC_mod= 0
##$BYTORDP= 0
##$COROFFS= 0
##$CY= 15
##$DATMOD= 1
##$DC= 0
##$DFILT= <>
##$DTYPP= 0
##$F1P= 0
##$F2P= 0
##$FCOR= 0.5
##$FTSIZE= 131072
##$FT_mod= 6
##$GAMMA= 0
##$GB= 0
##$INTBC= 1
##$INTSCL= 1
##$ISEN= 128
##$LB= 0.3
##$LEV0= 0
##$LPBIN= 0
##$MAXI= 10000
##$MC2= 0
##$MEAN= 0
##$ME_mod= 0
##$MI= 0
##$NCOEF= 0
##$NC_proc= -2
##$NLEV= 6
##$NOISF1= 0
##$NOISF2= 0
##$NSP= 0
##$NTH_PI= 0
##$NZP= 0
##$OFFSET= 14.96088
##$PC= 1
##$PHC0= 2.081909
##$PHC1= 0
##$PH_mod= 1
##$PKNL= yes
##$PPARMOD= 0
##$PPDIAG= 0
##$PPIPTYP= 0
##$PPMPNUM= 2147483647
##$PPRESOL= 1
##$PSCAL= 4
##$PSIGN= 0
##$PYNMP= <proc.py>
##$REVERSE= no
##$SF= 400.020009686241
##$SI= 131072
##$SIGF1= 0
##$SIGF2= 0
##$SINO= 400
##$SIOLD= 131072
##$SPECTYP= <>
##$SREGLST= <1H.CDCl3>
##$SSB= 0
##$STSI= 131072
##$STSR= 0
##$SW_p= 8223.68421052631
##$SYMM= 0
##$S_DEV= 0
##$TDeff= 65536
##$TDoff= 0
##$TI= <>
##$TILT= no
##$TM1= 0
##$TM2= 0
##$TOPLEV= 0
##$USERP1= <user>
##$USERP2= <user>
##$USERP3= <user>
##$USERP4= <user>
##$USERP5= <user>
##$WDW= 1
##$XDIM= 131072
##$YMAX_p= 456761498
##$YMIN_p= -11410
##$CURPLOT= <Network HP LaserJet P1505>
##$CURPRIN= <$Network HP LaserJet P1505>
##$DFORMAT= <normdp>
##$LAYOUT= <+/1D_H.xwp>
##$LFORMAT= <normlp>
##$PFORMAT= <normpl>
##$SURQMSG= 1
$$ End of Bruker specific parameters
$$ ---------------------------------
##NTUPLES= NMR SPECTRUM
##VAR_NAME=  FREQUENCY,     SPECTRUM/REAL,   SPECTRUM/IMAG
##SYMBOL=    X,             R,               I
##VAR_TYPE=  INDEPENDENT,   DEPENDENT,       DEPENDENT
##VAR_FORM=  AFFN,          ASDF,            ASDF
##VAR_DIM=   131072,        131072,          131072
##UNITS=     HZ,            ARBITRARY UNITS, ARBITRARY UNITS
##FACTOR=    0.0627417313425164, 1,          1
##FIRST=     8223.62146879497, 758,          -58244
##LAST=      0,             886,             -58639
##MIN=       0,             -11410,          0
##MAX=       8223.62146879497, 456761498,    0
$$ Real data points
##PAGE= N=1
##DATA TABLE= (X++(R..R)), XYDATA
$$ [...]
$$ plain form
63882 706897 689769 673847 659833 648321 639240 632093 626695 623464 623041 625806 631777 640696 652060
63869 652060 665231 679821 696042 714519 735545 758466 782060 805663 829682 854628 879817
63858 879817 903608 924895 943684 960045 973355 983160 989965 994291 995461 992424 985524 976270 965210
63845 965210 951215 933287 912177 889568 866306 842104 816507 789426 760920 731193 700873
63834 700873 670905 642011 614411 588045 562929 539264 517209 496587 476967 458247 440945
63823 440945 425544 411618 398107 384541 371587 360209 350669 342497 335113 328238 321956 316532 312048
63810 312048 308155 304381 300629 297084 293755 290558 287823 286131 285463 285032 284142 282801 281313 279756 278116
63795 278116 276449 274610 272244 269294 266156 263064 259779 256211 252859 250218 248095 245974 243783 241844
$$ packed form
63882G06897j7128j5922j4014j1512r081p147n398l231m23K765N971Q919J1364
63869F52060J3171J4590J6221J8477K1026K2921K3594K3603K4019K4946K5189
63858H79817K3791K1287J8789J6361J3310R805O805M326J170l037o900r254j1060
63845I65210j3995j7928k1110k2609k3262k4202k5597k7081k8506k9727l0320
63834G00873k9968k8894k7600k6366k5116k3665k2055k0622j9620j8720j7302
63823D40945j5401j3926j3511j3566j2954j1378r540q172p384o875o282n424m484
63810C12048l893l774l752l545l329l197k735j692o68m31q90j341j488j557j640
63795B78116j667j839k366k950l138l092l285l568l352k641k123k121k191j939
$$ plain form
63781 241844 240306 239094 238235 237846 237892 238268 239048 240320 241829 243017 243391 242763 241324 239630 238312 237556
63765 237556 236995 236226 235296 234583 234400 234760 235300 235441 234946 234328 234263 234590 234409 233354 232165 231678 231793 231864 231671
63746 231671 231552 231906 232998 234921 237350 239576 241186 242503 244045 245905 248009 250620 254055 258125 262248
63731 262248 265906 268648 270057 270298 270481 271855 274669 278276 282242 286798 292177 298054 303844 309351 314934
63716 314934 321068 327665 333772 338122 340130 340104 338449 335127 330196 324449 318993 314413 310747 307970 305998
63701 305998 304407 302725 300998 299679 299000 298806 298924 299352 300202 301762 304471 308360 312637 316284 319078
63686 319078 321639 324485 327420 329864 331414 331969 331679 330986 330535 330787 331654 332523 332811 332610 332746 333942 336015
63669 336015 338234 340373 342847 345764 348572 350988 353523 356532 359256 360525 360069 358502 356362 353792
$$ packed form
63781B41844j538j212q59l89M6L76P80J272J509J188L74o28j439j694j318p56
63765B37556n61p69r30p13j83L60N40J41m95o18o5L27j81j055j189m87J15P1j93
63746B31671j19L54J092J923K429K226J610J317J542J860K104K611L435M070M123
63731B62248L658K742J409K41J83J374K814L607L966M556N379N877N790N507N583
63716C14934O134O597O107M350K008k6j655l322m931n747n456m580l666k777j972
63701C05998j591j682j727j319o79j94J18M28Q50J560K709L889M277L647K794
63686C19078K561K846K935K444J550N55k90o93m51K52Q67Q69K88k01J36J196K073
63669C36015K219K139K474K917K808K416K535L009K724J269m56j567k140k570
$$ plain form
63655 353792 350869 347460 342935 336868 330001 323768 318710 314048 308943 303628 299070 296062 294809 294922
63641 294922 295493 295607 295119 294728 295070 295978 296841 297584 298999 302046 306864 312526 317903 322732 327652 333205
63625 333205 339197 345176 351104 357266 363898 371278 379850 389754 400531 411735 423614 436703 451047
63612 451047 466446 483291 502461 524423 548958 575757 604749 635865 668981 703967 740111
63601 740111 775430 807171 833228 852654 864968 869829 867814 860921 851732 842200 833313 825416 818341
63588 818341 811374 803422 793370 780368 764091 744855 723311 700006 675385 650149 625258 601522
63576 601522 579484 559698 542721 528653 516985 507159 499164 493401 490078 488846 489133 490734 494011
63563 494011 499362 506501 514509 522609 530537 538082 544791 550605 556426 563529 572565 583528 596466 611644
$$ packed form
63655C53792k923l409m525o067o867o233n058m662n105n315m558l008j253J13
63641B94922N71J14m88l91L42R08Q63P43J415L047M818N662N377M829M920N553
63625C33205N992N979N928O162O632P380Q572R904J0777J1204J1879J3089J4344
63612D51047J5399J6845J9170K1962K4535K6799K8992L1116L3116L4986L6144
63601G40111L5319L1741K6057J9426J2314M861k015o893r189r532q887p897p075
63588H18341o967p952j0052j3002j6277j9236k1544k3305k4621k5236k4891k3736
63576F01522k2038j9786j6977j4068j1668r826p995n763l323j232K87J601L277
63563D94011N351P139Q008Q100P928P545O709N814N821P103R036J0963J2938J5178
$$ plain form
63549 611644 629182 649155 672141 699231 731444 769487 813848 864253 918413 971481 1017211
63538 1017211 1050199 1067822 1070924 1063004 1048508 1031432 1014875 1000966 990622 983491 978458 974130
63526 974130 968830 960753 948646 932055 910568 883437 850593 813630 775046 736716 699718 665099
63514 665099 633721 605438 579390 555281 533621 514669 497917 482772 469084 456867 446097
63503 446097 436896 429251 422519 415881 409405 403978 400034 396999 394096 391075 388045 385272 383272 382395
63489 382395 382117 381442 380152 378956 378262 377704 377170 377353 378741 380837 383029 385720 389848 395672 402526 409527
63473 409527 416047 421707 426309 429696 431586 431685 429990 426651 421636 415034 407591 400332 393652 387370 381634
63458 381634 376929 373205 369980 367525 366837 368013 369721 370894 371982 373790 376045 378162 380705 384883
$$ packed form
63549F11644J7538J9973K2986K7090L2213L8043M4361N0405N4160N3068M5730
63538A017211L2988J7623L102p920j4496j7076j6557j3909j0344p131n033m328
63526I74130n300q077j2107j6591k1487k7131l2844l6963l8584l8330l6998l4619
63514F65099l1378k8283k6048k4109k1660j8952j6752j5145j3688j2217j0770
63503D46097r201p645o732o638o476n427l944l035k903l021l030k773k000q77
63489C82395k78o75j290j196o94n58n34J83J388K096K192K691M128N824O854P001
63473D09527O520N660M602L387J890R9j695l339n015o602p443p259o680o282n736
63458C81634m705l724l225k455o88J176J708J173J088J808K255K117K543M178
$$ plain form
63444 384883 390805 397287 403366 409311 416136 424577 434591 445529 456988 469706 485281 504893 528840
63431 528840 557392 590949 628362 665712 697939 721817 737057 745139 748001 747677 746264 745895 748808
63418 748808 757028 771437 791524 816619 846977 883009 923774 966909 1009677 1049282 1082510 1106383
63406 1106383 1119689 1123463 1119886 1111106 1099007 1085311 1071491 1058642 1047275 1036846 1025698 1011977
63394 1011977 994599 973099 947045 916343 881953 845575 808611 771999 736862 704454 675267
63383 675267 648895 624985 603821 585774 570700 558123 547592 538753 531426 525791 522153 520525
63371 520525 520834 523478 529062 537422 547466 558255 569789 582484 596398 611395 627707 645861
63359 645861 666175 688726 713776 741890 773515 808569 846495 886634 928369 970730 1011856
$$ packed form
63444C84883N922O482O079N945O825Q441J0014J0938J1459J2718J5575J9612K3947
63431E28840K8552L3557L7413L7350L2227K3878J5240Q082K862l24j413l69K913
63418G48808Q220J4409K0087K5095L0358L6032M0765M3135M2768L9605L3228K3873
63406A106383J3306L774l577q780j2099j3696j3820j2849j1367j0429j1148j3721
63394A011977j7378k1500k6054l0702l4390l6378l6964l6612l5137l2408k9187
63383F75267k6372k3910k1164j8047j5074j2577j0531q839p327n635l638j628
63371E20525L09K644N584Q360J0044J0789J1534J2695J3914J4997J6312J8154
63359F45861K0314K2551K5050K8114L1625L5054L7926M0139M1735M2361M1126
$$ plain form
63348 1011856 1049053 1079597 1101584 1114225 1117886 1114104 1105220 1093458 1080348 1067065 1054832 1044367
63336 1044367 1035021 1024979 1012296 995499 973612 946431 914957 880976 846019 811079 777212
63325 777212 745680 717260 692049 670292 652736 639802 631047 626156 625799 630290 637224 641429 638037
63312 638037 625614 606346 583756 560636 538571 518360 500322 484404 470375 458018 447203
63301 447203 437926 430257 424057 418775 413839 409370 406092 404258 403048 401451 399429 397596 395925 393501
63287 393501 389685 384882 379918 375189 370761 366837 363656 361155 359072 357221 355532 354063 353130 353103 353779
63272 353779 354312 354024 353033 351842 350695 349660 349001 348973 349432 350063 350860 352027 353549 355193 356881 358742
63256 358742 360917 363542 366826 370833 375279 379728 384001 388176 392355 396618 401194 406511 413096 421386
$$ packed form
63348A011856L7197L0544K1987J2641L661l782q884j1762j3110j3283j2233j0465
63336A044367r346j0042j2683j6797k1887k7181l1474l3981l4957l4940l3867
63325G77212l1532k8420k5211k1757j7556j2934q755m891l57M491O934M205l392
63312F38037j2423j9268k2590k3120k2065k0211j8038j5918j4029j2357j0815
63301D47203r277p669o200n282m936m469l278j834j210j597k022j833j671k424
63287C93501l816m803m964m729m428l924l181k501k083j851j689j469r33k7O76
63272C53779N33k88r91j191j147j035o59k8M59O31P97J167J522J644J688J861
63256C58742K175K625L284M007M446M449M273M175M179M263M576N317O585Q290
$$ plain form
63242 421386 431460 442958 455405 468569 482324 496518 511461 528250 547847 569850 593059
63231 593059 617279 643503 672055 701713 731298 761025 791408 821715 850642 877872 903913
63220 903913 928945 953021 977047 1002370 1029423 1057665 1086701 1116407 1146020 1174011 1198857
63209 1198857 1219168 1233317 1240024 1239321 1231953 1217883 1196480 1168222 1135010 1098516 1059335 1018150
63197 1018150 976636 936589 899049 864819 834967 810125 789916 773716 761415 752934 747703 745313
63185 745313 746138 750504 757673 766406 776324 788011 801960 818003 835699 854618 874194 893780 913034
63172 913034 932085 951234 970611 990036 1009052 1027091 1043656 1058238 1070099 1078407 1082588 1082337
63160 1082337 1077292 1067044 1051488 1030864 1005462 975746 942840 908370 873624 839255 805883
$$ packed form
63242D21386J0074J1498J2447J3164J3755J4194J4943J6789J9597K2003K3209
63231E93059K4220K6224K8552K9658K9585K9727L0383L0307K8927K7230K6041
63220I03913K5032K4076K4026K5323K7053K8242K9036K9706K9613K7991K4846
63209A198857K0311J4149O707p03p368j4070k1403k8258l3212l6494l9181m1185
63197A018150m1514m0047l7540l4230k9852k4842k0209j6200j2301q481n231k390
63185G45313Q25M366P169Q733R918J1687J3949J6043J7696J8919J9576J9586J9254
63172I13034J9051J9149J9377J9425J9016J8039J6565J4582J1861Q308M181k51
63160A082337n045j0248j5556k0624k5402k9716l2906l4470l4746l4369l3372
$$ plain form
63149 805883 774335 744949 717199 690534 665299 642386 622272 604799 589656 576639 565503
63138 565503 555891 547429 539775 532843 527043 522963 520554 518940 517310 515675 514459 513720 513300 513478 514859
63123 514859 517603 521210 525152 529385 534154 539545 545326 551083 556448 561351 566072 570916 575782 580156
63109 580156 583603 586234 588579 590985 593215 594860 596107 597753 600202 602747 604241 604324 603613 602829 602231
63094 602231 601836 601612 601347 600885 600597 601118 602440 603854 604951 606059 607333 608117 607824 606990 606780 607680 609292
63077 609292 611226 613560 616449 619891 624026 629270 635926 643901 652829 662388 672543 683651 696214
63064 696214 710346 725607 741596 758519 776917 797062 819095 843638 871740 904111 940799
63053 940799 981685 1026895 1076493 1130136 1187300 1247687 1311126 1377220 1445306 1514677 1584605
$$ packed form
63149H05883l1548k9386k7750k6665k5235k2913k0114j7473j5143j3017j1136
63138E65503r612q462p654o932n800m080k409j614j630j635j216p39m20J78J381
63123E14859K744L607L942M233M769N391N781N757N365M903M721M844M866M374
63109E80156L447K631K345K406K230J645J247J646K449K545J494Q3p11p84n98
63094F02231l95k24k65m62k88N21J322J414J097J108J274P84k93q34k10R00J612
63077F09292J934K334K889L442M135N244O656P975Q928R559J0155J1108J2563
63064F96214J4132J5261J5989J6923J8398K0145K2033K4543K8102L2371L6688
63053I40799M0886M5210M9598N3643N7164O0387O3439O6094O8086O9371O9928
$$ plain form
63042 1584605 1654261 1722898 1790153 1855982 1920325 1983106 2044744 2106425 2169549 2234787 2301676
63031 2301676 2368954 2435017 2498048 2555944 2606325 2646667 2674478 2687637 2684699 2664964 2628395
63020 2628395 2575770 2508955 2430689 2343852 2251063 2154990 2058668 1965082 1876469 1794148 1718902
63009 1718902 1651327 1591935 1541178 1499369 1466516 1442418 1426984 1420146 1421243 1428878 1441784 1459549
62997 1459549 1482064 1508516 1537489 1567972 1599662 1632208 1664788 1696709 1728096 1759687 1792065
62986 1792065 1825176 1858360 1890596 1920696 1947284 1968696 1983241 1989745 1987636 1976283 1954645 1922022
62974 1922022 1879003 1827302 1768832 1705309 1638468 1570012 1501341 1433674 1368323 1306353 1248125
62963 1248125 1193686 1143459 1097910 1056642 1018551 983011 950278 920644 893836 869389 846938
$$ packed form
63042A584605O9656O8637O7255O5829O4343O2781O1638O1681O3124O5238O6889
63031B301676O7278O6063O3031N7896N0381M0342K7811J3159k938j9735l6569
63020B628395n2625o6815p8266q6837r2789r6073r6322r3586q8613q2321p5246
63009A718902o7575n9392n0757m1809l2853k4098j5434o838J097P635J2906J7765
62997A459549K2515K6452K8973L0483L1690L2546L2580L1921L1387L1591L2378
62986A792065L3111L3184L2236L0100K6588K1412J4545O504k109j1353k1638l2623
62974A922022m3019n1701n8470o3523o6841o8456o8671o7667o5351o1970n8228
62963A248125n4439n0227m5549m1268l8091l5540l2733k9634k6808k4447k2451
$$ plain form
62952 846938 825863 805247 784555 763965 743761 723860 704269 685561 668522 653395 639637
62941 639637 626255 612460 598372 585069 573580 563888 555299 547571 540962 535256 529639 523799 518380
62928 518380 514068 510860 508460 506678 505145 503365 501524 500517 500663 500988 500309 498510 496236 493920 491750
62913 491750 490025 488783 487320 484799 481200 477234 473490 470093 466987 464091 461298 458602 456110 453776
62899 453776 451470 449463 448338 448163 448251 448122 448146 448765 449612 449965 449679 449109 448445 447637 446654 445368 443554 441488
62881 441488 440137 440159 441043 441819 442223 442561 442858 442961 443256 444431 446510 448765 450577 451812 452369 451992 450755
62864 450755 449298 448372 448197 448258 447676 446059 444070 442762 442309 441987 441586 441913 443298 444534 444249 442751 441446
62847 441446 440911 440693 440749 441722 443695 445789 447279 448248 448881 449018 448712 448441 448423 448328 447986 447716 447656 447366 446519
$$ packed form
62952H46938k1075k0616k0692k0590k0204j9901j9591j8708j7039j5127j3758
62941F39637j3382j3795j4088j3303j1489r692q589p728o609n706n617n840n419
62928E18380m312l208k400j782j533j780j841j007J46L25o79j799k274k316k170
62913D91750j725j242j463k521l599l966l744l397l106k896k793k696k492k334
62899D53776k306k007j125j75Q8j29K4O19Q47L53k86n70o64q08r83j286j814k066
62881D41488j351K2Q84P76M04L38K97J03K95J175K079K255J812J235N57l77j237
62864D50755j457r26j75O1n82j617j989j308m53l22m01L27J385J236k85j498j305
62847D41446n35k18N6R73J973K094J490R69O33J37l06k71j8r5l42k70o0k90q47
$$ plain form
62828 446519 445492 444962 445306 446666 449068 452114 455018 457344 459466 461945 464777 467520 469973 472396 475206
62813 475206 478623 482558 486742 491087 495849 501229 506996 512863 519119 526350 534525 542913 551063 559394
62799 559394 568609 578991 590539 603319 617250 631825 646494 661271 676746 693610 712346 733240
62787 733240 756527 782596 812196 846386 886269 932780 986608 1048019 1116730 1192294 1274784
62776 1274784 1364936 1463445 1570141 1683811 1802581 1924286 2046475 2166136 2279566 2382833
62766 2382833 2472545 2546126 2601321 2635989 2648868 2640394 2612265 2566183 2503456 2425839 2336199
62755 2336199 2238023 2134413 2027649 1919495 1811638 1705855 1603763 1506474 1414588 1328540
62745 1328540 1248707 1175051 1107060 1044390 987309 936100 890231 848617 810672 776628 746803
$$ packed form
62828D46519j027n30L44J360K402L046K904K326K122K479K832K743K453K423K810
62813D75206L417L935M184M345M762N380N767N867O256P231Q175Q388Q150Q331
62799E59394R215J0382J1548J2780J3931J4575J4669J4777J5475J6864J8736K0894
62787G33240K3287K6069K9600L4190L9883M6511N3828O1411O8711P5564Q2490
62776A274784R0152R8509J06696J13670J18770J21705J22189J19661J13430J03267
62766B382833Q9712P3581N5195L4668J2879q474k8129m6082o2727p7617q9640
62755B336199r8176j03610j06764j08154j07857j05783j02092r7289r1886q6048
62745A328540p9833p3656o7991o2670n7081n1209m5869m1614l7945l4044k9825
$$ plain form
62734 746803 720962 698466 678672 661064 645285 631194 618695 607530 597395 588261 580366 573937
62722 573937 569045 565586 563193 561371 560045 559826 561396 564719 569183 574443 580823 588989 599478 612407
62708 612407 627397 643972 662252 682981 706639 733033 762218 795260 833405 876858 925215
62697 925215 978652 1037679 1101824 1169694 1240552 1314884 1393090 1474307 1556692 1638038 1715747
62686 1715747 1787027 1849585 1901639 1941052 1965296 1972886 1964264 1940788 1903393 1852835 1790766 1719821
62674 1719821 1642825 1562357 1480789 1400122 1321631 1245892 1173166 1103778 1038448 978337 924373
62663 924373 876369 833190 793930 758402 726332 696881 669528 644841 623606 605509 589387
62652 589387 574543 561060 548886 537447 526370 515981 506690 498279 490165 482175 474709 468235 462840
$$ packed form
62734G46803k5841k2496j9794j7608j5779j4091j2499j1165j0135r134p895o429
62722E73937m892l459k393j822j326k19J570L323M464N260O380Q166J0489J2929
62708F12407J4990J6575J8280K0729K3658K6394K9185L3042L8145M3453M8357
62697I25215N3437N9027O4145O7870P0858P4332P8206Q1217Q2385Q1346P7709
62686A715747P1280O2558N2054L9413K4244P590q622k3476l7395n0558o2069p0945
62674A719821p6996q0468q1568q0667p8491p5739p2726o9388o5330o0111n3964
62663I24373m8004m3179l9260l5528l2070k9451k7353k4687k1235j8097j6122
62652E89387j4844j3483j2174j1439j1077j0389r291q411q114p990p466o474n395
$$ plain form
62639 462840 458347 454623 451631 449265 447435 446406 446784 448810 451722 454133 455131 454851 454035 453300 452789 452188
62623 452188 450961 448868 446403 444492 443628 443523 443660 443963 444871 447033 450967 456612 463045 469131 474768
62608 474768 481205 489696 499997 510582 520274 529385 539266 551125 565372 581831 600316 621027
62596 621027 644543 671563 702663 738252 778704 824449 875699 931828 991019 1050866 1109471
62585 1109471 1165756 1218595 1266101 1306163 1337456 1359418 1371406 1372471 1362210 1341505 1312203
62574 1312203 1276121 1234395 1187707 1137122 1084622 1032528 982292 934085 887679 843264 801206
62563 801206 761670 725046 692275 663902 639057 616144 594496 574717 557512 542924 530621
62552 530621 520115 510656 501682 493517 486935 481903 477516 473332 469964 468035 467216 466684 465985 465173 464644
$$ packed form
62639D62840m493l724k992k366j830j029L78K026K912K411R98k80q16p35n11o01
62623D52188j227k093k465j911q64j05J37L03R08K162L934N645O433O086N637
62608D74768O437Q491J0301J0585R692R111R881J1859J4247J6459J8485K0711
62596F21027K3516K7020L1100L5589M0452M5745N1250N6129N9191N9847N8605
62585A109471N6285N2839M7506M0062L1293K1962J1988J065j0261k0705k9302
62574A312203l6082m1726m6688n0585n2500n2094n0236m8207m6406m4415m2058
62563H01206l9536l6624l2771k8373k4845k2913k1648j9779j7205j4588j2303
62552E30621j0506r459q974q165o582n032m387m184l368j929q19n32o99q12n29
$$ plain form
62537 464644 465046 466716 468911 470265 470309 469898 469774 469517 468506 467259 467057 468602 471728 476166 481980 489359
62521 489359 498470 509471 522417 537324 554507 574537 597607 623335 651550 682966 718636 758884
62509 758884 803004 849778 898021 946831 995556 1043413 1089118 1131161 1168434 1200157 1225198
62498 1225198 1242118 1250145 1249649 1241558 1226926 1207318 1184903 1161757 1139530 1119967 1104958 1095586
62486 1095586 1091824 1093695 1102117 1117992 1141124 1170666 1206098 1247026 1292680 1342411 1396127 1452977
62474 1452977 1509564 1560419 1600692 1628375 1644374 1650952 1649602 1639412 1617380 1580915 1530251 1468361
62462 1468361 1399111 1326001 1251957 1178970 1107701 1038203 971239 908391 850984 799624 754804
62451 754804 717041 686002 660140 637744 618149 601707 588824 579273 572161 566378 561231 556777
$$ packed form
62537D64644M02J670K195J354M4m11j24k57j011j247k02J545L126M438N814P379
62521D89359R111J1001J2946J4907J7183K0030K3070K5728K8215L1416L5670M0248
62509G58884M4120M6774M8243M8810M8725M7857M5705M2043L7273L1723K5041
62498A225198J6920Q027m96q091j4632j9608k2415k3146k2227j9563j5009r372
62486A095586l762J871Q422J5875K3132K9542L5432M0928M5654M9731N3716N6850
62474A452977N6587N0855M0273K7683J5999O578j350j0190k2032l6465n0664o1890
62462A468361o9250p3110p4044p2987p1269o9498o6964o2848n7407n1360m4820
62451G54804l7763l1039k5862k2396j9595j6442j2883r551p112n783n147m454
$$ plain form
62439 556777 553562 552105 552733 555574 560268 565765 570862 575073 578619 581549 583211 582738 579784 574573 567414
62424 567414 558520 548431 538330 529476 522004 514624 505998 496333 487082 479115 471922 464864 458395 453443
62410 453443 450047 447235 444016 440035 435553 431286 428027 425908 424141 421790 418633 415062 411603 408993
62396 408993 408265 410005 413611 417754 421503 424720 427664 430683 434026 437454 440260 442109 443601 445605
62382 445605 448341 451597 455419 459994 465205 470973 477689 485612 494199 502842 511954 522334 533641 544550
62368 544550 554542 564601 575997 589257 604509 621902 641246 661997 684167 708792 737135 769858
62356 769858 807251 849759 897799 951318 1009741 1072025 1136427 1200453 1261313 1316373 1363415
62345 1363415 1400979 1428636 1446605 1455082 1454377 1445657 1430743 1410751 1385394 1354087 1317402 1277029
$$ packed form
62439E56777l215j457O28K841M694N497N097M211L546K930J662m73k954n211p159
62424E67414q894j0089j0101q854p472p380q626r665r251p967p193p058o469m952
62410D53443l396k812l219l981m482m267l259k119j767k351l157l571l459k610
62396D08993p28J740L606M143L749L217K944L019L343L428K806J849J492K004
62382D45605K736L256L822M575N211N768O716P923Q587Q643R112J0380J1307J0909
62368E44550R992J0059J1396J3260J5252J7393J9344K0751K2170K4625K8343L2723
62356G69858L7393M2508M8040N3519N8423O2284O4402O4026O0860N5060M7042
62345A363415L7564K7657J7969Q477p05q720j4914j9992k5357l1307l6685m0373
$$ plain form
62333 1277029 1234610 1191125 1147298 1104076 1062569 1023735 988228 956365 928100 903091 880911
62322 880911 861230 843647 827239 810508 792156 772061 751208 730518 710032 689365 668648
62311 668648 648702 630470 614408 600131 586556 572864 559593 548305 539836 533372 527593 522130
62299 522130 517258 512869 508710 505264 503307 502623 502047 500907 499685 499193 499827 501692 504724 508464 512321
62284 512321 516228 520505 524987 528936 531974 534556 537304 540444 544037 548161 552655 557182 561871 567414
62270 567414 574279 582215 590741 599726 609298 619590 630865 643654 658601 676366 697603 722677
62258 722677 751488 784041 821196 864318 914113 970316 1032466 1100294 1172955 1248339 1323359
62247 1323359 1394618 1458839 1513322 1556467 1587764 1607318 1615727 1614209 1604020 1585474 1558026 1521463
$$ packed form
62333A277029m2419m3485m3827m3222m1507l8834l5507l1863k8265k5009k2180
62322H80911j9681j7583j6408j6731j8352k0095k0853k0690k0486k0667k0717
62311F68648j9946j8232j6062j4277j3575j3692j3271j1288q469o464n779n463
62299E22130m872m389m159l446j957o84n76j140j222m92O34J865L032L740L857
62284E12321L907M277M482L949L038K582K748L140L593M124M494M527M689N543
62270E67414O865P936Q526Q985R572J0292J1275J2789J4947J7765K1237K5074
62258G22677K8811L2553L7155M3122M9795N6203O2150O7828P2661P5384P5020
62247A323359P1259O4221N4483M3145L1297J9554Q409j518j0189j8546k7448l6563
$$ plain form
62235 1521463 1476497 1424147 1365353 1301595 1235254 1168853 1104270 1042918 986043 934282 887325
62224 887325 844554 805809 771202 740547 713429 689633 669059 651344 635913 622328 610318
62213 610318 599553 589669 580530 572293 565187 559241 554194 549662 545491 541859 539004 536990 535855 535710
62199 535710 536523 538071 540374 543773 548236 553032 557650 562612 568692 575716 582997 590622 599255 608808
62185 608808 618467 628179 639006 651685 665778 680521 695488 710003 722882 733431 741964 748779
62173 748779 753476 756040 757930 761243 767125 775677 787066 802030 821448 845940 875803 911026 951430
62160 951430 996725 1045949 1096717 1145645 1189914 1228011 1258954 1281673 1295683 1301731 1301192 1295164
62148 1295164 1284407 1269402 1249951 1225308 1195356 1161246 1124507 1086150 1047164 1009153 973701
$$ packed form
62235A521463m4966n2350n8794o3758o6341o6401o4583o1352n6875n1761m6957
62224H87325m2771l8745l4607l0655k7118k3796k0574j7715j5431j3585j2010
62213F10318j0765r884r139q237p106n946n047m532m171l632k855k014j135j45
62199E35710Q13J548K303L399M463M796M618M962O080P024P281P625Q633R553
62185F08808R659R712J0827J2679J4093J4743J4967J4515J2879J0549Q533O815
62173G48779M697K564J890L313N882Q552J1389J4964J9418K4492K9863L5223M0404
62160I51430M5295M9224N0768M8928M4269L8097L0943K2719J4010O048n39o028
62148A295164j0757j5005j9451k4643k9952l4110l6739l8357l8986l8011l5452
$$ plain form
62137 973701 941563 913061 888688 868573 851920 837826 826255 817423 810739 805311 801161 798880
62125 798880 798217 798009 797548 797179 797554 799158 802692 809012 818280 829705 842412 856164 870915 885931
62111 885931 899501 909440 914086 913263 908425 901726 895005 889548 886130 884552 883340 880512 874779 865917
62097 865917 854477 841751 829714 820168 813759 810154 808933 809764 811944 814576 817344 820499 824048 827545
62083 827545 830792 834171 838049 842397 847282 853338 861350 871606 883866 897808 913342 930623 949814
62070 949814 970640 992147 1013113 1032877 1051750 1070630 1090373 1111475 1134153 1158567 1184948
62059 1184948 1213383 1243425 1273919 1303186 1329262 1350156 1364443 1371940 1373647 1370810 1364148 1353839
62047 1353839 1339789 1321639 1298858 1271112 1238445 1201198 1160221 1117189 1073984 1031422 989184
$$ packed form
62137I73701l2138k8502k4373k0115j6653j4094j1571q832o684n428m150k281
62125G98880o63k08m61l69L75J604L534O320R268J1425J2707J3752J4751J5016
62111H85931J3570R939M646q23m838o699o721n457l418j578j212k828n733q862
62097H65917j1440j2726j2037r546o409l605j221Q31K180K632K768L155L549L497
62083H27545L247L379L878M348M885O056Q012J0256J2260J3942J5534J7281J9191
62070I49814K0826K1507K0966J9764J8873J8880J9743K1102K2678K4414K6381
62059A184948K8435L0042L0494K9267K6076K0894J4287P497J707k837o662j0309
62047A353839j4050j8150k2781k7746l2667l7247m0977m3032m3205m2562m2238
$$ plain form
62036 989184 947296 906994 869681 835804 805364 778740 756040 736194 717774 700519 685166
62025 685166 671935 660146 649215 639063 629500 620139 611111 603022 595850 588564 580201 570819 561190
62012 561190 552006 543578 535880 528669 521848 515781 510902 507143 504216 502314 501909 502837 504328 506050 508457
61997 508457 511914 516141 520749 525630 530443 534402 537070 538895 540420 541377 541044 539149 535836 530947 524059
61982 524059 515340 505952 497320 490101 483899 477869 471549 465121 458946 453027 447145 441365 436111 431712
61968 431712 428167 425375 423302 421735 420183 418251 416002 413850 412200 411246 410878 410626 409906 408577 407241
61953 407241 406794 407615 409264 410998 412542 414273 416695 419888 423585 427663 432331 437933 444890 453743 464752
61938 464752 477345 490483 503839 518102 533768 550123 566021 581282 596639 612475 628309
$$ packed form
62036I89184m1888m0302l7313l3877l0440k6624k2700j9846j8420j7255j5353
62025F85166j3231j1789j0931j0152r563r361r028q089p172p286q363r382r629
62012E61190r184q428p698p211o821o067m879l759k927j902m05R28J491J722K407
61997E08457L457M227M608M881M813L959K668J825J525R57l33j895l313m889o888
61982E24059q719r388q632p219o202o030o320o428o175n919n882n780n254m399
61968D31712l545k792k073j567j552j932k249k152j650r54l68k52p20j329j336
61953D07241m47Q21J649J734J544J731K422L193L697M078M668N602O957Q853J1009
61938D64752J2593J3138J3356J4263J5666J6355J5898J5261J5357J5836J5834
$$ plain form
61927 628309 643478 657658 670609 681976 691499 698988 703986 705913 704662 700672 694373 686077 676618
61914 676618 667528 660143 654774 651100 649163 649612 653089 659707 669113 680779 694109 708483 723411
61901 723411 738577 753493 767048 777648 784131 786483 785481 781867 776187 769137 761311 752556 742354
61888 742354 731053 720034 710226 701149 691942 682673 673957 665868 658019 650283 642551 634096 624081
61875 624081 612561 600171 587100 573280 559438 546902 536229 527000 519093 513123 509301 506795
61863 506795 504775 503424 503387 504840 507598 511681 517253 524297 532738 542583 553779 566353 580911 598486
61849 598486 619463 643060 668205 694548 722267 751228 780725 809819 837534 862899 885067
61838 885067 903280 916622 924145 925452 920964 911613 898666 883921 869365 856279 845060 836183
$$ packed form
61927F28309J5169J4180J2951J1367R523P489M998J927j251l990o299q296r459
61914F76618r090p385n369l674j937M49L477O618R406J1666J3330J4374J4928
61901G23411J5166J4916J3555J0600O483K352j002l614n680p050p826q755j0202
61888G42354j1301j1019r808r077r207r269q716q089p849p736p732q455j0015
61875F24081j1520j2390j3071j3820j3842j2536j0673r229p907n970l822k506
61863E06795k020j351l7J453K758M083N572P044Q441R845J1196J2574J4558J7575
61849E98486K0977K3597K5145K6343K7719K8961K9497K9094K7715K5365K2168
61838H85067J8213J3342P523J307m488r351j2947j4745j4556j3086j1219q877
$$ plain form
61826 836183 830724 829449 831959 837492 846240 858970 875288 892995 909394 922815 932639 938335 939002
61813 939002 933852 922804 906468 885671 861267 834444 806881 780189 755131 731592 709326 688472
61801 688472 669331 652004 636381 622236 609214 596914 585218 574363 564657 556260 549254 543547
61789 543547 538591 533510 527879 522245 517582 514219 511463 508319 504539 500882 498290 496819 495623 494071
61775 494071 492524 491694 491545 491372 490847 490360 490278 490484 490858 491596 492693 493596 493869 493924 494633 496328 498574 500863
61757 500863 503210 505998 509463 513452 517647 521916 526250 530324 533403 534952 535155 534408 532523 529021 524212
61742 524212 519268 514999 511165 507358 503949 501569 500028 498428 496234 493682 491194 488956 487195 486378
61728 486378 486779 488041 489434 490553 491618 493073 494996 496995 498689 500201 502017 504398 507101 509740
$$ packed form
61826H36183n459j275K510N533Q748J2730J6318J7707J6399J3421R824N696O67
61813I39002n150j1048j6336k0797k4404k6823k7563k6692k5058k3539k2266k0854
61801F88472j9141j7327j5623j4145j3022j2300j1696j0855r706q397p006n707
61789E43547m956n081n631n634m663l363k756l144l780l657k592j471j196j552
61775D94071j547q30j49j73n25m87q2K06L74P38J097R03K73N5P09J695K246K289
61757E00863K347K788L465L989M195M269M334M074L079J549K03p47j885l502m809
61742E24212m944m269l834l807l409k380j541j600k194k552k488k238j761q17
61728D86378M01J262J393J119J065J455J923J999J694J512J816K381K703K639
$$ plain form
61714 509740 512275 514993 518039 521123 523770 525791 527317 528257 527936 525630 521516 516745 512406 508708 505308
61699 505308 502016 498859 495781 492776 490112 487948 485860 483200 479862 476317 472976 469959 467351 465148
61685 465148 462907 459995 456337 452553 449282 446708 444775 443412 442412 441423 440187 438588 436494 433920
61671 433920 431276 429036 427130 425103 422910 421069 419912 419081 417976 416419 414791 413734 413689 414403 414984
61656 414984 414810 414315 414402 415298 416515 417854 419641 421920 424161 425989 427525 428830 429765 430750 432876 436709
61640 436709 441458 445839 449291 451960 453965 455325 456275 457073 457589 457483 456614 454976 452516 449429 446445
61625 446445 444365 443311 442619 441437 439271 436164 432571 429078 426110 423846 422156 420428 417799 414092
61611 414092 410332 407691 405935 403638 399971 395455 390775 385814 380411 375207 370983 367635 364546 361584
$$ packed form
61714E09740K535K718L046L084K647K021J526R40l21k306m114m771m339l698l400
61699E05308l292l157l078l005k664k164k088k660l338l545l341l017k608k203
61685D65148k241k912l658l784l271k574j933j363j000r89j236j599k094k574
61671D33920k644k240j906k027k193j841j157q31j105j557j628j057m5P14N81
61656D14984j74m95Q7Q96J217J339J787K279K241J828J536J305R35R85K126L833
61640D36709M749M381L452K669K005J360R50P98N16j06q69j638k460l087k984
61625D46445k080j054o92j182k166l107l593l493k968k264j690j728k629l707
61611D14092l760k641j756k297l667m516m680m961n403n204m224l348l089k962
$$ plain form
61597 361584 359001 356589 353665 349881 345537 341108 336850 332806 328892 325029 321427 318529 316462 314829
61583 314829 313309 312095 311403 310852 309827 308269 306617 305134 303714 302308 301073 300048 299039 297941 296985
61568 296985 296542 296770 297452 298162 298654 299063 299618 300260 300779 301260 302055 303278 304663 305954 307121 308243 309520
61551 309520 311375 313981 316677 318421 319016 319293 319902 320521 320610 320328 320186 320240 320168 319947 320030 320980 323144 326466
61533 326466 330401 334228 337578 340430 342628 343872 344252 344264 344115 343500 342240 340596 338831 337015 335396
61518 335396 334321 333566 332434 330721 328893 327134 325166 323351 322898 324212 325953 326616 326336 326303 327025 328098
61502 328098 329139 329991 330400 330378 330546 331251 331712 330960 329349 328190 328086 328565 329233 330305 331852 333335 334195
61485 334195 334378 334170 333870 333673 333524 333227 333001 333638 335629 338423 341029 343069 344766 346254 347510 348689
$$ packed form
61597C61584k583k412k924l784m344m429m258m044l914l863l602k898k067j633
61583C14829j520j214o92n51j025j558j652j483j420j406j235j025j009j098r56
61568B96985m43K28O82P10M92M09N55O42N19M81P95J223J385J291J167J122J277
61551C09520J855K606K696J744N95K77O09O19Q9k82j42N4p2k21Q3R50K164L322
61533C26466L935L827L350K852K198J244L80J2j49o15j260j644j765j816j619
61518C35396j075p55j132j713j828j759j968j815m53J314J741O63k80l3P22J073
61502C28098J041Q52M09k2J68P05M61p52j611j159j04M79O68J072J547J483Q60
61485C34195J83k08l00j97j49k97k26O37J991K794K606K040J697J488J256J179
$$ plain form
61469 348689 349884 350782 351074 350908 350435 349366 347665 346194 345824 346212 346327 345868 345310 344793 343982 342912 341978
61452 341978 341198 340411 340122 341079 343019 344842 346165 347634 349553 351396 353020 355185 358223 361161 362985
61437 362985 364073 365546 367806 370494 373507 377092 380969 384227 386351 387878 389687 391858 393530 393868
61423 393868 392990 391818 391200 391404 392342 393867 395706 397511 399203 400918 402427 403055 402534 401501 400731 400293
61407 400293 399860 399363 398712 397362 394924 391905 389095 386499 383679 380857 378766 377472 376301 374951 373803
61392 373803 373018 372247 371447 371175 371683 372388 372602 372313 371942 371801 372052 372820 374008 375295 376434 377397 378274 379354
61374 379354 381124 383758 386693 389235 391473 394042 397101 400127 402675 404673 406056 406834 407494 408587 409819
61359 409819 410385 410365 410978 413183 416736 420942 425572 430608 435757 440874 446482 453372 461838 471480 481387
$$ packed form
61469C48689J195Q98K92j66m73j069j701j471l70L88J15m59n58n17q11j070r34
61452C41978p80p87k89R57J940J823J323J469J919J843J624K165L038K938J824
61437C62985J088J473K260K688L013L585L877L258K124J527J809K171J672L38
61423C93868q78j172o18K04R38J525J839J805J692J715J509O28n21j033p70m38
61407D00293m33m97o51j350k438l019k810k596k820k822k091j294j171j350j148
61392C73803p85p71q00k72N08P05K14k89l71j41K51P68J188J287J139R63Q77J080
61374C79354J770K634K935K542K238K569L059L026K548J998J383P78O60J093J232
61359D09819N66k0O13K205L553M206M630N036N149N117N608O890Q466R642R907
$$ plain form
61344 481387 490308 497128 501629 504645 507291 510217 513628 517570 521956 526588 531297 535851 539721 542319
61330 542319 543557 543816 543300 541834 539361 536274 533067 529923 526699 523104 518963 514566 510628 507598 505256
61315 505256 503371 502388 502834 504330 506037 507946 510917 515455 521320 528412 537141 547702 559812 573341
61301 573341 588369 604228 619194 631549 640415 645414 646361 643775 639008 633273 626936 620041 612901
61288 612901 605704 598047 589409 579835 569897 560317 551831 544890 539204 534024 529147 525179 522631 521318
61274 521318 520987 521890 524319 528054 532659 537861 543259 548219 552545 556776 561389 566167 570837 575837 581821
61259 581821 588834 596599 605300 615268 625975 636000 644173 650339 654939 658263 660338 661300 661604 661745
61245 661745 661772 661188 659455 656563 652949 648982 644794 640537 636414 632442 628537 624847 621657 618902 616157
$$ packed form
61344D81387Q921O820M501L016K646K926L411L942M386M632M709M554L870K598
61330E42319J238K59n16j466k473l087l207l144l224l595m141m397l938l030k342
61315E05256j885r83M46J496J707J909K971M538N865P092Q729J0561J2110J3529
61301E73341J5028J5859J4966J2355Q866M999R47k586m767n735o337o895p140
61288F12901p197p657q638r574r938r580q486o941n686n180m877l968k548j313
61274E21318l31R03K429L735M605N202N398M960M326M231M613M778M670N000N984
61259E81821P013P765Q701R968J0707J0025Q173O166M600L324K075R62L04J41
61245F61745K7n84j733k892l614l967m188m257m123l972l905l690l190k755k745
$$ plain form
61230 616157 613217 610399 608210 606991 606925 608047 610252 613490 617803 622896 627887 632019 635427 638724 642068
61215 642068 645347 649042 653974 660085 666254 671466 675494 678341 679909 680441 680528 680341 679507 678014 676541
61200 676541 675695 675612 676584 679259 683903 690228 698347 709051 722724 738727 756334 775277 794641 812088
61186 812088 825353 834238 840309 844933 848391 850665 852153 853380 854507 855284 855238 853900 851088 846959 841822
61171 841822 836065 830197 824519 818719 812246 805112 797794 790243 781732 771918 761323 750388 738764
61158 738764 726053 712657 699322 686351 673845 662341 652562 644824 639100 635353 633413 632895 633667
61145 633667 635938 639304 642017 641819 637528 629547 619187 607884 596784 586488 577131 568845 561947
61132 561947 556554 552438 549576 548495 549642 552649 556630 561038 565971 571823 579004 587947 599057 612539
$$ packed form
61230F16157k940k818k189j219o6J122K205L238M313N093M991M132L408L297L344
61215F42068L279L695M932O111O169N212M028K847J568N32Q7j87q34j493j473
61200F76541q46q3R72K675M644O325Q119J0704J3673J6003J7607J8943J9364J7447
61186H12088J3265Q885O071M624L458K274J488J227J127P77m6j338k812m129n137
61171H41822n757n868n678n800o473p134p318p551q511r814j0595j0935j1624
61158G38764j2711j3396j3335j2971j2506j1504r779p738n724l747j940n18P72
61145F33667K271L366K713j98m291p981j0360j1303j1100j0296r357q286o898
61132E61947n393m116k862j081J147L007L981M408M933N852P181Q943J1110J3482
$$ plain form
61118 612539 628219 645554 663995 683570 704844 727972 752104 776232 800345 825109 850621
61107 850621 876319 901936 927460 952144 974662 994625 1012865 1029747 1044141 1054638 1060859 1062905
61095 1062905 1060397 1053105 1041977 1028563 1013549 996537 977149 955746 933196 910382 887891 865784
61083 865784 843701 821417 799340 778400 759439 742524 726663 710592 694276 679252 666849
61072 666849 656476 646596 637086 629410 624479 621585 619700 618625 618373 618524 618799 619454 620651 622256 624693
61057 624693 629058 635785 643936 652354 660848 669805 679436 689932 701738 715147 730068 746409 764120
61044 764120 782771 801916 821967 843850 867692 892830 919214 947635 978280 1010225 1042714
61033 1042714 1075842 1109702 1144022 1179083 1215868 1254923 1296020 1339074 1384201 1430755 1477609
$$ packed form
61118F12539J5680J7335J8441J9575K1274K3128K4132K4128K4113K4764K5512
61107H50621K5698K5617K5524K4684K2518J9963J8240J6882J4394J0497O221K046
61095A062905k508p292j1128j3414j5014j7012j9388k1403k2550k2814k2491k2107
61083H65784k2083k2284k2077k0940j8961j6915j5861j6071j6316j5024j2403
61072F66849j0373r880r510p676m931k894j885j075k52J51K75O55J197J605K437
61057F24693M365O727Q151Q418Q494Q957R631J0496J1806J3409J4921J6341J7711
61044G64120J8651J9145K0051K1883K3842K5138K6384K8421L0645L1945L2489
61033A042714L3128L3860L4320L5061L6785L9055M1097M3054M5127M6554M6854
$$ plain form
61022 1477609 1524388 1571034 1616501 1659986 1703579 1751546 1806637 1869199 1939971 2020889 2112362
61011 2112362 2212468 2320016 2436305 2563756 2706295 2872207 3073358 3320705 3624489
61002 3624489 3999832 4467556 5048933 5767566 6661146 7785642 9204223 10977512 13155734
60993 13155734 15733783 18556608 21261612 23377647 24566693 24821909 24448687 23865371
60985 23865371 23420298 23343101 23753842 24610146 25626751 26321351 26238078 25192677 23336574
60976 23336574 21011809 18552832 16185753 14034141 12153465 10550307 9198776 8063697
60968 8063697 7114735 6324136 5663373 5108301 4642645 4252700 3922640 3637881 3389007
60959 3389007 3169326 2971886 2791689 2627707 2479565 2344458 2219667 2105691 2004200
$$ packed form
61022A477609M6779M6646M5467M3485M3593M7967N5091O2562P0772Q0918R1473
61011B112362J00106J07548J16289J27451J42539J65912K01151K47347L03784
61002C624489L75343M67724N81377P18633Q93580J124496J418581J773289K178222
60993A3155734K578049K822825K705004K116035J189046K55216l73222n83316
60985B3865371m45073p7197M10741Q56304J016605O94600q3273j045401j856103
60976B3336574k324765k458977k367079k151612j880676j603158j351531j135079
60968H063697r48962p90599o60763n55072m65656l89945l30060k84759k48874
60959C389007k19681j97440j80197j63982j48142j35107j24791j13976j01491
$$ plain form
60950 2004200 1914749 1835718 1766433 1705743 1650092 1595508 1540549 1485597 1430751 1376361 1324287
60939 1324287 1276319 1232123 1190314 1150561 1113068 1077183 1042278 1009054 978270 949090 920364
60928 920364 892740 867836 845924 825910 807042 789259 772427 756500 741941 728875 716423
60917 716423 703935 692192 682291 674052 666613 659876 654204 649403 645192 642096 640737 640661 640855 640961 641211
60902 641211 641782 642995 645404 648820 651947 653846 654965 655977 656537 656183 655483 655101 654512 652852 650341 647700
60886 647700 644780 640935 636215 631077 625379 618669 611012 602709 593735 584291 575238 567059 559110 550832
60872 550832 542857 535827 528988 521343 513617 507626 503968 501531 499051 496100 492811 489709 487653 487068
60858 487068 487394 488045 489452 492236 495730 498370 499365 499174 498589 498166 498366 499480 501437 504088 507348 510720
$$ packed form
60950B004200q9451p9031o9285o0690n5651n4584n4959n4952n4846n4390n2074
60939A324287m7968m4196m1809l9753l7493l5885l4905l3224l0784k9180k8726
60928I20364k7624k4904k1912k0014j8868j7783j6832j5927j4559j3066j2452
60917G16423j2488j1743r901q239p439o737n672m801m211l096j359p6J94J06K50
60902F41211N71J213K409L416L127J899J119J012N60l54p00l82n89j660k511k641
60886F47700k920l845m720n138n698o710p657q303q974r444r053q179p949q278
60872E50832p975p030o839p645p726n991l658k437k480k951l289l102k056n85
60858D87068L26O51J407K784L494K640R95j91n85m23K00J114J957K651L260L372
$$ plain form
60842 510720 513303 514788 515777 516563 516397 514683 512053 509386 506551 503084 499375 496111 493145 489984 486902
60827 486902 484550 482948 481782 481189 481331 481744 482046 482662 483875 484820 484490 483213 481994 480965 479615 477990
60811 477990 476414 474463 471488 467810 464251 460813 457005 453065 449561 446104 441821 436977 432820 429844
60797 429844 427359 424758 422048 419099 415503 411296 406953 402638 398238 393976 390182 386680 383326 380835
60783 380835 379958 380051 379597 378161 376793 376489 377195 378285 379062 378870 377676 376560 376718 378039 379539 381018
60767 381018 383260 386695 390873 395332 399970 404577 408889 413124 417601 421912 425360 428101 430850 433538
60753 433538 435330 435939 435863 435310 434009 432216 430780 430015 429431 428749 428193 427675 426740 425483 424399 422998 419796
60736 419796 414249 407717 401835 396703 391378 385507 379714 374736 370801 367664 364838 361868 358634 355417
$$ packed form
60842E10720K583J485R89P86j66j714k630k667k835l467l709l264k966l161l082
60827D86902k352j602j166n93J42M13L02O16J213R45l30j277j219j029j350j625
60811D77990j576j951k975l678l559l438l808l940l504l457m283m844m157k976
60797D29844k485k601k710k949l596m207m343m315m400m262l794l502l354k491
60783C80835q77R3m54j436j368l04P06J090P77j92j194j116J58J321J500J479
60767C81018K242L435M178M459M638M607M312M235M477M311L448K741K749K688
60753D33538J792O09p6n53j301j793j436p65n84o82n56n18r35j257j084j401l202
60736D19796n547o532n882n132n325n871n793m978l935l137k826k970l234l217
$$ plain form
60722 355417 352699 350942 350293 350210 349682 348264 346578 345393 344586 343626 342619 342035 341726 341214 340818 341468 343341
60705 343341 345584 347511 349248 351054 352788 354284 355648 356974 358322 360033 362476 365355 367890 369755
60691 369755 371367 373265 375742 379077 383429 388410 393259 397493 401053 403986 406506 409213 412616 416479
60677 416479 420116 423165 425582 427210 428013 428474 429028 429329 428817 427725 426708 425650 423713 420472 416208
60662 416208 411190 405543 399737 394432 389851 385936 382904 380858 379156 377180 375523 375415 377029 379325
60648 379325 381516 383652 385824 387893 390111 392961 396154 398668 399932 400084 399037 396294 391918 386814
60634 386814 381806 377197 373334 370718 369340 368660 368307 368094 367510 366188 364829 364567 365338 365988 366133 366676
60618 366676 368156 369744 370466 370419 370244 370186 370234 370505 371009 371582 372366 373732 375527 377015 377777 378031 377955 377440
$$ packed form
60722C55417k718j757o49q3n28j418j686j185q07r60j007n84l09n12l96O50J873
60705C43341K243J927J737J806J734J496J364J326J348J711K443K879K535J865
60691C69755J612J898K477L335M352M981M849M234L560K933K520K707L403L863
60677D16479L637L049K417J628Q03M61N54L01n12j092j017j058j937l241m264
60662D16208n018n647n806n305m581l915l032k046j702j976j657j08J614K296
60648C79325K191K136K172K069K218K850L193K514J264J52j047k743m376n104
60634C86814n008m609l863k616j378o80l53k13n84j322j359k62P71O50J45N43
60618C66676J480J588P22m7j75n8M8K71N04N73P84J366J795J488P62K54p6n15
$$ plain form
60600 377440 376627 375919 375299 374429 373542 373431 374409 376097 378295 381136 384270 386911 388903 390789 392622 393812
60584 393812 394365 395059 396008 396209 395140 393716 393016 392971 392997 393045 393298 393657 394315 396170 399934 405346 411864 419611
60566 419611 429037 440211 453001 467388 482951 498429 512397 524154 533638 540792 545347 546883
60554 546883 544953 539551 531629 522706 513888 505742 499073 494958 493775 494824 497188 500435 504493 509593
60540 509593 516439 525663 536976 549627 563752 580347 599810 621473 644667 668959 692900 713742
60528 713742 729192 738731 742822 741809 736242 727381 716569 704646 692399 680846 670524 661100 652181
60515 652181 643888 636333 629315 622985 618021 614625 612077 609807 608200 607886 608927 611234 615136 621116
60501 621116 629592 641280 657124 677597 702759 733114 769437 811457 857785 907405 960114 1015127
$$ packed form
60600C77440q13p08o20q70q87j11R78J688K198K841L134K641J992J886J833J190
60584C93812N53O94R49K01j069j424p00m5K6M8K53L59O58J855L764N412O518P747
60566D19611R426J1174J2790J4387J5563J5478J3968J1757R484P154M555J536
60554E46883j930n402p922q923q818q146o669m115j183J049K364L247M058N100
60540E09593O846R224J1313J2651J4125J6595J9463K1663K3194K4292K3941K0842
60528G13742J5450R539M091j013n567q861j0812j1923j2247j1553j0322r424q919
60515F52181q293p555p018o330m964l396k548k270j607l14J041K307L902N980
60501F21116Q476J1688J5844K0473K5162L0355L6323M2020M6328M9620N2709N5013
$$ plain form
60489 1015127 1070528 1124628 1176510 1224507 1265526 1296916 1317920 1328318 1326877 1312432 1285581
60478 1285581 1248018 1200992 1145773 1085074 1022603 961333 903052 849080 800286 756604 717448
60467 717448 682476 651427 623775 599270 578257 560680 545397 531364 518903 508803 500675 493257
60455 493257 485994 479283 473354 467897 462704 457868 453431 449360 445646 441897 437301 431702 426342 422774
60441 422774 421269 420913 420864 420841 420750 420628 420696 420784 419987 417573 414050 410705 408268 406503 404868 403111 401418
60424 401418 400327 400167 400405 400136 399433 399437 400698 402329 403398 404233 405566 407233 408683 409994 411416 412526
60408 412526 412891 413040 413809 415143 416492 417885 419690 421765 423815 426114 428940 431705 433645 434944 436241
60393 436241 437569 438799 440606 443729 447591 450892 453400 455943 458844 461530 463646 465359 466566 466990
$$ packed form
60489A015127N5401N4100N1882M7997M1019L1390K1004J0398j441j4445k6851
60478A285581l7563m7026n5219o0699o2471o1270n8281n3972m8794m3682l9156
60467G17448l4972l1049k7652k4505k1013j7577j5283j4033j2461j0100q128p418
60455D93257p263o711n929n457n193m836m437m071l714l749m596n599n360l568
60441D22774j505l56m9k3r1j22O8Q8p97k414l523l345k437j765j635j757j693
60424D01418j091j60K38k69p03MJ261J631J069Q35J333J667J450J311J422J110
60408D12526L65J49P69J334J349J393J805K075K050K299K826K765J940J299J297
60393D36241J328J230J807L123L862L301K508K543K901K686K116J713J207M24
$$ plain form
60379 466990 467154 468212 470599 473750 477206 480995 484757 487573 489136 490353 492342 495277 498435 500940
60365 500940 502349 502959 503660 505135 507204 509219 510901 512396 513860 515475 517572 520192 522867 525448 528712
60350 528712 533410 539118 544920 550888 557887 566042 574343 581771 587904 592401 594861 595407 594673 592983 590102
60335 590102 585938 580961 575792 570828 566293 562203 558272 554232 550146 546060 541603 536516 531411 527324
60321 527324 524470 521898 518471 513932 509142 505486 503827 503748 504125 504596 505987 509100 513831 519923 527793
60306 527793 537851 549689 562845 577868 595851 617245 641663 668025 693980 716002 731427
60295 731427 740121 743152 740296 730217 712920 690721 666664 642984 621100 601935 585813 572663
60283 572663 562506 555291 550380 546749 543626 540543 537245 534069 531781 530273 528090 524181 519440 515377
$$ packed form
60379D66990J64J058K387L151L456L789L762K816J563J217J989K935L158K505
60365E00940J409O10P01J475K069K015J682J495J464J615K097K620K675K581L264
60350E28712M698N708N802N968O999Q155Q301P428O133M497K460N46p34j690k881
60335E90102m164m977n169m964m535m090l931m040m086m086m457n087n105m087
60321E27324k854k572l427m539m790l656j659p9L77M71J391L113M731O092P870
60306E27793J0058J1838J3156J5023J7983K1394K4418K6362K5955K2022J5425
60295G31427Q694L031k856j0079j7297k2199k4057k3680k1884j9165j6122j3150
60283E72663j0157p215m911l631l123l083l298l176k288j508k183l909m741m063
$$ plain form
60269 515377 511904 507811 502927 498272 494240 490210 486001 482297 479420 476934 474668 472966 471733 470394
60255 470394 468933 467898 467189 466021 464304 463002 462800 463416 464456 465932 467658 469095 470114 471074 471952
60240 471952 472318 472258 472345 472543 472199 471296 470687 470829 471378 472252 473959 476479 478978 481124 483624 486903 490313
60223 490313 493296 496353 500077 503971 507051 509119 510875 513170 516545 521040 526072 530944 535727 541141
60209 541141 547429 554048 560620 567462 574858 582536 590216 598021 605987 613778 621169 628236 634844 640610
60195 640610 645646 650644 655892 660794 664603 667039 668001 667421 665719 663723 661781 659497 656541 653102 649310
60180 649310 644855 639441 633056 625749 617864 610530 604997 601169 597675 593651 589578 586048 582753 579281
60166 579281 576005 573450 571485 569884 569033 569248 569791 569399 567671 565469 564023 563993 565187 566895 568605 570456
$$ packed form
60269E15377l473m093m884m655m032m030m209l704k877k486k266j702j233j339
60255D70394j461j035p09j168j717j302k02O16J040J476J726J437J019R60Q78
60240D71952L66o0Q7J98l44r03o09J42N49Q74J707K520K499K146K500L279L410
60223D90313K983L057L724L894L080K068J756K295L375M495N032M872M783N414
60209E41141O288O619O572O842P396P678P680P805P966P791P391P067O608N766
60195F40610N036M998N248M902L809K436R62n80j702j996j942k284k956l439l792
60180F49310m455n414o385p307p885p334n533l828l494m024m073l530l295l472
60166E79281l276k555j965j601q51K15N43l92j728k202j446l0J194J708J710J851
$$ plain form
60150 570456 572743 575082 576568 576845 576492 576196 576091 576130 576556 577667 579445 581578 583655 585372 587002 589580
60134 589580 594098 600473 607714 615001 622101 628894 635204 641063 646498 651118 654519 656950 658890 660301
60120 660301 661155 662406 665224 669281 672959 675468 677660 680573 684260 688368 692730 696875 699895 701381
60106 701381 701817 701702 700935 699319 696883 693538 689210 684456 680013 675589 670170 663766 657726 652982 649160
60091 649160 645886 643727 643073 643151 643069 643060 643847 645386 646938 647858 647770 646551 644696 643183 642471 642085 641433 640389
60073 640389 638812 636275 632681 628399 623444 617289 609886 602030 594316 586560 578641 571052 564122 557590
60059 557590 551451 546327 542380 538753 534755 530813 527600 525004 522688 520959 520306 520595 521362 522478 524064
60044 524064 526256 529398 533805 539013 543996 548515 553459 559506 566314 573396 580734 588007 594223 598847
$$ packed form
60150E70456K287K339J486K77l53k96j05L9M26J111J778K133K077J717J630K578
60134E89580M518O375P241P287P100O793O310N859N435M620L401K431J940J411
60120F60301Q54J251K818M057L678K509K192K913L687M108M362M145L020J486
60106G01381M36j15p67j616k436l345m328m754m443m424n419o404o040m744l822
60091F49160l274k159o54P8q2rP87J539J552R20q8j219j855j513p12l86o52j044
60073F40389j577k537l594m282m955o155p403p856p714p756p919p589o930o532
60059E57590o139n124l947l627l998l942l213k596k316j729o53K89P67J116J586
60044E24064K192L142M407N208M983M519M944O047O808P082P338P273O216M624
$$ plain form
60030 598847 602376 605131 606436 605747 603674 601018 597614 592952 587214 580882 574059 566925 560087 553675
60016 553675 546765 538504 529195 519628 510121 500895 492519 485167 478324 472003 467340 465019 464000 462824
60002 462824 461315 459969 458584 456861 455558 455569 456323 456539 456260 456764 458615 461061 463362 465557 467819 470054
59986 470054 472356 475105 478463 482233 486196 490130 493716 496858 499793 502423 503930 503622 501769 499057
59972 499057 495721 491780 487593 483513 479417 475214 471350 468236 465730 463858 463363 464707 467115 469547
59958 469547 472066 475277 478844 481640 483208 484107 484950 485852 486709 487297 487225 486362 485211 484359 483840 483491 483514
59941 483514 484123 485012 485711 486059 485885 484795 482844 480814 479219 477639 475705 474084 473728 474725 476625 479261
59925 479261 482462 485625 488506 491927 496789 502933 509752 517316 525854 534681 542687 549491 555187 559441
$$ packed form
60030E98847L529K755J305o89k073k656l404m662n738o332o823p134o838o412
60016E53675o910q261r309r567r507r226q376p352o843o321m663k321j019j176
60002D62824j509j346j385j723j303J1P54K16k79N04J851K446K301K195K262K235
59986D70054K302K749L358L770L963L934L586L142K935K630J507l08j853k712
59972D99057l336l941m187m080m096m203l864l114k506j872m95J344K408K432
59958D69547K519L211L567K796J568Q99Q43R02Q57N88p2q63j151q52n19l49K3
59941D83514O09Q89O99L48j74j090j951k030j595j580j934j621l56R97J900K636
59925D79261L201L163K881L421M862O144O819P564Q538Q827Q006O804N696M254
$$ plain form
59911 559441 561915 563202 564262 565233 565769 566227 567451 569552 571868 574005 576017 577760 578906 579500 579811
59896 579811 579833 579593 579610 580376 581737 583444 585809 589100 592862 596693 601097 606580 612352 616967 619931 621865
59880 621865 623508 625483 628528 632920 638049 643377 649272 655900 661934 665654 666866 666511 664831 661316
59866 661316 656226 650703 645279 639518 633234 627122 622025 618392 616306 615240 614042 612099 610341 610218
59852 610218 611945 614624 617715 621353 625595 630521 636930 645833 657252 670246 683643 695787 704180
59839 704180 706919 704527 699367 693523 688296 685132 685190 687765 690500 691459 690080 686237 679757 671194 661968
59824 661968 653326 645735 639233 633529 627912 621964 616259 611551 607563 603532 599568 596308 593553 590521
59810 590521 587265 584511 582174 579372 575939 572703 570213 568333 567108 566807 567118 567468 568078 569479 571052
$$ packed form
59911E59441K474J287J060R71N36M58J224K101K316K137K012J743J146N94L11
59896E79811K2k40J7P66J361J707K365L291L762L831M404N483N772M615K964J934
59880F21865J643J975L045M392N129N328N895O628O034L720J212l55j680l515
59866F61316n090n523n424n761o284o112n097l633k086j066j198j943j758j23
59852F10218J727K679L091L638M242M926O409Q903J1419J2994J3397J2144Q393
59839G04180K739k392n160n844n227l164N8K575K735R59j379l843o480q563r226
59824F61968q642p591o502n704n617n948n705m708l988m031l964l260k755l032
59810E90521l256k754k337k802l433l236k490j880j225l01L11L50O10J401J573
$$ plain form
59795 571052 571450 570560 569690 569607 569668 569104 567932 566366 564461 562595 561227 560004 558132 555635 553138 550530
59779 550530 547154 543341 540244 537981 535464 532367 529738 528226 527187 526155 525797 526650 528072 529258 530374
59764 530374 532007 534330 537358 541209 545660 550125 554417 558823 563322 567687 572458 578763 586845 595784
59750 595784 604884 614247 623776 632808 641112 649145 656849 663324 668149 672006 675540 678604 681040 683165
59736 683165 684978 685830 685400 684175 682612 680717 678724 677141 675774 673740 670899 668243 666504 665390 664568
59721 664568 664219 664073 663070 660749 658067 656133 654917 653770 652349 650532 648250 646003 644738 644659 644929
59706 644929 645035 645606 647290 649644 651810 653676 655800 658652 662336 666548 670549 673749 676531 679892 684200
59691 684200 688938 693570 697714 700507 701071 699875 698494 697717 696971 695946 695479 696155 697120 697061 695573 692955
$$ packed form
59795E71052L98q90q70q3O1n64j172j566j905j866j368j223j872k497k497k608
59779E50530l376l813l097k263k517l097k629j512j039j032l58Q53J422J186J116
59764E30374J633K323L028L851M451M465M292M406M499M365M771O305Q082Q939
59750E95784R100R363R529R032Q304Q033P704O475M825L857L534L064K436K125
59736F83165J813Q52m30j225j563j895j993j583j367k034k841k656j739j114q22
59721F64568l49j46j003k321k682j934j216j147j421j817k282k247j265p9K70
59706F44929J06N71J684K354K166J866K124K852L684M212M001L200K782L361M308
59691F84200M738M632M144K793N64j196j381p77p46j025m67O76R65n9j488k618
$$ plain form
59675 692955 689411 685039 680020 674322 667785 660754 654052 648095 642710 637841 633654 629936 626282 622971
59661 622971 620698 619415 618431 617656 617632 618335 619193 620383 622747 626259 629902 633274 636947 640975 644553 647451
59645 647451 650277 652828 653713 652245 649275 645565 640719 634423 627284 619755 611578 603083 595695 590354
59631 590354 586619 584034 582983 583406 584018 583785 583012 582132 580619 577946 574500 570677 566236 561320 556940
59616 556940 553566 550370 546646 542765 539009 534781 529940 525621 522758 520944 519665 519383 520383 521828
59602 521828 523012 524360 526170 527584 528006 528287 529295 530412 530721 530582 530808 531309 531774 532725 534588 536633
59586 536633 538071 539311 540908 542190 542189 541173 539989 538590 536402 533492 530348 527120 523955 521293 519003
59571 519003 516162 512574 509439 507576 506091 503881 501322 499298 497698 496167 495316 495755 496785 497379 497689
$$ packed form
59675F92955l544m372n019n698o537p031o702n957n385m869m187l718l654l311
59661F22971k273j283r84p75k4P03Q58J190K364L512L643L372L673M028L578K898
59645F47451K826K551Q85j468k970l710m846o296p139p529q177q495p388n341
59631E90354l735k585j051M23O12k33p73q80j513k673l446l823m441m916m380
59616E56940l374l196l724l881l756m228m841m319k863j814j279k82J000J445
59602E21828J184J348J810J414M22K81J008J117L09j39K26N01M65R51J863K045
59586E36633J438J240J597J282jj016j184j399k188k910l144l228l165k662k290
59571E19003k841l588l135j863j485k210k559k024j600j531q51M39J030N94L10
$$ plain form
59556 497689 498368 499247 499875 500556 501635 502611 503114 503884 505603 507665 509307 510995 513449 516200 518455 520586
59540 520586 523612 528092 534552 544034 557240 574266 595838 622629 651575 674903 685615 683388
59528 683388 673403 660703 647904 636952 629736 626584 626305 627968 631199 635130 638849 642585 646744 650131
59514 650131 650897 648896 645319 640350 633148 624064 614876 606596 598611 590225 581671 573512 566220 560282
59500 560282 555566 550880 545344 539791 535560 532449 529322 526219 524152 523207 522494 521792 521666 522113 522644 523481
59484 523481 525192 527335 529022 530600 533221 536918 540641 544012 547544 551286 554867 558727 563763 569774
59470 569774 575636 580808 585294 588459 589546 589148 588545 587818 586207 584093 582788 582493 582250 581981 582816 585335
59454 585335 589144 594287 601315 609759 618199 626229 634905 644944 655786 666541 676513 684670 689923
$$ packed form
59556D97689O79Q79O28O81J079R76N03P70J719K062J642J688K454K751K255K131
59540E20586L026M480O460R482J3206J7026K1572K6791K8946K3328J0712k227
59528F83388r985j2700j2799j0952p216l152k79J663L231L931L719L736M159L387
59514F50131P66k001l577m969p202r084r188q280p985q386q554q159p292n938
59500E60282m716m686n536n553m231l111l127l103k067r45p13p02j26M47N31Q37
59484E23481J711K143J687J578K621L697L723L371L532L742L581L860N036O011
59470E69774N862N172M486L165J087l98o03p27j611k114j305k95k43k69Q35K519
59454E85335L809N143P028Q444Q440Q030Q676J0039J0842J0755R972Q157N253
$$ plain form
59441 689923 692025 691114 686625 678109 666914 655502 645162 635794 627557 621014 615771 610766 605909 601859
59427 601859 598417 594891 591890 590832 591799 593768 596835 602133 609638 618307 628437 641590 657926 676002
59413 676002 695499 717783 743489 772158 804511 841454 879100 907816 919014 911825 891974 866235
59401 866235 839790 816689 799687 789884 788223 796419 814182 835752 851364 853180 839734 815290
59389 815290 786132 757267 731289 709125 691180 677483 667292 659575 654006 650765 649435 649058 649349
59376 649349 650783 653388 656526 660021 664337 669374 674246 678554 682761 686990 690639 693611 696781 700698
59362 700698 704813 708494 711901 715423 719129 723130 727614 732270 736498 740413 744812 750119 756360 764067
59348 764067 773965 785641 797763 809803 822392 835931 850244 865594 882490 900050 916068 929168
$$ packed form
59441F89923K102r11m489q516j1195j1412j0340r368q237o543n243n005m857m050
59427F01859l442l526l001j058R67J969L067N298P505Q669J0130J3153J6336J8076
59413F76002J9497K2284K5706K8669L2353L6943L7646K8716J1198p189j9851k5739
59401H66235k6445k3101j7002r803j661Q196J7763K1570J5612J816j3446k4444
59389H15290k9158k8865k5978k2164j7945j3697j0191p717n569l241j330l77K91
59376F49349J434K605L138L495M316N037M872M308M207M229L649K972L170L917
59362G00698M115L681L407L522L706M001M484M656M228L915M399N307O241P707
59348G64067R898J1676J2122J2040J2589J3539J4313J5350J6896J7560J6018J3100
$$ plain form
59336 929168 939704 948272 954689 958778 960670 959896 955543 947791 937959 926706 913641 899070 884486
59323 884486 870729 857249 843835 831497 820872 811263 802148 794207 787879 782228 776240 770132 764460
59310 764460 758967 753210 747326 741353 734788 727610 720872 715548 711619 708880 707688 708424 711192 716678
59296 716678 726324 740828 758873 777318 791832 797713 792074 776171 754640 732013 710678 691773
59284 691773 676020 663042 651499 640800 631624 624456 619027 615523 614729 616487 619634 624013 630846
59271 630846 640498 651623 663264 676044 690412 705460 720401 735505 750534 763988 775033 784425
59259 784425 792273 796573 795533 789985 782031 772565 761564 749644 737784 726333 715504 706020 698240
59246 698240 691560 685577 680784 677335 674444 671926 670909 671946 673904 675974 679290 685024 692205 699054
$$ packed form
59336I29168J0536Q568O417M089J892p74m353p752r832j1253j3065j4571j4584
59323H84486j3757j3480j3414j2338j0625r609r115p941o328n651n988o108n672
59310G64460n493n757n884n973o565p178o738n324l929k739j192P36K768N486
59296G16678R646J4504J8045J8445J4514N881n639j5903k1531k2627k1335j8905
59284F91773j5753j2978j1543j0699r176p168n429l504p94J758L147M379O833
59271F30846R652J1125J1641J2780J4368J5048J4941J5104J5029J3454J1045R392
59259G84425P848M300j040n548p954r466j1001j1920j1860j1451j0829r484p780
59246F98240o680n983m793l449k891k518j017J037J958K070L316N734P181O849
$$ plain form
59232 699054 705380 712043 718932 725148 730568 735768 740800 745131 748234 749429 747944 743953 738732 733013
59218 733013 726304 718600 711388 705863 701405 696964 692653 688733 684380 678965 673406 668752 664459 659570
59204 659570 654612 650691 647575 644262 640761 637844 635609 633615 631893 630625 629485 628328 627783 628085 628248
59189 628248 627614 627291 628752 631775 635041 637978 640808 643569 646401 650069 655017 660597 666189 672112 678394
59174 678394 683875 687863 691481 695877 700236 703341 706106 710644 717430 725199 733226 741952 751606 761703
59160 761703 771723 781037 788446 793027 795144 795590 794212 790392 784290 776494 767048 755989 744239 732835
59146 732835 721785 710665 699627 688851 677838 666431 655631 646158 637083 627240 617248 608709
59134 608709 602017 596238 590588 584804 578743 572849 568376 565992 564828 563979 564000 565690 568407 571086 574121
$$ packed form
59232F99054O326O663O889O216N420N200N032M331L103J195j485l991n221n719
59218G33013o709p704p212n525m458m441m311l920m353n415n559m654m293m889
59204F59570m958l921l116l313l501k917k235j994j722j268j140j157n45L02J63
59189F28248o34l23J461L023L266K937K830K761K832L668M948N580N592N923O282
59174F78394N481L988L618M396M359L105K765M538O786P769Q027Q726R654J0097
59160G61703J0020R314P409M581K117M46j378l820o102p796r446j1059j1750j1404
59146G32835j1050j1120j1038j0776j1013j1407j0800r473r075r843r992q539
59134F08709o692n779n650n784o061n894m473k384j164q49K1J690K717K679L035
$$ plain form
59119 574121 578769 585382 593599 603485 615040 627296 639332 651481 664205 676648 687756 698009
59107 698009 708464 718854 728242 736802 745265 753267 759939 765602 771196 776449 780143 781809 781734 779849
59093 779849 776113 771584 767676 764727 762422 760957 760549 760507 760125 759708 759416 758028 754347 748948 743013 736351
59077 736351 728280 719454 710956 702422 692975 683266 674588 666691 658505 650507 644243 639782 635623 630961
59063 630961 626267 621838 617426 613111 609014 604543 599400 594772 591932 590236 588162 585664 583727 582260
59049 582260 580385 578252 576640 575199 573010 570541 569136 568922 569009 569260 570011 570554 569834 568254 566916 565670
59033 565670 563901 562591 563347 565805 568282 570671 574401 579816 585982 592955 601852 612614 623944 635580
59019 635580 648493 662755 677326 692004 707361 722556 735345 744542 750545 753340 752226 747813
$$ packed form
59119E74121M648O613Q217R886J1555J2256J2036J2149J2724J2443J1108J0253
59107F98009J0455J0390R388Q560Q463Q002O672N663N594N253L694J666p5j885
59093G79849l736m529l908k949k305j465m08m2l82m17k92j388l681n399n935o662
59077G36351q071q826q498q534r447r709q678p897q186p998o264m461m159m662
59063F30961m694m429m412m315m097m471n143m628k840j696k074k498j937j467
59049E82260j875k133j612j441k189k469j405k14Q7K51P51N43p20j580j338j246
59033E65670j769j310P56K458K477K389L730N415O166O973Q897J0762J1330J1636
59019F35580J2913J4262J4571J4678J5357J5195J2789R197O003K795j114m413
$$ plain form
59007 747813 742233 736883 731681 726793 723131 720883 719423 719086 721277 726360 733084 740307 747800 755159
58993 755159 761548 766645 770462 772393 772047 770712 770087 769709 767564 763154 757972 753015 747920 742665 738046
58978 738046 734268 730948 728603 728319 729980 732711 736936 743852 752952 762294 771306 781110 791991 802860
58964 802860 813455 824696 836410 846960 855662 863564 871296 878115 883459 887514 889799 889038 884755
58951 884755 877358 866708 852584 836449 820475 804773 787887 770066 753515 739175 725859 713001
58939 713001 701726 692595 684814 678305 674105 671957 669871 666891 664044 661886 659505 656771 655144 655216
58925 655216 655607 655327 655144 655673 656108 655805 655188 654268 652202 649145 646592 645128 643679 641680 640008 639188
58909 639188 638740 638934 641047 645199 650039 655144 661538 669336 677264 685304 695310 708061 721996 735770
$$ packed form
59007G47813n580n350n202m888l662k248j460l37K191N083O724P223P493P359
58993G55159O389N097L817J931l46j335o25l78k145m410n182m957n095n255m619
58978G38046l778l320k345k84J661K731M225O916R100R342R012R804J0881J0869
58964H02860J0595J1241J1714J0550Q702P902P732O819N344M055K285p61m283
58951H84755p397j0650j4124j6135j5974j5702j6886j7821j6551j4340j3316j2858
58939G13001j1275r131p781o509m200k148k086k980k847k158k381k734j627P2
58925F55216L91k80j83N29M35l03o17r20k066l057k553j464j449j999j672q20
58909F39188m48J94K113M152M840N105O394P798P928Q040J0006J2751J3935J3774
$$ plain form
58895 735770 749688 763711 776582 788131 800079 813380 827000 840490 855471 873281 893248
58884 893248 914497 937218 960915 983496 1003421 1020873 1035832 1047100 1054245 1058243 1059171 1055669
58872 1055669 1047783 1037831 1027063 1013987 997583 979788 963121 948068 934442 923066 914200 906183
58860 906183 897454 888278 879121 869233 858251 847231 836637 825299 812734 800416 789267 778125
58848 778125 766286 755293 746387 738335 729747 721572 715272 710187 704675 698354 691494 683745 675083 666533
58834 666533 658516 650154 641488 634468 630270 627525 624663 622009 620046 617851 615063 613301 613667 614752
58820 614752 615021 615251 616712 618811 620586 622753 626208 630150 633639 637417 642249 647073 650608 653258 655651
58805 655651 657067 657063 656910 657462 657359 655303 652422 650387 648790 646362 643207 639873 635812 630666 625590 621432
$$ packed form
58895G35770J3918J4023J2871J1549J1948J3301J3620J3490J4981J7810J9967
58884H93248K1249K2721K3697K2581J9925J7452J4959J1268P145L998R28l502
58872A055669p886r952j0768j3076j6404j7795j6667j5053j3626j1376q866q017
58860I06183q729r176r157r888j0982j1020j0594j1338j2565j2318j1149j1142
58848G78125j1839j0993q906q052q588q175o300n085n512o321o860p749q662q550
58834F66533q017q362q666p020m198k745k862k654j963k195k788j762L66J085
58820F14752K69K30J461K099J775K167L455L942L489L778M832M824L535K650K393
58805F55651J416mj53N52j03k056k881k035j597k428l155l334m061n146n076m158
$$ plain form
58789 621432 617160 611822 606451 602313 599119 596720 596565 599378 603260 606292 609353 614234 620705 627608
58775 627608 635190 644031 653082 660811 666885 670942 671426 667693 661614 655197 648307 640529 633181 627223
58761 627223 621168 613435 605049 597834 591793 586516 583091 582108 581658 579940 578151 578313 580006 581741 583698
58746 583698 586445 588819 589905 591470 595581 601351 606745 612015 618534 625861 632806 639934 648127 656132
58732 656132 662418 668028 674761 681996 688169 693849 700253 706222 709952 712489 716232 720977 724579 726689
58718 726689 728837 731620 734646 738454 743829 750024 756095 762868 771161 779404 785600 790125 793965 795901
58704 795901 794480 791099 787827 783555 775638 764020 750415 734776 716152 695918 676591 658311
58692 658311 639852 622102 607092 594506 582651 571985 564159 558419 552512 546446 541832 538171 533361
$$ packed form
58789F21432m272n338n371m138l194k399j55K813L882L032L061M881O471O903
58775F27608P582Q841R051P729O074M057M84l733o079o417o890p778p348n958
58761F27223o055p733q386p215o041n277l425r83m50j718j789J62J693J735J957
58746E83698K747K374J086J565M111N770N394N270O519P327O945P128Q193Q005
58732F56132O286N610O733P235O173N680O404N969L730K537L743M745L602K110
58718G26689K148K783L026L808N375O195O071O773Q293Q243O196M525L840J936
58704G95901j421l381l272m272p917j1618j3605j5639j8624k0234j9327j8280
58692F58311j8459j7750j5010j2586j1855j0666p826n740n907o066m614l661m810
$$ plain form
58679 533361 527331 521777 516913 511882 507613 505704 505119 503548 501486 501272 502743 503655 504107 506704 512414
58664 512414 519887 528813 540387 554363 568891 583142 596843 607528 611889 609977 604981 599040 592349
58651 592349 585793 580724 576223 570099 562640 556151 551056 545859 540616 536854 534250 531064 527716 526249
58637 526249 526303 525418 523430 522835 524554 527031 529701 533572 537981 540522 540850 541135 542154 542279 540820 539200
58621 539200 538291 537698 538013 540627 545012 549197 553077 558229 564553 570414 576016 583170 591714 599582 606369
58606 606369 613224 619323 622345 622701 623463 625695 627510 628008 628303 628318 626485 623231 620951 619866 617589 613507
58590 613507 609886 607913 606263 604421 603986 605839 609265 614462 622614 632966 643124 652604 662788 673262
58576 673262 681822 688332 694847 701751 707621 713018 720297 729360 737867 746066 756975 771145 785835
$$ packed form
58679E33361o030n554m864n031m269j909n85j571k062k14J471R12M52K597N710
58664E12414P473Q926J1574J3976J4528J4251J3701J0685M361j912m996n941o691
58651E92349o556n069m501o124p459o489n095n197n243l762k604l186l348j467
58637E26249N4q85j988n95J719K477K670L871M409K541L28K85J019J25j459j620
58621E39200r09n93L15K614M385M185L880N152O324N861N602P154Q544P868O787
58606F06369O855O099L022L56P62K232J815M98K95J5j833l254k280j085k277m082
58590F13507l621j973j650j842m35J853L426N197Q152J0352J0158R480J0184J0474
58576F73262Q560O510O515O904N870N397P279R063Q507Q199J0909J4170J4690
$$ plain form
58563 785835 800384 817939 840537 866621 894691 925312 958094 990463 1020742 1048831 1072888
58552 1072888 1089278 1097023 1098749 1096405 1089879 1080515 1071623 1064333 1056911 1049159 1043289 1039392 1034352 1026429
58538 1026429 1016685 1004779 987945 965676 941121 916317 890283 863240 838246 816903 797624
58527 797624 779791 765399 754951 746036 737701 732000 729505 727598 725001 723620 724013 723429 720420 717180
58513 717180 715228 712840 708826 704773 701565 697724 693126 690291 690031 689848 688434 687589 687987 687483 685473
58498 685473 684374 684820 683978 680754 677999 677355 676653 674778 674311 676694 679399 680659 682529 686577 691053
58483 691053 695113 701419 711626 723518 735416 749252 766587 785816 805864 828180 852364 874267
58471 874267 891221 904754 915620 920960 919219 913052 904401 891639 874744 858279 845678 835229
$$ packed form
58563G85835J4549J7555K2598K6084K8070L0621L2782L2369L0279K8089K4057
58552A072888J6390P745J726k344o526r364q892p290p422p752n870l897n040p923
58538A026429r744j1906j6834k2269k4555k4804k6034k7043k4994k1343j9279
58527G97624j7833j4392j0448q915q335n701k495j907k597j381L93n84l009l240
58513G17180j952k388m014m053l208l841m598k835k60j83j414q45L98n04k010
58498F85473j099M46q42l224k755o44p02j875m67K383K705J260J870M048M476
58483F91053M060O306J0207J1892J1898J3836J7335J9229K0048K2316K4184K1903
58471H74267J6954J3533J0866N340j741o167q651j2762j6895j6465j2601j0449
$$ plain form
58459 835229 825128 817662 814808 814542 815360 819842 829833 842517 855149 869177 885771 901737 913893
58446 913893 923201 930552 932843 927544 917157 905137 891325 875262 859831 847525 836950 826784
58434 826784 819194 815700 813887 811931 812009 815556 819740 822541 826679 834516 843770 852401 862842 876942
58420 876942 891409 902796 912374 921597 927540 927635 924340 920343 913816 903212 892021 883604 875793 865629
58406 865629 854965 846353 838004 828010 819042 813632 809267 803361 798498 797473 797842 796881 797201 801692 807485
58391 807485 810768 813208 817799 822725 825140 826693 829568 831501 830500 829909 832908 836683 838102 840313
58377 840313 847295 856599 864031 870930 880119 889256 895143 900324 908494 917531 923858 929555 938312 948555
58363 948555 957351 966856 980026 994247 1006138 1018382 1034763 1052718 1067721 1080610 1093748 1104616
$$ packed form
58459H35229j0101p466k854k66Q18M482R991J2684J2632J4028J6594J5966J2156
58446I13893R308P351K291n299j0387j2020j3812j6063j5431j2306j0575j0166
58434H26784p590l494j813j956P8L547M184K801M138P837R254Q631J0441J4100
58420H76942J4467J1387R578R223N943R5l295l997o527j0604j1191q417p811j0164
58406H65629j0664q612q349r994q968n410m365n906m863j025L69r61L20M491N793
58391H07485L283K440M591M926K415J553K875J933j001n91K999L775J419K211
58377H40313O982R304P432O899R189R137N887N181Q170R037O327N697Q757J0243
58363I48555Q796R505J3170J4221J1891J2244J6381J7955J5003J2889J3138J0868
$$ plain form
58351 1104616 1110341 1113795 1118139 1120458 1118089 1115676 1118057 1121712 1121644 1121201 1126152 1134371 1140686 1146924 1157567
58336 1157567 1170238 1180266 1190274 1205460 1223529 1239093 1253922 1273012 1294460 1313091 1330145
58325 1330145 1349500 1368195 1380724 1388934 1397866 1405806 1408480 1408911 1412829 1418312 1420327 1421284 1426540 1433790
58311 1433790 1437802 1441384 1450443 1462457 1471267 1479106 1492179 1508550 1522365 1535927 1555259 1577648
58299 1577648 1596062 1612084 1631831 1653016 1669049 1682238 1699671 1719613 1735370 1749036 1767821
58288 1767821 1790198 1809393 1827098 1849763 1874998 1895991 1915830 1942791 1974965 2004464 2033116
58277 2033116 2068504 2107966 2142541 2173601 2209501 2249044 2284720 2319085 2360986 2408602 2453299
58266 2453299 2497132 2548981 2606612 2660758 2713771 2775483 2843654 2907802 2969374 3038240 3112100
$$ packed form
58351A104616N725L454M344K319k369k413K381L655o8m43M951Q219O315O238J0643
58336A157567J2671J0028J0008J5186J8069J5564J4829J9090K1448J8631J7054
58325A330145J9355J8695J2529Q210Q932P940K674M31L918N483K015R57N256P250
58311A433790M012L582R059J2014Q810P839J3073J6371J3815J3562J9332K2389
58299A577648J8414J6022J9747K1185J6033J3189J7433J9942J5757J3666J8785
58288A767821K2377J9195J7705K2665K5235K0993J9839K6961L2174K9499K8652
58277B033116L5388L9462L4575L1060L5900L9543L5676L4365M1901M7616M4697
58266B453299M3833N1849N7631N4146N3013O1712O8171O4148O1572O8866P3860
$$ plain form
58255 3112100 3180046 3243982 3315368 3393123 3466436 3537175 3617074 3704752 3788656 3871052 3965353
58244 3965353 4071101 4175853 4280479 4397492 4525462 4651093 4775888 4914328 5066346
58235 5066346 5219048 5374988 5550158 5744176 5941929 6144645 6368900 6614898 6867591
58226 6867591 7129438 7418866 7735838 8063602 8405258 8782277 9195929 9628531 10084282
58217 10084282 10588490 11144641 11734986 12366071 13068467 13848448 14688240 15598394 16619393
58208 16619393 17767323 19032914 20440053 22046993 23884095 25955039 28308260 31039224
58200 31039224 34215758 37882111 42154177 47234168 53328625 60659636 69585469 80613591
58192 80613591 94290813 111228921 132281803 158540826 191062550 230596320 277174582
$$ packed form
58255C112100O7946O3936P1386P7755P3313P0739P9899Q7678Q3904Q2396R4301
58244C965353J05748J04752J04626J17013J27970J25631J24795J38440J52018
58235E066346J52702J55940J75170J94018J97753K02716K24255K45998K52693
58226F867591K61847K89428L16972L27764L41656L77019M13652M32602M55751
58217A0084282N04208N56151N90345O31085P02396P79981Q39792R10154J020999
58208A6619393J147930J265591J407139J606940J837102K070944K353221K730964
58200C1039224L176534L666353M272066N079991O094457P331011Q925833J1028122
58192H0613591J3677222J6938108K1052882K6259023L2521724L9533770M6578262
$$ plain form
58185 277174582 328991634 380939177 424671630 451526704 456761498 441734598 412403502
58178 412403502 375815133 337379852 300089287 265055356 232451821 202339450 175031246
58171 175031246 150900627 130029242 112173321 96998128 84199036 73439696 64350999
58164 64350999 56639268 50108689 44569369 39813325 35691766 32131766 29058979 26372195
58156 26372195 24003477 21932821 20126131 18517441 17065278 15769721 14618928 13570210
58148 13570210 12597851 11711380 10912208 10176148 9491780 8873803 8324557 7820729 7350620
58139 7350620 6927989 6556973 6218028 5900004 5612661 5355944 5108990 4861570 4626776
58130 4626776 4411626 4203873 3998529 3809275 3642277 3484858 3330723 3191134 3070720
$$ packed form
58185B77174582N1817052N1947543M3732453K6855074N234794j5026900k9331096
58178D12403502l6588369l8435281l7290565l5033931l2603535l0112371k7308204
58171A75031246k4130619k0871385j7855921j5175193j2799092j0759340r088697
58164F4350999p711731o530579n539320m756044m121559l560000l072787k686784
58156B6372195k368718k070656j806690j608690j452163j295557j150793j048718
58148A3570210r72359q86471p99172p36060o84368o17977n49246n03828m70109
58139G350620m22631l71016l38945l18024k87343k56717k46954k47420k34794
58130D626776k15150k07753k05344j89254j66998j57419j54135j39589j20414
$$ plain form
58121 3070720 2956745 2842784 2739597 2652262 2569075 2483307 2404309 2336992 2271053 2200426 2133579
58110 2133579 2075055 2016012 1952353 1893465 1843872 1794323 1739935 1689473 1647810 1606491 1560435
58099 1560435 1517240 1481239 1444692 1403452 1365509 1335394 1305469 1271116 1239572 1215366 1191727
58088 1191727 1164701 1141428 1126018 1111141 1091863 1074196 1061778 1047423 1026253 1004382 986448
58077 986448 967048 942614 919441 901760 883695 861048 839507 823318 807171 787135 768558
58066 768558 755357 742364 725957 711620 703310 695798 685159 676447 673280 669936 661553 652353 646090
58053 646090 638112 624770 611301 602432 594118 582387 571548 565793 561112 553394 546446 544310 543331
58040 543331 539327 535136 533880 532152 526891 521734 519765 517206 510976 505023 502404 498452 488779 476919
$$ packed form
58121C070720j13975j13961j03187q7335q3187q5768p8998o7317o5939p0627o6847
58110B133579n8524n9043o3659n8888m9593m9549n4388n0462m1663m1319m6056
58099A560435m3195l6001l6547m1240l7943l0115k9925l4353l1544k4206k3639
58088A191727k7026k3273j5410j4877j9278j7667j2418j4355k1170k1871j7934
58077I86448j9400k4434k3173j7681j8065k2647k1541j6189j6147k0036j8577
58066G68558j3201j2993j6407j4337q310p512j0639q712l167l344q383r200o263
58053F46090p978j3342j3469q869q314j1731j0839n755m681p718o948k136r79
58040E43331m004m191j256j728n261n157j969k559o230n953k619l952r673j1860
$$ plain form
58026 476919 467220 457266 444274 431958 423941 416987 407767 399768 396519 394413 389287 383957 382210 381306
58012 381306 377456 372945 370998 369104 364240 359263 357536 356500 353081 350078 350744 352304 351320 350266 352268
57997 352268 354539 353641 352352 354667 358675 360845 362802 367322 372001 373321 372967 374045 375075 373574 371410
57982 371410 370821 369278 364033 357602 353137 348748 342028 335767 333217 332024 328793 325486 325295 326250 324978
57967 324978 322924 322937 323600 322746 322575 325296 327686 326191 323649 324648 327834 329115 329014 330332 331630 329544
57951 329544 325055 321449 318520 314460 310809 309895 309948 308234 306361 307180 309250 309804 310344 313812 319037 323508
57935 323508 328821 337783 348836 358920 369131 381846 394898 404345 410563 416015 419601 418970 415936
57922 415936 413632 410574 403492 393908 385935 379501 371700 363088 356586 351603 345099 337364 331286 327037
$$ packed form
58026D76919r699r954j2992j2316q017o954r220p999l249k106n126n330j747r04
58012C81306l850m511j947j894m864m977j727j036l419l003O66J560r84j054K002
57997C52268K271q98j289K315M008K170J957M520M679J320l54J078J030j501k164
57982C71410n89j543n245o431m465m389o720o261k550j193l231l307j91R55j272
57967C24978k054J3O63q54j71K721K390j495k542R99L186J281j01J318J298k086
57951C29544m489l606k929m060l651r14N3j714j873Q19K070N54N40L468N225M471
57935C23508N313Q962J1053J0084J0211J2715J3052R447O218N452L586o31l034
57922D15936k304l058p082r584p973o434p801q612o502m983o504p735o078m249
$$ plain form
57908 327037 322756 319320 319188 321617 323860 325913 329385 333172 335040 335907 337812 339424 338519 337029 338353
57893 338353 341346 342382 341859 343150 346338 348475 349061 349986 350962 350163 348580 348696 349663 348630 345915 344019
57877 344019 342570 339263 334779 331623 328942 323684 316297 310251 306428 302899 299674 298647 299216 298794 297408
57862 297408 297203 297902 297423 296451 297681 300923 303689 306199 311067 318310 325379 331865 339510 347766 354067
57847 354067 358452 363382 368963 372753 374243 375135 375294 372798 368004 363281 358887 353255 347027 342352 338493
57832 338493 332698 325311 319450 315744 312028 308210 306569 306937 306346 304032 302381 302374 302392 302005 302676 304214
57816 304214 304713 304473 305808 308615 310378 310879 312446 314923 314882 310665 304034 296147 286201 274965 265376
57801 265376 258404 252180 246154 242209 240696 239343 237217 236020 236400 236725 236577 237726 240463 242631 243515
$$ packed form
57908C27037m281l436j32K429K243K053L472L787J868Q67J905J612r05j490J324
57893C38353K993J036n23J291L188K137N86R25R76p99j583J16R67j033k715j896
57877C44019j449l307m484l156k681n258p387o046l823l529l225j027N69m22j386
57862B97408k05O99m79r72J230L242K766K510M868P243P069O486P645Q256O301
57847C54067M385M930N581L790J490Q92J59k496m794m723m394n632o228m675l859
57832C38493n795p387n861l706l716l818j641L68n91k314j651pJ8l87O71J538
57816C04214M99k40J335K807J763N01J567K477m1m217o631p887r946j1236r589
57801B65376o972o224o026l945j513j353k126j197L80L25j48J149K737K168Q84
$$ plain form
57786 243515 245209 248833 252711 255496 257970 260727 263183 265850 270519 277286 284356 291327 299487 308386
57772 308386 315612 320660 325593 331134 335551 338090 339900 340788 338742 333687 328197 323351 317370 309414
57758 309414 301294 294261 287481 280828 275812 272585 269285 265509 263173 262878 262796 262287 263155 266084 269168
57743 269168 271336 273902 277410 280191 281462 282621 284081 284084 282157 280539 280664 281327 281832 283731 287742 291969
57727 291969 294930 297526 300467 302655 303740 305373 308324 311094 312969 315618 319955 324115 326272 326994
57713 326994 327305 326972 326082 325639 325189 322537 317213 311488 306672 301384 294903 289077 285110 281483 277067
57698 277067 273456 272088 271679 270622 269538 269311 268886 267059 264418 261712 258301 253887 249700 246438 243146
57683 243146 239503 236912 235990 235468 235076 236829 241765 248053 254343 262544 275250 292679 314280 341347
$$ packed form
57786B43515J694L624L878K785K474K757K456K667M669O767P070O971Q160Q899
57772C08386P226N048M933N541M417K539J810Q88k046n055n490m846n981p956
57758C09414q120p033o780o653n016l227l300l776k336k95q2n09Q68K929L084
57743B69168K168K566L508K781J271J159J460Lj927j618J25O63N05J899M011M227
57727B91969K961K596K941K188J085J633K951K770J875K649M337M160K157P22
57713C26994L11l33q90m43m50k652n324n725m816n288o481n826l967l627m416
57698B77067l611j368m09j057j084k27m25j827k641k706l411m414m187l262l292
57683B43146l643k591r22n22l92J753M936O288O290Q201J2706J7429K1601K7067
$$ plain form
57669 341347 376059 419743 473974 541441 623248 715594 809197 890362 943430 956969 930825
57658 930825 875804 805342 729139 654161 586515 529141 480470 438259 402817 374745 352201
57647 352201 332866 316409 302926 291196 280572 272301 266898 262391 257228 252573 249724 247679 245463
57634 245463 244373 245428 246886 246825 246113 246307 246672 245867 244656 244363 244300 243193 241585 240543 239587 238072 236934
57617 236934 236903 236678 235004 232825 231364 229985 228012 226597 226487 225994 223635 220813 219434 218853 217767 217077
57601 217077 218016 219281 219018 218118 218599 220109 220916 221026 221433 221517 220069 217868 216489 215465 213336 210563
57585 210563 208786 207940 206691 204995 203883 203383 202883 202760 203525 204238 203815 202975 202831 202665 201144 198651 196330
57568 196330 194027 191322 189248 188615 187916 185356 181816 179391 178206 177192 176780 178021 179922 180489 179795
$$ packed form
57669C41347L4712M3684N4231O7467Q1807R2346R3603Q1165N3068J3539k6144
57658I30825n5021p0462p6203p4978o7646n7374m8671m2211l5442k8072k2544
57647C52201j9335j6457j3483j1730j0624q271n403m507n163m655k849k045k216
57634B45463j090J055J458o1p12J94L65q05j211k93o3j107j608j042r56j515j138
57617B36934l1k25j674k179j461j379j973j415j10m93k359k822j379n81j086o90
57601B17077R39J265k63r00M81J510Q07J10M07Q4j448k201j379j024k129k773
57585B10563j777q46j249j696j112n00n00j23P65P13m23q40j44j66j521k493k321
57568A96330k303k705k074o33o99k560l540k425j185j014m12J241J901N67o94
$$ plain form
57553 179795 179465 179830 180068 180487 182100 184472 186371 188019 190366 192711 193413 192445 191125 189886 188507 187820
57537 187820 188889 191065 192947 194625 196897 199217 200706 202292 205336 208884 210852 211345 212326 214485 216873
57522 216873 219128 221642 223955 225407 226981 230185 234487 238144 241104 244720 249024 252708 255557 258562
57508 258562 261833 264602 267012 269731 272119 272905 272305 271415 270046 267445 264573 263253 263310 262965 261731 260649
57492 260649 259907 258622 256833 255472 254518 253259 252022 251567 251218 249863 248290 248107 248743 248091 245877 243925
57476 243925 243272 243468 244502 246771 249134 249523 247712 245322 243213 241058 239264 238807 239269 239464 239913 242171
57460 242171 245814 248735 250493 252714 256037 259306 262070 265236 268791 271387 272760 274252 276423 278369
57446 278369 279815 281704 284311 286864 289281 292188 295127 297012 298463 301261 305263 308407 310072 311862
$$ packed form
57553A79795l30L65K38M19J613K372J899J648K347K345P02r68j320j239j379o87
57537A87820J069K176J882J678K272K320J489J586L044L548J968M93R81K159K388
57522B16873K255K514K313J452J574L204M302L657K960L616M304L684K849L005
57508B58562L271K769K410K719K388P86o00q90j369k601k872j320N7l45j234j082
57492B60649p42j285j789j361r54j259j237m55l49j355j573j83O36o52k214j952
57476B43925o53J96J034K269K363L89j811k390k109k155j794m57M62J95M49K258
57460B42171L643K921J758K221L323L269K764L166L555K596J373J492K171J946
57446B78369J446J889K607K553K417K907K939J885J451K798M002L144J665J790
$$ plain form
57432 311862 314648 317418 319700 322478 325944 328787 330627 332882 336331 339895 342699 345254 347881 349962
57418 349962 351514 353532 356100 358114 359408 361062 363124 364301 364595 365880 369007 372536 375318 378148
57404 378148 381781 385290 387601 388986 390097 391133 392651 395472 399101 402006 404045 406692 410350 413583
57390 413583 415800 418511 422933 428307 433659 439336 445814 452745 460090 468440 477354 485165 491264 496806
57376 496806 502422 507176 510626 513847 517460 520582 522745 524897 527497 529598 530907 532803 536140 539971
57362 539971 543590 547890 553393 558811 563039 566929 571638 576812 581752 586868 592599 598307 603510 608923
57348 608923 615159 621763 628539 636348 645480 654693 662927 670499 677648 683577 688163 692989 699408 706956
57334 706956 714785 723116 732021 740391 747489 754174 761248 767969 773493 778466 783864 789499 794951 800776
$$ packed form
57432C11862K786K770K282K778L466K843J840K255L449L564K804K555K627K081
57418C49962J552K018K568K014J294J654K062J177K94J285L127L529K782K830
57404C78148L633L509K311J385J111J036J518K821L629K905K039K647L658L233
57390D13583K217K711M422N374N352N677O478O931P345Q350Q914P811O099N542
57376D96806N616M754L450L221L613L122K163K152K600K101J309J896L337L831
57362E39971L619M300N503N418M228L890M709N174M940N116N731N708N203N413
57348F08923O236O604O776P809R132R213Q234P572P149N929M586M826O419P548
57334G06956P829Q331Q905Q370P098O685P074O721N524M973N398N635N452N825
$$ plain form
57320 800776 807583 815014 822715 831081 840042 848422 855618 862640 870461 878687 886850 895511 904926 914032
57306 914032 922027 929699 938063 946970 956025 965451 974989 983498 990818 998519 1007673 1017397 1026787 1036537
57292 1036537 1047302 1058188 1068488 1079377 1092158 1106142 1119929 1133559 1147801 1162439 1176843
57281 1176843 1191200 1205772 1220015 1233758 1248070 1263630 1279439 1294539 1309649 1325618 1341554
57270 1341554 1356097 1369427 1382543 1395688 1408879 1422773 1437446 1451531 1464080 1476153 1489043
57259 1489043 1502214 1514595 1526610 1539173 1551896 1564111 1576582 1590276 1604387 1617447 1629634
57248 1629634 1642212 1655488 1668970 1682753 1697041 1711061 1724094 1736881 1750542 1764876 1779160
57237 1779160 1793678 1808932 1824374 1839499 1855157 1872089 1889210 1905209 1920813 1937517 1954994
$$ packed form
57320H00776O807P431P701Q366Q961Q380P196P022P821Q226Q163Q661R415R106
57306I14032P995P672Q364Q907R055R426R538Q509P320P701R154R724R390R750
57292A036537J0765J0886J0300J0889J2781J3984J3787J3630J4242J4638J4404
57281A176843J4357J4572J4243J3743J4312J5560J5809J5100J5110J5969J5936
57270A341554J4543J3330J3116J3145J3191J3894J4673J4085J2549J2073J2890
57259A489043J3171J2381J2015J2563J2723J2215J2471J3694J4111J3060J2187
57248A629634J2578J3276J3482J3783J4288J4020J3033J2787J3661J4334J4284
57237A779160J4518J5254J5442J5125J5658J6932J7121J5999J5604J6704J7477
$$ plain form
57226 1954994 1971828 1988029 2004610 2021285 2036799 2051273 2066131 2081849 2097686 2113534 2130241
57215 2130241 2147988 2165904 2183348 2200353 2216970 2233381 2250301 2268018 2285450 2301454 2316650
57204 2316650 2332608 2349666 2366890 2383750 2400490 2417157 2433546 2449825 2466152 2482064 2497152
57193 2497152 2511756 2526073 2539480 2551733 2563809 2576324 2588300 2598935 2609476 2621592 2634906
57182 2634906 2647818 2659879 2671531 2682419 2692043 2701479 2712456 2725109 2738365 2752013 2766571 2781595
57170 2781595 2796059 2810121 2824748 2839810 2854167 2867303 2879384 2890213 2899829 2909632 2921040 2933383
57158 2933383 2944858 2955265 2966051 2977894 2990015 3001744 3013079 3023843 3033756 3043193 3052429 3060501
57146 3060501 3066242 3070009 3072929 3075018 3075806 3076297 3078429 3082830 3088816 3096294 3105897 3117415 3129833 3142787
$$ packed form
57226A954994J6834J6201J6581J6675J5514J4474J4858J5718J5837J5848J6707
57215B130241J7747J7916J7444J7005J6617J6411J6920J7717J7432J6004J5196
57204B316650J5958J7058J7224J6860J6740J6667J6389J6279J6327J5912J5088
57193B497152J4604J4317J3407J2253J2076J2515J1976J0635J0541J2116J3314
57182B634906J2912J2061J1652J0888R624R436J0977J2653J3256J3648J4558J5024
57170B781595J4464J4062J4627J5062J4357J3136J2081J0829R616R803J1408J2343
57158B933383J1475J0407J0786J1843J2121J1729J1335J0764R913R437R236Q072
57146C060501N741L767K920K089P88M91K132M401N986P478R603J1518J2418J2954
$$ plain form
57132 3142787 3156360 3169676 3181313 3190951 3199118 3205642 3209943 3212523 3214570 3216380 3217688 3219143 3221860
57119 3221860 3226088 3232015 3241303 3255905 3275794 3299776 3328115 3362395 3403212 3450210 3504346 3568280
57107 3568280 3644722 3736273 3846719 3980658 4142031 4334687 4564118 4837174 5161136 5545728
57097 5545728 6006187 6562988 7239568 8062469 9062524 10272422 11722014 13436164 15433965
57088 15433965 17724927 20304247 23152322 26236289 29508582 32906123 36355164 39772690
57080 39772690 43051634 46040732 48550022 50394089 51446245 51666904 51096367 49828302
57072 49828302 47981502 45678187 43032560 40149633 37127989 34059611 31026732 28099223
57064 28099223 25332706 22766147 20420857 18303251 16409419 14728424 13244513 11939588
$$ packed form
57132C142787J3573J3316J1637R638Q167O524M301K580K047J810J308J455K717
57119C221860M228N927R288J4602J9889K3982K8339L4280M0817M6998N4136O3934
57107C568280P6442R1551J10446J33939J61373J92656K29431K73056L23962L84592
57097E545728M60459N56801O76580Q22901J000055J209898J449592J714150J997801
57088A5433965K290962K579320K848075L083967L272293L397541L449041L417526
57080C9772690L278944K989098K509290J844067J052156K20659n70537j268065
57072D9828302j846800k303315k645627k882927l021644l068378l032879k927509
57064B8099223k766517k566559k345290k117606j893832j680995j483911j304925
$$ plain form
57056 11939588 10794979 9791705 8910960 8135839 7452338 6848357 6312722 5835697 5409393
57047 5409393 5026908 4681770 4368628 4083466 3822648 3582581 3360586 3155099 2964686
57038 2964686 2787779 2623474 2471323 2330146 2198251 2075088 1961474 1858071 1764959 1682876
57028 1682876 1613379 1557458 1515297 1487839 1477442 1486456 1514944 1557811 1601983 1628069 1619450 1572121
57016 1572121 1495042 1401527 1302291 1205232 1116435 1038503 970281 910246 858603 815024 776876
57005 776876 741632 709343 681061 656462 634555 615154 597941 581444 564566 548033 532978
56994 532978 519169 505850 493206 481810 471636 462718 455766 451248 448965 449371 454029 463785 477445
56981 477445 492736 507188 517639 520858 515974 505023 490383 473170 454706 437392 422690 409862
$$ packed form
57056A1939588j144609j003274q80745p75121o83501o03981n35635m77025m26304
57047E409393l82485l45138l13142k85162k60818k40067k21995k05487j90413
57038B964686j76907j64305j52151j41177j31895j23163j13614j03403r3112q2083
57028A682876o9497n5921m2161k7458j0397R014K8488M2867M4172K6086q619m7329
57016A572121p7079r3515r9236r7059q8797p7932o8222o0035n1643m3579l8148
57005G76876l5244l2289k8282k4599k1907j9401j7213j6497j6878j6533j5055
56994E32978j3809j3319j2644j1396j0174q918o952m518k283M06M658R756J3660
56981D77445J5291J4452J0451L219m884j0951j4640j7213j8464j7314j4702j2828
$$ plain form
56969 409862 397962 387564 379414 373058 368182 365775 366606 369961 375160 382939 394178 408843 427312
56956 427312 450790 478536 505970 527160 538327 538205 527056 507210 483008 458124 433651 409925
56944 409925 388659 371581 358360 347743 339668 334634 332104 331425 333491 339872 351046 366920 388215
56931 388215 415827 449304 486729 524739 557499 577505 579828 565437 539447 507157 472741 439809
56919 439809 410673 385369 362888 342939 325613 310486 297407 287095 279576 273152 266365 259928
56907 259928 255253 252116 249298 246547 244361 242673 241162 240054 239453 238925 238838 240771 245288 250723 255605
56892 255605 260821 267824 276417 286258 299069 317045 340060 366354 394667 423343 448292 464519
56880 464519 469689 464761 451981 434077 414522 396263 380180 366033 354226 345348 339171 335832
$$ packed form
56969D09862j1900j0398q150o356m876k407Q31L355N199P779J1239J4665J8469
56956D27312K3478K7746K7434K1190J1167j22j1149j9846k4202k4884k4473k3726
56944D09925k1266j7078j3221j0617q075n034k530o79K066O381J1174J5874K1295
56931C88215K7612L3477L7425L8010L2760K0006K323j4391k5990l2290l4416l2932
56919D39809k9136k5304k2481j9949j7326j5127j3079j0312p519o424o787o437
56907B59928m675l137k818k751k186j688j511j108o01n28q7J933M517N435M882
56892B55605N216P003Q593R841J2811J7976K3015K6294K8313K8676K4949J6227
56880D64519N170m928j2780j7904j9555j8259j6083j4147j1807q878o177l339
$$ plain form
56868 335832 336929 343601 354566 368084 385028 408084 438872 477899 526358 585302 652754 722835
56856 722835 787057 835654 859987 856964 831179 791035 743344 692728 643893 601080 565739 537368
56844 537368 516185 502864 496607 496269 502931 518917 544827 580186 626549 687287 764535 858463
56832 858463 967947 1087468 1202651 1292842 1341078 1341739 1300072 1227545 1137845 1043316 952028
56821 952028 868025 793955 731832 681533 641063 609157 586155 572275 566967 570402 583805 607907
56809 607907 642794 689611 750533 825753 910544 994602 1063503 1102828 1104648 1071567 1013734 942083
56797 942083 864939 788781 718380 655603 600429 553598 516482 488590 467563 451917 441774
56786 441774 436977 436873 442209 455038 476350 505703 542900 587126 633561 673283 697868 703211
$$ packed form
56868C35832J097O672J0965J3518J6944K3056L0788L9027M8459N8944O7452P0081
56856G22835O4222M8597K4333l023k5785m0144m7691n0616m8835m2813l5341k8371
56844E37368k1183j3321o257l38O662J5986K5910L5359M6363O0738P7248R3928
56832H58463J09484J19521J15183R0191M8236O61m1667p2527q9700r4529r1288
56821I52028q4003p4070o2123n0299m0470l1906k3002j3880n308L435J3403K4102
56809F07907L4887M6817O0922P5220Q4791Q4058O8901L9325J820l3081n7833p1651
56797I42083p7144p6158p0401o2777n5174m6831l7116k7892k1027j5646j0143
56786D41774m797j04N336J2829K1312K9353L7197M4226M6435L9722K4585N343
$$ plain form
56774 703211 689300 658917 617245 570414 522916 477149 435116 398545 367262 339612 314994
56763 314994 294146 276870 261690 248079 236763 227451 218589 209936 203110 198740 195197 190937 186128
56750 186128 181294 176392 172020 169497 168846 168482 167620 167074 167063 166338 164472 163004 163214 164414 165416 166056
56734 166056 166358 165798 164374 163025 162275 161757 161518 162231 163669 164647 164910 165349 166080 166222 165977 166823 169046
56717 169046 171143 172258 173077 173723 173115 171295 170094 170393 170843 170404 169988 170352 170486 169516 168368 168127 168443
56700 168443 168816 169738 171259 172076 171367 170085 169232 168416 167241 166487 166612 166528 165184 163142 161510 160596 160528
56683 160528 161781 164068 166111 167390 168779 170698 172253 173029 174069 176096 178298 179842 181066 182328
56669 182328 183206 183656 184388 185352 185533 184887 184703 185367 185752 185472 185600 186281 185963 184054 182108 181225 180518 179405
$$ packed form
56774G03211j3911l0383m1672m6831m7498m5767m2033l6571l1283k7650k4618
56763C14994k0848j7276j5180j3611j1316r312q862q653o826m370l543m260m809
56750A86128m834m902m372k523o51l64q62n46j1p25j866j468K10J200J002O40
56734A66056L02n60j424j349p50n18k39P13J438R78K63M39P31J42k45Q46K223
56717A69046K097J115Q19O46o08j820j201K99M50m39m16L64J34r70j148k41L16
56700A68443L73R22J521Q17p09j282q53q16j175p54J25q4j344k042j632r14o8
56683A60528J253K287K043J279J389J919J555P76J040K027K202J544J224J262
56669A82328Q78M50P32R64J81o46j84O64L85k80J28O81l18j909j946q83p07j113
$$ plain form
56651 179405 178986 179710 179998 178836 177547 177259 176870 175357 173972 174062 174609 174052 172872 172267 171814 170545 169017
56634 169017 168395 168725 169734 171923 175158 177680 178266 177998 178321 178866 178825 178835 179636 180439 180465 180661 181980 183474
56616 183474 183950 184120 185182 186633 187378 187656 188038 187900 186812 186034 186670 187706 187780 187479 187862 188132 186976
56599 186976 184996 183645 182849 181740 180658 180352 180287 179755 179635 181032 183194 184741 185906 187555 189111 189474
56583 189474 189066 188936 188787 187836 186699 186470 186828 186902 187029 187859 188821 189355 190506 193297 196586 198616 199726
56566 199726 201539 204471 208000 212421 218343 225358 233097 242661 255158 269824 285138 300379 314252
56553 314252 323689 326491 324008 319113 312907 305635 299070 294982 292265 288464 283379 278618 274483 270033
56539 270033 265528 262097 259481 256595 253825 252401 251942 250906 248953 246745 244164 240926 238200 237284 237416
$$ packed form
56651A79405m19P24K88j162j289k88l89j513j385R0N47n57j180o05m53j269j528
56634A69017o22L30J009K189L235K522N86k68L23N45m1J0Q01Q03K6J96J319J494
56616A83474M76J70J062J451P45K78L82j38j088p78O36J036P4l01L83K70j156
56599A86976j980j351p96j109j082l06o5n32j20J397K162J547J165J649J556L63
56583A89474m08j30j49r51j137k29L58P4J27Q30R62N34J151K791L289K030J110
56566A99726J813K932L529M421N922P015P739R564J2497J4666J5314J5241J3873
56553C14252R437K802k483m895o206p272o565m088k717l801n085m761m135m450
56539B70033m505l431k616k886k770j424m59j036j953k208k581l238k726r16J32
$$ plain form
56524 237416 237066 236453 236517 236449 234847 232386 230760 229767 228087 226041 224816 223758 221364 218377 216949 217224
56508 217224 217547 217589 218411 219806 220418 220298 220635 221240 220902 219892 219441 219198 217927 216237 215712 215735 214266 211508
56490 211508 209702 209312 208526 206648 204994 204112 202988 201357 200183 199555 198675 198048 199055 201169 202232 201729
56474 201729 201251 201548 201745 201671 202338 203750 204715 205147 206249 208203 209952 211328 213001 214375 214026 212317
56458 212317 211099 210796 210239 209328 209255 210032 210362 210024 209942 210007 209378 208802 209937 212518 214848 216819 219532 222249
56440 222249 222921 221691 220702 220382 219188 217080 215874 215809 215164 213672 212975 213184 212388 210336 209258 210196 211582
56423 211582 212329 213263 214648 215232 214626 213809 212683 210070 206676 204911 205117 205181 204528 205098 207465 209484 209945
56406 209945 210288 211430 212121 211824 212152 213996 216057 217537 219425 221902 223395 223508 224018 225692 226979 227139
$$ packed form
56524B37416l50o13O4o8j602k461j626r93j680k046j225j058k394k987j428K75
56508B17224L23M2Q22J395O12j20L37O05l38j010m51k43j271j690n25K3j469k758
56490B11508j806l90p86j878j654q82j124j631j174o28q80o27J007K114J063n03
56474B01729m78K97J97p4O67J412R65M32J102J954J749J376J673J374l49j709
56458B12317j218l03n57r11p3P77L30l38q2O5o29n76J135K581K330J971K713K717
56440B22249O72j230r89l20j194k108j206o5o45j492o97K09p96k052j078R38J386
56423B11582P47R34J385N84o06q17j126k613l394j765K06O4o53N70K367K019M61
56406B09945L43J142O91k97L28J844K061J480J888K477J493J13N10J674J287J60
$$ plain form
56390 227139 227746 229659 231328 231642 231806 233018 234826 236967 240216 244236 247215 248759 250522 253033 254749
56375 254749 255134 255624 256549 256384 255194 255429 257852 260011 260376 260732 262775 265519 267838 270443 273427 274884
56359 274884 274004 272793 272947 273727 274451 276111 278770 280374 280011 279521 280156 280563 279750 278934 278612 276999 273419
56342 273419 270219 269182 268990 268264 268079 269380 270911 271934 274023 277963 281782 284129 286660 290846 295364
56327 295364 298962 302949 308466 314179 319028 324283 330454 335196 336863 337247 338246 338796 337756 336785 337365
56312 337365 337784 336087 333479 331918 330836 329100 327769 328068 329011 329738 331769 336305 341708 346285 350951
56297 350951 356610 361669 364937 368197 372964 377498 380057 382346 386520 391382 394854 397721 401618 405659
56283 405659 408464 411334 416089 421791 426711 431537 437686 444534 451191 458753 468002 477226 485230 493955
$$ packed form
56390B27139O07J913J669L14J64J212J808K141L249M020K979J544J763K511J716
56375B54749L85M90R25j65j190K35K423K159L65L56K043K744K319K605K984J457
56359B74884q80j211J54P80P24J660K659J604l63m90O35M07q13q16l22j613l580
56342B73419l200j037j92p26j85J301J531J023K089L940L819K347K531M186M518
56327B95364L598L987N517N713M849N255O171M742J667L84R99N50j040r71N80
56312C37365M19j697k608j561j082j736j331K99R43P27K031M536N403M577M666
56297C50951N659N059L268L260M767M534K559K289M174M862L472K867L897M041
56283D05659K805K870M755N702M920M826O149O848O657P562R249R224Q004Q725
$$ plain form
56269 493955 505164 517168 527980 539045 552534 567614 582840 599586 619449 640781 661615
56258 661615 683800 710402 741148 774168 810291 851892 899399 952493 1012875 1082315 1159789
56247 1159789 1243862 1335949 1437930 1548563 1665432 1788192 1916584 2047582 2177822 2306369
56237 2306369 2431600 2547994 2649676 2734671 2802112 2848260 2869595 2867390 2845107 2803732 2743832
56226 2743832 2669479 2585442 2492553 2390316 2281960 2172473 2063741 1955950 1851568 1753301
56216 1753301 1660140 1570022 1484438 1405973 1333472 1264368 1199636 1141585 1088731 1037898 989595
56205 989595 946324 907337 870086 835215 805045 778593 753111 729083 708769 691215 673776
56194 673776 657146 643904 633360 622795 612473 604458 597828 590102 582181 576919 573992 571041 568449
$$ packed form
56269D93955J1209J2004J0812J1065J3489J5080J5226J6746J9863K1332K0834
56258F61615K2185K6602L0746L3020L6123M1601M7507N3094O0382O9440P7474
56247A159789Q4073R2087J01981J10633J16869J22760J28392J30998J30240J28547
56237B306369J25231J16394J01682Q4995O7441M6148K1335k205k2283m1375n9900
56226B743832p4353q4037r2889j02237j08356j09487j08732j07791j04382r8267
56216A753301r3161r0118q5584p8465p2501o9104o4732n8051n2854n0833m8303
56205I89595m3271l8987l7251l4871l0170k6452k5482k4028k0314j7554j7439
56194F73776j6630j3242j0544j0565j0322q015o630p726p921n262k927k951k592
$$ plain form
56181 568449 568020 568320 566489 563427 562193 562585 562369 562400 565194 569632 572340 573263 574897 577293 578851 580571
56165 580571 584390 588827 591478 594151 600147 608203 614702 620095 627351 635870 643011 649993 660049 672305
56151 672305 683790 695965 712679 733111 753497 774758 801608 835147 873198 917116 971374
56140 971374 1037030 1112281 1198676 1299746 1413887 1535083 1659639 1785170 1904039 2005977
56130 2005977 2087980 2155298 2213283 2264991 2315505 2369863 2425518 2473579 2508102 2528460 2534000
56119 2534000 2524312 2504556 2482639 2460152 2432240 2395416 2348254 2285673 2201598 2098012 1983988
56108 1983988 1865861 1745951 1630004 1526484 1437542 1358871 1289130 1231420 1185210 1145588
56098 1145588 1111382 1085705 1067634 1051752 1036721 1025972 1019237 1012012 1004133 1000149 1000344 1000089 998825
$$ packed form
56181E68449m29L00j831l062j234L92k16L1K794M438K708R23J634K396J558J720
56165E80571L819M437K651K673N996Q056O499N393P256Q519P141O982J0056J2256
56151F72305J1485J2175J6714K0432K0386K1261K6850L3539L8051M3918N4258
56140I71374O5656P5251Q6395J01070J14141J21196J24556J25531J18869J01938
56130B005977Q2003O7318N7985N1708N0514N4358N5655M8061L4523K0358N540
56119B534000r688j9756k1917k2487k7912l6824m7162o2581q4075j03586j14024
56108A983988j18127j19910j15947j03520q8942p8671o9741n7710m6210l9622
56098A145588l4206k5677j8071j5882j5031j0749o735p225p879l984J95k55j264
$$ plain form
56085 998825 1000739 1005766 1009163 1010910 1016148 1025275 1033081 1038841 1047495 1059525 1069567 1076593 1085552 1097303
56071 1097303 1107045 1114390 1124812 1139194 1152239 1163129 1177243 1195278 1211427 1224694 1241196 1262728
56059 1262728 1283815 1302594 1323576 1346977 1366628 1381483 1397999 1418040 1435688 1449078 1463861
56048 1463861 1481740 1497225 1509124 1523507 1541858 1558173 1571269 1587984 1610796 1634498 1658253
56037 1658253 1687944 1723124 1755002 1781294 1809701 1842948 1874504 1903070 1936588 1977157 2016826
56026 2016826 2053304 2094669 2143233 2190249 2232377 2277695 2329398 2379508 2425135 2474808 2532036
56015 2532036 2588947 2642958 2702993 2772296 2842384 2911122 2988798 3078744 3170453 3259824 3356979
56004 3356979 3465631 3574654 3679203 3789812 3910995 4032042 4149410 4276468 4419892
$$ packed form
56085I98825J914N027L397J747N238R127P806N760Q654J2030J0042P026Q959J1751
56071A097303R742P345J0422J4382J3045J0890J4114J8035J6149J3267J6502K1532
56059A262728K1087J8779K0982K3401J9651J4855J6516K0041J7648J3390J4783
56048A463861J7879J5485J1899J4383J8351J6315J3096J6715K2812K3702K3755
56037A658253K9691L5180L1878K6292K8407L3247L1556K8566L3518M0569L9669
56026B016826L6478M1365M8564M7016M2128M5318N1703N0110M5627M9673N7228
56015B532036N6911N4011O0035O9303P0088O8738P7676Q9946R1709Q9371R7155
56004C356979J08652J09023J04549J10609J21183J21047J17368J27058J43424
$$ plain form
55995 4419892 4568538 4717247 4878687 5059228 5246771 5435749 5640032 5867307 6105807
55986 6105807 6350852 6618209 6915650 7228450 7549630 7896508 8280103 8687707 9114226
55977 9114226 9579787 10096651 10651130 11239299 11886402 12608622 13392347 14235853 15173165
55968 15173165 16230862 17403199 18698932 20168548 21854370 23762960 25922871 28419158
55960 28419158 31335294 34723137 38679377 43394683 49086806 55967539 64344132 74684120
55952 74684120 87529565 103463634 123262230 147971308 178699181 216321372 261123695
55945 261123695 311851330 364171314 410158380 440586350 449246404 435955076 405837879
55938 405837879 366002192 322619671 279952911 240588633 205786140 175795108 150318138
$$ packed form
55995D419892J48646J48709J61440J80541J87543J88978K04283K27275K38500
55986F105807K45045K67357K97441L12800L21180L46878L83595M07604M26519
55977I114226M65561N16864N54479N88169O47103P22220P83725Q43506R37312
55968A5173165J057697J172337J295733J469616J685822J908590K159911K496287
55960B8419158K916136L387843L956240M715306N692123O880733Q376593J0339988
55952G4684120J2845445J5934069J9798596K4709078L0727873L7622191M4802323
55945B61123695N0727635N2319984M5987066L0427970Q660054j3291328l0117197
55938D05837879l9835687m3382521m2666760l9364278l4802493k9991032k5476970
$$ plain form
55931 150318138 128900532 111024305 96098755 83569264 73023221 64139615 56608715
55924 56608715 50167188 44647536 39923318 35846828 32286749 29176187 26470853 24097813
55916 24097813 21987331 20115190 18469856 17010407 15694145 14513235 13467233 12528075
55908 12528075 11665712 10880875 10180294 9544642 8950927 8402425 7907581 7451916 7018462
55899 7018462 6614630 6252162 5920315 5604131 5309995 5048361 4809183 4578392 4361793
55890 4361793 4169619 3993459 3820771 3657206 3513041 3381915 3253745 3134908 3035344 2948698
55880 2948698 2864734 2788552 2727917 2673473 2610747 2541128 2473066 2403391 2325321 2244803 2171141
55869 2171141 2100320 2024151 1947124 1878239 1814896 1750431 1689156 1638521 1594430 1549201 1506227
$$ packed form
55931A50318138k1417606j7876227j4925550j2529491j0546043q883606p530900
55924E6608715o441527n519652m724218m076490l560079l110562k705334k373040
55916B4097813k110482j872141j645334j459449j316262j180910j046002r39158
55908A2528075q62363p84837p00581o35652n93715n48502m94844m55665m33454
55899G018462m03832l62468l31847l16184k94136k61634k39178k30791k16599
55890D361793j92174j76160j72688j63565j44165j31126j28170j18837r9564q6646
55880B948698q3964p6182o0635n4444o2726o9619o8062o9675p8070q0518p3662
55869B171141p0821p6169p7027o8885o3343o4465o1275n0635m4091m5229m2974
$$ plain form
55858 1506227 1472267 1442823 1409571 1375068 1346262 1320495 1291549 1262586 1239642 1218869 1193281
55847 1193281 1165671 1142167 1119542 1091626 1061930 1037202 1014622 987914 960209 938279 919639
55836 919639 897831 875088 857439 842320 823445 803352 788950 778747 766249 752206 742120
55825 742120 735188 726729 718057 713273 709542 700843 688173 676328 664266 648442 631903 620145 611353
55812 611353 600418 589099 582569 579420 574683 569341 567397 567018 564177 561673 564842 571493 575793 579037
55798 579037 586768 597932 606611 612148 618112 623428 623932 620791 618370 615670 608574 598554 590510 584040
55784 584040 575564 566922 562901 561895 557728 549270 539919 529394 514758 498191 485220 476224 467663
55771 467663 460352 458494 461896 467176 475112 488297 502572 509367 506310 498042 487476 474039 459676
$$ packed form
55858A506227l3960k9444l3252l4503k8806k5767k8946k8963k2944k0773k5588
55847A193281k7610k3504k2625k7916k9696k4728k2580k6708k7705k1930j8640
55836I19639k1808k2743j7649j5119j8875k0093j4402j0203j2498j4043j0086
55825G42120o932q459q672m784l731q699j2670j1845j2062j5824j6539j1758q792
55812F11353j0935j1319o530l149m737n342j944l79k841k504L169O651M300L244
55798E79037P731J1164Q679N537N964N316N04l141k421k700p096j0020q044o470
55784E84040q476q642m021j006m167q458r351j0525j4636j6567j2971q996q561
55771D67663p311j858L402N280P936J3185J4275O795l057q268j0566j3437j4363
$$ plain form
55758 459676 448384 439823 430604 421413 415764 412633 407732 401280 396962 393883 387314 377059 367539 359675
55744 359675 350179 338912 329653 323292 317184 311376 308627 308178 306288 303130 302445 304237 304385 301712 298954
55729 298954 296712 292926 288388 286188 285467 282179 276220 271407 268299 263689 257451 253197 251494 248939
55715 248939 244731 241967 241703 241800 242286 245861 252366 258623 264236 271668 280205 285984 288513 291002 293633
55700 293633 292778 287720 281945 276769 269829 260952 253401 247990 241892 234636 229470 227426 225711 223398
55686 223398 222999 224835 225511 223734 222432 223511 225655 228721 234931 243980 252056 257448 262232 267004 269047
55671 269047 267420 264890 263061 260298 256048 252509 250396 247716 244170 242083 241635 240086 237227 236585 239448
55656 239448 242630 244038 245665 249011 252152 253506 254283 255234 255085 253927 253972 255333 255280 253155 251597 251367
$$ packed form
55758D59676j1292q561r219r191n649l131m901o452m318l079o569j0255r520p864
55744C59675r496j1267r259o361o108n808k749m49j890l158o85J792J48k673k758
55729B98954k242l786m538k200p21l288n959m813l108m610o238m254j703k555
55715B48939m208k764k64R7M86L575O505O257N613P432Q537N779K529K489K631
55700B93633q55n058n775n176o940q877p551n411o098p256n166k044j715k313
55686B23398l99J836O76j777j302J079K144L066O210R049Q076N392M784M772K043
55671B69047j627k530j829k763m250l539k113k680l546k087m48j549k859o42K863
55656B39448L182J408J627L346L141J354P77R51j49j158M5J361n3k125j558k30
$$ plain form
55640 251367 249559 244751 239320 234747 229212 221909 215233 210377 205097 198138 191752 187589 184174 180636
55626 180636 178758 179022 178702 176373 174437 174755 175576 175202 174900 175646 175592 173369 170579 168655 166514 163488
55610 163488 161195 160261 158614 155226 152176 150848 149494 146824 144582 144151 143885 142202 140205 139009 137588
55595 137588 135455 134292 134683 134398 132215 130263 130345 131019 130629 130132 130606 131004 130718 131355 133614 135389 135279
55578 135279 135066 136364 137802 137996 138379 140534 143390 145575 148014 151884 156482 161279 167454 175159 181865
55563 181865 185622 187481 188716 188423 185996 183145 181204 179089 176097 173876 173341 172434 169420 165802 163564
55548 163564 162104 160234 158590 157631 155812 152257 148811 147075 145799 143531 141388 140792 140888 140548 140557 141513
55532 141513 141957 140926 139987 140498 141270 141105 140980 141337 139975 135279 129151 124190 120389 117033 115182 115484
$$ packed form
55640B51367j808m808n431m573n535p303o676m856n280o959o386m163l415l538
55626A80636j878K64l20k329j936L18Q21l74l02P46n4k223k790j924k141l026
55610A63488k293r34j647l388l050j328j354k670k242m31k66j683j997j196j421
55595A37588k133j163L91k85k183j952Q2O74l90m97M74L98k86O37K259J775j10
55578A35279k13J298J438J94L83K155K856K185K439L870M598M797O175P705O706
55563A81865L757J859J235k93k427k851j941k115k992k221n35r07l014l618k238
55548A63564j460j870j644r59j819l555l446j736j276k268k143n96R6l40RR56
55532A41513M44j031r39N11P72j65j25L57j362m696o128m961l801l356j851L02
$$ plain form
55516 115484 115963 114819 113195 112572 111839 109647 107353 106756 107148 107384 108603 111988 115927 118244 119260 120017
55500 120017 119704 117646 115578 115046 114716 113160 111992 113073 114814 114593 112896 111724 110787 108787 106819
55485 106819 106978 108881 110736 112555 115200 117689 118664 119226 121154 123589 124588 124726 125947 127965 128939 128719
55469 128719 128375 127493 125013 121878 119921 118912 117450 115824 115189 114916 113669 112198 112141 112839 112239 110290
55453 110290 108700 107976 107359 107012 107598 108273 107640 106090 104907 103904 102336 101178 101851 103492 104084 103526
55437 103526 103110 102880 102100 101494 102274 103651 103948 103509 103908 104980 105275 104838 104936 105562 105758 105873 106943 108340
55419 108340 108541 107755 107423 107673 107603 107452 108101 109036 109165 108991 109585 110151 109126 106988 105508 104898 104193 103722
55401 103722 104469 105618 105383 103850 102516 101656 100645 100121 101033 102214 101784 100499 100742 102658 104262 105083
$$ packed form
55516A15484M79j144j624o23p33k192k294n97L92K36J219L385L939K317J016P57
55500A20017l13k058k068n32l30j556j168J081J741k21j697j172r37k000j968
55485A06819J59J903J855J819K645K489R75N62J928K435R99J38J221K018R74k20
55469A28719l44q82k480l135j957j009j462j626o35k73j247j471n7O98o00j949
55453A10290j590p24o17l47N86O75o33j550j183j003j568j158O73J641N92n58
55437A03526m16k30p80o06P80J377K97m39L99J072K95m37R8O26J96J15J070J397
55419A08340K01p86l32K50p0j51O49R35J29j74N94N66j025k138j480o10p05m71
55401A03722P47J149k35j533j334q60j011n24R12J181m30j285K43J916J604Q21
$$ plain form
55385 105083 106557 108828 110201 110067 109660 109626 109351 108857 108865 108847 107447 105068 103630 103595 103470 102347 100671 98467
55367 98467 95228 91713 89602 89107 89018 89121 90397 92754 94805 96096 97501 99291 100746 101673 102425 102566
55351 102566 101475 99988 99424 99382 98690 98025 99118 101636 103433 103760 103695 103536 102455 100845 100361 101299 102275
55334 102275 102724 103376 104123 103837 102579 101658 101273 100433 99392 99697 101539 103419 104784 106632 109111 110935
55318 110935 111676 112348 113187 113048 111572 109938 108903 108046 107256 107019 106971 106146 104922 104707 105569 106217 106320 106620
55300 106620 106750 105444 103082 101553 101227 100607 99310 98830 99805 101051 101910 103101 104606 105187 104834 105281
55284 105281 107202 109131 109948 110239 110437 109890 108637 107875 107802 107134 105590 104633 104871 104971 104180 103691 104448 105623
55266 105623 106382 107133 107968 107884 106688 105813 106153 106849 107177 107673 108362 107904 105747 103412 102385 102342 102478 102945
$$ packed form
55385A05083J474K271J373j34m07l4k75m94Qj8j400k379j438l5j25j123j676k204
55367I8467l239l515k111m95q9J03J276K357K051J291J405J790J455R27P52J41
55351A02566j091j487n64m2o92o65J093K518J797L27o5j59j081j610m84R38R76
55334A02275M49O52P47k86j258r21l85q40j041L05J842J880J365J848K479J824
55318A10935P41O72Q39j39j476j634j035q57p90k37m8q25j224k15Q62O48J03L00
55300A06620J30j306k362j529l26o20j297m80R75J246Q59J191J505N81l53M47
55284A05281J921J929Q17K91J98n47j253p62p3o68j544r57K38J00p91m89P57J175
55266A05623P59P51Q35q4j196q75L40O96L28M96O89m58k157k335j027m3J36M67
$$ plain form
55248 102945 103891 104709 105272 106328 107786 108278 107353 106373 106251 106129 105300 104623 104836 105192 105031 105076 105851 106341
55230 106341 105547 104042 102809 101799 100744 100158 100432 101039 101507 102022 102438 102039 100994 100548 101080 101478 101124
55213 101124 100892 101423 102162 102882 104382 106694 108363 108602 108462 108808 108888 108040 107123 106971 107032 106829 107151 108463
55195 108463 109621 109552 108858 108474 108152 107609 107696 108946 110231 110389 110078 110520 111452 111788 111453 111230 111429 111885
55177 111885 112600 113420 113752 113411 113067 113220 113585 113895 114258 114268 113059 110848 109090 108443 107899 106544 104813
55160 104813 103391 102334 101900 102640 103970 104337 103564 103325 104485 105869 106587 107553 109420 110955 110990 110369 110371
55143 110371 110704 110542 110149 110008 109655 108799 108305 108720 109115 108630 107837 107344 106594 105408 105098 106427 107970 108207
55125 108207 107874 108507 109905 110877 111339 111888 112285 112099 111976 112616 113336 113228 112826 113098 113679 113652 113269 113361 113847
$$ packed form
55248A02945R46Q18N63J056J458M92r25r80j22j22q29o77K13L56j61M5P75M90
55230A06341p94j505j233j010j055n86K74O07M68N15M16l99j045m46N32L98l54
55213A01124k32N31P39P20J500K312J669K39j40L46Q0q48r17j52O1k03L22J312
55195A08463J158o9o94l84l22n43Q7J250J285J58l11M42R32L36l35k23J99M56
55177A11885P15Q20L32l41l44J53L65L10L63J0j209k211j758o47n44j355j731
55160A04813j422j057m34P40J330L67p73k39J160J384P18R66J867J535L5o21K
55143A10371L33j62l93j41l53q56m94M15L95m85p93m93p50j186l10J329J543K37
55125A08207l33O33J398R72M62N49L97j86j23O40P20j08m02K72N81k7l83R2M86
$$ plain form
55106 113847 114250 114897 116183 117456 117956 118042 118230 118001 116946 116053 116374 117316 117701 117619 117796 118090 118094 118381 119651
55087 119651 121413 122797 123782 124381 123799 121925 120432 120697 121637 121351 119887 118588 117682 116581 115795 116438
55071 116438 118172 119441 119438 118331 116119 112930 110006 108748 109096 110171 111905 114539 117249 118927 119836
55056 119836 120886 121830 121779 120929 120121 119191 117424 115256 113846 113327 113045 113063 113795 114616 114556 114041 114214 114892
55038 114892 114996 114765 115640 117922 120261 121638 122280 122467 121935 120770 119627 118840 118300 118233 119078 120632 122288
55021 122288 123939 125635 126689 126294 124856 123612 123109 123093 123544 124644 125904 126457 126174 125657 125348 125390 125857
55004 125857 126314 125732 123863 122098 121945 123261 124881 126152 126763 126078 124070 122174 121727 122185 122258 122003 122277
54987 122277 122873 122933 122655 122840 123191 122765 121744 121095 120808 120169 119514 120010 121801 123919 125876 127918 129872
$$ packed form
55106A13847M03O47J286J273N00Q6J88k29j055q93L21R42L85q2J77K94MK87J270
55087A19651J762J384R85N99n82j874j493K65R40k86j464j299r06j101p86O43
55071A16438J734J269lj107k212l189k924j258L48J075J734K634K710J678R09
55056A19836J050R44n1q50q08r30j767k168j410n19k82J8P32Q21o0n15J73O78
55038A14892J04k31Q75K282K339J377O42J87n32j165j143p87n40o7Q45J554J656
55021A22288J651J696J054l95j438j244n03j6M51J100J260N53k83n17l09M2M67
55004A25857M57n82j869j765j53J316J620J271O11o85k008j896m47M58P3k55K74
54987A22277N96O0k78J85L51m26j021o49k87o39o55M96J791K118J957K042J954
$$ plain form
54970 129872 131212 132053 132726 132708 131438 129835 129506 130689 132363 133944 135383 136118 135670 134893 134926 135280 134719
54953 134719 133586 133264 133605 133105 131639 130895 131729 133017 133566 133464 133141 132607 132078 132002 132188 132079 131872 132078
54935 132078 132148 131127 129594 129217 130280 131332 131450 131216 131259 131479 132051 133632 136215 139149 142514 147103
54919 147103 152843 158729 164518 171035 178599 186526 194309 201776 208005 211668 212660 211884 209334 204143 196752
54904 196752 189194 182790 177113 171609 166596 162140 157594 152880 148838 145809 143236 141038 139885 139732
54890 139732 139615 139300 139625 140727 141525 141526 141547 142113 142684 143144 144455 147085 150224 153344 157158 162306 168429
54873 168429 175227 183004 191382 198899 204783 209809 214493 217751 218308 216310 212554 207234 200437 192937
54859 192937 185539 178395 171666 165983 161561 157748 154042 150668 147613 144230 140464 137397 135791 135061
$$ packed form
54970A29872J340Q41O73j8j270j603l29J183J674J581J439P35m48p77L3L54n61
54953A34719j133l22L41n00j466p44Q34J288N49j02l23n34n29p6J86j09k07K06
54935A32078P0j021j533l77J063J052J18k34M3K20N72J581K583K934L365M589
54919A47103N740N886N789O517P564P927P783P467O229L663R92p76k550n191p391
54904A96752p558o404n677n504n013m456m546m714m042l029k573k198j153j53
54890A39732j17l15L25J102P98JK1N66N71M60J311K630L139L120L814N148O123
54873A68429O798P777Q378P517N884N026M684L258N57j998l756n320o797p500
54859A92937p398p144o729n683m422l813l706l374l055l383l766l067j606p30
$$ plain form
54845 135061 134374 133700 132995 131478 128769 125902 124147 123395 122607 121355 120114 119408 119355 119735 120100 120136 120160 120815
54827 120815 122165 123668 125037 126372 127393 127502 126791 126126 126044 126395 127083 128145 129043 129000 128243 127827 128107
54810 128107 128526 128978 130050 131615 132645 132850 133190 134187 134976 134682 133670 132825 132509 132673 133122 133315 132838
54793 132838 132210 132208 132386 131570 129863 128688 128602 128659 128231 127803 127537 126821 125816 125752 126919 128099 128784 130233
54775 130233 133260 136657 138972 140403 141764 143018 144158 146237 150103 155118 160283 165664 171638 177940
54761 177940 184592 192632 202509 212712 221208 227393 231375 232462 229876 224354 217575 210353 202533 194228
54747 194228 186062 178480 171729 166202 162105 159138 156990 155599 154510 152858 150515 148426 147204 146346
54733 146346 145392 144783 144824 144925 144724 144959 146259 148072 149708 151530 154138 157328 160802 165055 170542 176813
$$ packed form
54845A35061o87o74p05j517k709k867j755p52p88j252j241p06n3L80L65L6K4O55
54827A20815J350J503J369J335J021J09p11o65q2L51O88J062Q98m3p57m16K80
54810A28107M19M52J072J565J030K05L40R97P89k94j012q45l16J64M49J93m77
54793A32838o28kJ78q16j707j175q6N7m28m28k66p16j005o4J167J180O85J449
54775A30233L027L397K315J431J361J254J140K079L866N015N165N381N974O302
54761A77940O652Q040R877J0203Q496O185L982J087k586n522o779p222p820q305
54747A94228q166p582o751n527m097k967k148j391j089j652k343k089j222q58
54733A46346r54o09M1J01k01K35J300J813J636J822K608L190L474M253N487O271
$$ plain form
54717 176813 183333 190277 197580 204108 208781 211695 213206 212803 209947 205198 199499 193068 185936 178813
54703 178813 172480 166965 162088 158005 154575 151160 147844 145737 145250 145201 144557 143749 143255 142309 140348 138499
54687 138499 138034 138375 138163 137374 136843 136513 135746 134732 134118 133806 133464 133562 134561 135716 135999 135605 135338 135287 135400
54668 135400 136406 138565 140282 139705 137191 134640 132931 131686 131030 131698 133466 135065 135760 135762 135283 134415
54652 134415 133748 133858 134344 134422 134179 134178 134294 134063 133680 133514 133193 132456 132265 133599 135675 136848 136822 136520 136290
54633 136290 135891 135835 136948 138724 139731 139563 138939 138106 136771 135481 135341 136288 137131 137363 137516 137732 137527
54616 137527 136994 136734 136484 135376 133721 132997 133784 135126 136162 136960 137424 136903 135407 133984 133373 133308 133470
54599 133470 134075 135140 136243 137280 138518 139654 139839 138873 137455 136160 135123 134665 135039 135553 135178 134135
$$ packed form
54717A76813O520O944P303O528M673K914J511m03k856m749n699o431p132p123
54703A78813o333n515m877m083l430l415l316k107m87m9o44q08m94r46j961j849
54687A38499m65L41k12p89n31l30p67j014o14l12l42R8R99J155K83l94k67n1J13
54668A35400J006K159J717n77k514k551j709j245o56O68J768J599O95Km79q68
54652A34415o67J10M86P8k43jJ16k31l83j66l21p37j91J334K076J173k6l02k30
54633A36290l99n6J113J776J007j68o24q33j335j290j40R47Q43K32J53K16k05
54616A37527n33k60k50j108j655p24P87J342J036P98M64n21j496j423o11o5J62
54599A33470O05J065J103J037J238J136J85r66j418j295j037m58L74N14l75j043
$$ plain form
54583 134135 133573 133582 132975 131354 129945 129813 130544 131239 131703 132045 132187 132397 133312 134863 136021 136175 135887 135811
54565 135811 135754 135427 135296 135989 137393 138865 139914 140400 140548 140921 141844 142753 142855 142351 142149 142351 142150 141419
54547 141419 141199 142091 143222 143549 143361 143731 145088 146999 148953 150748 152324 153645 154588 154902 154605 154381
54531 154381 155008 156302 157176 156897 155802 154740 154297 154532 154892 154410 152642 150423 149030 148606 148120 146839
54515 146839 145038 143288 141919 141348 142001 143547 144881 145229 144870 144632 145114 146402 147970 148906 148812 148374 148416
54498 148416 148604 147878 146037 144018 142630 141913 141728 142043 142502 142584 142369 142428 142928 143595 144545 146219 148436 150393
54480 150393 151678 152461 152740 152339 151644 151349 151425 151392 151523 152545 154035 154593 154020 153902 155376 157558 159066
54463 159066 160019 161474 163624 165646 166886 167341 167195 166616 165910 165314 164646 163470 161593 159387 157739 157539
$$ packed form
54583A34135n62Ro07j621j409j32P31O95M64L42J42K10R15J551J158J54k88p6
54565A35811n7l27j31O93J404J472J049M86J48L73R23R09J02n04k02K02k01p31
54547A41419k20Q92J131L27j88L70J357J911J954J795J576J321R43L14k97k24
54531A54381O27J294Q74k79j095j062m43K35L60m82j768k219j393m24m86j281
54515A46839j801j750j369n71O53J546J334L48l59k38M82J288J568R36r4m38M2
54498A48416J88p26j841k019j388p17j85L15M59Q2k15N9N00O67R50J674K217J957
54480A50393J285P83K79m01o95k95P6l3J31J022J490N58n73j18J474K182J508
54463A59066R53J455K150K022J240M55j46n79p06n96o68j176j877k206j648k00
$$ plain form
54447 157539 158829 160513 161329 161012 160164 159264 158456 158025 158212 158587 158413 157639 156863 156324 155720 154989 154513 154483
54429 154483 154769 155332 156017 156121 155075 153540 152901 153660 155123 156558 157673 158132 157764 157360 158132 160228 162688
54412 162688 164840 166653 167821 167843 167138 166748 166738 166238 165280 165091 166100 167189 167588 168056 169319 170677 171212
54395 171212 171333 171980 173126 174087 174638 174888 174603 173590 172402 171950 172641 174302 176454 178243 178718 177750 176293
54378 176293 175294 174742 174077 173044 171859 170994 170966 171881 173098 173874 174230 174517 174388 173265 171721 171150 171913
54361 171913 173099 174411 176872 181078 185971 190095 193071 195175 196448 196948 197053 196850 195968 194408 192675
54346 192675 190692 187664 183583 179763 177222 175501 173759 172025 170602 169187 167450 165787 164727 164272
54332 164272 164291 164814 165516 165811 165802 166120 166509 165987 164857 164877 166590 168189 168241 167906 168911 170750 171747 171800 172058
$$ packed form
54447A57539J290J684Q16l17q48r00q08m31J87L75j74p74p76n39o04p31m76l0
54429A54483K86N63O85J04j046j535o39P59J463J435J115M59l68m04P72K096K460
54412A62688K152J813J168K2p05l90j0n00r58j89J009J089L99M68J263J358N35
54395A71212J21O47J146R61N51K50k85j013j188m52O91J661K152J789M75r68j457
54378A76293r99n52o65j033j185q65k8R15J217P76L56K87j29j123j544n71P63
54361A71913J186J312K461M206M893M124K976K104J273N00J05k03q82j560j733
54346A92675j983l028m081l820k541j721j742j734j423j415j737j663j060m55
54332A64272J9N23P02K95rL18L89n22j130K0J713J599N2l35J005J839R97N3K58
$$ plain form
54313 172058 172584 172344 171159 169858 168610 166822 164695 163353 163206 163453 163421 163269 163082 162305 160508 158073
54297 158073 155901 154903 155597 157588 159571 160520 160769 161349 162501 163567 164120 164409 164744 165188 165849 166855 167951
54280 167951 168621 168659 168302 167893 167682 167788 168078 168302 168514 169038 169819 170400 170731 171318 172202 172574 171914 170783 169893
54261 169893 169153 168370 168167 169235 171156 172898 174140 175276 176407 177176 177418 177349 177264 177519 178491 180030 181289
54244 181289 181571 181023 180121 179059 178047 177510 177300 176386 174121 171384 169664 169427 170037 170830 171500 171799 171638
54227 171638 171294 171004 170645 170182 169958 170161 170583 171260 172586 174307 175377 175440 175514 176350 177080 176545 175102 173928
54209 173928 173201 172228 170856 169550 168447 167492 167137 167792 168817 169070 168245 166871 165424 164309 164202 165316
54193 165316 166673 167139 166820 166504 166228 165553 164818 164864 165726 166738 167689 168702 169273 168649 167115 165770 165132
$$ packed form
54313A72058N26k40j185j301j248j788k127j342j47K47l2j52j87p77j797k435
54297A58073k172r98O94J991J983R49K49N80J152J066N53K89L35M44O61J006J096
54280A67951O70L8l57m09k11J06K90K24K12N24P81N81L31N87Q84L72o60j131q90
54261A69893p40p83k03J068J921J742J242J136J131P69K42o9q5K55R72J539J259
54244A81289K82n48r02j062j012n37k10r14k265k737j720k37O10P93O70K99j61
54227A71638l44k90l59m63k24K03M22O77J326J721J070O3P4Q36P30n35j443j174
54209A73928p27r73j372j306j103r55l55O55J025K53q25j374j447j115j07J114
54193A65316J357M66l19l16k76o75p35M6Q62J012R51J013N71o24j534j345o38
$$ plain form
54176 165132 165023 165597 167244 169525 171423 172756 174245 176073 177450 177737 177083 175864 174330 172890 171877
54161 171877 171002 169805 168492 167529 166711 165641 164890 165425 167013 168353 168806 168761 168248 166618 164008 161843
54145 161843 161264 161953 163004 164118 165373 166540 167219 167319 167063 166797 166894 167445 168069 168416 168708 169269 169800 169811
54127 169811 169586 169889 170820 171701 172019 171767 171000 169899 169133 169318 170190 171099 172136 173844 175992 177680 178636
54110 178636 179373 180053 180249 179959 179858 180291 180910 181409 181795 181830 181166 180188 179869 180584 181860 183291 184833 186216
54092 186216 187097 187959 189810 192776 195988 199070 202721 207533 213260 219536 226288 232946 238178 241014 241556
54077 241556 240232 237165 232762 228114 224167 220954 218016 215129 212367 209991 208487 208119 208304 208028 207043
54062 207043 206024 205482 205205 204843 204236 203082 201207 199331 198591 199061 199656 199786 200097 201206 202771 204400
$$ packed form
54176A65132j09N74J647K281J898J333J489J828J377K87o54j219j534j440j013
54161A71877q75j197j313r63q18j070p51N35J588J340M53m5n13j630k610k165
54145A61843n79O89J051J114J255J167O79J00k56k66R7N51O24L47K92N61N31J1
54127A69811k25L03R31Q81L18k52p67j101p66J85Q72R09J037J708K148J688R56
54110A78636P37O80J96k90j01M33O19M99L86L5o64r78l19P15J276J431J542J383
54092A86216Q81Q62J851K966L212L082L651M812N727O276O752O658N232K836N42
54077B41556j324l067m403m648l947l213k938k887k762k376j504l68J85k76r85
54062B07043j019n42k77l62o07j154j875j876p40M70N95J30L11J109J565J629
$$ plain form
54046 204400 206494 209426 212676 215580 218354 221701 225941 231161 237633 245316 253361 260862 267820 274729
54032 274729 281507 287457 292194 295983 299191 301884 304086 306026 307906 309553 310525 310629 310243 309890 309606
54017 309606 309056 308216 307371 306347 304502 301872 299470 297763 295665 291950 286993 282031 277312 272301 267318
54002 267318 263469 260951 258780 256283 253608 250655 246864 242435 238591 236148 234807 234071 233844 233823 233407
53987 233407 232590 231902 231157 229393 226526 223912 222627 222133 221293 219795 217997 216198 214737 214052 214012 213874
53971 213874 213399 213298 214015 214826 214769 213853 212814 212214 212261 212922 213750 214172 214314 215009 216725 219079 221623 224301
53953 224301 226912 228989 230665 232805 235872 239402 242986 246960 251773 257599 265027 275163 288406 303843
53939 303843 320143 336011 349324 357246 358443 354477 348160 341179 334065 327478 322169 318030 314322
$$ packed form
54046B04400K094K932L250K904K774L347M240N220O472P683Q045P501O958O909
54032B74729O778N950M737L789L208K693K202J940J880J647R72J04l86l53k84
54017C09606n50q40q45j024j845k630k402j707k098l715m957m962m719n011m983
54002B67318l849k518k171k497k675k953l791m429l844k443j341p36k27k1m16
53987B33407q17o88p45j764k867k614j285m94q40j498j798j799j461o85m0j38
53971B13874m75j01P17Q11n7r16j039o00M7O61Q28M22J42O95J716K354K544K678
53953B24301K611K077J676K140L067L530L584L974M813N826P428J0136J3243J5437
53939C03843J6300J5868J3313P922J197l966o317o981p114o587n309m139l708
$$ plain form
53926 314322 310782 307914 306371 306602 308712 312142 315850 319236 322546 326074 329656 333343 337884 343922
53912 343922 351358 359954 369784 380387 390243 398044 404023 409252 414009 417544 419080 418408 415876 412466
53898 412466 409478 407579 406316 404857 402718 399467 394509 387855 380564 373714 367362 360997 354455 347838
53884 347838 341074 334208 327652 321604 315694 309725 304181 299444 295147 290869 286845 283335 279950 276316
53870 276316 272792 269778 266888 263643 260441 257970 256051 253889 251166 248142 245004 241859 239042 236756
53856 236756 234610 232106 229371 226954 225253 224511 224845 225806 226418 226174 225450 224541 223059 220858 218734 217404
53840 217404 216525 215591 215082 215707 217050 218030 218340 218538 219072 220075 221744 223972 225892 226624 226260 225500 224701
53823 224701 223997 223799 224319 224957 225011 224627 224319 224071 223773 224023 225451 227633 229631 231259 232873 234379 235557
$$ packed form
53926C14322l540k868j543K31K110L430L708L386L310L528L582L687M541O038
53912C43922P436Q596R830J0603R856P801N979N229M757L535J536o72k532l410
53898D12466k988j899j263j459k139l251m958o654p291o850o352o365o542o617
53884C47838o764o866o556o048n910n969n544m737m297m278m024l510l385l634
53870B76316l524l014k890l245l202k471j919k162k723l024l138l145k817k286
53856B36756k146k504k735k417j701p42L34R61O12k44p24r09j482k201k124j330
53840B17404q79r34n09O25J343R80L10J98N34J003J669K228J920P32l64p60p99
53823B24701p04j98N20O38N4l84l08k48k98K50J428K182J998J628J614J506J178
$$ plain form
53806 235557 237021 239654 243215 246619 249522 252692 256888 262320 269010 276600 283864 289499 293496 296885
53792 296885 300118 302703 304432 305951 307901 310330 313154 316433 319950 323099 325346 326359 325826 323759
53778 323759 320801 317526 313626 308522 302598 296939 292013 287462 283127 279287 275846 272262 268469 265022
53764 265022 262118 259257 256141 253182 250892 249264 247939 246447 244305 241466 238669 236711 235382 233807
53750 233807 231806 230137 229257 228678 227852 227037 226896 227659 228948 230121 230582 230079 228839 227317 225917 225067
53734 225067 225187 226182 227348 228242 229228 230630 231851 232161 231961 232291 233348 234496 235635 237420 239988 242508
53718 242508 244300 245595 246812 247842 248473 248961 249729 250837 252060 253239 254413 255820 257768 260268 262916
53703 262916 265398 267933 270838 273933 276859 279743 283020 286781 290829 295145 299741 304282 308360 311923
$$ packed form
53806B35557J464K633L561L404K903L170M196N432O690P590P264N635L997L389
53792B96885L233K585J729J519J950K429K824L279L517L149K247J013n33k067
53778C23759k958l275l900n104n924n659m926m551m335l840l441l584l793l447
53764B65022k904k861l116k959k290j628j325j492k142k839k797j958j329j575
53750B33807k001j669q80n79q26q15j41P63J289J173M61n03j240j522j400q50
53734B25067J20R95J166Q94R86J402J221L10k00L30J057J148J139J785K568K520
53718B42508J792J295J217J030O31M88P68J108J223J179J174J407J948K500K648
53703B62916K482K535K905L095K926K884L277L761M048M316M596M541M078L563
$$ plain form
53689 311923 314901 316793 317283 316919 316461 315925 315029 314146 313862 313857 313291 312145 311134 310362 309189 307514 306079
53672 306079 305211 304263 302706 301038 300145 300243 300695 300526 299098 296804 294996 294688 295416 295957 295932 295958 296371 296726
53654 296726 296590 296067 295509 295337 296015 297441 298541 298328 297292 296848 297474 298360 298837 299075 299284 299390 299751 301203
53636 301203 303971 307291 310343 312856 314727 315973 317277 319611 322947 326132 328376 330119 332118 334478
53622 334478 336962 339561 342305 345022 347637 350418 353837 358521 365086 373366 381993 389477 395586 400970
53608 400970 405796 409777 413228 416775 420106 422330 423645 425282 427547 429400 430380 431497 433541 435746
53594 435746 436961 437129 436859 436395 435731 435012 434179 432853 431054 429307 427752 425993 424096 422687 421691 420177
53578 420177 417955 416066 414996 413649 410992 407579 404454 401631 398826 396713 396072 396293 395986 394762 393382
$$ packed form
53689C11923K978J892M90l64m58n36q96q83k84nn66j146j011p72j173j675j435
53672C06079q68r48j557j668q93R8M52j69j428k294j808l08P28N41k5K6M13L55
53654B96726j36n23n58j72O78J426J100k13j036m44O26Q86M77K38K09J06L61J452
53636C01203K768L320L052K513J871J246J304K334L336L185K244J743J999K360
53622C34478K484K599K744K717K615K781L419M684O565Q280Q627P484O109N384
53608D00970M826L981L451L547L331K224J315J637K265J853R80J117K044K205
53594D35746J215J68k70m64o64p19q33j326j799j747j555j759j897j409r96j514
53578D20177k222j889j070j347k657l413l125k823k805k113o41K21l07j224j380
$$ plain form
53563 393382 392513 392274 392589 393134 393309 393036 393132 394056 394886 394533 393456 393052 393694 394529 395042 395612 396530 397499 398339
53544 398339 399297 400461 401574 402685 404349 406945 410309 414138 418293 422551 426585 430453 434817 440448
53530 440448 447589 455832 464437 472868 481240 490267 500616 512320 524842 537558 550086 562375 574736
53517 574736 587696 601739 617126 633826 651416 669265 687198 705920 726359 748652 772230
53506 772230 796727 822103 847874 873056 897189 920748 944237 967446 989912 1011519 1032214
53495 1032214 1051666 1069692 1086692 1103304 1119908 1136643 1153570 1170597 1187583 1204618 1221823
53484 1221823 1238950 1255738 1272581 1290112 1308097 1325564 1342239 1358884 1375857 1392140 1406286
53473 1406286 1417681 1426522 1433280 1438515 1442447 1444272 1442687 1437489 1429860 1420677 1409523 1396014 1381120
$$ packed form
53563C93382q69k39L15N45J75k73R6R24Q30l53j077m04O42Q35N13N70R18R69Q40
53544C98339R58J164J113J111J664K596L364L829M155M258M034L868M364N631
53530D40448P141Q243Q605Q431Q372R027J0349J1704J2522J2716J2528J2289J2361
53517E74736J2960J4043J5387J6700J7590J7849J7933J8722K0439K2293K3578
53506G72230K4497K5376K5771K5182K4133K3559K3489K3209K2466K1607K0695
53495A032214J9452J8026J7000J6612J6604J6735J6927J7027J6986J7035J7205
53484A221823J7127J6788J6843J7531J7985J7467J6675J6645J6973J6283J4146
53473A406286J1395Q841O758N235L932J825j585n198p629r183j1154j3509j4894
$$ plain form
53460 1381120 1366292 1352027 1338177 1324969 1312620 1300293 1286423 1270021 1251160 1230560 1209320
53449 1209320 1188667 1169201 1150504 1131952 1113626 1095939 1078837 1062011 1045702 1030791 1018183
53438 1018183 1008355 1001157 995778 991326 987653 985171 983694 982259 980474 979304 979972 982708 987036 992584
53424 992584 999050 1006110 1013998 1023499 1034741 1046696 1058623 1071308 1086016 1102753 1120473 1138591
53412 1138591 1157511 1178057 1201053 1227077 1255853 1286187 1317065 1348464 1380741 1413966 1448440
53401 1448440 1485102 1524558 1566281 1609545 1654476 1701371 1749722 1798942 1849417 1901693 1955157
53390 1955157 2008729 2062421 2116944 2171982 2226115 2278405 2328975 2377994 2425155 2470258 2513366
53379 2513366 2554205 2592156 2626974 2658850 2687660 2712641 2732904 2747953 2757865 2763294 2764901 2762341
$$ packed form
53460A381120j4828j4265j3850j3208j2349j2327j3870j6402j8861k0600k1240
53449A209320k0653j9466j8697j8552j8326j7687j7102j6826j6309j4911j2608
53438A018183r828p198n379m452l673k482j477j435j785j170O68K736M328N548
53424I92584O466P060P888R501J1242J1955J1927J2685J4708J6737J7720J8118
53412A138591J8920K0546K2996K6024K8776L0334L0878L1399L2277L3225L4474
53401A448440L6662L9456M1723M3264M4931M6895M8351M9220N0475N2276N3464
53390A955157N3572N3692N4523N5038N4133N2290N0570M9019M7161M5103M3108
53379B513366M0839L7951L4818L1876K8810K4981K0263J5049R912N429J607k560
$$ plain form
53367 2762341 2754147 2739012 2716667 2687204 2650567 2607594 2560697 2512235 2462726 2411742 2359909
53356 2359909 2308587 2258037 2207517 2157247 2108768 2063138 2020091 1979323 1941306 1906141 1872484
53345 1872484 1838328 1802444 1764836 1726365 1688295 1651778 1617363 1585051 1554712 1526234 1499564
53334 1499564 1475002 1453174 1434283 1417834 1403540 1391918 1383128 1375744 1367583 1357451 1345297 1331183
53322 1331183 1315276 1298584 1282428 1267158 1252329 1238028 1224947 1213212 1202260 1192010 1183154
53311 1183154 1176093 1170511 1166120 1162948 1160757 1159077 1158032 1158365 1160488 1164144 1169077 1175326 1182886 1191826
53297 1191826 1202682 1216016 1231664 1249181 1268757 1290759 1314610 1339241 1364434 1390510 1416776
53286 1416776 1441712 1464804 1486864 1508229 1528059 1545852 1562276 1577767 1591484 1602354 1610182
$$ packed form
53367B762341q194j5135k2345k9463l6637m2973m6897m8462m9509n0984n1833
53356B359909n1322n0550n0520n0270m8479m5630m3047m0768l8017l5165l3657
53345A872484l4156l5884l7608l8471l8070l6517l4415l2312l0339k8478k6670
53334A499564k4562k1828j8891j6449j4294j1622q790p384q161j0132j2154j4114
53322A331183j5907j6692j6156j5270j4829j4301j3081j1735j0952j0250q856
53311A183154p061n582m391l172k191j680j045L33K123L656M933O249P560Q940
53297A191826J0856J3334J5648J7517J9576K2002K3851K4631K5193K6076K6266
53286A416776K4936K3092K2060K1365J9830J7793J6424J5491J3717J0870P828
$$ plain form
53275 1610182 1614929 1615861 1612387 1605109 1595244 1583464 1569957 1555021 1538869 1521162 1501392 1479547
53263 1479547 1456054 1431366 1405941 1380245 1354460 1328423 1301985 1275139 1247796 1219920 1191929
53252 1191929 1164502 1137991 1112501 1088366 1065727 1043718 1021073 997747 975011 953659 932998
53241 932998 911972 890427 868906 847946 828044 809563 792241 775500 759644 745968 735151
53230 735151 726228 717720 709238 701380 694579 688568 682576 675657 667195 657447 647146 636350 624170
53217 624170 609896 593795 576592 558889 541458 525342 511037 498105 486051 475064 465455 456933
53205 456933 448993 441532 434561 427724 420627 413264 405698 397725 389287 380844 372863 365270 357799 350510
53191 350510 343587 336988 330712 325070 320306 316248 312641 309507 306898 304645 302637 300920 299273 297106
$$ packed form
53275A610182M747R32l474p278r865j1780j3507j4936j6152j7707j9770k1845
53263A479547k3493k4688k5425k5696k5785k6037k6438k6846k7343k7876k7991
53252A191929k7427k6511k5490k4135k2639k2009k2645k3326k2736k1352k0661
53241I32998k1026k1545k1521k0960j9902j8481j7322j6741j5856j3676j0817
53230G35151q923q508q482p858o801o011n992o919q462r748j0301j0796j2180
53217F24170j4274j6101j7203j7703j7431j6116j4305j2932j2054j0987r609q522
53205D56933p940p461o971o837p097p363p566p973q438q443p981p593p471p289
53191C50510o923o599o276n642m764m058l607l134k609k253k008j717j647k167
$$ plain form
53177 297106 294194 291067 288352 286028 283705 281340 279314 278025 277608 277766 277722 276719 274826 272898 271589
53162 271589 270721 269820 268809 267907 267219 266693 266231 265729 265253 265157 265641 266208 266073 265102 263803 262391 260598 258522
53144 258522 256960 256577 257237 258283 259038 259031 258383 258045 258959 260874 262662 263729 264337 264634 264393 263864 263758 264161
53126 264161 264516 264897 266035 267662 268266 267232 265952 265897 266715 267285 267656 268665 270422 272447 274793 277803
53110 277803 281061 283647 285240 286087 286144 285088 283006 280332 277326 274220 271571 269768 268523 267449 266751
53095 266751 266723 266961 266836 266334 265757 264992 263828 262589 261655 260742 259384 257788 256444 255340 254370 254030 254721
53078 254721 255770 256185 256067 256157 256292 255611 254243 253413 253639 254040 253813 253284 252956 252509 251461 250140 249258 248950
53060 248950 248784 248423 247793 246877 245782 244844 244320 244133 244120 244350 244951 245843 246954 248513 250772 253435 255665
$$ packed form
53177B97106k912l127k715k324k323k365k026j289m17J58m4j003j893j928j309
53162B71589q68r01j011r02o88n26m62n02m76r6M84N67j35r71j299j412j793k076
53144B58522j562l83O60J046P55po48l38R14J915J788J067O08K97k41n29j06M03
53126B64161L55L81J138J627O04j034j280n5Q18N70L71J009J757K025K346L010
53110B77803L258K586J593Q47N7j056k082k674l006l106k649j803j245j074o98
53095B66751k8K38j25n02n77p65j164j239r34r13j358j596j344j104r70l40O91
53078B54721J049M15j18R0J35o81j368q30K26M01k27n29l28m47j048j321q82l08
53060B48950j66l61o30r16j095r38n24j87j3K30O01Q92J111J559K259K663K230
$$ plain form
53043 255665 256864 257262 257503 257726 257413 256260 254875 254202 254433 254888 254872 254255 253260 252201 251465 251244 251207 250938
53025 250938 250733 251356 252872 254400 255211 255448 255535 255587 255739 256260 256880 256738 255634 254655 254923 256291 257930 259534
53007 259534 261147 262394 262849 262846 263027 263345 263372 263311 263792 264745 265435 265618 265813 266316 266735 266788 266847 267308 267899 268004
52987 268004 267416 266457 265518 264730 264143 264065 264957 266834 269033 271023 273248 276512 280544 284039 286389 288524
52971 288524 291447 294768 297331 298657 299005 298568 297564 296684 296568 297029 297511 298014 298754 299258 298760 297420 296188
52954 296188 295439 294547 292909 290702 288428 286330 284461 282823 281271 279607 277886 276358 275136 274169 273463
52939 273463 273076 273047 273472 274354 275183 275127 274026 272700 271841 271119 269872 268125 266269 264275 262067 260227 259449
52922 259449 259598 260039 260613 261438 262117 262114 261731 261740 262204 262606 263028 264168 266113 268047 269262 269608 268897 266873
$$ packed form
53043B55665J199L98K41K23l13j153j385o73K31M55j6o17r95j059p36k21l7k69
53025B50938k05O23J516J528Q11K37Q7N2J52N21O20j42j104r79K68J368J639J604
53007B59534J613J247M55lJ81L18K7o1M81R53O90J83J95N03M19N3N9M61N91J05
52987B68004n88r59r39p88n87p8Q92J877K199J990K225L264M032L495K350K135
52971B88524K923L321K563J326L48m37j004q80j16M61M82N03P40N04m98j340j232
52954B96188p49q92j638k207k274k098j869j638j552j664j721j528j222r67p06
52939B73463l87k9M25Q82Q29n6j101j326q59p22j247j747j856j994k208j840p78
52922B59449J49M41N74Q25O79ll83RM64M02M22J140J945J934J215L46p11k024
$$ plain form
52904 266873 264024 261546 260144 259537 259367 259824 260988 262201 262602 261996 260929 260141 260063 260580 261304 262172 263491
52887 263491 265080 265900 265225 263795 262965 263013 263134 262913 262743 262842 262976 263324 264552 266678 268723 269892 270423
52870 270423 271010 272076 273903 276763 280473 284318 287655 290214 291833 292564 293069 294118 295536 296453 296723
52855 296723 297148 297990 298220 296770 293733 289788 285218 280158 275183 270818 266883 262942 259105 255811 253101
52840 253101 250658 248396 246501 244998 243675 242350 240965 239549 238276 237431 237177 237505 238481 240190 242399
52825 242399 244559 246301 247608 248407 248370 247311 245481 243337 241329 239989 239788 240660 241904 242779 243034 242864
52809 242864 242672 242924 243899 245494 247473 249840 252584 255125 256498 256169 254372 251712 248881 246610 245244
52794 245244 244287 242956 241293 240149 239945 240000 239365 237815 235812 233951 232693 232253 232506 233205 234345 235989
$$ packed form
52904B66873k849k478j402o07j70M57J164J213M01o06j067p88p8N17P24Q68J319
52887B63491J589Q20o75j430q30M8J21k21j70R9J34L48J228K126K045J169N31
52870B70423N87J066J827K860L710L845L337K559J619P31N05J049J418R17K70
52855B96723M25Q42K30j450l037l945m570n060m975m365l935l941l837l294k710
52840B53101k443k262j895j503j323j325j385j416j273q45k54L28R76J709K209
52825B42399K160J742J307P99l7j059j830k144k008j340k01Q72J244Q75K55j70
52809B42864j92K52R75J595J979K367K744K541J373l29j797k660k831k271j366
52794B45244r57j331j663j144k04N5o35j550k003j861j258m40K53O99J140J644
$$ plain form
52778 235989 237841 239453 240841 242357 243929 245008 245343 245258 245121 245099 245460 246364 247183 246811 244998 242778 241181
52761 241181 240119 238954 237632 236722 236609 237123 237785 238239 238549 239194 240501 242044 242967 242945 242559 242711 244008
52744 244008 246573 249873 252822 254705 256118 258389 261943 265817 268801 270469 271007 270837 270626 271014 272007
52729 272007 273148 274388 276108 278111 279406 279380 278536 277656 276797 275527 273649 271285 268690 266307 264635
52714 264635 263770 263376 263161 263004 262690 262093 261559 261413 261204 260302 259149 258853 259483 259951 259796 259779 260297 260621 260430
52695 260430 260757 262381 264362 265314 265227 264912 264471 263537 262408 261656 261065 260187 259517 259824 260584 260413 259048 257660
52677 257660 257107 257012 256836 256825 257372 258224 258857 259171 259422 259749 260076 260225 259995 259318 258401 257614 257227 257358 257975
52658 257975 258796 259486 260211 261669 264221 267285 270076 272662 275797 279894 284563 288999 292339 293819 293180
$$ packed form
52778B35989J852J612J388J516J572J079L35q5j37k2L61R04Q19l72j813k220j597
52761B41181j062j165j322r10j13N14O62M54L10O45J307J543R23k2l86J52J297
52744B44008K565L300K949J883J413K271L554L874K984J668N38j70k11L88R93
52729B72007J141J240J720K003J295k6q44q80q59j270j878k364k595k383j672
52714B64635q65l94k15j57l14n97n34j46k09r02j153k96O30M68j55j7N18L24j91
52695B60430L27J624J981R52q7l15m41r34j129p52n91q78o70L07P60j71j365j388
52677B57660n53r5j76j1N47Q52O33L14K51L27L27J49k30o77r17p87l87J31O17
52658B57975Q21O90P25J458K552L064K791K586L135M097M669M436L340J480o39
$$ plain form
52643 293180 290967 288128 285322 282868 281050 279987 279291 278353 277036 275767 274938 274533 274381 274541 275359 277159
52627 277159 279766 282377 284185 285196 286021 286764 286669 285192 282976 281263 280587 280440 280002 278833 277122 275598
52611 275598 274995 275314 275793 275817 275511 275201 274771 273989 273098 272572 272503 272627 272722 272638 272223 271569 271053 270793 270422 269795
52591 269795 269533 270295 271849 273372 274518 275632 277045 278611 279937 280782 281268 281889 283078 284645 285934
52576 285934 286646 287003 286938 285888 283872 282095 281725 282506 283269 283423 283229 282987 282826 283090 284015 284927 284518 282126
52558 282126 278332 274296 270974 268929 268347 268966 270247 271709 273067 274211 275240 276265 276968 276698 275341
52543 275341 273720 272772 272600 272642 272408 271659 270298 268675 267640 267754 268703 269954 271566 273766 276088 277698
52527 277698 278427 278786 279116 279346 279506 279796 280156 280316 280337 280715 281860 283784 286163 288471 290231 291453 292599
$$ packed form
52643B93180k213k839k806k454j818j063o96r38j317j269q29m05j52J60Q18J800
52627B77159K607K611J808J011Q25P43r5j477k216j713o76j47m38j169j711j524
52611B75598o03L19M79K4l06l10m30p82q91n26o9J24R5q4m15o54n16k60l71o27
52591B69795k62P62J554J523J146J114J413J566J326Q45M86O21J189J567J289
52576B85934P12L57o5j050k016j777l70P81P63J54j94k42j61K64R25R12m09k392
52558B82126l794m036l322k045n82O19J281J462J358J144J029J025P03k70j357
52543B75341j621r48j72M2k34p49j361j623j035J14R49J251J612K200K322J610
52527B77698P29L59L30K30J60K90L60J60K1L78J145J924K379K308J760J222J146
$$ plain form
52510 292599 293948 295367 296955 299344 302938 307340 311945 316456 320250 322007 320928 317854 314327 310961
52496 310961 307544 304139 300967 297563 293346 288927 285731 284293 283925 283997 284401 284714 284144 282672 281287 280679
52480 280679 280542 280442 280555 281136 282012 282972 284051 285160 286074 287037 288674 291029 293396 295368 297331 299597
52464 299597 301787 303573 305357 307667 310370 312949 315119 316702 317311 316621 314720 311838 308099 303857 299895
52449 299895 296834 294560 292571 290674 289079 288002 287462 287255 287002 286375 285442 284524 283643 282454 280868 279314
52433 279314 278146 277168 276150 275455 275633 276454 276896 276279 275125 274595 275248 276651 278172 279700 281331 282772
52417 282772 283663 284310 285341 286594 287188 287040 287464 289672 293354 297447 301695 306648 312639 319797 328759
52402 328759 340181 353364 366181 376486 383056 385399 383647 378791 372207 364663 356310 347688 339895
$$ packed form
52510B92599J349J419J588K389L594M402M605M511L794J757j079l074l527l366
52496C10961l417l405l172l404m217m419l196j438l68P2M04L13n70j472j385o08
52480B80679j37j00J13N81Q76R60J079J109R14R63J637K355K367J972J963K266
52464B99597K190J786J784K310K703K579K170J583O09o90j901k882l739m242l962
52449B99895l061k274j989j897j595j077n40k07k53o27r33r18q81j189j586j554
52433B79314j168r78j018o95J78Q21M42o17j154n30O53J403J521J528J631J441
52417B82772Q91O47J031J253N94j48M24K208L682M093M248M953N991P158Q962
52402C28759J1422J3183J2817J0305O570K343j752m856o584p544q353q622p793
$$ plain form
52389 339895 333585 328465 324060 320386 317672 315976 315305 315611 316491 317402 318351 319873 322211 324985 327712
52374 327712 330119 331936 333078 334217 336510 340485 345669 351396 357341 363060 367810 371202 373537 375108
52360 375108 375693 375031 373404 371420 369676 368762 369025 370054 370971 371577 372682 374914 377768 380344 382521 384760
52344 384760 387054 388820 389825 390701 392315 394975 398413 402404 407086 412574 418506 424335 430130 436653
52330 436653 444386 453012 462219 472530 484691 498565 513419 529202 546715 566451 587886 610035
52318 610035 632148 653801 674812 695259 715236 734676 753758 773177 793467 814275 834963
52307 834963 855673 876996 898763 920034 940245 959581 978305 996620 1015072 1034023 1052631
52296 1052631 1069369 1083612 1095719 1105505 1111911 1114507 1114105 1111376 1106037 1097951 1088075 1077588 1066934
$$ packed form
52389C39895o310n120m405l674k714j696o71L06Q80R11R49J522K338K774K727
52374C27712K407J817J142J139K293L975N184N727N945N719M750L392K335J571
52360C75108N85o62j627j984j744r14K63J029R17O06J105K232K854K576K177K239
52344C84760K294J766J005Q76J614K660L438L991M682N488N932N829N795O523
52330D36653P733Q626R207J0311J2161J3874J4854J5783J7513J9736K1435K2149
52318F10035K2113K1653K1011K0447J9977J9440J9082J9419K0290K0808K0688
52307H34963K0710K1323K1767K1271K0211J9336J8724J8315J8452J8951J8608
52296A052631J6738J4243J2107R786O406K596m02k729n339q086r876j0487j0654
$$ plain form
52283 1066934 1056286 1046026 1036173 1026242 1016379 1007765 1001200 996162 992064 989561 989641 992127 996117 1001350
52269 1001350 1008157 1016511 1026110 1037045 1049467 1062824 1076281 1089734 1103697 1118396 1133654 1149496
52257 1149496 1166194 1183754 1201843 1220023 1237702 1254224 1269518 1284262 1298876 1312671 1324489
52246 1324489 1333723 1340107 1343061 1342110 1337708 1330882 1322213 1311774 1299788 1286641 1272486 1257467 1242103
52233 1242103 1226735 1210876 1193960 1176510 1159738 1144051 1128893 1114052 1100147 1087554 1075760
52222 1075760 1064271 1053496 1044194 1036466 1029857 1024157 1019606 1016371 1014253 1012976 1012502 1012938 1014220 1016081
52208 1016081 1018383 1021385 1025548 1031024 1037359 1043670 1049093 1053264 1056536 1059565 1062528 1064999 1066878 1069069
52194 1069069 1072678 1077750 1083472 1089474 1096093 1103295 1110246 1116334 1121862 1127283 1132268 1135989 1137872 1137704
$$ packed form
52283A066934j0648j0260r853r931r863q614o565n038m098k503Q0K486L990N233
52269A001350O807Q354R599J0935J2422J3357J3457J3453J3963J4699J5258J5842
52257A149496J6698J7560J8089J8180J7679J6522J5294J4744J4614J3795J1818
52246A324489R234O384K954r51m402o826q669j0439j1986j3147j4155j5019j5364
52233A242103j5368j5859j6916j7450j6772j5687j5158j4841j3905j2593j1794
52222A075760j1489j0775r302p728o609n700m551l235k118j277m74M36J282J861
52208A016081K302L002M163N476O335O311N423M171L272L029K963K471J879K191
52194A069069L609N072N722O002O619P202O951O088N528N421M985L721J883j68
$$ plain form
52180 1137704 1135448 1131291 1125477 1117889 1108246 1096927 1084982 1073107 1061296 1049836 1039837 1032192 1026594
52167 1026594 1022168 1018573 1015951 1014378 1013970 1015127 1017999 1022052 1026625 1031549 1036775 1041816 1046038 1049154
52153 1049154 1051057 1051686 1051451 1051255 1051573 1051996 1052123 1052321 1053098 1054354 1055830 1057678 1060010 1062505 1065067 1068125
52137 1068125 1071530 1073950 1074356 1073566 1073303 1074275 1076194 1079209 1084072 1091055 1099891 1110806 1124706 1142247
$$ packed form
52180A137704k256m157n814p588r643j1319j1945j1875j1811j1460r999p645n598
52167A026594m426l595k622j573m08J157K872M053M573M924N226N041M222L116
52153A049154J903O29k35j96L18M23J27J98P77J256J476J848K332K495K562L058
52137A068125L405K420M06p90k63R72J919L015M863O983Q836J0915J3900J7541
$$ [...]
##END NTUPLES=NMR SPECTRUM
##END=
