
##TITLE=AC1318_SSUAH12147_6608726_lk79rY1aOC
##JCAMPDX= 6.0         $$ Bruker NMR JCAMP-DX V2.0
##DATA TYPE= NMR SPECTRUM
##DATA CLASS= NTUPLES
##ORIGIN= BRUKER
##OWNER= Administrator
$$ 1.72 TOPSPIN		Version 2.1
$$ 2012-08-01 18:41:58.265 -0500  Administrator@TOPSPIN
$$ Compression mode = diff/dup
##.OBSERVE FREQUENCY= 400.02188249412
##.OBSERVE NUCLEUS= ^1H
##.ACQUISITION MODE= SIMULTANEOUS (DQD)
##.ACQUISITION SCHEME= undefined
##.AVERAGES= 64
##.DIGITISER RES= 22
##SPECTROMETER/DATA SYSTEM= spect
##.PULSE SEQUENCE= noesygpps1d.comp
##.SOLVENT NAME= COFFEE_meoh
##.SHIFT REFERENCE= INTERNAL, COFFEE_meoh, 1, 14.96229
##AUDIT TRAIL= $$ (NUMBER, WHEN, WHO, WHERE, PROCESS, VERSION, WHAT)
$$ ##TITLE= Audit trail, TOPSPIN		Version 2.1
$$ ##JCAMPDX= 5.01
$$ ##ORIGIN= Bruker BioSpin GmbH
$$ ##OWNER= Administrator
$$ $$ C:\Bruker\TOPSPIN/data/COFFEE/nmr/AC1318_SSUAH12147_6608726_lk79rY1aOC/12/pdata/1/auditp.txt
$$ ##AUDIT TRAIL=  $$ (NUMBER, WHEN, WHO, WHERE, PROCESS, VERSION, WHAT)
(   1,<2012-08-01 18:41:51.640 -0500>,<Administrator>,<TOPSPIN>,<go>,<TOPSPIN 2.1>,
      <created by zg
	started at 2012-08-01 18:30:20.093 -0500,
	POWCHK enabled, PULCHK disabled,
       configuration hash MD5:
       6B 1B 68 BB D9 2E 58 E2 7F 35 AD 54 07 DF 0E 41
       data hash MD5: 64K
       52 95 E2 E6 B7 EF 21 E8 3B 06 7F EF 33 FF AC B8>)
(   2,<2012-08-01 18:41:54.937 -0500>,<Administrator>,<TOPSPIN>,<proc1d>,<TOPSPIN 2.1>,
      <Start of raw data processing
       efp LB = 0.3 FT_mod = 6 PKNL = 1 PHC0 = 0 PHC1 = 0 SI = 128K 
       data hash MD5: 128K
       5A 07 11 5E 29 73 98 4C 3B 8E 6D 74 A6 92 45 51>)
(   3,<2012-08-01 18:41:56.265 -0500>,<Administrator>,<TOPSPIN>,<proc1d>,<TOPSPIN 2.1>,
      <pk PHC0 = -0.8624268 PHC1 = 0 
       data hash MD5: 128K
       59 35 54 5B A8 F0 F2 4F 47 C8 C1 59 20 1D D1 D5>)
(   4,<2012-08-01 18:41:57.781 -0500>,<Administrator>,<TOPSPIN>,<proc1d>,<TOPSPIN 2.1>,
      <abs ABSG = 1 
       data hash MD5: 128K
       A9 BC D1 F3 2B D8 E8 3B B4 A7 79 9C E4 84 1F 31>)
(   5,<2012-08-01 18:41:57.890 -0500>,<Administrator>,<TOPSPIN>,<proc1d>,<TOPSPIN 2.1>,
      <abs ABSG = 2 
       data hash MD5: 128K
       44 7A 24 71 89 EC 3C ED B5 F4 8D AC 9C D6 A7 5E>)
(   6,<2012-08-01 18:41:57.968 -0500>,<Administrator>,<TOPSPIN>,<proc1d>,<TOPSPIN 2.1>,
      <abs ABSG = 3 
       data hash MD5: 128K
       10 B6 21 69 01 6D 18 F3 18 9E 5F 82 84 C0 69 1C>)
(   7,<2012-08-01 18:41:58.046 -0500>,<Administrator>,<TOPSPIN>,<proc1d>,<TOPSPIN 2.1>,
      <abs ABSG = 4 
       data hash MD5: 128K
       D2 BE 01 1D 78 6B 46 66 EA D9 D8 42 B9 0C 1F 18>)
(   8,<2012-08-01 18:41:58.125 -0500>,<Administrator>,<TOPSPIN>,<proc1d>,<TOPSPIN 2.1>,
      <abs ABSG = 5 
       data hash MD5: 128K
       82 17 DF 9D 2E 0A 65 F0 9A 40 BF E5 28 15 07 00>)
$$ ##END=
$$ 
$$ $$ hash MD5
$$ $$ AA 2B 75 82 40 04 B9 3A B9 A8 46 66 95 11 9F 0F
##$RELAX= 
##$RELAX= 
##$RELAX= 
##$RELAX= 
##$RELAX= 
##$RELAX= 
##$RELAX= 
##$RELAX= 
$$ Bruker specific parameters
$$ [...]
##$TP07= 0
##$TPNAME0= <>
##$TPNAME1= <>
##$TPNAME2= <>
##$TPNAME3= <>
##$TPNAME4= <>
##$TPNAME5= <>
##$TPNAME6= <>
##$TPNAME7= <>
##$TPOAL= (0..7)
0.5 0.5 0.5 0.5 0.5 0.5 0.5 0.5
##$TPOFFS= (0..7)
0 0 0 0 0 0 0 0
##$TUNHIN= 0
##$TUNHOUT= 0
##$TUNXOUT= 0
##$USERA1= <user>
##$USERA2= <user>
##$USERA3= <user>
##$USERA4= <user>
##$USERA5= <user>
##$V9= 5
##$VALIST= <valist>
##$VCLIST= <CCCCCCCCCCCCCCC>
##$VD= 0
##$VDLIST= <DDDDDDDDDDDDDDD>
##$VPLIST= <PPPPPPPPPPPPPPP>
##$VTLIST= <TTTTTTTTTTTTTTT>
##$WBST= 1024
##$WBSW= 4
##$XGAIN= (0..3)
0 0 0 0
##$XL= 0
##$YL= 0
##$YMAX_a= 16086955
##$YMIN_a= -9493624
##$ZGOPTNS= <>
##$ZL1= 120
##$ZL2= 120
##$ZL3= 120
##$ZL4= 120
##$ABSF1= 14.96229
##$ABSF2= -5.595892
##$ABSG= 5
##$ABSL= 3
##$ALPHA= 0
##$AQORDER= 0
##$ASSFAC= 0
##$ASSFACI= 0
##$ASSFACX= 0
##$ASSWID= 0
##$AUNMP= <proc_prof1d_extract.lims>
##$AXLEFT= 0
##$AXNAME= <>
##$AXNUC= <1H>
##$AXRIGHT= 0
##$AXTYPE= 0
##$AXUNIT= <>
##$AZFE= 0.1
##$AZFW= 0.1
##$BCFW= 0
##$BC_mod= 0
##$BYTORDP= 0
##$COROFFS= 0
##$CY= 15
##$DATMOD= 1
##$DC= 0
##$DFILT= <>
##$DTYPP= 0
##$F1P= 0
##$F2P= 0
##$FCOR= 0.5
##$FTSIZE= 131072
##$FT_mod= 6
##$GAMMA= 0
##$GB= 0
##$INTBC= 1
##$INTSCL= 1
##$ISEN= 128
##$LB= 0.3
##$LEV0= 0
##$LPBIN= 0
##$MAXI= 10000
##$MC2= 0
##$MEAN= 0
##$ME_mod= 0
##$MI= 0
##$NCOEF= 0
##$NC_proc= -2
##$NLEV= 6
##$NOISF1= 0
##$NOISF2= 0
##$NSP= 0
##$NTH_PI= 0
##$NZP= 0
##$OFFSET= 14.96229
##$PC= 1
##$PHC0= -0.8624268
##$PHC1= 0
##$PH_mod= 1
##$PKNL= yes
##$PPARMOD= 0
##$PPDIAG= 0
##$PPIPTYP= 0
##$PPMPNUM= 2147483647
##$PPRESOL= 1
##$PSCAL= 4
##$PSIGN= 0
##$PYNMP= <proc.py>
##$REVERSE= no
##$SF= 400.020009121075
##$SI= 131072
##$SIGF1= 0
##$SIGF2= 0
##$SINO= 400
##$SIOLD= 131072
##$SPECTYP= <>
##$SREGLST= <1H.CDCl3>
##$SSB= 0
##$STSI= 131072
##$STSR= 0
##$SW_p= 8223.68421052631
##$SYMM= 0
##$S_DEV= 0
##$TDeff= 65536
##$TDoff= 0
##$TI= <>
##$TILT= no
##$TM1= 0
##$TM2= 0
##$TOPLEV= 0
##$USERP1= <user>
##$USERP2= <user>
##$USERP3= <user>
##$USERP4= <user>
##$USERP5= <user>
##$WDW= 1
##$XDIM= 131072
##$YMAX_p= 454328576
##$YMIN_p= -11385
##$CURPLOT= <Network HP LaserJet P1505>
##$CURPRIN= <$Network HP LaserJet P1505>
##$DFORMAT= <normdp>
##$LAYOUT= <+/1D_H.xwp>
##$LFORMAT= <normlp>
##$PFORMAT= <normpl>
##$SURQMSG= 1
$$ End of Bruker specific parameters
$$ ---------------------------------
##NTUPLES= NMR SPECTRUM
##VAR_NAME=  FREQUENCY,     SPECTRUM/REAL,   SPECTRUM/IMAG
##SYMBOL=    X,             R,               I
##VAR_TYPE=  INDEPENDENT,   DEPENDENT,       DEPENDENT
##VAR_FORM=  AFFN,          ASDF,            ASDF
##VAR_DIM=   131072,        131072,          131072
##UNITS=     HZ,            ARBITRARY UNITS, ARBITRARY UNITS
##FACTOR=    0.0627417313425164, 1,          1
##FIRST=     8223.62146879497, 3627,         -57654
##LAST=      0,             4697,            -58171
##MIN=       0,             -11385,          0
##MAX=       8223.62146879497, 454328576,    0
$$ Real data points
##PAGE= N=1
##DATA TABLE= (X++(R..R)), XYDATA
$$ [...]
63204A135766p169j3706j9525k4535k8838l2330l4924l6726l7558l6794l4199
63193H29462l0539k6814k3252j9591j5955j2736r890o981l869q14K046M818P501
63180F93386R930J2060J3939J5440J6336J6685J6831J7054J7333J7495J7396J7096
63168H80981J6852J6893J7024J6674J5430J3377J0840P986M751J020l216p679
63156I90933j1846j5312j8242k1091k3936k6263k7499k7512k6565k5129k3690
63145G43848k2411k0955j8915j6408j3920j1659r481p468n995n093m248l061j760
63132F02474q62n85o19l65N17J588J891J157M45R69K485L627L730L506L773M440
63116F28171M962N078M695L704K336J238Q67J087J565K097K479K521K362K292
$$ plain form
63204 1135766 1128597 1114891 1095366 1070831 1041993 1009663 974739 938013 900455 863661 829462
63193 829462 798923 772109 748857 729266 713311 700575 690685 683704 679835 679021 681067 685885 693386
63180 693386 703316 715376 729315 744755 761091 777776 794607 811661 828994 846489 863885 880981
63168 880981 897833 914726 931750 948424 963854 977231 988071 996057 1000808 1001828 998612 990933
63156 990933 979087 963775 945533 924442 900506 874243 846744 819232 792667 767538 743848
63145 743848 721437 700482 681567 665159 651239 639580 630099 622631 616636 611543 607295 604234 602474
63132 602474 601612 601027 600408 600043 600560 602148 604039 605196 605641 606610 609095 612722 616452 619958 623731 628171
63116 628171 633133 638211 642906 646610 648946 650184 651051 652138 653703 655800 658279 660800 663162 665454
63102F65454K217J821J262J029J052O64l29j238j436j065o10l37l35n20m18M22
63086F67633J651K439K625K809L175L229K973L267M515N932O762P365Q362R458
63072G32195R959R980J0282J1206J2368J3258J3658J3741J4019J4960J6448J7936
63060H90010J9190K0405K1642K2849K4410K6785K9494L1490L2753L4511L7421
63049A190960M0686M3410M5789M8189N0167N1201N1540N1561N1095N0160M9418
63038A724176M9088M8385M7021M6224M7106M8887N0034N0487N1255N2334N2501
63027B267498N0864M7274M1308L2309K0637P689n539j9005l2582m5437n6668o5880
63015B242468p2891p7469p9591p9469p7244p3093o7542o1215n4322m6891l9409
$$ plain form
63102 665454 667671 669492 670754 671783 672835 673499 673170 671932 670496 669431 668821 668484 668149 667629 667211 667633
63086 667633 669284 671723 674348 677157 680332 683561 686534 689801 694316 700248 707010 714375 722737 732195
63072 732195 742154 752134 762416 773622 785990 799248 812906 826647 840666 855626 872074 890010
63060 890010 909200 929605 951247 974096 998506 1025291 1054785 1086275 1119028 1153539 1190960
63049 1190960 1231646 1275056 1320845 1369034 1419201 1470402 1521942 1573503 1624598 1674758 1724176
63038 1724176 1773264 1821649 1868670 1914894 1962000 2010887 2060921 2111408 2162663 2214997 2267498
63027 2267498 2318362 2365636 2406944 2439253 2459890 2467579 2462040 2443035 2410453 2365016 2308348 2242468
63015 2242468 2169577 2092108 2012517 1933048 1855804 1782711 1715169 1653954 1599632 1552741 1513332
63004A513332l2604k6633k0920j4917q651k591K718P045J0705J4210J7458J9682
62992A478834K0500K0551K0723K1182K1662K2145K2693K2993K2692K1872K0758
62981A716605J9177J6759J3227Q265J661n960j3333j9987k6828l4594m2513m9197
62969A583282n4143n7531n9326n9591n8968n7794n5359n1256m6752m3449m1005
62958I98108l7738l3243k8942k5957k3886k1913j9894j7928j5884j3824j2175
62947G46724j1163j0598j0293j0158r905r385r068r451j0116j0150r392q534q072
62934F20439q054q581r576j0171r431p755o557o367o284n462m178l146k658k727
62920E29492l257l782l705l065k460k085j566q47m04m48o77j033j832k912l492
$$ plain form
63004 1513332 1480728 1454095 1433175 1418258 1409607 1407016 1409734 1416779 1427484 1441694 1459152 1478834
62992 1478834 1499334 1519885 1540608 1561790 1583452 1605597 1628290 1651283 1673975 1695847 1716605
62981 1716605 1735782 1752541 1765768 1774033 1775694 1769734 1756401 1736414 1709586 1674992 1632479 1583282
62969 1583282 1529139 1471608 1412282 1352691 1293723 1235929 1180570 1129314 1082562 1039113 998108
62958 998108 960370 927127 898185 872228 848342 826429 806535 788607 772723 758899 746724
62947 746724 735561 724963 714670 704512 694607 685222 676154 666703 656587 646437 637045 628511 620439
62934 620439 612385 603804 594228 584057 574626 566871 560314 553947 547663 542201 538023 534877 532219 529492
62920 529492 526235 522453 518748 515683 513223 511138 509572 508725 508321 507873 507196 506163 504331 501419 497927
62905D97927l206k550j941j138K7J047J415J323J288J446J563J405Q09k13j285
62890D97917j939k174k324k416k166j675j477j797k319k800l222l275k488j164
62876D66681m03p44j355j114M4J303K080K365K279J822J141N73K92O9n01j419
62860D73113k105j945j091l74l46p51j117j454j985k545k729k368j583o21O7Q4
62844D52250k06J48J284J962J123n71j563j339o28j02J40J28o3r1J33J15l47m63
62826D51910L54J176P40n09r64k41M80M98M05O79Q05L82j31j95P1M20Q55J290
62808D58025J549J791K152K123J318O28J356L168M387M443M572N699P175Q200
62794E06586R058J0165J1178J1893J2945J4710J6526J7811J9048K0813K2728K4266
$$ plain form
62905 497927 494721 492171 490230 489092 489119 490166 491581 492904 494192 495638 497201 498606 499415 499202 497917
62890 497917 495978 493804 491480 489064 486898 485223 483746 481949 479630 476830 473608 470333 467845 466681
62876 466681 466278 465534 464179 463065 463109 464412 466492 468857 471136 472958 474099 474672 474964 475033 474532 473113
62860 473113 471008 469063 467972 467598 467252 466501 465384 463930 461945 459400 456671 454303 452720 452099 452166 452250
62844 452250 452044 452192 453476 455438 456561 455990 454427 453088 452460 452358 452498 452626 452563 452472 452605 452720 452373 451910
62826 451910 452264 453440 454180 453671 452707 452466 452946 453444 453849 454528 455333 455715 455584 455389 455460 455880 456735 458025
62808 458025 459574 461365 463517 465640 466958 467586 468942 472110 476497 480940 485512 491211 498386 506586
62794 506586 515644 525809 536987 548880 561825 576535 593061 610872 629920 650733 673461 697727
62782F97727K5864K8330L1748L5737M0204M5147N0246N5340O0818O6951P3392
62771A211504P9749Q6085R2246R7382J00610J01688J00554R6907R0607Q1812P0322
62760B209466N5659L8294J9936J949j5674l3148m9555o3520p4573q3052q9238
62749A916544r3313r5659r6419r5236r1992q7455q2550p7561p2456o7450o2614
62738I93839n7527n1929m6311m1361l7331l4235l1943k9739k6664k2914j9943
62727E93942j8542j7660j5984j3715j1841j0426q893p351o421n977n205l854k542
62714D65531j826j558j128O7K159M451N950O604P399Q886J0434J1563J2978J5390
62700E46900J8122K0155K1877K4561K8359L2140L5134L7701M0514M3935M8137
$$ plain form
62782 697727 723591 751921 783669 819406 859610 904757 955003 1010343 1071161 1138112 1211504
62771 1211504 1291253 1377338 1469584 1566966 1667576 1769264 1869818 1966725 2057332 2139144 2209466
62760 2209466 2265125 2303419 2323355 2325304 2309630 2276482 2226927 2163407 2088834 2005782 1916544
62749 1916544 1823231 1727572 1631153 1535917 1443925 1356470 1273920 1196359 1123903 1056453 993839
62738 993839 936312 884383 838072 796711 759380 725145 693202 663463 636799 613885 593942
62727 593942 575400 557740 541756 528041 516200 505774 496881 489530 483109 477132 471927 468073 465531
62714 465531 463705 462147 461019 461086 463245 467696 473646 480250 487649 496535 506969 518532 531510 546900
62700 546900 565022 585177 607054 631615 659974 692114 727248 764949 805463 849398 897535
62689H97535N2889N7245O0222O1824O2606O2386O0267N5850M9591M1892L2663
62678A494970K1960J0352j527j3227k4209l3909m2278m9648n5916o0264o2038
62667A184266o1602o0101n8455n6614n3847m9857m5447m1744l8846l5853l2344
62656F49556k9024k6578k4609k2387j9967j7938j6491j5486j4889j4480j3547
62645D34160j1664r537q258p984q023p947p831p570o805n590m494l914l752l733
62631C37058l669l432l043k692k481k289k034j765j297l32Q42J392J051N84O79
62616C18572J057J189J210J416J570J511J850L124M752N780O250O893P841Q615
62602C71630R167R961J1089J2173J3093J4092J5276J6661J8556K1244K4462K7746
$$ plain form
62689 897535 950424 1007669 1067891 1129715 1192321 1254707 1314974 1370824 1420415 1462307 1494970
62678 1494970 1516930 1527282 1525755 1512528 1488319 1454410 1412132 1362484 1306568 1246304 1184266
62667 1184266 1122664 1062563 1004108 947494 893647 843790 798343 756599 717753 681900 649556
62656 649556 620532 593954 569345 546958 526991 509053 492562 477076 462187 447707 434160
62645 434160 422496 412959 404701 396717 388694 380747 372916 365346 358541 352951 348457 344543 340791 337058
62631 337058 333389 329957 326914 324222 321741 319452 317418 315653 314356 314024 314866 316258 317309 317893 318572
62616 318572 319629 320818 322028 323444 325014 326525 328375 331499 336251 342031 348281 355174 363015 371630
62602 371630 380797 390758 401847 414020 427113 441205 456481 473142 491698 512942 537404 565150
62590E65150L1071L4567L8017M1256M4588M8062N0852N2232N2589N2459N1132
62579A061975M7306M0861L2756K3543J3333L029o035j3791k1354k8927l5141l9017
62567A078538m1297m3187m4724m5141m4111m1858l8737l5339l2526l0688k9274
62556F51656k7481k5169k2718k0434j8469j7025j6188j5656j5002j4141j3383
62545D45990j3034j3007j2822j2008j0568q924p435o161n175m622m290l597k388
62532C41959j266p91p18n28j56K79R64J973K836L251L728M766N855O226O199O791
62516C81368Q210R728J0922J2095J3513J5188J7345K0239K3455K6212K8407L0551
62504E97233L2765L4604L5839L6471L6029L3825L0043K5705K1392J6690J1019
$$ plain form
62590 565150 596221 630788 668805 710061 754649 802711 853563 905795 958384 1010843 1061975
62579 1061975 1109281 1150142 1182898 1206441 1219774 1222803 1216768 1202977 1181623 1152696 1117555 1078538
62567 1078538 1037241 994054 949330 904189 860078 818220 779483 744144 711618 680930 651656
62556 651656 624175 599006 576288 555854 537385 520360 504172 488516 473514 459373 445990
62545 445990 432956 419949 407127 395119 384551 375627 368192 362031 356856 352234 347944 344347 341959
62532 341959 340693 339902 339184 338656 338500 338779 339743 341716 344552 347803 351531 356297 362152 368378 374577 381368
62516 381368 389578 399306 410228 422323 435836 451024 468369 488608 512063 538275 566682 597233
62504 597233 629998 664602 700441 736912 772941 806766 836809 862514 883906 900596 911615
62493I11615M288l283j1172j8310k3654k7120k9333l0488l0339k9224k8096k7319
62481F57565k6338k4711k2693k0581j8302j5859j3480j1175q830o748n369m500
62469D78979l643k982l007l273k714j320k39M7L48J190J964K216K508L256L855
62454D77185L869L979M840N856O192O148O436O700O063M790M146M585N001M089
62440E49879J719j161l610n538p620j0354j3133j4620j4218j2816j1685j1161
62428D45682j0756j0147r493q920q231p101n367l212j218J1M69Q02J546K610L643
62413C90318M553N428O239O869P260P434P584Q101R129J0016R782Q373O950O618
62399D94654P215P670P208N913M339K976J903Q07o31k323l890n138o155o999p578
$$ plain form
62493 911615 915903 912620 901448 883138 859484 832364 803031 772543 742204 712980 684884 657565
62481 657565 631227 606516 583823 563242 544940 529081 515601 504426 495596 488848 483479 478979
62469 478979 475336 472354 469347 466074 463360 462040 461801 461848 462196 463386 465350 467566 470074 473330 477185
62454 477185 481054 485033 489873 495729 501921 508069 514505 521205 527268 532058 536204 540789 545790 549879
62440 549879 551598 550437 546827 541289 533669 523315 510182 495562 481344 468528 456843 445682
62428 445682 434926 424779 415286 406366 398135 391034 385667 382455 381237 381248 381717 382519 384065 386675 390318
62413 390318 394871 400299 406538 413407 420667 428101 435685 443786 452915 462931 472713 481086 488036 494654
62399 494654 501869 509539 516747 522660 526999 529975 531878 532685 532054 529731 525841 520703 514548 507549 499971
62384D99971p856p814p272o087m493k873j292L47J872L103M418O426R126J1952
62370D99528J4605J7245J9926K2613K5690K9589L3896L7653M0772M4192M8389
62359H34098N2556N5689N7726N9079N9648N8792N5840N0287M2063L1915K1073
62348A378766J0357P8r145j6398k1655k6067l0579l4966l8704m1967m4973m7088
62336A077659m7441m6047m3566m0333l6404l2263k8655k5769k3292k1228j9930
62325G12731j9240j8247j6267j3719j1661j0523r690q352o537m919l808k789j484
62312E85495j16R78J793K155J468l23k055k612k475k991m332n346n385n018m874
62297E56362m916n126n689o162n615m041k600j936j364l06N94O74N82J401L056
$$ plain form
62384 499971 492115 484301 477029 470942 466449 463576 462284 462631 464503 467606 472024 478450 487576 499528
62370 499528 514133 531378 551304 573917 599607 629196 663092 700745 741517 785709 834098
62359 834098 886654 942343 1000069 1059148 1118796 1177588 1233428 1283715 1325778 1357693 1378766
62348 1378766 1389123 1389201 1380056 1363658 1342003 1315936 1285357 1250391 1211687 1169720 1124747 1077659
62336 1077659 1030218 984171 940605 900272 863868 831605 802950 777181 753889 732661 712731
62325 712731 693491 675244 658977 645258 633597 623074 613384 605032 598495 593576 589768 586979 585495
62312 585495 585379 586357 588150 590305 591773 591450 589395 586783 584308 581317 576985 571639 566254 561236 556362
62297 556362 551446 546320 540631 534469 528854 524813 522213 520277 518913 518607 519201 519875 520457 521858 524914
62282E24914M517N129N022M636M481M987N978O662O648O510O962Q025R431J1169
62268F15071J3099J4695J5847J7333J9827K2936K5842K8420L1117L4269L8136
62257H76592M3003M8510N3341N6210N6783N5162N1096M4490L6055K6774J7179
62246A365195P796m50p227j3564k0499k7398l2790l6482l9557m2397m4034m3751
62234A064842m2098l9856l6983l3190k8880k4833k1316j8113j5111j2409j0003
62223G82050p790n883m515l619k761j747r69q80j264j483j387j427j701j584q01
62208G44239j09j73l11O01K297L354L242L033L872N713P767R342J0020R910R974
62193H12771J1215J3294J4878J5485J6022J7255J8879K0395K1715K2360K1418
$$ plain form
62282 524914 529431 534560 539582 544218 548699 553686 559664 566326 572974 579484 586446 594471 603902 615071
62268 615071 628170 642865 658712 676045 695872 718808 744650 773070 804187 838456 876592
62257 876592 919595 968105 1021446 1077656 1134439 1189601 1240697 1285187 1321242 1348016 1365195
62246 1365195 1372991 1372541 1365314 1351750 1331251 1303853 1271063 1234581 1195024 1152627 1108593 1064842
62234 1064842 1022744 982888 945905 912715 883835 859002 837686 819573 804462 792053 782050
62223 782050 774260 768377 763862 760243 757482 755735 754766 753886 752622 751139 749752 748325 746624 745040 744239
62208 744239 744130 743957 743646 744247 746544 749898 753140 756173 760045 765758 773525 782867 792887 802797 812771
62193 812771 823986 837280 852158 867643 883665 900920 919799 940194 961909 984269 1005687
62182A005687J8987J6566J5273J4570J3483J2069J1011J0708J1507J3701J6620
62171A160182J8834K0101K1921K5283K9234L2686L6157M0203M3401M3754M1237
62160A512993L7208L2106K5684J8922J3543R716O118K294q26k972n338q730j2269
62147A628449j4570j5218j4639j3314j1633r801p659m997k125M79K901N433P657
62134A550963Q695Q414P645P300P830R352J1499J3365J4308J4733J5459J6624
62122A686187J7898J9244K0563K1166K0683K0123K0794K2455K3749K4271K4824
62111A921957K5771K6455K6476K6236K6024K5689K5448K5936K7172K8437K9341
62100B214942L0130L0783L0901L0647L0879L2031L3790L5965L8684M1613M4063
$$ plain form
62182 1005687 1024674 1041240 1056513 1071083 1084566 1096635 1107646 1118354 1129861 1143562 1160182
62171 1160182 1179016 1199117 1221038 1246321 1275555 1308241 1344398 1384601 1428002 1471756 1512993
62160 1512993 1550201 1582307 1607991 1626913 1640456 1650172 1656290 1658584 1657758 1654786 1649448 1640718 1628449
62147 1628449 1613879 1598661 1584022 1570708 1559075 1549274 1541615 1536618 1534493 1534972 1537873 1543306 1550963
62134 1550963 1559658 1568072 1575717 1583017 1590847 1600199 1611698 1625063 1639371 1654104 1669563 1686187
62122 1686187 1704085 1723329 1743892 1765058 1785741 1805864 1826658 1849113 1872862 1897133 1921957
62111 1921957 1947728 1974183 2000659 2026895 2052919 2078608 2104056 2129992 2157164 2185601 2214942
62100 2214942 2245072 2275855 2306756 2337403 2368282 2400313 2434103 2470068 2508752 2550365 2594428
62089B594428M6216M9144N3129N6716N7897N5759N0996M5613M2103M1899M4310
62078C138210M7605N0893N3825N4905N1918M4749L6337L0040K6967K6424K7665
62067C589538L0177L3127L5728L7806L9365L9955L8984L6234L1758K5731J8801
62056C957204J1930N616k58n629j0165j4162j8571k3603k8224l1581l4118l6485
62044C771954l8190l8211l6497l4052l1736k9650k7456k4821k1745j8762j6525
62033C454309j5001j3529j1865j0492r666q903p809o769o229n964n640n525n938
62020C340979o538o793o797o958p298p661q255r323j0617j1839j3239j5059j6685
62007C213917j7263j7031j7220j8436j9914k0607k0475k0258k0360k0457k0153
$$ plain form
62089 2594428 2640644 2689788 2742917 2799633 2857530 2913289 2964285 3009898 3052001 3093900 3138210
62078 3138210 3185815 3236708 3290533 3345438 3397356 3442105 3478442 3508482 3535449 3561873 3589538
62067 3589538 3619715 3652842 3688570 3726376 3765741 3805696 3844680 3880914 3912672 3938403 3957204
62056 3957204 3969134 3974750 3974492 3968863 3958698 3944536 3925965 3902362 3874138 3842557 3808439 3771954
62044 3771954 3733764 3695553 3659056 3625004 3593268 3563618 3536162 3511341 3489596 3470834 3454309
62033 3454309 3439308 3425779 3413914 3403422 3393756 3384853 3377044 3370275 3364046 3358082 3352442 3346917 3340979
62020 3340979 3334441 3327648 3320851 3313893 3306595 3298934 3290679 3281356 3270739 3258900 3245661 3230602 3213917
62007 3213917 3196654 3179623 3162403 3143967 3124053 3103446 3082971 3062713 3042353 3021896 3001743
61996C001743j9655j9649k0612k2478k4932k7793l0913l3902l6249l7660l8066
61985B689834l7472l6101l4521l3215l2084l0736k9147k7601k6132k4614k3290
61974B354921k2570k2212k1413j9929j8443j7610j7264j6890j6374j5868j5398
61963B150950j4975j4787j4932j5205j5411j5553j5522j5008j3993j3015j2604
61952A989945j2647j2630j2293j1734j0988r809p980n713l620k126j001K77J723
61939A901404K877L847N579Q566J1897J4390J6270J8714K1995K5214K7833L0434
61927B089020L3637L7268M1017M5112M9894N5353O1476O8533P6661Q5738R5906
61916B739615J07681J21352J36889J54673J75584K00005K27478K57843K92074
$$ plain form
61996 3001743 2982088 2962439 2941827 2919349 2894417 2866624 2835711 2801809 2765560 2727900 2689834
61985 2689834 2652362 2616261 2581740 2548525 2516441 2485705 2456558 2428957 2402825 2378211 2354921
61974 2354921 2332351 2310139 2288726 2268797 2250354 2232744 2215480 2198590 2182216 2166348 2150950
61963 2150950 2135975 2121188 2106256 2091051 2075640 2060087 2044565 2029557 2015564 2002549 1989945
61952 1989945 1977298 1964668 1952375 1940641 1929653 1919844 1911864 1906151 1902531 1900405 1899404 1899681 1901404
61939 1901404 1904281 1908128 1913707 1922273 1934170 1948560 1964830 1983544 2005539 2030753 2058586 2089020
61927 2089020 2122657 2159925 2200942 2246054 2295948 2351301 2412777 2481310 2557971 2643709 2739615
61916 2739615 2847296 2968648 3105537 3260210 3435794 3635799 3863277 4121120 4413194
61907D413194L31452L76376M26626M82276N43669O10422O80570P50046Q12191
61898I426822Q57578Q74632Q51029P76094O44531M60235K37523j729k33585m37515
61888A3455615n99992p15486p85107q14173q10356p82497p39214o87369o31506
61879F889915n74466n18158m64085m13791l68812l29657k95180k63822k35330
61870C426614k10431j89023j69881j52272j36634j23260j11423j00336r0038q0782
61860B062534p2348o4532n7591n1617m6143m0810l5766l1059k6363k1795j8103
61849A596407j5505j3193j0586q241o824n956m920l810l086k578j819r67n29m67
61835A517926l01J98R82K083L406M533N265N951O782P281P109O789O960P366P340
$$ plain form
61907 4413194 4744646 5121022 5547648 6029924 6573593 7184015 7864585 8614631 9426822
61898 9426822 10284400 11159032 12010061 12786155 13430686 13890921 14128444 14126715 13893130 13455615
61888 13455615 12855623 12140137 11355030 10540857 9730501 8948004 8208790 7521421 6889915
61879 6889915 6315449 5797291 5333206 4919415 4550603 4220946 3925766 3661944 3426614
61870 3426614 3216183 3027160 2857279 2705007 2568373 2445113 2333690 2233354 2143316 2062534
61860 2062534 1990186 1925654 1868063 1816446 1770303 1729493 1693727 1662668 1636305 1614510 1596407
61849 1596407 1580902 1567709 1557123 1548882 1542058 1536102 1531182 1527372 1524286 1521708 1519889 1518922 1518393 1517926
61835 1517926 1517625 1517823 1518805 1520888 1524294 1528827 1534092 1540043 1546825 1554106 1561215 1568004 1574964 1582330 1589670
61820A589670O958O977P883R626J1938J4283J5874J6493J7002J8397K0724K3543
61808A759368K7031L1631L6810M1272M4557M7685N1934N7502O3585O9362P4778
61797B305515Q0479Q7145R4715J02522J10247J18492J28109J39348J51974J65951
61787C484497J81739K00048K21603K46769K75325L06982L42366L82999M30068
61778F072396M83728N44116O12431O90455P79331Q79183R89296J107717J230324
61769A3388977J350080J456128J532677J559193J513472J377140J141839Q14377
61761B4133883M18674p853m23119p90306j084445j294371j421231j474799j469096
61752A6587337j419124j339258j241999j136740j029781r25725q28184p39074
$$ plain form
61820 1589670 1596628 1603605 1611488 1621114 1633052 1647335 1663209 1679702 1696704 1715101 1735825 1759368
61808 1759368 1786399 1818030 1854840 1896112 1940669 1988354 2040288 2097790 2161375 2230737 2305515
61797 2305515 2385994 2473139 2567854 2670376 2780623 2899115 3027224 3166572 3318546 3484497
61787 3484497 3666236 3866284 4087887 4334656 4609981 4916963 5259329 5642328 6072396
61778 6072396 6556124 7100240 7712671 8403126 9182457 10061640 11050936 12158653 13388977
61769 13388977 14739057 16195185 17727862 19287055 20800527 22177667 23319506 24133883
61761 24133883 24552557 24544704 24121585 23331279 22246834 20952463 19531232 18056433 16587337
61752 16587337 15168213 13828955 12586956 11450216 10420435 9494710 8666526 7927452
61744G927452o58470n86064n22065m66181m16833l72457l32832k98226k68004
61735D006320k41194k17621j97304j79252j62212j46249j32289j20405j09724
61726B500070r9844r1129q3652p6975p1015o6014o1704n7445n3302m9950m7441
61715A741599m4940m1908l8645l5572l2738l0185k7988k5836k3240k0375j8034
61704A402138j6740j6342j6430j6536j6124j5150j4431j4633j5069j4515j3133
61693A233035j2395j2970j3860j3985j3548j3250j3081j2637j2005j1671j1836
61682A091797j2296j2715j2759j2293j1612j1177j0999j0689j0167r792r677r432
61670I58189q786p935p083o176n294m805m790m807m450l903l652l931m526m797
$$ plain form
61744 7927452 7268982 6682918 6160853 5694672 5277839 4905382 4572550 4274324 4006320
61735 4006320 3765126 3547505 3350201 3170949 3008737 2862488 2730199 2609794 2500070
61726 2500070 2400226 2309097 2225445 2148470 2077455 2011441 1949737 1892292 1838990 1789040 1741599
61715 1741599 1696659 1654751 1616106 1580534 1547796 1517611 1489623 1463787 1440547 1420172 1402138
61704 1402138 1385398 1369056 1352626 1336090 1319966 1304816 1290385 1275752 1260683 1246168 1233035
61693 1233035 1220640 1207670 1193810 1179825 1166277 1153027 1139946 1127309 1115304 1103633 1091797
61682 1091797 1079501 1066786 1054027 1041734 1030122 1018945 1007946 997257 987090 977298 967621 958189
61670 958189 949403 941468 934385 928209 922915 918110 913320 908513 904063 900160 896508 892577 888051 883254
61656H83254m054k340p94n29j126j099K0J000P92J62N46J927K940K830K269K069
61640H87867K057J616O97k43j003j655k002j660q30l88q78j718j883j159l23k13
61624H78282j058k566m140n027m894m368m495n501o573o982o795o347n697m922
61610H08917m309l850l203k462k329k975l559l413l036l160l532l441k885k281
61596G64482j488j74J193J800J734J776K115K291K389L197M939O754P799Q137
61582H06944Q300Q573R057R916J1223J2808J4418J5864J7056J8159J9586K1575
61570I73479K3900K6275K8623L0688L1834L1869L1586L1798L2151L1690L0286
61559A304179K8699K7445K6419K5518K4754K3818K2329K0542J9004J7565J5454
$$ plain form
61656 883254 879200 876860 876066 875537 874411 873312 873332 874332 875124 875286 875832 877759 880699 883529 885798 887867
61640 887867 889924 891540 892237 891994 890991 889336 887334 885674 884844 884456 883578 881860 879977 878818 878495 878282
61624 878282 877224 874658 870518 865491 860597 856229 851734 846233 839660 832678 825883 819536 813839 808917
61610 808917 804608 800758 797555 795093 792764 789789 786230 782817 779781 776621 773089 769648 766763 764482
61596 764482 762994 762820 764013 765813 767547 769323 771438 773729 776118 779315 784254 791008 798807 806944
61582 806944 815244 823817 832874 842790 854013 866821 881239 897103 914159 932318 951904 973479
61570 973479 997379 1023654 1052277 1082965 1114799 1146668 1178254 1210052 1242203 1273893 1304179
61559 1304179 1332878 1360323 1386742 1412260 1437014 1460832 1483161 1503703 1522707 1540272 1555726
61548A555726J2362Q764N135J565j851m946p846j0758j3415j5347j6637j7630
61536A495122j8123j7626j6413j5360j4646j3537j1543q965o080k755Q83M174
61524A375131O822R405J2656J6679K1182K6024L1238L6910M3194N0163N7701O5846
61512A752951P5046Q5600R7137J09258J22414J37379J54166J72331J91986K13409
61502C111677K35751K57276K76767K93301L04464L06219K95187K70258K31925
61493E582825J81567J22205N8792l403o0457j09735j49360j78702j98660k10651
61483E034421k15565k14089k07384j96796j83357j68002j51785j35373j18920
61474C443150j02690q7226p2536n7950m3316k9597j7548o524M585J5739K5901
$$ plain form
61548 1555726 1568088 1576852 1581987 1583552 1581701 1576755 1568909 1558151 1544736 1529389 1512752 1495122
61536 1495122 1476999 1459373 1442960 1427600 1412954 1399417 1387874 1378909 1372829 1370074 1370957 1375131
61524 1375131 1381953 1391358 1404014 1420693 1441875 1467899 1499137 1536047 1579241 1629404 1687105 1752951
61512 1752951 1827997 1913597 2010734 2119992 2242406 2379785 2533951 2706282 2898268 3111677
61502 3111677 3347428 3604704 3881471 4174772 4479236 4785455 5080642 5350900 5582825
61493 5582825 5764392 5886597 5945389 5941986 5881529 5771794 5622434 5443732 5245072 5034421
61483 5034421 4818856 4604767 4397383 4200587 4017230 3849228 3697443 3562070 3443150
61474 3443150 3340460 3253234 3180698 3122748 3079432 3049835 3032287 3025763 3030348 3046087 3071988
61463C071988L4393M1357M7056N1555N4957N7328N8458N8129N6555N4196N1307
61452C637279M8111M5163M3112M2131M1945M2357M3478M5525M8519N2106N5486
61441D145212N7707N8214N7036N4459N0791M6278M0972L4618K7084J8821J0401
61430D601593J755p508j7054k5781l3002l8925m3814m7426m9614n0687n0666m8914
61418D189957m5041l9716l4000k8306k2552j6886j1658o908k457J497M302N324
61406C993556M405J916j528n591j0425j6012k1410k5202k6755k6489k4780k1269
61394C820416j5500p614K072J3625K7213M2663N9686P8238R8348J19908J42784
61383D381839J66835J91637K16608K41505K66225K89781L09885L23816L29224
$$ plain form
61463 3071988 3106381 3147738 3194794 3246349 3301306 3358634 3417092 3475221 3531776 3585972 3637279
61452 3637279 3685390 3730553 3773665 3815796 3857741 3900098 3943576 3989101 4037620 4089726 4145212
61441 4145212 4202919 4261133 4318169 4372628 4423419 4469697 4510669 4545287 4572371 4591192 4601593
61430 4601593 4603348 4595840 4578786 4553005 4520003 4481078 4437264 4389838 4340224 4289537 4238871 4189957
61418 4189957 4144916 4105200 4071200 4042894 4020342 4003456 3991798 3984890 3982433 3983930 3988232 3993556
61406 3993556 3997961 3999877 3998349 3992758 3982333 3966321 3944911 3919709 3892954 3866465 3841685 3820416
61394 3820416 3804916 3797302 3799374 3812999 3840212 3882875 3942561 4020799 4119147 4239055 4381839
61383 4381839 4548674 4740311 4956919 5198424 5464649 5754430 6064315 6388131 6717355
61374F717355L24050L06417K75281K31142J76178J14187N0334j0211o4246j11224
61364H009263j51903j86910k16594k41361k61305k75989k85082k88935k88109
61355E813075k82787k73108k59842k44357k28081k12106j96929j82337j67801
61346C765727j53141j38514j23948j09377r5148q1764o9122n6702m4489l2898
61336B860624k1801j0641L91J0395J9272K7889L6284M3044M7320N0216N3125N5658
61324C171776N6477N5379N3232N0414M6669M2251L7973L4150L0496K7039K4221
61313C630077K2058K0042J7978J6268J5232J4651J4008J2722J0160N796n40q678
61301C769774j8086k7665l6110m2914m8698n4168n9119o2877o5184o6163o5839
$$ plain form
61374 6717355 7041405 7347822 7623103 7854245 8030423 8144610 8194944 8184733 8120487 8009263
61364 8009263 7857360 7670450 7453856 7212495 6951190 6675201 6390119 6101184 5813075
61355 5813075 5530288 5257180 4997338 4752981 4524900 4312794 4115865 3933528 3765727
61346 3765727 3612586 3474072 3350124 3240747 3145599 3063835 2994713 2938011 2893522 2860624
61336 2860624 2838823 2828182 2828573 2838968 2858240 2886129 2922413 2965457 3012777 3062993 3116118 3171776
61324 3171776 3228253 3283632 3336864 3387278 3433947 3476198 3514171 3548321 3578817 3605856 3630077
61313 3630077 3652135 3672177 3690155 3706423 3721655 3736306 3750314 3763036 3773196 3778992 3778452 3769774
61301 3769774 3751688 3724023 3687913 3644999 3596301 3542133 3483014 3420137 3354953 3288790 3222951
61290C222951o4335o2120n9460n5968n1231m5547l9528l3377k7165k1343j6365
61279B746512j2112q325n304l536l060l792n991r639j3744j7101j9470k1179k1961
61266B601298k1090j8512j4836j0302m686J779Q280J4399K0394K6453L2450L8732
61254B674359M6434N6586O9208Q3438R8225J12751J26473J38794J48539J53944
61244C708751J53391J45930J30723J06638P3281L2387j2396n7125r8516j33765
61234D049299j60582j77907j86180j86784j81498j72318j61071j48979j36755
61225B537225j25010j14143j03980r4128q4676p6026o8122o0472n2947m5979l9875
61214A671867l4466k9604k5404k1844j8479j4878j1022p140l382K65L928P669
$$ plain form
61290 3222951 3158616 3096496 3037036 2981068 2929837 2884290 2844762 2811385 2784220 2762877 2746512
61279 2746512 2734400 2726075 2720771 2717235 2714175 2710383 2704392 2694753 2681009 2663908 2644438 2623259 2601298
61266 2601298 2580208 2561696 2546860 2536558 2531872 2533651 2541931 2556330 2576724 2603177 2635627 2674359
61254 2674359 2720793 2777379 2846587 2930025 3028250 3141001 3267474 3406268 3554807 3708751
61244 3708751 3862142 4008072 4138795 4245433 4318714 4351101 4338705 4281580 4183064 4049299
61234 4049299 3888717 3710810 3524630 3337846 3156348 2984030 2822959 2673980 2537225
61225 2537225 2412215 2298072 2194092 2099964 2015288 1939262 1871140 1810668 1757721 1711742 1671867
61214 1671867 1637401 1607797 1582393 1560549 1542070 1527192 1516170 1509030 1505648 1505913 1509841 1517510
61202A517510J1256J4282J6780J9401K2527K5471K7071K6868K5180K2189J7738
61191A746273J2014N751l15n713r946j2676j4327j5838j7639j9361k0754k2243
61179A625226k4191k6150k7339k7542k7180k6723k6385k6260k6444k6955k7630
61168A332427k8121k8104k7717k7570k8011k8504k8237k7256k6369k5866k5017
61157A031655k3092k0313j7426j4791j2327r951p687n712m680n565q619j2664
61145H88828j6026j7996j8939j9179j8502j6880j4931j3304j1964j0417q393n992
61133G16305l397q38J304K745L622M338N016N419N476N623O388P711Q934R482
61119G78128R414R215R198R318R482R779J0266J0761J1115J1512J2199J3003J3438
$$ plain form
61202 1517510 1528766 1543048 1559828 1579229 1601756 1627227 1654298 1681166 1706346 1728535 1746273
61191 1746273 1758287 1764038 1763723 1758010 1748064 1735388 1721061 1705223 1687584 1668223 1647469 1625226
61179 1625226 1601035 1574885 1547546 1520004 1492824 1466101 1439716 1413456 1387012 1360057 1332427
61168 1332427 1304306 1276202 1248485 1220915 1192904 1164400 1136163 1108907 1082538 1056672 1031655
61157 1031655 1008563 988250 970824 956033 943706 933755 926068 920356 915676 910111 901492 888828
61145 888828 872802 854806 835867 816688 798186 781306 766375 753071 741107 730690 722297 716305
61133 716305 712908 712070 713374 716119 719741 724079 729095 734514 739990 745613 752001 759712 768646 778128
61119 778128 787542 796757 805955 815273 824755 834534 844800 855561 866676 878188 890387 903390 916828
61106I16828J3282J2579J1069Q161L825r22m858p559r277j0185j0353j0162j0108
61093I02320j0299j0611j1119j1856j2362j2168j1562j1183j0991j0442r615r205
61081G70907r332r294q704p936p251o376n242m280l545k510j079O9O01J008J531
61066G08567J643J241J291K409L750M185L804L399L119K629J930J201L44o39j333
61051G37540j557j616j449m56J207K343K465K622L617M700N109N566O860Q178
61037G75129Q420Q164Q663R829J0778J1589J2827J4101J4681J4881J5281J5347
61025I19690J4409J3221J2863J2881J2235J1292J1165J1750J2141J2281J2500
61014A056428J2369J1729J1934J4069J6960J8808J9765K1027K2636K4355K7286
$$ plain form
61106 916828 930110 942689 953758 961919 965744 964822 959964 952405 943128 932943 922590 912428 902320
61093 902320 892021 881410 870291 858435 846073 833905 822343 811160 800169 789727 780112 770907
61081 770907 761575 752281 743577 735641 728390 722014 716772 712492 708947 706437 705358 705427 706028 707036 708567
61066 708567 710210 711451 712742 715151 718901 723086 726890 730289 733408 736037 737967 739168 739512 738873 737540
61051 737540 735983 734367 732918 732462 733669 736012 738477 741099 744716 749416 754525 760091 766951 775129
61037 775129 783549 791713 800376 810205 820983 832572 845399 859500 874181 889062 904343 919690
61025 919690 934099 947320 960183 973064 985299 996591 1007756 1019506 1031647 1043928 1056428
61014 1056428 1068797 1080526 1092460 1106529 1123489 1142297 1162062 1183089 1205725 1230080 1257366
61003A257366L2208L7661M2171M6952N3660O1065O6755P0599P3593P5332P6081
60992A893443P9179Q7398R8865J10764J24551J42536J61843J77754J91010K05823
60982C273166K23288K43979K74115L20186L79560M46422N24837O24507P46930
60973G056990Q92271J079191J338135J684344K122888K676022L340899L965206
60965B4155946M208373L742976K566381J086751j51249q30451r53066o48978k0508
60956C3156175P75769J394721J410279O37195o78027k025901k992275l459158
60948B8218778l528351l345344l017127k625218k236007j884044j573147j302163
60940H707377j075963q92965p41233o12696n09243m31272l71294l22645k84854
$$ plain form
61003 1257366 1289574 1327235 1369406 1416358 1470018 1531083 1597838 1668437 1742030 1817362 1893443
60992 1893443 1972622 2060020 2158885 2269649 2394200 2536736 2698579 2876333 3067343 3273166
60982 3273166 3496454 3740433 4014548 4334734 4714294 5160716 5685553 6310060 7056990
60973 7056990 7949261 9028452 10366587 12050931 14173819 16849841 20190740 24155946
60965 24155946 28364319 32107295 34673676 35760427 35609178 34778727 33825661 33176683 33156175
60956 33156175 33931944 35326665 36736944 37374139 36696112 34670211 31677936 28218778
60948 28218778 24690427 21345083 18327956 15702738 13466731 11582687 10009540 8707377
60940 8707377 7631414 6738449 5997216 5384520 4875277 4444005 4072711 3750066 3465212
60931C465212k56649k32259k08644j88708j73616j58920j41713j24961j11150
60922A868592r8007q4255p3642o9038o7740o6293o5152o4900o2806n7213n1116
60911A108430m7384m4234l9093l3319k9344k6503k3310k0767j9918j8917j5909
60900G89732j2318j0209q962p330o146o098n466k933k26Q14J251K553L650L256
60886G41568K631L174L599K323L69q20k157m782p328q221q580r986j1360j0953
60872F89477r623r276r695r530q919q531p672n744m028l630l300j603N28J620
60858F10074K264L530M688M851N088O396P535P436P700J0042J3111J4770J5653
60845G13138J7428J9298J9508J8847J9327K0472K0182J8409J6886J5899J4170
$$ plain form
60931 3465212 3208563 2976304 2767660 2578952 2405336 2246416 2104703 1979742 1868592
60922 1868592 1770585 1686330 1612688 1543650 1475910 1409617 1344465 1279565 1216759 1159546 1108430
60911 1108430 1061046 1016812 977719 944400 915056 888553 865243 844476 824558 805641 789732
60900 789732 777414 767205 758243 750913 744767 738669 733203 730270 730044 730858 732109 734662 738312 741568
60886 741568 744199 747373 750972 753295 753664 752844 750687 745905 738577 730356 721776 711790 700430 689477
60872 689477 679854 670578 660883 651353 642434 633903 626231 620487 616459 612829 609529 607926 608454 610074
60858 610074 612338 615868 620556 625407 630495 636891 644426 651862 659562 669604 682715 697485 713138
60845 713138 730566 749864 769372 788219 807546 828018 848200 866609 883495 899394 913564
60834I13564J1401Q321M904J065j652j648J46J521J921J893Q15k115n539p416
60820I27181q122r484j1458j2473j2429j2587j2995j2683j2092j2636j3984j4261
60808G81977j2968j1464j0623j0005r239q359p035n157l736l549l581k583j252
60795F92426q78q23M35K527L873M433N420O791P488P753Q885J0882J2484J3312
60781G75008J4003J4551J4491J4276J4562J4690J3757J2459J1965J1770J0775
60770I22307R549R233R137P996O603O457O669N178K513J094J151N77j135k074
60756I85255j437q19j315k147k817m045n716o317n357m240l942l788l188k779
60742I37348l115l912n129p062r054r823r435r231r541r230p880o506n722m936
$$ plain form
60834 913564 924965 933286 938190 939255 937603 935955 936101 937622 939543 941436 942251 940136 934597 927181
60820 927181 919059 909575 898117 885644 873215 860628 847633 834950 822858 810222 796238 781977
60808 781977 769009 757545 746922 736917 727678 719319 712284 707127 703391 699842 696261 693678 692426
60795 692426 691548 690725 691160 693687 697560 701993 707413 714204 721692 729445 738330 749212 761696 775008
60781 775008 789011 803562 818053 832329 846891 861581 875338 887797 899762 911532 922307
60770 922307 931856 941089 950226 958222 964825 971282 977951 983129 985642 986736 987887 988464 987329 985255
60756 985255 983818 982999 981684 979537 976720 972675 966959 960642 955285 951045 947103 943315 940127 937348
60742 937348 934233 930321 925192 918130 909076 899253 889818 880587 871046 861816 853936 847430 841708 836772
60728H36772l770k727j991j100m2P35J437K547L424L047K049K090L146L362J854
60713H50833j61j411j970k329k595k891l228l002j957j236j902k997k945k306
60699H19903k897m646n794n980o506p617q232q444r514j1119j1484j0673j0833
60686G16164j2447j3241j1867r967r316r419r275r172r217q312o135m222l557
60673F00017k863q07J767L326L895M350M779M936N168N645N707M989M198L909
60659F49016L686L194K978L353L738L801M064M628M734M238M177N042N880N969
60645G08498O003O686P409P311O551N672M824M329M871O372P755Q467R111J0062
60631H03921J0789J1131J1846J3096J3783J3171J1997J1085J0098Q431O289M066
$$ plain form
60728 836772 833002 830275 828284 827184 827142 827877 829314 831861 835285 838332 840381 842471 845617 848979 850833
60713 850833 850672 849261 847291 844962 842367 839476 836248 833246 831289 830053 828151 825154 822209 819903
60699 819903 817006 812360 806566 800586 794080 786463 778231 769787 760273 749154 737670 726997 716164
60686 716164 703717 690476 678609 668642 659326 649907 640632 631460 622243 613931 607796 603574 600017
60673 600017 597154 596347 598114 601440 605335 609685 614464 619400 624568 630213 635920 640909 645107 649016
60659 649016 652702 655896 658874 662227 665965 669766 673830 678458 683192 687430 691607 696649 702529 708498
60645 708498 714501 721187 728596 735907 742458 748130 752954 757283 762154 768526 776281 784748 793859 803921
60631 803921 814710 825841 837687 850783 864566 877737 889734 900819 910917 919348 925637 929703
60619I29703J741m55j954k986m653p214r472j0509j0863j1273j1480j0958r763
60606H39864q020n577k753l48J549L587N600O339N225L152J010j269l751n826
60592H38782p000p239o253l844j098L66O63J428L030L929L398K740K941L082K207
60577H37132R67K06m33j279j566q97k76m17l93O99K053K435K007J554R96j03j488
60560H41197k824m429o460q209r089r353r117p860n730l995l334k841j643k25
60546G66088Q25K099M180O404P974R253J0894J2721J4542J7126K1208K6400L2027
60533I31741L8223M5211N2292N8185O1580O0906N4848M3770K9613J3887k826j9019
60521A368411l1848l9656m3297m3908m1132l4774k6673j9118j2619o630j356K617
$$ plain form
60619 929703 931444 930989 929035 926049 921396 914182 904710 894201 883338 872065 860585 849627 839864
60606 839864 831844 826267 823514 823166 824715 828302 833902 840241 845466 848618 849628 848359 844608 838782
60592 838782 831782 824543 818290 814446 813348 813714 814377 815805 818835 822764 826162 828902 831843 834925 837132
60577 837132 838099 838305 837872 836593 835027 834130 833854 833437 833044 833743 835796 838231 840238 841792 842788 842685 841197
60560 841197 838373 833944 827484 819275 810186 800833 791716 783856 778126 774131 770797 767956 766313 766088
60546 766088 766913 769012 773192 779596 787570 796823 807717 820438 834980 852106 873314 899714 931741
60533 931741 969964 1015175 1067467 1125652 1187232 1248138 1302986 1346756 1376369 1390256 1387430 1368411
60521 1368411 1336563 1296907 1253610 1209702 1168570 1133796 1107123 1088005 1075386 1068756 1067400 1070017
60509A070017N482P578Q412P642O183N244N023N385O809R534J2760J5836J9398
60496A185303K4300L0294L6807M4066N2528O2085P2563Q3805R4483J02348J06897
60485A895479J10536J15912J23408J32789J45941J66136J95250K33138K78940
60476C397529L30791L83687M28241M52163M44086L98208L16614K06905P8111n9679
60466F376656j92741l05123l85522m31913m48711m41640m16710l81160l41772
60457C031364l02367k64559k29957j99897j74057j51292j31279j14032r8754q4771
60447A280399p2683o3168n5493m8580m2470l7468l2937k8429k4820k2841k1599
60436H29911k0070j8796j8483j8179j6758j4941j3910j2991j0821p933o066n544
$$ plain form
60509 1070017 1075499 1083077 1091489 1099131 1105314 1110558 1115581 1120966 1127775 1137309 1150069 1165905 1185303
60496 1185303 1209603 1239897 1276704 1320770 1373298 1435383 1507946 1591751 1686234 1788582 1895479
60485 1895479 2006015 2121927 2245335 2378124 2524065 2690201 2885451 3118589 3397529
60476 3397529 3728320 4112007 4540248 4992411 5436497 5834705 6151319 6358224 6436335 6376656
60466 6376656 6183915 5878792 5493270 5061357 4612646 4171006 3754296 3373136 3031364
60457 3031364 2728997 2464438 2234481 2034584 1860527 1709235 1577956 1463924 1365170 1280399
60447 1280399 1207716 1144548 1089055 1040475 998005 960537 927600 899171 874351 851510 829911
60436 829911 809841 791045 772562 754383 737625 722684 708774 695783 684962 677029 670963 665419
60424F65419n308m943m765m478l612k785k746k724j530K65J057P11M55P05P72
60409F36493N01N35J027J551K077K786L312L372L681M909O322O770O440O298O453
60394F92527O430O356O531O460N670M806M592M499L733K579J461j51k342l567
60380G39584k754j448j758l222l876l467l291l545l300k662k561k682j857l30
60366G02831N41O91J245K198K341J622J420K255L117L356L498L928M335M689N352
60351G43419O140O515O719P332Q076Q385Q724R805J0941J0912J0074R824J0273
60338H57139J0331R857R814J0323J0418R825R267Q987Q580Q329R142J1097J3548
60325I86657J6554K0596K4970K7976K8735K7456K4117J8367J0602J761p655j6991
$$ plain form
60424 665419 660111 655168 650403 645925 642313 639528 636782 634058 632528 632793 633850 634561 635016 635721 636493
60409 636493 636994 637529 638556 640107 642184 644970 648282 651654 655335 660244 666566 673336 679776 686074 692527
60394 692527 698957 705313 711844 718304 723974 728780 733372 737871 741604 744183 745644 745493 743151 739584
60380 739584 736830 735382 733624 730402 726526 723059 719768 716223 712923 710261 707700 705018 703161 702831
60366 702831 703372 704063 705308 707506 709847 711469 712889 715144 718261 721617 725115 729043 733378 738067 743419
60351 743419 749559 756074 762793 770125 778201 786586 795310 805115 816056 826968 837042 846866 857139
60338 857139 867470 877327 887141 897464 907882 917707 926974 935961 944541 952870 962012 973109 986657
60325 986657 1003211 1023807 1048777 1076753 1105488 1132944 1157061 1175428 1186030 1187791 1180136 1163145
60313A163145k4487k8611k9912k9925k8811k6012k2500k0113j8849j7031j4131
60302I02763j1361r389p670o153n578n661m935k838m79J033J615J517J088J152
60288H55104K211L329L215K193J573J586J575J688K453L183K828K012K139K920
60274H88009L076K961L982N687O203N515N558O908Q192R124J1133J4334J6668
60261I87350J7184J7612J9578K2482K5301K8367L2085L5728L8760M1855M5688
60250A311990N0100N5099O1147O7939P4525Q1079Q8838R7851J06706J14809J22941
60239B233024J31027J37448J41295J43187J43167J39901J32853J23162J11499
60230C436563R7139Q0140O2370M5160K7812R633q331k4772l9498n2162o1327o6180
$$ plain form
60313 1163145 1138658 1110047 1080135 1050210 1021399 995387 972887 952774 933925 916894 902763
60302 902763 891402 882013 874343 868190 862612 856951 852016 849178 848699 849732 851347 852864 853952 855104
60288 855104 857315 860644 863859 866052 867625 869211 870786 872474 874927 878110 880938 882950 885089 888009
60274 888009 891085 894046 898028 903715 909918 915433 920991 927899 936091 945215 956348 970682 987350
60261 987350 1004534 1022146 1041724 1064206 1089507 1117874 1149959 1185687 1224447 1266302 1311990
60250 1311990 1362090 1417189 1478336 1546275 1620800 1701879 1790717 1888568 1995274 2110083 2233024
60239 2233024 2364051 2501499 2642794 2785981 2929148 3069049 3201902 3325064 3436563
60230 3436563 3533702 3613842 3676212 3721372 3749184 3758817 3750486 3725714 3686216 3634054 3572727 3506547
60218C506547o7728o7132o4192n8477n0542m0966k9635j6885l850R241K3642L9913
60206C179936N6782P3092Q9210J05327J20002J31806J41007J48208J52541J52519
60196D350430J47659J38163J24154J06313Q6232O4960M2207J7875o770l0383n2861
60185D987979p4276r3496j08944j19907j26258j27714j24301j16829j06237r3125
60175C896892p8220o2314m5386k6905p372J1674K9517M6802O3721P9090R1680
60164C999179J01064J06576J06968J01904R2626Q0478O5948M9570L2351J4805
60154D751469l098k0536l5755m7662n6174o0728o0296n5168m6890l6016k1762
60143D307384m425J4104L2894N2898P4554R6571J18236J40801J65387J91453K18528
$$ plain form
60218 3506547 3438819 3371687 3307495 3249018 3198476 3157510 3127875 3110990 3107140 3116381 3140023 3179936
60206 3179936 3236718 3309810 3399020 3504347 3624349 3756155 3897162 4045370 4197911 4350430
60196 4350430 4498089 4636252 4760406 4866719 4952951 5017911 5060118 5077993 5071223 5040840 4987979
60185 4987979 4913703 4820207 4711263 4591356 4465098 4337384 4213083 4096254 3990017 3896892
60175 3896892 3818672 3756358 3710972 3684067 3676695 3688369 3717886 3764688 3828409 3907499 3999179
60164 3999179 4100243 4206819 4313787 4415691 4508317 4588795 4654743 4704313 4736664 4751469
60154 4751469 4748371 4727835 4692080 4644418 4588244 4527516 4467220 4412052 4365162 4329146 4307384
60143 4307384 4302959 4317063 4349957 4402855 4477409 4573980 4692216 4833017 4998404 5189857 5408385
60132E408385K47532K78864L10903L41747L70830L97642M20504M37907M49471
60123H663785M54350M50444M36499M13452L82436L43242K96089K43094J86391
60114A1869782J26333O3044j838o6570j30746j93628k52449l04077l47094l80704
60104A0382053m03019m12463m09858l97415l76577l48316l14530k77386k37903
60095G204586j96418j53776j10977o8479k6849J2785M9702Q3860J14467J39571
60085G048472J57757J68837J72135J66018J50260J27067R8655O5751K9765n882
60075H178835l8473o8365r6770j22900j45320j64472j81590j96164k06670k12798
60065F745313k15167k13767k08510k00448j90683j78938j64662j48621j31916
$$ plain form
60132 5408385 5655917 5934781 6245684 6587431 6958261 7355903 7776407 8214314 8663785
60123 8663785 9118135 9568579 10005078 10418530 10800966 11144208 11440297 11683391 11869782
60114 11869782 11996115 12059159 12057321 11990751 11860005 11666377 11413928 11109851 10762757 10382053
60104 10382053 9979034 9566571 9156713 8759298 8382721 8034405 7719875 7442489 7204586
60095 7204586 7008168 6854392 6743415 6674936 6648087 6660872 6710574 6794434 6908901 7048472
60085 7048472 7206229 7375066 7547201 7713219 7863479 7990546 8089201 8154952 8184717 8178835
60075 8178835 8140362 8071997 7975227 7852327 7707007 7542535 7360945 7164781 6958111 6745313
60065 6745313 6530146 6316379 6107869 5907421 5716738 5537800 5373138 5224517 5092601
60056E092601j14409r5528p5565n4772l2450q370J6066L9652O2929Q6417J08641
60045E025212J27691J43472J56470J65529J68714J65459J56154J40679J19099
60036F368479R2826O3572L2098o92l2871o3239r2459j20651j45494j64538j77827
60025E759204j86245j89050j85456j77114j66349j53156j36596j18055j00102
60016D347081q2875o4448m4374k4213m659J5307L6414N8353Q1007J04511J28233
60005D550337J51327J73872J95812K15207K29235K36435K36394K28203K11254
59996F428076J87022J58130J26127R1681N6011K0142j6331n3663q9887j22318
59986F784990j50161j73425j90324j98507j98289j92111j81217j65444j45971
$$ plain form
60056 5092601 4978192 4882664 4807099 4752327 4719877 4711507 4727573 4767225 4830154 4916571 5025212
60045 5025212 5152903 5296375 5452845 5618374 5787088 5952547 6108701 6249380 6368479
60036 6368479 6461305 6524877 6556975 6556283 6523412 6460173 6367714 6247063 6101569 5937031 5759204
60025 5759204 5572959 5383909 5198453 5021339 4854990 4701834 4565238 4447183 4347081
60016 4347081 4264206 4199758 4155384 4131171 4126512 4141819 4178233 4236586 4317593 4422104 4550337
60005 4550337 4701664 4875536 5071348 5286555 5515790 5752225 5988619 6216822 6428076
59996 6428076 6615098 6773228 6899355 6991036 7047047 7067189 7050858 6997195 6907308 6784990
59986 6784990 6634829 6461404 6271080 6072573 5874284 5682173 5500956 5335512 5189541
59977E189541j25423j05034q3957o1645l8762j5677P826L1094N2646P1908Q9312
59966E011829J04829J17844J28253J35995J39974J39152J34289J26784J16506
59957F155455J02677Q6265O9251N2055L4067J6372J381j0103j9068k5475k7581
59946F435296k4248j5774k349J6294L9471O5912R5672J29798J67988K08584K50959
59935G367603K95912L43258L90856M36244M77547N12407N37586N49670N44953
59926A1456036N19083M68906L94894L00598J90394O9623n3881j71177k75622l63454
59916A2535400m31781m78626n04926n14023n08669m90395m61688m26321l87070
59907H331901l44981l01133k57246k14188j71720j29860q8883m8120o834L3786
$$ plain form
59977 5189541 5064118 4959084 4875127 4813482 4774720 4759043 4766869 4797963 4850609 4922517 5011829
59966 5011829 5116658 5234502 5362755 5498750 5638724 5777876 5912165 6038949 6155455
59957 6155455 6258132 6344397 6413648 6465703 6499770 6516142 6517523 6507420 6488352 6462877 6435296
59946 6435296 6411048 6395274 6392925 6409219 6448690 6514602 6610274 6740072 6908060 7116644 7367603
59935 7367603 7663515 8006773 8397629 8833873 9311420 9823827 10361413 10911083 11456036
59926 11456036 11975119 12444025 12838919 13139517 13329911 13399534 13345653 13174476 12898854 12535400
59916 12535400 12103619 11624993 11120067 10606044 10097375 9606980 9145292 8718971 8331901
59907 8331901 7986920 7685787 7428541 7214353 7042633 6912773 6823890 6775770 6768936 6802722
59897F802722P1602J06492J40224J73177K03232K27945K45673K54400K51650K36157
59887H713274K07963J67012J13690N0769j7259q6737j54818k17356k69787l10397
59877H196354l40281l59847l68022l65304l54797l39288l19603k96496k71714
59868E181002k46351k20333j94250j69638j46784j24606j03303q4851p0128n8022
59858C762736m8272m2515m1354m2681m4315m6169m8401m9529m7977m3881l7981
59847C269661l0288k1124j2033m369J728N897O603K709n133j5512k7416l9582
59835C131141n0133n7766o2336o3845o2189n8245n3590m8578m2250l4540k6841
59824B570828j9867j2745m894L022J0770J9372K9371L9781M9424N7784O4042O7220
$$ plain form
59897 6802722 6874324 6980816 7121040 7294217 7497449 7725394 7971067 8225467 8477117 8713274
59887 8713274 8921237 9088249 9201939 9252708 9235449 9148712 8993894 8776538 8506751 8196354
59877 8196354 7856073 7496226 7128204 6762900 6408103 6068815 5749212 5452716 5181002
59868 5181002 4934651 4714318 4520068 4350430 4203646 4079040 3975737 3890886 3820758 3762736
59858 3762736 3714464 3671949 3630595 3587914 3543599 3497430 3449029 3399500 3351523 3307642 3269661
59847 3269661 3239373 3218249 3206216 3201847 3203575 3209472 3216075 3218784 3213651 3198139 3170723 3131141
59835 3131141 3081008 3023242 2960906 2897061 2834872 2776627 2723037 2674459 2632209 2597669 2570828
59824 2570828 2550961 2538216 2533322 2536344 2547114 2566486 2595857 2635638 2685062 2742846 2806888 2874108
59812B874108O8052O9038P1790P5765P9918Q3552Q4929Q1207P1061N5931L8159
59801C653510J9668K816r883j8026k3346k6476k5878k0902j3497n398M229J6605
59789C553422L0776M5163O0103P7002R6190J17390J41173J68372J98981K33121
59779D721693K72188L17614L68837M23206M76438N21600N48036N42791M94511
59770H686914L98369K60491R8713o3145k04448l13056l84558m20021m25291m09274
59760G224694l80137l43289l02763k62337k24148j88110j54024j22925r5535p0948
59750E080478m8004k6521o388J3015L1680M8906O5144Q2206J00754J19423J37366
59739E598059J55819J76027J97503K19583K43040K68890K97110L27709L61493
$$ plain form
59812 2874108 2942160 3011198 3082988 3158753 3238671 3322223 3407152 3488359 3559420 3615351 3653510
59801 3653510 3673178 3675994 3666111 3648085 3624739 3598263 3572385 3551483 3537986 3532588 3536817 3553422
59789 3553422 3584198 3629361 3689464 3766466 3862656 3980046 4121219 4289591 4488572 4721693
59779 4721693 4993881 5311495 5680332 6103538 6579976 7101576 7649612 8192403 8686914
59770 8686914 9085283 9345774 9444487 9381342 9176894 8863838 8479280 8059259 7633968 7224694
59760 7224694 6844557 6501268 6198505 5936168 5712020 5523910 5369886 5246961 5151426 5080478
59750 5080478 5032474 5005953 4999565 5012580 5044260 5093166 5158310 5240516 5341270 5460693 5598059
59739 5598059 5753878 5929905 6127408 6346991 6590031 6858921 7156031 7483740 7845233
59730G845233L98727M38620M81071N27109N76484O26473O74092P17504P54144
59721A3039457P79504P89431P82194P57459P15585O59846N97616N37444M85908
59712A9144444M47995M28045M28126M46828M81107N27864N82384O37234O84787
59703B3808814P19570P36886P31028O97231O34370N44491M31278L00751J61944
59694B8766363K4706j02662k13053l00118l60222l93543m01570l85005l45536
59685B6289360k87724k16633j34692m2562N8366J66355K80974M02201N28794O59053
59675B7703492P91856R24803J052124J165788J257235J316199J329383J283182
59667C6824062J168060R80246P22226M05081M9950l15599o63894r71025j218448
$$ plain form
59730 7845233 8243960 8682580 9163651 9690760 10267244 10893717 11567809 12285313 13039457
59721 13039457 13818961 14608392 15390586 16148045 16863630 17523476 18121092 18658536 19144444
59712 19144444 19592439 20020484 20448610 20895438 21376545 21904409 22486793 23124027 23808814
59703 23808814 24528384 25265270 25996298 26693529 27327899 27872390 28303668 28604419 28766363
59694 28766363 28791069 28688407 28475354 28175236 27815014 27421471 27019901 26634896 26289360
59685 26289360 26001636 25785003 25650311 25607749 25666115 25832470 26113444 26515645 27044439 27703492
59675 27703492 28495348 29420151 30472275 31638063 32895298 34211497 35540880 36824062
59667 36824062 37992122 38972368 39694594 40099675 40149625 39834026 39170132 38199107 36980659
59658C6980659j395246j499619j536757j515193j445544j340465j213087j075718
59650B5959030r41536q26509p47160p15376p34309p96404q83593r71947j040596
59641A8301600j078423j083479j058828j010540r46899q75676q01719p28122o58153
59632A0059761n93974n34950m79712m29022l84525l45610l09972k76600k46084
59623F459312k18517j93200j69902j48591j28471j09122r1849p8022o6824n6594
59613E198220m7687m2006m0237m1565m5586n2498o1745p2197q3265r4223j03148
59602D514063j08342j10380j11000j10528j08027j03358r7257q9886q1042p1481
59592C522762o2413n3979m5588l7141k8726j9930j0811k618L852R537J5303K0111
$$ plain form
59658 36980659 35585413 34085794 32549037 31033844 29588300 28247835 27034748 25959030
59650 25959030 25017494 24190985 23443825 22728449 21994140 21197736 20314143 19342196 18301600
59641 18301600 17223177 16139698 15080870 14070330 13123431 12247755 11446036 10717914 10059761
59632 10059761 9465787 8930837 8451125 8022103 7637578 7291968 6981996 6705396 6459312
59623 6459312 6240795 6047595 5877693 5729102 5600631 5491509 5399660 5321638 5254814 5198220
59613 5198220 5150533 5108527 5068290 5026725 4981139 4928641 4866896 4794699 4711434 4617211 4514063
59602 4514063 4405721 4295341 4184341 4073813 3965786 3862428 3765171 3675285 3594243 3522762
59592 3522762 3460349 3406370 3360782 3323641 3294915 3274985 3264174 3261556 3265408 3274945 3290248 3310359
59580C310359K2834K4523K6817K9183K9919K8997K7707K6369K4627K3337K3938
59569C598610K6448L0132L5454M3268N2620O1630P0174P9661R0569J02195J14460
59558D305221J27993J42681J57964J74274J92526K12496K33240K54513K76244
59549F077152K97269L16173L32587L46133L55021L57476L53668L44717L30931
59540I111127L12678K91673K69520K46397K22957K01324J81534J59119J30000
59531A1126329R6941O7820M8121L8225L7082M4569N9952Q1307J07015J35226J61710
59520A2004297J80779J88527J83002J61993J23776P0173N837o5805j43257k23545
59510A2485777l01033l70387m28492m73389n03858n20629n25690n20040n03991
$$ plain form
59580 3310359 3333193 3357716 3384533 3413716 3443635 3472632 3500339 3526708 3551335 3574672 3598610
59569 3598610 3625058 3655190 3690644 3733912 3786532 3848162 3918336 3997997 4088566 4190761 4305221
59558 4305221 4433214 4575895 4733859 4908133 5100659 5313155 5546395 5800908 6077152
59549 6077152 6374421 6690594 7023181 7369314 7724335 8081811 8435479 8780196 9111127
59540 9111127 9423805 9715478 9984998 10231395 10454352 10655676 10837210 10996329 11126329
59531 11126329 11223270 11291090 11339211 11377436 11414518 11459087 11519039 11600346 11707361 11842587 12004297
59520 12004297 12185076 12373603 12556605 12718598 12842374 12912547 12918384 12852579 12709322 12485777
59510 12485777 12184744 11814357 11385865 10912476 10408618 9887989 9362299 8842259 8338268
59501H338268m79612m50352m18105l83057l46453l10859k77398k45288k14542
59492E212602j86595j61770j38554j16119r5325p6600n8935m1543k4561p712R806
59481D314694K7756M5107O2010P9654R8125J16519J35225J55824J78484K01668
59471E415066K24537K47378K69459K88789L04195L15304L20197L15488K99181
59462G999594K71408K32300J81736J21552N5579j3015q2129j48411k07278k56044
59452H155292k94695l23226l40726l47797l47199l41135l29997l14499k96630
59443E219388k77640k57251k35738k14742j95253j76740j58982j42823j28521
59434C431698j15252j02741r1521q1258p0874o0567n1528m3507l5034k6243j8877
$$ plain form
59501 8338268 7858656 7408304 6990199 6607142 6260689 5949830 5672432 5427144 5212602
59492 5212602 5026007 4864237 4725683 4609564 4514239 4437639 4378704 4337161 4312600 4304888 4314694
59481 4314694 4342450 4387557 4449567 4529221 4627346 4743865 4879090 5034914 5213398 5415066
59471 5415066 5639603 5886981 6156440 6445229 6749424 7064728 7384925 7700413 7999594
59462 7999594 8271002 8503302 8685038 8806590 8862169 8849154 8767025 8618614 8411336 8155292
59452 8155292 7860597 7537371 7196645 6848848 6501649 6160514 5830517 5516018 5219388
59443 5219388 4941748 4684497 4448759 4234017 4038764 3862024 3703042 3560219 3431698
59434 3431698 3316446 3213705 3122184 3040926 2970052 2909485 2857957 2814450 2779416 2753173 2734296
59423B734296j3206p630j699L253O927J0648J4583J7286J8740K0863K4426K8605
59411B857092L4069M2416N1126N3437M5974L3562K3942K0484K2382K8768L9055
59400C252307N1506O5069Q1326J01204J20712J33365J37171J37063J40318J51192
59390D371233J69898J94738K24230K57817K95239L35907L79428M26272M76672
59381G131434N29028N80516O28840O71627P04444P21870P21114P02840O68605
59372A3060318O20040N60966M97452M34419L73993L17821K68296K26164J89067
59363A6548536J53905J18844Q2019M0468p959o3150j24063j89510k56216l18142
59353A5984732l69360m06656m28900m36204m31167m19034m04964l92153l83052
$$ plain form
59423 2734296 2721090 2713460 2711761 2715014 2721941 2732589 2747172 2764458 2783198 2804061 2828487 2857092
59411 2857092 2891161 2933577 2984703 3038140 3084114 3117676 3141618 3162102 3184484 3213252 3252307
59400 3252307 3303813 3368882 3450208 3551412 3672124 3805489 3942660 4079723 4220041 4371233
59390 4371233 4541131 4735869 4960099 5217916 5513155 5849062 6228490 6654762 7131434
59381 7131434 7660462 8240978 8869818 9541445 10245889 10967759 11688873 12391713 13060318
59372 13060318 13680358 14241324 14738776 15173195 15547188 15865009 16133305 16359469 16548536
59363 16548536 16702441 16821285 16903304 16943772 16935813 16872663 16748600 16559090 16302874 15984732
59353 15984732 15615372 15208716 14779816 14343612 13912445 13493411 13088447 12696294 12313242
59344A2313242l80102l83866l92248m02816m14292m24830m31098m30703m23910
59335H629377m11783l94451l72496l48007l22655k96236k68497k40758k14431
59326E760063j89473j65599j43374j22871j03010q3497o5698n0379l6370k2749
59316D777043j0465l75Q416J6625K2985K6047K6270K4763K1499J6224R619K135
59304D940786o846j7296k7447l5774m2580m8418n2608n4541n4747n3305m8988
59293D498236m1486l2651k3992j4613l178R808K3309L7656N3407O9772Q5824J01945
59281D764037J18559J34860J50166J65074J79869J93285K04066K12039K16364
59272F338319K14718K05849J91122J72003J48005J19039Q7830N7527K8096k918
$$ plain form
59344 12313242 11933140 11549274 11157026 10754210 10339918 9915088 9483990 9053287 8629377
59335 8629377 8217594 7823143 7450647 7102640 6779985 6483749 6215252 5974494 5760063
59326 5760063 5570590 5404991 5261617 5138746 5035736 4952239 4886541 4836162 4799792 4777043
59316 4777043 4766578 4766203 4774619 4791244 4814229 4840276 4866546 4891309 4912808 4929032 4938651 4940786
59304 4940786 4933940 4916644 4889197 4853423 4810843 4762425 4709817 4655276 4600529 4547224 4498236
59293 4498236 4456750 4424099 4400107 4385494 4382316 4392124 4415433 4453089 4506496 4576268 4662092 4764037
59281 4764037 4882596 5017456 5167622 5332696 5512565 5705850 5909916 6121955 6338319
59272 6338319 6553037 6758886 6950008 7122011 7270016 7389055 7476885 7534412 7562508 7559590
59262G559590l6871p2583j07041j36188j56600j68093j73607j75532j73866j68905
59252F190304j63087j58301j53448j46806j38874j30796j21910j11205r9589q8249
59242D878039p6212o1775m5187k7694r176J1254L3461N7072Q2918J11743J42709
59231E097152J75011K09699K48082K89575L32812L77327M22022M63268M96478
59222H111426N18399N26195N16022M84873M32805L61615K72782J68718N4571o3395
59212A1384011j80002k89992l86550m63725n19433n54186n68471n63755n44567
59203G313330n16551m82942m45006m04794l65060l27164k91356k58480k29387
59194C992590k03386j79242j57098j37745j20875j05739r2555q1573p1821o2460
$$ plain form
59262 7559590 7522719 7450136 7343095 7206907 7050307 6882214 6708607 6533075 6359209 6190304
59252 6190304 6027217 5868916 5715468 5568662 5429788 5298992 5177082 5065877 4966288 4878039
59242 4878039 4801827 4740052 4694865 4667171 4657995 4669249 4702710 4759782 4842700 4954443 5097152
59231 5097152 5272163 5481862 5729944 6019519 6352331 6729658 7151680 7614948 8111426
59222 8111426 8629825 9156020 9672042 10156915 10589720 10951335 11224117 11392835 11447406 11384011
59212 11384011 11204009 10914017 10527467 10063742 9544309 8990123 8421652 7857897 7313330
59203 7313330 6796779 6313837 5868831 5464037 5098977 4771813 4480457 4221977 3992590
59194 3992590 3789204 3609962 3452864 3315119 3194244 3088505 2995950 2914377 2842556 2780096
59184B780096n4132m7407m1233l4664k8579k3822j9224j3547p758l209Q20N543
59172B512884J0191J3614J6837K1477K6904L1515L5581M0297M5260M9507N3782
59161B857849N9104O4220O7264O8887P0960P3098P3234P0929O7293O2384N5291
59150C590513M6324L6595K6078J4417K883o917j5512k4334l2809l9208m3544m7009
59138C507477m9272m8971m6354m2835l8492l2403k4952j7373r556o57Q777J7613
59126C223002K6472L6868M8654O0586P2665Q5533R8363J09918J21050J33625J47615
59115D164351J61607J75504J90282K05733K20923K36193K52318K68308K82383
59106F157602K94105L03025L06080K99057K79957K48617K04362J47076P9952Q206
$$ plain form
59184 2780096 2725964 2678557 2637324 2602660 2574081 2550259 2531035 2517488 2509730 2506521 2507341 2512884
59172 2512884 2523075 2536689 2553526 2575003 2601907 2633422 2669003 2709300 2754560 2804067 2857849
59161 2857849 2916953 2981173 3048437 3117324 3188284 3261382 3334616 3405545 3472838 3535222 3590513
59150 3590513 3636837 3673432 3699510 3713927 3716810 3709893 3694381 3670047 3637238 3598030 3554486 3507477
59138 3507477 3458205 3409234 3362880 3320045 3281553 3249150 3224198 3206825 3197269 3196612 3205389 3223002
59126 3223002 3249474 3286342 3334996 3395582 3468247 3553780 3652143 3762061 3883111 4016736 4164351
59115 4164351 4325958 4501462 4691744 4897477 5118400 5354593 5606911 5875219 6157602
59106 6157602 6451707 6754732 7060812 7359869 7639826 7888443 8092805 8239881 8319833 8328039
59096H328039o4311j34794j99000k52471k93821l24102l43624l52268l52074l46192
59086E665382l35744l20561l02246k83342k64175k43802k23354k05055j88594
59077C298509j72102j56172j43120j32555j21713j10199j00505r3321q6282p8074
59067B104466p0271o4151n8910n3944m9876m6455m2329l7655l4208l2159k9492
59056A585016k5375k1481j9164j7816j6713j6160j6129j6024j6254j7883k0433
59045A381584k2199k2928k3825k4832k4437k2266j9491j6589j3158r930q292p697
59033A165940o172l463j092O64L064O103Q336R663J1440J3602J4483J3777J2867
59020A249212J2029J0079P082M593K949J111o22p32N49J340J447K539M712O113
$$ plain form
59096 8328039 8263728 8128934 7929934 7677463 7383642 7059540 6715916 6363648 6011574 5665382
59086 5665382 5329638 5009077 4706831 4423489 4159314 3915512 3692158 3487103 3298509
59077 3298509 3126407 2970235 2827115 2694560 2572847 2462648 2362143 2268822 2182540 2104466
59067 2104466 2034195 1970044 1911134 1857190 1807314 1760859 1718530 1680875 1646667 1614508 1585016
59056 1585016 1559641 1538160 1518996 1501180 1484467 1468307 1452178 1436154 1419900 1402017 1381584
59045 1381584 1359385 1336457 1312632 1287800 1263363 1241097 1221606 1205017 1191859 1181929 1173637 1165940
59033 1165940 1159768 1156305 1155213 1155877 1158941 1165044 1173380 1183043 1194483 1208085 1222568 1236345 1249212
59020 1249212 1261241 1271320 1278402 1282995 1285944 1287055 1286433 1285701 1286250 1287590 1289037 1291576 1296288 1302401
59006A302401O405P369R443J0782J0512R884R427P948N277L115K233J528O48Q14
58992A387786K249L473L945M845O537P805Q226Q736R375R198Q759R874J2377J4030
58978A497215J4230J4839J6630J7993J8028J8067J9168K0754K2567K5339K8814
58967A713644L1620L3603L5775L7702L7840L6696L6510L7338L6804L4309L2184
58956B104025L1874L2256L2593L3901L6402L8806M1127M5128N1021N6742O1403
58945B565278O6383P2227P7740Q2988Q9859R8509J06685J13649J21473J31286
58935C526077J41682J52096J64309J79022J94306K09068K25040K43769K64645
58926E300014K87321L13042L42048L72626M04303M39096M78259N20565N65068
$$ plain form
59006 1302401 1308806 1316175 1325618 1336400 1346912 1356796 1366223 1374171 1379448 1382563 1384796 1386324 1386972 1387786
58992 1387786 1390035 1393508 1397453 1402298 1408835 1416640 1424866 1433602 1442977 1452175 1460934 1470808 1483185 1497215
58978 1497215 1511445 1526284 1542914 1560907 1578935 1597002 1616170 1636924 1659491 1684830 1713644
58967 1713644 1745264 1778867 1814642 1852344 1890184 1926880 1963390 2000728 2037532 2071841 2104025
58956 2104025 2135899 2168155 2200748 2234649 2271051 2309857 2350984 2396112 2447133 2503875 2565278
58945 2565278 2631661 2703888 2781628 2864616 2954475 3052984 3159669 3273318 3394791 3526077
58935 3526077 3667759 3819855 3984164 4163186 4357492 4566560 4791600 5035369 5300014
58926 5300014 5587335 5900377 6242425 6615051 7019354 7458450 7936709 8457274 9022342
58917I022342O12634O63364P15305P66775Q16990Q63199R00234R23727R30713
58908A6215283R16379Q74125Q00341O95989N62921M03111K23042L4488j51418
58899B0574261l27599m87398o22472p27436q03226q53207q79054q82664q68545
58890A4122660q41327q03450p57433p07469o56568o04966n53342n04626m60679
58881H232800m20299l82559l49031l20743k96203k74456k56716k42804k29471
58872E460518k14674k00214j87765j75691j62291j48930j37225j26268j15259
58863C992201j05701r8392r1285q2920p4983o8879o2914n5510m8001m1640l4970
58852C227006k6971j9592j4271r012j871N730J2032J8223K5700L3091L9041M5032
$$ plain form
58917 9022342 9634976 10298340 11013645 11780420 12597410 13460609 14360843 15284570 16215283
58908 16215283 17131662 18005787 18806128 19502117 20065038 20468149 20691191 20725679 20574261
58899 20574261 20246662 19759264 19136792 18409356 17606130 16752923 15873869 14991205 14122660
58890 14122660 13281333 12477883 11720450 11012981 10356413 9751447 9198105 8693479 8232800
58881 8232800 7812501 7429942 7080911 6760168 6463965 6189509 5932793 5689989 5460518
58872 5460518 5245844 5045630 4857865 4682174 4519883 4370953 4233728 4107460 3992201
58863 3992201 3886500 3788108 3696823 3613903 3538920 3470041 3407127 3351617 3303616 3261976 3227006
58852 3227006 3200035 3180443 3166172 3157160 3155289 3161019 3173051 3191274 3216974 3250065 3289106 3334138
58840C334138N2441N9741O5621P1942Q0478Q9720R7964J06616J17263J28476J38868
58829D343268J50284J64578J80082J94767K10149K28614K49554K71652K96260
58820F289208L24965L56454L89330M25436M66785N11828N58346O07363O60273
58811A0589988P14534P66008Q13236Q55326Q87713R03813Q99080Q70107Q12110
58802A8111915P21468N99373M50170K78514R1567r8778k80142m44815n88091p04591
58792A8136590p90492q47298q79340q89173q78848q53350q18618p77598p31644
58783A0670229o83796o37097n91553n46286n02782m62741m24992l88119l53881
58774F078982l24456k98741k74946k54325k38323k24557k09835j94971j82370
$$ plain form
58840 3334138 3386579 3446320 3511941 3583883 3664361 3754081 3852045 3958661 4075924 4204400 4343268
58829 4343268 4493552 4658130 4838212 5032979 5243128 5471742 5721296 5992948 6289208
58820 6289208 6614173 6970627 7359957 7785393 8252178 8764006 9322352 9929715 10589988
58811 10589988 11304522 12070530 12883766 13739092 14626805 15530618 16429698 17299805 18111915
58802 18111915 18833383 19432756 19882926 20161440 20253007 20154229 19874087 19429272 18841181 18136590
58792 18136590 17346098 16498800 15619460 14730287 13851439 12998089 12179471 11401873 10670229
58783 10670229 9986433 9349336 8757783 8211497 7708715 7245974 6820982 6432863 6078982
58774 6078982 5754526 5455785 5180839 4926514 4688191 4463634 4253799 4058828 3876458
58765C876458j71164j59083j46983j37060j28416j18847j09186j01498r4704q6401
58755B623116p7321o9779o3351n6335m9702m5360m2202l8105l4020l1861l0272
58744B084808k7057k3727k2927k3209k1279j7764j5786j5361j4220j2875j3665
58733A876938j5859j6690j6406j7469j9619k0448k0113k0853k2655k3828k5025
58722A657973k8147l2121l4190l4523l5225l5911l4782l2863l2482l2626l0620
58711A294483k7359k5937k6022k4610k1665j9898j9505j8119j5666j4422j4431
58700A066849j3491j1482j0358j0146r233q105q432r150p823n146l804l678k828
58687I63173k130m112p910j0304j1088j2602j4660j4920j3600j2924j2479j0099
$$ plain form
58765 3876458 3705294 3546211 3399228 3262168 3133752 3014905 2905719 2804221 2709517 2623116
58755 2623116 2545795 2476016 2412665 2356330 2306628 2261268 2219066 2180961 2146941 2115080 2084808
58744 2084808 2057751 2034024 2011097 1987888 1966609 1948845 1933059 1917698 1903478 1890603 1876938
58733 1876938 1861079 1844389 1827983 1810514 1790895 1770447 1750334 1729481 1706826 1682998 1657973
58722 1657973 1629826 1597705 1563515 1528992 1493767 1457856 1423074 1390211 1357729 1325103 1294483
58711 1294483 1267124 1241187 1215165 1190555 1168890 1148992 1129487 1111368 1095702 1081280 1066849
58700 1066849 1053358 1041876 1031518 1021372 1012139 1004034 995602 986452 978629 973483 969679 966001 963173
58687 963173 961043 956931 949021 938717 927629 915027 900367 885447 871847 858923 846444 836345
58675H36345o674n017m614k627M59J480L24k91k20j569l403k406J198L756M166
58660H20907M454M608K469j202l006k563k600l399k514q6J090J061K779O354Q753
58645H37105R561J1560J5163J7731J8862K0920K3832K4860K4036K4458K6623K7917
58633A082628K8208L0387L4809L8777M2150M7779N5779O3028O9099P6903Q6816
58622A656363R6029J04628J16330J31990J48253J63871J81481K01865K22220K41360
58612C264390K60775K78993K90687K92949K86822K71294K41820J96796J40130
58603E524656P5985O707o2627j23957j73076k11574k40349k56968k61362k58135
58593D019300k50732k38518k21857k04535j88749j72742j55669j39808j25916
$$ plain form
58675 836345 829671 824654 820040 817413 817872 819352 819676 819385 819165 817596 814193 811787 812985 816741 820907
58660 820907 825361 829969 832438 831236 828230 825667 823067 819668 817154 817068 818158 819219 821998 828352 837105
58645 837105 846666 858226 873389 891120 909982 930902 954734 979594 1003630 1028088 1054711 1082628
58633 1082628 1110836 1141223 1176032 1214809 1256959 1304738 1360517 1423545 1492644 1569547 1656363
58622 1656363 1752392 1857020 1973350 2105340 2253593 2417464 2598945 2800810 3023030 3264390
58612 3264390 3525165 3804158 4094845 4387794 4674616 4945910 5187730 5384526 5524656
58603 5524656 5600641 5607348 5544721 5420764 5247688 5036114 4795765 4538797 4277435 4019300
58593 4019300 3768568 3530050 3308193 3103658 2914909 2742167 2586498 2446690 2320774
58584B320774j11573r6175q2525p1597o0854m9685m1106l6085l1629k6504k3522
58573A689519k3953k5148k5952k8935l4734l9477m0448l9410l8108l5443l1356
58562A326555k8447k7483k6175k4236k4458k7000k8038k6035k3865k2875k0629
58551A047314j6566j3947j3838j3029j0293q793r863j0362q867q482j0677j2291
58539I10306j1525j1124j2687j3626j2648j2393j3775j3644j0954r328j0473j1123
58527G67006r494q596r969j0437q502p581r376j0280q143o341p229p733n581l715
58513F54029m387m769k747j186k137k614m68J266K08q30N34J764P82K22J962L082
58497F44711J635P07K456L797K539J904M345O659O005N094O555P850O658N625
$$ plain form
58584 2320774 2209201 2113026 2030501 1958904 1898050 1848365 1807259 1771174 1739545 1713041 1689519
58573 1689519 1665566 1640418 1614466 1585531 1550797 1511320 1470872 1431462 1393354 1357911 1326555
58562 1326555 1298108 1270625 1244450 1220214 1195756 1168756 1140718 1114683 1090818 1067943 1047314
58551 1047314 1030748 1016801 1002963 989934 979641 970848 960985 950623 941756 933274 922597 910306
58539 910306 898781 887657 874970 861344 848696 836303 822528 808884 797930 788602 778129 767006
58527 767006 757512 748916 738947 728510 720008 712427 703051 692771 684628 678287 671058 663325 657744 654029
58513 654029 649642 644873 642126 640940 638803 636189 635721 636987 637195 636365 636899 638663 639445 639667 641629 644711
58497 644711 646346 647053 649509 653306 655845 657749 662094 668753 674758 679852 686407 694257 700915 706540
58483G06540O842P198M297J397J448J748m22k479j923j495l710n766n131m701
58469G03843p072r178q023o399p441q803p578n827n966n875l723k324l622m400
58455F17612k471j288l315m915l141j402k775m028k162m84k065l455j302J056
58441E85865J02j046J087L400K456J423L851O534N690M260N841P383N298K897
58427F35041M130N835L901J399K706N178M532K951L882M405R31k962k598o85j562
58412F67084k569K44L375J680k022k044K56L85k65J888M479L511J341K012L143
58397F82498R02j816o35J764R38n51J603M526L531J312K673N108L911J681L264
58382G10709O174N507L518M724O462M151Q85J920M575L610J594L625O809N656
$$ plain form
58483 706540 713382 720580 724877 726274 727722 729470 729048 726569 724646 723151 719441 713675 708544 703843
58469 703843 696771 687593 679570 673171 665730 656927 649349 643522 637556 631681 627958 625634 622012 617612
58455 617612 615141 613853 610538 605623 602482 601080 598305 594277 592115 591631 589566 586111 584809 585865
58441 585865 585967 584921 586008 589408 591864 593287 597138 603672 609362 613622 619463 626846 632144 635041
58427 635041 639171 645006 648907 650306 653012 658190 662722 665673 669555 673960 674891 671929 669331 668646 667084
58412 667084 664515 664759 668134 669814 667792 665748 666004 666389 666124 668012 672491 676002 677343 679355 682498
58397 682498 683400 681584 680949 682713 683651 683100 684703 689229 692760 694072 696745 701853 705764 707445 710709
58382 710709 716883 722390 725908 730632 737094 741245 742130 744050 748625 752235 753829 757454 764263 769919
58368G69919L006M818Q745Q789O714P854J0165Q460N103N424P053M789J455K578
58354H54872N168L302L4J768N665M821J385K041M936L783O46J824N135M186J234
58339I00800K876O969O855M502O375J0364J0171Q264J0949J5018J3344R275J0982
58326A016744J5855J5394J1443J2144J5787J4380R798J0331J4383J3601R319R758
58314A168937J3662J2916Q887R810J4406J4391J0864J1842J5970J5208J1234J2479
58302A320606J7394J7460J4120J5674K0207J9089J4483J5563K0435J9944J6133
58291A511108J8151K3336K1876J6752J8801K5385K5031J9967K2165K9870L0822
58280A763264K6400K9177L8211M0588L6335L7731M4736M5551M0969M3307N1371
$$ plain form
58368 769919 772925 777743 786488 795277 801991 809845 820010 828470 833573 838997 846050 850839 852294 854872
58354 854872 860040 863342 863376 865144 870809 875630 877015 879056 883992 887775 888421 890245 895380 899566 900800
58339 900800 903676 910645 917500 922002 928377 938741 948912 957176 968125 983143 996487 1005762 1016744
58326 1016744 1032599 1047993 1059436 1071580 1087367 1101747 1111545 1121876 1136259 1149860 1159179 1168937
58314 1168937 1182599 1195515 1204402 1214212 1228618 1243009 1253873 1265715 1281685 1296893 1308127 1320606
58302 1320606 1338000 1355460 1369580 1385254 1405461 1424550 1439033 1454596 1475031 1494975 1511108
58291 1511108 1529259 1552595 1574471 1591223 1610024 1635409 1660440 1680407 1702572 1732442 1763264
58280 1763264 1789664 1818841 1857052 1897640 1933975 1971706 2016442 2061993 2102962 2146269 2197640
58269B197640N1743M4866M4299N0147M9445M2855M4011N2069N2696M6705M9175
58258B725651N9448O1597N5747N8406P0022P3742O8655P1884Q4732Q9826Q5465
58247C505175Q9019J02101J06928J01777J04795J17819J22788J19001J26164J44974
58237D640541J53785J50488J57175J76754J87311J86678J98375K24995K41608
58228F317710K44710K59980K91449L12814L20243L41584L81025M09400M22827
58219I301742M53436N07208N51870N82455O34338P13569P83111Q38053R21147
58210A5286929J041689J158041J265561J416757J626120J847872K080981K395719
58202B8119669K818962L303247L850455M541868N398486O356463P444502Q828966
$$ plain form
58269 2197640 2249383 2294249 2338548 2388695 2438140 2480995 2525006 2577075 2629771 2676476 2725651
58258 2725651 2785099 2846696 2902443 2960849 3030871 3104613 3173268 3245152 3329884 3419710 3505175
58247 3505175 3594194 3696295 3803223 3905000 4009795 4127614 4250402 4369403 4495567 4640541
58237 4640541 4794326 4944814 5101989 5278743 5466054 5652732 5851107 6076102 6317710
58228 6317710 6562420 6822400 7113849 7426663 7746906 8088490 8469515 8878915 9301742
58219 9301742 9755178 10262386 10814256 11396711 12031049 12744618 13527729 14365782 15286929
58210 15286929 16328618 17486659 18752220 20168977 21795097 23642969 25723950 28119669
58202 28119669 30938631 34241878 38092333 42634201 48032687 54389150 61833652 70662618
58194G0662618J0619766J2831224J5627148J9367015K4287341L0409244L7788209
58187B21592565M6089722N3176406N4650089M6308624K7966507M544663j7113830
58180D37214746l2511794m0911567m3736418m2699282l9262255l4704015k9936772
58173A73452643k5372145k1185543j7563159j4595288j2165056j0125104q457061
58166F3989287p151297o082731n132811m313290l655308l087797k536309k036575
58158B9993169j634485j266590q54472m27272k6335M28693J044136J805231K682952
58149C1745027L791310N163613O325317O367389M694311J674413j573683m027195
58141E4160502n346422n758620n612838n141663m500447l828477l215117k675952
$$ plain form
58194 70662618 81282384 94113608 109740756 129107771 153395112 183804356 221592565
58187 221592565 267682287 320858693 375508782 421817406 449783913 454328576 437214746
58180 437214746 404702952 363791385 320054967 277355685 238093430 203389415 173452643
58173 173452643 148080498 126894955 109331796 94736508 82571452 72446348 63989287
58166 63989287 56837990 50755259 45622448 41309158 37653850 34566053 32029744 29993169
58158 29993169 28358684 27092094 26237622 25810350 25784015 26212708 27256844 29062075 31745027
58149 31745027 35536337 40699950 47025267 53392656 58086967 59761380 58187697 54160502
58141 54160502 48814080 43055460 37442622 32300959 27800512 23972035 20756918 18080966
58133A8080966k203489j810943j508252j272144j071168r00268p66062o57018
58125G891622n55855m67673m07564l69189l32477k95879k73993k66920k58398
58116D663674k43241k31366k23855k09298j86247j66608j53352j36164j12786
58107C000757r4259q5211p8483p2862p6349q7542r3057q8494q3784q3246p8815
58096B078655o8045o0387n9534n6964m9153m4255m5498m4494l7573l2797l4140
58085A545815l4241k9528k7334l1120l3364l0043k7993l1003l2523k9001k6836
58074A212829k9208k9433k4225k0524k2199k2752j8114j4222j4925j4706j0264
58063I92257p336r060r422n054k101m561p167o392p118j1772j4271j1527r704
$$ plain form
58133 18080966 15877477 14066534 12558282 11286138 10214970 9314702 8548640 7891622
58125 7891622 7335767 6868094 6460530 6091341 5758864 5462985 5188992 4922072 4663674
58116 4663674 4420433 4189067 3965212 3755914 3569667 3403059 3249707 3113543 3000757
58107 3000757 2906498 2821287 2742804 2669942 2593593 2506051 2412994 2324500 2240716 2157470 2078655
58096 2078655 2010610 1950223 1890689 1833725 1784572 1740317 1694819 1650325 1612752 1579955 1545815
58085 1545815 1511574 1482046 1454712 1423592 1390228 1360185 1332192 1301189 1268666 1239665 1212829
58074 1212829 1183621 1154188 1129963 1109439 1087240 1064488 1046374 1032152 1017227 1002521 992257
58063 992257 984921 975861 966439 961385 959284 954723 947556 941164 934046 922274 908003 896476 886772
58050H86772j2316j3380r304o231q287r641n909k612m473o676m692k771m727n946
58036G89807k494J103P83N46L588N113J690j349L81K104p48l747k095M18p85k357
58020G91958k95J852J10k017o63O38j916m664l587k161m412p036o095m761o751
58005G50200q709o814m457n654p237n248k843m035n793m206k492m928q465q372
57991F70947o846q114j0102q743n788m783m016p62K179J497J51K043M581L800
57977F36044K066L373N541M588K542L393N304M280J763J421J964J95k388k809
57963F67277k809n128p292n865l234l419m769l698k094l979p942r804r746j0278
57949E87220j0154p019l078j614p88K690O813P748O959Q256J0594J0535R104R453
$$ plain form
58050 886772 874456 861076 851772 845541 837254 827613 821704 819092 814619 807943 803251 800480 795753 789807
58036 789807 787313 788416 789199 789745 793333 798446 800136 798787 799168 801272 800524 796777 794682 795100 794315 791958
58020 791958 791663 793515 793625 791608 790945 791583 789667 785003 781416 779255 774843 767807 761712 756951 750200
58005 750200 741491 734677 730220 724566 717329 712081 709238 705203 699410 695204 692712 687784 679319 670947
57991 670947 664101 655987 645885 637142 631354 626571 622555 621793 623972 625469 625620 627663 632244 636044
57977 636044 638110 641483 647024 651612 654154 657547 662851 667131 668894 670315 672279 672474 670086 667277
57963 667277 664468 659340 652048 646183 642949 639530 634761 631063 628969 624990 617048 607244 597498 587220
57949 587220 577066 570047 566969 565355 564567 567257 574070 581818 588777 597033 607627 618162 627266 636719
57935F36719J0222P976L916J630L23l233q134j1094j2677j5494j8290j8001j5784
57922E58079j4868j4364j1348p184n485n563l993j033M69R35K851N227N234L928
57908E12885M641O991Q073Q065R073R985Q232N328M904O475O651N228M657M716
57894F05904L287J175Q28J431M57j218j040j33j603m778o492o695p566q472p298
57879E67787n424n830p531p325n760n767o693n495k748j581j535N76M369O318
57865E23361O046O570Q540R690R723J0497J1617J0962R131Q408P954N213J304
57852F29016l56j51j451m289n524m904n246o772o944n917o475q374q339o044m676
57837E53554n084m740l055k405l257l289k111j917k902k810j606j781l604m820
$$ plain form
57935 636719 646941 654917 658833 660463 660786 657553 649419 638325 625648 610154 591864 573863 558079
57922 558079 543211 528847 517499 510315 504830 499267 495274 494241 494710 495645 498496 503723 508957 512885
57908 512885 517526 524517 532590 540655 549728 559713 567945 573273 578177 584652 591303 596531 601188 605904
57894 605904 609191 610366 611194 612625 613082 611864 610824 610691 609088 604310 597818 591123 583557 575085 567787
57879 567787 562363 556533 549002 541677 535917 530150 523457 517962 515214 513633 512098 512674 517043 523361
57865 523361 529407 535977 544517 554207 563930 574427 586044 597006 606137 614545 622499 627712 629016
57852 629016 628660 628509 627058 622769 617245 612341 607095 600323 593379 587462 580987 572613 564274 558230 553554
57837 553554 548470 543730 540675 538270 535013 531724 529613 527696 524794 521984 520378 518597 514993 510173
57823E10173n359p366j0272j1007r616r499j1327j1933j0157q611q505p830n953
57810C92738n123n955o038m491l426l555k742l97J019M10j26P63J809K442M011
57795C71339O502P953Q289R902J3347J6181J6987J6712J5434J1992P631N597O081
57782E13947N820L692K215K421J915m39k517l299m820p874r981r644q833r225
57768D73378r697r366r366r861q946o302m369m182l632j530K88O33J079K596L716
57753D14439L780M546O663Q070P624O927O830N869L902L466N432P016O348N423
57739D96335O155P006O139M622L951L313J870J019J957L535M626O083Q423J0236
57725E65270J0736J1240J2392J2742J1786J1412J2526J3274J2449J1677J2360
$$ plain form
57823 510173 504814 497448 487176 476169 466553 457054 445727 433794 423637 415026 406521 398691 392738
57810 392738 387615 381660 375622 371131 367705 364150 361408 361011 362030 362440 362314 363077 364886 367328 371339
57795 371339 377841 385794 394083 403985 417332 433513 450500 467212 482646 494638 502269 507866 513947
57782 513947 519767 523459 525674 528095 530010 529571 527054 523755 518935 511061 501080 491436 482603 473378
57768 473378 463681 454315 444949 435088 426142 419840 415471 411289 407657 406127 406415 407048 408127 410723 414439
57753 414439 418219 422765 429428 437498 445122 452049 458879 464748 468650 472116 477548 484564 490912 496335
57739 496335 502490 509496 515635 520257 524208 527521 529391 530410 532367 535902 540528 546611 555034 565270
57725 565270 576006 587246 599638 612380 624166 635578 648104 661378 673827 685504 697864
57714F97864J3508J4384J6084J8623J9830J9246J9610K2311K4869K5476K6389
57703I18194K9941L4531L7759M0582M5039N0560N5738O1373O8599P6310Q3351
57692A501977R1196J01628J13945J27156J42552J61331J81950K02649K24308K47793
57682C096485K70654K89283L02063L07380L00914K78621K40991J91754J34558
57673E412703P4082J8047k5997n4857o8055o5113m9868l6418m4347q4428j49747
57662D926002k20766k77758l09971l17396l06497k84185k55075k23017j92220
57653B539117j65260j41650j20124j00962q4754p0674n7809m6594l7332k8911
57643A685047k0664j3592p974j823O267J4719K1668K8048L5734M4495N3345O3063
$$ plain form
57714 697864 711372 725756 741840 760463 780293 799539 819149 841460 866329 891805 918194
57703 918194 948135 982666 1020425 1061007 1106046 1156606 1212344 1273717 1342316 1418626 1501977
57692 1501977 1593173 1694801 1808746 1935902 2078454 2239785 2421735 2624384 2848692 3096485
57682 3096485 3367139 3656422 3958485 4265865 4566779 4845400 5086391 5278145 5412703
57673 5412703 5486785 5504832 5478835 5423978 5355923 5290810 5240942 5204524 5160177 5075749 4926002
57662 4926002 4705236 4427478 4117507 3800111 3493614 3209429 2954354 2731337 2539117
57653 2539117 2373857 2232207 2112083 2011121 1926367 1855693 1797884 1751290 1713958 1685047
57643 1685047 1664383 1650791 1642817 1640994 1647261 1661980 1683648 1711696 1747430 1791925 1845270 1908333
57631A908333P4706Q7262R9426J12309J27592J44465J61082J77759J95779K14060
57621C302773K29721K40975K46752K44251K29695K01362J60071J07725M7571j5091
57611D995805p4873j28494j73689k07619k28747k39001k41625k37975k28535k15548
57601C019699k01714j87355j71571j55276j40468j27324j14714j02874r2975q4693
57591A640735p6784o9334o3130n7522n1373m5329m0766l7229l3455k9935k7793
57580A108085k6074k3063j9566j7757j7324j5854j2875j0352r184q197o863o079
57568I34897n851m838k799j149m93K80J940L871N526P076Q391R045R549J0886
57554I76331J2753J3909J4211J4715J5841J7176J8882K1525K4637K7253K9706
$$ plain form
57631 1908333 1983039 2070301 2169727 2282036 2409628 2554093 2715175 2892934 3088713 3302773
57621 3302773 3532494 3773469 4020221 4264472 4494167 4695529 4855600 4963325 5010896 4995805
57611 4995805 4920932 4792438 4618749 4411130 4182383 3943382 3701757 3463782 3235247 3019699
57601 3019699 2817985 2630630 2459059 2303783 2163315 2035991 1921277 1818403 1725428 1640735
57591 1640735 1563951 1494617 1431487 1373965 1322592 1277263 1236497 1199268 1165813 1135878 1108085
57580 1108085 1082011 1058948 1039382 1021625 1004301 988447 975572 965220 956036 947839 940976 934897
57568 934897 929046 924208 921409 920260 919767 920047 921987 925858 931384 938460 946851 955896 965445 976331
57554 976331 989084 1002993 1017204 1031919 1047760 1064936 1083818 1105343 1129980 1157233 1186939
57543A186939L3192L7756M2499M7472N3518O0480O7443P4615Q3148R3266J04327
57532A884655J16426J30094J44660J58754J72179J85406J97347K05424K07482
57523C402427K01911J86530J59617J22110P7033K7209k4589p4029j16375j49355
57513C812489j73126j87855j93600j92097j86128j77031j64900j50976j37345
57504B249431j24464j11403r8474q7149p7356o7495n7385m8692m2072l6266l0399
57493A468276k4856j9550j3719p852l486o37K407O274R887J2971J6766K1673K6637
57480A494791L1501L7552M4927N1984N8196O5354P4724Q5273R5920J07404J20513
57469B268139J34309J47613J60614J73550J84938J92264J93297J85956J68327
$$ plain form
57543 1186939 1220131 1257887 1300386 1347858 1401376 1461856 1529299 1603914 1687062 1780328 1884655
57532 1884655 2001081 2131175 2275835 2434589 2606768 2792174 2989521 3194945 3402427
57523 3402427 3604338 3790868 3950485 4072595 4149628 4176837 4152248 4078219 3961844 3812489
57513 3812489 3639363 3451508 3257908 3065811 2879683 2702652 2537752 2386776 2249431
57504 2249431 2124967 2013564 1915090 1827941 1750585 1683090 1625705 1577013 1534941 1498675 1468276
57493 1468276 1443420 1423870 1410151 1402299 1398813 1398176 1400583 1406857 1416744 1429715 1446481 1468154 1494791
57480 1494791 1526292 1563844 1608771 1660755 1718951 1784305 1859029 1944302 2040222 2147626 2268139
57469 2268139 2402448 2550061 2710675 2884225 3069163 3261427 3454724 3640680 3809007
57460C809007J39919J02039N6588N932m5808r3250j32614j62909j84022j95478
57450C299404j97922j93860j85757j74612j61215j47159j33589j20324j07286
57441A877680r5492q5715p7278o9191o1485n4616m8531m3077l8356l4181l0088
57430A239670k6294k3490k1492j9292j6722j4712j3587j2516j0969r293p577n448
57418A058278l371k468k637k567j958j920k648k684j330P2K90k2J98P08Q37P88
57402A039566J037J458J874K483L181L600M101N411P007P473O836O752P823Q605
57388A107207Q073P207P211P771Q052P939P438O385N444N853P398Q265P724P197
57374A209164P842Q855R147Q951Q718Q143P326P233P981Q356P976Q074R101R602
$$ plain form
57460 3809007 3948926 4050965 4107553 4113485 4067677 3974427 3841813 3678904 3494882 3299404
57450 3299404 3101482 2907622 2721865 2547253 2386038 2238879 2105290 1984966 1877680
57441 1877680 1782188 1696473 1619195 1550004 1488519 1433903 1385372 1342295 1303939 1269758 1239670
57430 1239670 1213376 1189886 1168394 1149102 1132380 1117668 1104081 1091565 1080596 1071303 1063726 1058278
57418 1058278 1054907 1052439 1049802 1047235 1045277 1043357 1040709 1038025 1036695 1036767 1037057 1037035 1037233 1037941 1038778 1039566
57402 1039566 1040603 1042061 1043935 1046418 1049599 1053199 1057300 1062711 1069718 1077191 1084027 1090779 1098602 1107207
57388 1107207 1115280 1122487 1129698 1137469 1145521 1153460 1160898 1167283 1172727 1178580 1185978 1194243 1201967 1209164
57374 1209164 1217006 1225861 1235008 1243959 1252677 1260820 1268146 1275379 1283360 1291716 1299692 1307766 1316867 1326469
57360A326469Q795Q223R264J0816J1228J0856J0915J1263J1165J1002J1471J2157
57348A453624J2411J2600J3111J3235J2469J1833J2457J3902J5099J5849J6311
57337A602901J6205J5678J5556J5790J5118J3431J2665J3979J5849J6494J6425
57326A770091J6853J7295J6837J6200J6475J7086J6989J6656J6938J7306J7135
57315A955861J7385J8948K0587K0751K0175K0459K1227K1101K0484K0906K2370
57304B180254K3723K4904K6529K7912K7945K7329K7627K8665K9210K9641L1338
57293B485077L3827L5239L5516L6581L9111M1566M2837M3632M4750M5843M6488
57282B930467M6880M7016M6578M5763M4943M3464M0193L5189K9418K3110J5900
$$ plain form
57360 1326469 1335264 1343487 1352751 1363567 1374795 1385651 1396566 1407829 1418994 1429996 1441467 1453624
57348 1453624 1466035 1478635 1491746 1504981 1517450 1529283 1541740 1555642 1570741 1586590 1602901
57337 1602901 1619106 1634784 1650340 1666130 1681248 1694679 1707344 1721323 1737172 1753666 1770091
57326 1770091 1786944 1804239 1821076 1837276 1853751 1870837 1887826 1904482 1921420 1938726 1955861
57315 1955861 1973246 1992194 2012781 2033532 2053707 2074166 2095393 2116494 2136978 2157884 2180254
57304 2180254 2203977 2228881 2255410 2283322 2311267 2338596 2366223 2394888 2424098 2453739 2485077
57293 2485077 2518904 2554143 2589659 2626240 2665351 2706917 2749754 2793386 2838136 2883979 2930467
57282 2930467 2977347 3024363 3070941 3116704 3161647 3205111 3245304 3280493 3309911 3333021 3348921
57271C348921Q363J698l886q825j2515j3866j3416j2903j2661j1344q488n436
57259C255642l326j774j14J595L251N117P138Q926J0647J2730J4683J5418J4927
57246C344860J4414J4733J5715J7024J8467J9550J9928K0187K1036K1943K1870
57235C549727K1085K0853K1525K2371K3080K3855K4150K3047K0958J9402J8915
57224C788968J8634J8041J7552J7266J6657J5798J5487J5888J6260J6342J6702
57213C973595J7550J8314J8676J8948J9338J9770K0443K1584K2795K3680K4717
57202D199410K6397K7962K8319K7856K7829K8212K7751K6056K4084K2611K1567
57191D488054K0867K0532K0061J8919J7494J6469J5656J4684J4157J4651J5262
$$ plain form
57271 3348921 3357284 3358982 3355096 3346271 3333756 3319890 3306474 3293571 3280910 3269566 3261078 3255642
57259 3255642 3252316 3250542 3250428 3252023 3255274 3260391 3267529 3276455 3287102 3299832 3314515 3329933 3344860
57246 3344860 3359274 3374007 3389722 3406746 3425213 3444763 3464691 3484878 3505914 3527857 3549727
57235 3549727 3570812 3591665 3613190 3635561 3658641 3682496 3706646 3729693 3750651 3770053 3788968
57224 3788968 3807602 3825643 3843195 3860461 3877118 3892916 3908403 3924291 3940551 3956893 3973595
57213 3973595 3991145 4009459 4028135 4047083 4066421 4086191 4106634 4128218 4151013 4174693 4199410
57202 4199410 4225807 4253769 4282088 4309944 4337773 4365985 4393736 4419792 4443876 4466487 4488054
57191 4488054 4508921 4529453 4549514 4568433 4585927 4602396 4618052 4632736 4646893 4661544 4676806
57180D676806J4838J3899J3546J3284J2043J0611J0592J1448J1162R542Q221P484
57168D813476N963L689K597L387M485M801N103N824N895M729L294K243R24j016
57154D865394k859m393o319q528r893j0396j1417j3335j4858j5423j6127j7504
57142D734342j8495j8469j8193j7919j6600j3933j1115q740n931k552j18N66O30
57129D603473R15O46o52j996l036n162r124j3396j6369j8347k0027k0714j9548
57116D476663j6939j3504q987l403K235P410J2815J8812K4869L1437M0477N3388
57104D625273P0242R1914J20625J57414K01416K52765L13864L86445M69684N62503
57094G252145O65356P78470R00873J032341J173128J319419J461039J584981J679099
$$ plain form
57180 4676806 4691644 4705543 4719089 4732373 4744416 4755027 4765619 4777067 4788229 4797771 4805992 4813476
57168 4813476 4819439 4823128 4825725 4829112 4833597 4838398 4843501 4849325 4855220 4859949 4863243 4865486 4866410 4865394
57154 4865394 4862535 4858142 4851823 4843295 4833402 4823006 4811589 4798254 4783396 4767973 4751846 4734342
57142 4734342 4715847 4697378 4679185 4661266 4644666 4630733 4619618 4610878 4604947 4602395 4602277 4602843 4603473
57129 4603473 4604388 4605034 4604382 4602386 4599350 4594188 4585064 4571668 4555299 4536952 4516925 4496211 4476663
57116 4476663 4459724 4446220 4437233 4433830 4436065 4443475 4456290 4475102 4499971 4531408 4571885 4625273
57104 4625273 4695515 4787429 4908054 5065468 5266884 5519649 5833513 6219958 6689642 7252145
57094 7252145 7917501 8695971 9596844 10629185 11802313 13121732 14582771 16167752 17846851
57085A7846851J732321J735922J686410J582297J415573J173135Q53839M81779
57077B8508127R6888k66725n90170q63663j081718j246382j367652j455612j513761
57068B0219332j540869j536141j501142j439713j358022j263206j160835j054748
57060I364656r49063q48173p54438o67932n88775n17933m55639m00999l53477
57051C828227l13111k79244k50641k26751k07277j90922j76247j63288j52480
57042A868266j42678j32363j22126j13530j06023r7621q8348q0193p3689o7263
57032H44432o0220n3794m8703m4066l9305l4930l1059k7071k3110j9952j7238
57021D44984j3909j0411q280p442o287m485l269k764j675L2Q57N92Q11J993L021
$$ plain form
57085 17846851 19579172 21315094 23001504 24583801 25999374 27172509 28026348 28508127
57077 28508127 28605015 28338290 27748120 26884457 25802739 24556357 23188705 21733093 20219332
57068 20219332 18678463 17142322 15641180 14201467 12843445 11580239 10419404 9364656
57060 9364656 8415593 7567420 6812982 6145050 5556275 5038342 4582703 4181704 3828227
57051 3828227 3515116 3235872 2985231 2758480 2551203 2360281 2184034 2020746 1868266
57042 1868266 1725588 1593225 1471099 1357569 1251546 1153925 1065577 985384 911695 844432
57032 844432 784212 730418 681715 637649 598344 563414 532355 505284 482174 462222 444984
57021 444984 431075 420664 412384 404942 398655 394170 390901 388137 386462 386494 387351 387943 388754 390747 393768
57006C93768M057O966J1997J7120K1720K7785L6268M5900N7120P3436R6910J26722
56994I19769J64733K15552K72784L08304K86688J96558O4756o3276j55186k04573
56984B006109k20859k15368j97061j73916j52178j34306j19700j07348r6602q6244
56974E02527p4922o2835n1612m2065l3323k4640j6731j0538n794j777J426L637
56962A83353N716Q767J2818J7371K2610K8543L3313L3808K8221J7371L959q703
56950C87147j7884k2766k4528k4431k2453j8610j4430j1543r485o657l005M5K073
56937B13473M305P727J2135J7118K2651K8577L4474L9597M1810L7457K4532O007
56925D89863j1805k4402l1360l4106l3765l1447k8499k5456k1928j7953j4317
$$ plain form
57006 393768 397825 404791 416788 433908 455628 483413 519681 565581 622701 696137 793047 919769
56994 919769 1084502 1300054 1572838 1881142 2167830 2364388 2429144 2365868 2210682 2006109
56984 2006109 1785250 1569882 1372821 1198905 1046727 912421 792721 685373 588771 502527
56974 502527 427605 364770 313158 271093 237770 213130 196399 185861 180067 178290 179716 183353
56962 183353 189069 197836 210654 228025 250635 279178 312491 346299 374520 391891 395850 387147
56950 387147 369263 346497 321969 297538 275085 256475 242045 230502 221017 214360 211355 211400 213473
56937 213473 217778 225505 237640 254758 277409 305986 340460 380057 421867 459324 483856 489863
56925 489863 478058 453656 422296 388190 354425 322978 294479 269023 247095 229142 214825
56914B14825j1432r106p482o829o458n334l730k847k824k681k201k047j972p36
56900A49146J768M037N003N202N547O358P836J0068J2360J3950J5391J7931K1637
56887B76234K5597K9476L2897L3580K8641J8195N680n688j4802k1041k3484k2630
56875C62655k0635j8720j6098j2249q252m981j792K030O225J0852J6878K4527
56863C40440L2733M1256N1585O4227P6093Q1625P6044N7763K9625j430k7658m4932
56851G77371n3698n5974n3162m6754l8803l0576k2113j3690o080R07Q500J7143
56839D83071K6389L6774M9729O5394Q2798J01923J21890J35939J32308J03757
56829A339972N5166K06m7997q2139j00500j05474j01811r3589q2481o9408n6381
$$ plain form
56914 214825 203393 194287 186805 179976 173518 168184 164454 161607 158783 156102 153901 151854 149882 149146
56900 149146 150914 154951 159954 165156 170703 177061 184897 194965 207325 221275 236666 254597 276234
56887 276234 301831 331307 364204 397784 426425 444620 450300 444612 429810 408769 385285 362655
56875 362655 342020 323300 307202 294953 286701 281720 279928 281958 288183 299035 315913 340440
56863 340440 373173 414429 466014 530241 606334 687959 764003 821766 851391 849961 822303 777371
56851 777371 723673 667699 614537 567783 528980 498404 476291 462601 456521 457428 465928 483071
56839 483071 509460 546234 595963 661357 744155 846078 967968 1103907 1236215 1339972
56829 1339972 1395138 1395344 1347347 1265208 1164708 1059234 957423 863834 781353 711945 655564
56818F55564m5177l5440k5821j6148p023J939J1893K3341L6151N0555O6797Q3415
56806H00046R5842R6858Q0134M5817K827l6391o4210q0128q6385q4759p7847o9400
56794F22404o1250n2311m2090l2594k5231j8539j1073l978J566P184J5044K4670
56782D23802L4327M3554N1423N3887M6274K8338M916j7881l5583m5967m9453m8779
56770D88858m6623m3637l9480l4580k9619k4584j9763j6394j4896j3735j1569
56759A93978r155p631o438m631k842k138k145k095k347l195l514k418r72m31j90
56744A43836O59J188K51j104j157l53l39j128j469j318j680k529k893k600k243
56729A27121j953j644j781k475k735k016j487k224l326l435k842k493k165j410
$$ plain form
56818 655564 610387 574947 549126 532978 525955 527894 539787 563128 599279 649834 716631 800046
56806 800046 895888 992746 1072880 1118697 1121524 1085133 1020923 940795 854410 769651 691804 622404
56794 622404 561154 508843 466753 434159 408928 390389 379316 375338 376904 384088 399132 423802
56782 423802 458129 501683 553106 606993 653267 681605 686521 668640 633057 587090 537637 488858
56770 488858 442235 398598 359118 324538 294919 270335 250572 234178 219282 205547 193978
56759 193978 184823 177192 170754 166123 163281 161143 158998 156903 154556 151361 147847 145429 144457 144026 143836
56744 143836 144495 145683 145934 144830 143673 143320 142981 141853 140384 139066 137386 134857 131964 129364 127121
56729 127121 125168 123524 121743 119268 116533 114517 113030 110806 107480 104045 101203 98710 96545 95135
56715I5135r61j345j462m31N78L22j91M63J398R70k36m58K66O88R01J772K690
56698A00099K450J574J379J518Q22j28J90J474K115J856J645J429M94n13l36N73
56682A16641P33J97J67O18N69K27N77J261J170O65R72J719J443J60p67j059j601
56665A23692k379k514k112k092k422k420k391l064l896l828l167k880k740k134
56651H5653j756k449l257k920k322k967l979l330j367k69m68l70O45J608K155
56636F4607K852L484L280K640K520K543J873J210J635K254J560L77O47K049K650
56621I6181K319K516L183K949K090K195L030K814J523Q76J153J010M34P92J875
56606A24940J949R32N36J059J033K63J77Q52P01m07p48M6K64o57j127l40M09K23
$$ plain form
56715 95135 94174 92829 91367 90936 91514 91836 91645 92108 93506 94476 94240 93782 94048 94736 95637 97409 100099
56698 100099 102549 104123 105502 107020 107842 107714 107904 109378 111493 113349 114994 116423 116917 116404 116068 116641
56682 116641 117374 117571 117738 118356 118925 119152 119729 120990 122160 122825 123797 125516 126959 127119 126352 125293 123692
56665 123692 121313 118799 116687 114595 112173 109753 107362 104298 100402 96574 93407 90527 87787 85653
56651 85653 83897 81448 78191 75271 72949 69982 66003 62673 61306 61037 60569 60199 60844 62452 64607
56636 64607 67459 70943 74223 76863 79383 81926 83799 85009 86644 88898 90458 90835 91482 93531 96181
56621 96181 98500 101016 104199 107148 109238 111433 114463 117277 118800 119676 120829 121839 122273 123065 124940
56606 124940 126889 127821 128357 129416 130449 130712 130889 131741 132442 132035 131287 131333 131597 130940 129813 129473 129882 130105
56588A30105j6M02Q74J000J222J531J461J490K412L377K863J427R93J640J711
56573A52492J012J061K063K531K185K402L474M045L710L523L712L379K653K552
56559A90794K722J909P26J098K946M228M279M259M343L523K250K133K897K699
56545B30806J447P24N03o20k076j885o75j240l728n219m658m194m835m844l602
56530A95904l084m004m194k447o07k69n24m88j018k485l648l945m267m504l340
56515A57080j205l23r62r26M20J073K40l48m7n25k157k831j769r81j467j512k92
56498A43468L72m32r17m0O40K17J99J284J699N39m19l5L70L1L07J589K000R92
56480A51864P55K313L600L291K984L667L535J555j81P4J048J381J993L402L878
$$ plain form
56588 130105 130089 130491 131365 132365 133587 135118 136579 138069 140481 143858 146721 148148 149141 150781 152492
56573 152492 153504 154565 156628 159159 161344 163746 167220 171265 174975 178498 182210 185589 188242 190794
56559 190794 193516 195425 196151 197249 200195 204423 208702 212961 217304 220827 223077 225210 228107 230806
56545 230806 232253 232977 233480 232860 230784 228899 228224 226984 223256 218037 213379 209185 204350 199506 195904
56530 195904 192820 188816 184622 182175 181568 181299 180775 180287 179269 176784 173136 169191 164924 160420 157080
56515 157080 155875 155552 154590 153664 154084 155157 155397 155049 155002 154477 152320 149489 147720 146739 145272 143760 143468
56498 143468 143840 143408 142491 142451 143091 143308 143507 144791 146490 147029 146610 146575 146945 146976 147283 148872 150872 151864
56480 151864 152619 154932 158532 161823 164807 168474 172009 173564 173383 173457 174505 175886 177879 181281 185159
56465A85159K484J030R32J113Q03J254K767L449K740K727L983L862J148j359j332
56450B10760k89m0N31K308L262J960N11R84K016J771J237J691J898P10m49m01
56434B28460o26k244l573l238k684l074k929j392n52j696k720k033j633l264m930
56419A91872m428l102k866k714j439o31j613k481j517m88j223k019q66P10N68
56404A67763j68M77J767K362L120M556M593K131j38P5P70n78k561k787k220k698
56388A76464l050j578L12P43J040L026N304N856N779O847Q019P814P381P753P091
56373B38801M164J564J710K754K130R59J116J186m50j777o52R04K95r54l64P05
56357B52091J5q73L79K083J502PM21J863J891J288K000K788J602n4L43J801K129
$$ plain form
56465 185159 187643 188673 189605 190718 191521 192775 195542 198991 201731 204458 208441 212303 213451 212092 210760
56450 210760 210471 210431 210962 213270 216532 218492 219003 219987 222003 223774 225011 226702 228600 229310 228861 228460
56434 228460 227834 225590 222017 218779 216095 213021 210092 208700 208148 206452 203732 201699 200066 196802 191872
56419 191872 187444 184342 181476 178762 177323 176692 175079 172598 171081 170593 169370 167351 166485 167195 167763
56404 167763 167595 168072 169839 172201 175321 179877 184470 186601 186463 186538 187308 186730 184169 181382 179162 176464
56388 176464 173414 171836 172148 172891 173931 176957 182261 188117 193896 200743 208762 216576 223957 231710 238801
56373 238801 242965 244529 246239 248993 251123 252082 253198 254384 253934 252157 251505 252409 252704 251750 251386 252091
56357 252091 252106 251233 251612 253695 255197 255204 255625 257488 259379 260667 262667 265455 267057 267003 267346 269147 271276
56340B71276K155L313L951K488J293K797M741M189L043M492P072P592O967P671
56326C33040Q348O640M605N537P956Q527Q247R793J1393R686O422N893P583P559
56312D41229N475M101L531J825q4O2R22k90k440k717k189l488n134m082j800j711
56296D33210k754j618O45P47j53J483M624N412M282M732O527O754O120P565J0062
56281D87638J0446R945J2077J5540J6237J5007J6226J9859K2084K2837K5493K9813
56269G03202L2441L3780L7371M2958M7191N0536N6518O4717P1568P7535Q6325
56258A304142R7534J07210J15303J25260J36610J45226J50705J56203J61140J61351
56248B660684J56427J49613J40526J25349J04451Q2576O1262L8169J4068o696
$$ plain form
56340 271276 273431 276744 280695 283183 284476 287273 292014 296203 299246 303738 310810 318402 325369 333040
56326 333040 341388 348028 352633 358170 366126 374653 382900 392693 404086 413772 420194 426087 433670 441229
56312 441229 446704 450805 454336 456161 456077 456139 457061 456771 454331 451614 449425 445937 440803 436721 434921 433210
56296 433210 430456 428838 429483 430230 430077 431560 436184 441596 445878 450610 457137 463891 470011 477576 487638
56281 487638 498084 508029 520106 535646 551883 566890 583116 602975 625059 647896 673389 703202
56269 703202 735643 769423 806794 849752 896943 947479 1003997 1068714 1140282 1217817 1304142
56258 1304142 1401676 1508886 1624189 1749449 1886059 2031285 2181990 2338193 2499333 2660684
56248 2660684 2817111 2966724 3107250 3232599 3337050 3419626 3480888 3519057 3533125 3526429
56238C526429k3024l7502m9904n7176n9963o2286o4802o4964o3472o3636o4933
56227B914767o4359o3445o6529p2822p7781q1380q7040r3428r5980r5782r7980
56216B018241j01767j01317r6541r3384r2921q9834q2711p6309p2183o6351n8006
56205A086917n1589m8273m3974l7625l3057l1074k7979k3362k1062k1093j9098
56194G28731j4993j3436j4610j3448r312p225q088p027l118j315k742k462R97
56181F31952L158K777M157Q089R770Q131Q058J1023J2628J1673J2350J5186J5279
56168G54231J1859J0131J1260J0233N995L832N084M510O23j351L37Q44j297j282
56154H15009J974L178J123J482N973R049Q671R962J4800J8323J9170K2563K9696
$$ plain form
56238 3526429 3503405 3465903 3415999 3358823 3298860 3236574 3171772 3106808 3043336 2979700 2914767
56227 2914767 2850408 2786963 2720434 2647612 2569831 2488451 2401411 2307983 2212003 2116221 2018241
56216 2018241 1916474 1815157 1718616 1625232 1532311 1442477 1359766 1283457 1211274 1144923 1086917
56205 1086917 1035328 987055 943081 905456 872399 841325 813346 789984 768922 747829 728731
56194 728731 713738 700302 685692 672244 662932 655707 647619 640592 637474 636159 633417 630955 631952
56181 631952 635110 637887 642044 650133 659903 668034 676092 687115 699743 711416 723766 738952 754231
56168 754231 766090 776221 787481 797714 803709 807541 812625 817135 817758 816407 816744 817588 816291 815009
56154 815009 816983 820161 821284 822766 828739 837788 846459 856421 871221 889544 908714 931277 960973
56141I60973L4891L6915M2192N2980O3589P2223Q5245J05408J27063J47146J69201
56130A897826J91881K05185K03508J91722J74206J49777J22138J02682R6448R5857
56120C431230R3158Q7779P7408N5162K2080r520l1124m5434n4800n5986n2212
56109C517741n6451p5179j00668j25250j50022j73355j85309j81743j71197j60257
56099B138310j44865j23307j03987r2064q1460o8156n8235n4844n0687m1765l4974
56088A283966l3983l1481k3766j8654k0123j9790j2842p513r102r722m060r1l257
56075A089582n231K38N263L187J130N411R185O688N143J0252J4395J1580R491
56062A166314J4322J8422J5481J2936J6680J8876J3800J0187J4602J8543J5283
$$ plain form
56141 960973 995864 1032779 1074971 1127951 1191540 1263763 1349008 1454416 1581479 1728625 1897826
56130 1897826 2089707 2294892 2498400 2690122 2864328 3014105 3136243 3238925 3335373 3431230
56120 3431230 3524388 3612167 3689575 3744737 3766817 3757297 3726173 3680739 3625939 3569953 3517741
56109 3517741 3461290 3386111 3285443 3160193 3010171 2836816 2651507 2469764 2298567 2138310
56099 2138310 1993445 1870138 1766151 1674087 1592627 1524471 1466236 1411392 1360705 1318940 1283966
56088 1283966 1249983 1218502 1194736 1176082 1155959 1136169 1123327 1115814 1106712 1096990 1092930 1092839 1089582
56075 1089582 1084351 1084589 1089852 1093039 1094169 1099580 1108765 1115453 1120596 1130848 1145243 1156823 1166314
56062 1166314 1180636 1199058 1214539 1227475 1244155 1263031 1276831 1287018 1301620 1320163 1335446
56051A335446J3137J8310K1599J6461J2918J8564K3436J9307J6049K2429K8846
56040A546502K6214K3859L0836L7600L4623L1165L6781M2398L8946L6328M4142
56029A929394N2030M9461M6197N2476N8094N2620M6910N2347N8424N3692M8917
56018B500562N5808O3090N8182N2209N8383O6312O3530O1290P2232Q4000Q2530
56007C218128P9709Q9700J00337R7325R3617J04427J16799J15345J13788J28216
55997D257391J44280J44989J45123J62498J81851J84406J85675K05145K27023
55988E838381K31623K35995K60817K87915K95487L03069L34248L68803L82161
55979H538499L96834M40870M92411N22868N56150O23476P00249P54115Q13121
$$ plain form
56051 1335446 1348583 1366893 1388492 1404953 1417871 1436435 1459871 1479178 1495227 1517656 1546502
56040 1546502 1572716 1596575 1627411 1665011 1699634 1730799 1767580 1809978 1848924 1885252 1929394
56029 1929394 1981424 2030885 2077082 2129558 2187652 2240272 2287182 2339529 2397953 2451645 2500562
56018 2500562 2556370 2619460 2677642 2729851 2788234 2854546 2918076 2979366 3051598 3135598 3218128
56007 3218128 3297837 3387537 3487874 3585199 3678816 3783243 3900042 4015387 4129175 4257391
55997 4257391 4401671 4546660 4691783 4854281 5036132 5220538 5406213 5611358 5838381
55988 5838381 6070004 6305999 6566816 6854731 7150218 7453287 7787535 8156338 8538499
55979 8538499 8935333 9376203 9868614 10391482 10947632 11571108 12271357 13025472 13838593
55970A3838593R15137J034661J136766J255883J437466J652621J862718K115021
55962B5248866K474115K916608L403523L991341M747403N630808O603722P783557
55954F2799943R325880J1259998J3643908J6767515K0953524K6289781L2811651
55947A93852200M0516267M8275184N2648069M9017093L5192874J4017475q152602
55940D25366560k5687672l6443936m1176523m1547131l9068612l5051206l0535179
55933A75856301k6093638k1953971j8288633j5231026j2734695j0649824q912454
55926F1992060p523265o409429n457607m640812l987290l463322k998132k586851
55918B4925352k264649k010644j771290j548882j379300j249041j115447r83965
$$ plain form
55970 13838593 14753730 15788391 16925157 18181040 19618506 21271127 23133845 25248866
55962 25248866 27722981 30639589 34043112 38034453 42781856 48412664 55016386 62799943
55954 62799943 72125823 83385821 97029729 113797244 134750768 161040549 193852200
55947 193852200 234368467 282643651 335291720 384308813 419501687 433519162 425366560
55940 425366560 399678888 363234952 322058429 280511298 241442686 206391480 175856301
55933 175856301 149762663 127808692 109520059 94289033 81554338 70904514 61992060
55926 61992060 54468795 48059366 42601759 37960947 33973657 30510335 27512203 24925352
55918 24925352 22660703 20650059 18878769 17329887 15950587 14701546 13586099 12602134
55910A2602134q88917q20499p42350o60170o04927n67808n16314m56696m18925
55901F925528l96618l60648l16678k92705k83593k62012k31600k17415k15372
55892D348887k00764j76552j65688j65270j53734j34402j28173j31412j23173
55883B969719j06264j00601j03484r5771q0237p5696p9725p4194o1491n9274o5257
55872B067725o2044n1497n0178n5959n2346m1278l9316m5495m4299l6457l6238
55861A552618m1986l9162k9181k6267k9185k4348j3541j0626j3855q760M291J1854
55849A331852J3237J8220K2490J2315q418k1807k4727k9112l6032l5014k7574
55838A215430k6253l0802k9306k2226k1716k7850k8826k4249k5176l1245l0671
$$ plain form
55910 12602134 11713217 10892718 10150368 9490198 8885271 8317463 7801149 7344453 6925528
55901 6925528 6528910 6168262 5851584 5558879 5275286 5013274 4781674 4564259 4348887
55892 4348887 4148123 3971571 3805883 3640613 3486879 3352477 3224304 3092892 2969719
55883 2969719 2863455 2762854 2659370 2563599 2483362 2407666 2327941 2253747 2192256 2132982 2067725
55872 2067725 2005681 1954184 1904006 1848047 1795701 1754423 1715107 1669612 1625313 1588856 1552618
55861 1552618 1510632 1471470 1442289 1416022 1386837 1362489 1348948 1338322 1324467 1315707 1319998 1331852
55849 1331852 1345089 1363309 1385799 1398114 1389696 1367889 1343162 1314050 1278018 1243004 1215430
55838 1215430 1189177 1158375 1129069 1106843 1085127 1057277 1028451 1004202 979026 947781 917110
55827I17110k3050j9928k2410k0223j3362j2857j9102k0749j6251j5711k0132
55816G13335j9490j2935j0694j4069j3243o850m359p070n709R25L554P67J500
55803F25662O970Q209L937L190P479P717J591k833l407p106j4378j6792j3119
55790F07120j1837j4956j5060j0860r859j3062j2629p470n657q696q705l884j446
55777D82999k590k17N455M769m205j1515j2236j2724j6140j6511j1811q806j0008
55764C86460r073l715l93j902k904j633l428q765j0497o992n580r012j0861q354
55750C03351p293j0023j0696o932m429n692n678k725k331n894p150l908k061l921
55736B24618l856K78K644O42l33K373L956K287J916L877K408l785p755o265m852
$$ plain form
55827 917110 894060 874132 851722 831499 818137 805280 786178 765429 749178 733467 713335
55816 713335 693845 680910 670216 656147 642904 636054 631695 624625 618916 619841 623395 624162 625662
55803 625662 632632 640841 644778 647968 655447 663164 664755 661922 658515 651409 637031 620239 607120
55790 607120 595283 580327 565267 554407 544548 531486 518857 511387 505730 497034 488329 484445 482999
55777 482999 480409 480192 485647 490416 486211 474696 462460 449736 433596 417085 405274 396468 386460
55764 386460 377387 373672 373279 371377 368473 366840 363412 354647 344150 337158 331578 322566 311705 303351
55750 303351 296058 286035 275339 268407 263978 258286 252608 249883 247552 241658 234508 230600 228539 224618
55736 224618 220762 221040 223684 224326 223993 226366 230322 232609 234525 238402 240810 237025 229270 223005 218153
55721B18153o667o956l410j363l613n175l195k190m484n180j696J171N92P90M047
55706A80824O004M650M703Q205R991P305M846N458M976J226r78J093K887J504
55692B42694J038L875N387K662J10J036J764o88l034k809l072n172m800l04L019
55677B41706J849K38J367J923l77j772n4P50j610k794k30J605m36k336q38N32
55661B39523j045j907O74K793J433L72K673M531K608N29J810L083O67k507k830
55646B52407k726n304q125q277q066r830j0709q211n577n997o973n648m313n259
55632A57392n797l701k213m155o532o129n126n976o242l792j655k307k629M5K319
55617A03502P03k048k127j127j789k366p33P02m16j549l01N98j469l580k476m25
$$ plain form
55721 218153 211486 204530 201120 199757 196144 190969 187774 185584 181100 175920 174224 175395 175987 176777 180824
55706 180824 186828 191478 196181 204386 214377 221682 226528 231986 236962 238188 237210 238303 241190 242694
55692 242694 243732 247607 252994 255656 255766 256802 258566 257878 254844 252035 248963 243791 238991 238687 241706
55677 241706 243555 243793 245160 247083 246706 244934 244880 245630 244020 241226 240996 242601 242165 239829 238991 239523
55661 239523 238478 236571 237245 240038 241471 241843 244516 249047 251655 252184 253994 257077 257744 255237 252407
55646 252407 249681 244377 236252 227975 219909 210079 199370 191159 185582 179585 172612 166964 162651 157392
55632 157392 151595 147894 145681 141526 134994 128865 123739 117763 111521 107729 106074 103767 101138 101183 103502
55617 103502 104205 102157 100030 98903 97114 94748 94015 94717 94301 92752 92451 93049 91580 88000 85524 85099
55601H5099o54j540n95L88n84j136P62K171M38j558o40R09Q0j041L41K091J411
55584H5942L71J647K990J465q93r99k12p34p49J563L380K040L27J581L628L104
55568A04451J763K873N194O042O555Q449R289O548K728J152L10k359m951m866
55554A43178m202n794p577o552m688n145o181m683k324k324l297k193k98m97j430
55539H5993j61J998J949M94K67O48j26n19J438L658L444K437L164L838J871o77
55523A09716o26M65n22k344k195j349k327l385j752N64Q0j745j354K64k10k002
55507I1278k091j172j820k961k014m55j270l007k316m19r24l061l243j758j832
55492F2935l342l415k115j831k065m04K365L373K752K635K464M41j899j808n82
$$ plain form
55601 85099 84445 82905 82310 82698 82114 80978 81740 83911 84349 82791 82151 83060 83140 82099 82440 84531 85942
55584 85942 86313 87960 90950 92415 91522 90523 90311 89577 88828 90391 93771 95811 96138 97719 101347 104451
55568 104451 106214 109087 114281 120323 126878 135327 144616 151164 153892 155044 155354 152995 148044 143178
55554 143178 138976 133182 125605 119053 114365 109220 103039 98356 96032 93708 90411 88218 87920 87423 85993
55539 85993 85832 87830 89779 90273 90540 91188 91062 90543 91981 95639 99083 101520 104684 108522 110393 109716
55523 109716 109090 109555 109033 106689 104494 103145 100818 97433 95681 96245 96325 94580 93226 93490 93280 91278
55507 91278 89187 88015 86195 83234 81220 80765 79495 76488 74172 73753 72829 69768 66525 64767 62935
55492 62935 59593 56178 54063 52232 50167 49763 52128 55501 58253 60888 63352 63793 61894 60086 59504
55477E9504j362l307l280j844k001l336k973j175n78q93J03J436L35k233k803
55462C5593j377p75j011K51K444K752J444J293K166J428p04j387l87j52j081j367
55446C9130j089j761k473j164R64J026l27j41J258R63q79j350k39k08j622k030
55430C0058p58M04R29J749K239J167j7Q79K522K036J50k65M74j09j435q65R75
55413D0133J172K3K74J538J007q37p52J217J796M87R9J127J075l76p70J06k39
55396D7080j953k314q41l4n14k16J047R74o46j308l83O0m75j97J002J159J85J3
55378D2639O64M22k08P76K353J547j050j791j80N55n74j111m38r20k796l147j219
55361C5522J49k98l62R10J338j05j405j426j602k413k148m85N45K27J00M70j24
$$ plain form
55477 59504 58142 54835 51555 49711 47710 44374 41401 40226 39648 38755 38858 40294 40629 38396 35593
55462 35593 34216 33441 32430 32681 35125 37877 39321 40614 42780 44208 43504 42117 41730 41578 40497 39130
55446 39130 38041 36280 33807 32643 33607 34633 34306 34165 35423 36386 35507 34157 33918 33710 32088 30058
55430 30058 29300 29704 30633 32382 34621 35788 35771 36650 39172 41208 41358 41093 41567 41458 40023 39158 40133
55413 40133 41305 41328 41602 43140 44147 43310 42558 43775 45571 46058 46157 47284 48359 47983 47213 47319 47080
55396 47080 45127 42813 41972 41938 41424 41208 42255 43229 42583 41275 40892 40952 40477 40280 41282 42441 42626 42639
55378 42639 43303 43725 43517 44293 46646 48193 47143 45352 45172 45727 45153 44042 43604 42684 39888 36741 35522
55361 35522 35671 35373 35011 35921 37259 37154 35749 34323 32721 30308 28160 27675 28220 28447 28547 29017 28893
55344B8893j310q58J013J548L07j74P01N73j030j501k9Q59jn82P4K5j489k322
55326B4697j429n86o41J7J693K100N02o65L3Q18L62oO88J217Q46O47Q91L11r39
55307C0556j041p2k40j766k209r10j32p17o84O88J423P64O10J579J656K33n11
55290B9227K56M74o54r74M37J310L29n58J04Q44N08L63J139J415P24P99K008K135
55272C9886M37p69k96j71j561k391j198J70l6o11k07J24n90j215r56r56j647j488
55254B6525m7O88k09r49m37j96j095j496m10O21N69O33J327J169o3k78R97J215
55236B8564o76k016r15O46N64PN36J119O74N04J615K381J436K02K39O87M58L64
55218C6389R96J189N60P14K062K421P61p65n30q6q89j615r92k24k69K18J851K488
$$ plain form
55344 28893 27583 26725 27738 29286 29593 29419 30120 30693 29663 28162 28133 28992 28991 28409 28483 28508 27019 24697
55326 24697 23268 22682 22041 22058 23751 25851 26353 25688 25721 26539 26901 26895 27583 28800 29646 30293 31184 31495 30556
55307 30556 29515 29443 29203 27437 25228 24318 24186 23469 22785 23473 24896 25660 26270 27849 29505 29738 29227
55290 29227 29483 29957 29303 28329 28766 30076 30405 29847 29951 30795 31303 31666 32805 34220 34944 35743 37751 39886
55272 39886 40323 39554 39258 39087 37526 35135 33937 34107 34071 33460 33253 33377 32787 31572 30616 29660 28013 26525
55254 26525 26478 27166 26957 26008 25571 25375 24280 22784 22374 22995 23564 24197 25524 26693 26630 26352 27349 28564
55236 28564 27888 25872 24957 25603 26167 26174 26710 27829 28503 29007 30622 33003 34439 34641 34880 35567 36025 36389
55218 36389 37385 38574 39134 39848 41910 44331 45092 44327 43797 43711 42822 41207 40215 39991 39722 39940 41791 44279
55200D4279P94j137j216n46p14q53J6N70k91j119o11L8k75l33O70J089l6p94J89
55181C9720J103K49r33p74l31q00r46O8L41j365k838k025n44m92p45K70J051j81
55163C0828j798j569o67j221k111j068R91J551P93O73J163Q25j12l99l64r52j431
55146B5132p70O7j94o54N5J126J160P49R79J135L96J3J144K372K037J177J479
55129C7403K169J735R34J237J952J721J137J295J440P89O94K197L254J582j464
55114E8075k864k299j595j366j078j057j599j506j14P95k42j495p56R07J183N11
55098D5500Q22J846J869R22K65j42p68o05J085K546J934L91pL02o2k67J022K432
55080E9085J840J84j25P20P92J87M18J132Q46L6J80O68o8j271r69L92O88j88n14
$$ plain form
55200 44279 45073 43936 42720 42174 41460 40607 40623 41193 40902 39783 39172 39210 38935 38602 39272 40361 40325 39531 39720
55181 39720 40823 41072 40139 39365 39034 38234 37288 37356 37697 36332 33494 31469 30925 30433 29688 29958 31009 30828
55163 30828 29030 27461 26794 25573 23462 22394 23385 24936 25729 26402 27565 28390 28278 27879 27515 26563 25132
55146 25132 24362 24429 24235 23581 23636 24762 25922 26671 27650 28785 29181 29194 30338 32710 34747 35924 37403
55129 37403 39572 41307 42241 43478 45430 47151 48288 49583 51023 51812 52506 54703 57957 59539 58075
55114 58075 55211 52912 51317 49951 48873 47816 46217 44711 44597 45392 45150 43655 42899 43806 44989 45500
55098 45500 46322 48168 50037 50959 51224 51082 50314 49709 50794 53340 55274 55665 55658 55960 55898 55631 56653 59085
55080 59085 60925 61109 60984 61704 62496 62683 63101 64233 65079 65115 65295 65963 65895 64624 63655 64047 64735 64547 64033
55061F4033L5L84N15J076J279R8j308j202l16l80p86P6J326Q98n32m86J029J726
55043F7465J060O39Q92O85J02M09J266R61m99j354j102r09j148j064p34q66r71
55026F4832p6J109J128L17J05M33K47k24j26l3p88j329l00J148J055M1P3Q28M85
55007F8925p62j188p89q61j093l37M30n77k326k155k11Q44K85n6M85N34k60o31
54989F0257l92o53j229p77L55M31n25p40Q7M90J22N9L16j0l05Q29K505K368M77
54970F3665o89j80O01J016J959L294L605K904K694L169L145K816L646N457O609
54955A03711P074Q211R575R297P814P762R794J1874J3051J4466J6016J5551J2419
54942B46615Q525M949O10m723r188j1821j3909j6166j7215j6126j4082j2391j0997
$$ plain form
55061 64033 64068 64452 64967 66043 67322 67420 66112 64910 64594 64214 63428 63504 64830 65728 65196 64710 65739 67465
55043 67465 68525 69164 70056 70741 70843 71252 72518 73479 72980 71626 70524 69615 68467 67403 66669 65803 64832
55026 64832 64756 65865 66993 67310 67415 67848 68095 67871 67745 67712 66924 65595 65295 66443 67498 67539 67612 68440 68925
55007 68925 68163 66975 66186 65325 64232 63895 64325 63748 61422 59267 59056 59900 60185 60129 60614 61148 60888 60257
54989 60257 59865 59212 57983 57206 57561 57992 57467 56727 56814 57304 57426 57485 57801 57791 57486 58315 60820 63188 63665
54970 63665 62976 62796 63397 64413 66372 69666 73271 76175 78869 82038 85183 87999 91645 97102 103711
54955 103711 110785 118996 128571 137868 145682 153444 163238 175112 188163 202629 218645 234196 246615
54942 246615 255140 260089 260699 255976 246788 234967 221058 204892 187677 171551 157469 145078 134081
54929A34081r698q744p663n664l626l251m064l807k081q21p89n67M56J043Q30
54914H5635J162K460L440L735M552O110P110P470Q791J1327J3364J4251J5132
54901A84539J5871J4423J0323N859K541p60m968q901j1560j3618j5309j5425j3724
54888A49291j1909j0953r817p907o358n754n121m224m274n171m821k518l60R9
54874G0203o3K38J33q62j228j17P99N0j161j202o20o44r11o09k33m47p20o02q31
54855F1173j727k066r75N14J098R42O11j06j144j504q79m27q66j308r79n20n88
54838E1249p09m98m34n48k1J178J894J736J628J794J208k10r46l65K85K01K06
54821E7648O58M81n92j021J2J133J147Q24J092J426J350J601K487K934K424K046
$$ plain form
54929 134081 124383 115639 107976 102312 98686 95435 91371 87564 85483 84662 83873 83306 83762 84805 85635
54914 85635 86797 89257 92697 96432 100984 107094 114204 121674 130465 141792 155156 169407 184539
54901 184539 200410 214833 225156 231015 233556 232796 227828 218927 207367 193749 178440 163015 149291
54888 149291 137382 126429 116612 108705 102347 96593 91472 87248 82974 77803 72982 70464 70104 70203
54874 70203 70140 70378 70511 69649 68421 68304 69103 69153 67992 66790 66170 65526 64615 64006 63773 63326 62606 62004 61173
54855 61173 59446 57380 56405 56919 58017 58959 59570 59464 58320 56816 55937 55510 54644 53336 52357 51837 51249
54838 51249 50540 50042 49608 49060 49039 50217 52111 53847 55475 57269 58477 58267 57321 56956 57241 57442 57648
54821 57648 58306 58787 58195 57174 57186 58319 59466 60290 61382 62808 64158 65759 68246 71180 73604 75650
54805G5650K489K922K984L744N470O607O379O294P539R015R626J0476J2891J5912
54791A77998J7610J7494J6110J3609J0163O508K874j328n867r332j1204j2454
54779B22181j3278j2428r829p565o899o541n348m357m480m408k908j206r49j515
54765A40470j371n99K1R99L102N441O580O775P430R097J1308J3674J5985J8060
54751B36972K0249K3088K5877K6968K5921K3806K0843J5780Q276p5p908j5097
54739D04700k0928k3780k3818k3488k3952k3530k1066j8213j6587j5257j3034
54728A81047j0907j0017r381p858o307n686m988l318k051k515l378k798j511j289
54714A09043j846j747j081q43q66n74o25j656k535j967o87j20q0K97O70M66M40
$$ plain form
54805 75650 78139 81061 84045 87789 93259 99866 106245 112539 120078 129093 138719 149195 162086 177998
54791 177998 195608 213102 229212 242821 252984 259492 262366 261038 255171 245839 234635 222181
54779 222181 208903 196475 186646 179081 172182 165641 160293 155936 151456 147048 144140 142934 141985 140470
54765 140470 139099 138500 138521 139520 142622 148063 154643 161418 168848 177945 189253 202927 218912 236972
54751 236972 257221 280309 306186 333154 359075 382881 403724 419504 427780 427705 419797 404700
54739 404700 383772 359992 336174 312686 288734 265204 244138 225925 209338 194081 181047
54728 181047 170140 160123 150742 142884 136577 130891 125903 122585 120534 118019 114641 111843 110332 109043
54714 109043 107197 105450 104369 103526 102660 102086 101461 99805 97270 95303 94616 94496 94416 94713 95383 95849 96289
54697I6289J201J624P31k54R9Q53L79o80o16L34O73M13P16J465J532R31N91N42
54679A06823K02n1N79J745K560L096L822M362M273M067M126L762K769K485L656
54664A48276M710M046K655K424L169L505L431L806M279M008L630M338N789O810
54650B04876P408Q288R203R709J0558J2545J4899J6621J8366K1170K4296K6224
54638C84163K6721K6008K3095J7043Q942P02p122j4515k0374k3740k5527k6939
54626C68457k7380k5959k3705k2013k0272j7422j4490j2958j1899r554o629n117
54614A71059m735l569j600n23n37k84K81j30j375j883j412j336j996k340k160
54599A47460k440l286l677l485l676m483n205n658n987n411l258r55o83k255l416
$$ plain form
54697 96289 97490 99114 99845 99591 99690 100543 100922 100242 99626 99960 100633 101046 101762 103227 104759 105690 106281 106823
54679 106823 107025 106974 107553 109298 111858 114954 118776 123138 127411 131478 135604 139366 142135 144620 148276
54664 148276 152986 157032 159687 162111 165280 168785 172216 176022 180301 184309 187939 192277 198066 204876
54650 204876 212284 220572 229775 239484 250042 262587 277486 294107 312473 333643 357939 384163
54638 384163 410884 436892 459987 477030 485972 486674 479552 465037 444663 420923 395396 368457
54626 368457 341077 315118 291413 269400 249128 231706 217216 204258 192359 182805 176176 171059
54614 171059 166324 162755 161155 160632 160095 159811 160092 159962 158587 156704 155292 153956 151960 149620 147460
54599 147460 145020 141734 138057 134572 130896 126413 121208 115550 109563 104152 100894 99939 99256 97001 93585
54584I3585l119k350j864j332q44j060j663j590r66r93j835k317j809q62k0N63
54568G1524M94l06q78m12L53M19L57J148K048J726O68L53O74M53j32J2N79M85
54550G9565K78J347L014L104J500N25J550L442M700N070M861M501M918O594Q352
54535A33321Q804Q609R350J0782J1401J1237J1544J2038J1027Q271N197K262j336
54522B42507n221p778q830r989j1814j2955j2570j1498j0542r584q717q317p814
54509A16878o346m635m158m500l793j826l82k77n40o69j277k093j783l65M56j06
54493H4584j040j616k148k345j347K44O15l63q49q7O70P71J159J980J798L07o47
54476H1686N4J102J159R07J376K094K323K361K452J918N90m28m63l21o26o83k4
$$ plain form
54584 93585 90466 88116 86252 84920 84076 83016 81353 79763 78797 77804 75969 73652 71843 70981 70961 71524
54568 71524 72018 71712 70834 70422 70775 71194 71551 72699 74747 76473 77141 77494 78168 78621 78489 78501 79080 79565
54550 79565 79843 81190 84204 87308 88808 89333 90883 94325 99025 104095 108956 113457 118375 124969 133321
54535 133321 142125 150734 160084 170866 182267 193504 205048 217086 228113 236384 241581 243843 242507
54522 242507 237286 229508 220678 210689 198875 185920 173350 161852 151310 141726 133009 124692 116878
54509 116878 110532 105897 101739 97239 93446 91620 91238 90961 90421 89752 88475 86382 84599 84234 84690 84584
54493 84584 83544 81928 79780 77435 76088 76332 76947 76584 75735 75648 76318 77089 78248 80228 82026 82333 81686
54476 81686 81740 82842 84001 84908 86284 88378 90701 93062 95514 97432 98022 97594 97131 96810 96184 95501 95477
54459I5477L99k05j077j231j038j325j905k051j685j258j057j147j408j380q02
54444G8307k92o01j328j456r77p30q01n50m8L1j48J45O45M13l48m84J59O68P85
54425G3390R85J013K16q11q41j08J49LM55J088N62o40n82P96J511R74R16K225
54407H1301L523L738L610L759L523K683K199K435K618K715L662N151N476M242
54393A30635K980K408J565K52k13K98Pj718l107k972k465k615k605j880j591k349
54377A16630k862k287j801k272k526j581n51o28j080q91n95q71j089q02q99j749
54361I4146k023r02L37N14M84J220J778J037j70m59m3K61P01J610K200J927J728
54344A04346K360K942K641K300K807L351K957K315K401K622K061J213Q94O31k59
$$ plain form
54459 95477 95876 95671 94594 93363 92325 91000 89095 87044 85359 84101 83044 81897 80489 79109 78307
54444 78307 78015 77414 76086 74630 73653 72923 72122 71572 71524 71555 71407 71552 72197 72610 72262 71778 71937 72605 73390
54425 73390 74375 75388 75604 74793 73952 73844 73993 73996 74451 75539 76101 75461 74879 75675 77186 78160 79076 81301
54407 81301 84824 88562 92172 95931 99454 102137 104336 106771 109389 112104 115766 120917 126393 130635
54393 130635 133615 136023 137588 137840 137627 137925 137932 136214 133107 130135 127670 125055 122450 120570 118979 116630
54377 116630 113768 111481 109680 107408 104882 103301 102750 102122 101042 100151 99556 98685 97596 96794 95895 94146
54361 94146 92123 91221 91558 92072 92556 93776 95554 96591 96421 95962 95919 96180 96881 98491 100691 102618 104346
54344 104346 106706 109648 112289 114589 117396 120747 123704 126019 128420 131042 133103 134316 135210 135841 135582
54329A35582j260j845k707m221n069m223k944k991l985m395m037l736l442k598
54315H8129j621j380j770k163k546k955k729j613o61p37j082p43l05p85j733j957
54299F3349j349o65k59j59n57j159j061k49J7p21j072q0R63N35p01j154p60m47
54281E4471k33M07J096J178R69J046J000L14m49n90n08p31p02J08R11Q02L01L43
54263E9733O83O43M29M49K63m38q34k54N73P67O99R14Q55J1q23q25n27n79l97
54244F1342N14J210P95J14L44J050J222J032J011O62m06j122m77O38Q04K33o8
54227F8898j75o02q57l47K29qo12q71j141j652j406j9Q78J0j243j001P8K75j46
54208F0288J79Q69N46m75p83m62n18n04O70K095J830K14m69M07J116O19j32k61
$$ plain form
54329 135582 134322 132477 129770 125549 120480 116257 113313 110322 106337 101942 97905 94169 90727 88129
54315 88129 86508 85128 83358 81195 78649 75694 72965 71352 70691 69954 68872 68129 67824 67039 65306 63349
54299 63349 62000 61335 61076 60917 60360 59201 58140 57891 57908 57187 56115 56035 56998 57533 56832 55678 54918 54471
54281 54471 54238 54645 55741 56919 57888 58934 59934 60248 59799 59209 58701 57970 57268 57376 58287 59089 59390 59733
54263 59733 60416 61059 61488 61937 62200 61762 60928 60674 61247 62014 62713 63627 64482 64493 63670 62845 62318 61739 61342
54244 61342 61856 63066 63861 63975 64319 65369 66591 67623 68634 69296 68890 67768 67291 67929 68733 68966 68898
54227 68898 68723 68121 67264 66917 67146 67138 66526 65655 64514 62862 61456 61437 62315 62325 61082 60081 60159 60434 60288
54208 60288 60467 61336 61882 61407 60624 60162 59644 59140 59810 61905 63735 63949 63480 63887 65003 65622 65490 65229
54190F5229j94l33l19o2L7K0K79N35K97J5L84Q55M70l40m08Q2m2q09j119o58j35
54169F3784K27P72J159P31j09l93j77k21m17j78J24l40j198j360q15l42O4Q83
54151F2194J625J462Q24P15Q91M43l06l27J88K11j79j01L31L63L17R84J780J465
54133G2880L10m07n90j030j442r93l73r52k179k227j046k55j40O11J941J996K72
54116F6376j322j333n63j22J62M98K23q13j449q46L49J110J169O35l05r22m40
54099F2407O74J095M57l97r29j307j317m74O79R37K75j84p6j19m17j52P51J245
54081F3148Q26J66k08n30q49q41p14j036j539j383n95O5M94J126J614J226L98
54064F1368K81Q62J156J095J410J786J086n14j516j331p87l93J02M50P7m18R6
$$ plain form
54190 65229 65035 64702 64383 64321 64358 64378 64657 65192 65489 65504 65888 66743 67213 66873 66465 66547 66505 65696 64577 63919 63784
54169 63784 64011 64783 65942 66673 66564 66171 65994 65773 65356 65178 65302 64962 63764 62404 61589 61247 61311 62194
54151 62194 63819 65281 66105 66820 67711 68154 67848 67521 67709 67920 67741 67640 67971 68334 68651 69635 71415 72880
54133 72880 73190 72783 72193 71163 69721 68728 68355 67403 65224 62997 61951 61696 61556 62167 64108 66104 66376
54116 66376 65054 63721 63158 63036 63198 63696 63919 63106 61657 60811 61160 62270 63439 64074 63769 62847 62407
54099 62407 63081 64176 64633 64236 63307 62000 60683 60209 60888 61825 62100 61916 61840 61721 61304 61152 61903 63148
54081 63148 63974 64140 63932 63402 62553 61712 60998 59962 58423 57040 56445 56510 57004 58130 59744 60970 61368
54064 61368 61649 62511 63667 64762 66172 67958 69044 68530 67014 65683 64896 64503 64605 65055 65132 64714 64810
54047F4810J179J319N58M45J302J851J825K462L863M349L258K099K060K451K596
54032I6427L116M264M976M705M484N042N592N517N546O130O301N413M471M381
54018A66365M388L541K482K353K899K980K286J413Q40N96M55mr93j864j798j172
54002A84767j232k268l323l810m095m271l881l148l030l538l530k617j745j477
53988A42802j285j011j376k292k398j218k15o74j855k314j910j407j095q06n33
53973A22413l09j8J74j13o50p69m27k26k65p8L01M12M80J053J592J002l41q23
53955A23408k3P60P54O58R61J045O69O23J247J783J828J943K366K556K449K677
53939A45704L202L363L456M402N582N142K996J262R84O32j036k868l367k955k739
$$ plain form
54047 64810 65989 67308 67866 68311 69613 71464 73289 75751 79614 83963 87221 89320 91380 93831 96427
54032 96427 99543 103807 108783 113488 117972 123014 128606 134123 139669 145799 152100 157513 161984 166365
54018 166365 170753 174294 176776 179129 182028 185008 187294 188707 189547 190143 190598 190594 189601 187737 185939 184767
54002 184767 183535 181267 177944 174134 170039 165768 161887 158739 155709 152171 148641 146024 144279 142802
53988 142802 141517 140506 139130 136838 134440 133222 133007 132333 130478 128164 126254 124847 123752 122946 122413
53973 122413 122104 122086 122260 122147 121497 120728 120301 120075 119810 119732 120033 120445 120925 121978 123570 124572 124231 123408
53955 123408 123385 124145 124899 125557 126518 127563 128232 128855 130102 131885 133713 135656 138022 140578 143027 145704
53939 145704 148906 152269 155725 160127 165709 170851 173847 175109 176093 176725 175689 172821 169454 166499 163760
53924A63760k598j921q56L10J734L082L350K574K215L003L874L967L971M450M631
53909A95546M028L699M577N966O853P352P757P586O709O005N806N119L428J787
53895B72218J046N07m87j245j211j286k281l407l678l505l732m233m651n242n948
53880B32865n952n194m942n807o673o635o345o387n989m709l677l741l939l272
53866A59603k413k245k298k110k489l791m628l932k820k609k658j983j440k141
53852A22046l131k865j837j560j952j922j611j859k172j461j54L76J19J51N31
53837A02699L28n39j181j326j471j713j644j178m16P50J953K073P98m19k74M72
53821I8912L17o87j401j533j529j322o48K3K57O17J558K221J719P67N95J078J389
$$ plain form
53924 163760 161162 159241 158385 158695 160429 163511 166861 169435 171650 174653 178527 182494 186465 190915 195546
53909 195546 199574 203273 207850 213816 220669 228021 235778 243364 250073 256078 261884 267003 270431 272218
53895 272218 273264 273771 273284 272039 270828 269542 267261 263854 260176 256671 252939 248706 244055 238813 232865
53880 232865 226913 221719 216777 210970 204297 197662 191317 184930 178941 174232 170555 166814 162875 159603
53866 159603 157190 154945 152647 150537 148048 144257 139629 135697 132877 130268 127610 125627 124187 122046
53852 122046 118915 116050 114213 112653 110701 108779 107168 105309 103137 101676 101522 101898 102017 102168 102699
53837 102699 103027 102488 101307 99981 98510 96797 95153 93975 93559 94309 96262 98335 99133 98714 98440 98912
53821 98912 99229 98542 97141 95608 94079 92757 92109 92132 92389 93006 94564 96785 98504 99271 99866 100944 102333
53804A02333J627K273K839K578J888J618J707J881K685M407N920O102N571N474
53790A48903N587N178M672M758M805M038L283L594M126L399J852J039R35K64r72
53775A95461j470q73q4M04O95L33j166k879l334k582j832j413q31m68j227k691
53759A76043l431l113k678k602k550k563k948l200k599j669j503j864j603p00
53745A43020k94p57j344j619j803j794j286p16p71j142j045o45o93j172j577k007
53729A24355k620k619j368J63N88K23K96P41N27k59o17m64m55l96M00J453J653
53712A21601J135Q85R13N88K80P50J364R81J54L38J289J524J085J449K777L599
53696A40712L446L395L766L546K559J980K241K377K018K013K582K709J983J280
$$ plain form
53804 102333 103960 106233 109072 111650 113538 115156 116863 118744 121429 125836 131756 137858 143429 148903
53790 148903 154490 159668 164340 169098 173903 177941 181224 184818 188944 192343 194195 195234 196169 196433 195461
53775 195461 193991 193118 193034 193438 194133 194466 193300 190421 187087 184505 182673 181260 180429 179961 178734 176043
53759 176043 172612 169499 166821 164219 161669 159106 156158 152958 150359 148690 147187 145323 143720 143020
53745 143020 142726 141969 140625 139006 137203 135409 134123 133407 132636 131494 130449 129804 129111 127939 126362 124355
53729 124355 121735 119116 117748 117911 118499 118722 119018 119759 120286 120027 119410 118946 118491 118095 118495 119948 121601
53712 121601 122736 123621 124534 125122 125402 126152 127516 128497 128651 128989 130278 131802 132887 134336 137113 140712
53696 140712 144158 147553 151319 154865 157424 159404 161645 164022 166040 168053 170635 173344 175327 176607
53682A76607J054O56j55o18l62P7N63J558K681K711J418j2p38j040j151q76n93
53665A81780j015j802j865j226q77q74l32N81O96M2n7N77N65n14j303j011n98
53648A72767p58p10J09Q56P88M30K99J3n64p07k05M0m14p06j58O66J079J199J196
53629A75220Q09K32K12P97J261J539K315L351L349K030P55N26Q84J341K156L071
53613A99848L057K185K010L197M316M088L283L251L902M278M130L807L534L566
53599B48452M169M866M739L966L806M536M862M024L012K893L305L501L532L494
53585C03157K953J985J599K157K568K017J219J093J350J368J342J554J483O51
53571C26496n42j533k248k428j467L19J458J173M34L69P85R95R53P58J27p82j106
$$ plain form
53682 176607 177661 178317 178162 177544 177182 177259 177822 179380 182061 184772 186190 186178 185440 184400 183249 182373 181780
53665 181780 180765 178963 177098 175872 174995 174121 173789 174370 175066 175108 175051 175628 176193 175679 174376 173365 172767
53648 172767 172009 171299 171408 172264 173052 173482 173781 173794 173230 172523 172318 172358 171944 171238 171080 171746 172825 174024 175220
53629 175220 176029 176261 176473 177270 178531 180070 182385 185736 189085 191115 191870 192396 193280 194621 196777 199848
53613 199848 202905 205090 207100 210297 214613 218701 221984 225235 229137 233415 237545 241352 244886 248452
53599 248452 252621 257487 262226 266192 269998 274534 279396 283420 286432 289325 292630 296131 299663 303157
53585 303157 306110 308095 309694 311851 314419 316436 317655 318748 320098 321466 322808 324362 325845 326496
53571 326496 325954 324421 322173 319745 318278 318597 320055 321228 321662 322031 322816 323811 324764 325522 325649 324867 323761
53554C23761o48l67p80j071n76O9J87K23P06J112Q95N21N70P60P72J073J949K782
53536C31938L138L526M241M588M204L966M522N103M900M599N195O332O982P030
53522D00264O975O850O562O622P413Q397Q912R131R433R668R888J0880J2904J4801
53508E28700J5392J5029J4768J4865J5084J5653J6748J7726J8023J8210J9148
53497G09346K0583K1602K1961K2069K2070K1855K1561K1350K1122K0963K1240
53486I45722K1781K1774K1005K0292K0103J9755J8748J7787J7607J7819J7870
53475A160263J8136J8965J9542J8935J7573J6566J6178J5927J5590J5117J4177
53464A346969J2698J1254J0168Q865O888M791L193J823K74j215k590m639p660
$$ plain form
53554 323761 323113 322746 321966 320895 320319 320388 320575 320798 321504 322616 323511 324032 324602 325362 326134 327207 329156 331938
53536 331938 335076 338602 342843 347431 351635 355601 360123 365226 370126 374725 379920 386252 393234 400264
53522 400264 407239 414089 420651 427273 434686 443083 451995 461126 470559 480227 490115 500995 513899 528700
53508 528700 544092 559121 573889 588754 603838 619491 636239 653965 671988 690198 709346
53497 709346 729929 751531 773492 795561 817631 839486 861047 882397 903519 924482 945722
53486 945722 967503 989277 1010282 1030574 1050677 1070432 1089180 1106967 1124574 1142393 1160263
53475 1160263 1178399 1197364 1216906 1235841 1253414 1269980 1286158 1302085 1317675 1332792 1346969
53464 1346969 1359667 1370921 1381089 1389954 1396842 1401633 1404826 1406649 1406923 1405708 1403118 1398479 1390819
53451A390819j0441j1732j2073j2862j4285j5337j5429j4971j4652j5048j6405
53440A237584j8121j9007j8756j8451j8965j9762k0081k0237k0670k0734j9672
53429A023128j7994j6685j5695j4378j2746j1146r358p189n321m437m032l261
53417I00886k301j787j432n08Q78K083L106M322N565O516P538R075J0755J2054
53403I56750J3310J5026J6760J7863J8637J9674K0647K1048K1537K3142K5583
53392A169977K7747K9543L1844L4781L7417L9108M0065M0683M1240M2188M3729
53381A578322M5300M6311M7118M8339M9616N0046M9543M8725M7747M6367M4835
53370B102269M3571M2180L9872L6795L3784L0958K7643K3728J9927J6592J3240
$$ plain form
53451 1390819 1380378 1368646 1356573 1343711 1329426 1314089 1298660 1283689 1269037 1253989 1237584
53440 1237584 1219463 1200456 1181700 1163249 1144284 1124522 1104441 1084204 1063534 1042800 1023128
53429 1023128 1005134 988449 972754 958376 945630 934484 925126 917937 912616 908179 904147 900886
53417 900886 898585 896798 895366 894858 895736 897819 900925 905247 910812 917328 924866 933941 944696 956750
53403 956750 970060 985086 1001846 1019709 1038346 1058020 1078667 1099715 1121252 1144394 1169977
53392 1169977 1197724 1227267 1259111 1293892 1331309 1370417 1410482 1451165 1492405 1534593 1578322
53381 1578322 1623622 1669933 1717051 1765390 1815006 1865052 1914595 1963320 2011067 2057434 2102269
53370 2102269 2145840 2188020 2227892 2264687 2298471 2329429 2357072 2380800 2400727 2417319 2430559
53359B430559R506N701K163j357n384j0176j5530k0749k4932k7667k9390l0799
53347B281945l2298l4172l6756l9862m2527m3928m4159m3730m2862m1705m0690
53336A839256l9998l9105l7468l5349l3549l2722l3043l3947l4123l2668l0401
53325A456883k8989k8545k7518k5280k3170k2173k1242j9095j6261j3934j2135
53314A218541j0451r416r624j0379j0818j1390j2704j3809j3300j1471r722q450
53302A087007p179o118n788n524m111j759R3Q32J160J721K527L633N092O401P137
53287A085124P896R511J1711J3609J5081J6553J7949J9079K0486K2559K4344K4624
53275A288526K3675K2567K1331J9461J7591J6901J7007J6297J4258J1901R877
$$ plain form
53359 2430559 2440065 2445766 2447929 2446572 2441188 2431012 2415482 2394733 2369801 2342134 2312744 2281945
53347 2281945 2249647 2215475 2178719 2138857 2096330 2052402 2008243 1964513 1921651 1879946 1839256
53336 1839256 1799258 1760153 1722685 1687336 1653787 1621065 1588022 1554075 1519952 1487284 1456883
53325 1456883 1427894 1399349 1371831 1346551 1323381 1301208 1279966 1260871 1244610 1230676 1218541
53314 1218541 1208090 1198674 1189050 1178671 1167853 1156463 1143759 1129950 1116650 1105179 1095457 1087007
53302 1087007 1079828 1073710 1067922 1062398 1058287 1056528 1056621 1057453 1058613 1060334 1062861 1066494 1071586 1077987 1085124
53287 1085124 1093020 1102531 1114242 1127851 1142932 1159485 1177434 1196513 1216999 1239558 1263902 1288526
53275 1288526 1312201 1334768 1356099 1375560 1393151 1410052 1427059 1443356 1457614 1469515 1479392
53264A479392P788N482L476J912L67j218k593m074o078p968q778q981j0060j2281
53250A436386j4376j5595j6610j8134j9920k1530k2941k4033k4388k3962k3196
53239A211701k2399k1583k0812j9997j8736j7133j6233j6701j7583j7599j7042
53228A005883j7040j7473j7182j5957j4734j3914j3059j2134j1646j1450j0841
53217H50453r845r190q943q504p914p859q311q460q106p951q464r467j0835j2568
53203G24036j4250j5338j5790j5620j4403j2263j0581j0417j0943j0850j0462
53192E83119j0743j1109j0343r120r274j0884j2233j2583j2766j3042j2664j1808
53180D46550j1630j2151j2133j1453j1318j1747j1132r027p170o770o863o348
$$ plain form
53264 1479392 1487180 1492662 1496138 1498050 1498417 1497199 1494606 1490532 1484454 1476486 1467708 1458727 1448667 1436386
53250 1436386 1422010 1406415 1389805 1371671 1351751 1330221 1307280 1283247 1258859 1234897 1211701
53239 1211701 1189302 1167719 1146907 1126910 1108174 1091041 1074808 1058107 1040524 1022925 1005883
53228 1005883 988843 971370 954188 938231 923497 909583 896524 884390 872744 861294 850453
53217 850453 840608 831418 822475 813971 806057 798198 789887 781427 773321 765370 756906 747439 736604 724036
53203 724036 709786 694448 678658 663038 648635 636372 625791 615374 604431 593581 583119
53192 583119 572376 561267 550924 541804 532530 521646 509413 496830 484064 471022 458358 446550
53180 446550 434920 422769 410636 399183 387865 376118 364986 355959 348789 342019 335156 328808
53168C28808n802o045o506o290n570m918m371l986m185m830n074m717m531m753
53154B57230m571l679k969l042l339l320l297l434l232k586k137k064j731j001
53140B16828o15q34r92q15p85q89m75L19N14L1j53jo27k004k401j034O32J204
53122B07903J234J653K041J815J638K260L156L510L483L432L046K233J704J701
53108B40809J343J43j015j387j505k022k643l231m424o123o840n809m341l859
53094A99096l979l807l678m030l990k797j469j348j946j959j520j650k188k086
53080A62649j296p22o49p00r50j703k472k534k160k059k044j502p87p38j127r78
53064A40228k79pm46p37l44J42m6q45j582j725j217n00j52k81m39l29j84k34l04
$$ plain form
53168 328808 323006 316961 310455 304165 298595 293677 289306 285320 281135 276305 271231 266514 261983 257230
53154 257230 252659 248980 246011 242969 239630 236310 233013 229579 226347 223761 221624 219560 217829 216828
53140 216828 216213 215379 214387 213572 212787 211898 211423 211742 212256 212287 212134 212133 211506 209502 207101 206067 206699 207903
53122 207903 209137 210790 212831 214646 216284 218544 221700 225210 228693 232125 235171 237404 239108 240809
53108 240809 242152 242295 241280 239893 238388 236366 233723 230492 226068 219945 213105 207296 202955 199096
53094 199096 195117 191310 187632 183602 179612 176815 175346 173998 172052 170093 168573 166923 164735 162649
53080 162649 161353 160631 159982 159282 158332 156629 154157 151623 149463 147404 145360 143858 143071 142333 141206 140228
53064 140228 139949 139942 139496 138759 138415 138557 138511 137666 136084 134359 133142 132642 132490 132209 131770 131441 131257 131023 130719
53045A30719l05n37j066j413j236q11m79k08q0m40j170j574j376j076r54o65j88
53028A17141j41o36q75n07l06p34j018m73K45L07P5K52N91N03K13J99J43m60j233
53009A13286j431j027m58J21N96N59K5k18K18O26M32K36O81J190J013O63J098
52992A17610K012K258J486L63n07q94o80j70j57p81r44K04J812K434K025J650
52976A27721J741J820J634J499J648K042K731L633M339M643M860N054M648L449
52962A71462K295J895J801J343P66M70%j082k096k205j784j628j531r21l47p78
52946A67660j861k279j663q64m81l90n83j227j919j952j428j124j263j319j029
52931A48278p11n53l80j05J54L76N58N55M23N95J155J542J420J262J372J118J4
$$ plain form
53045 130719 130414 129877 128811 127398 126162 125351 124872 124664 124584 124144 122974 121400 120024 118948 117994 117329 117141
53028 117141 117000 116364 115489 114982 114676 113942 112924 112451 112696 113003 113078 113330 113921 114424 114637 114836 114979 114519 113286
53009 113286 111855 110828 110370 110491 111087 111646 111671 111453 111671 112297 112729 112965 113646 114836 115849 116512 117610
52992 117610 119622 121880 123366 123729 123222 122328 121648 121478 121321 120540 119596 119800 121612 124046 126071 127721
52976 127721 129462 131282 132916 134415 136063 138105 140836 144469 148808 153451 158311 163365 168013 171462
52962 171462 173757 175652 177453 178796 179562 180032 180032 178950 176854 174649 172865 171237 169706 168785 168438 167660
52946 167660 165799 163520 161857 160993 160512 160122 159539 158312 156393 154441 153013 151889 150626 149307 148278
52931 148278 147567 147014 146634 146529 146683 147059 147617 148172 148595 149190 150345 151887 153307 154569 155941 157059 157073
52914A57073j143j287o63k56j45M35J592K493K555K028J431J065R73P84m8j342
52898A65545k026j493n05o4PM40J138J451J352J311J328J082P02O00P69J054J583
52881A74274K230K211J117j26l26L81R00O94Q5n59r74p53J91J246J834K038J988
52864A86451J366K99k06M09J242J318J037J232J638J613J535K046K627K369J611
52849B06587J420J949K623L390M377M849M114L071L213M357M770L496J214j025
52835B48405k604l112k561j732j336j159r54j429l077m744n001m276m028m255
52821B08137l752k448j581j581j699j752k396l448l709k802j730j198q74n75p47
52806A77845j379j709j420j033q66o93n42p22r78p40k84m39j154j612j637j760
$$ plain form
52914 157073 155930 154643 153980 153724 153579 154014 155606 158099 160654 162682 164113 165178 166151 166935 166887 165545
52898 165545 163519 162026 161521 161457 161464 161904 163042 164493 165845 167156 168484 169566 170268 170868 171637 172691 174274
52881 174274 176504 178715 179832 179706 179380 179761 180661 181355 181440 180881 179907 179154 179345 180591 182425 184463 186451
52864 186451 187817 188116 187910 188319 189561 190879 191916 193148 194786 196399 197934 199980 202607 204976 206587
52849 206587 208007 209956 212579 215969 220346 225195 229309 232380 235593 239950 244720 248216 249430 248405
52835 248405 245801 242689 240128 238396 237060 235901 234947 233518 230441 225697 220696 216420 212392 208137
52821 208137 204385 201937 200356 198775 197076 195324 192928 189480 185771 182969 181239 180041 179167 178592 177845
52806 177845 176466 174757 173337 172304 171438 170745 170203 169481 168503 167763 167479 167040 165886 164274 162637 160877
52790A60877j855j250k77k03j284k268k212j615j332j472j697j689j166k89O2
52775A42330o76j688j831j403j519k096k120j640j732k409k438j440m43m1L09
52760A21163P48N14m97j252j242j169j478j652j440j364j498j233p47j091k238
52745A05524k680j745o68n49p40l39J86Q1k57j76p9n76j150r51l08k94j120j925
52727I2234j916j125j82K06j35n80l91K41M50J2l87k60Q3J80r0o70j197r12M23
52708H5984J647J433K73n8J020K349K998L191L144K570J768J638K119K090J300
52693A13466Q19J067J013Q6p18n58j44m13j085j526j862k238k093j185l51l12
52677A03966o67q57j088j512j582j143j011j555j832j166n17j040k191k546j852
$$ plain form
52790 160877 159022 157772 157495 157292 156008 153740 151528 149913 148581 147109 145412 143723 142557 142268 142330
52775 142330 141654 139966 138135 136732 135213 133117 130997 129357 127625 125216 122778 121338 120895 120854 121163
52760 121163 121911 122425 121928 120676 119434 118265 116787 115135 113695 112331 110833 109600 108853 107762 105524
52745 105524 102844 101099 100431 99882 99142 98803 98989 99070 98813 98637 98558 97982 96832 95881 95573 95279 94159 92234
52727 92234 90318 89193 89011 89217 89082 88502 88111 88352 88802 88814 88427 88167 88250 88430 88340 87670 86473 85561 85984
52708 85984 87631 89064 89337 89279 90299 92648 95646 98837 101981 104551 106319 107957 110076 112166 113466
52693 113466 114285 115352 116365 116451 115733 115175 115031 114618 113533 112007 110145 107907 105814 104629 104278 103966
52677 103966 103299 102442 101354 99842 98260 97117 96106 94551 92719 91553 91036 89996 87805 85259 83407
52662H3407j035p17p39q55q73m88L08R03Q09K96j16l30l87j37L86P66P92O33K76
52643H2899m20r67n89M02O52l47j512j769j302o73J24J089J736J879J864J602
52627H4668M90j174k033j582r24r11r36m51j44n12o73J10R36O78j72l89Q6N02
52609G7569O58P29N52J88M21J490K241J726P05L79M50j9p03m76O66J672J973J746
52591I1967J039m7p34l32N90R17N76L55N51Q53J194J649J886J690J636K212K763
52574A08765K362J334P48Q01Q42O77O50O72L32j77k10K68O95Q64R97J138J204
52557A21962J457K018K250J473Q2q46q54k89M24J003J065N83K10M63R08Q99O78
52540A33486Q76J321J332Q95N73M74J91l61p45o40o1Q59J749K033J561Q91M50
$$ plain form
52662 83407 82372 81655 80916 80061 79188 78700 79008 79911 80720 81016 80900 80570 80183 80046 80432 81198 81990 82623 82899
52643 82899 82479 81512 80923 81325 81977 81630 80118 78349 77047 76374 76498 77587 79323 81202 83066 84668
52627 84668 85158 83984 81951 80369 79445 78534 77598 77147 77003 76491 75818 75928 76864 77542 77370 76981 77067 77569
52609 77569 78227 78956 79508 79696 80117 81607 83848 85574 86279 86658 87108 87089 86386 85910 86576 88248 90221 91967
52591 91967 93006 92959 92225 91893 92483 93400 93976 94331 94882 95735 96929 98578 100464 102154 103790 106002 108765
52574 108765 111127 112461 113209 114010 114852 115529 116179 116851 117183 117006 116796 117064 117759 118623 119620 120758 121962
52557 121962 123419 125437 127687 129160 129242 128396 127542 127253 127677 128680 129745 130328 130538 131001 131909 132808 133486
52540 133486 134362 135683 137015 137910 138483 138957 139148 138787 138042 137402 137341 138200 139949 141982 143543 144434 144884
52523A44884n1r01j678j895j674j185j46J341K228J741N21k99n01m57j67L36M05
52506A42502k86q94o41j72m18q49l14Q86J323O44p4p7K86N70Q00Q89N73L9k43
52487A44544k73l41k03N75J670K291K310K202K085J686J116P22L54l18r49r37
52471A56534m62j83j03K62P93Q89N75M44O00N46J50j66j43J61P41J390J423N41
52453A63992m03m04K18M48K92O16J476J940J651J295J315J261P62J29k98o80j214
52436A72396j786k246k496k294j521n76M8M05P40P65M6j085j751j584q87p7M53
52419A58550K95m65j021q94p30j290k135k261j550o29K59J144J578J180N92O99
52403A53322J212J177N81K28K55J32p4K39R55J325J249J278J326P82j41l95L16
$$ plain form
52523 144884 144833 143932 142254 140359 138685 137500 137354 138695 140923 142664 143185 142886 142385 141928 141761 142097 142502
52506 142502 142216 141322 140681 140509 140091 139242 138928 139814 141137 141781 141707 141630 141916 142486 143286 144175 144748 144787 144544
52487 144544 144271 143930 143727 144302 145972 148263 150573 152775 154860 156546 157662 158384 158738 158420 157471 156534
52471 156534 156072 155889 155786 156048 156841 157730 158305 158749 159349 159895 160045 159879 159736 159897 160638 162028 163451 163992
52453 163992 163589 163185 163403 163851 164143 164759 166235 168175 169826 171121 172436 173697 174459 174588 174290 173610 172396
52436 172396 170610 168364 165868 163574 162053 161477 161525 161930 162670 163435 163481 162396 160645 159061 158174 158097 158550
52419 158550 158845 158380 157359 156465 155735 154445 152310 150049 148499 147870 148129 149273 150851 152031 152623 153322
52403 153322 154534 155711 156292 156520 156775 156907 156833 157072 158027 159352 160601 161879 163205 163987 163846 163451 163767
52386A63767J169J551J725J947K036J927J755J272J93r92j465j298j144r26k0
52371A71497J372K270K384K341K455K433K297K357K358J890J493J996K845K704
52357B02692J663J185J727K142J826J609J937J958J228P30J207J868J822J512
52343B25106J678J950J684J283J597K473K924K370J130Pj79Q01K113K537J912
52328B49386J257J321J741J847J421N32n58j023r0J734K994L157L063L295L350
52313B73427K942K837L608M628N091N169N379N645N778O100O885P796Q496R184
52299C52965R947J0429J0567J0885J1501J1704J1259J1144J2180J3695J4466J4397
52287D95139J4329J4684J5121J5291J5169J4901J4795J5229J6137J6855J6861
$$ plain form
52386 163767 164936 166487 168212 170159 172195 174122 175877 177149 177342 176350 174885 173587 172443 171517 171497
52371 171497 172869 175139 177523 179864 182319 184752 187049 189406 191764 193654 195147 197143 199988 202692
52357 202692 204355 205540 207267 209409 211235 212844 214781 216739 217967 218697 219904 221772 223594 225106
52343 225106 226784 228734 230418 231701 233298 235771 238695 241065 242195 242202 242023 242824 244937 247474 249386
52328 249386 250643 251964 253705 255552 256973 257505 256947 255924 255834 257568 260562 263719 266782 270077 273427
52313 273427 276369 279206 282814 287442 292533 297702 303081 308726 314504 320604 327489 335285 343781 352965
52299 352965 362912 373341 383908 394793 406294 417998 429257 440401 452581 466276 480742 495139
52287 495139 509468 524152 539273 554564 569733 584634 599429 614658 630795 647650 664511
52276F64511J6336J5703J5091J4540J4203J4027J3698J3142J2538J1683J0095
52265H15567Q013O440N801N282M011K254Q51R9k71m67o27j014j782k788l820m689
52249H32860n033m614l888l628l837l726k907j843r79j95O67J588K868M893P210
52234H19436Q739R289R833J0946J2011J2446J2661J3135J3530J3447J3266J3454
52222I62193J3751J3648J3063J2032J0455Q600P101O015M682K939J525P84k5j518
52208A055245l307m955o812r053j0937j1928j2641j3692j4468j4119j3009j2142
52196I28182j1713j1286j0858j0664j0437r822r205r060q919p913o195m858m600
52183H12652n133n703n648m665l194k246k350k952l295l363l469l477l163k781
$$ plain form
52276 664511 680847 696550 711641 726181 740384 754411 768109 781251 793789 805472 815567
52265 815567 823580 830020 835821 841103 845114 847368 848219 848318 848047 847580 846953 845939 844157 841369 837549 832860
52249 832860 827827 823213 819325 815697 811860 808134 805227 803384 802405 802210 802877 804465 807333 812226 819436
52234 819436 828175 837464 847297 858243 870254 882700 895361 908496 922026 935473 948739 962193
52222 962193 975944 989592 1002655 1014687 1025142 1033742 1040843 1046858 1051540 1054479 1056004 1056788 1056763 1055245
52208 1055245 1051938 1046983 1040171 1031118 1020181 1008253 995612 981920 967452 953333 940324 928182
52196 928182 916469 905183 894325 883661 873224 863402 854197 845137 836218 828305 822110 817252 812652
52183 812652 807519 801816 796168 791503 788309 786063 783713 780761 777466 774103 770634 767157 763994 761213
52169G61213k644k520k137j814j946k320k575k821l225l516l535l683m155m311
52155G20011l697l037l303m259m859m676m105l518l088l063l383l377k713k178
52141F70755k631l593l907l442l024k978k918k801l062l590l712l306k966k883
52127F25942k559j895j642k298l289l758l579l206k917k663k416k248k196k163
52113E89113j938j308l15O96J439J972K441K768K853K944L440M457N804P302Q758
$$ plain form
52169 761213 758569 756049 753912 752098 750152 747832 745257 742436 739211 735695 732160 728477 724322 720011
52155 720011 716314 713277 709974 705715 700856 696180 692075 688557 685469 682406 679023 675646 672933 670755
52141 670755 668124 664531 660624 657182 654158 651180 648262 645461 642399 638809 635097 631791 628825 625942
52127 625942 623383 621488 619846 617548 614259 610501 606922 603716 600799 598136 595720 593472 591276 589113
52113 589113 587175 585867 585552 586248 587687 589659 592100 594868 597721 600665 604105 608562 614366 621668 630426
$$ [...]
##END NTUPLES=NMR SPECTRUM
##END=
