
##TITLE=AC1318_SSUAH12147_6535344_7FNUsokbu0
##JCAMPDX= 6.0         $$ Bruker NMR JCAMP-DX V2.0
##DATA TYPE= NMR SPECTRUM
##DATA CLASS= NTUPLES
##ORIGIN= BRUKER
##OWNER= Administrator
$$ 1.72 TOPSPIN		Version 2.1
$$ 2012-07-17 17:47:59.796 -0500  Administrator@TOPSPIN
$$ Compression mode = diff/dup
##.OBSERVE FREQUENCY= 400.02188249412
##.OBSERVE NUCLEUS= ^1H
##.ACQUISITION MODE= SIMULTANEOUS (DQD)
##.ACQUISITION SCHEME= undefined
##.AVERAGES= 8
##.DIGITISER RES= 22
##SPECTROMETER/DATA SYSTEM= spect
##.PULSE SEQUENCE= zg30
##.SOLVENT NAME= COFFEE_meoh
##.SHIFT REFERENCE= INTERNAL, COFFEE_meoh, 1, 14.98509
##AUDIT TRAIL= $$ (NUMBER, WHEN, WHO, WHERE, PROCESS, VERSION, WHAT)
$$ ##TITLE= Audit trail, TOPSPIN		Version 2.1
$$ ##JCAMPDX= 5.01
$$ ##ORIGIN= Bruker BioSpin GmbH
$$ ##OWNER= Administrator
$$ $$ C:\Bruker\TOPSPIN/data/COFFEE/nmr/AC1318_SSUAH12147_6535344_7FNUsokbu0/10/pdata/1/auditp.txt
$$ ##AUDIT TRAIL=  $$ (NUMBER, WHEN, WHO, WHERE, PROCESS, VERSION, WHAT)
(   1,<2012-07-17 17:47:51.875 -0500>,<Administrator>,<TOPSPIN>,<go>,<TOPSPIN 2.1>,
      <created by zg
	started at 2012-07-17 17:46:45.328 -0500,
	POWCHK enabled, PULCHK disabled,
       configuration hash MD5:
       6B 1B 68 BB D9 2E 58 E2 7F 35 AD 54 07 DF 0E 41
       data hash MD5: 64K
       37 DA 73 AC 6C DB A5 3A 67 01 5E 30 96 9B 94 46>)
(   2,<2012-07-17 17:47:55.656 -0500>,<Administrator>,<TOPSPIN>,<proc1d>,<TOPSPIN 2.1>,
      <Start of raw data processing
       efp LB = 0 FT_mod = 6 PKNL = 1 PHC0 = 0 PHC1 = 0 SI = 32K 
       data hash MD5: 32K
       2F A4 CA DB E5 F4 55 9A DD 0E 2E 88 50 40 D9 D5>)
(   3,<2012-07-17 17:47:55.937 -0500>,<Administrator>,<TOPSPIN>,<proc1d>,<TOPSPIN 2.1>,
      <pk PHC0 = 175.0177 PHC1 = 0 
       data hash MD5: 32K
       27 20 E0 58 9C 2C 0B CD E5 B6 D8 46 82 8C A3 28>)
(   4,<2012-07-17 17:47:56.109 -0500>,<Administrator>,<TOPSPIN>,<proc1d>,<TOPSPIN 2.1>,
      <abs ABSG = 1 
       data hash MD5: 32K
       7E 21 DD 42 8D 15 E5 74 85 CE DE 59 EF 57 6A 69>)
(   5,<2012-07-17 17:47:56.218 -0500>,<Administrator>,<TOPSPIN>,<proc1d>,<TOPSPIN 2.1>,
      <abs ABSG = 2 
       data hash MD5: 32K
       27 FB FF BD 5C 81 F7 54 81 CA 84 95 35 47 D4 02>)
(   6,<2012-07-17 17:47:56.250 -0500>,<Administrator>,<TOPSPIN>,<proc1d>,<TOPSPIN 2.1>,
      <abs ABSG = 3 
       data hash MD5: 32K
       C4 65 9C 02 5E 3E 83 B9 15 7E B6 43 AB FD B4 DC>)
(   7,<2012-07-17 17:47:56.281 -0500>,<Administrator>,<TOPSPIN>,<proc1d>,<TOPSPIN 2.1>,
      <abs ABSG = 4 
       data hash MD5: 32K
       72 F4 EB DF 91 B0 98 E0 0B 08 07 84 62 4E 52 9E>)
(   8,<2012-07-17 17:47:56.312 -0500>,<Administrator>,<TOPSPIN>,<proc1d>,<TOPSPIN 2.1>,
      <abs ABSG = 5 
       data hash MD5: 32K
       C6 90 EA DC C0 25 9C EA 6E 6A C5 4E E0 52 C5 2F>)
$$ ##END=
$$ 
$$ $$ hash MD5
$$ $$ A6 5B 2D 5F 07 A1 A3 65 CC 70 45 BE 1C 8B 1E A3
##$RELAX= 
##$RELAX= 
##$RELAX= 
##$RELAX= 
##$RELAX= 
##$RELAX= 
##$RELAX= 
$$ Bruker specific parameters
$$ --------------------------
$$ [...]
150 150 150 150 150 150 150 150
##$TP07= 0
##$TPNAME0= <>
##$TPNAME1= <>
##$TPNAME2= <>
##$TPNAME3= <>
##$TPNAME4= <>
##$TPNAME5= <>
##$TPNAME6= <>
##$TPNAME7= <>
##$TPOAL= (0..7)
0.5 0.5 0.5 0.5 0.5 0.5 0.5 0.5
##$TPOFFS= (0..7)
0 0 0 0 0 0 0 0
##$TUNHIN= 0
##$TUNHOUT= 0
##$TUNXOUT= 0
##$USERA1= <user>
##$USERA2= <user>
##$USERA3= <user>
##$USERA4= <user>
##$USERA5= <user>
##$V9= 5
##$VALIST= <valist>
##$VCLIST= <CCCCCCCCCCCCCCC>
##$VD= 0
##$VDLIST= <DDDDDDDDDDDDDDD>
##$VPLIST= <PPPPPPPPPPPPPPP>
##$VTLIST= <TTTTTTTTTTTTTTT>
##$WBST= 2048
##$WBSW= 25
##$XGAIN= (0..3)
0 0 0 0
##$XL= 0
##$YL= 0
##$YMAX_a= 499857
##$YMIN_a= -630196
##$ZGOPTNS= <>
##$ZL1= 120
##$ZL2= 120
##$ZL3= 120
##$ZL4= 120
##$ABSF1= 14.98509
##$ABSF2= -5.573092
##$ABSG= 5
##$ABSL= 3
##$ALPHA= 0
##$AQORDER= 0
##$ASSFAC= 0
##$ASSFACI= 0
##$ASSFACX= 0
##$ASSWID= 0
##$AUNMP= <proc_prof1d_extract_pilot.lims>
##$AXLEFT= 0
##$AXNAME= <>
##$AXNUC= <1H>
##$AXRIGHT= 0
##$AXTYPE= 0
##$AXUNIT= <>
##$AZFE= 0.1
##$AZFW= 0.1
##$BCFW= 0
##$BC_mod= 0
##$BYTORDP= 0
##$COROFFS= 0
##$CY= 15
##$DATMOD= 1
##$DC= 0
##$DFILT= <>
##$DTYPP= 0
##$F1P= 0
##$F2P= 0
##$FCOR= 0.5
##$FTSIZE= 32768
##$FT_mod= 6
##$GAMMA= 0
##$GB= 0
##$INTBC= 1
##$INTSCL= 1
##$ISEN= 128
##$LB= 0
##$LEV0= 0
##$LPBIN= 0
##$MAXI= 10000
##$MC2= 0
##$MEAN= 0
##$ME_mod= 0
##$MI= 0
##$NCOEF= 0
##$NC_proc= -8
##$NLEV= 6
##$NOISF1= 0
##$NOISF2= 0
##$NSP= 0
##$NTH_PI= 0
##$NZP= 0
##$OFFSET= 14.98509
##$PC= 1
##$PHC0= 175.0177
##$PHC1= 0
##$PH_mod= 1
##$PKNL= yes
##$PPARMOD= 0
##$PPDIAG= 0
##$PPIPTYP= 0
##$PPMPNUM= 2147483647
##$PPRESOL= 1
##$PSCAL= 4
##$PSIGN= 0
##$PYNMP= <proc.py>
##$REVERSE= no
##$SF= 400.02
##$SI= 32768
##$SIGF1= 0
##$SIGF2= 0
##$SINO= 400
##$SIOLD= 32768
##$SPECTYP= <>
##$SREGLST= <1H.CDCl3>
##$SSB= 0
##$STSI= 32768
##$STSR= 0
##$SW_p= 8223.68421052631
##$SYMM= 0
##$S_DEV= 0
##$TDeff= 65536
##$TDoff= 0
##$TI= <>
##$TILT= no
##$TM1= 0
##$TM2= 0
##$TOPLEV= 0
##$USERP1= <user>
##$USERP2= <user>
##$USERP3= <user>
##$USERP4= <user>
##$USERP5= <user>
##$WDW= 1
##$XDIM= 32768
##$YMAX_p= 475161445
##$YMIN_p= -718730
##$CURPLOT= <Network HP LaserJet P1505>
##$CURPRIN= <$Network HP LaserJet P1505>
##$DFORMAT= <normdp>
##$LAYOUT= <+/1D_H.xwp>
##$LFORMAT= <normlp>
##$PFORMAT= <normpl>
##$SURQMSG= 1
$$ End of Bruker specific parameters
$$ ---------------------------------
##NTUPLES= NMR SPECTRUM
##VAR_NAME=  FREQUENCY,     SPECTRUM/REAL,   SPECTRUM/IMAG
##SYMBOL=    X,             R,               I
##VAR_TYPE=  INDEPENDENT,   DEPENDENT,       DEPENDENT
##VAR_FORM=  AFFN,          ASDF,            ASDF
##VAR_DIM=   32768,         32768,           32768
##UNITS=     HZ,            ARBITRARY UNITS, ARBITRARY UNITS
##FACTOR=    0.250966925370066, 1,           1
##FIRST=     8223.43324360094, -79116,       -29761
##LAST=      0,             97031,           -162916
##MIN=       0,             -718730,         0
##MAX=       8223.43324360094, 475161445,    0
$$ Real data points
##PAGE= N=1
##DATA TABLE= (X++(R..R)), XYDATA
$$ [...]
19547A30562d9049A38760a00919A22555b98371f4635g667A17930a43310A14944
19536A1608a43422C1704b52029a10761m8047P2574C9432b5167B04441q4218Q671
19525A28894a37276k91219J81841B33597j11229r745d0474B8794b33925C51056
19514C8236a17967b6583h659L886l61897g2327j59400C5014r949a22064K8059
19503i4005j9092Q086j26236k43257a75149E9c77150a57686b5822j02303A77981
19491b0061j03726c7947l80148a46796j17531r8523E6243I649K08486A5815c1320
19479g9814o559B0043b324n5770j55552a2390j77245r5116B23866c24184h6983
19467A42006F903J68233B4803a95463h2493A02232B2573b5003A22438Q7457C1611
$$ y = [130562, -49049, 138760, -100919, 122555, -298371, -64635, -7667, 117930, -143310, 114944, 11608, -143422, 31704, -252029, -110761, -158808, -86234, 39432, -25167, 204441, 120223, 128894, -137276, -428495, -246654, 233597, 122368, 112623, -40474, 28794, -233925, 351056, 38236, -117967, -26583, -8659, -4773, -366670, -72327, -231727, 35014, 25065, -122064, -94005, -113097, -105011, -231247, -474504, -175149, 59, -377150, -157686, -25822, -128125, 177981, -20061, -123787, -37947, -418095, -146796, -264327, -362850, 56243, 9649, 218135, 15815, -31320, -79814, -86373, 20043, -2324, -58094, -213646, -12390, -189635, -284751, 223866, -324184, -86983, 142006, 6903, 175136, 24803, -195463, -82493, 102232, 22573, -25003, 122438, 209895, 31611]
19455B04619e0442j95916A98470g296j06335E1425c718j65363j10706A03896a85009
19443A8513c00354c7375k09509k76688g9678r7329g9440q173k2857A12898k3461
19432H9437J3059J26181a10126A7304K0569i7048p5781j81769B4162J9551a03585
19420c3525F7940J38051b10432j7271k01463a2501j83508g7510a3844A26727N6314
19409A83041C3789L7717f0812A03774b60127g3385p2281f6041B0523A936K6247
19398B8183L2169b05494k38150h978k26345H5918a47887K5991A32072b15015d9666
19386b05111P2244j0100a9420B88261A24173c45009D5978L08J70382e6121C8061
19374a58163N257A12508i8015B3311J03615A6249J36974c69151g4718D4316c29207
$$ y = [204619, -50442, -246358, 198470, -7296, -113631, 51425, -3718, -169081, -279787, 103896, -185009, 18513, -300354, -37375, -246884, -523572, -79678, -177007, -79440, -87613, -110470, 112898, 89437, 102496, 228677, -110126, 17304, 37873, -97048, -172829, -354598, 24162, 43713, -103585, -33525, 67940, 205991, -210432, -227703, -429166, -12501, -196009, -77510, -13844, 126727, 183041, 33789, 71506, -60812, 103774, -260127, -73385, -145666, -66041, 20523, 1936, 28183, 60352, -205494, -443644, -8978, -235323, 85918, -147887, -121896, 132072, -215015, -49666, -205111, -132867, -142967, -19420, 288261, 124173, -345009, 45978, 46286, 216668, -56121, 38061, -158163, -152906, 112508, -98015, 23311, 126926, 16249, 153223, -369151, -74718, 44316, -329207]
19362H6883k6045C029g3349D19c08806F8660l1341b23930N8956I7654a27439D21896
19349e0374j09336e7573m9449J700A29605b2080G8027i1145j9877B26415b68692
19337B22416a40832m3280P1502m41710b73570D9560a11676l24273B60636i2735
19326h2599A27998c1779q5302c3645k74152h3372C2473a49547m5637i3271C586
19314a2555n3928j39968h4149o8230a1786l16451a32993A7710i9118l92490b32072
19302g5769k15460d2705r1971A93547a84314D9183f5746G3903b81217J36006B80725
19290a27316B85934b91012G591Q873b4667B36015L9260F5164i8733A5040J27629
19279A42669b37891l0175c2651B0278K62600b3218F1945a76697A47800g6259k73900
$$ y = [86883, 60838, 3029, -73349, 419, -308806, 68660, 37319, -223930, -164974, 97654, -127439, 421896, -50374, -159710, -57573, -107022, -105322, 129605, -22080, 78027, -91145, -111022, 226415, -268692, 222416, -140832, -184112, -112610, -554320, -273570, 49560, -111676, -435949, 260636, -92735, -82599, 127998, -31779, -117081, -33645, -307797, -83372, 32473, -149547, -195184, -93271, 3586, -12555, -66483, -206451, -84149, -152379, -11786, -328237, -132993, 17710, -99118, -491608, -232072, -75769, -291229, -42705, -134676, 193547, -184314, 49183, -65746, 73903, -281217, -145211, 280725, -127316, 285934, -291012, 7591, 16464, -24667, 236015, 275275, 65164, -98733, 15040, 142669, -237891, -268066, -32651, 20278, 282878, -23218, 61945, -176697, 147800, -76259, -350159]
19268c50159B02626a63113A19106a74179M3865M1715j56479A32315b33141A2351
19257a85451H0888K46623H1740R0608a65862o0582J07634a8361A41890a6999j05715
19246a22714a4729n5190B47239i5603k75136B756a16418A26021i0394k41586h53
19234c2159F025c78143A57051C1810a7750k14036p7869e7224A56368b24954F7602
19222c8273j55327N9509L9170m5290A20054b40576n8732Q8502B4752a31392d5238
19210b79512c7240k89115e2416A81854l2647m2241g7320n6671A54778b55614g6197
19198b75022R0300A56478a2658A29902A0010d28620f8105K9434j95193J7331r7347
19187c13880J54945k11538a78480K7827B54946e6897p2445B07861b3608B71661
$$ y = [-350159, 202626, -163113, 119106, -174179, -130314, -88599, -245078, 132315, -233141, 12351, -185451, 80888, 327511, 81740, 172348, -165862, -226444, -118810, -18361, 141890, -16999, -122714, -14729, -69919, 247239, -95603, -370739, 2756, -116418, 126021, -90394, -331980, -853, -32159, 6025, -378143, 157051, 31810, -17750, -231786, -309655, -57224, 156368, -224954, 67602, -38273, -193600, -134091, -94921, -140211, 120054, -240576, -299308, -210806, 24752, -131392, -45238, -279512, -37240, -326355, -52416, 181854, 149207, 106966, -77320, -133991, 154778, -255614, -76197, -275022, -184722, 156478, -12658, 129902, 10010, -428620, -68105, -38671, -233864, -216533, -313880, -158935, -370473, -178480, -150653, 254946, -56897, -129342, 207861, -23608, 271661]
19176b61491I6586b00241e6761m16070a40279k7921O6272j71523L4971J9026g3136
19164F1145a86897A33301E6170O6045h7320B52150c05817J16726K1900a6998A79403
19152b8664A51967a32630J8688O577c112r0573G4642a33261B08073E1594d13767
19140A02238b70347J17359o0549A67421J8598k1540a4313B83111B9352a375j05869
19129a07244n855j83366g9160C9881a41576m7164i134j21211A28326J7440C5723
19117g4156j24665B53237a90608j64918D8355M1820M9368P1012B5907a05832A28347
19105B16259k9731b32472H3923Q605a57778C81P288i095j92538g5412A26585a29153
19092B96966b08104L0872A10065k3291l4924J67229O3902b79916N4434A69159
$$ y = [-261491, 96586, -200241, -56761, -472831, -140279, -168200, -101928, -273451, -238480, -219454, -73136, 61145, -186897, 133301, 56170, 122215, -87320, 252150, -305817, -189091, -167191, -16998, 179403, -28664, 151967, -132630, -113942, -107365, -3112, -93685, 74642, -133261, 208073, 51594, -413767, 102238, -270347, -152988, -213537, 167421, 186019, 164479, -14313, 283111, 29352, -1375, -107244, -113099, -296465, -79160, 39881, -141576, -188740, -9134, -130345, 128326, 145766, 35723, -74156, -198821, 253237, -190608, -355526, 48355, 90175, 139543, 210555, 25907, -105832, 128347, 216259, 186528, -232472, 83923, 92528, -157778, 381, 7669, -9095, -201633, -75412, 126585, -129153, 296966, -208104, -177232, 110065, 86774, 51850, 219079, 282981, -279916, -225482, 169159]
19081c69102P0178a00709k34959d7189m2214L1130j68292D12240a18944A23482
19070i6315j80450G5529m43c31315D0619M3101a17306j3630M4276B0571J9578
19059D0149a2641q5897H5893c45587A74924i0336c6547m253D1607J9230L9737
19048A00574J24504f115o6448C0936a82491B3788a46611N0679l1784a4273a442
19036i3448j10754h1290N015Q095A84566b50934G7728k6113J15294J13318O1841
19025C42068a20641A2992M03331a27647K6347B28763j07860n1066a29611m5807
19015a75418Q1121A50418d6568l9821K6105A51863a98828A84079e188A32292A1557
19003B3885a24952K820j3510L7709n4572G0972K27055b30401g2017o650B29387
$$ y = [-369102, -298924, -100709, -335668, -47189, -89403, -58273, -226565, 412240, -118944, 123482, -96315, -276765, 75529, 75086, -331315, 40619, 83720, -117306, -130936, -86660, 20571, 40149, -12641, -98538, 85893, -345587, 174924, -90336, -36547, -40800, 41607, 60837, 100574, 225078, -6115, -72563, 30936, -182491, 23788, -146611, -95932, -127716, -14273, -1442, -93448, -204202, -81290, -76275, -68180, 184566, -250934, 77728, 51615, 166909, 280227, 342068, -120641, 12992, 416323, -127647, -101300, 228763, 120903, 69837, -129611, -175418, -94297, 150418, -46568, -86389, -60284, 151863, -198828, 184079, -5188, 132292, 11557, 23885, -124952, -122132, -135642, -97933, -152505, 70972, 298027, -230401, -72017, -78667, 229387]
18991c06814q8722a53469k07552a41023A54931f1534B18915g9518k91712O6599
18981c04631J9349I1364k2527b021A90890i1000E3690M4094D1875c88019d4181
18969a00717B02527c21046a903A8956J6486a31930q6062C13996I7478b49856A1308
18957A50871b48194D0271K34516a48180I4014G545b2645G280M7761b71015q3486
18946c54501g7850A3176a87980O9698A05995J34643E5939a88686A58050J40098
18936B98148j30417q3250P6533c63652a13169E3064K61160C9999Q0992a64020
18925b35654c6906B92331q6818H4965b6780A09575m9964c1078j28659l4430O74
18914a93493B3512J50236J04718c5822A1269e47594g8187l6184E58452c19656
$$ y = [-306814, -395536, -153469, -361021, -141023, 154931, -61534, 218915, -79518, -371230, -304631, -285282, 91364, 68837, -2021, 190890, -91000, 53690, 97784, 41875, -388019, -44181, -100717, 202527, -321046, -1903, 18956, 35442, -131930, -217992, 313996, 97478, -249856, 11308, 150871, -248194, 40271, 274787, -148180, 94014, 7545, -22645, 7280, 55041, -271015, -354501, -77850, 13176, -187980, -118282, 105995, 240638, 55939, -188686, 158050, 298148, 167731, 84481, 161014, -363652, -113169, 53064, 314224, 39999, 120991, -164020, -235654, -36906, 292331, 205513, 84965, -26780, 109575, 59611, -31078, -159737, -194167, -193493, 23512, 173748, 278466, -35822, 11269, -547594, -78187, -114371, 558452, -319656]
18903c90474a30122n4841B61622K6669E3358A6674M0919b13982k6380H1681a53276
18891B9372J80024c19258B08361G9716l894l4521J05099d19347J74172P0713A48845
18879g4502j16993g5339B05546E262d0323n6627f904j62296B5303a21440k4671
18868a46111e7338j27233k33781A6070J28018Q878l6320a53766e4501E3676J12515
18857A66191M925l0072a92279G0005c7158A99745n9768b23293D4253h7268k91442
18846c78710E8552A8347A441J49389a67553C0572J4718d5727k7748b1167G1435
18834c70107b0007G3527c02021C8473a0603j62041L3805A22471h7743B44858b06413
18822c36762h5285A46639o9890N1791n6676c8592j97189h8358D36618a28273a311
$$ y = [-390474, -130122, -184963, 261622, 288291, 53358, 16674, 57593, -213982, -240362, 81681, -153276, 29372, 209396, -319258, 208361, 79716, 75822, 41301, 146400, -419347, -245175, -174462, 148845, -74502, -191495, -75339, 205546, 5262, -40323, -96950, -6904, -169200, 25303, -121440, -146111, -57338, -184571, -418352, 16070, 144088, 152966, 116646, -153766, -54501, 53676, 166191, 171116, 141044, -192279, 70005, -37158, 199745, 139977, -223293, 44253, -87268, -378710, 58552, 18347, 1441, 150830, -167553, 30572, 45290, -45727, -73475, -21167, 71435, -370107, -20007, 73527, -302021, 38473, -10603, -172644, -138839, 122471, -87743, 244858, -206413, -336762, -85285, 146639, 76749, 128540, 71864, -38592, -235781, -88358, 436618, -128273, -1311]
18810c08733B68822j31552b58399P8927B30974E4719L20681H6399b70039B7253
18799i2333A46103a57709d5119l44036A10681d4899I7786b75290R5033G6283a46666
18787a16605c4313j31977G9607J35740j1041g3861q6574f3907A69404L3453d0869
18775b0921j83220B78208C8475R7347b7529f82I4258c62908C8042b5439A06243
18763i980E2721b75745C4832f7020j90230g2421m8104A48708l4808b29091J09370
18752a19721j54913f2532j62186I9699c02748E0057K32586c71877E5843a85410
18741b21199M8612j46520J02165A26751a29668e2205m844n3757r2954Q2321N9357
18730f2082K9863E3352a25955B57478b7253m30700E6963R3330c01241j6491a23856
$$ y = [-308733, 268822, 137270, -258399, -179472, 230974, 54719, 375400, 86399, -270039, 27253, -92333, 146103, -157709, -45119, -389155, 110681, -44899, 97786, -275290, -180257, 76283, -146666, -116605, -34313, -166290, 79607, 215347, 204306, -73861, -160435, -63907, 169404, 202857, -40869, -20921, -204141, 278208, 38475, 135822, -27529, -682, 94258, -362908, 38042, -25439, 106243, -9980, 52721, -275745, 34832, -67020, -257250, -72421, -120525, 148708, 113900, -229091, -119721, -274634, -62532, -224718, 99699, -302748, 50057, 282643, -371877, 55843, -185410, -221199, -172587, -319107, -216942, 126751, -129668, -52205, -57049, -110806, -203760, -121439, -62082, -32219, 53352, -125955, 257478, -27253, -457953, 56963, 150293, -301241, -317732, -123856]
18718a75966j25934f8900I2633D5257M6057d29496J47936D89290c08364g1094
18707E0265i6815K4417p1307I1418i8691M2790F006O2993O6348c9837j18397D2852
18694A27458a75135B27213b53872K1420k1034j13175c5767C9351d17765g5424
18683b9876N010d738j01022G2149H88J01878J85415a79537E0292L9125J35613
18672B25030a47770A39898D2057a75449k35124G2934j8455a94960C06537b30185
18661b83823L3619A52147d21028A82200F9154D870Q4509a26278A90960g7634r5328
18650a72962F1435M0561h7132m7142k1007b3076A23599a06528a7670l3461A60590
18638A48322J22448a64000d0547l4344J497k76686B2432b29112E3366K6878d9179
$$ y = [-175966, -301900, -68900, 92633, 45257, 91314, -429496, -281560, 489290, -308364, -71094, 50265, -96815, -72398, -143705, 91418, -98691, -55901, 6006, 68999, 135347, -39837, -158234, 42852, 127458, -175135, 227213, -253872, -232452, -253486, -366661, -35767, 39351, -417765, -75424, -29876, -24866, -4738, -105760, 72149, 888, 102766, 288181, -179537, 50292, 89417, 225030, -147770, 139898, 42057, -175449, -410573, 72934, 54479, -194960, 306537, -230185, -283823, -250204, 152147, -421028, 182200, 69154, 4870, 89379, -126278, 190960, -77634, -172962, 61435, 101996, -87132, -134274, -155281, -23076, 123599, -106528, -17670, -51131, 160590, 148322, 270770, -164000, -40547, -74891, -73394, -350080, 22432, -229112, 53366, 80244, -49179]
18626a20436D2442J56669I1835i4007B01660B8380J2634b07005b9627j49725l4724
18615b14076I2303a51380j01199P9517L1593F3585b93899d4597r5560A35606c53413
18603f1985n8058J1982j21272m3686I1225r231C4135J01140d2498k06659F5595
18591e8883l6574q3496B927a01843l16315B01968p8494i6861i865j25315a4592
18579c59191a74191p8399f6407l3313B83811a8066A53777B4305K41868b31147
18568A22602A9731K76574C9206a47658A37649b10335m9564o2862a11821A97259
18557B56427p0087o6353c85062a40849B80910g1774k66771f5228k03165J05135
18547a63258J8695I0219J31475A6815a17505c5728E5314g0317C40327G7798a74750
$$ y = [-120436, 42442, 199111, 91835, -94007, 201660, 28380, 41014, -207005, -29627, -179352, -214076, 92303, -151380, -252579, -173062, -141469, 63585, -293899, -44597, -140157, 135606, -353413, -61985, -120043, -108061, -229333, -273019, 91225, 81994, 34135, 135275, -42498, -249157, 65595, -58883, -95457, -178953, 2927, -101843, -418158, 201968, 123474, -96861, -9865, -135180, -14592, -359191, -174191, -252590, -66407, -99720, 283811, -18066, 153777, 24305, 266173, -231147, 122602, 19731, 296305, 39206, -147658, 137649, -210335, -259899, -322761, -111821, 197259, 256427, 186340, 119987, -385062, -140849, 280910, -71774, -338545, -65228, -268393, -163258, -144563, 90219, 221694, 16815, -117505, -35728, 55314, -70317, 340327, 77798, -174750]
18535i4191A76353P5613e9247I3375a41559b8892C31689D609e003l2085m65911
18524e02999J47185Q2955A57774D0430b24954C0714b41930A94482d9316l1816
18514h1132B27049a44752N5210j31639r4560h5481K3653j09061L4862D9879A9416
18502h0310C30660j30779d5870j11364j55676m2743J64613P0373l0390b7116p9842
18491a06958a7374A88945b5616l7290j5785F469b46523i2645M5125A97451C0996
18479f727r8145j54985G8883Q3748a32861B66083a90774L4585g8019C47422a44043
18467B2465K2175a26776r745f3052m6604A9777a46148j33055c5538A45490a88080
18455B19621o1500a27442F0451b61426F3422g0495A94848g1586K0560B895Q8015
$$ y = [-94191, 176353, 251966, -59247, 93375, -141559, -28892, 331689, 4609, -5003, -37088, -502999, -355814, -272859, 157774, 40430, -224954, 30714, -241930, 194482, -49316, -81132, 227049, -144752, -89542, -221181, -315741, -85481, -61828, -170889, -136027, 49879, 19416, -80310, 330660, 199881, -45870, -157234, -312910, -355653, -191040, -120667, -151057, -27116, -106958, -17374, 188945, -25616, -62906, -78691, 6469, -246523, -92645, -47520, 197451, 30996, -6727, -104872, -259857, 78883, 162631, -132861, 266083, -190774, -156189, -78019, 347422, -144043, 22465, 44640, -126776, -136521, -63052, -109656, 19777, -146148, -279203, -35538, 145490, -188080, 219621, 158121, -127442, 60451, -261426, 63422, -70495, 194848, -71586, -51026, 2895, 90910]
18444I0910M913N3199a22017J8538b2337A70714b68273i3221B3355L78329a64906
18432A07427e2169C26217A01351R2405l0627l5504i4858E2791B4510Q068F64Q310
18420H974g3937j64362C4399A4892b18680M0035O1141l0358C8960c22179P0582
18409b51597A93135i9162n1409A89539i5561H4466R0929d55895A53545a90280
18398H1229c93555a84696l835G5629J7270A6804n677b72675i726A93658g5875
18386a664j29758k1157l2011A87984a74289f9654b5098m38833A76273b01512N1241
18375a50271d024l84064I2599d1067A10768c7783j59577A57033J36755o6733g0462
18363e5991D4240L6429a78935B10947c3118j2816B59345p9208a78663A09993a32945
$$ y = [90910, 95823, 149022, -122017, -103479, -22337, 170714, -268273, -93221, 23355, 401684, -164906, 107427, -52169, 326217, 101351, 193756, 163129, 127625, -94858, 52791, 24510, 32578, 664, 8974, -73937, -238299, 34399, 14892, -218680, -178645, -117504, -147862, 38960, -322179, -251597, 193135, -99162, -150571, 189539, -95561, 84466, 175395, -455895, 153545, -190280, 81229, -393555, -184696, -188531, 75629, 92899, 16804, 11127, -272675, -9726, 193658, -75875, -1664, -131422, -152579, -184590, 187984, -174289, -69654, -25098, -463931, 176273, -201512, -150271, -4024, -388088, 92599, -41067, 110768, -37783, -197360, 157033, 293788, 227055, -70462, -55991, 44240, 80669, -178935, 210947, -33118, -45934, 259345, 180137, -178663, 109993, -132945]
18351c4346A20511D2335J387b76985e1784a4662l6668A53537B4269a59985B725
18339a80562O9225m0368c5234j3733j1496D4068d1418q3987m9641N4971d3406
18327C2220J31598n4840k2192J02636f0151b0962B87037b52039A1786J30260Q424
18316A50470a9217A93348k7295E6944a09790G4501a53653j48004h7724M526j62398
18305b45596G9028B8876e7390A12363d1455G5704a42226b0415r611C654J17089
18294A20743i1234C61491i8102j9969j6809k3176e9448A32493f0826H5863c87024
18282a10065M6305k90360B55691b62349A86023o7385A5964d50313a81613F3189
18271b37822I0079K10888g6998H0101c7528k98912A01940i7447l12649c6381j07963
$$ y = [-34346, 120511, 42335, 43722, -276985, -51784, -14662, -51330, 153537, 24269, -159985, 2725, -180562, -111337, -151705, -35234, -48967, -60463, 44068, -41418, -125405, -175046, -120075, -43406, 32220, 163818, 108978, 86786, 189422, -60151, -20962, 287037, -252039, 11786, 142046, 150470, -19217, 193348, 166053, 56944, -109790, 74501, -153653, -301657, -87724, -83198, -245596, 79028, 28876, -57390, 112363, -41455, 75704, -142226, -20415, -30026, 3654, 120743, -91234, 361491, -98102, -118071, -134880, -158056, -59448, 132493, -60826, 85863, -387024, -110065, -63760, -354120, 255691, -262349, 186023, 118638, 15964, -450313, -181613, 63189, -237822, 90079, 300967, -76998, 80101, -37528, -336440, 101940, -97447, -410096, -36381, -144344]
18260a44344d796D185J95517F5452f0814A82675a88492J9638A08381b46809B7152
18248G1429J25904a22324f200q3759o5590N5271d7090j48854b7481G7223g5415
18236f5533B15732F989i0411l8468j59427a30045a6471j60759Q3396H9935f2061
18224A12285a81926C8615K59281b19734B37227J23192b93502A029J36695a7319
18213a03903A02992O1495i3722j07412A14830J3281a15455N4021c350A63894C8115
18201b31870a1796p051A9133d6040C37862b34866Q2610b7665l4522D05525A48937
18189A22071a28140A77078C5148h7092J5043j53960D8943P375R349g0332b8958
18177h7077l8184M7411A34685b56409Q2852B36382F7956J0659i199j17005A87516
$$ y = [-144344, -4796, 4185, 199702, 65452, -60814, 182675, -188492, -168854, 108381, -246809, 27152, 71429, 197333, -122324, -6200, -89959, -155549, -100278, -47090, -195944, -27481, 77223, -75415, -65533, 215732, 6989, -90411, -128879, -288306, -130045, -16471, -177230, -93834, 89935, -62061, 112285, -181926, 38615, 297896, -219734, 237227, 360419, -293502, 1029, 137724, -17319, -103903, 102992, 164487, -93722, -201134, 114830, 128111, -115455, -61434, -3350, 163894, 38115, -231870, -11796, -18847, 19133, -46040, 337862, -234866, -152256, -27665, -62187, 405525, 148937, 122071, -128140, 177078, 35148, -87092, -72049, -226009, 48943, 56318, 65667, -70332, -28958, -87077, -125261, -77850, 134685, -256409, -173557, 236382, 67956, 78615, -9199, -126204, 187516]
18165C43920b00649A24113a7941F6517J80687B4434a75576O0260A38625m7978
18155I0647a63080j73030F8852f1260j00584h0134A67388E256b30590h4144c3963
18143d1766B67952c1649L346I1490a47856e5832B8658a74187j56211E6398J45540
18132B01938l8747a10014L0058j92263A51451a21223k68813b0254E9933b94248
18121b91867A07505O3117c8459F1447A5093c70738a30143B80568l8074D270c5211
18109h5900H5207b76620a4692j04471H4368K41193j43829a80414A23657d60636
18098d4500k52019g5041K9061k21153B53770a67261O5115D4377a37712Q113E0393
18086a96862K2209C8976e0329C58795A79156p7520a9847j85102l4684B23693i5965
$$ y = [343920, -200649, 124113, -17941, 66517, 247204, 24434, -175576, -115316, 138625, 90647, -163080, -336110, 68852, -61260, -161844, -80134, 167388, 5256, -230590, -84144, -33963, -41766, 267952, -31649, -28303, 91490, -147856, -55832, 28658, -174187, -330398, 56398, 201938, 163191, -110014, -79956, -272219, 151451, -121223, -390036, -20254, 59933, -294248, -291867, 107505, 170622, -38459, 61447, 15093, -370738, -130143, 280568, 242494, 4270, -35211, -85900, 85207, -276620, -14692, -119163, 84368, 325561, 181732, -180414, 123657, -460636, -44500, -296519, -75041, -45980, -267133, 253770, -167261, -102146, 44377, -137712, -129599, 50393, -196862, -174653, 38976, -50329, 358795, 179156, 101636, -19847, -204949, -239633, 223693, -95965]
18074A11877a27928q0474F7452L1190c94829c5649A51421b10529I8502g6461k21117
18063b97578E5273b33082h4655J0724n8701M3964j98042E3241c5192p9901L9322
18052g5771A31160K9145C116L5684b08177A40927a51918e7009a6151j38235A8763
18040A66b29567d6934n3219J0019B27303F2404J94280a66378A45428J1255Q6088
18029B42771a00325j59143A4321a19539o2850a9148j56739B1708a56370j66112
18019c22482C52693j52924b3870G7227a70710M2257B9436a11592A14976j4576
18009A00400l117b46402D0308c6322a2204B17135f4574B0622b28003L8398O7590
17998a22015m9647A71187g1036J4290m1826l12515H0804J69067N8546a31213C1415
$$ y = [111877, -127928, -208402, 67452, 98642, -394829, -35649, 151421, -210529, 98502, -76461, -297578, 55273, -233082, -84655, -73931, -132632, -88668, -286710, 53241, -35192, -115093, -75771, 131160, 160305, 3116, 38800, -208177, 140927, -151918, -57009, -16151, -154386, 18763, 166, -229567, -46934, -100153, -90134, 227303, 62404, 256684, -166378, 145428, 156683, 242771, -100325, -259468, 14321, -119539, -182389, -19148, -175887, 21708, -156370, -322482, 352693, 199769, -23870, 77227, -170710, -128453, 29436, -111592, 114976, 100400, 97283, -246402, 40308, -36322, -12204, 217135, -64574, 20622, -228003, -189605, -122015, -171662, 171187, -71036, -56746, -98572, -411087, 80804, 249871, 308417, -131213, 31415]
17986F2493c1492l49058G6107j7650b2159k8792B90153e1757l4828J5086B76147
17974d5394m0641j56640g189j57496d1951B79274j19948o9093a00058C69810B7247
17962a30993j77927E3651J65000a42353M1089c5674F9165L7388h5820F5588H86
17950B54385D4525e0807A78720i5200A26374N3509C5199a17418l03928J80174
17940b41172A44931R1099l585a09275c462B7608N2066c06849J02332a0130j06955
17929a17085J6557A11343b90161O1012D0289K33814a74131A5963a5357F2333b44017
17917H1245J04168b30616b0241F1213c1506k2917C73746C0979b52824e3293l2172
17906h5465A35300c31049J59340j120b9177j18984M6082E35831A35665m2692F352
$$ y = [62493, -31492, -380550, 76107, 58457, -22159, -50951, 290153, -51757, -86585, -71499, 276147, -45394, -86035, -242675, -7189, -164685, -41951, 279274, 159326, 90233, -100058, 369810, 27247, -130993, -308920, 53651, 218651, -142353, -101264, -35674, 69165, 106553, -85820, 65588, 886, 254385, 44525, -50807, 178720, -95200, 126374, 179883, 35199, -117418, -421346, -241172, 144931, 236030, 232445, -109275, -3462, 27608, 79674, -306849, -204517, -10130, -117085, -100528, 111343, -290161, -229149, 40289, 274103, -174131, 15963, -15357, 62333, -244017, 81245, 185413, -230616, -20241, 61213, -31506, -54423, 373746, 30979, -252824, -53293, -85465, 135300, -331049, -171709, -172829, -29177, -148161, -102079, 535831, 135665, 92973, 6352]
17894g2023A51612c34611h6971C64927F0407i6363B01656j9763D7456a88048H5638
17882F4578L2732R6927G9355a19251j98020P8513H6516d4412l54480A19414B711
17870I8047a22409F1896M0194b18612j1912g7163L6995A0131c3830m48682b632
17858g3923A97494A4435b26231A87457j5797p9478P2633L2177h671c341D691P5296
17846G9987g3225j59806A71423d8937A02538c08209g0020A04173J16406a61721
17835a97773J9398D24105E1281b56870g4758A4731a17945B70825E3860g435A1071
17823C4895J12820J3226k8114b63240J04334A28175b23808e2460p985j06038D65798
17811G4147L8975f5813q6707C7795a33624K4463B30878d6751L483B43911B2737
$$ y = [-72023, 151612, -334611, -86971, 364927, 60407, -96363, 201656, 181893, 47456, -188048, 85638, 64578, 97310, 194237, 79355, -119251, -317271, -238758, 86516, -44412, -398892, 119414, 2711, 98047, -122409, 61896, 102090, -218612, -230524, -77163, -40168, 10131, -33830, -482512, -2632, -73923, 197494, 14435, -226231, 187457, 171660, 92182, 164815, 196992, -8671, -3341, 4691, 79987, -73225, -233031, 171423, -48937, 102538, -308209, -70020, 104173, 220579, -161721, -197773, -178375, 424105, 51281, -256870, -74758, 14731, -117945, 270825, 53860, -7435, 11071, 34895, 147715, 160941, 132827, -263240, -158906, 128175, -223808, -52460, -60445, -166483, 465798, 74147, 113122, -65813, -152520, 37795, -133624, -109161, 230878, -46751, -43268, 243911, 22737]
17799B02384d40629b19404A28015a45810k9568A94123M1357D6674M1981C0506
17788d20260A45539N7899j4055a28772j42183C56667r9126D8030e5980B14340
17777c03117h7218L2201q2267A74430P2457A6541Q0244D0985a1291A20249a17749
17765h6210j5355j55023A2253a25143A65146h2618G9705Q2014p5908k0394a20727
17753A13791e0681j43272C26691a75576n7519B51014M6243A19106b3004D5209
17742a48034C47396A05863D2374b5963J1321A3586J73373c04634e1181o8870H2859
17730i8248A17905f4368B42309b84060H3817A7474b76385D1862K96665A18162
17719B00958a9970l3208k9244A72747c8545A71974a61432A36400J05671e7154
$$ y = [202384, -440629, -219404, 128015, -145810, -175378, 194123, 235480, 46674, 88655, 30506, -420260, 145539, 203438, 189383, -128772, -270955, 356667, 257541, 48030, -55980, 214340, -303117, -87218, -55017, -137284, 174430, 246887, 16541, 96785, 40985, -11291, 120249, -117749, -86210, -101565, -256588, 12253, -125143, 165146, -82618, 79705, 161719, 85811, 65417, -120727, 113791, -50681, -193953, 326691, -175576, -233095, 251014, 297257, 119106, -23004, 45209, -148034, 347396, 105863, 42374, -25963, -14642, 13586, 186959, -304634, -51181, -120051, 82859, -98248, 117905, -64368, 242309, -284060, 83817, 17474, -276385, 41862, 338527, 118162, 200958, -19970, -53178, -82422, 172747, -38545, 171974, -161432, 136400, 242071, -57154]
17708C13358E1740J21811E4331b4805B82131j30573b00738B45445c98216F8558
17697a05313B96820g6637A86677R4896r9347o9221k0454b803j43408H5343a21754
17685C01057j07876K15560A1887a35590j22945d9478n2242B71261b21549D3789
17674B91765j03754E73d387A35994R054a24938C9597e3936B79746J562G0839C2296
17661a45037B86739a18684J0950a9598j19026j98033a08555G855c0607j49829
17651a80436j02223B49067j02494b69452m8080O9328A8895b53173B42695a9969
17640a462p0569k24264a15465d2116a1109l15796G4787a38629A59994F9653J1988
17629H1641a89315L0525D1050c08743C04534q7113a86833B69431j04000a19197
$$ y = [313358, 51740, 173551, 54331, -24805, 282131, 151558, -200738, 245445, -398216, 68558, -105313, 296820, -76637, 186677, 281573, 182226, 113005, 92551, -2803, -146211, 85343, -121754, 301057, 193181, 408741, 11887, -135590, -258535, -49478, -101720, 271261, -221549, 43789, 291765, 188011, 573, -4387, 135994, 145048, -124938, 39597, -53936, 279746, 281308, 70839, 32296, -145037, 286739, -118684, -107734, -19598, -138624, -336657, -108555, 7855, -30607, -180436, -282659, 249067, 146573, -269452, -317532, -248204, 18895, -253173, 242695, -19969, -1462, -72031, -296295, -115465, -42116, -11109, -326905, 74787, -138629, 159994, 69653, 81641, -189315, -158790, 41050, -308743, 304534, 217421, -186833, 269431, 165431, -119197]
17618H9897M3520a23136A43573R2394b05168A32023J96773b65474A2157a65321
17607F7404b28257c0389F3235a7144A47189J78235a29443K6186M2510m2959B95434
17595h7177C63677i0321C5058N9253r617N4623B7646a41030c4241o0559k48A19503
17582a65317B74646m5332B0394L5179M1897N2975g2118A4663K42499d6181d356
17570A36391J99245a26926A06910m3518O6298k3437I355N3942j6402c06669A10187
17558D4227d3868r5409B27007A09111a31206K561N1520j59428G2535K71292j43475
17547B00352p0404b07231R8248C62080b9707n6125a7630B52451C9924a01503A27694
17535A20392a04237E5582J86035C2872J73192C0834c2294j76564B15574l1410
$$ y = [89897, 133417, -123136, 143573, 235967, -205168, 132023, 328796, -265474, 12157, -165321, 67404, -228257, -30389, 63235, -17144, 147189, 325424, -129443, -103257, -60747, -103706, 295434, -87177, 363677, -90321, 35058, 94311, 84694, 139317, 27646, -141030, -34241, -94800, -95048, 119503, -165317, 274646, 229314, 20394, 55573, 97470, 150445, -72118, 14663, 257162, -46181, -4356, 136391, 335636, -126926, 106910, 63392, 129690, 106253, 9355, 63297, 46895, -306669, 110187, 44227, -43868, -139277, 227007, 109111, -131206, -128645, -77125, -236553, 72535, 343827, 200352, 129948, -207231, -108983, 362080, -29707, -85832, -17630, 252451, 39924, -101503, 127694, 120392, -104237, 55582, 241617, 32872, 206064, 30834, -32294, -208858, 215574, 184164]
17525A84164A7948J7318L57864C4683K10990I7976K18768g850o2505L1769k06179
17514b44765E1432a76949j2507A84682p5683R0159r7866N2060m5287a22664k09756
17503c32420B39760e3406B61989I8336a08619G7542P0730L65525a9988I5182L66912
17492D62094A46033D3212N5895j8270b71215A37253R3547a65026d1977A5720L5979
17481E1699k994k1172L15833C2248K32604d7839H2551e2118F4309K86782C2947
17469h4756A05389K0194d2983B72647j33233K93410D0782M953M50946j86454A00457
17457A20166L9991J23714j02013J53740C2237O4668M67824k7663k23642O1388
17447C74812q67A71209K80738E161O34052A91987J50333j65150j1206e54B59366
$$ y = [184164, 17948, 35266, 393130, 34683, 245673, 97976, 316744, -7850, -70355, -38586, -244765, 51432, -176949, -189456, 184682, 108999, 199158, 101292, 153352, 108065, -122664, -332420, 239760, -53406, 261989, 98336, -108619, 77542, 148272, 513797, -19988, 95182, 462094, 146033, 43212, 99107, 80837, -271215, 137253, 230800, -165026, -41977, 15720, 51699, 48705, 27533, 343366, 32248, 264852, -47839, 82551, -52118, 64309, 351091, 32947, -84756, 105389, 125583, -42983, 272647, 139414, 432824, 40782, 45735, 496681, 310227, 100457, 120166, 160157, 283871, 181858, 335598, 32237, 96905, 564729, 537066, 313424, 374812, 373945, 171209, 451947, 5161, 639213, 191987, 342320, 177170, 165964, -554, 259366]
17435C62481b3604A87334H6957L90724j69182K3573D0748A2352Q4645F614J70116
17424A76730K97632q0418o5492j29506D7647K4915L8587N7359L69081B16098D7788
17412b25739A6624K62619n7194N5686P7420J30559a10262F2621F192a7186A77154
17400A64027h6399j84381E71216E6658K2240g8844B34630a22969C23730n6637
17390B67093D1660L36444b74953D8062L01152l4986A06906J11786J28361j25236
17380B21817A06058R5532B9168J29265K05701A06852c5396R385B93417D0962J49343
17369A90305J53291c7286p6625A05775C9437Q5292K65331n9784j46996p5879a59649
17357E4333L09202j67341k9708J3773K28991m4685F8907L7899C9131K37204c6057
$$ y = [362481, -23604, 187334, 86957, 477681, 308499, 332072, 40748, 12352, 96997, 6614, 176730, 474362, 393944, 328452, 198946, 47647, 72562, 111149, 168508, 537589, 216098, 47788, -225739, 16624, 279243, 222049, 277735, 355155, 485714, -110262, 62621, 6192, -17186, 177154, 164027, -86399, -270780, 571216, 56658, 78898, -78844, 234630, -122969, 323730, 267093, 41660, 378104, -274953, 48062, 349214, 314228, 106906, 218692, 347053, 221817, 106058, 201590, 29168, 158433, 364134, 106852, -35396, -26011, 293417, 40962, 190305, 343596, -37286, -113911, 105775, 39437, 124729, 390060, 330276, 183280, 107401, -159649, 54333, 363535, 196194, 166486, 180259, 409250, 364565, 68907, 106806, 39131, 276335, -36057]
17345D6513L74950k00523K19757A39376c667n7141C99299j07456F6171e0759j80362
17334b31121B24490b35741A96996q1184L1854N9801K80817F9335K03964J65191
17324D38490A52270J82834i5289C81855A89264q93G8085J974Q1485o7102D0255
17312B3065L14169a9743F3252b08483B54737N065a32937C00563n3393F5305K57847
17301C23152N1801D6552a50569B80701A4365a8227j02415A43948I056M66523j8653
17290D56926E9497O2492j9496R5321J46317A62822l5373C9149L48454A11149K54466
17279C65615E4278c4575j37806I6863a85541c3267I0565B0510K93346I3217J50417
17268B43634k2734H0734J21137q0420K82587j80618l3425H6342b6936A72421J28031
$$ y = [46513, 421463, 220940, 440697, 139376, -3667, -60808, 399299, 291843, 66171, -50759, -231121, 224490, -235741, 196996, 115812, 147666, 207467, 488284, 69335, 273299, 438490, 152270, 335104, -95289, 381855, 189264, 188371, 78085, 80059, 161544, 94442, 40255, 23065, 337234, -19743, 63252, -208483, 254737, 259802, -132937, 300563, 247170, 65305, 323152, 374953, 46552, -150569, 280701, 14365, -18227, -120642, 143948, 9056, 475579, 456926, 59497, 121989, 102493, 197814, 344131, 162822, 127449, 39149, 387603, 111149, 365615, 54278, -34575, -172381, 96863, -185541, -33267, 90565, 20510, 313856, 93217, 243634, 220900, 80734, 201871, 121451, 404038, 223420, 189995, 86342, -26936, 172421, 300452]
17257C00452E1656K15584K4234J96248F0974M48570A55046E3299J09901J03497
17247B66697d9309D19912E8039L7660K2312J10124B1974p578J99560q9619l9338
17236H4999K40652h1551B29833m7714j9491p1778R6026P7413O1918J5712N1212
17225C93131E4643K57749l0824j01750j0513G7659L48515A52512K9911K53400
17215D35823A98678O7580a5913A16522K66166m6282F9414J56767J25487a2747
17204B16916m5671J68490K90442B97998D6774J6738K27860J24935I4871J08237
17194B03108d9457B92425j19515h366D03718a18326B87871j28746J22696n6931
17184B24890r9840P388K97508a22768B76022H5312a97083D99794j68128n2196
$$ y = [300452, 51656, 267240, 291474, 487722, 60974, 509544, 155046, 53299, 163200, 266697, -49309, 419912, 58039, 95699, 118011, 228135, 21974, 14396, 213956, 124337, 84999, 325651, -81551, 229833, 182119, 162628, 90850, 186876, 264289, 326207, 341919, 393131, 54643, 312392, 281568, 179818, 169305, 77659, 426174, 152512, 182423, 435823, 198678, 266258, -15913, 116522, 382688, 336406, 69414, 226181, 351668, -12747, 216916, 171245, 339735, 630177, 297998, 46774, 63512, 291372, 416307, 94871, 203108, -49457, 292425, 172910, -8366, 403718, -118326, 287871, 159125, 281821, 224890, 125050, 132438, 429946, -122768, 276022, 85312, -197083, 499794, 331666, 279470]
17174B79470b76380B54551O5967J66779j1329l1304L24825C62747F1514K71925
17164C33439j45060P5946P5450j52488A9117K83453K69821G6782N76669A99243
17153B13436K21407J30013k00104n4020L83251B65093M434J22523A51693C7800
17142C67664k3284K01624j73934q371K32763m8785B28618J08590R2393l169r3112
17131C33320J80425A62049M30630j54659j56957k3631Q5531Q7020J29415K4936
17121E84334A65600C5289L69428L5813A91063K85323J2576k39929J27207I2517
17110C76922q2873N6226p8198L13625k20161k697M1512A10255K00918A12057L91190
17099E03247k17865J10207j45628K40083j04407O6219B16678K71305O9433o2427
$$ y = [279470, -276380, 254551, 320518, 487297, 475968, 444664, 769489, 362747, 61514, 333439, 188379, 264325, 339775, 187287, 19117, 302570, 572391, 76782, 653451, 199243, 213436, 434843, 564856, 364752, 310732, 693983, 265093, 269527, 392050, 151693, 37800, 367664, 344380, 546004, 372070, 363699, 596462, 547677, 228618, 337208, 429601, 426432, 333320, 513745, 162049, 592679, 438020, 281063, 257432, 342963, 429983, 559398, 584334, 165600, 35289, 404717, 440530, 191063, 476386, 488962, 249033, 376240, 92517, 376922, 294049, 350275, 272077, 585702, 365541, 362844, 404356, 110255, 311173, 112057, 503247, 285382, 395589, 249961, 490044, 385637, 451856, 216678, 487983, 557416, 494989]
17089D94989Q9133j8842A89831L59576j68125M5488J11431j20243j1913j08997
17079B97048J24878n5608Q0345p7184L1121j9595J6919j55330M87094C47641J92437
17068E40078B20653K71184m8315p5164K89567j54160m2461N2728j3889K63290
17058G63433l53476j12990L91794C35229J36531j95438O5292J49450J7049p6379
17048D31734K35829j60780B29519K49396n6390J9842M0147p2766n7351L32365
17038F84762J61134j92788J97532k12853J10632J44068A92265K34115M07202J1695
17028H45277l20004M05720l7818C42368L06813j05049L49829l13993j0229J43035
17018G12774r3779j73860J03320N979O8451J08175j1354B81683N18830k32438
$$ y = [494989, 584122, 565280, 189831, 549407, 381282, 426770, 538201, 417958, 406045, 297048, 421926, 366318, 446663, 369479, 400600, 381005, 397924, 242594, 729688, 347641, 540078, 220653, 491837, 443522, 368358, 657925, 503765, 461304, 514032, 500143, 763433, 409957, 296967, 688761, 335229, 471760, 276322, 341614, 491064, 508113, 431734, 667563, 506783, 229519, 478915, 422525, 442367, 482514, 409748, 352397, 684762, 845896, 653108, 850640, 637787, 748419, 892487, 192265, 426380, 833582, 845277, 525273, 930993, 893175, 342368, 649181, 544132, 893961, 579968, 569739, 712774, 618995, 445135, 548455, 554434, 622885, 731060, 719706, 281683, 800513, 568075]
17008E68075M08591j51026k49045j64071j59210N31770p6754J36451j96309k06451
16998D42021K30486J44299N133K59967k67068K95109k86381L41311l86580Q2693
16988H60990r6441K30216L01314o23383M53378k00832J75305m67878K18611j09954
16978G41326J18980J86964D84847J98790o0409K06879J58850k72684J82775J77476
16968A076524M5648k49060o931k61095M42527r9254J23337l2987m342p444n163
16957A021760J87176l9586K33818m41576Q3087J91245j32445k95240J89406j34911
16947H62734L32829j76403j16546Q2697K29584O3266j70091R5844j13567j22389
16937I67958P4419Q2296J19059j7151J19515j84358j81371J36676J14089P8495
$$ y = [568075, 976666, 825640, 576595, 412524, 253314, 785084, 708330, 844781, 648472, 442021, 672507, 816806, 821939, 1081906, 814838, 1109947, 823566, 1164877, 778297, 860990, 764549, 994765, 1296079, 672696, 1126074, 925242, 1100547, 632669, 851280, 741326, 860306, 1047270, 484847, 683637, 623228, 830107, 988957, 716273, 899048, 1076524, 1122172, 873112, 866181, 605086, 1047613, 948359, 1071696, 1038709, 1034367, 1026923, 1021760, 1208936, 1169350, 1403168, 961592, 1044679, 1235924, 1103479, 808239, 997645, 862734, 1195563, 1019160, 902614, 985311, 1214895, 1278161, 1108070, 1203914, 1090347, 967958, 1042377, 1124673, 1243732, 1226581, 1346096, 1161738, 980367, 1117043, 1231132, 1309627]
16927A309627K3985k84593J22585p3250K8777L83132j02054n8317L24184k28887
16917A445189j17011K06545k38900K55624p9075p3781Q4578J01866q6527J88747
16907A687255R7405n78581L49348L1396L69745l62426R9498j8449N07346o85895
16897A496642L38760J08508j99428l5970Q9666K59462m0346j15651J86713l28028
16887A760328R1519L15834o35157N17210j42167p7754J69742K42504n5175K01772
16877B388656R2721k91122J87067p6796K92034l25796M76345k29000n31490O93362
16867B675981l6744l8088J28690o9637j93733M26730k54839R3709K12829M1182
16857B986080k41864J59757N5528K2042j49384L74463j82346J80320m5668Q0824
$$ y = [1309627, 1333612, 1049019, 1171604, 1098354, 1127131, 1510263, 1408209, 1349892, 1674076, 1445189, 1328178, 1534723, 1295823, 1551447, 1472372, 1398591, 1483169, 1585035, 1498508, 1687255, 1784660, 1206079, 1555427, 1586823, 1956568, 1594142, 1693640, 1675191, 2182537, 1496642, 1835402, 1943910, 1744482, 1708512, 1798178, 2057640, 2017294, 1901643, 2088356, 1760328, 1851847, 2167681, 1532524, 2049734, 1907567, 1829813, 1999555, 2242059, 2186884, 2388656, 2481377, 2190255, 2377322, 2300526, 2592560, 2266764, 2743109, 2514109, 1982619, 2675981, 2639237, 2601149, 2729839, 2660202, 2466469, 2893199, 2638360, 2732069, 2944898, 2986080, 2744216, 2903973, 2959501, 2981543, 2832159, 3206622, 3024276, 3204596, 3158928, 3239752]
16847C239752J68410N4850j62553N3673K08814k44762K66452K48872j03390q7642
16837C642476o344N15433j26262J31822r7763K07565J47380J03568j17928L86065
16827D786012j95182Q6736L21490J07802k53949R4650K02308J62396R0711J2681
16817E415655Q7812J5987J60494J89435J73294J2760M77986j5453Q3693N1578
16807F653241K00570J38637P3708J46699J80971M03546O683L72325j47940M75128
16797H503568k47802N50587j07088K45938K77874K16280l2406N30328K47999N98414
16787A0783692P5258J46175O34532l2087L60838O66960O4854L75563M78381n1370
16777A3502796O50398M28684P15618O29203J10527P01102M35189O93925M96507
$$ y = [3239752, 3408162, 3463012, 3300459, 3354132, 3562946, 3318184, 3584636, 3833508, 3730118, 3642476, 3636132, 4151565, 4025303, 4157125, 4059362, 4266927, 4414307, 4517875, 4399947, 4786012, 4590830, 4677566, 4999056, 5106858, 4852909, 4947559, 5149867, 5312263, 5402974, 5415655, 5503467, 5519454, 5679948, 5869383, 6042677, 6055437, 6533423, 6517970, 6601663, 6653241, 6853811, 6992448, 7066156, 7212855, 7393826, 7797372, 7804055, 8176380, 8028440, 8503568, 8255766, 8806353, 8699265, 8945203, 9223077, 9439357, 9406951, 9937279, 10185278, 10783692, 10858950, 11005125, 11639657, 11607570, 11968408, 12635368, 12700222, 13075785, 13554166, 13502796, 14153194, 14581878, 15297496, 15926699, 16037226, 16738328, 17173517, 17867442, 18363949]
16768A8363949O19627N84336O02441J039269N76352R16093Q41913P51214R82498
16759B5277692J030431J125032J052718J257976J420671J433577J265594J863247
16751C5726938J421320J720708J500267K036400K499315K235918K040511K719223
16743E1900600K856910K863174L182604L230104L659576L838154M208090M404306
16735H0143518M934707M988445N642936N903174O129689O568304O806961P262548
16727A28380282P506712P532993P908292Q220186P517712P521001P002129O573710
16719A88163017N240911M210751L017127J826242M71348j088865k561418l566993
16711A95712120m970853n587836o814397p222991p241572p980183q212793p548165
$$ y = [18363949, 18983576, 19567912, 20170353, 21209622, 21785974, 22702067, 23543980, 24295194, 25277692, 26308123, 27433155, 28485873, 29743849, 31164520, 32598097, 33863691, 35726938, 37148258, 38868966, 40369233, 42405633, 44904948, 47140866, 49181377, 51900600, 54757510, 57620684, 60803288, 64033392, 67692968, 71531122, 75739212, 80143518, 85078225, 90066670, 95709606, 101612780, 107742469, 114310773, 121117734, 128380282, 135886994, 143419987, 151328279, 159548465, 167066177, 174587178, 181589307, 188163017, 193403928, 197614679, 200631806, 202458048, 202929396, 201840531, 199279113, 195712120, 190741267, 185153431, 178339034, 171116043, 163874471, 155894288, 147681495, 140133330]
16703A40133330q109063p503172p189835p438243o379019o140007n783194n641879
16695H5948918n198170n108023m254131l954943l909430l687387l223832l049186
16687E3563816k842745l008196k361576k461815j937007k032359k089948j395054
16679C5435116j667518j793087j338976j383150j411736r24639j267611j173900
16671B4474499q82123r05439j056340j032242n66141o80716p71619o59150n75874
16662A7344855l47419p36473m65918r21104l24924m13485k48765p79404n05246
16653A2602117j69966o22986k03508l57042m15065k43706P5882o01980k14320
16644I849426o01953k04046k09473k92679J25108o44942J69028l16201l28869
$$ y = [140133330, 132024267, 124521095, 117331260, 109893017, 103513998, 97373991, 91590797, 85948918, 80750748, 75642725, 71388594, 67433651, 63524221, 59836834, 56613002, 53563816, 50721071, 47712875, 45351299, 42889484, 40952477, 38920118, 36830170, 35435116, 33767598, 31974511, 30635535, 29252385, 27840649, 26916010, 25648399, 24474499, 23592376, 22686937, 21630597, 20598355, 20032214, 19351498, 18579879, 17920729, 17344855, 16997436, 16260963, 15795045, 14873941, 14549017, 14135532, 13886767, 13107363, 12602117, 12432151, 11809165, 11605657, 11248615, 10833550, 10589844, 10665726, 10063746, 9849426, 9247473, 9043427, 8833954, 8541275, 8666383, 8021441, 8190469, 7874268, 7545399]
16635G545399m06013j08144j39263j1231k7486m38151N7935j52558k2839m96076
16625E801573o3625M7424j74831l68304M45720n08209J52377m19407J12977o34808
16615D390887J26764p0490j19683R6320r1334k46024L55403k83278j87335k26048
16605C745182J30013j13922n6900J88763l34546j1690j11981K00511l62604j09967
16595C162859L8294k14406L61182l41098j06479K93685J7656o21086L58971k15362
16585B734216K86231j38788j91701l2119r8698M9450N7400n75692L16158k85391
16575B121066J35404P8608j09138j46835K27147j41424r4377J19995l71927K98700
16565B117219Q6066j00934k88607J96575Q3381l55873K9990J32006Q877k23107
$$ y = [7545399, 7139386, 7031242, 6891979, 6880748, 6853262, 6415111, 6473046, 6320488, 6297649, 5801573, 5737948, 5785372, 5610541, 5242237, 5687957, 5179748, 5332125, 4912718, 5025695, 4390887, 4517651, 4447161, 4327478, 4423798, 4332464, 4086440, 4441843, 4158565, 3971230, 3745182, 3875195, 3761273, 3704373, 3893136, 3558590, 3546900, 3434919, 3635430, 3272826, 3162859, 3201153, 2986747, 3347929, 3006831, 2900352, 3194037, 3211693, 2590607, 2949578, 2734216, 3020447, 2881659, 2689958, 2657839, 2559141, 2608591, 2665991, 2090299, 2406457, 2121066, 2256470, 2335078, 2225940, 2079105, 2306252, 2164828, 2070451, 2190446, 1818519, 2117219, 2203285, 2102351, 1813744, 2010319, 2093700, 1737827, 1767817, 1899823, 1908700, 1685593]
16555A685593L1819K33782l73548J01124P8252j39460K32069l71199L93522j7329
16545A854625l49376J18183m26441K67961K60561j86486Q3332n5055k08921J82242
16535A540625n9008k08666j15395Q1704L11390q3432l31482K8891j10410J31370
16525A185587j8752r9097j13091K82687J24819l57149J92095j0469J38621o05302
16515G19949L86556J08412J886k56155K04643E79581L16794K27999q7618j20805
16505I15951q337N3518l4746l9228k53318M52507m54176K09313K6845m8947j94128
16494F25254p9903K70810k30184K53892j28066J86250j36876j04783J79711j19983
16484G16122J04406n1959J73425m09255J06772N9840j01834J85584k60206K34203
$$ y = [1685593, 1717412, 1951194, 1577646, 1678770, 1757022, 1617562, 1849631, 1478432, 1871954, 1854625, 1505249, 1623432, 1196991, 1464952, 1725513, 1539027, 1622359, 1567304, 1358383, 1540625, 1481617, 1272951, 1157556, 1239260, 1550650, 1467218, 1135736, 1164627, 1054217, 1185587, 1166835, 1067738, 954647, 1237334, 1362153, 1005004, 1197099, 1186630, 1325251, 719949, 1106505, 1214917, 1216803, 960648, 1165291, 579581, 896375, 1124374, 1036756, 915951, 907614, 961132, 926386, 887158, 633840, 1086347, 632171, 841484, 868329, 819382, 625254, 545351, 816161, 585977, 839869, 711803, 898053, 761177, 656394, 836105, 716122, 820528, 768569, 941994, 532739, 639511, 699351, 597517, 783101, 522895, 757098]
16474G57098J30312j51676J3144p1981L30789k40851L6166C61063J78118q0156
16464D59025J73773J43046j20351l10569j14814n4047L31314L16412e16E39515
16453G36912k74437K16372K42057D08316q9222K35642J13281k17419J55322K28517
16443H34437r5790j39193j93604j91582M82485C29900K09668O6519p6471M5076
16433E74692j80600L4727j47317j19881K84333j48483i9992D41855r2760q9649
16423B59446L03079A65069K9443L93514j43309A32595L15555j95421Q4447K32595
16413E69771o7008m0674j71230e1373E57832A15869a9858C06261M0369N2420p5970
16402C23080L0979E1226j3338J37959J53382L24865B22625J79374A48380J56073
$$ y = [757098, 887410, 735734, 748878, 676897, 1007686, 766835, 803001, 361063, 539181, 459025, 632798, 775844, 655493, 344924, 230110, 176063, 507377, 823789, -516, 539515, 736912, 462475, 678847, 920904, 408316, 319094, 554736, 668017, 450598, 605920, 834437, 738647, 599454, 405850, 214268, 696753, 329900, 539568, 606087, 529616, 574692, 394092, 428819, 281502, 161621, 445954, 297471, -99992, 441855, 349095, 259446, 562525, 165069, 194512, 588026, 444717, 132595, 448150, 252729, 337176, 569771, 502763, 462089, 290859, -51373, 557832, 115869, -19858, 306261, 346630, 399050, 323080, 354059, 51226, 37888, 175847, 329229, 654094, 222625, 401999, 148380, 304453]
16392C04453I6490K40379J98011k58330R6875J77208r6968j18625Q6429j68405
16382B53064M26054l34905A13636K24610K62686j02326j56602A48106J29799K6581
16372C04486G7012J33836d7291A11168J46867J1210K00370B07781k9865J2313
16362A90229M50383k67164j73408M06909j34945n7161A06803c5283C01461p5078
16352B26383l8651J47390A06337J51040l9830B6490L16037h2399A61464c557B12061
16340C9203K16594o293A19149h272A99210J02053J80315j78374F4571K4217J1681
16329A00469O3084N2742c5921A10801L11052p5385o8646j36293N24266l07518
16319C58277q3373D7438L73837k02502f0524B68568p3430D3745M567J53067Q640
$$ y = [304453, 96490, 336869, 534880, 276550, 373425, 550633, 453665, 335040, 421469, 253064, 679118, 344213, 113636, 338246, 600932, 498606, 342004, 148106, 277905, 304486, 77012, 210848, -47291, 111168, 258035, 269245, 469615, 207781, 177916, 190229, 640612, 373448, 200040, 606949, 472004, 414843, 106803, -35283, 301461, 226383, 187732, 335122, 106337, 257377, 217547, 26490, 342527, -82399, 161464, -3557, 212061, 39203, 255797, 249504, 119149, -8272, 199210, 301263, 481578, 303204, 64571, 88788, 100469, 163553, 216295, -35921, 110801, 421853, 346468, 277822, 141529, 665795, 358277, 274904, 47438, 421275, 218773, -60524, 268568, 195138, 43745, 48312, 201379, 210019]
16308B10019A1689K21091D442K09870R7603L74952f6990C5984g0856A468R7796
16297I9264d7959B83936M4555j01221i7677A37565K47197q2664r4184L679b13931
16285F9846A0358K01145R3978e9131C07010i0328k0996D75422a16333A18488b62286
16273C8600H197L42441A31471N2559Q6803J8389K05584C8640L1695K31867A7012
16261a80053B33062b7038j01903E7740K76769E0826c9223q8690C55478c2046A372
16249c66684a18708M2485E5668K56321D2164c4866A67941M6552I3144h3623A10365
16237I9531G415a6385B6424d4140j23598A05589J87877n8732c10171B65306a31445
16225A32534a85213B76168A17875B2120Q4484C7085J29804C6149a2663j10959
$$ y = [210019, 11689, 232780, 4442, 214312, 311915, 686867, -66990, 35984, -70856, 1468, 99264, -47959, 283936, 328491, 227270, -97677, 137565, 384762, 302098, 207914, 211593, -213931, 69846, 10358, 211503, 305481, -59131, 307010, -90328, -111324, 475422, -116333, 118488, -262286, 38600, 8197, 350638, 131471, 184030, 270833, 289222, 494806, 38640, 70335, 302202, 17012, -180053, 233062, -27038, -128941, 57740, 334509, 50826, -39223, -127913, 355478, -32046, 1372, -366684, -118708, -76223, 55668, 311989, 42164, -34866, 167941, 214493, 93144, -83623, 110365, 99531, 7415, -16385, 26424, -44140, -167738, 105589, 293466, 234734, -310171, 265306, -131445, 132534, -185213, 276168, 117875, 22120, 106604, 37085, 166889, 36149, -12663, -123622]
16215a23622D9611h8361A46281l5650B3663J75508K9364g1063A68237q2042i2594
16203c92678C0189K6635a13175J9297l0214A63671b165q95j908k33954B40400
16191A35976J07180I574K07702M3731f3033F1995h5297L099H6410n138N18823
16180F00095B3216h7706k82106f5581B62268B7570K42424C5448c3510D3073L1920
16169G4993j8863J09064L0004l7194m4905h4933l896l03835A36762A7619P636
16158B5255J50213K1618D7364N8100B6838h073B24371c67891A49929a12866B74921
16146C32722j28699j8392c58577h4021J0199j61653h4831j26144A6420L3353a51848
16134c2916j33603P0676d3484F9593P3036i5056L9145l3725j22521B009a30604
$$ y = [-123622, 49611, -88361, 146281, 110631, 23663, 199171, 228535, -71063, 168237, 86195, -92594, -392678, 30189, 56824, -113175, -93878, -124092, 163671, -2165, -3060, -4968, -238922, 240400, 135976, 243156, 9574, 217276, 261007, -63033, 61995, -85297, -82198, 86410, 81272, 600095, 23216, -87706, -369812, -65581, 262268, 27570, 269994, 35448, -33510, 43073, 74993, 56130, 165194, 195198, 158004, 113099, -84933, -88829, -392664, 136762, 17619, 25255, 175468, 197086, 47364, 105464, 26838, -8073, 224371, -367891, 149929, -112866, 274921, 332722, 204023, 185631, -358577, -84021, -73822, -235475, -84831, -210975, 16420, 49773, -151848, -32916, -166519, -95843, -43484, 69593, 142629, -95056, -55911, -89636, -212157, 2009, -130604]
16122B10032F7791a53509m4943A87002a37489D9266J1746b03481A29685d7256
16111a39912b7762B24036a57236A04476J40877h1232I3341L2098q969j3979c3706
16099a3363A70237n9708A3618O2251L77418c4813I8748a06009D89184e0404F1512
16087a25529k27285J4779f2248C7461b42819e644A53450C816b64871p7253a3807
16075b87522E7786M02733i9589H9719b42297B71128g0466B11636a63317j95998
16065c59315G1517b93798B02516o7760a39091C83152a98323a9026H5176N2108
16055A37284J0758h6626B07380a12628k70877k5060f4285A04192K7301J13860
16045B45353F0440R7988D2344c2438K499j115J0599j77466P1563p9553E7743a74707
$$ y = [210032, 67791, -153509, -198452, 187002, -137489, 49266, 61012, -203481, 129685, -47256, -139912, -27762, 224036, -157236, 104476, 245353, -81232, 93341, 125439, 116470, 102491, -33706, -13363, 170237, 110529, 13618, 75869, 453287, -34813, 98748, -106009, 489184, -50404, 61512, -125529, -352814, -338035, -62248, 37461, -242819, -5644, 153450, 3816, -264871, -342124, -13807, -287522, 57786, 460519, -99589, 89719, -242297, 271128, -70466, 211636, -163317, -359315, 71517, -293798, 202516, 134756, -139091, 383152, -198323, -19026, 85176, 137284, 148042, -86626, 207380, -112628, -383505, -408565, -64285, 104192, 131493, 245353, 60440, 158428, 42344, -32438, -29939, -31054, -20455, -197921, -126358, -205911, 57743, -174707]
16032b46115J12740A97116e009j06927N5483B12409B1529J13062K0278G4956C5764
16020b17951f6339E460a74348A24786a34271c3977j42994Q723o5342Q1390M8016
16009a04184j52808B88161C6168Q7387l696Q3159j4188G9980a72666k2956D35575
15997A38556a53780c6059q3664F4264a72954g3106j12529F7791P4659f3925I8736
15985B7645K64614J31712j36421I6017d6333B85624K99338I9150j3374d6947D392
15973a69565B33953a10136A06645a4637G0457B8869M6375L00493h6849B4047a01044
15961c21810f7211B11386j8414d29121C60999j40988b1995k95158a16980k19235
15951c36215a18376j16938j45853i7993D9948K1850l1848a13425j93827N0586
$$ y = [-246115, -133375, 197116, -5009, -111936, -56453, 212409, 21529, 134591, 154869, 74956, 35764, -217951, -66339, 5460, -174348, 124786, -134271, -33977, -176971, -168248, -233590, -152200, -104184, -256992, 288161, 36168, 123555, 119859, 203018, 188830, 79980, -172666, -195622, 435575, 138556, -153780, -36059, -119723, 64264, -172954, -73106, -185635, 67791, 142450, -63925, 98736, 27645, 292259, 423971, 287550, 96017, -46333, 285624, 584962, 99150, 85776, -46947, 4392, -169565, 233953, -110136, 106645, -14637, 70457, 28869, 75244, 375737, -86849, 24047, -101044, -321810, -67211, 211386, 192972, -429121, 360999, 220011, -21995, -317153, -116980, -336215, -118376, -235314, -381167, -97993, 49948, 71798, 39950, -113425, -307252, -256666]
15941b56666B12505q2521R2345C9656a39890l4831h4195B20136c04469L8457e9451
15929b1467D2615e9448K0776r3148j1965B01652l8478a48752L2117a0998B653
15917D1147e4919k38666K2056p7178B824f0748j78060B32109E6220b03018k8177
15906b31195k8618b8274l10202h4131A99470d84858A24961b91847G3608a18907
15895e4711m7816A97747b08938A17425b69921A8816K26560m6334G3934P8706A1579
15883g4536I4496g0128j15306C7383m171R0890j6536b55009A5013a10840n5923
15872a66763L6665A16975D3960c10093J7346e2716b4739j52130g9163F235J77447
15861A83682h1779H1179a03144A26206a34140A27381K6718a36643q2102a3955
$$ y = [-256666, 212505, 129984, 222329, 39656, -139890, -174721, -84195, 220136, -304469, -266012, -59451, -21467, 42615, -59448, -38672, -131820, -143785, 201652, 163174, -148752, -116635, -10998, 2653, 41147, -54919, -293585, -271529, -348707, 2824, -60748, -238808, 232109, 56220, -203018, -231195, -259813, -28274, -338476, -84131, 199470, -484858, 124961, -291847, 73608, -118907, -54711, -102527, 197747, -208938, 117425, -269921, 18816, 245376, 199042, 73934, 152640, 11579, -74536, 94496, -70128, -185434, 37383, 33212, 124102, 107566, -255009, 15013, -110840, -166763, -130098, 116975, 43960, -310093, -292747, -52716, -24739, -176869, -79163, 6235, 183682, -81779, 81179, -103144, 126206, -134140, 127381, 154099, -136643, -218745, -13955]
15850a40604a3530G546a31385B12793D5005c91593J45875a8865A7052f2961B8665
15838a50204o9176i455A52461h3749B02771D7620b03887f611j51811j73466O5535
15827b66353Q1268b6592A45923C309d5944l60960F4229J89039b97517d5559o0546
15816a06105a5881r2786F3748i9837l282k96461A37736i0535k4418B11261F2595
15804A02436a71154A82830h9114B82808K7824I5995a86122Q6521R742j99273j52804
15793d41936a39386N6773L7355B53897l8979a43268D5976K984K41610a13429k15199
15782c28628B10566g4942q7647E2632g0450n3845L0081A73459b23769e0596l5354
15771h5950q1605j66493B5866N00691A70846c05732J26385r7407b9216r183m1922
$$ y = [-140604, -13530, 7546, -131385, 212793, 45005, -391593, -245718, -18865, 17052, -62961, 28665, -150204, -219380, -9455, 152461, -83749, 202771, 47620, -203887, -6611, -158422, -331888, -266353, -185085, -26592, 145923, 3309, -45944, -406904, 64229, 253268, -297517, -45559, -106105, -15881, -108667, 63748, -99837, -103119, -399580, 137736, -90535, -114953, 211261, 62595, 102436, -171154, 182830, -89114, 282808, 310632, 95995, -186122, -99601, -89859, -289132, -441936, -139386, -82613, -45258, 253897, 214918, -143268, 45976, 48960, 290570, -113429, -328628, 210566, -74942, -162589, 52632, -70450, -124295, -94214, 173459, -223769, -50596, -85950, -167555, -334048, 25866, 526557, 170846, -305732, -179347, -276754, -29216, -38399, -80321]
15760h0321j5757B17036A00930l0359L67482a25885C48478c58338J02841I9134
15749a7563l7277B30481E765J42630B6239a34532f4747C32672A60382b53459I51
15737b30266G4515c0186m1618i858H8486K59096a04863k36417D3988c8555B90402
15725a97071n4975H5182B6975J26026a14643k10026i6755C64571j53402b83304
15714a29489B5142c0223l0991n0108B6924J8769N5452H601e8879P863A19827a14213
15701g1765F3072M7998k5222h3844E3356k723p247J14207b22119d3072j03452
15690a46524j35270B34185j513A11278b77551c2548p4614J546A9166c0763Q74
15679b9889A58366d4031D4736b52175A26445a09329j47519f4317Q2j52789A67035
$$ y = [-80321, -96078, 217036, 100930, 70571, 438053, -125885, 348478, -358338, -255497, 99134, -17563, -54840, 230481, 5765, 148395, 26239, -134532, -64747, 332672, 160382, -253459, 951, -230266, 74515, -30186, -71804, -9858, 88486, 347582, -104863, -341280, 43988, -38555, 290402, -197071, -252046, 85182, 26975, 153001, -114643, -324669, -96755, 364571, 211169, -283304, -129489, 25142, -30223, -61214, -111322, 26924, 45693, 101145, 8601, -58879, -51016, 119827, -114213, -71765, 63072, 111070, 85848, -83844, 53356, 50633, 43386, 157593, -222119, -43072, -146524, -281794, 234185, 232672, 111278, -277551, -32548, -107162, -105616, 19166, -30763, -29889, 158366, -44031, 44736, -252175, 126445, -109329, -256848, -64317, -64235, -217024, 167035]
15667A97838a92636H3752J26704l5863a7545r5395j8824q7846M2477D13767a62885
15655C9972a36026H6786m0449a84427O8560o5089A0159l980J45568b634k5444
15644b8078l8176B953a19567r2256C24094g610A97175J40933a32966A5889a35985
15632A10807k8807a09338B55487a08533B54730g0373B5777g7949m2437C4188b09967
15620a12899N521b8998A39588m2445a52378n8717k211B11417C8907a23202N3437
15609f9765k62981h6419d2720E3229a86099j7395P4056q8481j47095b6048B27627
15597b83947g6004l6395D1636M94762a95144R3830B6285L76114f23A27950e8753
15585e9485A56056B4864a583C41868a73611B6282J76392o6037o0446b6695B19529
$$ y = [197838, -192636, 83752, 210456, 174593, -17545, -112940, -131764, -219610, -177133, 413767, -162885, 39972, -136026, 86786, 46337, -184427, -115867, -180956, 10159, 6179, 151747, -2634, -28078, -66254, 2953, -119567, -211823, 324094, -7610, 197175, 338108, -132966, 15889, -135985, 110807, 82000, -109338, 255487, -108533, 254730, -70373, 25777, -77949, -120386, 34188, -209967, -112899, -107378, -28998, 139588, 97143, -152378, -211095, -213306, 211417, 38907, -123202, -69765, -332746, -86419, -42720, 53229, -186099, -203494, -129438, -217919, -365014, -26048, 227627, -283947, -76004, -112399, 41636, 536398, -195144, -101314, 26285, 402399, -623, 127950, -58753, -59485, 156056, 24864, -1583, 341868, -173611, 26282, 202674, 136637, 76191, -26695, 219529]
15573A9813R4961a53588A40150e9420A09005a34386j20068o125A45010m8567b78634
15561a05320d6237j65744B38495q6865d17323J99943n5914A03348m7442J00735
15551A56641J99831B1999Q8073a08271l08350a84981M2731B0003e621l51037a4958
15539A3528M9466M6401a0524k9770k1195D253b2764j68806f1142A77493o4207
15528A13286B9353L1297b6449j30130A77366b24682I1399i4230l7041I8127J91092
15517B89219b10988d0083j62429D8496K20002d0789A99224k6745b49617B8632
15506C48862a10215c5734B25408m9784J07327A06976b3258A56538b6914q4499
15496a11413B42720a03876A0261g2038B7074P3702a31296L9963C3293K75055H6590
$$ y = [19813, 114774, -153588, 140150, -59420, 109005, -134386, -254454, -260579, 145010, 96443, -278634, -105320, -46237, -211981, 238495, 151630, -417323, -217380, -273294, 103348, 55906, 156641, 356472, 21999, 110072, -108271, -416621, -184981, -142250, 20003, -5621, -356658, -14958, 13528, 62994, 109395, -10524, -40294, -61489, 4253, -22764, -191570, -61142, 177493, 113286, 29353, 60650, -26449, -156579, 177366, -224682, 91399, -94230, -131271, 98127, 289219, -210988, -40083, -202512, 48496, 268498, -40789, 199224, 172479, -249617, 28632, 348862, -110215, -35734, 225408, 175624, 282951, 106976, -23258, 156538, -26914, -111413, 242720, -103876, 10261, -72038, 27074, 100776, -131296, -91333, 33293, 308348, 86590]
15484C2780e552k8829r5326E6249J09660k7242a02348r0799j06234B592a1507
15472B35787a79893F1121a7624k04772A50575Q6942A09282K0933N4319b35482
15461A74634P3438a6683A13263M2695a72031l02684H6106K84111G8645a61213
15450H9663b13812A9606P7308g7174K1189i346n9871k32702J1092A91035B6014
15438B2497J15941K70051c5460m0845c4032k0497o6940G3059j0801P2071o4278
15427G0051P2080j6153e5917l6170r550k25936A22830A2912K2551J46680c80526
15415C13549j35756G193L4603L14565a73345A49431a25415B25827b52231B36991
15404A62347f203j9076l30804A67494a11341j2259c745G718Q7583b06967Q6896
$$ y = [32780, -5552, -34381, -129707, 56249, 165909, 138667, -102348, -193147, -299381, 2592, -11507, 235787, -179893, 61121, -17624, -222396, 150575, 237517, 109282, 130215, 184534, -235482, 174634, 248072, -16683, 113263, 155958, -172031, -474715, 86106, 370217, 78645, -161213, 89663, -213812, 19606, 96914, -77174, -55985, -9346, -69217, -301919, -290827, 191035, 26014, 22497, 138438, 408489, -35460, -76305, -34032, -54529, -121469, 73059, 62258, 134329, 70051, 142131, 125978, -55917, -92087, -101637, -327573, 122830, 12912, 35463, 182143, -380526, 313549, 177793, 7193, 41796, 356361, -173345, 149431, -125415, 225827, -252231, 236991, 162347, -6203, -25279, -356083, 167494, -111341, -123600, -3745, 7718, 95301, -206967, -120071]
15393a20071C60471a05983D8146A2246a60239m1473h7688L7008G0570b10722a121
15381D1904c8929A50473K6007n4100K4204E6479b07533a8816E3025c54658K0802
15370c33856I1169j5292i3942K541C86305A04036b24337H6376a1319m7389A87745
15358a08800k97449A87501k2994h4327j0473A07079c81389a3309j28700E2365
15347C0756d3933B48055j17874a15772d638r9408C8277J59286a8072j87481Q8219
15336a17334l7973b9499k08133A33338g5263A49915O2354p9030J55956b08156
15325D8575d1930A49640h2116H6276J98807d3328G6647J04569B921O7080J42494
15314B12495a19689k10870A62293a75642d5798A90585o3593b17061B311J42881
$$ y = [-120071, 360471, -105983, 48146, 12246, -160239, -201712, -87688, -50680, 70570, -210722, -1121, 41904, -38929, 150473, 176480, 122380, 146584, 56479, -207533, -18816, 53025, -354658, -333856, 91169, 75877, -93942, -91401, 386305, 104036, -224337, 86376, -11319, -58708, 187745, -108800, -406249, 187501, 164507, -84327, -94800, 107079, -381389, -13309, -142009, 52365, 30756, -43933, 248055, 130181, -115772, -4638, -104046, 38277, 197563, -18072, -205553, -117334, -155307, -29499, -237632, 133338, -75263, 149915, 212269, 133239, 289195, -208156, 48575, -41930, 149640, -82116, 86276, 285083, -43328, 76647, 181216, 2921, 70001, 212495, -119689, -330559, 162293, -175642, -45798, 190585, 126992, -217061, 2311, 145192]
15304A45192e5414j0295B9143a073j00718A61066J18029A3664g6672B40577E1120
15292a9879A95893A0698M32102a24040L0045A50223L15341D6937j1167N1534l5480
15281E1824P3579n5858J54716M222j05545M27823j57042e5381C6425A0420i1198
15269A83012A1001J64828R1881j7879F6903M1119j5028A9337a06086B05879K76882
15258D82761G5618K61282l2981j39853L34430a33216C79083A29936J83172K28468
15248E41576L62649M29445l37013P37519n75829n26969l00169j23719p5831b5517
15237C01460H5088K2602b27030d0765A76932j750o5156L36505j43976a37076K5155
15226a11921J9869A48052k4640J25486n3327J0213G3274k0789K12253a0877j75461
$$ y = [145192, -55414, -65709, 29143, -1073, -101791, 161066, 279095, 13664, -76672, 240577, 51120, -19879, 195893, 10698, 442800, -124040, -93995, 150223, 465564, 46937, 35770, 87304, 51824, 125403, 69545, 224261, 228483, 122938, 550761, 393719, -55381, 36425, 10420, -91198, 183012, 11001, 175829, 267710, 249831, 66903, 108022, 92994, 19337, -106086, 205879, 482761, 75618, 336900, 303919, 164066, 498496, -133216, 379083, 129936, 313108, 541576, 904225, 1333670, 996657, 1734176, 1158347, 631378, 331209, 207490, 131659, -25517, 301460, 85088, 107690, -227030, -40765, 176932, 175182, 110026, 446531, 302555, -137076, -111921, -92052, 148052, 123412, 248898, 195571, 205784, 73274, 52485, 264738, -10877, -186338]
15215a86338D7337K1278J00496o5039q30a34081n6099m4104a030C12945j45478
15204A67467c40218a07485B13142L2622m7859p0924K73001g1476E1842a6843k0485
15193c7328l5I5395Q8441E8029H519O770c5220B74647a78172o7047A7970J08912
15181A26882J90903J47561H1002K32145A23775J63957c5895F8793g7919K5833
15171e2086D6349K24069j02436g4471A01363J6258J83108b55953H0814C6615M49163
15160D85778f4561D3279r815J89985E4703K22752P6610G1981K84750j53411E8411
15148a20752B75561q0367l1576D6686J52102h9479C22411f6676B07393O097b64905
15136a28763K5161A70354G6097Q0895a2687A62989A3667K81063A01581K12412
$$ y = [-186338, 47337, 68615, 169111, 104072, 103242, -134081, -190180, -234284, -1030, 312945, 167467, -340218, -107485, 213142, 245764, 197905, 126981, 399982, -71476, 51842, -16843, -37328, -37363, 95395, 183836, 58029, 8519, 15289, -35220, 274647, -178172, -245219, 17970, 126882, 317785, 465346, 81002, 313147, 123775, 287732, -35895, 68793, -77919, -52086, 46349, 270418, 167982, -74471, 101363, 117621, 300729, -255953, 80814, 36615, 485778, -64561, 43279, 33464, 223449, 54703, 277455, 354065, 71981, 356731, 203320, 58411, -120752, 275561, 195194, 163618, 46686, 198788, -89479, 322411, -66676, 207393, 213490, -264905, -128763, -103602, 170354, 76097, 156992, -12687, 162989, 13667, 294730, 101581, 313993]
15126C13993a20347B66361j18450B20J59237p1280J85434D8618P0764K11210a16030
15114C01066f9007M124j96649L7660F8286C283b86405a09649E04c0419D9746c2199
15101B63064h0868C06039j07054j1133J09520j34431K332J28811h0335m9516E6762
15089B87278h0754B12459H8954C2756J41156K7649E8235B9076K81760l2521F4143
15077A4274N08585B7986K08894n0063Q0276J46755A19690K14535A28087L8509
15067A66596k0304J31194A30310M1428L9092J73132G6969L40710N3187a00335
15056I3220F962L84492j90835K880o7561M5453f779B53787C8561E238J11978D4303
15043C5377L4816K57337N9220F9259L47519A51219a46984C88435E9454a22251
$$ y = [313993, -120347, 266361, 147911, 220, 159457, 88177, 273611, 48618, 119382, 330592, -116030, 301066, -69007, -64883, -261532, -223872, 68286, 3283, -286405, -109649, 504, -30419, 49746, -32199, 263064, -80868, 306039, 198985, 187852, 297372, 162941, 165273, 294084, -80335, -129851, 56762, 287278, -80754, 212459, 88954, 32756, 173912, 201561, 58235, 29076, 310836, 278315, 64143, 14274, 522859, 27986, 236880, 186817, 267093, 413848, 119690, 334225, 128087, 166596, 146292, 277486, 130310, 171738, 210830, 383962, 76969, 417679, 470866, -100335, 93220, 6962, 391454, 200619, 203499, 135938, 181391, -6779, 253787, 38561, 5238, 117216, 44303, 35377, 70193, 327530, 386750, 69259, 416778, 151219, -146984, 388435, 59454, -122251]
15032A65879K5985i5252B63277N8947N403a53818B04586h087B88953J54967j27225
15021C16695A17386g5116C58804A6328O745J33685c7629C88557d4100A89025b99482
15009c87777A36346K06349K7291g218r0679E17202b3975D27583j85465R7307q3329
14998B56096o7871l6314R0811j6485F3217M801M58350D9627K15187B0309M18971
14987D39280k08072D9246N05592k25280J6847f7691F0477N1920L29938A82950
14976B53315K7369M4119A36107E5206L25394A02913N912K60426o9579q5859G5177
14964A7360P2378K25278q5781e5714C9576N22776r7000j28717j14087J19858j4235
14953C28171R9105J4683A15769K45292j59674K80818k02045J30213A93989l9126
$$ y = [165879, 191864, -95252, 263277, 322224, 327627, -153818, 204586, -8087, 288953, 443920, 316695, 117386, -75116, 358804, 16328, 23073, 156758, -37629, 388557, -44100, 189025, -299482, -387777, 136346, 342695, 369986, -7218, -97897, 517202, -23975, 427583, 242118, 339425, 256096, 188225, 151911, 242722, 226237, 63217, 68018, 526368, 49627, 264814, 20309, 439280, 231208, 49246, 554838, 329558, 346405, -67691, 60477, 112397, 442335, 182950, 253315, 280684, 324803, 136107, 55206, 380600, 102913, 108825, 369251, 299672, 213813, 75177, 17360, 89738, 315016, 229235, -55714, 39576, 562352, 465352, 336635, 222548, 342406, 328171, 427276, 441959, 115769, 361061, 201387, 482205, 280160, 410373, 193989, 154863]
14943A54863J68724j20565J36946A69726m0005J67241a709B69590K6857m8848
14933B47599r9420K45656J65712I1955A2038K66911J64498l2914A94562K5813
14923B20375L4648J56351j70014R2766K80550k74413j14109H4101L12881I2535
14912D13274j27228K20192k13629G9219M98133i0939A75993K43513K19810k85724
14902C53592B9708K14981K39247R9842j34034A14370L96927j02522Q0505j27460
14892C61820m2507E3127L78080j13744B7797O28177J0304k07326j58974K25011
14882E24989n311j24814K25956I5302K87486j4753L4096j17440J30594j28149
14872B87136j26559J7993L5905K12607L29706B56540K71163n6205n163l0079A98184
$$ y = [154863, 323587, 203022, 339968, 169726, 129721, 296962, -1709, 269590, 296447, 247599, 148179, 393835, 559547, 91955, 12038, 278949, 443447, 410533, 194562, 220375, 255023, 411374, 241360, 334126, 614676, 340263, 226154, 84101, 396982, 92535, 413274, 286046, 506238, 292609, 79219, 577352, -90939, 175993, 419506, 639316, 353592, 29708, 244689, 483936, 583778, 449744, 114370, 511297, 408775, 489280, 361820, 319313, 53127, 431207, 317463, 27797, 655974, 666278, 458952, 299978, 524989, 519678, 394864, 620820, 95302, 382788, 368035, 402131, 284691, 415285, 287136, 160577, 178570, 214475, 427082, 756788, 256540, 527703, 471498, 466335, 436256, 198184]
14860B82005O5327L88691k70258A97989n2444R0817J87016J0489A69379P69007
14850I38386C09724L78184C15300R2568O4840B03934J45370N9159P4165o0150
14840D22478j74952L23919L6763j08291p9545K08089j48016j99119J95740M05331
14830H82397k21123j66622N6607j74373K21789j06291R3746k42181J60414j58553
14820C45810M06131l02415j14300K62542J04840j66127M866q6179J27784j96900
14810C86052P5019O2765J05752L6092B73433A26105Q40001m79622P2632J03087
14800F62203j29697L59490C82730K13256o3484o0021K88384k13545j27016j09470
14790C10834L61819j54699K06658l22603L69744l26944J48662N5546l24002L12655
$$ y = [282005, 347332, 736023, 465765, 197989, 145545, 236362, 423378, 433867, 169379, 938386, 309724, 687908, 315300, 407868, 472708, 203934, 349304, 408463, 482628, 422478, 247526, 571445, 608208, 499917, 420372, 628461, 480445, 281326, 477066, 882397, 661274, 494652, 551259, 376886, 598675, 492384, 586130, 343949, 504363, 345810, 751941, 449526, 335226, 597768, 702608, 536481, 541347, 455168, 582952, 386052, 461071, 523836, 629588, 665680, 273433, 126105, 966106, 486484, 559116, 662203, 532506, 891996, 382730, 595986, 532502, 472481, 760865, 547320, 420304, 310834, 672653, 517954, 724612, 402009, 771753, 444809, 593471, 649017, 325015, 637670]
14780F37670j32489K43988Q256k69114J86763J54539O7600k44531K1991K28783
14770I03456j86599m0720j624j28101K98842j05911k11488K49553k1895O0604
14760H16117N8142C64736J49725B35139O07107p9139k01506P9027l74P0248j77150
14749E33352K06350J63064j32689j13249j52509J5447l1259M62351m30175P7272
14739E97955J74174M34891E70942N8523M2307L1408M9315r2303J37336k0222j87524
14728E89782K87076j56469Q666j06081R8308M7799L10077m51776k15409O4378
14718D76351O3918K62023K12140k41061L06642l36747l9469J96470L4687r2080
14708H42874K9540J1248k27053Q7319K1069j18301M27542k7078j37294N05137
$$ y = [637670, 505181, 749169, 757425, 488311, 675074, 829613, 897213, 652682, 674673, 903456, 716857, 676137, 674513, 546412, 845254, 739343, 527855, 777408, 755513, 816117, 874259, 364736, 514461, 235139, 842246, 763107, 561601, 640628, 640254, 710502, 533352, 739702, 902766, 770077, 656828, 504319, 519766, 488507, 950858, 520683, 597955, 772129, 1207020, 570942, 629465, 671772, 703180, 752495, 660192, 797528, 777306, 589782, 876858, 720389, 729055, 622974, 721282, 769081, 1079158, 627382, 411973, 476351, 540269, 802292, 1014432, 773371, 1080013, 743266, 703797, 900267, 934954, 842874, 872414, 883662, 656609, 743928, 764997, 646696, 1074238, 1047160, 909866, 1415003]
14698A415003o69213N1542Q9189k29315L38596j6059n0369j65027L67665K9855
14688A161867m45674L353J25058L33987k14715r0182J32126j48058M68234k25547
14678A100449r5301L32864l45324q363K29810m42421J5376K75676o0573K01133
14668A203326l33073K30907O9485l3084j70889K12887l63183M33876p7708J40916
14658A313460j31636r4751J94108n4267k55371K63358k8768j39850K24579k9191
14648A261671Q9119j87090r7196M17353M157j07767k20689k83182L75975P0856
14638A323207J68080l49889K45206q1156K8406L42728o24381M36196j65785M7871
14628A370483k83208K97094J62978k87026L67516k25121K84554k34040J32242
$$ y = [1415003, 745790, 797332, 886521, 657206, 995802, 979743, 929374, 764347, 1132012, 1161867, 716193, 719546, 844604, 1178591, 963876, 873694, 1005820, 857762, 1325996, 1100449, 1005148, 1338012, 992688, 984325, 1214135, 771714, 787090, 1062766, 1002193, 1203326, 870253, 1101160, 1170645, 1137561, 966672, 1179559, 816376, 1250252, 1172544, 1313460, 1181824, 1087073, 1281181, 1226914, 971543, 1234901, 1206133, 1066283, 1290862, 1261671, 1350790, 1163700, 1066504, 1483857, 1488014, 1380247, 1159558, 876376, 1252351, 1323207, 1491287, 1141398, 1386604, 1305448, 1333854, 1676582, 1052201, 1488397, 1322612, 1370483, 1087275, 1384369, 1547347, 1260321, 1627837, 1402716, 1687270, 1453230, 1585472]
14619A585472k57256j25730N9289j1324K99781J81572k64368L0750J82157J02455
14609A782798K1419k4402k85819K13896Q3249J74092j96063o4398J30947j24880
14599A710839J4507k5902J115J83274r3216r1503M18683m3633l11052P8326J7731
14588A859169K41798k3568M3136j71722k04155K63425L2247j06194J39345j43174
14578A930307k7070K03629J72763k12280J67265k16927Q8131M45965o36461M75624
14568B390946j11759L80255k67964J97575l6889Q4058m40257O13379J08311k2828
14558B894827o9964J15359L27170K48128l030q8074J186570J71465J043520J483964
14548G309935L516365P814310K2842899K490357j9090367j2334162o125245k489710
$$ y = [1585472, 1328216, 1202486, 1261775, 1250451, 1550232, 1731804, 1467436, 1498186, 1680343, 1782798, 1804217, 1779815, 1493996, 1707892, 1791141, 1965233, 1769170, 1704772, 1835719, 1710839, 1725346, 1699444, 1700559, 1883833, 1790617, 1699114, 2117797, 2074164, 1763112, 1841438, 1859169, 2100967, 2077399, 2120535, 1948813, 1744658, 2008083, 2040330, 1934136, 2073481, 1930307, 1903237, 2106866, 2279629, 2067349, 2234614, 2017687, 2105818, 2551783, 1915322, 2390946, 2279187, 2659442, 2391478, 2589053, 2552164, 2636222, 2195965, 2809344, 2917655, 2894827, 2824863, 2940222, 3267392, 3515520, 3512490, 3424416, 4610986, 4782451, 5825971, 7309935, 10826300, 18640610, 41483509, 43973866, 24883499, 12549337, 6424092, 3934382]
14540C934382j133345l79270k94559k53333L35248k25523O7569J0931J26146K2336
14530B210582k86500N30703j89488n8635L76873K994m656k81044L79198k3389
14520B656638J8894j2380K29263k20004P0077j86079J17301M3895j12374J50239
14510B755470P7238J87508k59277J52078R0481r5813L77936j34758n5398J95503
14500C290968J53164R2496k67450K80894j82398L61518m59918j83645N26496J88949
14490C801074m05027N81219l5637l42468J33307K94254l187l72747K74882L4046
14480C959716l4863k311o4207O35595n35307L60062M37506l34420P6494l31382
14470D166883K05146K7267l7595J71917K81493r0436j54318K28684M6006K74538
$$ y = [3934382, 2801037, 2421767, 2127208, 1873875, 2209123, 1983600, 2051169, 2062100, 2188246, 2210582, 1924082, 2454785, 2265297, 2206662, 2583535, 2586529, 2581873, 2300829, 2680027, 2656638, 2675532, 2663152, 2892415, 2672411, 2742488, 2556409, 2673710, 2717605, 2605231, 2755470, 2832708, 3020216, 2760939, 2913017, 3003498, 2907685, 3285621, 3150863, 3095465, 3290968, 3444132, 3536628, 3269178, 3550072, 3367674, 3729192, 3269274, 3085629, 3612125, 3801074, 3396047, 3977266, 3941629, 3599161, 3732468, 4026722, 4023535, 3650788, 3925670, 3959716, 3924853, 3922542, 3858335, 4493930, 3958623, 4318685, 4756191, 4421771, 4498265, 4166883, 4372029, 4399296, 4361701, 4533618, 4815111, 4724675, 4570357, 4799041, 4845047, 5119585]
14460E119585n5983j37330L14621J01712k22494L56227k75034J56737J85434j62059
14450E381416J35604j18762L35773J09416J74444o9317J5269K48842j00328N1964
14440F164321M39605j90077k09540O11122j75454L00790m11912N21899j32766
14431F917988K07395K01750Q4986L66452j10782r2182l9154L48035K2733r8385
14421G808836K40142j01003L12022K71043P3849K87802j13911K17611j68820K02064
14411I029635N08651J55458L5890n6797K5803M24912K9790L90103J09291J88264
14401A0841000J29930J87767J13255J24175K84254J8275M07122J4991N8356N85476
14391A2764601J80589J28896J68847J56037O7001N74393K16003J13178L38944
$$ y = [5119585, 5063602, 4926272, 5240893, 5342605, 5120111, 5476338, 5201304, 5358041, 5543475, 5381416, 5517020, 5398258, 5734031, 5843447, 6017891, 5948574, 5963843, 6212685, 6112357, 6164321, 6603926, 6413849, 6204309, 6815431, 6639977, 6940767, 6528855, 7050754, 6917988, 7125383, 7327133, 7412119, 7778571, 7667789, 7575607, 7536453, 7884488, 7907221, 7808836, 8048978, 7947975, 8259997, 8531040, 8604889, 8892691, 8778780, 8996391, 8827571, 9029635, 9538286, 9693744, 9729634, 9672837, 9698640, 10123552, 10153342, 10543445, 10652736, 10841000, 10970930, 11158697, 11271952, 11396127, 11680381, 11698656, 12105778, 12120769, 12179125, 12764601, 12945190, 13074086, 13242933, 13398970, 13465971, 14040364, 14256367, 14369545, 14708489]
14382A4708489L64911L21159J78172K62933L70748L02407O25483J38452L94429
14373A7667183O32816l0481K77097K89864L24910M25410N98682O40165L69706
14364B1195352L81946P10110L79910L70041O60986N19782L57978N14814N21504
14355B5612423O52397Q66232L25930N26911O68463R25811O33121J102101O10898
14346C1924287R56089O27621Q15306Q78602R79025Q78688R03478J196493J340652
14337D0500241O83167J371623J395505J415210J113475J524861J290882J722349
14329E1017313J278285J655401J811329J987904K004619J906821K285443K182001
14321F6129116K218355K435552K408348K964084K589622L079309L222535L103918
$$ y = [14708489, 15073400, 15394559, 15572731, 15835664, 16206412, 16508819, 17134302, 17272754, 17667183, 18299999, 18269518, 18546615, 18836479, 19161389, 19586799, 20185481, 20825646, 21195352, 21577298, 22287408, 22667318, 23037359, 23698345, 24218127, 24576105, 25090919, 25612423, 26264820, 27131052, 27456982, 27983893, 28652356, 29578167, 30211288, 31313389, 31924287, 32880376, 33507997, 34323303, 35201905, 36180930, 37059618, 37963096, 39159589, 40500241, 41183408, 42555031, 43950536, 45365746, 46479221, 48004082, 49294964, 51017313, 52295598, 53950999, 55762328, 57750232, 59754851, 61661672, 63947115, 66129116, 68347471, 70783023, 73191371, 76155455, 78745077, 81824386, 85046921, 88150839]
14313H8150839L298417M243153L977360M011752M372914M289027N113817M939292
14305A22396571N475279O087242N979987O196088O752174P263936P591684P858090
14297A75601051Q830860Q710822R695855J0140960J0514939J1341008J1565392
14290B46400887J2474002J2486999J3699110J3828511J4442363J4498058J5510549
14283C43340479J4867864J5217522J4994328J4616170J4750839J2828439J2594562
14276D43210203J0742540R329958P091663M059165P27916j999289l708707o794177
14268D62659272q041796m978836r355343r766798j0692238j1505438j3213949
14261C95104874j4354230j5309789j5626848j5424133j5502515j5742412j4957623
$$ y = [88150839, 91449256, 95692409, 99669769, 103681521, 108054435, 112343462, 117457279, 122396571, 127871850, 133959092, 139939079, 146135167, 152887341, 160151277, 167742961, 175601051, 184431911, 193142733, 202838588, 212979548, 223494487, 234835495, 246400887, 258874889, 271361888, 285060998, 298889509, 313331872, 327829930, 343340479, 358208343, 373425865, 388420193, 403036363, 417787202, 430615641, 443210203, 453952743, 463282701, 470374364, 474433529, 475161445, 473162156, 469453449, 462659272, 454617476, 449638640, 440283297, 430516499, 419824261, 408318823, 395104874, 380750644, 365440855, 349814007, 334389874, 318887359, 303144947, 288187324]
14254B88187324j3191605j3570270j3040311j2470149j2029609j0935418j0347431
14247B02602531r872310r724600q489443q278534p407226p575274p049581o528958
14239A37676605o149056n280916n481869n334132m643428m833563m537261l901659
14231I7514721l406703m118342l275400l183969l602545k636619k977220k581300
14223G1732623k319738k499180k472394j945194k264065j948442j743136k053931
14215E4486543j628135j281704j481515j336941j842411j671152r87133j354955
14207D2902597q85955p97150j507350j428019j032568q72422p85258l80316j315664
14198C3897895j183527p38677j012716n41051n86995r49864n07773p30041o42357
$$ y = [288187324, 274995719, 261425449, 248385138, 235914989, 223885380, 212949962, 202602531, 192730221, 183005621, 174516178, 166237644, 158830418, 151255144, 144205563, 137676605, 131527549, 126246633, 120764764, 115430632, 110787204, 105953641, 101416380, 97514721, 94108018, 89989676, 86714276, 83530307, 79927762, 77291143, 74313923, 71732623, 69412885, 66913705, 64441311, 62496117, 60232052, 58283610, 56540474, 54486543, 52858408, 51576704, 50095189, 48758248, 46915837, 45244685, 44257552, 42902597, 42016642, 41219492, 39712142, 38284123, 37251555, 36379133, 35593875, 35213559, 33897895, 32714368, 31975691, 30962975, 30421924, 29834929, 28885065, 28377292, 27647251, 27004894]
14189B7004894q11511q42021m15466m44622o27133m36559n73530o9416j104423
14180B1680213p7371n76536k06485r00577k50210l78627j98688n02530j44218
14171A8444971m96564n07841l03690m6324o67224j57989R8604l90286n07733m76725
14161A4989199j3750l29984O571m71549l02786K63865l18086l97716l61833k73022
14151A2790909K2093o07512K42061m14265l458k19153o25251K07176m29204j51863
14141A0811533O050m2005j95299j20812q9515l76322l26717K0394K6462j78160
14131I535609j28516k41519L34951m81449l0866J5393l11685k73321K63951m14866
14121H267682R8151m82624K83834k09649l03555J45237l15112J4696k87955J81430
$$ y = [27004894, 26193383, 25351362, 24935896, 24491274, 23864141, 23427582, 22854052, 22784636, 21680213, 21602842, 21026306, 20819821, 19919244, 19669034, 19290407, 19091719, 18589189, 18444971, 17948407, 17440566, 17136876, 17090552, 16423328, 16265339, 16363943, 15973657, 15465924, 14989199, 14975449, 14645465, 14652036, 14180487, 13877701, 14141566, 13823480, 13425764, 13063931, 12790909, 12813002, 12205490, 12447551, 12033286, 12029828, 11810675, 11185424, 11392600, 10963396, 10811533, 10817583, 10775578, 10580279, 10459467, 10369952, 9993630, 9666913, 9687307, 9713769, 9535609, 9407093, 9165574, 9500525, 9019076, 8988210, 9003603, 8691918, 8418597, 8682548, 8267682, 8365833, 7883209, 8167043, 7957394, 7653839, 7799076, 7483964, 7498660, 7210705, 7392135]
14111G392135k92914q5363o5113J08127k66795J6292j26761j22367J53304P4540
14101F785085j97128q1895j80405k38029k16353J4319K66778j64997k80780J40715
14091E847310L0827r1663K7479J23497n55723J01354j64998K17645n79059L47536
14081E304205j25238R612j89910j33429J717m3186K9259L6805l18651K83121J2221
14070D866526n48872L71575k26495l5621M1957O5928k02985k10198O3434J89072
14060D374321j11080J87204k00832k9967o9144J00177n49712L23418j81763K54308
14050D096930m23984l58223R4332J43169L4486K1185m5237j57293l86435M06235
14040C425165M6909m21131M01280l76111p989J39814l4083O4772k91299K82740
$$ y = [7392135, 7099221, 7013858, 6948745, 7056872, 6790077, 6806369, 6679608, 6557241, 6710545, 6785085, 6587957, 6506062, 6325657, 6087628, 5871275, 5885594, 6152372, 5987375, 5706595, 5847310, 5878137, 5786474, 5813953, 5937450, 5381727, 5483081, 5318083, 5535728, 4956669, 5304205, 5178967, 5188579, 4998669, 4865240, 4866957, 4823771, 4853030, 4889835, 4571184, 4854305, 4866526, 4317654, 4689229, 4462734, 4427113, 4469070, 4534998, 4332013, 4121815, 4185249, 4374321, 4263241, 4450445, 4249613, 4219646, 4150502, 4250679, 3700967, 4024385, 3842622, 4096930, 3672946, 3314723, 3409055, 3552224, 3586710, 3607895, 3562658, 3405365, 3018930, 3425165, 3472074, 3050943, 3452223, 3076112, 3068123, 3207937, 3173854, 3238626, 2947327, 3230067]
14030C230067o1345j10368J45495j65039k56079J78026k29428K18246p2853R6508
14020B973230q8443k32129L7303l2478J13086j93081l6921m9420J48136l38039
14010B301244L31639l56165L06309l20396J60535P1538j81943j06731J58755l63100
14000B001685P1934l9933N1618K28128k59573J1720J81224q948K5639L56418N3864
13989B673776Q41972J953356O149096K0315467J4133044j8829717j1493908o175498
13981I567588k295160k024280r39214k54226n44584n53882J77453J63775m26053
13972B871417J29963k66424r0033J7120k10729j3849J32643p9641j98812P7478
13962B369133j71454k02078K17557j3413j07688J02289j21832K82454m26095l6140
$$ y = [3230067, 3168722, 3058354, 3203849, 3038810, 2782731, 2960757, 2731329, 2949575, 2876722, 2973230, 2884787, 2652658, 2689961, 2657483, 2770569, 2577488, 2540567, 2491147, 2639283, 2301244, 2632883, 2276718, 2583027, 2262631, 2423166, 2494704, 2312761, 2206030, 2364785, 2001685, 2073619, 2033686, 2085304, 2313432, 2053859, 2065579, 2246803, 2237855, 2263494, 2619912, 2673776, 3515748, 5469104, 11618200, 31933667, 46066711, 27236994, 15743086, 9567588, 7272428, 5248148, 4308934, 4054708, 3510124, 2956242, 3133695, 3297470, 2871417, 3001380, 2734956, 2644923, 2662043, 2451314, 2437465, 2570108, 2490467, 2291655, 2369133, 2197679, 1995601, 2213158, 2199745, 2092057, 2194346, 2072514, 2354968, 1928873, 1892733]
13952A892733J43115O790l36742L93404l43131K33920j27540L49691l87771j65594
13942A658875J14359L41588l88217J61575n33885K89802K52521l55023M86794
13933B028389l1090l56576J3081M7122j3758k00363R2124k3452O8303J23782j38049
13922A609513K91037l24107J19651m46736P1706L49249l70629M75175l37777J51608
13912A588690P1623l98234K47322j51892J64924j73180r8782K03688K53194l32632
13902A374721J26484P3739O2143j97969n22994P47189k24417j00305O4707j19526
13892A283772L99893k89646o9461k17694k2851O9124j48379J19478J39160o574
13882A256822q5164k84456M42267N9393j8738K42628k89905j9864j063j40641
$$ y = [1892733, 2035848, 2042638, 1705896, 2099300, 1756169, 1990089, 1862549, 2212240, 1824469, 1658875, 1773234, 2114822, 1726605, 1888180, 1354295, 1644097, 1896618, 1541595, 2028389, 1997299, 1640723, 1653804, 1700926, 1687168, 1486805, 1578929, 1555477, 1623780, 1747562, 1609513, 1900550, 1576443, 1696094, 1249358, 1321064, 1670313, 1299684, 1774859, 1437082, 1588690, 1660313, 1262079, 1509401, 1357509, 1522433, 1349253, 1250471, 1454159, 1707353, 1374721, 1501205, 1574944, 1637087, 1439118, 916124, 1663313, 1438896, 1338591, 1403298, 1283772, 1683665, 1394019, 1324558, 1106864, 1084013, 1153137, 1004758, 1124236, 1263396, 1256822, 1171658, 887202, 1329469, 1388862, 1370124, 1612752, 1322847, 1302983, 1301920, 1161279]
13872A161279r3601J20718J1933j78082r4240M37478k86674J78409J68275m51325
13862I74170M5118J23554J59003l42902k36807N53696M1017R2674l17757m1812
13852A049954k56919K83168r7070N37348m49457O167k33801J80540J01057J04268
13842A225255m72792N03025q5317k35957j53513L61298O5970m89164L83120j17503
13832I84422J8813M6164l9290p4242k6905K14674l32730Q0704J99111j95142j10291
13821G65288K62069j38395R0252o2951q8620L05851k79040J73088j5094O5269
13811A077717m05273N38624m31887L01065k92452J31474j50821L84959o5122l70049
13801G18235L19319o9976k84546M9312J94453j8426P9334k336l5119N3175l22852
$$ y = [1161279, 1067678, 1188396, 1200329, 1022247, 928007, 1365485, 1078811, 1257220, 1425495, 974170, 1019288, 1142842, 1301845, 958943, 722136, 1275832, 1316849, 1409523, 1091766, 1049954, 793035, 1076203, 979133, 1516481, 1067024, 1073191, 839390, 1019930, 1120987, 1225255, 752463, 1255488, 1170171, 934214, 780701, 1141999, 1207969, 718805, 1101925, 984422, 1003235, 1049399, 1010109, 935867, 908962, 1123636, 790906, 871610, 1070721, 875579, 765288, 1027357, 888962, 979214, 916263, 827643, 1133494, 854454, 1027542, 1012448, 1077717, 672444, 1211068, 779181, 1080246, 787794, 919268, 768447, 1153406, 1088284, 718235, 1037554, 967578, 683032, 732344, 926797, 908371, 987705, 985369, 950250, 1003425, 680573]
13790F80573P1952B56673M46710L06022k08488n359K87637l80843P1170j65329
13780F08193m2426M64836k60560M5370j75797M32731j55606j88030J31663m04664
13770D55710N27080q8366j87124k71610R0886j38779L66350M0676K37805D62373
13759E88039K77692j53197l30245J93644J69906k34723L08462l19200K35528k1085
13749G14821K00493l25382P860P2376J10191j4274l80756L79009r5793J08267
13739G76812k82068J68912A91040N72092k75052L10747C65831Q4489M4672L07160
13729H02152l05658m2126L77909j35509j71423J58885M13984D87854K01977j06984
13719E82847J10351l17280P4215n459K41249B52585L86855J95633k77227Q2709
$$ y = [680573, 752525, 256673, 703383, 1009405, 800917, 795558, 1083195, 702352, 773522, 608193, 565767, 1030603, 770043, 815413, 639616, 1072347, 916741, 728711, 860374, 455710, 982790, 894424, 707300, 435690, 526576, 387797, 754147, 794823, 1032628, 462373, 588039, 865731, 712534, 382289, 575933, 745839, 511116, 819578, 500378, 735906, 714821, 915314, 589932, 597792, 670168, 780359, 766085, 385329, 764338, 668545, 776812, 494744, 663656, 191040, 763132, 488080, 798827, 365831, 450320, 494992, 802152, 496494, 454368, 832277, 696768, 525345, 684230, 1098214, 487854, 689831, 582847, 693198, 375918, 450133, 444674, 685923, 252585, 639440, 835073, 557846, 640555]
13709F40555j96726L24578r2107r758q0896K39581j36464j044J75172k80308B23387
13697C87588L069j6536J58706m5028r4215J58221j66664j8624M47057l92651j18811
13686C02112L94698j25424m7937Q431L470j62406j17293J77056J82567k22804
13676C92470A81906J36609K81650J60165n2342p4831A11880J97712J45638K6560
13666D81790j09459L7323K64938j90198O2594k36169L5883O8707O0680l8345K81179
13655G18923B34627r830A09562L33817J63343j54420j04669J68316m9051Q4208
13645E51106B44110J05612M84710A52989M23550j29985j53758K87760J05688j21974
13635E64270J5497k08806M35342C65674M7915j54272K15551j14549j6284F1252
$$ y = [640555, 443829, 768407, 676300, 666542, 585646, 825227, 688763, 687719, 862891, 582583, 223387, 387588, 390657, 374121, 532827, 487799, 393584, 551805, 385141, 366517, 813574, 420923, 302112, 696810, 571386, 523449, 531880, 535350, 372944, 255651, 432707, 615274, 392470, 181906, 318515, 600165, 760330, 707988, 633157, 111880, 309592, 455230, 481790, 372331, 409654, 674592, 484394, 546988, 310819, 346702, 415409, 476089, 437744, 718923, 234627, 224797, 109562, 443379, 606722, 452302, 347633, 515949, 466898, 551106, 244110, 349722, 834432, 152989, 576539, 446554, 292796, 580556, 686244, 564270, 579767, 370961, 806303, 365674, 413589, 259317, 474868, 360319, 344035, 61252]
13624D76658A47614M32770N2502A50149L20874B05696J32254r9669J18894j44185
13614B12990J29500O2747o5764J59243j04762j95216J16891J61820j28471k8954
13604C20024J06991A88507K69752J56132B04504O0036J21974K6194j70728K51555
13594D93535A73764J6779J94885j92311J18581K96495j29157P5971J12600B89499
13583D32483p7131J3033K1526q809J32377A03876M40120n7695j75657J05076j74630
13572B41090l8377K48158K12879c4870B68872K74398M7956n4860j86694A65101
13561B50542K6690K40179j74758K0190K19974A91797K72580j47608l7504p3260
13551B06005L88099j70987j68583L24346A31976R4337N3812A31707J78259r6094
$$ y = [476658, 147614, 580384, 632886, 150149, 471023, 205696, 337950, 238281, 357175, 212990, 342490, 405237, 339473, 498716, 393954, 198738, 315629, 477449, 348978, 320024, 427015, 188507, 458259, 614391, 204504, 264540, 386514, 412708, 241980, 493535, 173764, 190543, 385428, 193117, 311698, 608193, 479036, 555007, 667607, 289499, 432483, 355352, 368385, 389911, 381102, 513479, 103876, 543996, 486301, 310644, 415720, 241090, 202713, 450871, 663750, -34870, 268872, 543270, 591226, 536366, 349672, 165101, 250542, 277232, 517411, 342653, 362843, 582817, 191797, 464377, 316769, 279265, 206005, 594104, 423117, 254534, 578880, 131976, 226313, 280125, 131707, 309966, 213872]
13541B13872L42090B45793J07302q3813M09588l19578A12174J71012p1383H9401
13530C61628P8306j28350p8078J42522n609r1351K09766C6672K54335I3937L69506
13519D63443J36446A29627B6278D421M29297d4427E77968k35094j25835K30353
13509D47392b3903C40854B211K11924N18457j93269a15980C34828B1157d0820
13498A9750L38221A25768J4358C2394L13798j47226M1021r3168F6110L8992M69108
13487E74210j14766b9154A97654C6351O5904L66344r1974J69531J2709B49200
13476B25300L53640j74729j40788J75135j51286j22205L21898j54741p8726J15726
13466C69224A08604N6598K19858d6054H8948Q4001P1468P0409j27267J56540C0588
$$ y = [213872, 555962, 245793, 353095, 269282, 678870, 359292, 112174, 283186, 211803, 89401, 361628, 439934, 311584, 233506, 376028, 370419, 279068, 488834, 36672, 291007, 93937, 463443, 599889, 129627, 26278, 4421, 433718, -44427, 577968, 342874, 217039, 447392, -23903, 340854, 2211, 214135, 732592, 539323, -115980, 334828, 21157, -40820, 19750, 357971, 125768, 140126, 32394, 346192, 198966, 239987, 146819, 66110, 105102, 574210, 459444, -29154, 197654, 36351, 102255, 468599, 376625, 546156, 558865, 249200, 225300, 578940, 404211, 263423, 438558, 287272, 165067, 486965, 332224, 253498, 369224, 108604, 165202, 385060, -46054, 88948, 172949, 244417, 314826, 187559, 344099, 30588]
13454A05122m4007N23012j54092A92122K965j2421K12408j4504A52686J76840
13444C29526a7440B46809Q7772A53686a09581M8095D38411B7301a07359C54000
13433A7594P0445K85907r7113K3560r4147L26397p1637F0629J24427M44961k67764
13422C62253A46370L67895E1236K70527H2576J34748j02187f0432B14449b21994
13411a84324l9586C58012a7015A13285Q8544n1039K57387e982E38559k32042i612
13399A70262K55250o3439J88499A91055M2046J06436A59317n6081k8951f3065
13388A04802L05438j29143r9496L0550J45904G5429J50104J03255m8025K71416
13378E52179A60435Q8189q1178R3468P9988F5792L65980m0212J40181A38934L19044
$$ y = [105122, 61115, 584127, 430035, 192122, 195087, 182666, 395074, 380570, 152686, 329526, -17440, 246809, 334581, 153686, -109581, -61486, 438411, 27301, -107359, 354000, 17594, 88039, 373946, 276833, 300393, 206246, 532643, 461006, 60629, 185056, 630017, 362253, 146370, 514265, 51236, 321763, 82576, 217324, 115137, -60432, 214449, -221994, -184324, -223910, 358012, -17015, 113285, 201829, 150790, 408177, -5982, 538559, 306517, -9612, 170262, 425512, 362073, 550572, 191055, 233101, 339537, 159317, 103236, 74285, -63065, 104802, 410240, 281097, 181601, 212151, 358055, 75429, 225533, 328788, 280763, 552179, 160435, 248624, 167446, 260914, 340902, 65792, 431772, 391560, 531741, 138934, 457978]
13367D57978a33183D36017A64309R5114e815A35644b7891B56751L673m9258J23303
13356C34469j48955J15706j09623J4807J63270n6410A0073K8372O7044J25527
13346B31016n1113K35555J40563A66797R3840Q3662o7617c6128C90204j00799
13336B89405r5039D5405J28490J21954A14291M09047o8283B20902p880O4536A07726
13324A50181K63945j97940a24227B57143J11678j0058j5225p2752m598o0403C0964
13312D47877G4809K06634a29278o4704B570O4409R2468C3253g4606E45185A12456
13300F19497g1880F02966B3975L12160d7177j16743j561k4057C03841K2373m7973
13289B78241A25176L3081O1313J91874d6100C08008I6934R7667J14649J04647
$$ y = [457978, -133183, 436017, 164309, 259423, -5815, 135644, -27891, 256751, 260424, 211166, 334469, 185514, 301220, 191597, 206404, 369674, 313264, 10073, 38445, 105489, 231016, 179903, 415458, 556021, 166797, 260637, 344299, 276682, -36128, 390204, 289405, 194366, 45405, 173895, 295849, 114291, 523338, 455055, 220902, 213022, 277558, 107726, 150181, 414126, 216186, -124227, 257143, 368821, 358763, 343538, 270786, 266188, 205785, 30964, 447877, 74809, 281443, -129278, -193982, 2570, 66979, 159447, 33253, -74606, 545185, 112456, 619497, -71880, 602966, 23975, 336135, -47177, -163920, -165481, -189538, 303841, 326214, 278241, 125176, 158257, 219570, 411444, -46100, 308008, 96934, 194601, 309250, 413897]
13279D13897d872j87830C83623a9649R163B51800l5555c17786B58608D6696J11518
13268A58214a28567A11353P3281G7834R48c2652I8289L0175L43659a12506G7980
13256C12716D6653L90938A57137J47015i400C36323E0413a62547A91672h7518
13245D8745J69202c1033A88132q7801P6859C6202J82709P2062O3411E4279a9175
13233F9549c98271B4696K10400E4891j6656g1313C9321d9681n0613k7339B74336
13221D24189j55007A08229N4440o4505a47374D0685J42255b3043q2699B30282
13210A18698J06342c8270a1388E1481K3167P246L04037H7474L3176M5970O0676
13199B27296O5881E8683K81605B9125J83800b1898n6948K802j73283E8660J19066
$$ y = [413897, -4872, -192702, 383623, -19649, -10486, 251800, 216245, -317786, 258608, 46696, 158214, -128567, 111353, 184634, 77834, 78782, -32652, 98289, 128464, 472123, -112506, 77980, 312716, 46653, 437591, 157137, 304152, -9400, 336323, 50413, -162547, 191672, -87518, 48745, 217947, -31033, 188132, 100331, 177190, 36202, 218911, 290973, 354384, 54279, -19175, 69549, -398271, 24696, 235096, 54891, 38235, -71313, 39321, -49681, -100294, -127633, 274336, 424189, 269182, 108229, 162669, 98164, -147374, 40685, 182940, -23043, -105742, 230282, 118698, 225040, -38270, -11388, 51481, 74648, 81894, 385931, 87474, 120650, 166620, 227296, 293177, 58683, 340288, 29125, 212925, -21898, -78846, -76044, -249327, 58660, 177726]
13188A77726J9943d4604A11082J4345a04701B77479j08722a0214I2738e3560D10316
13176C76263A23799L54051j60710F4677L69555c1656B40408m9195a67488P0094
13166i7394A88672D1957n230O8023C363M4446J37966J24886f2042B35469A8268
13154A43810j0907k3025J5009m1385M4422b2960A05858M1988J77141K1883n5047
13143B91823l0095g9849c9242l6591B15625c5892j55059A14590J44700F5340M3690
13132A09030K38634i899A90005J66164A60727b0846G4806Q0754R3969f7322K4805
13121d2517n404l4905K818A24784b156k0834m5394a8961o7465k18862B29035a637
13108A96235f422l978p7938C6664j8078J54151d8637C8282Q1503a92429A5622
$$ y = [177726, 197669, -44604, 111082, 125427, -104701, 277479, 168757, -10214, 92738, -53560, 410316, 376263, 123799, 477850, 317140, 64677, 434232, -31656, 240408, 191213, -167488, -97394, 188672, 41957, 36727, 104750, 3363, 47809, 185775, 310661, -62042, 235469, 18268, 143810, 132903, 109878, 124887, 83502, 127924, -22960, 105858, 147846, 324987, 346870, 291823, 261728, -79849, -39242, -75833, 215625, -35892, -190951, 114590, 259290, 65340, 109030, 347664, -9899, 190005, 356169, 160727, -20846, 74806, 155560, 249529, -67322, -42517, -47921, -82826, -80008, 124784, -2156, -22990, -68384, -18961, -86426, -305288, 229035, -1637, 196235, -6422, -10400, -88338, 36664, 18586, 172737, -48637, 38282, 119785, -192429, 15622]
13096E4069o634J29340J24895j15659a45634G1406Q3096j9159a98327A9018c95412
13084c644F31242k79841c6508C0007O376K81292j49855p106i0789C1530M5866
13073G7396J2987B7009R3078D7810P9489B9315P9777D2696a27936D19102f0041
13061E3463a06829j80758A73079m2464A4723J7475J83918c40589f9106B01096
13050b68256B11340B8778J98591G3174Q5309J63780J75485A81859K44267j27259
13040B98867G2681a780B37480q7225F985e8541B99512r6548d910j57443O8447
13029i3906A81627m7766E1099J22445n8201J56514b16431J07631B84001n8594
13019B25407L8994a23979A47943o8824a14952A09947J5992c7173J4308A08030
$$ y = [54069, 47435, 176775, 301670, 186011, -145634, 71406, 154502, 135343, -198327, 19018, -395412, -3644, 631242, 351401, -36508, 30007, 36383, 317675, 167820, 160714, -90789, 31530, 77396, 90383, 27009, 120087, 47810, 127299, 29315, 109092, 42696, -127936, 419102, -60041, 53463, -106829, -287587, 173079, 130615, 14723, 32198, 216116, -340589, -69106, 201096, -268256, 211340, 28778, 227369, 73174, 158483, 322263, 497748, 181859, 426126, 298867, 72681, -1780, 237480, 150255, 6985, -58541, 299512, 202964, -4910, -162353, -93906, 181627, 133861, 51099, 173544, 115343, 271857, -216431, -108800, 284001, 225407, 264401, -123979, 147943, 79119, -114952, 109947, 125939, -37173, -22865, 108030]
13008A69661a7362B98923E8371K954K46378b99689D1394J45356a21993A23931
12997A55407l576o2195b9144a2952k3950I9752D7051J77589p8488F0084c21432
12985A92386g2140A3222c7208A86098d2327A7035L1750L06366b17172c936k348
12974f284j34506a5574a750r2540Q083j03065C86251i936j29217j9825B7462b8010
12961B25382a87559B78758j27255a4562A44902N1849q0031K50186A1391a22981
12950I3079a31417k6021N2448b9917A98049l3693N8579B3035J15160F1760M0383
12939A02143D669J77026a65913D0177e2772A87725H3365k8736O8034M6971J46718
12928C16352A9102K22744A06717B4235O8792c51610A05682O3354a02341d0147
$$ y = [169661, -17362, 298923, 58371, 61325, 307703, -299689, 41394, 186750, -121993, 123931, 155407, 151831, 89636, -29144, -12952, -36902, 99752, 47051, 224640, 146152, 60084, -321432, 192386, -72140, 13222, -37208, 186098, -42327, 17035, 48785, 355151, -217172, -3936, -6284, -140790, -15574, -1750, -94290, -86207, -189272, 386251, -9936, -139153, -158978, 27462, -28010, 225382, -187559, 278758, 151503, -14562, 144902, 196751, 116720, 366906, 11391, -122981, 93079, -131417, -157438, -104990, -29917, 198049, 164356, 222935, 23035, 138195, 61760, 102143, 4669, 181695, -165913, 40177, -52772, 187725, 83365, 54629, 122663, 169634, 316352, 19102, 241846, 106717, 24235, 93027, -351610, 105682, 169036, -102341, -40147]
12917d5752G5943a42311C29908A61768b65698d1782q0163d2559A36479E3952B3093
12905B44843i048k45771H6690J85476c61982N7591B51661r1414G7150h3153B46621
12893i5969n1477d6578B35300a14058B13224a29092C4124J24102F5551a1849A12311
12881b0167B24440G2833J10046b2298A27619B2323J78456L5269q9261b89017B57483
12869b89813D82336a81945g6921K5902A33513J2378L6179a71894G9067M6752d2183
12857C34866j63761K22070b0362A30240o3903O9632a65114A08808I897J36656
12847A46553N95b53076A1749d03276a54701A73585b24914I2118c39397D68914
12836i080A1920b42525A77730m9849d3150p8602M905A65045c08260A03029K0631
$$ y = [-45752, 75943, -142311, 329908, 161768, -265698, -41782, -121945, -42559, 136479, 53952, 23093, 244843, -9048, -254819, 86690, 272166, -361982, -304391, 251661, 160247, 77150, -83153, 246621, -95969, -147446, -46578, 235300, -114058, 213224, -129092, 34124, 158226, 65551, -11849, 112311, -20167, 224440, 72833, 182879, -22298, 127619, 22323, 200779, 236048, 146787, -289017, 257483, -289813, 482336, -181945, -76921, -51019, 133513, 145891, 182070, -171894, 79067, 125819, -42183, 334866, 171105, 393175, -20362, 130240, 66337, 135969, -165114, 108808, 9897, 146553, 147148, -253076, 11749, -403276, -154701, 173585, -224914, 92118, -339397, 468914, -9080, 11920, -242525, 177730, 127881, -43150, -121752, -116847, 165045, -308260, 103029, 123660]
12825A23660N444E8127a11515d7691j03272M7984B48164b00070j4107B38536C7870
12813a14865C46363h9161j1823A4364J14316d8221k15320C430J54294a54714G7392
12801c4505n918o3344A32916g8711K8858B8828a33660c0129C11213j23616D6055
12789E6553i5691o8199P2972A97339m7207f8989o00b1912j60224A99728i2885
12777A56496L83618a77818H8447h6367b7054E3418j2272b4945j8527p0078C24898
12765F2500k4215b04160J00209B23927a33997B15837h5577A62291a48093A82178
12754A68277D8067J45862E8661e8857B24222E4292h1739q0671A6658O347R3738
12743A16743a78554j20036A78938l6432J18800A05614a70435E4787e8966j25658
$$ y = [123660, 129104, 58127, -111515, -47691, -150963, -102979, 248164, -200070, -214177, 238536, 37870, -114865, 346363, -89161, -100984, 14364, 128680, -48221, -263541, 3430, 157724, -154714, 77392, -34505, -40423, -103767, 132916, -78711, -49853, 28828, -133660, -30129, 311213, 187597, 46055, 56553, -95691, -163890, -90918, 197339, 150132, -68989, -69589, -21912, -182136, 199728, -92885, 156496, 540114, -177818, 88447, -86367, -27054, 53418, 41146, -24945, -43472, -113550, 324898, 62500, 38285, -204160, -103951, 223927, -133997, 215837, -85577, 162291, -148093, 182178, 168277, 48067, 193929, 58661, -58857, 224222, 54292, -81739, -162410, 16658, 23005, 116743, -178554, -298590, 178938, 142506, 261306, 105614, -170435, 54787, -58966, -184624]
12733a84624B10064a95177P6134A94031k2914k3699n3172j0894M137f7780A01215
12721a48427F796M85695a61952k0636r4941A4890R4472a45491I214K77538F4208
12709A78532J6614a17776C63701F5946Q340J81236A04851J79534o6800r2455b30750
12697B25005I3764A7993a11880L6872A21382a02305G6375d04526F6653K28555
12687B95208b94364a3958G3589g1441A72847l213G5993C7335E730Q134P3578B1548
12674a7133F488J52566J35619j16378K31023c5632B20365J6793e57k3862A78876
12662C59303a33051K2354A09984a31225A17532j2107F307L29121j51141o4591
12652A19696J24156D8241b5117D93795B09965a04156A36879a04434a557k81034
$$ y = [-184624, 210064, -195177, -119043, 194031, 171117, 147418, 94246, 83352, 87489, -67780, 101215, -148427, 6796, 492491, -161952, -182588, -277529, 14890, 109362, -145491, 9214, 286752, 64208, 178532, 195146, -117776, 363701, 65946, 74286, 255522, 104851, 284385, 217585, 125130, -230750, 225005, 93764, 17993, -111880, -75008, 121382, -102305, 76375, -404526, 66653, 295208, -294364, -13958, 73589, -71441, 172847, 169634, 75993, 37335, 5730, 13864, 87442, 21548, -17133, 6488, 159054, 294673, 178295, 409318, -35632, 220365, 237158, -557, -24419, 178876, 359303, -133051, -110697, 109984, -131225, 117532, 105425, 6307, 335428, 184287, 119696, 243852, 48241, -25117, 493795, 209965, -104156, 136879, -104434, -1557, -282591]
12642b82591a19454A23308N348M1300a21219A33148a90524B4228a72667k2625
12632a95292B50196r6155d5530G2858a02738D09625a04179B51703j2058b54207
12621b13904B03650n6331K81386A05083i693B55712l9748n1249e8925B33024R5059
12610C28083b90497e5734j05169a619r2434C00294l802e593B0787L7759J58032
12599B16578n0165L04236H6797C5786P2220K5314J40625B7568c1524n0767G1625
12587b3875A98310a22785e4616m9988B30259a7847m0656n2391C13933e38722b31626
12575A42027a42032j30552A32347N5994h7440a1933k39925b6722m1826n1527C7220
12563B89679l850a32013B30883o4061J46082a42739A554b2278n8613A67994J26816
$$ y = [-282591, -119454, 123308, 128656, 169956, -121219, 133148, -190524, 24228, -172667, -195292, 250196, 154041, -45530, 72858, -102738, 409625, -104179, 251703, 239645, -254207, -213904, 203650, 147319, 428705, 105083, -9693, 255712, 215964, 164715, -58925, 233024, 328083, -290497, -55734, -160903, -1619, -94053, 300294, 296492, -5593, 20787, 58546, 216578, 166413, 470649, 86797, 35786, 108006, 133320, 273945, 27568, -31524, -82291, 71625, -23875, 198310, -122785, -54616, -104604, 230259, -17847, -58503, -110894, 313933, -538722, -231626, 142027, -142032, -272584, 132347, 188341, -87440, -11933, -251858, -26722, -68548, -120075, 37220, 289679, 285829, -132013, 230883, 166822, 312904, -142739, 1554, -22278, -80891, 167994, 294810]
12552B94810h3806b7187H3276K09481a932A2284N3014O1151b1835D33687A79800
12540b774r3345L235F5355M892a03720A44459K06610E42L15534a2228j75075A35809
12527G4157J12226a52580F9261l2150a3086A20871a8881B992a14060L8345A0603
12515B18178L5457j18733a72524E2238b05027B12826b81903a3628A80457J27148
12505C07605h5453B7593K31049b08265f6145A62539R1843D3161e6379k52692K2175
12494b86896A93928I6588a43413F6985K43123b01572D1693d14879b03877Q637
12484a95240c4355B04142J01215b6801E3724L327j5941a71083H8907c16981e1818
12472a1080j03839o3189p9424E4382d24054B23795e6837j57949C44376b59440
$$ y = [294810, -83806, -27187, 83276, 292757, -1932, 12284, 65298, 126449, -21835, 433687, 179800, -2774, -96119, -92884, 65355, 70247, -103720, 144459, 351069, 542, 316076, -12228, -187303, 135809, 74157, 186383, -152580, 69261, 37111, -13086, 120871, -18881, 2992, -114060, -75715, 10603, 218178, 253635, 134902, -172524, 52238, -205027, 212826, -281903, -13628, 180457, 307605, -85453, 27593, 258642, -208265, -66145, 162539, 254382, 43161, -56379, -309071, -286896, 193928, 96588, -143413, 66985, 310108, -201572, 41693, -414879, -203877, -195240, -34355, 204142, 305357, -26801, 53724, 57051, 41110, -171083, 88907, -316981, -51818, -11080, -114919, -178108, -257532, 54382, -424054, 223795, -56837, -214786, 344376, -259440]
12461e9615k28175a2786A62532i9528r8875N2579A78576K46759j44973c9421B08424
12449E7878b40025i0656A18239A8423a94188e1553D7722A992R5363l1315c62687
12437A3515Q3708K81060d6484o4132A55825J19614j15020e791H8973a21941k2280
12426a44221D6284a45294j04577d681j2602k27782A52190p3962J02895a24448
12415C06699j51279J12184G5216a46877n2371B9561k930L85230n6597d797l47398
12404c52195B16692D8831J2519J17256a3805I4511L8775a24519A42517J86550
12394C29067h4340o71A21755J93736j08364g9677q0545O891l13811J11004A45154
12382a46555B32916K9997M0129a3797G0247J94680k5506a28603M7079A66084l5468
$$ y = [-59615, -287790, -12786, 162532, -99528, -198403, -145824, 178576, 425335, 280362, -39421, 208424, 57878, -240025, -90656, 118239, 18423, -194188, -51553, 47722, 1992, 97355, 66040, -362687, 13515, 97223, 378283, -46484, -110616, 155825, 275439, 160419, -5791, 88973, -121941, -144221, 46284, -145294, -249871, -4681, -17283, -245065, 152190, 78228, 181123, -124448, 306699, 155420, 267604, 75216, -146877, -199248, 29561, 26631, 411861, 355264, -4797, -352195, 216692, 48831, 61350, 178606, -13805, 94511, 133286, -124519, 142517, 329067, -84340, -85011, 121755, 315491, 207127, -79677, -160222, -153331, -467142, -356138, 145154, -146555, 232916, 262913, 303042, -13797, 70247, 264927, 239421, -128603, -81524, 166084, 130616]
12371A30616a81818k3589q2116f1254l19892a5335A64388n5075a60674A29871
12360a35396j32060B761a07127c980m8509p3047b9333A85058F8071d8435B03173
12348c06249e8853j07357A74527E0554c33200A43986J9840C1737a19525A45390
12337i8412A56798G0837e99k42965g040H6004J43308J2917J31996j64304i9766
12325A8430e0415k9622n3322H6660b26617j00773A0292b0460A71706G3038g0049
12313a7520B18029c75107A84685a24748A8354K13476j3405a61435o7738H3452
12302e0272F1469j5938a67171b4475j18387m4240A22087e6101E049K1163M51324
12291D77536a1976a876k7052A75931m2169a74819f5436A31327O2684J12268I287
$$ y = [130616, -181818, -205407, -287523, -61254, -381146, -15335, 164388, 109313, -160674, 129871, -135396, -267456, 2761, -107127, -3980, -52489, -125536, -29333, 185058, 68071, -48435, 203173, -306249, -58853, -166210, 174527, 50554, -333200, 143986, 163826, 31737, -119525, 145390, -98412, 156798, 70837, -599, -243564, -7040, 86004, 229312, 242229, 374225, 209921, -99766, 18430, -50415, -80037, -133359, 86660, -226617, -327390, 10292, -20460, 171706, 73038, -70049, -17520, 218029, -375107, 184685, -124748, 18354, 231830, 218425, -161435, -229173, 83452, -50272, 61469, 45531, -167171, -24475, -142862, -187102, 122087, -56101, 5049, 26212, 477536, -11976, -1876, -28928, 175931, 133762, -174819, -65436, 131327, 194011, 306279, 9287]
12279e5748I6364P3327Q0997C20K00731j6647J21157C3584L15481h6625C05885
12267a62711K9209f0172B28341k6111d6333E4639P4201l4582j9810B1724P5837
12256I7561n819J22113c32225N6482A95244E78L47332M4082D2004g1635B36660
12244A5721J58030A9726M38098H0058L33270j86083B0234G800J98421M0984A8845
12232C20592A03895K591A5745J14165B8766J12418b6328m7067j42661A58788l4019
12221A24769K00649J01578j92761n3456L0177l3296H1408K92114j55311C1462
12210A56472a31263B5781b96368A49668J66019H6203K62388a01900k22147E88340
12199B11302F0545K16872A12660L02724A11541b7115B64596a444D59625E5527
$$ y = [-55748, 96364, 169691, 250688, 320, 201051, 184404, 305561, 33584, 349065, -86625, 305885, -162711, -133502, -60172, 228341, 202230, -46333, 54639, 128840, 94258, 74448, 21724, 97561, 91742, 213855, -332225, -275743, 195244, 578, 347910, 391992, 42004, -71635, 236660, 15721, 173751, 19726, 457824, 80058, 413328, 227245, 20234, 7800, 206221, 247205, 18845, 320592, 103895, 106486, 15745, 129910, 28766, 141184, -26328, -73395, -216056, 158788, 124769, 325418, 426996, 234235, 180779, 210956, 177660, 81408, 373522, 218211, 31462, 156472, -131263, 25781, -296368, 149668, 315687, 86203, 348591, -101900, -324047, 588340, 211302, 60545, 277417, 112660, 415384, 111541, -27115, 264596, -1444, 459625, 55527]
12188b1990B90204g0545B32954D473K9594Q3147R0507J79802A5883M43265A29083
12176A49154J06776r3561b8125I8350d4318A95458L4211P2145q1851H5036a1029
12164a76836B03441l8592J44709a21607C0289J73529i2011j47337D0662K60332
12154C00994q632A40828I626L08285A41081h7267E5681d074C04361E3578J77768
12143B31346C6245J39934m2173P1523H8192j0294L60258g0266A24393a72753D22052
12131A39960E1433g0914A40400a87399B44089d4702j74397B25503H9663a31106
12120D1394a06587j96348B81219J2647d6072E2827f3184H0512j0784k8403d08704
12108D3294J8510a28881D0863a28344B5680g6724A53018g1A91264G6468a07044
$$ y = [-21990, 290204, -70545, 232954, 4473, 34067, 117214, 207721, 387523, 15883, 459148, 129083, 149154, 255930, 162369, -28125, 98350, -44318, 195458, 229669, 301814, 219963, 85036, -11029, -176836, 203441, 164849, 309558, -121607, 30289, 203818, -92011, -239348, 40662, 300994, 292362, 140828, 9626, 317911, 141081, -87267, 55681, -4074, 304361, 53578, 231346, 36245, 176179, 134006, 205529, 88192, 77898, 438156, -70266, 124393, -172753, 422052, 139960, 51433, -70914, 140400, -187399, 244089, -44702, -219099, 225503, 89663, -131106, 41394, -106587, -302935, 281219, 293866, -46072, 52827, -63184, 80512, 69728, 41325, -408704, 43294, 61804, -128881, 40863, -128344, 25680, -76724, 153018, -71, 191264, 76468, -107044]
12096G270a6760j60958A32143D958b2823l8975C18623e159n4241O880j72778j72201
12084c97499J25771f9189A6918J89210p4910K5984C62J81462O79316J444669j110968
12073A194841l68755A40606O3794H6750L6381n4072L7671a76707I5887c83964
12062A10549b71548A10110b14713C42704a86291n7687C6015a94578R736n642j81593
12051c72077E0708L3396C2861a56614E6394R5508A5736J90892o0519a59047L8655
12040a20392h479A12648c35401e3094C6566C351J52948g052B99394a33909l5743
12029a69652e3428k39510f9329A9317b23524K2592m9596M2887H5903a48732o1466
12018b10198L0059M5885e9908C01657F5481a11780C33683A08853f9835o4559B46343
$$ y = [7270, -16760, -177718, 132143, 4958, -22823, -61798, 318623, -5159, -59400, -52520, -225298, -397499, -271728, -69189, 16918, 206128, 131218, 157202, 362, 181824, 861140, 2305809, 1194841, 826086, 140606, 204400, 86750, 123131, 69059, 106730, -176707, 95887, -383964, 110549, -271548, 110110, -214713, 342704, -186291, -243978, 36015, -194578, -184842, -190484, -372077, 50708, 84104, 32861, -156614, 56394, 151902, 15736, 206628, 146109, -159047, -120392, -8479, 112648, -335401, -53094, 36566, 3351, 156299, -7052, 299394, -133909, -169652, -53428, -292938, -69329, 19317, -223524, -200932, -250528, -207641, 85903, -148732, -210198, -180139, -134254, -59908, 301657, 65481, -111780, 333683, 108853, -69835, -134394, 246343]
12006B4150J55013D9274P422c6124j96321C01476a95187D7971c05776a19974D9155
11994B27394R9554I6109J53129O252a92038d7633j01620H6709a44508C00633i3892
11982a2597q9843j92882m6027B46745n3384n7086a07352q1665e8354A86301b18935
11970b42181C1978E31h5313K2449C7839a5916n7573G5526j6569Q5740a0385C5443
11957a25995K9022C59908a54408D20457b98181A92374K7887C6379a42629b7019
11946A08840j9150K36885a9917k44249a04731A33762a96478A82626C4904k816
11936C2088Q9565h6584a0833A73498b50002A64242b47468C44872M787F8299J39
11925F8438j5815j5011K7089a8273f130B05a7472l3883k87645I2328J17003d26883
$$ y = [24150, 179163, 49274, 56696, -36124, -232445, 301476, -195187, 47971, -305776, -119974, 49155, 227394, 326948, 96109, 249238, 255490, -192038, -47633, -149253, 86709, -144508, 300633, -93892, -12597, -102440, -295322, -341349, 246745, 193361, 136275, -107352, -189017, -58354, 186301, -218935, -242181, 31978, 531, -85313, -62864, 37839, -15916, -73489, 75526, 58957, 144697, -10385, 35443, -125995, -96973, 359908, -154408, 420457, -298181, 192374, 220261, 36379, -142629, -27019, 108840, 89690, 326575, -19917, -264166, -104731, 133762, -196478, 182626, 34904, 32088, 121653, -86584, -10833, 173498, -250002, 164242, -247468, 344872, 349659, 68299, 68438, 52623, 37612, 64701, -18273, -6130, 205, -17472, -51355, -339000, 92328, 209331, -426883]
11912g1123r9143b3863j09342l9349C20151A44020Q4729a72460B12499a02766
11901I3400b4725j6416H1043l0904c08975A42078b28087a11503a5149k08199R2129
11890a31219A73810Q3558a28701B2574d5842A59702g1161b0j0180m3196o0645
11879a14041d4273j1978k8030A34946B9598a15346r2435n5677B87561E5663c44360
11867A81193b02673a6917k53336e5611A76254I24b7587k11172F7357i77l21981
11856c22958J28793F1173a94932r5999f2713n3495M468q1629A94723D7491a46663
11844B04158J17351H8619a04654D2168a29399k53293g7964B67192d2797C03464
11833h2229k25668a19092d8504l51855a85202a3740A2408J12189h6775C82722
$$ y = [-71123, -170266, -23863, -133205, -172554, 320151, 144020, 228749, -172460, 212499, -102766, 93400, -24725, -41141, 81043, 50139, -308975, 142078, -228087, -111503, -15149, -223348, -131219, 173810, 257368, -128701, 22574, -45842, 159702, -71161, -20, -10200, -53396, -114041, -44273, -56251, -84281, 134946, 29598, -115346, -207781, -263458, 287561, 55663, -344360, 181193, -202673, -16917, -270253, -55611, 176254, 924, -27587, -238759, 67357, -977, -322958, -194165, 61173, -194932, -290931, -62713, -116208, -111740, -193369, 194723, 47491, -146663, 204158, 321509, 88619, -104654, 42168, -129399, -382692, -77964, 267192, -42797, 303464, -82229, -307897, -119092, -48504, -400359, -185202, -13740, 12408, 124597, -86775, 382722]
11822c09704c6461A58463c4144j06936A48091A4494d7181k43544A7226a38217
11811D6050d49253a4114l4767g02j51688k91770a38673f4084J9692l8042f304
11799B26080a19235A29123L8715b00846A1095b85986k46960D8351c02966b4100
11788G6854c09933C1202L40495e7015a2713k37852I0865N377c3329B36238D2899
11776B6175J72490q9677a3759C0056b94555J27957l3459k0246E0879b04999j6519
11765b21518F2105a67004A58322a65885j09140B25595k5137O1140n9294A1185
11754B98723b14241L1981p1341a07948K4047A71035a85678m2108j0321B08311
11743A59799F8476B5384a49927f0602E8831h475A29198a26357D271M0287b4411
$$ y = [-309704, -36461, 158463, -34144, -141080, 148091, 14494, -47181, -290725, 17226, -138217, 46050, -449253, -14114, -48881, -702, -152390, -444160, -138673, -64084, -44392, -82434, -6304, 226080, -119235, 129123, 167838, -200846, 11095, -285986, -532946, 48351, -302966, -24100, 76854, -309933, 31202, 371697, -57015, -12713, -250565, 90865, 96242, -33329, 236238, 42899, 26175, 198665, 108988, -13759, 30056, -294555, -166598, -200057, -220303, 50879, -204999, -221518, 62105, -167004, 158322, -165885, -275025, 225595, 200458, 261598, 202304, 11185, 298723, -214241, -182260, -253601, -107948, -83901, 171035, -185678, -227786, -238107, 208311, 159799, 68476, 25384, -149927, -60602, 58831, -8475, 129198, -126357, 4271, 44558, -24411]
11731B00766b65481D3916J87775G8104e0358C9434a39010l1738A97929b32384
11720d4135B1385g3493B88393B0231a38255f5822E2016b70641A72599c07074f214
11708c8991a3775E3033a73335B00107m3091J48098G1727e47347H8581O3892b3868
11696d1592j43493G4679K09130o6608j9687L2400a7501k9752A46182K41680A5930
11684A38338i1210B39944D874J72071H3616b0483A6602K85292j36892a79016M4126
11673a34890B13742G815J9026g247p2019L5356B22062l0697E0793J7394O2114
11662A30301C0996L06459e1895l04211A02488f5092D7047L0354J47172J00954
11652C25527A08431a54697A04917O8416q5195A682N3319P3273D906O1480k1531
$$ y = [200766, -265481, 43916, 231691, 78104, -50358, 39434, -139010, -170748, 197929, -232384, -44135, 21385, -73493, 288393, 20231, -138255, -65822, 52016, -270641, 172599, -307074, -6214, -38991, -13775, 53033, -173335, 200107, 157016, 305114, 71727, -547347, 88581, 152473, -23868, -41592, -185085, 74679, 283809, 217201, 197514, 229914, -17501, -47253, 146182, 387862, 15930, 138338, -91210, 239944, 4874, 176945, 83616, -20483, 16602, 301894, 165002, -179016, -134890, 213742, 7815, 26841, -7247, -79266, -43910, 222062, 191365, 50793, 68187, 130301, 30996, 337455, -51895, -356106, 102488, -65092, 47047, 77401, 224573, 325527, 108431, -154697, 104917, 173333, 88138, 1682, 55001, 128274, 4906, 66386, 44855]
11641D4855b0169D5478K03541L2775a7283D8107L11631j79250a39030C29040C1723
11629A16117N6920i1354A08379m2961A3057K18640r7137b91572a34607q4199A65470
11617A11452h1168j61381a18619j19802j68729A93589d08528a86260b4954N791
11607a9163E3963R7601m5122j9055a07330D8937J24705C2363c7691D5338R1068
11596A36406B2507a27211n8681d4645B49793a68988k1197G1485K95861b7595k5231
11585e2826E1491Q2193a39155m287c3294B84769a67456C05450L638a35277d3955
11573B76283q1470e5747B05413i9576B51461n2984m4241d9764D9657L14745a58371
11561a90286A08691j0531L31571d3805I4693m901P5939g7328B50730n3179C8264
$$ y = [44855, -20169, 45478, 249019, 281794, -17283, 48107, 359738, 180488, -139030, 329040, 31723, 116117, 173037, -91354, 108379, 65418, 13057, 231697, 134560, -291572, -134607, -218806, 165470, 111452, -81168, -242549, -118619, -238421, -407150, 193589, -408528, -186260, -24954, -19163, 53963, 151564, 106442, 87387, -107330, 48937, 173642, 32363, -37691, 45338, 136406, 22507, -127211, -185892, -44645, 249793, -168988, -190185, 71485, 367346, -27595, -52826, 51491, 133684, -139155, -143442, -33294, 284769, -167456, 305450, 309088, -135277, -43955, 276283, 194813, -55747, 205413, -99576, 251461, 198477, 154236, -49764, 49657, 364402, -158371, -190286, 108691, 98160, 429731, -43805, 94693, 89792, 165731, -77328, 250730, 197551, 38264]
11549d6317F8977f5032j7412D1386J09473A7961Q4560q131a56142P0408L1963
11538e3771F0215J46792J28680o5892D1459A1955e6395B38114e3520J3064E3515
11526d2618A53632c558H0333C1607K30693b495C399K83511p1625a07295A33115
11514C80772D8620K33055r1875L20192A08323L73907A25377m0083b1756A78393
11503a4533B22936b7954B58070O698b61176A19678R3438L94942b2075A88985j4635
11492A74350p0496J0307l5594b7291F814J90738h3323k36924J52718P9900A62512
11480B05042J3495a12875B14581J06649B6011a0461I850O4995h6437j66103A75305
11468a46948b8202A9974b0923E05159F0824J00291D5556b3749f581B62958a01011
$$ y = [-46317, 68977, -65032, -82444, 41386, 150859, 17961, 102521, 94390, -156142, -85734, -53771, 60215, 207007, 335687, 269795, 41459, 11955, -56395, 238114, -53520, -40456, 53515, -42618, 153632, -3558, 80333, 31607, 262300, -2495, 3399, 286910, 215285, -107295, 133115, 380772, 48620, 281675, 189800, 509992, 108323, 482230, 125377, 85294, -21756, 178393, -14533, 222936, -27954, 258070, 264768, -261176, 119678, 213116, 608058, -22075, 188985, 174350, 103854, 114161, 78567, -27291, 6814, 197552, -83323, -320247, -167529, -87629, 162512, 205042, 218537, -112875, 214581, 321230, 26011, -10461, 9850, 74845, -86437, -252540, 175305, -146948, -28202, 19974, -20923, 505159, 60824, 161115, 45556, -23749, -6581, 262958, -101011]
11456a71687c1304A7686J48331h712C46641E2123J37994E255L51978j61964L18010
11445E13279H8933a44205A04578P2400a02456C96428D2865J85388a4998C44622
11434d2843A03339d3694B03898a81321H3047a03747A61222b3836j65906a1152
11423a72433B86987m8447G2089K8669L35338A39184K89149f3075q0672A44028
11412i9543I5752b81342G1635i8738B36670K692I8038b2948A41673g4713A87685
11400D29967A22915o1201J51058a10095n9443A69198F1537L5004K04580c16088
11389b88954H489N5474c79685d5895l58588G6849J34819E8460K44021A32845A1853
11377C04890b62584F0135K5172N9613b1048B25886q5308n1245J74529J57441e98388
$$ y = [-171687, -31304, 17686, 166017, -8712, 346641, 52123, 190117, 5255, 357233, 195269, 513279, 88933, -144205, 104578, 176978, -102456, 396428, 42865, 228253, -14998, 344622, -42843, 103339, -43694, 203898, -181321, 83047, -103747, 161222, -23836, -189742, -11152, -172433, 286987, 238540, 72089, 100758, 436096, 139184, 428333, -63075, -143747, 144028, -99543, 95752, -281342, 71635, -98738, 236670, 239362, 98038, -22948, 141673, -74713, 187685, 429967, 122915, 61714, 212772, -110095, -169538, 169198, 61537, 96541, 301121, -316088, -288954, 8489, 63963, -379685, -45895, -404483, 76849, 211668, 58460, 302481, 132845, 11853, 304890, -262584, 60135, 85307, 144920, -21048, 225886, 140578, 89333, 263862, 421303, -598388]
11365C05545C7199L9585J55787a70077I9925a37164C90904b48495e5358A1018
11354B98181e2842n164J7641C4760J89216c2213H5063B2704P4627l9935L0551
11343H7947h5547E8836B3635K0367j9946h3004e901l3714A16227h3859A22324
11331B34194a03628l3668B96515c67561A40129h3391I8198b07174d1567k20623
11321b62190j04816a14624M3908c2095m06872a79893B63501D6168g626A54382
11310a64679f2775B0319c9206k05795B13654a68864D6835j9768b17638i5446I0970
11298d16342a67030h364k49970f1770l2814j47841D8623J3203K48748d8312A01168
11286A48134g3587K6301H2539L865b16039P2488j01974h0823A72091b19995G9152
$$ y = [305545, 37199, 76784, 232571, -170077, 99925, -137164, 390904, -248495, -55358, 11018, 298181, -52842, -58006, -40365, 34760, 223976, -32213, 85063, 22704, 97331, 57396, 87947, -85547, 58836, 23635, 44002, 24056, -83004, -5901, -39615, 116227, -83859, 122324, 234194, -103628, -137296, 296515, -367561, 140129, -83391, 98198, -207174, -41567, -262190, -367006, -114624, -70716, -32095, -438967, -179893, 263501, 46168, -7626, 154382, -164679, -62775, 20319, -39206, -245001, 213654, -168864, 46835, 27067, -217638, -95446, 90970, -416342, -167030, -8364, -258334, -61770, -94584, -242425, 48623, 61826, 310574, -48312, 101168, 148134, -73587, -47286, 82539, 86404, -216039, -143551, -245525, -80823, 172091, -219995, 79152]
11274b7668k42317B24366b5382a2141j80893O2801B01772a02970A29341d7627
11263i0648B43123a40767A60755c0815I9852a68018A20319K25260H5892a02052
11252A74308e6887o7342A10774b50369B53524i0594A42874k4454f2767b1385B34343
11240B29249b98469h8846D6507J8632J29970H0830c16282Q518A574a28039E488
11228a35974F5544j1525J46491a54110A6101a59085Q429F3601C0706b0182A47075
11216a38732O1045P320G5458i5218B11862c04641c9887h854j18208b5821D3657
11204b9775j33319A47364L953L5336b24163E8615a95241B50001A1529b980C73366
11192b2416B9900J61888c51913a10119n2893A94280b5787R196j1556j65743k05092
$$ y = [-27668, -269985, 224366, -25382, -12141, -193034, -130233, 201772, -102970, 129341, -47627, -90648, 243123, -140767, 160755, -30815, 99852, -168018, 120319, 345579, 85892, -102052, 174308, -56887, -124229, 110774, -250369, 253524, -90594, 142874, 118420, -62767, -21385, 234343, 229249, -298469, -88846, 46507, 65139, 195109, 80830, -316282, -307764, 1574, -128039, 5488, -135974, 65544, 54019, 200510, -154110, 16101, -159085, -150656, 63601, 30706, -20182, 147075, -138732, -77687, -70367, 75458, -95218, 211862, -304641, -39887, -8854, -127062, -25821, 43657, -29775, -163094, 147364, 151317, 186653, -224163, 58615, -195241, 250001, 11529, -2980, 373366, -22416, 29900, 191788, -351913, -110119, -163012, 194280, -25787, -16591, -28147, -193890, -398982]
11181c98982J77733A19401c9175p2836B44151D7814K95089j49528a04254a6376
11170f5740j36448B19504E9491a46514A2032d0381q7541A5631b75282N4142C42954
11158a13660H1312g7359B2944K92733e5790l33717F3067a54559n6100C97472c90352
11146E807a012A0581L14938a03920K2743j12587O6736J4823K2302A96666a7925
11134B59330r0200M9906a54374G0432K94847a60350N9254k13235B76192g0365
11123A12242m3641J05737i0588A47770K1190E8168b20133B31899f3986H1929K48146
11112C30075A03933o516i4240G4461K26050A28674m8303g8036c2323A56902e6372
11100C24064j58477K5170n1894B3976Q5466R9600J60439A79176F9780J52739A3440
$$ y = [-398982, -221249, 119401, -39175, -112011, 244151, 47814, 342903, 193375, -104254, -16376, -65740, -202188, 219504, 59491, -146514, 12032, -40381, -127922, 15631, -275282, -221140, 342954, -113660, 81312, -77359, 22944, 315677, -55790, -389507, 63067, -154559, -210659, 397472, -390352, 5807, -1012, 10581, 325519, -103920, -81177, -193764, -127028, -112205, -89903, 196666, -17925, 259330, 169130, 219036, -154374, 70432, 365279, -160350, -101096, -314331, 276192, -70365, 112242, 68601, 174338, -90588, 147770, 168960, 58168, -220133, 231899, -63986, 81929, 330075, 103933, 97417, -94240, 74461, 300511, 128674, 80371, -78036, -32323, 156902, -56372, 324064, 165587, 190757, 138863, 23976, 109442, 209042, 369481, 179176, 69780, 222519, 13440]
11088C53769j53828m4445E3840K27408j1079L9813j46244l8195Q4256J80871M50536
11077H41206B73865J50391j26200M0569j50338K45421j52304a46945e7733q1519
11067a39252B13904K83764J97372j09658B11667L71135J73080l73867Q3037L6123
11057E01175M0513J46660l5411j95696L50354j28742j7000J00060K67816k33462
11047G96267j31801j77318Q5953K62489l20554J34193P2445R2127m9229k55316
11037E09256M77875m36905L31291k41601j5507o5932k3369j54005j25152P20066
11027I76017l46084O8860p7284R9949j80916j73093J18072K28797m5876L19664
11017I88106k02905j29726k3818M34542C71810K91374l17178L11424B53956N22408
$$ y = [353769, 199941, 155496, 53840, 281248, 270169, 309982, 163738, 125543, 209799, 390670, 841206, 273865, 424256, 298056, 338625, 188287, 433708, 281404, -146945, -57733, -139252, 213904, 497668, 695040, 585382, 211667, 582802, 755882, 382015, 465052, 501175, 541688, 688348, 652937, 457241, 807595, 678853, 661853, 761913, 1029729, 796267, 664466, 487148, 573101, 835590, 515036, 649229, 721674, 813801, 764572, 509256, 987131, 550226, 881517, 639916, 624409, 558477, 535108, 381103, 255951, 976017, 629933, 698793, 621509, 721458, 540542, 367449, 485521, 714318, 668442, 988106, 785201, 655475, 631657, 1066199, 371810, 663184, 346006, 657430, 253956, 776364]
11007G76364l74736J71108j86846J40982J85213j59554Q1703J18695l9406J65629
10997H79152j76489o3997J70491j98613k59153N9635L31033J28275K40930k38546
10987H72718k04602L87298l3732j01300M8430J51300K29136l47459L25854L63295
10977A690938j21228L88101K17372Q1454L99758P5987k68666L46349p7698k52722
10967B479645j58162j59296n19810j72356L32806k11435r2448j53257K92392K2030
10957A660109K77023m54948L60081l05970j8635k65245k32990O9417j96783n4975
10947H37084j15202k55835j49512P6249r9047K39010A14416k2962K35824L7346
10937C64624K3682A16727n5305a5956k2901C5143L08610b2123B4149J82182c8596
$$ y = [776364, 401628, 572736, 385890, 526872, 712085, 552531, 634234, 752929, 713523, 879152, 702663, 638666, 809157, 610544, 351391, 411026, 742059, 870334, 1111264, 872718, 668116, 1055414, 1021682, 920382, 968812, 1120112, 1349248, 1001789, 1327643, 1690938, 1569710, 1957811, 2175183, 2256637, 2656395, 2732382, 2463716, 2810065, 2732367, 2479645, 2321483, 2162187, 1642377, 1470021, 1802827, 1591392, 1498944, 1345687, 1638079, 1660109, 1937132, 1482184, 1842265, 1536295, 1517660, 1252415, 1019425, 1088842, 892059, 837084, 721882, 466047, 316535, 392784, 293737, 532747, 114416, 91454, 327278, 364624, 388306, 116727, 61422, -15956, -38857, 35143, 343753, -22123, 24149, 206331, -38596]
10925b27210A4334a49032C80142d6335l3193c0283G0816c06519H0354b32633k87986
10914e20619b42754A68792l1651b73891j38034c5958A34335N6329G2173a55368
10903a40012j14823F185g122n3286b9j34232j35292R2017n019A6395b45982F0687
10890a43600b5386k30443A3163e62545A01261B3672L8769J53013h1581a7258M405
10879a2853j8693j34692A7777K64227a22073a2549B78164A07190D4157b15814
10868b24367E2200p986a6230A46511N1925C2959a68674G4084d6101p6665m0457
10857a63223O3956A37941F912a90679e4851F1189d9869C8341g8762k55923F4379
10845g9882C8606L5609a91583K0563A42424J27323B0218b5106A78672f3957B5383
$$ y = [-227210, 14334, -149032, 380142, -46335, -79528, -30283, 70816, -306519, 80354, -232633, -520619, -242754, 168792, 137141, -273891, -411925, -35958, 134335, 190664, 72173, -155368, -140012, -254835, 6185, -7122, -60408, -29, -134261, -269553, -177536, -182555, 16395, -245982, 60687, -143600, -25386, -255829, 13163, -562545, 101261, 23672, 62441, 215454, -81581, -17258, -12853, -31546, -166238, 17777, 282004, -122073, -12549, 278164, 107190, 44157, -215814, -224367, 52200, 44214, -16230, 146511, 198436, 32959, -168674, 74084, -46101, -122766, -163223, -99267, 137941, 6912, -190679, -54851, 61189, -49869, 38341, -78762, -334685, 64379, -79882, 38606, 74215, -191583, -171020, 142424, 269747, 20218, -25106, 178672, -63957, 25383]
10833a27353B9490J2886a49990K6750o0257h9047j49710D0106b724j76904A93823
10821d3464m2984j65705A29894h2250j11694D5725b1445D5936R9967K2711B8585
10809A20510P3700g0980B35751A6810g4281A22200a85131D3964Q0630C1227D684
10797A33093L1130E2069j1314b01402j5032d2629J4435B4980b248C45149E2562
10785c16837N0185j29384g733j63893C6448d7934k41672a17314o322K6792j7061
10774a13905M1593A4183c5826k9746j12479g0335k21334j17797c3970D536h9503
10762A05417b37716A00730c86678I6768b88710A10743n3849c44307C14493a22804
10751I2379M926J60779a01384A81154p9661b96478H6661R3012e6131m358k7134
$$ y = [-127353, 29490, 42376, -149990, -123240, -183497, -89047, -238757, 40106, -2724, -179628, 193823, -43464, -86448, -252153, 129894, -82250, -193944, 45725, -21445, 45936, 145903, 168614, 28585, 120510, 194210, -70980, 235751, 16810, -74281, 122200, -185131, 43964, 124594, 31227, 4684, 133093, 164223, 52069, 40755, -201402, -216434, -42629, -28194, 24980, -2248, 345149, 52562, -316837, -266652, -396036, -7733, -171626, 36448, -47934, -289606, -117314, -123636, -96844, -113905, -72312, 14183, -35826, -65572, -178051, -70335, -291669, -409466, -33970, 4536, -89503, 105417, -237716, 100730, -386678, 96768, -288710, 110743, 56894, -344307, 314493, -122804, 92379, 97305, 258084, -101384, 181154, 101493, -296478, 86661, 179673, -56131, -60489, -87623]
10740h7623B88995d702j5265A758d3314G0366f8568K9579G4705k7547L76557b25913
10727b94488g7400m7309q62N7204j69326e5315J6216j46252h0176A59238r727
10716A49511a35863j56804B61960D0361K61415j32030M4537a84125D6457J09339
10706A55796g9407A78970a86228d6848J8671l6130k10300J28227B01234c06693
10695I3415J7231a44539j95956c7437k0819j41302h097G6224O0844b9971E5734
10683a02316j51990J16637n9948C3023L06351a13838j30688C3772h2053L0037
10673e2016F2875P1115b04621r4475A16755a36890j23113A4769b01684B3411K4154
10662D7565L12776a34798K8830j20031f7201r753A96252d2992j94623h4287D9301
$$ y = [-87623, 288995, -4702, -19967, 1758, -43314, 70366, -68568, -38989, 74705, 47158, 423715, -225913, -294488, -77400, -124709, -125571, -68367, -237693, -55315, -39099, -185351, -80176, 159238, 149511, -135863, -292667, 261960, 40361, 301776, 169746, 214283, -184125, 46457, 155796, -79407, 178970, -186228, -46848, -28177, -64307, -274607, -146380, 201234, -306693, 93415, 110646, -144539, -340495, -37437, -58256, -199558, -8097, 76224, 137068, -29971, 55734, -102316, -254306, -137669, -197617, 33023, 339374, -113838, -244526, 33772, -82053, -52016, 62875, 133990, -204621, -299096, 116755, -136890, -260003, 14769, -201684, 23411, 47565, 360341, -134798, -105968, -225999, -67201, -76954, 196252, -42992, -237615, -84287, 49301]
10650A68524a8053m43414a68145L5468n72L7613q5461A65640K9209b41465A7808
10638d41054A66202i8228M5926A58472k4858g8526C6636b51194i3429n4277l19042
10627d66748K02992H8836c4314B17045b7523B46515a24163A04767A3850g1079
10616a0573k51587H2394a16682j45308i0582j41736i9095C2308i2339A33789a19117
10604D2006c24308B13523e8715E2005Q640b28172A54816E6442c08341a31331a7907
10592b50054a1006E055a63037B83596B9310c234A19932J81919b02999K7125j4393
10581a90267a147l7458k43382j32570e9446H135g7058j90541J28669D8035b48239
10569b6129A94660G7425i1790j42784P6203f3212r1554I0358i4308j5700o3581
$$ y = [168524, -18053, -461467, -168145, -132677, -133249, -95636, -181097, 165640, 194849, -241465, 17808, -441054, 166202, -98228, -52302, 158472, 133614, -78526, 36636, -251194, -93429, -147706, -466748, -263756, 88836, -34314, 217045, -27523, 246515, -124163, 104767, 13850, -71079, -10573, -262160, 82394, -116682, -261990, -90582, -232318, -99095, 32308, -92339, 133789, -119117, 42006, -324308, 213523, -58715, 52005, 60645, -228172, 154816, 56442, -308341, -131331, -17907, -250054, -11006, 5055, -163037, 283596, 29310, -3234, 119932, 301851, -202999, -175874, -190267, -1147, -38605, -281987, -414557, -59446, 8135, -77058, -267599, -138930, 48035, -248239, -26129, 194660, 77425, -91790, -234574, -158371, -63212, -154766, 90358, -94308, -110008, -173589]
10558a73589p8025f2218B15170c18743D4945i6471a7177k51064a16115j80203
10548b96318H7963q005I495J7749J64354e1505l4608A53712o7474c368C17298
10536h2426j44798A58837g8705j17339B1892J58147G4277f3819K6452A00827b6623
10524c49235C61014C5471j1221b97434A01887b23039A59403b02672I6639j6124
10514H0515f410I0817a51343n6332a108j9549j60255D9278g0623o1619d6000A50837
10501D1250J54299a48466j65889J30846j87283a69170O6751j64768q045c8224
10490a07640I6512J12985j769j02779b4676E730K12538k9054J37717o5584K89491
10479E50838m2857l5162k09166n8118o4333m6418J58273R3694j11888i6852B34076
$$ y = [-173589, -251614, -62218, 215170, -318743, 44945, -96471, -17177, -268241, -116115, -296318, 87963, 79958, 9495, 27244, 191598, -51505, -86113, 153712, 86238, -3368, 317298, -82426, -227224, 158837, -78705, -196044, 21892, 180039, 74277, -63819, -37367, 100827, -26623, -349235, 361014, 35471, 24250, -297434, 101887, -223039, 159403, -202672, 96639, 80515, -6410, 90817, -151343, -207675, -1108, -20657, -180912, 49278, -70623, -132242, -46000, 150837, 41250, 195549, -148466, -314355, -183509, -370792, -169170, -102419, -267187, -275232, -38224, -107640, 96512, 209497, 207728, 104949, -24676, 5730, 218268, 189214, 326931, 261347, 550838, 507981, 472819, 263653, 205535, 141202, 94784, 253057, 346751, 234863, -96852, 234076]
10467a77523M1922D8878E697a61382d3059A86489g9348l5254n0239B60492N3320
10456C13812A04484K15901A35979c25753a05859j19349E004c31322a12697B7268
10445A35140K01260C5538g9772c4844j04892j19918B90351b70600a05509e453
10434a98905b4570o0125A4403K1370J28797b8010j32891B26968b06258e0136q2526
10423a32662k02844N1672c3110j7351r6775j04346E4883a4802m97527C6474d0377
10411A00405a5003j9881I4769a0140A88037A648a0502B86235d6390E753d64513
10399A2106M1184J18415J7659p3847c8392B45332F6634K96544G4250J06956M4989
10388B26195b61057A38250a00277E7139J45147a1387B32945n7680K91921C0070
$$ y = [-177523, -135601, 48878, 5697, -161382, -43059, 186489, -79348, -114602, -164841, 260492, 313812, 104484, 320385, 135979, -325753, -105859, -225208, 5004, -331322, -112697, 27268, 135140, 336400, 35538, -79772, -34844, -139736, -259654, 290351, -270600, -105509, -5453, -198905, -24570, -84695, 14403, 35773, 164570, -28010, -160901, 226968, -206258, -50136, -132662, -335506, -283834, -33110, -50461, -147236, -251582, 54883, -14802, -512329, 36474, -40377, 100405, -15003, -34884, 94769, -10140, 188037, 1648, -10502, 286235, -46390, 5753, -464513, 12106, 53290, 171705, 189364, 115517, -38392, 245332, 66634, 363178, 74250, 181206, 226195, -261057, 138250, -100277, 57139, 202286, -11387, 232945, 175265, 467186, 30070]
10377A27211P2352m6271L23968j24893C3995R123K16503r8662J36561K42714J43497
10366F83731j94935M9325A36183a29705C52978O314M0885A3139K07891K0678A0662
10354B98029J47900A33767K32333K12793k16761J7775J24139B15954h867B67902
10343E58531B75776K19531A00138l078J23577k5143K5068I3367n277c8942B63730
10331H3484a90613Q4243A35121P2320I5089f2467C23183p4760a34296C83316o5648
10320C17668A09282K07433j56898e4619F8241g5210B10346N0375a01385D58188
10309a4819D5486h91j751B42808j18963e1669D6848b9670m0058l9479B3463a02832
10296G402e4136k50824a13657E7088L09257e069l83606a59809B10734d37133a922
$$ y = [127211, 199563, 153292, 477260, 352367, 33995, 43118, 259621, 160959, 297520, 540234, 683731, 488796, 538121, 136183, -129705, 352978, 359292, 400177, 13139, 221030, 241708, 10662, 298029, 445929, 133767, 366100, 578893, 362132, 379907, 504046, 215954, -8867, 267902, 558531, 275776, 495307, 100138, 97060, 220637, 195494, 220562, 93367, 88090, -38942, 263730, 83484, -190613, -106370, 135121, 207441, 95089, -62467, 323183, 248423, -134296, 383316, 317668, 109282, 316715, 159817, -54619, 68241, -75210, 210346, 260721, -101385, 458188, -14819, 45486, -891, -2642, 242808, 123845, -51669, 46848, -29670, -69728, -109207, 23463, -102832, 7402, -54136, -304960, -113657, 57088, 366345, -5069, -388675, -159809, 210734, -437133, -1922]
10284a5975k33213e365C98385A71979n2062g3257A31287a48439F2362P1545b89012
10272a83033A6919b21636Q1592k26273B05540F6859g8197C3918K97761I3373K99879
10261C93252A66258G8b5172C06077j0441A22877A70b52573j2025a31547A16363
10249g4362Q599k61788A03447n0406b16804B625Q6856c24850A67351c2332A26623
10237a03669J9756b1873j23321A41383J86409b4317A2644a33393b09H8137a52629
10225b38224A5223f4845B46276A5021c15991F5190a82764C0055b45580Q8999g4108
10213d8934B35436J0835B5094K40342c05642f1225j78096E5681i8011K5098B64037
10201b14047R1590C0996Q4519a47345B09190b8755j7064o0849l15092g152j01528
$$ y = [-15975, -249188, -5365, 398385, 171979, 119917, -73257, 131287, -148439, 62362, 133907, -289012, -183033, 16919, -221636, -140044, -366317, 205540, 66859, -78197, 33918, 331679, 93373, 393252, 166258, 78, -25172, 306077, 295636, 122877, 170, -252573, -264598, -131547, 116363, -74362, -65763, -327551, 103447, 53041, -216804, 2625, 89481, -324850, 167351, -32332, 126623, -103669, -83913, -21873, -145194, 141383, 327792, -24317, 12644, -133393, -209, 88137, -152629, -238224, 15223, -64845, 246276, 15021, -315991, 65190, -182764, 30055, -245580, -156581, -74108, -48934, 235436, 246271, 25094, 265436, -305642, -61225, -239321, 55681, -98011, -72913, 264037, -214047, -122457, 30996, 115515, -147345, 209190, -28755, -45819, -106668, -421760, -7152, -108680]
10190a08680j5967K9478n2892A89960J06580a33487J4364a5107k51207o7982I107
10178A80037F4337a80658K4754A47189E4680c00339K6167J27079H1964a35128
10167b0240A1414J33738a88262C05f158m48359a29482j12554d5202j61754j62258
10156c69214G0213b31754B05441a59142r1163E4074h6568n0605A53920L1303A7496
10144f6957k85876J48258D27255b89403E7083g2693A41620b62890a21569A33459
10133d025j58270B6425d6985r379C93867f452B0102O3192e247j04028B3508K85531
10121C09039D146J56938b27850Q9360N0105A62335a24765j45340q5870a22505
10110c13670B15750Q8867l2185D6154M6000O7727g6722k21667N1428M732i7011
$$ y = [-108680, -124647, -95169, -148061, 189960, 296540, -133487, -119123, -15107, -266314, -334296, 9107, 180037, 64337, -180658, -155904, 147189, 54680, -300339, -274172, -147093, 81964, -135128, -20240, 11414, 145152, -188262, 305, -6158, -454517, -129482, -242036, -45202, -206956, -369214, 70213, -231754, 205441, -159142, -250305, 54074, -86568, -137173, 153920, 185223, 17496, -66957, -352833, -204575, 427255, -289403, 57083, -72693, 141620, -262890, -121569, 133459, -4025, -162295, 26425, -46985, -56364, 393867, -6452, 20102, 83294, -5247, -109275, 23508, 309039, 4146, 161084, -227850, -138490, -88385, 162335, -124765, -270105, -355975, -122505, -313670, 215750, 304617, 272432, 46154, 92154, 159881, -76722, -298389, -246961, -242229, -97011]
10098i6539k3863B14575a71997j58938J27978R0872E8330R7296a39886d0010j79352
10087b19362D5017P9167A2674a02652j01875E0278a89993i109D8681a06649P632
10076i9017B28452E200d1371B59344h5918m02432J66773a1121j13312A27923j9086
10065A08837b01033G3664a56563A41142A0851b14291b4307l2243I4924b11540
10054D8491b26558b3981B0659e5322j41687M3517d781j56745A02302A9704K5297
10043D5001b67885A9782a24981C4182a83257A00120D2068a55073D27023b38697
10032C0091a60685o9762J02583b1455m5373l2796A31866Q8418p5188d1025q0558
10021a21583j649M070J5351k557C9274b6569j91000Q9142F0100J26448R632a11670
$$ y = [-96539, -120402, 214575, -171997, -330935, -202957, -112085, 58330, 155626, -139886, -40010, -219362, 45017, 124184, 12674, -102652, -204527, 50278, -189993, -9109, 48681, -106649, -99017, 228452, 5200, -41371, 259344, -85918, -488350, -321577, -11121, -124433, 127923, 108837, -201033, 73664, -156563, 141142, 10851, -214291, -24307, -56550, 94924, -211540, 48491, -226558, -23981, 20659, -55322, -197009, -153492, -4781, -161526, 102302, 19704, 45001, -267885, 19782, -124981, 34182, -183257, 100120, 42068, -155073, 427023, -238697, 30091, -160685, -230447, -127864, -21455, -66828, -99624, 131866, 220284, 145096, -41025, -121583, -123232, -119162, -103811, -106368, 39274, -26569, -217569, -128427, 60100, 186548, 196180, -111670]
10008i7959K3357j8751C9106J4582R2014a95370G9682i3325k4276j1703J2041
9997a17263B3674b67580B72876b03922k51883i3736G0874c32860G0927a86246
9986a28116A84453a61492A5035K11429c7901C3692m147b7069k6561I5922D7753
9974f629j43760g3277k45438e2269c432E7656B5420J14767m155n1489K6980k1714
9962H9809K30511r0517F9854P8558c84307a28189k19535A12742a23318q1676h7950
9950A38911a46588b364q9316o0353k02364J26795a08030p3283h7077A85520H7599
9938a33323k11641d5741D7673j5059d3527j65741M1460A72493B463c1236k18942
9927b50178A25267c87799j16423f4474m0316J4703A69317b14301c7451l14958
$$ y = [-97959, -74602, -93353, 39106, 53688, 145702, -195370, 79682, -93325, -117601, -129304, -117263, 23674, -267580, 272876, -203922, -455805, -93736, 70874, -332860, 70927, -186246, -128116, 184453, -161492, 15035, 226464, -37901, 33692, 29545, -27069, -53630, 95922, 47753, -6629, -150389, -73277, -318715, -52269, -3432, 57656, 25420, 140187, 136032, 84543, 111523, 89809, 320320, 229803, 69854, 148412, -384307, -128189, -347724, 112742, -123318, -204994, -87950, 138911, -146588, -2364, -91680, -152033, -354397, -227602, -108030, -181313, -87077, 185520, 87599, -133323, -344964, -45741, 47673, 32614, -43527, -209268, -167808, 172493, 2463, -31236, -250178, 125267, -387799, -504222, -64474, -104790, -90087, 169317, -214301, -37451, -352409]
9917c52409H5402b68302F6228M5340a0043k87565N6214a7973j21134C5874a82627
9905i4715j77010E8741i2094b5779F3462a61462n3315C9692J42392c07683e9675
9893a15086B50539A19494f7684l15103A6337b08803M3306O3051A10767c16805
9882a766A61880K06767C2628d6286o4946K766d6984k08273l3425O3892J03375
9871a21415k25051a28463N9201d965j48799B15218b67504A61177a5177B86928
9860d1421q5423B08560g262j85654o388O9183H0473a6356m95558a52308a2280
9848E3068b14949a03462C3134J25024e1344n0543q0253h7287I5985h5693p0835
9837a56528A61711A0011Q836a5547j80934M6138k18329a79791E627a02597d2778
$$ y = [-352409, 85402, -268302, 66228, 111568, -10043, -297608, -241394, -17973, -139107, 35874, -182627, -94715, -271725, 58741, -92094, -25779, 63462, -161462, -214777, 39692, 182084, -307683, -59675, -115086, 250539, 119494, -67684, -382787, 16337, -208803, -165497, -102446, 110767, -316805, -1766, 161880, 368647, 32628, -46286, -111232, -108466, -46984, -255257, -288682, -224790, -121415, -346466, -128463, -69262, -4965, -153764, 215218, -267504, 161177, -15177, 286928, -41421, -126844, 208560, -7262, -192916, -199304, -130121, 80473, -16356, -511914, -152308, -12280, 53068, -214949, -103462, 33134, 158158, -51344, -101887, -182140, -87287, 95985, -85693, -156528, 161711, 10011, 18847, -15547, -196481, -150343, -368672, -179791, 5627, -102597, -42778]
9825D2789K9724f4381j14958A19549d92907f4967j64867A73084B3032K5321k2254
9814B6099c72895A08104J26431A1861b97634a15903J9036J7619j25016r5662B8627
9802c4357k1355j28835A07097b40769R8880j89434D0539b51484q4259A7987d59131
9790a42593l75014a3167m95361H5315a56318k27051a13861A41636b0516B17454
9779I4262k17a1708j88701o2716B99990c09594g7790k02365E5629c29262a42990
9767a26118k11563b6573e480N69D1420K286j2921b02010o0509B042a00255M7938
9755e2317a4586j62244P8006B06729d39389h6641k9178A42377b86527A12224D6339
9743d746l1530q0260A05007b04631k10661a3184A2017J04429b08084b9701k64615
$$ y = [42789, 72513, -64381, -179339, 119549, -492907, -64967, -229834, 173084, 23032, 48353, 26099, -372895, 108104, 234535, 11861, -297634, -115903, -96867, -79248, -204264, -299926, 28627, -34357, -55712, -184547, 107097, -240769, -141889, -331323, 40539, -251484, -335743, 17987, -459131, -142593, -517607, -13167, -508528, 85315, -156318, -383369, -113861, 141636, -20516, 217454, 94262, 94045, -11708, -200409, -263125, 299990, -309594, -77790, -280155, 55629, -329262, -142990, -126118, -337681, -26573, -5480, -4911, 41420, 43706, 30785, -202010, -262519, 2042, -100255, -52317, -14586, -176830, -98824, 206729, -439389, -86641, -115819, 142377, -286527, 112224, 46339, -4746, -36276, -116536, 105007, -204631, -415292, -13184, 12017, 116446, -208084, -29701, -294316]
9732b94316P6251o1215d5015l8152p2050O0199k09808k6347B81405c08436M923
9721c03513B03435a67444j8556l0697b5632A55430J01084J51985a36937K4228
9711a12709E5715a10516j87180B03376a19486k07682i8683A24786b3711j33134
9701a56845A17497J19541B8356b37223n0588N3583B17357c27869g3556l6165A8533
9689C69078i8839r696c6400A79772D3977b508k28483n7470A0038N0815a53984
9677A47866m3299C4889b56995g370I3103b50305B36903g5900A24099A4c00251
9665d14274A5376d0200j24386L8307B5058g2022A00944h0280j88817A81140g5616
9653b58156H7356g9547D8702J172g2997a5599r9925B36831c399q0309k70924g423
$$ y = [-294316, -218065, -279280, -45015, -83167, -155217, -95018, -304826, -331173, 281405, -308436, -303513, 203435, -167444, -186000, -216697, -25632, 155430, 256514, 408499, -136937, -112709, 55715, -110516, -297696, 203376, -119486, -327168, -98683, 124786, -23711, -156845, 117497, 237038, 28356, -237223, -287811, -234228, 217357, -327869, -73556, -109721, 18533, 369078, -98839, -108535, -36400, 179772, 43977, -2508, -230991, -288461, 10038, 60853, -153984, 147866, 104567, 34889, -256995, -7370, 93103, -250305, 236903, -75900, 124099, 14, -300251, -414274, 15376, -40200, -164586, -126279, 25058, -72022, 100944, -80280, -269097, 181140, -75616, -258156, 87356, -79547, 48702, 49874, -72997, -15599, -115524, 236831, -3399, -83708, -354632, -7423]
9640a53999L5171k65447a34194A70077b23686A21258f8134o3349j48409h7408
9629c10621B99729a40271N9808l89370a89585Q0224H1543A7321d6137D2945d5792
9617b32139E5612d13895a80175j10470B33416h2267K115j29979h3271F1112f2108
9605B3621J28481p3469N374g8238o8835A7858b60056j75143c0910A9532J53510
9594A73042I599a58437a418k53942e4782b6367D6486a13849k10256A45332b28181
9582a0370l57772a72458N0242c8067j55664j59765c1227A47865g0609A88859b37970
9570I2771b87418Q9480h5656A91793C2628K4294b21215g2391D0941K68330b76172
9558c25082A12714d233j78832j50731D6526c09508A7195J84522H8899b77217h7991
$$ y = [-153999, -118828, -384275, -134194, 170077, -223686, 121258, -68134, -131483, -279892, -87408, -310621, 299729, -140271, -80463, -469833, -189585, -109361, 81543, 17321, -46137, 42945, -45792, -232139, 55612, -413895, -180175, -290645, 233416, -82267, -80152, -210131, -83271, 61112, -62108, 23621, 152102, 78633, 84007, -78238, -147073, 17858, -260056, -435199, -30910, 19532, 173042, 9599, -158437, -1418, -255360, -54782, -26367, 46486, -113849, -324105, 145332, -228181, -10370, -368142, -172458, -122216, -38067, -193731, -353496, -31227, 147865, -70609, 188859, -237970, 92771, -287418, -197938, -85656, 191793, 32628, 56922, -221215, -72391, 40941, 309271, -276172, -325082, 112714, -4233, -183065, -333796, 46526, -309508, 17195, 201717, 88899, -277217, -87991]
9546a48933B2475J32383b71401a34322m0444A81879d6239k65121c8220E4502B371
9534F95a08656j43145J23526q1324A20427a81519e9021K0399J8840F2585c05909
9522a25788a9365H344b5663m37180a51592r0007A56578N1855i9860B32987c5508
9510b48702A15279b63352A33255a4712o8531A20585b92156P7547k68633B1289
9499h9144C65841d9625j62154C6406c26732a37840l5572j76058f5695B04283a04007
9487A5217b37180A14686a72760A36615k3330g0599j43202A98797a34985A7798
9476A5270d6649A23002O0262i8736A04481b89813Q7185B30486r9455a72152A30484
9464g9688G2027a91506M4412f1556G584e30539b8363j73270R0602G1673a84905
$$ y = [-148933, 22475, 154858, -271401, -134322, -174766, 181879, -46239, -311360, -38220, 54502, 2371, 695, -108656, -251801, -128275, -209599, 120427, -181519, -59021, -38622, -19782, 62585, -305909, -125788, -19365, 8344, -25663, -462843, -151592, -241599, 156578, 208433, -99860, 232987, -35508, -248702, 115279, -263352, 133255, -14712, -83243, 120585, -292156, -214609, -483242, 21289, -89144, 365841, -49625, -211779, 36406, -326732, -137840, -173412, -349470, -65695, 204283, -104007, 15217, -237180, 114686, -172760, 136615, 113285, -70599, -213801, 198797, -134985, 17798, 15270, -46649, 123002, 183264, -98736, 104481, -289813, -202628, 230486, 131031, -172152, 130484, -79688, 72027, -191506, -147094, -61556, 7584, -530539, -28363, -201633, -111031, 71673, -184905]
9452a82690L5353J1959B40325j14289m3602K5930a95510A57420b57689A76206
9441A29732f6471j97146j54786I110b0131j85814N7616A34828K6539j13E3863
9429a3003A4074a19711I4611g2605E6093b8456q9761B6416c32900F2704J8618
9418H1322g0035A0934a60907c6373j05309b951A25749J66425d0960A01156a63425
9406A2723i7695E5635A0379a35609a2772A69774e2394A27515L1102a23764K5898
9395i7866K406m6488l2748a1753J179G4884J59199K95343k18130H5015a92074
9383I3297b20216A51272b15216F057h3295q6370k5356J2787L1176C1036d4921
9371A11358j0360a67177F6145M372g7692a1077j62386o39j54882j14331J35140
$$ y = [-182690, -147337, -135378, 240325, 126036, 82434, 108364, -195510, 157420, -257689, 176206, 129732, -66471, -263617, -418403, 9110, -20131, -205945, -148329, 134828, 161367, 161254, 53863, -13003, 14074, -119711, 94611, -72605, 56093, -28456, -118217, 26416, -332900, 62704, 81322, -70035, 10934, -160907, -36373, -141682, -2951, 125749, 292174, -40960, 101156, -163425, 12723, -97695, 55635, 10379, -135609, -12772, 169774, -52394, 127515, 158617, -123764, -97866, -95460, -141948, -174696, -11753, -10574, 74884, 234083, 529426, 311296, 85015, -192074, 93297, -220216, 151272, -215216, 6057, -83295, -169665, -195021, -182234, -151058, 31036, -44921, 111358, 100998, -167177, 66145, 70517, -77692, -11077, -173463, -174102, -328984, -443315, -308175]
9360c08175H413K7615h6940p1657I3249a06090j62012i4054q1610A8874g6546
9348A26327a26502A92462c4897A47247a10062j81988j08621J86264B2198L6671
9338E8869M3717a87517a1710r1752A37750P9698H6060i4428q6435d5773B15298
9326E4748b83485F3333l44A4842L2407a181j42558N8744q3533P7609m00499G2123
9313b74012F2697g212q9431k99476A32335b36278h8967A17152a31592p6479M6849
9302a61222A75620h6847A4351K1816a33279k6923q3143a18105p2751F1029c70138
9290b1645A60237e3892k2030b3363j10301j21075e6933Q264D0335d7703r8710
9279a46413d5761l3814D8217a27546A29818o290a3859j03167A2038O8102b26549
$$ y = [-308175, 8413, 36028, -86940, -158597, 93249, -106090, -268102, -94054, -175664, 18874, -76546, 126327, -126502, 192462, -34897, 147247, -110062, -292050, -400671, -214407, 22198, 58869, 102586, -187517, -11710, -103462, 137750, 217448, 86060, -94428, -180863, -45773, 215298, 54748, -283485, 63333, 62989, 14842, 47249, -1181, -143739, -84995, -168528, -90919, -491418, 72123, -274012, 62697, -7212, -96643, -396119, 132335, -236278, -88967, 117152, -131592, -208071, -161222, 175620, -86847, 14351, 36167, -133279, -160202, -243345, -118105, -190856, 61029, -370138, -21645, 160237, -53892, -75922, -23363, -133664, -254739, -56933, -48669, 40335, -47703, -146413, -45761, -79575, 48217, -127546, 129818, 123528, -13859, -117026, 12038, 80140, -226549]
9267b63074C79117b85058h1214D5979a87710P5146j20549J13769K7767H4331K59815
9256C44146j07436a96468L5239b496j36832m0575j17020A21763d9889A01851J3180
9245A15031h5152k04321R3620P4633M7673r9359B72920K9635B3612J23374b15399
9233F2157a17982k33548D5423K61063a32492C4600a08077j17036H6242J13850
9223B00092j0801a16576j5884K5346j86706A61321i6835E31417c37185F6564b95309
9211C5581b44839R3287d0156k228A49938b08784G216f4883J61j82338b190m9249
9199e1439m94771K20079A10147c20841B01925o8762b86129d4366q0429F4617b44002
9187F9995a35555R133D0268N6603c7497l4814q3301p598I9020D6453e2792k19937
$$ y = [-263074, 379117, -285058, -81214, 45979, -187710, -112564, -233113, -119344, -91577, 84331, 344146, 236710, -196468, -161229, -2496, -139328, -179903, -296923, 121763, -49889, 101851, 115031, -85152, -289473, -195853, -121220, -73547, -172906, 272920, 302555, 23612, 146986, -215399, 62157, -117982, -351530, 45423, 306486, -132492, 34600, -108077, -225113, 86242, 200092, 189291, -116576, -132460, -107114, -293820, 161321, -96835, 531417, -337185, 66564, -295309, 35581, -244839, -151552, -40156, -42384, 149938, -208784, 7216, -64883, -64722, -247060, -2190, -51439, -546210, -326131, 110147, -320841, 201925, 133163, -286129, -44366, -124795, 64617, -244002, 69995, -135555, -126422, 40268, 96871, -37497, -72311, -155612, -163210, 99020, 46453, -52792, -272729]
9175b72729C0032f1316b5684j81895e5943n3901k1036k394n1986o9077c4435G1243
9162a91547d8299j75313i2867C2939a83326j12694a21171q4512G6867K16247a87220
9150C1399A3408f7892B9808i2119d5585k75973A67733L9643b70701d1419k50970
9139b92389R2201C0826a03713A88310h2048O184A54990m2137B7279f4699K0734
9128d3965I4686P4095a67113G6799a50799j5081A06015O5187n7050d45015D3442
9116a25729B22777c9611C30407A8660K71015C9701f8537B06707c29113r2249H8828
9104a02067C9692L9563l6474a57139k1741A41173i3747A84934G8049J34350a85264
9092e9223B23193b9650l74115a37033L8349J5507K6619j39458f7343b2153G0993
$$ y = [-272729, 30032, -61316, -25684, -207579, -55943, -109844, -130880, -133274, -185260, -254337, -34435, 71243, -191547, -48299, -223612, -92867, 32939, -183326, -296020, -121171, -205683, 76867, 293114, -187220, 31399, 13408, -67892, 29808, -92119, -45585, -321558, 167733, 207376, -270701, -41419, -292389, -200188, 30826, -103713, 188310, -82048, -75864, 154990, 112853, 27279, -64699, -43965, 94686, 168781, -167113, 76799, -150799, -165880, 106015, 171202, 114152, -445015, 43442, -125729, 222777, -39611, 330407, 18660, 289675, 39701, -68537, 206707, -329113, -421362, 88828, -102067, 39692, 79255, 42781, -157139, -178880, 141173, -93747, 184934, 78049, 212399, -185264, -59223, 223193, -29650, -403765, -137033, -98684, -83177, -56558, -196016, -67343, -22153, 70993]
9080A7572d2752m04422a98892j47492c2236j23080j41418J13356K3046q6831i6763
9068c57658H0102b4318k69449F3541J6817i5130E2519J15838b24989a05988K0021
9057h5967A4272b1734A51544b97463I7615d4357A61761B8720b8429n6473A69778
9045a90736j05872D64846G9416e2550D05664e7302h96G8798j7426b26595P9694
9034a46901I905O958a5445G8285c88640E9949a79378p2358P1375C3104a84369
9022i6644f779E320g5032A44518a8434k02252f5666K094j43299a6244q0477k1685
9010a18406D1850J26785G1827J9558c8967j39807h7545B8378c10934h7361e534
8998e8844H997Q7837a32160j2232k2789A27315i6528j7196b7086B35463c1749
$$ y = [17572, -42752, -447174, -198892, -346384, -32236, -155316, -296734, -183378, -160332, -247163, -96763, -357658, 80102, -24318, -293767, 63541, 80358, -95130, 52519, 168357, -224989, -105988, -85967, 14272, -21734, 151544, -297463, 97615, -44357, 161761, 28720, -28429, -84902, 169778, -190736, -296608, 464846, 79416, -52550, 405664, -57302, -896, 78798, 61372, -226595, -146901, 9905, 16863, -15445, 78285, -388640, 59949, -179378, -251736, -180361, 33104, -184369, -96644, -6779, 5320, -75032, 144518, -18434, -220686, -65666, -63572, -206871, -16244, -96721, -118406, 41850, 168635, 71827, 91385, -38967, -178774, -87545, 28378, -310934, -87361, -5534, -58844, 8997, 96834, -132160, -144392, -167181, 127315, -96528, -113724, -27086, 235463, -31749]
8986a29733A87850c31381O6496k393h8533j38761C7727a57066j00736a063E132
8974A9931a48263F4636f1297l3957K2162B80168a29217l0815j54762H894J91623
8963B00517a28547e9724J4328C1158c99308E08168f093k77393J02192A30741m3526
8952H7215d6530B47734a23404B48873H2954a72081A27929m8664e0160A76932c4841
8940a28386B43766b19662O4388k7337q912I0519e6711n8969A71692c79015H4606
8928C32546A18173J95649q0279J25299R1776R24952M872204k558526A611257E97441
8917D94839k36621B3551K04996a12575D5427a86080a5424B27637P9695j49358
8907A57974D581c21517f6163A16397d1181k38952j8236d8016q6390E681b2772
$$ y = [-129733, 187850, -331381, -264885, -267278, -88533, -227294, 37727, -157066, -257802, -1063, 5132, 19931, -148263, 64636, -61297, -95254, -73092, 280168, -129217, -160032, -314794, 8894, 200517, -128547, -59724, -45396, 31158, -399308, 508168, -6093, -283486, -181294, 130741, 87215, -46530, 247734, -123404, 248873, 82954, -172081, 127929, 79265, -50160, 176932, -34841, -128386, 243766, -219662, -155274, -182611, -191523, 90519, -56711, -115680, 171692, -379015, 84606, 332546, 118173, 313822, 233543, 358842, 450618, 1375570, 6247774, 3689248, 1611257, 597441, 494839, 258218, 23551, 228547, -112575, 45427, -186080, -15424, 227637, 307332, 157974, 4581, -321517, -66163, 116397, -41181, -280133, -298369, -48016, -134406, 5681, -22772]
8895b62785B0186a72047M6419I024a1346G8145b20495E3559b04035K9306q994
8884a83723f0358A15214J10589g6802J0329c0015a0891A51184b57473J19765I3793
8872D06203F6204K56688j55227b05612b9698A62932N2802a23078k0021L3890F3905
8860f6396K9866j90117P5161r3632d6657q061A08936E1819c45228F863f4512a1868
8847a02842A72010b46067A989b59570J16122p293I5638E857J10416c80138a10778
$$ y = [-262785, 20186, -172047, -125628, 9024, -11346, 78145, -220495, 53559, -204035, -174729, -183723, -60358, 115214, 225803, -76802, -66473, -30015, -10891, 151184, -257473, -137708, 93793, 406203, 66204, 322892, 167665, -205612, -29698, 162932, 215734, -123078, -143099, -109209, 63905, -66396, -36530, -226647, -151486, -245118, -46657, -54718, 108936, 51819, -345228, 6863, -64512, -11868, -102842, 172010, -246067, 1989, -259570, -143448, -150741, 95638, 5857, 116273, -380138, -110778]
$$ [...]
##END NTUPLES=NMR SPECTRUM
##END=
