
##TITLE=AC1318_SSUAH12147_6535344_7FNUsokbu0
##JCAMPDX= 6.0         $$ Bruker NMR JCAMP-DX V2.0
##DATA TYPE= NMR SPECTRUM
##DATA CLASS= NTUPLES
##ORIGIN= BRUKER
##OWNER= Administrator
$$ 1.72 TOPSPIN		Version 2.1
$$ 2012-12-13 18:31:47.201 -0500  Administrator@X
$$ Compression mode = diff/dup
##.OBSERVE FREQUENCY= 400.02188249412
##.OBSERVE NUCLEUS= ^1H
##.ACQUISITION MODE= SIMULTANEOUS (DQD)
##.ACQUISITION SCHEME= undefined
##.AVERAGES= 8
##.DIGITISER RES= 22
##SPECTROMETER/DATA SYSTEM= spect
##.PULSE SEQUENCE= zg30
##.SOLVENT NAME= COFFEE_meoh
##.SHIFT REFERENCE= INTERNAL, COFFEE_meoh, 1, 14.98509
##AUDIT TRAIL= $$ (NUMBER, WHEN, WHO, WHERE, PROCESS, VERSION, WHAT)
$$ ##TITLE= Audit trail, TOPSPIN		Version 2.1
$$ ##JCAMPDX= 5.01
$$ ##ORIGIN= Bruker BioSpin GmbH
$$ ##OWNER= Administrator
$$ $$ E:\/data/COFFEE/nmr/AC1318_SSUAH12147_6535344_7FNUsokbu0/20/pdata/1/auditp.txt
$$ ##AUDIT TRAIL=  $$ (NUMBER, WHEN, WHO, WHERE, PROCESS, VERSION, WHAT)
(   1,<2012-12-13 18:31:39.061 -0500>,<Administrator>,<X>,<go>,<TOPSPIN 2.1>,
      <created by zg
	started at 2012-12-13 18:30:32.545 -0500,
	POWCHK enabled, PULCHK disabled,
       configuration hash MD5:
       86 BA 57 50 F2 9D 5C 9B 26 00 A9 28 5F 66 2E 89
       data hash MD5: 64K
       40 45 8F 52 8C A8 F8 12 54 96 00 35 63 07 05 1D>)
(   2,<2012-12-13 18:31:42.201 -0500>,<Administrator>,<X>,<proc1d>,<TOPSPIN 2.1>,
      <Start of raw data processing
       efp LB = 0 FT_mod = 6 PKNL = 1 PHC0 = 0 PHC1 = 0 SI = 32K 
       data hash MD5: 32K
       ED 73 6E C0 65 D3 33 0A 54 D2 2C DA 3A 66 DB 9E>)
(   3,<2012-12-13 18:31:42.654 -0500>,<Administrator>,<X>,<proc1d>,<TOPSPIN 2.1>,
      <pk PHC0 = 100.459 PHC1 = 0 
       data hash MD5: 32K
       CD B8 38 8B 27 F0 8D B8 37 7B 82 C2 69 B2 28 38>)
(   4,<2012-12-13 18:31:42.873 -0500>,<Administrator>,<X>,<proc1d>,<TOPSPIN 2.1>,
      <abs ABSG = 1 
       data hash MD5: 32K
       77 BA DB A9 0B 6C 9F 83 59 64 08 95 A7 A5 30 0C>)
(   5,<2012-12-13 18:31:43.014 -0500>,<Administrator>,<X>,<proc1d>,<TOPSPIN 2.1>,
      <abs ABSG = 2 
       data hash MD5: 32K
       EF 68 67 FA 40 C5 C0 B5 6E 4C 60 67 ED 62 CC F4>)
(   6,<2012-12-13 18:31:43.170 -0500>,<Administrator>,<X>,<proc1d>,<TOPSPIN 2.1>,
      <abs ABSG = 3 
       data hash MD5: 32K
       E0 BE D0 C0 A3 48 27 03 37 C4 29 51 25 76 D6 3C>)
(   7,<2012-12-13 18:31:43.311 -0500>,<Administrator>,<X>,<proc1d>,<TOPSPIN 2.1>,
      <abs ABSG = 4 
       data hash MD5: 32K
       92 7F BE 6C CF 8D 92 5E 03 61 6B 63 68 B8 19 A6>)
(   8,<2012-12-13 18:31:43.467 -0500>,<Administrator>,<X>,<proc1d>,<TOPSPIN 2.1>,
      <abs ABSG = 5 
       data hash MD5: 32K
       F8 38 CC 10 23 6E EE 95 D4 19 27 16 80 BB 95 16>)
$$ ##END=
$$ 
$$ $$ hash MD5
$$ $$ 36 FC B7 D4 5D 09 A5 0B A5 49 C7 41 88 C8 FB 4B
##$RELAX= 
##$RELAX= 
##$RELAX= 
##$RELAX= 
##$RELAX= 
##$RELAX= 
##$RELAX= 
$$ Bruker specific parameters
$$ --------------------------
##$DU= <E:\>
##$EXPNO= 20
##$NAME= <AC1318_SSUAH12147_6535344_7FNUsokbu0>
$$ [...]
##$TP= (0..7)
150 150 150 150 150 150 150 150
##$TP07= 0
##$TPNAME0= <>
##$TPNAME1= <>
##$TPNAME2= <>
##$TPNAME3= <>
##$TPNAME4= <>
##$TPNAME5= <>
##$TPNAME6= <>
##$TPNAME7= <>
##$TPOAL= (0..7)
0.5 0.5 0.5 0.5 0.5 0.5 0.5 0.5
##$TPOFFS= (0..7)
0 0 0 0 0 0 0 0
##$TUNHIN= 0
##$TUNHOUT= 0
##$TUNXOUT= 0
##$USERA1= <user>
##$USERA2= <user>
##$USERA3= <user>
##$USERA4= <user>
##$USERA5= <user>
##$V9= 5
##$VALIST= <valist>
##$VCLIST= <CCCCCCCCCCCCCCC>
##$VD= 0
##$VDLIST= <DDDDDDDDDDDDDDD>
##$VPLIST= <PPPPPPPPPPPPPPP>
##$VTLIST= <TTTTTTTTTTTTTTT>
##$WBST= 1024
##$WBSW= 4
##$XGAIN= (0..3)
0 0 0 0
##$XL= 0
##$YL= 0
##$YMAX_a= 657245
##$YMIN_a= -560422
##$ZGOPTNS= <>
##$ZL1= 120
##$ZL2= 120
##$ZL3= 120
##$ZL4= 120
##$ABSF1= 14.98509
##$ABSF2= -5.573092
##$ABSG= 5
##$ABSL= 3
##$ALPHA= 0
##$AQORDER= 0
##$ASSFAC= 0
##$ASSFACI= 0
##$ASSFACX= 0
##$ASSWID= 0
##$AUNMP= <proc_prof1d_extract_pilot.lims>
##$AXLEFT= 0
##$AXNAME= <>
##$AXNUC= <1H>
##$AXRIGHT= 0
##$AXTYPE= 0
##$AXUNIT= <>
##$AZFE= 0.1
##$AZFW= 0.1
##$BCFW= 0
##$BC_mod= 0
##$BYTORDP= 0
##$COROFFS= 0
##$CY= 15
##$DATMOD= 1
##$DC= 0
##$DFILT= <>
##$DTYPP= 0
##$F1P= 0
##$F2P= 0
##$FCOR= 0.5
##$FTSIZE= 32768
##$FT_mod= 6
##$GAMMA= 0
##$GB= 0
##$INTBC= 1
##$INTSCL= 1
##$ISEN= 128
##$LB= 0
##$LEV0= 0
##$LPBIN= 0
##$MAXI= 10000
##$MC2= 0
##$MEAN= 0
##$ME_mod= 0
##$MI= 0
##$NCOEF= 0
##$NC_proc= -8
##$NLEV= 6
##$NOISF1= 0
##$NOISF2= 0
##$NSP= 0
##$NTH_PI= 0
##$NZP= 0
##$OFFSET= 14.98509
##$PC= 1
##$PHC0= 100.459
##$PHC1= 0
##$PH_mod= 1
##$PKNL= yes
##$PPARMOD= 0
##$PPDIAG= 0
##$PPIPTYP= 0
##$PPMPNUM= 2147483647
##$PPRESOL= 1
##$PSCAL= 4
##$PSIGN= 0
##$PYNMP= <proc.py>
##$REVERSE= no
##$SF= 400.02
##$SI= 32768
##$SIGF1= 0
##$SIGF2= 0
##$SINO= 400
##$SIOLD= 32768
##$SPECTYP= <>
##$SREGLST= <1H.CDCl3>
##$SSB= 0
##$STSI= 32768
##$STSR= 0
##$SW_p= 8223.68421052631
##$SYMM= 0
##$S_DEV= 0
##$TDeff= 65536
##$TDoff= 0
##$TI= <>
##$TILT= no
##$TM1= 0
##$TM2= 0
##$TOPLEV= 0
##$USERP1= <user>
##$USERP2= <user>
##$USERP3= <user>
##$USERP4= <user>
##$USERP5= <user>
##$WDW= 1
##$XDIM= 32768
##$YMAX_p= 469377580
##$YMIN_p= -779776
##$CURPLOT= <Network HP LaserJet P1505>
##$CURPRIN= <$Network HP LaserJet P1505>
##$DFORMAT= <normdp>
##$LAYOUT= <+/1D_H.xwp>
##$LFORMAT= <normlp>
##$PFORMAT= <normpl>
##$SURQMSG= 1
$$ End of Bruker specific parameters
$$ ---------------------------------
##NTUPLES= NMR SPECTRUM
##VAR_NAME=  FREQUENCY,     SPECTRUM/REAL,   SPECTRUM/IMAG
##SYMBOL=    X,             R,               I
##VAR_TYPE=  INDEPENDENT,   DEPENDENT,       DEPENDENT
##VAR_FORM=  AFFN,          ASDF,            ASDF
##VAR_DIM=   32768,         32768,           32768
##UNITS=     HZ,            ARBITRARY UNITS, ARBITRARY UNITS
##FACTOR=    0.250966925370066, 1,           1
##FIRST=     8223.43324360094, -98092,       -4452
##LAST=      0,             -164400,         -226434
##MIN=       0,             -779776,         0
##MAX=       8223.43324360094, 469377580,    0
$$ Real data points
##PAGE= N=1
##DATA TABLE= (X++(R..R)), XYDATA
$$ [...]
23828 87442 -291649 -69810 59057 -374522 -156944 55018 17390 76828 52119 -26389 -153297
23817 -153297 192765 -184304 147647 68724 -10350 -7136 -5519 -147803 -196380 786 -186453
23805 99155 -225398 68018 10741 310713 94404 -43817 -144657 226794 190413 34194 -189633
23793 58813 66603 -43874 -89847 352736 -220663 -215413 -203439 130655 -100430 -42693 -51274
23782 -51274 48777 -192509 42286 -46013 -165738 24982 -11606 -155665 10269 -284009 295529
23770 -95243 23799 -190590 -111637 298406 -181388 -198575 -233617 -224329 -207095 -327475 -174457
23759 -174457 -79609 -199375 66879 -31529 26337 121047 145512 -139887 -264439 -24420 -13492
23748 -13492 -21472 -123637 -381969 -4769 -200404 -26167 -18667 -240571 27933 85769 -115673
23736 -188271 217582 153508 -130127 56982 22457 -235166 275786 71549 -58009 -468208
23726 -468208 97229 -166840 -113150 176107 81568 -74474 -32799 -147299 293021 -279330
23715 -154426 -174011 230060 94895 -23231 -88547 144872 86252 -264889 1699 26323 -183567
23703 -207197 46713 -108831 903 77323 -84693 -54402 56778 92328 -51645 -543 -201821 209716
23690 239130 -56352 266794 -108955 -76671 -118483 158561 41194 -34218 142563 -98195 59795
23678 227347 124754 7583 -1016 144024 35951 -68496 86354 68388 -179915 95420 135930
23667 135930 -52628 -21389 -6818 -33293 257218 -161441 43836 22442 80122 -66535 110901
23655 434298 -304643 160031 -149859 -66101 -157780 50630 -24073 -98011 -288206 17849 176858
23644 176858 -39061 -319181 14168 -29665 -85682 313789 -140953 -86564 -112193 -129835 66732
23632 -56942 192194 -94324 124725 44595 -158623 121785 23396 -150641 36183 73882 -19249
23620 14533 213542 -17244 4915 -128748 84107 -16812 -141354 -211650 49670 7716 67967
23609 67967 -181462 -97297 47873 -264730 -41141 370963 -219640 -138024 -60093 127659 365432
23598 365432 171040 138566 193515 -178616 -45409 -176568 -100787 -183995 -341239 -102252
23587 40102 226979 58671 256969 -30963 188736 46038 30781 332557 30477 45412 -93479
23575 81990 42069 77880 -391613 -16929 -85557 74004 383776 157778 -17913 210430 -130465
23563 -121568 -237676 187664 -57351 399634 -247626 20870 -215799 -52110 37165 69914
23553 69914 242062 -264218 48131 22089 112757 -453765 -59489 -279403 -252233 -7583 -162795
23542 -162795 93769 170861 34104 249198 65548 -43254 -177130 38019 -6650 194732 -45160
23530 -83880 -25432 -65024 -24434 -277985 -60918 104969 39539 -430572 4243 -304346 60867
23518 26511 -109788 93300 36380 265859 236508 -115717 -84801 279477 116321 -144340
23507 -45262 29317 -70504 -58304 -94867 94169 21820 -420932 345190 9496 26633 125883
23496 125883 4094 154536 -33799 -30717 41256 322406 137444 25757 110890 42941 -311218
23484 -314191 146864 27083 -122152 -80892 14583 33755 -143257 -80642 49387 -120059 -73297
23473 -73297 -98270 -134750 174531 -53915 117983 195548 41544 -139372 96159 -77025 -269466
23462 -269466 132276 162219 154992 -121928 -203874 -167991 14990 -413817 486608 -108075 351574
23450 -296099 14282 -269609 34478 -43932 -39390 422 -58217 27742 225078 -106447 -27409
23438 -35901 -61923 175057 3413 -29245 14416 106046 -131412 -102804 147898 -164216 -4491
23426 -195022 165094 -208475 465501 74624 -267623 -129348 209474 -50115 55867 181284
23416 181284 -44481 8387 -163094 86283 -125771 1470 -220122 -209922 214944 168800 265879
23405 265879 -44227 96270 297856 29213 -121969 39331 -110177 -225559 25608 -238676
23394 138190 7715 124647 -9577 347524 28312 38693 22621 105703 -135257 -137873 107768
23382 -64378 -224466 21674 254908 -146038 -222116 38827 -35506 122496 84355 118891 -202752
23370 207701 -114308 -295886 83046 233061 15467 275754 27306 -203782 -535997 -456479
23360 -456479 149463 152612 -91966 -115144 -51028 -72283 -270664 -247523 -114017 17329 90675
23349 90675 -48813 121038 -213769 236666 52118 -266593 -167770 41201 -165496 -123693 45643
23337 -68231 29585 102688 27361 247189 -252527 127690 74961 -142074 106812 -91526 -49899
23326 -49899 103591 239211 -10975 125786 81340 -524 -156366 -44390 -59648 -267385 -33701
23314 117425 -146686 -216860 -115701 -185736 -243719 97988 -314755 105445 -185361 96625
23303 -233387 -186826 2790 199512 -52254 72598 280820 118403 -209645 135036 -125545
23292 -299522 272914 -217708 49505 -329473 -10781 125963 869 24480 20551 -134124 -192343
23281 -192343 -72850 128281 -99022 1466 326378 -136362 -21139 -96552 170739 73132 -146305
23269 116998 38576 -11782 -214410 -288881 -179865 113196 5535 231182 93278 120867 -91387
23257 -25702 -229549 -55686 -135300 -25440 -54219 -265296 -131447 92669 38852 34477 -145934
23245 333998 -94347 32833 -39918 -46959 -36208 -281907 -7013 150453 -5450 206958 259046
23234 259046 257086 214385 75541 71135 29245 142720 110989 149299 -136044 -131837 -276203
23223 -276203 161641 118551 -55375 106073 -16693 -145954 -75189 31307 -22903 258754 -34647
23211 -158880 -105071 -88314 -132758 242725 33207 -229576 2185 74774 144358 53995 -65566
23199 -529765 -207990 -103722 -198506 -146531 -200792 77301 50524 -41115 153086 -54322 11204
23187 49398 -172661 163532 40347 -48303 -93574 -123644 189109 146812 -235361 -10532 -217397
23176 -217397 161530 154887 -149845 25822 -453936 89732 -116431 308321 -132265 95189
23165 -111433 -80471 -62867 -131770 -422731 -151957 147045 141872 72404 -140664 264282 -187344
23153 83401 -200937 228328 43057 -57949 196168 -113511 -15924 -186376 -156401 -71003 106659
23141 -282948 129323 77498 -153447 -233446 -215047 -64254 -359474 -217148 334612 -14006
23130 45428 67362 264651 100224 32688 162474 -107085 323657 37185 -237386 -258683
23120 -258683 112550 373193 206867 -61966 79904 58720 70298 -108752 85688 -168982
23109 -15643 -190007 -191272 -15450 153726 88911 -135533 -56943 163410 297957 -124027 223392
23097 101390 -199692 54732 130233 -71039 278435 -221753 96815 62658 53107 -446490 -187439
23085 94889 -450609 -53708 116842 -55310 160857 268243 -122485 -206381 -34778 56845 223134
23074 223134 -204609 1017 29744 -38802 -143812 -26508 -27265 -26435 22510 112532 101758 244179
23062 244179 256881 41668 -273178 118560 -116477 184951 105131 -299450 92463 -107225
23051 -142632 -134596 -273402 -226737 -253711 -19185 -117611 -133257 112490 -61885 -291281 -182199
23040 -182199 -96009 -361163 -204141 -50828 -128772 -333586 -130877 29026 -90848 -11460 -13074
23029 -13074 132759 135154 24635 312032 278752 16391 -225593 37083 56397 172639 124353
23018 124353 39124 146831 347685 49182 -135866 173583 158874 45831 -367442 -239930
23008 -239930 105572 -332235 -133809 -13488 -392677 -153905 18495 83302 -37424 76029
22997 -263207 190708 -85412 120096 -210811 138579 152621 269234 -99744 -329684 92914
22986 -44188 154814 -74271 -374064 -34483 -289910 68705 63829 123833 4813 -166129 -139102
22975 -139102 -126326 95162 52081 -82042 234640 231268 -208999 -148 274404 121863 318003
22964 318003 -4492 144550 -184459 77613 109174 -155716 138582 188940 145504 105796 -87241
22952 -657501 -387602 177837 -54373 66000 -118156 -63338 -178123 105448 147875 -224327
22941 146759 -147915 63247 224199 152585 -88505 -24294 -315280 -76553 216978 66710 -43914
22929 -192298 -425738 -59478 -17146 -54668 -183049 -189925 -85621 154853 203405 -199057 26679
22917 143673 235388 167510 -70753 27913 150415 285354 -44808 -170956 -175496 -253298 98942
22905 -47248 -51291 66570 89845 167039 -131723 -56365 107217 376187 -196150 9711 61752
22894 61752 2930 245696 -155409 68000 -113213 128267 -34906 138717 -282465 -233324 -2604
22882 36734 -441042 261716 -26058 -103839 -230026 365663 24854 -378204 -142778 -232697
22872 -232697 -54781 -180736 156016 53190 -90564 -82187 38746 -246399 -24288 2583 -64334
22860 -147155 -89226 -47174 181196 8388 -16519 -193736 88077 -119975 47145 36162 -32651
22848 -30334 28810 -169702 61420 47359 460917 -38386 -236234 56252 45925 -14349 -143909
22837 -143909 -124609 -69665 -83873 8284 -152925 12078 5485 110259 -231848 259208 -74375
22825 -119623 62938 -8214 -216827 -95275 110825 -152618 84636 249186 -164134 -284465
22815 -284465 -267460 187956 -18970 17241 180132 -343718 -41360 -95551 84424 -94838 20692
22803 -463806 -109179 465982 -3439 -93257 82338 -316040 -548 -210759 -191470 -16811 16908
22791 -275551 -256328 100178 12000 40797 240776 63244 -351025 -106289 -102480 153931 -51741
22779 104983 42301 190768 -221796 -72143 37544 -150540 -80434 45822 44297 225613 50304
22767 256556 64671 163251 -31991 279464 -577886 -136097 76800 -154063 -180060 -197314 189789
22755 328158 -200902 -83911 66779 237313 -191528 115109 -82984 127503 318739 211624
22745 211624 -20143 -27587 -385405 -1441 -182413 13157 8902 -42586 -317241 48602 113009
22734 113009 27753 105224 -25228 -304541 5364 182892 -153850 -13704 -10939 -174346 -248476
22723 -248476 -18697 -139049 -315091 -124977 192433 226281 133478 244307 -81794 -99126
22713 -99126 219221 -146943 13915 12735 46296 -154839 18623 -109723 61765 275393 -173183
22701 -161334 42337 -326450 -140639 289059 137863 -213624 -9906 -46294 -106357 13368 90589
22690 90589 103626 -63944 -55479 81253 -41608 126727 58577 -14302 -19214 178730 -244381
22678 -323259 -157405 -321555 -328960 -158985 -47850 -57002 2351 -229324 -185950 245477 -217026
22666 -1337 426617 82167 72746 -79021 55845 54482 -73590 79812 10223 -353138 -46921 99265
22653 -257571 31872 -46722 -229110 61470 -62517 -60937 153446 11478 36677 -175072 150813
22641 -84318 113320 166342 -196227 -288693 142049 -127768 -5205 124289 166037 126675 271688
22630 271688 -79773 241893 -216593 -15326 74538 -29390 -236986 62531 -81168 10986 -196954
22618 14081 311996 -89471 76434 -185643 -79072 -397968 -12018 192495 -313301 -14959 -75024
22607 -75024 -73628 -250497 -110666 69638 -222408 -12080 -213293 -142658 59220 -98738 126272
22595 327884 -309826 158341 -52487 -15850 -145907 161455 -265417 65276 309015 -80544
22584 -28409 -2243 6873 -154520 -176479 -244066 -151061 74652 81672 -318468 -39671 112320 82084
22572 82084 -171000 27589 190304 61333 80780 -197223 -161463 82576 231461 108112 -117509
22560 87310 -173618 -170286 35079 201298 9684 310763 7747 -82789 -459367 -157256 -43881
22548 -78722 -125994 23306 54565 -35936 -147 -369020 -64847 242262 -12160 -212443 -18719
22536 -202493 95475 188079 -212420 293672 -527232 -15113 341972 516272 -174488 -228292
22526 -228292 -112286 151718 86808 -215340 18820 -84202 -58622 -125543 -6159 179622 -266994
22514 -64932 -143084 -220969 -217512 339201 -178950 84553 -281848 20493 -65189 7114 98223
22503 98223 -28940 42528 -320019 245224 291303 -137646 -4957 -151645 -23114 35359 22139
22492 22139 -132526 153383 -172830 -3640 -48689 134877 111616 -2485 -7375 -23452 -193794
22481 -193794 -119548 -158746 203727 -216617 236379 79407 760 14742 93631 74181 199951
22470 199951 222683 -99101 -16518 -92880 35503 -185713 -93350 -179946 248477 5097 -340645
22458 -332981 -194431 -110299 188007 -35018 -8023 -39775 -391854 -16311 24700 -311042 133956
22446 -123637 376281 -70739 -164629 147458 192034 -322802 66042 -260092 -13427 47635 -255503
22434 131264 -58546 -53959 106476 -172085 -94528 -9511 156122 212192 12989 239697 191180
22423 191180 -68267 60300 -94103 -22324 -116539 -42561 59474 39811 -221208 -331100 -91615
22411 237420 161 -142091 -105944 -203425 102141 -218221 188636 113887 89694 58858 -6258
22399 264159 139163 256547 116812 -259698 30710 -186004 -302114 85279 -250075 59040
22388 -182286 246327 -209545 18519 -194286 -104094 -159488 -268603 -11111 -350848 -318007
22378 -318007 -104957 204261 -94961 -79715 -38450 -107314 205532 227705 54555 -117007 7491
22366 104925 -189652 -126119 92548 13116 -69427 81788 -186844 -221518 -158783 -73724 150419
22354 -54474 -353315 113676 -210789 -98443 -40385 36076 -133318 -41419 196004 325851
22344 325851 -127644 155775 -141723 -211811 209343 6294 -73903 -208286 53055 138739 -216987
22332 -403258 -48025 -229378 -54767 71186 204706 -330146 -124603 -92468 39947 57939 -10088
22320 129898 -172683 -234518 -173145 -100910 532 -17529 88415 -210485 -83027 152954 -313066
22308 -18182 -353290 -92696 130913 131140 47780 66866 86305 -105853 -24499 8628 -61616 -109262
22296 -109262 -5694 34470 122420 781 3400 -100949 -173225 295051 -50231 -64481 103940 375681
22284 375681 63901 11577 10270 194220 -258749 97142 96977 117102 -49009 -31221 -21879 -154994
22272 -154994 115954 -47714 129828 -301949 -90474 -1789 -211221 42986 -229375 -49833 -70207
22261 -70207 -127454 20158 30652 -66184 184384 278022 -260851 76251 -150393 12758 -117649
22249 154370 188828 -239197 -106767 171442 26499 -106229 -19089 -10720 -241149 60345 -105500
22237 78450 -113201 85814 -178258 127798 368339 -30351 91912 -338956 -102813 -56910
22227 -56910 111516 -206131 -53150 -104971 -161950 171837 -182273 -66247 183500 -109958
22216 -47513 79359 -182859 -6960 -30743 -63780 -151719 -41115 162869 -106656 108317 -259146
22204 -121329 147041 -279660 -76049 12999 -253482 -626 23836 -100998 -176680 66322 -1981
22192 128509 139681 -39869 -170287 -127026 147280 136362 171065 -218133 -145397 71935 185896
22181 185896 -83283 -150473 -295630 -207520 -261784 -194514 -290835 -107227 414293 -127341 100398
22169 -49541 252185 -99747 -239914 -253228 43227 -146228 132494 -158071 18662 -47278 -55559
22158 -55559 85418 -99609 -197411 -276927 135791 63539 -342972 227550 -24064 1462 -164262
22146 48952 -180908 236450 39397 48036 -22660 -156706 173660 -403676 -59136 11904 284325
22135 284325 -21689 199619 -242292 -404029 -382558 -19702 -149063 211 152951 353643 74252
22123 -112473 102097 -258374 -169108 85575 143413 254525 -56618 -18674 44419 12327 70073
22112 70073 -170081 82670 -165545 -145612 -94183 10065 -295077 -131951 -362046 -154515
22101 -292664 -310256 234342 152552 19792 -74223 257978 -68702 -180941 -177884 -210183 -348946
22090 -348946 36384 242366 52146 -275783 357700 -36981 127512 -315527 62341 -150126
22079 -51468 49344 -70019 -272020 -63157 42565 254764 70048 -275630 144456 -96533 -263156
22068 -263156 101532 -201242 14547 -177425 230694 -257579 103530 -39606 -182312 -63705
22057 9348 -414037 -132598 310922 -307691 -280116 -142958 -490001 35092 416775 91457
22046 22840 -286277 327564 -249664 58660 -101867 -27000 -124875 -65190 -148640 -264365 -184416
22035 -184416 1997 -70452 153799 -164041 -270060 50839 -74406 -100432 31142 -893 93685
22023 112781 -103048 -166432 -70077 -238577 87299 5051 -33896 148745 46674 -74456 70212
22011 12150 -68556 -4616 106874 -247359 89513 47536 -111697 58211 -388194 478432 127017
21999 -129682 151862 224533 48017 -100655 -352326 -18276 -144763 33125 117980 -209308
21988 81935 -154769 21823 -253546 75519 47161 -50535 -298588 -12474 -1139 -40027 89077
21976 -387352 46801 -190241 -51804 -135660 118243 -148996 -10908 -197545 44316 23604 129192
21965 129192 -4663 -667955 57774 47270 -172858 143201 -319472 -208836 215008 -68776
21954 -92538 55323 107584 -172884 -73599 -140151 15857 -116394 108046 -276364 -75097 15379
21942 -140951 -43463 -258403 -139 -121935 -19513 -155058 210767 115025 21375 -279918 -197046
21931 -197046 207749 -79825 -297530 -116786 -256191 -36176 181615 296680 -255608 -15493
21920 -41595 390062 -5430 -12563 64254 151847 -86855 -83532 -20532 325551 -19353 27885 90956
21908 90956 -79999 41917 -109222 97428 -157862 -278731 -218505 -262462 -43291 -24153 38337
21896 175379 -194792 32645 190269 -98919 -199925 -531048 -111991 60218 207488 -120230
21885 -184285 -293585 63195 303700 -238737 -150510 -142070 -32221 132168 -129953 -188544 -78034
21873 -267272 -252952 -208148 45185 -109565 152418 31370 -67761 112787 -230244 75751 -66548
21861 92805 -169472 68648 -113336 -150051 148330 145133 -285778 -95834 277275 -80251 323118
21849 -167920 -33770 287092 -16731 222837 -141460 284341 56182 -132240 84574 119217
21839 119217 105669 -255962 63156 -85685 -125282 -84974 -175870 147259 171156 -343932 -84549
21827 -106494 -241617 125280 76078 -80020 -216090 -216365 -180442 -24345 -145182 -146279 -101544
21816 -101544 361106 -138999 -904 36287 290027 -204697 -4090 261475 -44931 -183392 88436
21804 -14964 335547 104737 124539 -97909 318723 -90208 398852 227111 -180236 171099
21793 44521 -287688 -7484 381 26705 -43861 10305 -142014 -151763 237178 -54317 -69790 129966
21780 444232 -27505 -114880 -36160 -268668 -431659 -223928 -22648 -21719 195753 134029 -106479
21768 85257 -173037 -46816 -118241 295746 -84317 121930 -138015 -32173 -183432 206629
21757 -55126 -132614 97337 -265775 110382 -41327 -265135 100119 -46128 62362 -22521 -46251
21746 -46251 -161026 253584 65348 -197704 -2127 -95223 377864 198589 -99784 -415351 95111
21734 12958 119141 115410 182394 -164468 -415509 -154868 -205122 307354 -105995 -161760 -192063
21723 -192063 -205559 -234592 9635 -159117 -159064 -327645 -70794 -69139 58940 -130218 90483 -132662
21710 -77344 -88740 73386 -312126 -38250 18505 -41099 177402 -272382 -169174 -47838 282034
21698 -340993 -205278 -124490 -245392 -63410 -214280 115282 49771 -108284 302604 -252646
21687 107204 -16892 -131139 -181769 -163721 -277917 224675 -112895 251410 -108246 -215330
21677 -215330 127686 5026 -182197 -138309 -164337 -299124 233017 -290956 52553 87862 -39090
21665 -21319 -12820 -285949 -113730 -170792 -296761 156945 -139838 -371026 -117264 -191191
21655 -191191 -100829 -276686 -132118 139089 2302 -414941 70065 123910 4346 292643 102959
21643 102652 -224592 149451 287872 286070 -183517 26994 -52728 -23753 288536 -244664
21632 -8571 -11123 -388807 -93559 46962 46195 -20080 117901 262638 -267291 -164370 291369
21620 97994 -100057 -141593 -71768 50005 14170 -183535 234318 -46193 -358867 -233395 28142
21608 -86339 -170253 -261126 408480 140187 -22494 -295206 -217255 50035 112242 -122828 70833
21596 -101482 933 -206716 -22606 167643 195833 64302 -95287 72626 29229 32937 -105355
21584 -224143 21283 155266 -76636 -89860 -26840 -113185 103971 82764 -32335 13000 42966
21573 42966 -575803 42508 171999 -108014 -207376 -121199 143883 1537 23909 -145079 -62868
21561 -248684 -36569 -87626 -212763 285272 -65633 -60456 193506 -117927 109330 -103718
21550 23497 -141164 -195051 -131936 -159686 20793 -156725 124056 -100493 -68052 16042 -251913
21538 -67 -110751 -142531 -78682 182640 -172258 -121852 44089 -134961 -123559 46364 154377
21527 154377 -350201 -114684 -4004 -207061 18229 -53962 -21280 -106954 -34794 -24499 -292227
21516 -292227 -299739 209845 -71770 -322183 48190 -164855 -76552 101995 -97158 4721 -388462
21504 -267319 -50649 -87967 45845 -131136 -126585 -4933 -134209 -276373 -153760 -165601 -92140
21493 -92140 90361 360577 24136 -42386 -44917 96610 209717 -233123 48355 -284276 92398
21481 -262853 107199 183330 -111376 -1773 97071 -48436 -121862 -83482 -78264 -31163 -388575
21470 -388575 -106444 -342617 -187642 -482163 -6349 213681 -85599 -141529 -16302 27742 171137
21459 171137 -214629 324907 -279649 7886 96569 7520 158097 107852 185178 268096 -280935
21447 -211658 93493 -141562 -192119 164711 29901 19232 174660 271697 362206 243578 238651
21436 238651 127669 448409 183837 -56953 136296 82612 94008 -13434 -45166 -147962
21426 -147962 140026 4814 -167285 -95754 -87266 143063 31959 -274600 -155251 -105875 -49905
21414 -101728 -94645 -196479 -246627 29708 -147643 290274 368946 -260719 -89487 61569 -131891
21402 -62982 -483722 -66253 35310 -89317 136519 290557 -58794 -30530 -818 -15808 -154102
21391 -154102 50084 186148 -502299 -222299 -379889 -205287 80605 100454 -243809 107988
21380 195121 -29758 -298102 -53762 -277288 -154475 77043 -118023 -60056 -190186 24519
21369 10962 -59204 -1442 -233368 -398655 -131095 -90103 -191269 69020 -315610 -191465 215857
21357 -420879 196417 -118019 34751 -114356 -45191 249992 -66403 -75372 -101107 -144514 -211066
21346 -211066 1893 -241054 -76436 50971 184162 166494 -385914 73577 -9873 24986 -339652
21334 29608 -39908 170447 -95992 -120171 -64469 163433 -44934 161497 -219971 -117104 -222112
21323 -222112 -80583 104632 -97029 -2981 106516 86866 -104362 34095 -9017 -167515 153241
21311 -109316 -160035 63654 141009 -89122 11983 71596 40134 -25925 -40341 -294023 -236261
21300 -236261 116789 -258037 -207697 88449 -82288 -75521 -27453 89965 109355 -177117 -135851
21289 -135851 -3905 -82941 169319 -59222 -280152 -83637 -140684 382563 -108518 79515 243755
21278 243755 -17072 -223417 -72572 206594 -78776 -117392 -179668 5835 390525 -197569 -165390
21267 -165390 70122 -174441 -284037 -158174 2468 55605 -250026 290567 81141 -303183
21256 -96944 28723 -136808 2117 -24951 161525 -271386 -30307 -203450 276742 -21558 -262968
21245 -262968 209269 172720 80450 66854 -68341 -149876 -398224 -25907 -192848 184344 -335220
21233 -21271 -179739 -161012 -227459 -203197 159636 -25495 -141404 167609 -158337 -47809 -273080
21222 -273080 -202111 -63305 -11935 -78265 68632 -104253 -144889 -131832 222450 74810 -90176
21210 -298764 -17444 -193753 33320 41221 114875 23427 -205404 -131984 -286512 70616 65310
21199 65310 94160 -17213 -211734 77579 291901 102289 -170087 -70755 -54068 -205419 21454
21187 138914 -141701 -141237 -148567 16675 48206 34707 234686 64774 70845 216804 -193822
21175 -350535 -50655 -180836 -119224 6424 -290859 73117 -357149 -194884 51925 40608 -26898
21163 -408529 -36265 -166824 -186335 -313261 215951 -141943 -118355 -369934 35715 -365952
21152 116496 213721 50606 125364 205757 -234267 178860 -196024 -249858 -71419 -114350 -128391
21141 -128391 69107 -201776 1566 276786 -163873 -38114 -629 -133608 -176580 -57056 85236
21129 -1239 195388 60044 -103185 -82887 7416 -156956 -115677 -30213 -365770 -74999 160468
21117 -154460 161913 -59438 184364 154343 112286 34396 321459 -199446 -162209 -162851 -191579
21106 -191579 -432267 -117032 8832 -153263 -29462 136215 -66854 233451 -227389 101685
21095 -62128 101376 2979 104878 62524 -423025 184313 -252963 -166711 110446 -83205 302736
21083 235214 -274279 -116774 -203778 94986 -4317 -235245 40438 22231 -209651 -250422 -399566
21072 -399566 -36698 -2022 -119339 -133829 -145877 -443785 74045 28538 -146340 -286781 -42795
21060 225257 -321987 48193 110759 37871 -29475 93187 153068 -78207 -109065 -430594 -283851
21049 -283851 -9980 -45263 80618 -170000 -273776 256553 -293748 134484 -1184 31111 -85127
21037 159930 197596 -281410 46887 -257358 114505 -422489 -332781 48386 -270101 378070
21026 -108433 320486 -261265 -10601 -195863 -93432 57735 -241238 -255665 10740 -39246 -276462
21015 -276462 -7966 -106958 80109 -239868 -376860 -123708 -17343 -384955 7770 1266 71764
21004 71764 -6336 29793 -68765 -105888 -234240 -17611 279684 81446 -378964 -113261 -133748
20993 -133748 -10611 268815 141337 112626 44509 -45642 -6082 -84540 236706 60739 -117268
20981 151057 -146828 14093 -136642 163222 -71389 48731 118631 104565 113473 -97532 224904
20969 -94792 -306550 -238106 106081 -14647 8086 32581 107780 -179682 -19846 -115919 318635
20957 -372252 -184874 -42606 103888 -185720 64327 -203713 175115 -67200 -35502 -41289 -327831
20946 -327831 -221131 25246 -222088 33608 -154391 19886 -4906 -71839 -239186 -179790 129061
20934 -28171 -311556 -29183 -89238 -225090 273922 206084 -44720 87300 -18343 -252244 -224593
20923 -224593 225173 187829 210840 -279445 226713 -182720 -5253 292673 -50949 -120802 -205062
20912 -205062 -177128 -68338 -312359 -204029 -293155 4639 -421468 -193301 113522 -82415 -52940
20901 -52940 -39296 -134592 -192603 -84382 2234 18585 -215814 -36516 98913 -296550 48184
20889 -44983 30616 -93146 37753 -26337 208566 -149498 -297129 -208147 -315665 57536 -393796
20877 36046 49488 69607 7627 -136965 -113553 145531 -167084 176163 -156623 -270627 64428
20865 311658 109659 -61143 135417 -255314 -67253 242051 33939 -331164 -204592 -198690
20855 -198690 321065 -76467 98751 165957 73945 -164771 -86893 -145077 -206170 -116236 -199204
20844 -199204 -39965 225053 -332981 -188884 66290 -238111 338038 -26249 -12164 141409
20833 187064 -65688 -385065 -7278 -94412 147838 178319 -94091 99342 -451116 150870 -52004
20821 -189828 -27943 -39270 50146 -43514 -93055 -308984 146338 -81011 -134377 -8698 -228581
20810 -228581 38265 126164 -29927 -47741 74189 -344316 -243851 -2930 59296 -361036 158000
20798 -221558 -85111 -12652 -374434 9413 -148136 98905 -16126 105737 -406443 18749 -65909
20786 477681 27488 -254084 361965 -235716 416188 82504 -33486 132410 -15593 -193366
20776 -193366 -297643 5411 174153 -255147 -120105 192433 -222472 149819 -62734 73057
20765 -52611 155735 -113664 682 234275 74182 -28704 -7499 -99939 -115733 19522 -140375
20753 -11481 66289 -45415 -118502 -99634 -254431 -216173 255345 -377932 200248 72769 139930
20742 139930 66521 -124236 145999 250924 179854 -155426 4901 -156237 121592 117704 -622583
20730 114842 -78943 -502303 -215274 -177413 212615 94371 -33785 -116386 11028 -429834 -21205
20718 -122137 195422 -433032 -295878 -45477 70196 56547 6915 -225221 25947 369899 -171022
20706 -118310 -69535 -138611 -54395 -54056 43387 48659 -306474 168183 28746 -133011 -36026
20694 -186452 -157546 -58204 -237500 -131625 22335 -121320 135067 -351264 -83459 148762
20683 -39630 -371920 345363 -193523 -49524 -281061 -366741 -119569 229096 -18884 -223205
20673 -223205 211340 -339761 -70269 -290159 -52221 68136 -254373 208264 140815 -328177
20662 -32629 -396987 10344 -53887 127015 33906 -175114 -77063 179839 127818 -167857 159469
20650 -120621 -82003 36841 24515 -83337 -232674 315422 -11940 235742 61114 116276 130178
20639 130178 101447 -77843 23732 -257274 -219954 12801 -29144 -10159 -105646 -59581 -245653
20628 -245653 18432 177297 -243491 -133404 -151184 -104571 -31978 68820 69112 -61257 -73589
20617 -73589 -45916 31528 -168819 131475 182721 -59167 -304552 14239 -1482 -125852 -90253
20606 -90253 -93206 -63808 -110069 62012 122480 -129620 263256 -458880 -146124 -124595 -214742
20595 -214742 -15736 -165615 37238 322162 52691 -375247 -346410 47045 69887 -393333 -18631
20583 -11011 -175201 50554 -104038 -125047 -122432 94982 -15704 118014 -137441 -105501 83434
20571 -53900 111512 -148077 -23899 103954 73896 -329479 -193292 163154 182242 56332
20560 -31413 -11043 160708 190982 -8844 -187290 -235644 272961 236485 -68719 -294422 -112330
20548 -102263 155712 49066 24893 39113 -292973 -17768 95999 -174269 -119436 -356943 -124889
20536 29328 -34253 168120 -61852 -162167 -116382 -41678 -82403 -245794 -10165 -297055 58887
20524 104541 -108860 -102823 194341 -107486 56493 151191 -185096 -67198 -52246 9104 -169046
20512 -166252 97702 -224345 259957 -80020 -47479 62654 -251526 305340 38971 123386 -68803
20500 334815 173816 129739 -246210 -97635 39409 -364770 -459714 -208641 -111576 139118
20489 -180259 -34394 -116650 53310 -27609 25912 2194 -144111 -48566 63154 -131717 -90286
20478 -90286 -13187 -119175 -228146 163706 -61123 -156709 -149612 5521 -200342 -109455 10183
20466 8534 -301503 -299393 119069 138930 7541 -283473 -122264 268847 291456 -71445 -252800
20455 -252800 249409 -51475 71946 -31663 86514 116141 -162901 -62711 184801 48290 117285
20444 117285 182480 204021 -56963 -163962 -105851 42526 25921 82042 -103566 46315 -162683
20432 52507 -210906 -42562 -84232 -169095 -37386 -215020 332528 -81506 -69659 127786 -51470
20420 -37534 -47115 -120322 168597 -291101 47381 198174 -148951 -287503 -263635 5472 -368984
20408 123755 19696 97042 -167141 -33428 -335477 -272762 -54212 -22470 102489 -165118 364525
20396 -22256 -111937 -43563 144464 -142716 -235343 26000 -60749 116571 -150116 258409 23665
20384 150439 124199 136900 -280148 -399002 150542 10357 60172 -65351 -157904 321967 -232298
20372 -440322 55633 203014 -192300 -178201 77392 30975 127753 -174087 -377214 -333647 -430364
20361 -430364 -71371 98899 -400140 -329019 98737 174138 -275816 173820 -34525 -165712 46647
20349 -139914 167928 139689 194274 -309427 97270 -95570 331620 62914 53786 -149661 -61188
20337 -78351 -35933 20844 38624 138197 114592 -118684 258921 -188171 -128508 295336 -91061
20325 -9076 3056 -140142 35655 20839 -178419 -37049 28162 -205146 130280 -29687 -160943
20314 -160943 277727 -270614 -240609 -491061 -60594 -185818 160952 -204885 -109045 -16956
20303 21584 -210809 -281973 187684 206083 -368436 -37547 54046 -56884 -1843 -74287 10964
20291 -254065 44008 -231769 51619 -298561 62701 -27717 -25701 9768 -10248 -176538 -199718
20280 -199718 -66401 -53443 119302 1244 92394 -78885 -226700 -121748 48606 -80656 -192786
20269 -192786 -245518 302992 -142137 -282581 -219819 -244855 -143948 -194006 5606 -120545 -300717
20258 -300717 -367839 -446851 -354993 -153903 229017 236099 -241283 -312718 -100154 -46318 125548
20246 57700 -303441 -107578 166415 -15765 9439 -46459 -474282 -112845 -201471 -220698 -94458
20234 -348929 -50930 -34054 -73339 74257 -101867 -219292 -347214 340476 130708 -215910
20223 -83111 207269 104548 -114061 -150450 -75212 -70859 -89313 18540 -186292 100314 125649
20212 125649 -179132 -45156 -108681 -162638 210142 15586 -22582 -196613 225085 108953
20201 -239720 22271 11922 181464 501005 -37426 163331 -539055 126503 180150 -132071
20190 30156 -135452 -274188 137190 -181353 81288 67783 2033 65708 28655 -148341 -43730
20178 112509 -118107 -182772 289060 5834 -157350 -87106 -6218 -240349 -159277 32859 16273
20166 171490 -194660 69229 -43477 260317 -46529 6437 -4010 211089 127037 294698 163103
20155 163103 11782 -203112 180058 -117204 44693 -166139 -282794 -186053 238314 -17362
20144 174685 -39903 -220151 -21740 81635 -90684 273825 31993 -25223 -41651 -86067 -146975
20133 -146975 296793 -65377 9334 -276523 -16007 61332 -69042 259824 -95363 -484612 -221700
20121 -290806 74836 124865 -42805 -291062 229451 -207738 -201769 7026 -199168 -317488 -13125
20109 381547 58603 -358456 -273080 252147 67611 -229313 -145577 -153456 29806 96694 1553
20097 -250613 36596 6141 -239912 -174736 57148 -31333 -48459 36647 167024 -101831 -189697
20086 -189697 150148 -186455 141892 76428 -69895 -14325 -181109 -105761 -44355 81808 125825
20075 125825 70932 -118778 -251830 -194053 16945 16457 251342 -59427 28976 -366654 329904
20063 17714 123822 -278330 -72492 678 170075 35944 -300200 -6825 -183838 -119884 -80397
20052 -80397 256153 40869 259712 -380024 319346 -219654 -35062 -197166 20509 191748
20042 191748 -168524 138988 329986 -64428 -20950 69624 -177753 -210397 33129 -339827
20031 -48702 -308579 -5214 -208724 236849 -130824 -75888 -158703 159366 -3805 -200179 250598
20019 -393331 -184087 65009 -121648 -8801 -322183 -119387 -205259 -156125 -72457 84771 96434
20008 96434 83501 262191 -33228 -65617 -190682 -149404 79633 -148055 -350134 89354 77878
19997 77878 17102 130994 75232 -125692 196456 38175 -85498 41019 53480 98415 -107624
19985 -166302 -377141 160932 256325 69267 98350 26462 29299 -304310 -203257 -69851 -18839
19973 -235509 159102 50647 280899 -38244 -68233 368257 -256993 -70542 43505 -113649
19962 1496 69281 -275068 -110509 -161061 -170787 51688 -74401 -117934 -168935 -203771 56740 65540
19950 65540 -131722 -131970 -388786 -6740 -84623 -58756 -108356 -196700 -64178 -178099 139788
19938 -266362 -45670 686 -137271 -301876 28584 -167758 111156 236545 -8382 222183 -86362
19926 -275676 21206 -172029 175701 79743 -292239 -61087 -13608 -433527 -99527 106912
19915 -300008 253711 258967 -102541 -421373 -89439 -272483 -121584 195275 -197284 143618
19904 -34711 -206017 289685 160850 -246732 -19740 78169 159531 -10882 -82957 -102829 31092
19892 226339 -296100 -56434 127715 -151123 -334047 -188716 -144152 -178591 -130573 -339399
19882 -339399 -385551 -250671 -25038 -178882 -221410 503 -249878 151020 -326223 -251693 -290098
19871 -290098 -288680 -189740 114689 -210985 16140 -253807 320000 -12014 -475154 393059
19860 -167262 -314886 -12625 127331 281355 -73859 -111122 -30675 324776 -19964 -34836 16129
19848 -50236 -271510 -143677 -174952 2373 -123395 -183205 46490 22834 -9353 237330 139357
19837 139357 -582923 57218 381869 -271693 50288 129764 -102951 -217561 -204824 -253701
19827 -253701 51806 -40303 211013 304980 -304069 -200350 -31204 46619 -98564 -39343 201312
19815 -234200 -62447 -3630 -58677 -215722 -53395 -163204 33784 -137303 215962 424709 80404
19803 -308662 91228 81656 253799 153828 -277541 -177889 60526 -184998 -220565 -261119 323044
19791 -226373 68968 -27396 -70881 142939 -109064 -118203 -37772 14436 85638 -46008 -126427
19780 -126427 -70982 -337469 50277 1123 -67925 92130 13828 -123838 82671 -66724 109869
19768 25620 -148175 117007 -124926 -179013 287947 -103670 168864 18912 -216425 35230
19757 81798 8093 164077 122348 372866 -373971 -11802 47570 -284893 -371552 -160533 -80565
19746 -80565 107612 -102647 -71448 -80121 -55101 57394 -43621 281597 -129947 214632 -52324
19734 106127 53283 -76460 50956 181107 -212105 344113 225579 244769 -182615 199807
19723 -341438 -365504 54197 -125963 -271587 255795 177281 -156729 -104026 93939 -155290
19712 105161 -159237 75057 -214821 -358406 -382358 -22383 -203421 95915 -53999 -146031 275425
19700 186935 -58405 175146 -118223 1790 -113277 20895 106402 -150223 254191 -204567
19689 188739 -83114 47140 6848 -147329 -11914 -183936 -347358 194535 51352 107565 77645
19678 77645 -197066 -237206 -331624 9629 -222137 15018 97038 -186514 180728 -72498 -324289
19667 -324289 168321 -103641 -166184 263433 -65502 -63456 -15738 12807 158483 -123310 202138
19655 44306 36245 -255109 -90824 -52390 -16527 -272728 104 269066 132042 -43060 -431611
19644 -431611 -114453 -67145 -374897 135615 49974 258483 -76243 276014 -30933 -365726
19634 -365726 -249742 -290935 13973 7308 -129875 -181842 -118862 -179522 -388957 77412 -232196
19622 -232436 26099 -70228 -21313 -298396 166446 10257 -163720 -28995 101082 -187653
19611 101005 312959 -217251 -109055 -57972 -79322 -214182 -72805 82855 -20162 -67733 -42018
19600 -42018 135695 258279 -258053 173656 -171321 -294679 -83622 -211847 -204796 -186053
19590 -186053 -183081 60465 383498 207963 -265355 -127250 -129897 -115567 -194581 -170828 5173
19578 33692 168685 -32691 -235208 101929 132846 -445272 157211 -222712 -355503 -44940
19567 -77213 103844 -507150 -20476 -71420 189277 -72203 -346787 68818 57764 4096 -176665
19555 165417 -329115 -3693 -207472 -96174 -241510 36811 103991 213512 138902 196363 -200724
19543 -286194 1550 29889 -327622 109690 215061 168739 61756 166220 47519 68594 -120543
19531 157904 -94360 -49915 -327395 -25231 -144707 -65654 93671 -130313 -139524 -76486 -226350
19520 -226350 -128916 -67811 -155617 14942 -139220 -30224 -122544 -234685 -106240 53672 -179339
19508 203362 -169197 -61340 -163448 -110372 -80606 148058 -125377 -168462 -15491 -92548 -93438
19497 -93438 -43446 121751 169422 -431775 -34299 -197777 -110397 159227 -120480 -34753 76731
19485 -290464 104537 -116252 77757 189471 -217703 -96401 41323 45231 30359 -126775 22140
19473 -126099 -69707 -168847 51631 -202746 -269829 -231081 316224 40812 -57117 -103433 242933
19461 -236553 186258 142308 -163740 43956 -36224 -40335 81629 37020 -198165 65123 72914
19450 72914 -170152 285667 21368 214613 -338265 -134924 -219961 255423 -167722 53682
19439 -2590 -7572 -283999 -172211 -101802 -215129 -34602 123035 -98959 -131639 32638 -164046
19427 -10820 -71965 175192 -353832 -316151 -24798 -236310 -24819 -29935 -191618 -377627 67392
19415 -73645 -260563 -258185 67490 -344060 -3059 -124857 -57713 -43770 -348744 -783 -40583 -55760
19403 -55760 -8860 -73197 142062 -177345 326076 -113381 -98547 -45464 358327 -185734 -174190
19392 -174190 184677 -135830 -170900 -45767 185304 14986 60925 224740 96816 213339
19382 213339 65294 -217940 43625 -290251 44763 241545 -63080 -95949 -289668 -228129 73594
19370 -137047 -225982 1010 303269 249345 -138584 -186503 -332606 -260606 103042 -305239 -52253
19358 -39607 200429 -147524 -180953 -90870 44661 -6293 -106845 -201558 -138828 -21550 94389
19346 15328 93243 -181526 -427591 -103838 -43285 -43097 -463013 -31103 50555 -70633 -388958
19335 -388958 93012 -195803 -127193 -344366 243545 122378 117000 -322382 -84263 -436 6695
19323 -88859 82795 -358155 -316952 133075 279 163693 143468 187978 -127787 -200878 8517
19311 150471 -321122 -321300 -307089 -4137 -230383 -21563 199231 -69594 -122295 -132214 -290305
19300 -290305 -152314 -420003 -20398 -9566 -175039 -229354 -106120 -131987 39887 29329 37222
19289 37222 -267357 95615 89632 -48198 -109655 -308548 -221122 12487 -24097 -370141 30400
19277 -160231 53099 -90688 -62301 -42062 -114010 -253666 -52610 -97580 39930 -172999 55959
19265 -198122 -46392 -9646 -429060 116099 -146586 -22166 71598 -22218 -46333 56869 -305669
19253 205885 -139224 -223743 185053 259350 -72859 97915 -339039 -71430 -206678 -38512 72224
19241 17610 -132181 -228273 -128549 218222 242390 210226 317307 -281128 108622 -236550
19230 -69150 -291394 217859 -21700 -131862 -65790 136173 -181837 184775 1640 -43695 107445
19218 -79832 -93535 -29362 -73908 332878 -46067 -188994 -104250 -281865 -181610 109604 -141271
19206 -256018 197697 -334530 -125678 -208988 65059 131132 102585 -125214 -17513 -392859
19196 -392859 -32402 -184796 72105 -184225 -268846 71106 -190216 -81198 -40860 -182466 124203
19184 -105293 -154573 288800 62718 -281153 55439 -89521 284561 -301675 -346709 -11763 -168307
19173 -168307 -257611 -304707 -152919 -362758 -183387 -112286 -119168 -108890 212616 53415 -190168
19161 -84739 -69568 36181 243632 -21434 -128883 -102668 -37655 -171354 -47021 26319 -190399
19149 -123403 -154838 348496 -59251 -426481 -295486 2335 -264364 32396 -254904 157252
19138 -195737 -230300 -67685 126382 -195614 96797 -111730 -270572 34085 176366 220086
19128 220086 87277 5504 -127309 -131516 -168478 266927 -81297 52767 31016 -246376 -209909
19117 -209909 128823 224950 -240281 -1198 -193395 142579 -225382 -184676 -119992 -127016 -97178
19106 -97178 28433 101483 -241797 -235610 -315233 -41417 -455278 6465 132901 80914 160591
19095 160591 84427 -115084 -385846 16247 275032 -288132 -182239 -67960 65728 78050
19085 78050 -146906 -191351 -52274 68669 -148658 -80916 -137104 4876 104781 314302 123015
19073 -120341 56129 -277765 -20038 -315057 -20669 -159330 279005 -55143 -142908 -270840
19063 -270840 157916 13018 169089 -23475 -173400 26614 -99857 163592 -154727 -11025
19052 -54179 -146565 -197055 -235176 -139042 -110127 137798 -54964 -68666 -183611 -198017 278257
19040 28468 13561 -51265 -101539 -513648 -134427 192829 63412 -16749 -122165 -157394 -238364
19029 -238364 8956 26890 19823 219194 237491 194360 -16589 -116058 48209 125055 -68464 186920
19016 -235715 305096 -51433 -41029 -36383 221919 -311956 311178 -216060 -181382 -19419 43485
19004 -17666 24271 -157197 70259 -229735 -382618 -187217 -41969 -201599 194368 55729
18993 13926 30142 -142429 152053 -316704 106830 -96108 -124062 236420 121304 345010
18983 345010 6315 58813 -68432 450321 60730 -93490 -11625 -100729 -117528 -167634 -23433
18971 -60406 -550703 -365880 -39097 -335772 -227897 179083 191933 -140426 82703 69662
18961 69662 35500 107271 -99088 -349779 182456 130156 -212042 -231810 -13022 -240534 277073
18949 -63316 104254 83060 -186166 -82937 -159770 -70868 90951 332662 172012 40422 -151862
18937 -13895 -536663 -38451 -320092 126611 -194667 -125797 -225781 -281098 80756 88717 -71099
18925 -127963 -300982 93879 41908 -40767 -55159 -217545 -53881 222148 -35031 -120652 -338297
18914 -338297 389596 -183789 -116559 -6407 68236 201464 -263486 -166989 285788 -237903
18903 45447 181297 129084 105851 769663 -75801 -74392 -74628 -82629 -4777 -138362 -139868 -84354
18891 -84354 -58149 -123005 -69663 -259179 -128230 -40446 -109661 36294 -85960 235078 -138786
18879 252017 -15335 167927 24361 -141160 2179 -116244 127116 -294035 -508068 -187744
18868 -39054 -73161 -281998 305962 -467950 -126248 152437 149968 -36778 26154 -88282 -127574
18857 -127574 131254 -4414 47201 -22071 -25615 -163877 -210176 334482 -215702 -219887 138936
18845 -111802 73109 5138 115937 125937 -153675 243083 -61419 26903 143847 -150711 27635
18833 -17143 73342 107947 22931 -67361 -158048 -172012 -219650 399572 -49194 -89450 -431073
18822 -431073 -157826 -116237 -139996 9142 172608 90790 257901 15353 -103764 36762 -322080
18810 81767 198474 223064 125307 81611 202361 -417595 -196925 127658 61493 145897 84258
18799 84258 -89171 -17636 123854 133348 -106188 12483 38948 125478 -229039 8914 -290794
18787 -274938 -158524 -30440 146736 -166567 -47095 -123149 -7818 59685 -60844 -182460 34118
18775 -84584 251599 -109289 82552 66347 -311314 -186350 68226 -529265 -46311 -230573
18765 -230573 -80868 -298671 280970 -112308 -125773 58172 149105 111237 -123735 -201111 -103771
18754 -103771 -229710 -300357 5985 -223943 -152527 169807 -3717 24072 -66559 -170264 -13473
18742 -173904 75232 -16877 -147538 -282428 107399 -328706 86267 26777 -327335 161622
18731 -185048 132283 -68027 267048 -194759 170286 -127966 -23457 11297 284649 -36125
18720 -289095 134901 323687 -400380 -188299 -267524 -171197 -236689 141926 134631 -98388 -114072
18709 -114072 -423964 142428 -52358 -552548 -234808 -290442 28081 -211366 216437 -133892
18698 -394981 121492 97149 -312058 -340258 104196 -220504 -334661 -91573 -392630 -149690
18687 -222126 215185 48223 73736 167315 -196047 -118014 -15944 -325058 180440 -167363
18676 82005 -91796 59386 227273 94571 -51054 -178968 -63222 312710 123775 19483 -204366
18664 68753 -6399 -105968 37545 -460337 149733 -138911 31893 23876 -99881 77737 125190
18653 125190 -31966 -214315 71121 290093 357455 -242677 34076 -97662 -154636 127761 -60724
18641 243781 182729 -166168 -137210 -236372 -60771 -12193 -32254 -210450 123838 -302142 -15253
18629 -101722 111485 93483 5279 -280957 -420116 155733 -98491 293958 67323 -203627
18618 -122990 73259 -146858 -502368 30311 -97584 -137877 -305471 -130928 -118462 -36458 -223854
18607 -223854 -162494 -43711 -81511 -53813 65412 -102546 51502 235897 -239689 180716 -235137
18595 -271182 215556 -405276 102983 -84994 -343762 298370 120551 -237507 -26740 -192705
18585 -192705 -237619 64433 86918 -74450 -348874 -56704 -84733 39 -149190 167510 172466 135467
18573 135467 125757 -187251 -107112 91664 277450 139654 -339173 -59758 187160 63962 -211862
18561 -378508 -157738 365394 -256956 -182470 -155663 4048 -138475 -143102 113682 -139397 450190
18549 -36552 123327 -29247 -98115 -117636 -267239 -100266 -183827 -246351 411336 -298130 67316
18537 162423 89738 -40319 -1446 -115147 -140771 51530 -249743 -78681 -247668 -147350 64822
18525 99091 -244091 66920 91318 5183 12433 -261913 -130127 -116753 -72911 13845 203549
18514 203549 -47619 -137223 3810 -244654 -82515 -247350 -127482 -171413 -342074 -119163 -38325
18502 72420 -13519 89888 -182082 264949 -472281 -140416 -130978 -344394 -199639 -144165 183551
18490 121127 -194680 -151809 -151183 -170266 -65668 -50053 -184758 92746 -120178 375683 -142327
18478 75621 -125331 -13911 -329231 94189 -35847 -99072 -153341 -140752 -11713 138027 -46612
18466 110497 -231970 104713 -191757 -20271 64376 132836 154781 -335196 -211552 -9535 1555
18454 -55360 6173 -75521 160578 38452 -76289 -123400 -33959 -133661 135702 339527 -53128
18442 273084 397886 109652 17309 -159778 -204393 -40283 -213062 -50534 256834 101395
18431 -212765 -46029 -95196 12147 -119137 39467 72393 397778 219194 80603 -77062 71636
18419 -219506 -110732 476919 -93227 311661 65656 35782 -8960 -282491 153780 -126285
18408 193607 -145889 -10929 207670 105901 98793 -14821 -40025 -203828 -173506 -47581 -234913
18397 -234913 -40799 -13048 -44282 -158792 -379346 -51023 -59850 -148320 182010 687 -222149
18385 -54702 -89296 179585 41846 -59301 -209341 218801 175747 171735 -215859 -123265 -131215
18374 -131215 -168994 -67652 63139 -485056 -182375 193414 -66614 54629 205788 308726
18364 308726 -46441 -42828 51562 113575 105533 2039 22332 -188091 58680 -224206 -125615 585995
18351 121102 122656 94223 2910 33077 304128 -150510 -28714 167905 -57156 -276105 -125569
18339 -147505 -283897 14317 -72491 109670 -1588 -112753 148436 114650 -14047 -29385 -33833
18328 -33833 -113237 -203731 -122528 -141388 63100 113126 131924 78710 -298142 -263444 -107048
18316 -542 -133655 -156663 -60488 24663 230450 -84542 -189031 -56306 -87241 57726 -77793
18304 170085 -182708 114010 45871 -23972 -181618 -209930 -394294 84728 -209367 -433458
18294 -433458 143584 -244801 106443 263256 200163 238483 -161725 153961 157613 -158586
18283 -60899 -59806 82797 -49407 -159052 79049 -40497 284319 -65041 282029 9014 -159280
18271 -494703 -87340 87116 115241 -101236 -70706 -323180 -119595 -290060 -245965 -112964
18260 26562 318968 585333 192135 -40707 -141129 -68831 221962 -117966 -4482 -91553 -389972
18249 -389972 -206343 181867 -91949 87954 58833 219905 47839 128812 -99252 -507952 -222011
18237 -327255 49414 57320 51324 -243527 152723 -121071 47862 74721 -17888 -132453 -34615
18225 -33143 158634 309660 3157 144587 -85832 -124688 -53308 -37538 240631 -262634 -66673
18213 1246 -373659 64817 25192 12303 -15409 -221010 -225379 -386142 207545 -215501 -404945
18202 -404945 -410202 310941 -75007 -193440 -6262 -529187 -31184 140044 -96632 31002 25708
18191 25708 164586 -73512 -81548 50707 -183500 -187097 218188 -386768 -148105 -332430 -91828
18179 -54919 -255219 137055 164667 -247763 446489 14495 -15828 36469 -234725 16861 -182868
18167 -167946 91887 -35999 288806 21294 -35079 -239403 231279 141655 -116829 -217991
18157 -217991 -13827 141325 -184860 -162512 12394 -256748 111924 65209 -264061 67169
18146 20405 198968 -19723 -21513 122287 -52284 779 233429 184912 -106612 139446 -271810
18134 -445122 -155428 -293376 167799 -188537 -359417 -133954 -14500 3771 -129771 -683279
18124 -683279 -591049 177278 45866 -204004 -326218 122941 -102906 -328580 147633 -99991
18113 -48000 -120514 38029 -261962 -213111 -221552 212522 -95762 56397 -236544 117365 28641
18101 42022 -472829 -209673 117978 -7845 166069 104955 -211781 118451 -211983 171439
18090 71718 234720 132116 89913 292252 65841 -141283 25242 77997 343151 40192 -262596
18078 56888 -206703 187037 138315 -130601 163630 -26782 -37558 156959 5409 -368827 -6494
18066 -44184 12671 -229468 80955 -62775 245823 67863 34496 -335153 387409 -159418 44830
18054 -17835 145287 152686 179558 108736 -179917 -120098 632 80682 -43256 -355608 -75163 104559
18041 -324230 192811 -306102 143633 -14491 375158 -195795 -65442 108466 803 121420
18031 121420 463997 -182674 -273194 -142730 -207856 31160 193244 -96817 -102620 79045 -261508
18019 1894 -238216 -15303 114257 -48280 367329 -135013 -17025 177440 152356 10273 -8524
18007 122682 -42665 -171090 164281 -40932 -91328 -23466 -124410 121325 117295 -207128 130324
17995 -48063 112182 -199910 -160366 -20847 -127292 -252610 -250557 -265310 -96893 114079 -192218
17983 166235 -155535 -247391 207862 80763 425721 -238692 -135071 54675 172843 85498
17972 240406 -456249 -9258 -92772 311776 -361707 156968 -321848 -135885 -134141 -90259 -336287
17961 -336287 231590 -50807 45835 -366689 -37851 -373366 -173915 113137 -153520 -2302
17950 -145514 -15447 69160 -164104 -368466 -109839 -142926 276371 -123869 -164222 -35653
17939 162139 -93480 -179193 -43812 -97768 63176 -169628 -126963 356340 -29584 15256 -270524
17927 -90999 78760 -82591 -111809 -61345 -2383 -15275 2560 9950 13150 -242591 -290347 59635
17914 421342 35469 271449 160074 -184937 193683 -89715 -44087 65744 -366334 -112939
17903 -222255 32023 -74135 -55969 -121776 -163178 87607 20485 52768 -84286 -46575 -331657
17892 -331657 49132 -59761 -175004 12741 -92204 432813 -206661 2631 29607 32721 186690
17881 186690 -293154 41393 -179667 -176013 -18771 -63010 203984 141316 87050 81349 95228
17870 95228 -137600 45014 -223817 -403543 -80692 -222445 -43480 -139696 47873 179560 -33423
17858 -140171 341174 -18328 -17478 32774 -107505 -72796 38428 178786 456808 -362342 -30044
17846 204008 116858 -78762 56802 39634 145241 -71561 -92531 32237 2301 -111932 -118598
17835 -118598 -40552 -116034 223702 110634 -232929 -88594 -40078 -259630 -69007 -200623
17825 -200623 -290172 -223569 -267748 -42423 -142330 -308643 84437 -411790 -48954 -63098 145328
17813 103537 -473018 162699 -28399 39188 177974 -141059 -213481 -174164 -49651 -132806 -230037
17802 -230037 -123643 160267 333765 452091 -210098 -307404 -3706 123399 308641 111325
17791 274512 -266363 -30322 -28485 215699 189765 54572 211308 -239370 67714 303119 104582
17779 -224243 -24552 -44380 -199064 -64619 -409804 278085 -54072 340762 -168903 242151
17768 25169 -219145 291530 -244411 46377 337872 -376762 181025 -153862 132236 -27209
17757 -172447 211547 366681 112311 24392 -100202 113649 313206 159916 -149178 159244
17746 96405 -60750 124780 -35792 -57089 38088 87235 -106917 247189 -361243 -79767 46182
17734 -4727 -218963 -144169 88170 161176 166125 305510 225381 -119145 23183 -195929 -171103
17723 -171103 70637 27941 -231209 -187144 -65648 9462 277076 232762 10968 -34096 253212
17711 -192275 -50198 259901 -36174 77186 127501 -126635 -173009 -128890 -255607 -181972 -308621
17700 -308621 -9631 -82596 103470 -381046 192147 190933 -139208 260002 -137608 45810 -96688
17688 378495 -188995 -9535 269380 -23887 -60282 14616 -212285 88962 -124969 182516 66004
17676 -229 190755 128780 50349 13574 48301 -201634 171728 -111462 -224747 120146 -135127
17664 108192 63426 -128444 54445 99109 -20009 88927 79290 -83299 -60695 -41755 283674
17652 474210 -161355 58996 15684 128815 18559 -58335 198767 111234 137875 95033 142055
17641 142055 356948 -290389 -62563 -230543 -60816 290619 -174319 -188412 -61199 78592
17630 -142236 -112088 -215294 94892 52326 161202 -245602 -98927 -104250 35655 134890 266127
17619 266127 -102017 -84339 -215359 184957 -175122 -189884 250713 77557 197905 157854
17609 157854 -172732 -134352 -57870 -33926 35223 -44917 -281605 143411 -49403 -263705 114624
17597 -113802 130276 94970 -151261 37492 344826 189562 432 -48623 197500 16473 -30557
17585 -165783 -329471 -117833 -72136 -127951 83924 64020 -1181 -175895 -69396 119933 -72645
17573 99210 -163905 58733 -25005 -184799 81350 322263 -79568 -18316 28887 -67561 -27804
17561 12985 289334 -264759 314096 -39139 175391 -283052 38453 182730 -151363 185519
17550 33702 98567 161829 159986 329032 278899 -61047 -385434 205998 -56598 -135863 -221261
17539 -221261 119205 12150 95259 27898 4082 173684 -138053 -46201 -107379 174328 43536
17527 44016 -12820 -205717 86218 385981 279344 -136532 348505 -111488 -65555 -79731
17517 -79731 143263 59311 120610 227354 219958 -95842 215117 -150047 122412 160288 40847
17505 94199 394659 -245588 19870 -47198 213899 122590 -137299 21811 67573 138541 22021
17493 -20511 623 209631 261089 132357 386068 30697 -27425 -109761 -29131 318332 32017
17481 -110776 254911 11809 -27553 15150 326532 303683 -131102 -255281 204575 125205
17471 125205 -46393 394425 289469 -113461 103675 242203 29381 218455 -48958 113144
17460 116290 92005 157975 121428 251128 224139 -35199 -143634 213767 509134 120753
17449 120822 651297 106029 104735 418868 222946 53874 558009 246833 44722 -120514
17438 271853 554246 414537 212470 328468 136077 116028 264109 -97428 164085 115137
17428 115137 69712 454732 397337 49393 323832 238464 122654 -45722 109706 395868
17418 395868 463057 -80707 64945 253049 288907 339172 325041 -422574 347085 237218 67152
17406 211713 279785 85958 32958 226558 108865 59841 80488 173192 465096 476905 210657
17394 281303 252426 -274977 314556 640229 104874 291910 201137 527910 -67834 205787
17383 254850 130818 -208478 144356 276658 -174683 79499 232910 279114 499843 41708
17372 -192397 414605 141858 -60506 245825 151705 271000 1299 -85684 -83599 82210 231770
17361 231770 16218 270080 255756 -27542 123075 93823 24746 179013 -55982 314164 -39499
17349 334279 195623 119438 312768 146379 96572 -98143 -37657 292528 300688 74874 352024
17338 352024 192620 190798 -51650 106171 235708 -51076 190528 82892 388202 251137
17328 251137 199223 -144589 502643 154821 -28571 162544 131447 506491 142418 155921
17318 155921 -52465 27131 58633 144751 231922 95108 81589 359337 234458 278035 192352
17307 192352 -209628 -49023 424288 98551 269442 334038 331769 286874 75603 264923 155128
17296 155128 123708 267682 -57397 8188 -47429 398728 -67510 142688 -10845 71659 -3903
17284 154816 180420 66252 209821 63914 177822 27494 -48820 558223 341011 93692 504841
17273 504841 142231 427193 102662 87797 63792 354751 -230271 343347 155876 -82118
17262 142809 224764 421721 186925 154251 77516 443930 102995 -199243 613218 77201
17251 306370 147438 115492 -126740 347374 331402 290079 54336 312696 -15122 38377 -60873
17239 312509 42941 333054 -32596 21673 458787 -124335 -155117 -164671 80931 654963 97206
17227 433719 93553 -29959 -148261 104372 271129 328068 -3912 -149779 95604 387431 354142
17216 354142 265527 286624 187210 225033 241344 440363 394796 424893 153186 551114 256271
17204 362461 193205 333106 128469 250363 120236 473416 125824 459109 122027 347242
17194 347242 171432 358290 283771 202401 -122262 -159502 -106715 325260 185769 418218
17184 418218 120133 399980 46985 327165 94072 -94494 344365 325984 320826 551421 77107
17172 177718 227014 490442 197039 283181 196199 -283987 214313 114867 332044 172656
17162 172656 228009 -134620 349137 437210 293529 253494 320010 8781 313188 344384 162793
17150 422948 133674 95389 448412 318597 455016 45680 510363 270972 356610 237692
17140 237692 190064 416839 117424 360010 68763 416092 359473 252869 324552 222358
17130 222358 616697 -29570 462637 335978 477755 298909 183642 283718 539925 242837
17119 452574 20015 431990 150962 294419 247331 25878 515815 428319 288375 323708
17109 323708 319868 339730 578035 401173 291517 67027 194610 683819 410591 51724
17098 221423 496693 558767 167571 443327 904707 460812 178319 384311 407417 334425
17088 334425 601934 403896 436229 302571 469251 681633 519523 43845 193217 257082
17078 257082 627165 608212 640877 449354 719968 496874 251098 478960 252444 379278
17068 379278 447466 359284 789059 187461 288452 219228 722067 551597 473203 391093
17058 391093 381583 346988 823470 560341 296810 526709 644184 544886 442090 603285
17048 603285 556113 504547 714226 534677 756957 607522 301586 753369 765281 379248
17037 620778 630766 558950 491073 172851 768126 575068 614232 558866 261621 338652 806726
17026 806726 314038 655259 1048971 526831 472491 845461 429039 847900 555769 454042
17016 454042 503604 623182 560262 664339 977073 651519 472215 745458 626438 1127463
17006 1127463 858718 586540 499705 501190 780203 928532 878940 489115 617751 513565
16996 513565 861903 756015 804184 928921 476971 380089 576787 570476 718953 859311
16986 859311 969987 823730 665520 740044 921082 818593 1026157 983911 974578 921234
16976 921234 791873 553535 780647 1004489 852500 884021 784684 898699 816896 987544
16966 987544 1221959 647597 758733 1044962 966295 833076 1005043 1370047 947459 986905
16956 986905 1233578 714298 761561 1031069 985010 869499 971165 1266904 853548 1104074
16946 1104074 923804 1068757 1016460 1200041 1236554 1084075 1179880 1206619 1029164 1136432
16936 1136432 1156385 1180211 1369562 1193335 1064809 1445674 941534 1399342 1412456 1201535
16926 1201535 1359958 1372175 1594126 1493538 1231852 1329805 1610570 1446649 1492976 1328553
16916 1328553 1137406 1371291 1746674 1302076 1498851 1293151 1022606 1546996 1431107
16907 1431107 1501370 1578080 1512378 1067261 1922671 2148408 1979105 1618660 1797681 2009710
16897 2009710 1804937 2037919 1947399 1788593 1851954 1963953 1911283 1992465 1899912 1720873
16887 1720873 2148337 2017761 1597029 2281993 2237027 1981230 2220337 2242274 2174846 2341651
16877 2341651 2480204 2434868 2353077 2389748 2241720 2346919 2463437 2803097 2465340 2388490
16867 2388490 2584342 2373049 2454588 2622915 2459451 2867725 3060115 2706853 2798652 2672691
16857 2672691 2757880 2937826 2835944 2939426 3308816 3318689 3218611 3034366 3409015 3616684
16847 3616684 3007689 3466164 3609233 3705980 3671697 3507321 3718523 3670627 3632935 3782178
16837 3782178 3850844 3780933 3918478 3975638 4473818 4198139 4408035 4315102 4633766 4553162
16827 4553162 4337984 4895023 4539831 4919370 4894981 4776432 5280930 5165010 5232981 5173237
16817 5173237 5455261 5656283 5655674 5590244 5719726 6032293 5953238 5983093 6359814 6912777
16807 6912777 6540838 6953793 6934249 7130175 7112465 7598573 7592257 7936338 7659071 8195917
16797 8195917 7979757 8691793 8788033 9070974 8891846 9519118 9534216 9653293 10160591 10574833
16787 10574833 10394544 11241707 10972859 11269842 11801154 12097486 12593622 12924137 13053412
16778 13053412 13738661 13790701 14571751 15108072 15273194 15742500 16179364 16814900 17599357
16769 17599357 17968077 18118951 19243906 19804242 20262716 21262190 22098913 22954049 24048998
16760 24048998 24618297 25753315 26796599 28053867 29231207 30437632 31608167 33128874
16752 33128874 34395953 36037002 37702751 39072417 41289761 43056994 45502211 47935902
16744 47935902 50155505 52749744 55396354 58440679 61354318 64933267 68305231 72623461
16736 72623461 76318315 81011989 85475048 90789798 96179074 101830797 107474525 114179083
16728 114179083 120721506 127399370 134611372 141766884 149058063 156640496 163507391 170591396
16720 170591396 176789272 182114552 187051375 190417847 193187529 194652745 194597038 193404598
16712 193404598 190963492 187352444 182570671 177003808 170383226 163545441 156426135 148878209
16704 148878209 141570029 134101629 126272968 119364690 112213429 105900114 99419805 93984390
16696 93984390 88042424 82955023 78484953 73864568 69642333 65599018 61831413 58858947
16688 58858947 55026188 52371631 49570520 47075396 44466785 42485147 40500399 38660475
16680 38660475 36385701 34996792 33527383 31765541 30125825 29068270 27728853 26539162
16672 26539162 25896577 24587939 23250499 22830112 21701944 20780930 20166850 19399543 18696891
16663 18696891 17985256 17608583 16613479 16126743 15596128 15298823 14468024 14256337 13866584
16654 13866584 13265161 12931483 12350045 12199770 11808987 11298685 11008014 10617278 10489318
16645 10489318 10027489 10034702 9189145 9624362 9112795 8709171 8425829 8461468 8509196 7983148
16635 7983148 7697351 7470081 7619910 7232576 7202405 6934086 6600198 6718634 6480983 6706690
16625 6706690 6137025 5833274 5756923 5673964 5335945 5391710 5442393 5512554 5097060 5005705
16615 5005705 4645408 4546547 4681742 4715617 4421932 4819319 4212197 4201703 4218557 4278480
16605 4278480 4132423 4191292 3965212 4004864 3731744 3879140 3705414 3285767 3394325 3437265
16595 3437265 3195295 3430065 3525783 3038289 3023264 3303282 2846293 2989748 3136302 2869140
16585 2869140 2681695 3050119 2960006 2905461 2274425 2570577 2632275 2440997 2399958 2187065
16575 2187065 1987480 2288207 2518596 2282382 2322359 2401160 2167760 2484613 2206264 2046368
16565 2046368 2175268 2267885 2282612 2192118 1914330 1861675 1739170 1942582 1809491 1604302
16555 1604302 2015543 1789745 1805306 1598682 1615229 1559704 1552919 1461950 1496551 1821336 1574335
16544 1574335 1463349 1431669 1536881 1580769 1872473 1466472 1461725 1400790 1649790 1414984
16534 1414984 995381 1091600 1347612 1263127 1342423 1247232 1396642 1626827 1029219 1349485
16524 1349485 1007795 1446408 907701 1144645 1198676 1113736 1060584 1173089 1116669 1258297
16514 1258297 1032439 1129979 1276364 1072541 832139 1207044 1003897 1041399 1230076 1255851
16504 1255851 973873 1046603 740469 1205378 893311 1115600 931357 990230 522776 877717
16494 877717 1035105 962035 865430 669863 940029 873395 1136484 810904 701923 912209
16484 912209 583314 857003 847403 357080 488650 270430 476565 366659 1026108 789313
16474 789313 576110 660216 672033 526319 795657 520387 432834 687636 796309 515097
16464 515097 597958 780619 806671 492647 818297 914558 783925 202435 579502 544283
16454 544283 405762 823351 786638 611017 628264 301591 580889 393275 603932 398810
16444 398810 777888 354075 856719 231293 588940 319864 549323 612758 564642 697872
16434 697872 488209 567372 486199 358796 282617 349464 562198 567110 516151 61086 390802
16423 390802 207432 570987 264695 611137 309875 194964 253408 471793 676194 512754
16413 512754 501110 504492 594486 325862 236007 424978 501960 197017 618865 -49667 454391
16401 199185 170908 495179 173207 312981 -102274 374991 371096 -31496 481298 379301
16391 379301 497071 -42421 416075 439976 241700 364092 537658 381329 -50710 261940
16380 330781 532529 419948 357340 139886 354294 98430 333291 461393 380142 431994
16370 431994 514873 -49039 451789 693932 210546 197416 303513 123515 160594 102414
16360 102414 311126 240716 393829 197040 298341 253527 262224 346868 54473 463775 58551
16348 127332 -86002 -37575 378970 145211 517488 176945 232310 -353876 286351 355031
16338 355031 244945 109039 233900 410037 229416 307178 -64359 381109 159810 280289
16328 280289 294310 65566 -166002 163061 202299 227102 -22591 176806 136357 464505 385800
16317 385800 343249 -151794 64724 311284 173819 182606 206917 -169834 4077 20826 -26901
16305 135062 185002 144411 -58830 478707 122689 135391 223208 266198 179893 326614 -161770
16293 -20371 176443 24933 158985 192021 153847 403772 299178 -54826 472896 185828
16282 115756 144893 252738 257535 36945 274530 400841 -67646 274105 -29630 288432 480436
16271 480436 346787 -135049 45365 196741 -219669 283014 -21578 -164524 160147 292563
16261 292563 176083 -317854 -22714 60611 245190 202606 -72176 274846 -118207 107446
16250 -149493 -7632 214797 434229 217142 -115910 -1191 59761 85960 369591 430249 -200678
16238 97492 149922 205362 -56875 316492 450580 114278 -197680 -30309 -147229 200176
16227 30489 85881 334937 36002 234733 144915 174816 203707 23517 -126833 335502 235055
16216 235055 -2875 -254440 257453 109351 -105605 -31720 461613 -75217 -50657 294072
16205 69138 -53302 -271504 122121 -50531 -25775 -210323 39435 128518 -393149 85028 -55210
16193 75952 29421 -74603 -32388 16290 73948 113451 235159 -179384 321092 148304 -17098
16181 -144940 312434 223484 36433 -187536 97837 -130448 -59869 489482 21547 150637
16171 150637 11524 32211 231927 -109252 -207373 117793 94379 240111 -298002 -47974
16160 -171968 -301015 128813 -34008 216411 288701 56966 43805 96231 -85932 181403 120906
16149 120906 -11598 45301 122146 -5200 -226041 -39349 207856 -124104 313551 -39925 -175631
16138 -175631 256135 -10504 99251 -43885 179713 -51435 -176156 -156505 -37891 -23380 -69130
16127 -69130 19861 -149340 476465 283919 471656 405232 21106 117416 -92813 119925 -251102
16115 308619 -194485 38127 -131962 -123319 5498 248632 -210901 -260777 -60743 49101 25320
16104 25320 -72454 -251035 24408 -287886 -244845 -138658 -206665 128142 147282 157877 108246
16093 108246 59483 26295 -256195 -75488 -240307 -173876 -273194 -118512 -71333 144685 56479
16081 -204297 -309151 75638 17442 106594 -12851 -192157 -62956 -259343 -40718 -145305 -271884
16070 -271884 24580 -101452 191666 -132746 118671 -51025 378534 111415 -171714 -23970
16059 -156528 52405 32862 -266887 128061 -308021 -42369 108581 -178512 229589 37536
16048 -122604 152812 -199448 136841 -67432 17036 123981 18012 -24546 -145528 -226691
16038 -226691 -317670 -130570 -14895 -80733 2399 94812 -104847 2418 95368 316493 -36270
16026 322443 126833 -141322 142080 -163777 28204 196635 -175440 377180 -235587 209548
16015 -127248 -235060 -208559 14806 173378 -87017 -139762 233392 27654 186333 195803 62053
16003 54229 228572 -39632 162050 -183571 167158 -123258 -191873 467728 -192930 -28962
15992 -26660 -11367 36585 148825 -148507 -69652 103204 123161 -257092 501676 382920
15982 382920 252376 41121 328070 278048 10736 110615 -25806 -121882 -139893 -169567 1430
15970 -56016 -100045 53827 207491 177372 -252063 22102 178260 -47628 194058 97940 -47788
15958 58816 -107599 -70841 -176519 180103 -62343 -375291 -215417 -222652 114253 263275
15948 263275 184646 -159852 79562 127247 -429935 -27769 201260 -9831 -27445 -142259 -159777
15937 -159777 256729 -73171 42685 -270650 -110521 -4839 -105548 171572 -367180 204942
15926 -84320 -189160 265165 45249 -204796 -172568 10759 107947 -273919 -71561 -154786 -48084
15914 -192091 158668 -466270 117049 259019 -17369 183803 -187973 363720 81879 -185045
15903 -177543 -85973 293815 -265928 287220 137467 104718 2764 14463 -199862 -178548 -205083
15892 -205083 -566487 -52091 -70848 -35936 24000 310216 198677 304762 36036 -178420
15881 -216526 -96281 113479 -184170 -181479 -221649 206016 -168800 -34139 -59863 224288 -240444
15869 -583278 180288 -449713 -38042 -61694 -418544 -421489 -267613 157840 127886 319371
15859 319371 -128479 75521 255087 -16022 -188859 113492 84900 322864 20645 -221280
15848 -356603 23132 -97575 -19508 -306262 64908 -149571 18503 133206 -36941 -198190 56736
15836 144214 173360 -84996 97299 14331 56751 24966 -179905 -82892 -81935 -120674 -91504 -65476
15824 -65476 44469 100699 72338 74217 -119519 -43793 118919 -295705 -50241 127921 60001
15812 69241 -388845 -60366 -56253 -93766 -110104 25680 -39016 216398 12889 -32498 -139240
15801 -139240 337845 -86157 -80493 -259462 220798 303411 45697 -127725 -203131 -198018 -77541
15789 -202854 101811 10808 -81853 -143513 -79092 256795 -49127 203084 -16045 -133434 -176171
15778 -176171 58340 195912 -78501 -2833 -78425 186292 39065 148888 -156369 158312 26727
15766 124136 5725 42309 -157868 33590 -8878 -328943 122864 -207399 147666 499207 402080
15755 402080 -191365 216427 -111231 128723 -194103 76484 -28865 -99895 -46607 -26166
15745 -26166 -37250 -65942 -42930 35906 136817 -134064 157202 -17388 -55379 -380405 -368341
15734 -368341 -35902 -36966 99889 -160631 -365384 20311 -255795 -273720 -98616 227315 -613301
15722 -159298 131101 12863 -437578 10726 122032 108995 -21572 180119 207053 -246050
15711 -58586 219805 -83403 49028 -75914 -136514 170021 -148995 -231392 -189291 249702 -274839
15699 -22456 68082 260491 -343479 178388 100305 -215033 63851 -117042 -97021 391085
15688 149546 -105849 -271142 123412 134182 527093 -149961 -479885 81562 -273287 -104694
15677 -99645 -296622 9775 -66156 15301 165017 263233 252205 202792 -912 -116239 -39775 -43754
15665 -43754 -93778 -79964 26099 82227 -62846 -300931 -83141 -516937 4221 -49744 -224148
15654 -224148 23873 -118755 -223336 -262742 309269 -97641 176481 116247 50260 149333 -137184
15642 185290 -248660 -116747 17296 43565 229748 -11054 -95037 -30393 -70225 13228 -42609
15630 -230883 -109482 -280803 -53763 147466 -359625 317707 -103093 105554 -23617 -19013
15620 -19013 440350 1313 69570 -27115 -245549 2818 -304403 92382 -7611 27057 -153894
15608 96087 -80178 -67798 146638 -109316 -130968 -203887 61596 -453672 -74258 -38616 250345
15596 -303553 87814 -54988 147224 193585 -391584 -111865 -421397 -69109 -179036 -81464
15585 76124 228133 -86503 -238161 -97542 -150452 -37952 -46849 40504 -45714 148896 151892
15574 151892 125323 -20044 -18899 -94348 76292 -257294 2670 201229 -62400 -325484 24678
15562 28085 40568 -252496 22953 44541 341680 250390 275611 -150940 2646 95080 12591
15550 -182447 48512 90862 84459 -198249 224599 9811 -33035 25832 -13379 48736 160373
15539 160373 187345 -153825 185595 -242479 223844 226800 -283820 294676 81676 47899
15529 47899 -338131 -110526 22512 -20507 -139172 87014 177702 175886 82586 -199902 176625
15517 -98437 -400547 71271 182992 38781 -119322 429388 -235279 169216 -237646 47830
15506 -68072 -284019 -12010 -89624 188387 -288526 36052 -480939 283013 -193953 73503
15495 -215205 161378 -92771 157473 -73436 47759 -14802 58593 -50975 184305 -72222 65366
15483 47529 -97231 -312664 146031 -29333 -244668 -54009 195363 6806 56467 -42674 116115
15471 -252196 -143225 -95472 -57277 -236577 -162733 -135701 -105448 40026 195040 77920 -59455
15459 230354 -83112 33985 -230290 -81438 147514 -85222 42251 -160863 -62072 72868 123156
15448 123156 -32751 324975 160187 -5774 -158609 115044 -6494 256666 38787 271891 -251919
15436 82453 285298 -57075 297566 -301844 52624 -104760 -201606 84471 -5368 -189768 21256
15424 -42412 42426 104782 296335 109470 -179957 300301 -214208 -429723 271157 132041
15413 -183196 -91180 -72442 -118800 -143178 -368437 264775 -144706 -169222 108568 166918 -73046
15401 168265 -115514 -241394 -204738 192130 107535 -14309 -17846 -190282 -344390 -134391
15390 -94909 134738 241427 234623 -274294 -51656 12284 143727 135146 231691 -125463 -56999
15378 -310083 141432 -983 151615 127512 2469 207040 -229175 62833 -410413 -54051 162244
15366 -8654 138766 117540 163670 102863 -65068 -45362 -202167 148282 -117420 -102034 276837
15354 -162325 -85507 -143034 40810 115998 -211833 -144076 -26633 -59727 150085 90301 110657
15343 110657 256749 103694 -511451 269795 239496 108112 -404723 -31365 -256268 -80061
15332 -189647 -149596 -12549 272794 47683 239637 -79847 309369 59287 141797 -42321 26896
15320 470398 142691 -94472 -8774 -79241 -210331 362542 93201 -75488 -22549 -116729 94257
15308 323889 316203 9162 -26289 -50067 337164 241974 -82963 129402 53978 -6197 -25859 285669
15295 280240 -177981 -144755 94029 121477 -283768 -283059 -49026 125498 130128 99917 310777
15284 310777 16220 263425 -168631 -357777 -104447 -27664 23070 328462 -74990 250234
15273 -300797 -80321 247954 114202 40168 -46429 -112385 87054 -141944 259337 -167268
15262 -294553 180260 60527 332851 213052 64913 89679 -28713 166506 -227713 259389
15251 -195712 70514 729250 602073 1057176 1542053 1146622 1749996 1381391 337904 244508
15241 244508 10858 -37288 268358 53542 -255343 37728 -42754 -209691 -3977 -228736 -130583
15230 -130583 -80835 617304 151312 -186621 26915 323737 42499 166270 -25598 219485
15219 88551 252581 171871 -236878 140459 -363525 136294 218652 -75923 -14311 272901
15208 158010 -16965 208856 55824 -198249 144021 100669 -143070 241834 -71683 111872
15197 -35160 332726 -312193 -25610 124649 317178 -45632 37732 470109 143890 6958 -131734
15185 -111733 -7565 71442 318427 149088 127553 267703 15849 -81865 221048 466056 -155970
15173 -166144 148039 217231 -85031 -118463 -380 40708 127268 32305 77915 254482 -68330
15161 425505 24086 121067 -111454 131243 51193 44070 397612 -146365 287989 -59161 -254199
15150 -254199 64530 -450 -34202 94288 245449 152245 -9793 280657 121312 167147 368190
15139 368190 -16823 30343 201388 212381 30206 14217 -133325 251544 -181280 -25230 177379
15127 299938 166249 -198999 12368 87030 355496 412999 114143 337652 176342 144093
15117 144093 114346 141840 -26023 330754 392258 302578 106785 35839 28956 156624 -29483
15105 -120582 323350 -38676 -196159 364341 -66757 208395 -120885 -31404 -77190 5829 -43984
15093 310921 488348 489967 190560 66542 178245 192054 188890 356848 25526 189779 66856
15081 104048 57939 129787 91766 115754 352964 145511 152608 -21504 218704 35087 94075
15070 94075 178395 15424 271636 179757 302455 208323 232377 29940 253196 24468 251824
15059 251824 392406 -282220 457341 124563 332805 281600 -35724 100852 170607 131637
15049 131637 104589 -306361 76708 196704 147443 295903 4575 54828 57736 124888 152693
15038 152693 -107380 -150463 511955 224660 259113 429820 380521 218712 104976 357499
15028 357499 235687 416532 -134985 276534 97290 774293 -65137 335776 -199107 198368
15017 279903 161547 287607 327926 3733 173666 56065 409009 106690 339627 -113298
15006 144275 363705 124298 446355 706147 -6452 190748 -185729 67318 110465 277627
14996 277627 140725 505648 357007 117256 91053 176799 276080 313030 182303 500767
14986 500767 278211 -78068 127129 664827 562171 67861 301938 268070 219319 247448
14976 247448 245399 171980 44229 411203 111829 218782 600309 475935 70464 129667 285107
14965 285107 245767 236300 -68076 321643 256044 128077 195433 289428 163858 51573 -92827
14953 49587 288900 342766 -1761 359255 217511 316388 524943 162713 303630 104759
14942 244632 311760 141092 325312 418678 126480 167914 343785 513664 520780 273980
14932 273980 133848 302799 341877 258438 130909 354456 22462 474841 -67716 537299
14921 506958 192024 200709 438297 250521 69368 576263 359733 131891 544548 340244
14911 340244 212271 564239 411205 68497 157903 377623 538755 321178 230390 178307
14901 178307 148356 -38232 451577 189752 422839 449401 209803 691352 379012 576529
14891 576529 359057 130629 257152 554396 391603 642810 285146 215307 214404 308117
14881 308117 395241 339683 295797 36017 436919 467247 340493 411385 353728 332904 205687
14870 205687 183348 133712 -12943 205505 588043 244067 264837 382275 470614 244920
14860 244920 342080 495903 322111 301843 76705 208947 508445 274276 629794 143756
14849 141115 189152 397797 204189 321121 414633 257621 590165 381698 570890 146180
14838 541040 608185 200464 646222 603531 501502 437829 150718 90973 355264 205130
14828 205130 269131 290721 288987 509193 429014 789497 335152 343436 788260 582849 477054
14817 477054 309692 665162 664027 624790 469105 578481 603648 610029 346755 286809 867435
14806 867435 628528 708761 256666 469864 715752 675933 560437 200175 556186 567235
14796 567235 493156 352253 680289 528099 473762 282335 662580 590049 510887 508609 360488
14785 360488 844720 446308 198183 828192 501092 456255 718083 500077 613414 453384
14775 453384 612531 630194 942207 359602 365927 667696 640416 540461 628671 380406 543555
14764 543555 564563 396241 368526 303931 426273 595619 546824 690423 570571 1005386
14754 1005386 317146 723468 756674 589009 619834 992470 679749 561143 663246 777405
14744 777405 802824 517606 759919 465470 804605 816468 802829 1036348 633106 597346
14734 597346 750548 822274 771661 513587 627147 252152 918545 722247 834316 747240
14724 747240 590728 656880 1166862 416831 892025 1048814 878593 917150 678746 588826
14714 588826 725003 967183 677523 634542 890011 955994 521128 627933 1004136 754719
14704 754719 1072215 1224897 676000 908586 970001 880621 701984 864505 782215 869536
14694 869536 696049 1295282 917324 1119260 1189574 1067311 632674 1079677 833368 1069790
14684 1069790 1187500 1054547 1106680 953184 969710 727507 1120400 880820 1301757 1490566
14674 1490566 901232 686941 1110630 846565 818647 912523 998294 932316 1276250 1214914
14664 1214914 1222837 1103046 1258101 1216364 1074863 912761 1161238 1133525 726939 979056
14654 979056 1251720 1187974 1183500 1190402 1277868 1102897 876618 1220889 1291341 913950 1139102
14643 1139102 1075243 1270358 1159974 1165461 1192448 1271589 1241851 1401335 1394193 1377837 1299850
14632 1299850 1228566 1522668 1220987 1245592 1382399 1470007 1484845 1400237 1100577 1260540
14622 1260540 1655958 1269749 1365477 1321410 1377569 1668259 1316504 1421187 1380921 1515320
14612 1515320 1289331 1408001 1368959 1416030 1538213 1362390 1474065 1394931 1224804 1609044
14602 1609044 1582613 1565273 1674213 1514028 1627206 1585879 1734454 1527535 1697900 1397848
14592 1397848 1338765 1622244 1809551 2003274 1538024 1781771 1755342 1697229 1653794 2041510
14582 2041510 1760265 1878801 2059054 2020751 1893794 2022052 1857516 1913926 2151379 1879889
14572 1879889 2021034 2460476 2187832 2042688 2204285 2179606 2246081 2348489 2336083 2770730
14562 2770730 2553172 2742050 2801667 2906874 2850716 3111725 3213988 3079412 3271336 3607021
14552 3607021 4175720 4525528 5651441 6936551 10740363 18319154 37817729 50891529
14544 50891529 22240210 10439850 4901308 3123369 2551056 2370108 2078974 1906494
14536 1906494 2053992 1717395 2111735 1970166 2128704 1979613 1915962 1964990 2049640 1759533
14526 1759533 2287841 2157509 2024844 2338921 2546283 2392340 2332238 2850680 2268801 2551575
14516 2551575 2569454 2737643 2657388 3065461 2734355 2580654 2746966 2696189 2971377 2736675
14506 2736675 2625489 3147384 2981408 3027719 3084837 2952852 3296753 2937346 3271768 3063483
14496 3063483 2939449 3435855 3086882 3627416 3444093 3550726 3260492 3686448 3127163
14487 3127163 3420706 3365111 3650798 3670267 3531111 3737241 3918630 3928399 3674806 3599963
14477 3599963 3972830 3695644 4199903 4225967 4154629 4167257 3967516 4229894 4321599 4310750
14467 4310750 4310889 4317237 4711749 4585295 4618008 4848635 4712822 4766614 4940657 4784982 5190449
14456 5190449 5102722 5039063 4781914 5224446 5087841 5243968 5430431 5473806 5761496 5327954
14446 5327954 5671868 5686709 6062113 5631381 5850437 5985352 5850399 6477820 6344464 6402822
14436 6402822 6242317 6561110 6638111 6670539 6684449 6654718 7145187 7033690 7196398 6844037
14426 6844037 7404124 7536110 7486643 7667007 7624321 7875349 7731607 8067684 8214684 8364685
14416 8364685 8714867 8572303 8392462 8767876 9151779 8929412 9137656 9107133 9388294 9286326
14406 9286326 9811758 9845166 9756510 9890309 10410260 10403459 10414342 10769241 11055634 10884043
14396 10884043 11317531 11573273 11718002 11606636 11944003 12218108 12465983 12652092 12516336
14387 12516336 13022051 13278100 13369654 13766625 14112568 14038077 14175111 14996228 14932012 15418305
14377 15418305 15574015 15839787 16379243 16606196 16417389 17179921 17436540 17860376 18123169
14368 18123169 18438142 18721811 19400004 19770560 19906198 20647012 20702245 21381031 22140581
14359 22140581 22088006 22766420 23717856 24119068 24213204 24891775 25404542 26089533 27117170
14350 27117170 27581234 28414489 29094880 29702230 30581422 31548370 32033632 32968437 33673129
14341 33673129 34615057 35719052 36589120 37551643 38755472 39496176 41048857 42192289 43254165
14332 43254165 44515543 45867079 47539063 48815038 50597182 51770123 53696839 55291770
14324 55291770 57248543 59252392 61398584 63157493 65798725 67863631 70664843 73398862
14316 73398862 76078942 78726364 81732502 85155578 88394953 91882776 95627004 100080869
14308 100080869 103898754 108760459 113208584 118348103 123041378 128790135 134589608 140902039
14300 140902039 147529357 154699848 161842115 169941661 178366585 187133341 196178630 206032684
14292 206032684 216162159 227243912 238883551 250681409 262974436 276458389 289986791
14285 289986791 304024764 318497141 333349985 348431845 363564900 378505455 393371329
14278 393371329 407848406 421510440 434260886 446023247 455976219 463217103 467298729
14271 467298729 468290413 469096921 469377580 465276739 461532460 455047225 446925321 436262594
14263 436262594 424175234 410619109 396211475 381109632 365301674 349238012 333360840
14256 333360840 317638501 302130078 288470661 274198292 260403610 247327138 234954654
14249 234954654 223227459 212051911 201280317 191479254 182410216 173550819 165445697
14242 165445697 157754482 149969667 142802617 136308312 130836695 125169987 119468951 114506375
14234 114506375 109773566 104739953 100620224 97109734 93158878 89388770 85772095 82701733
14226 82701733 79011946 76491063 73593719 71023536 68490174 65855275 64032369 61839234
14218 61839234 59707760 57479874 55750812 53998408 52135986 51312138 49494145 47654571
14210 47654571 46014368 44672929 43573658 43204465 41938690 40777506 39215755 38178372
14202 38178372 36737565 36337509 35659755 34168407 33571202 32516732 31373916 30732234 30111594
14193 30111594 29444805 28656382 27908853 27388054 27070260 26121779 25244621 24876362 24221524
14184 24221524 23493753 23211899 22327709 22085961 21595256 21701401 21181339 20505668 19976475
14175 19976475 19767906 19247859 19135251 18750433 18050718 17681746 17503935 17237864 16851184
14166 16851184 16302057 16141160 15790950 15567874 15160510 15247760 14722596 14566875 14680261
14157 14680261 14115584 13885293 13781129 13104799 13134316 12845518 12800736 12415326 12194401 11893975
14147 11893975 11788322 11722996 11330935 11009094 10880482 10906183 10684580 10479078 10391598 10079614
14137 10079614 10109346 10169856 9793091 9788478 9494304 9549604 9531493 9427972 9003731 8796475
14127 8796475 8737634 8895912 8335660 8338053 8477000 8232448 8252618 7977979 8088789 8008449
14117 8008449 7748319 7377971 7562310 7554368 7446077 7362415 6741989 6986385 7195781 6561143
14107 6561143 6911353 6682663 6532676 6223603 6113159 6204474 6320064 6271037 6258493 6111142
14097 6111142 5800044 5724916 5835688 5767250 5676438 5759738 5328029 5463540 5325264 5344084
14087 5344084 5221765 5119858 5386201 5111103 4971103 5219068 5146583 5089239 5063959 5000286
14077 5000286 5130905 4751911 4770857 4556078 4417577 4515112 4752712 4701160 4419205 4709972
14067 4709972 4366454 4534148 4461276 4458611 4235389 3798566 3976546 4232756 4456251 3969037
14057 3969037 4409359 4314627 4265076 4092335 3987438 3840576 3923215 3708416 3963301 3514790
14047 3514790 4018635 3536732 3549249 3406312 3471932 3408222 3142648 3361083 3435247 3484108
14037 3484108 3426837 3191450 3071177 3113248 3333258 3175563 3267368 3181825 3551809 3126692
14027 3126692 3339169 3050709 3018146 2750184 2807330 3044979 2968939 2875691 2651290 2952891
14017 2952891 2579613 2570672 2546848 2737687 2441771 2672313 2821920 2431804 2453258 2490933
14007 2490933 2306672 2127931 2064872 2111967 2523582 2403669 2410331 2252867 2514726 2196358
13997 2196358 1917863 2262053 2330702 2194817 2342696 2085352 2124656 2621670 3025549 5345616
13987 5345616 11844699 29673233 53581585 27073606 13894785 8271303 5985854 5026918
13979 5026918 3719322 3779675 3299702 3201035 3215754 3126982 3074843 2444182 2733874 2625569
13969 2625569 2887506 2491698 2461483 2339288 2525031 2299258 2251513 2208379 2422305 1943764
13959 1943764 2433760 1741110 2143150 1837301 1968882 1874306 1929771 2123219 1928676 2254869
13949 2254869 2086658 1860911 1795262 1696948 2090339 2107232 1801880 1494272 1852646 1823003
13939 1823003 1918915 1565749 1820826 1890287 2061519 1905470 1752969 1720955 1718678 1557650
13929 1557650 1746426 1577925 1558995 1503923 1704654 1930547 1690170 1584997 1522889 1807945
13919 1807945 1673124 1649658 1433354 1184895 1389034 1389343 1385993 1430644 1277781 2015313 1533242
13908 1533242 1713905 1527166 1504521 1646691 1330442 1144446 1413977 1165115 1823846 1511388
13898 1511388 1406106 1475159 1326981 1278979 1465113 1457445 1452961 1323629 1397238 1540509 1309640
13887 1309640 1280487 1411113 1114764 1528209 1184943 1555500 1126031 1455170 1424555 1203947
13877 1203947 1287658 1244068 1167189 677794 1302711 1292860 787287 1166341 1321551 848681
13867 848681 1136082 1021801 1241689 1202313 1102346 966774 1175675 1175855 1375940 1299028 1134148
13856 1134148 1200100 972223 1066476 850119 1195899 1120195 901179 1244795 1123065 1353383
13846 1353383 1092794 720603 992257 1084900 932811 1020406 1034610 1199987 1205653 1188651
13836 1188651 933166 618882 1145004 1292061 993532 1041815 1120446 1193068 762731 596556
13826 596556 551102 1041819 1041137 822156 1072764 1190730 875681 862757 861000 999998 765426
13815 765426 1234304 659021 732578 1075401 1162275 1208029 1009861 819771 1162684 905193
13805 905193 957885 857275 745570 734151 1084156 799463 712980 648881 927292 1060614
13795 1060614 941714 1029595 813844 547462 781573 656515 751366 774872 522233 790855
13785 790855 795129 1103134 855331 889194 409710 671363 803465 983951 777117 741706
13775 741706 973322 649656 772055 888225 714513 463037 388650 956838 629193 870313
13765 870313 991357 902747 858402 424156 685310 647239 842388 524617 659535 791941
13755 791941 630415 664254 614692 591973 599846 661268 630113 406921 689566 651871 703812
13744 703812 451380 717062 832788 349089 219766 804668 345702 624588 444806 559833
13734 559833 724207 921148 419001 769949 653485 769412 533656 670193 938829 530591
13724 530591 729644 510620 365604 700968 757261 453931 489718 521715 858598 380585
13713 369228 575801 291741 490163 533076 442338 49122 681352 518991 394345 483558
13703 483558 477885 1046696 342451 427165 857780 443832 402621 902257 409268 290967
13693 290967 347252 648405 679445 392371 471363 362388 640946 732809 688572 741221 398072
13682 398072 853533 617408 590582 514109 676123 596914 489803 526929 542301 745389
13672 745389 483579 321941 534492 595254 599488 263063 865418 434576 272117 510466
13662 510466 450139 818606 197749 512705 504400 488781 430425 713228 595817 392440
13652 392440 550541 148265 535125 357934 526417 455634 358478 333515 761380 435136
13642 435136 558392 551210 736434 612376 554462 658243 244862 207649 464944 464445 365515
13631 365515 323929 204788 292118 300780 496108 435854 627517 476874 209186 385246
13621 385246 602254 441708 334098 108871 168650 271200 383709 168034 219828 775706
13611 775706 245132 -9825 733175 273203 438356 247269 671595 89584 390013 267847
13601 267847 55114 552991 271670 373046 397665 153195 429338 70716 296435 218512
13591 218512 459172 262266 278057 678042 360841 625890 19792 338769 166650 415763
13581 415763 574901 106512 283876 227139 634290 294518 558779 60134 325574 247355
13571 247355 280312 623876 342123 776009 348032 326609 493297 143219 501290 424867
13561 424867 421007 168717 589969 116314 681447 590646 66047 501115 519425 312813
13551 312813 256266 155085 94945 -58613 231103 351306 325129 163677 222417 178325 542845
13540 542845 256474 338085 590360 135411 291585 217150 160382 90148 316105 91237
13529 469019 130054 329255 267797 266905 368900 67891 320438 538495 283153 96005 349165
13518 349165 521800 317522 61409 181847 314198 207611 203539 501872 330175 231987
13508 231987 479489 305033 448610 480238 47685 155223 284399 343808 -173489 541047
13497 275052 408116 311846 504198 424689 143502 234346 19011 66228 -5103 -23528 412891
13485 334940 -78800 231329 266218 415993 -183659 446436 405800 584103 338833 225220
13475 225220 32069 -114155 48530 158813 213867 -7349 202587 332899 227686 589066
13465 589066 -10920 258786 304683 669889 -24733 541742 46253 371307 394379 145632
13454 174298 243211 202770 349549 375182 420107 71946 -305639 155302 522731 162601
13443 304410 239326 -113997 216080 65590 210311 -39690 276901 219800 300237 436229
13433 436229 268560 263846 218751 443257 135425 114279 205706 233543 213390 209610 159540
13422 159540 -123533 258390 185908 -82086 16083 -4407 174129 73151 339381 301767 -177896
13410 163254 -114619 -215175 225811 341336 18861 277530 136599 242021 355547 350607
13400 350607 -28708 370281 208900 -107809 42788 199631 373757 -106515 163993 191551
13390 191551 205843 263667 4569 384742 62859 401727 109786 33391 220773 448103 328638
13379 328638 171260 -249810 181279 370009 172662 70974 320211 151627 239019 275717
13369 275717 187745 149391 379595 314420 23327 162018 207322 357006 353919 455122 -14015
13357 163400 419509 328706 33577 201800 246917 190084 -133794 -5732 422222 396787 229796
13346 229796 468538 376302 456851 364117 262680 657481 254745 404275 193331 208488
13336 208488 1403 195708 213422 146255 136524 251760 59093 249459 174044 91897 417592
13325 417592 220489 269182 163682 196245 551219 361328 206380 208444 110439 600056
13315 600056 49484 264687 172673 170631 6429 -267176 468028 104561 -77322 227358 296238
13304 296238 278030 291465 -65024 324752 25612 258111 234654 461593 -43901 411421 77632
13292 70510 24626 -117423 83331 89960 -15449 -34310 470081 71663 87040 129405 80164
13281 80164 36375 -9402 16903 74918 356897 467376 38173 56360 204669 -31353 -7512
13269 527026 121007 -94653 221560 123431 363050 20175 476901 127110 -8762 168610
13258 297312 225931 200616 84346 -118833 3783 -26783 157654 67754 45838 -244497 35684
13246 268521 -69733 170559 226604 99157 78769 189863 180518 -92286 209603 97608 -92893
13234 -6893 351079 263271 -85639 452071 109709 235554 339793 44842 10984 134690 205045
13223 205045 -115564 470159 7181 160555 152160 39466 272612 50123 31855 332489 147921
13211 113425 135302 378967 215595 -9790 76311 -100745 44077 145339 276013 133083
13200 113717 -1533 335307 421344 315235 235561 -84642 276100 124044 -81362 91525 288220
13189 288220 -236200 -10190 90600 427189 226875 1367 20374 -88630 199600 -113671 95438
13177 191034 -105506 33634 -35055 -87177 -68983 -38741 -11023 -364461 -108001 87412 31078
13165 97697 173802 264693 118512 297999 -11353 401223 222485 54958 217481 120518 -6060
13153 211976 49987 25953 308237 200539 -23592 266119 36184 -196985 199487 208747 -163817
13141 287244 128027 -197123 1133 508878 123048 108681 -156593 184420 -106331 -65858
13131 -65858 221664 285597 212915 -92102 144742 151808 63469 353545 125863 156020 -364965
13119 -42612 -1635 52830 49038 511660 -147413 39316 7442 -119262 185775 179708 -1204 -2472
13107 -2472 7795 -271154 153585 438489 -109512 137120 -45848 -55481 10526 61197 -132550
13095 188456 162653 854 141083 180254 -125892 150569 -185251 -172316 91951 -127492 -130514
13084 -130514 56945 438982 56261 26875 259404 112363 67146 245900 -37062 362273
13073 7491 281211 -83758 146370 134602 219344 -56729 -101997 -132117 45551 -61435 108698
13061 214396 -120278 117903 23674 135349 77874 33643 91795 56496 63971 116645 -111305
13049 -38762 93309 397195 -69260 6368 14912 107678 307304 34112 -99769 83107 103133 -98229
13036 498629 -128841 586580 311819 149734 -152029 148279 -26903 8737 -195271 296774
13025 -32031 161106 296726 146362 231081 212580 306930 28211 434196 213193 136009 97783
13014 97783 81572 -22783 381327 83134 96299 71179 277513 237595 215336 -229933 -54485
13002 -271236 -89148 181711 68540 169934 445051 -12348 153895 -3018 70587 146930 -65032
12990 114043 -159553 27379 -292515 54765 -148978 -74093 41428 197826 272111 188307 -184410
12978 369354 -182323 217480 -44293 112256 232151 -22940 27794 190916 122377 89233
12968 89233 87134 71370 144263 -16333 -167308 264763 128229 300258 -52810 106404 140475
12957 140475 -93875 52617 -158100 262690 113374 201541 -24343 -137785 -213664 140523
12946 107072 -197841 -22382 -11443 6714 25402 348767 208069 319589 -29171 84134 231693
12935 231693 24033 108463 -31989 97709 -138976 72392 -142897 232076 343704 209533
12925 209533 -5236 -95080 -127268 36764 178877 176405 -102606 -159608 68201 47255 -7595 -151531
12913 -151531 35529 84995 -25944 288791 158267 50129 -45406 -10189 351871 32078 339718
12902 339718 -93238 34914 154715 44140 -184314 134864 390808 165024 -99561 68535
12891 44136 -62323 352694 -229384 -194268 -100231 217914 -190941 -68013 81481 198037 -52034
12879 -48071 -102399 -149887 243357 -3702 -67728 -471128 234093 359233 31425 35729 90355
12868 90355 120264 -38453 -211136 -134430 261971 73 39123 32791 -124055 175106 190454 -64996
12855 175255 -88819 -58080 265946 223028 -38541 115644 -363744 -227833 200152 -30720
12844 268079 66117 110242 -294567 -162092 221922 346534 -273460 50192 440763 -73408
12833 92407 147588 42579 -202607 103173 -124998 113528 -110146 336602 -56965 246146
12822 -112054 7469 251324 32808 -87315 44272 -155890 -125503 69890 -145480 127656 82152
12811 82152 33155 81662 47830 225361 237470 13017 -164033 -217872 126725 69044 7966
12799 45683 26889 -132744 150803 -5979 72122 -80031 70354 11347 -77898 -10960 266371
12787 -254484 234693 181128 268654 324623 47517 -97976 -85043 290809 128198 74271 -91527
12775 -295517 198058 28071 59580 -1482 -34587 -103324 338415 -28840 123553 103366 121902
12764 121902 -2385 197705 508380 -118899 124345 113222 149915 -282851 66856 6721 214236
12753 214236 -10022 307961 -264612 -58733 -126408 -215400 -56023 15580 23738 154661 8205
12741 121886 -78950 236600 278544 -119566 242451 124131 -72234 220524 93023 92553 204420
12730 204420 223491 183180 -15002 -169471 -133050 -21333 195784 -170108 -117559 71750 18288
12718 127093 -70492 -122159 772092 129513 -33302 8073 -46019 18564 116345 435621 184801
12706 69186 316397 18405 -201384 8249 276053 -154026 542349 80087 -64301 198676 87134
12694 -201043 175981 -31060 168332 72454 -243636 118722 50625 -1963 90679 107355 143515
12683 143515 -66861 179224 297590 233264 -218949 248196 72104 -177368 -210916 20111
12672 -64663 183733 -74185 127451 108938 -449299 -74304 97937 271071 104734 11089 -301722
12660 91689 146806 192755 -70980 251320 164378 -16063 242415 129372 9743 302248 71817
12648 132829 257100 456482 203935 -28751 67662 -38671 -3037 174364 21417 175678 55343
12636 -74274 -21717 323449 -136995 335978 7264 303674 357329 552170 152672 276384
12626 276384 74738 294518 111992 295924 -210703 88059 -173129 13026 143218 262797
12616 262797 -46019 -62800 82864 163384 283703 91798 -89378 57763 -121533 -182182 162734
12604 60361 -78787 -197322 -70184 282102 -206107 281493 104604 166621 136531 -60640 -90932
12593 -90932 -67815 -5190 -51839 142844 -30855 17417 129805 35366 -31105 -122720 33912
12581 -238226 -71458 39073 60529 -24692 136372 183932 -105361 39050 -143395 79754 113622
12570 113622 -165516 90424 -72928 24562 362093 -89179 -94390 149482 147199 116042 103743
12559 103743 -75028 43723 58062 436256 -19875 26421 216235 -18035 146643 -110285 223878
12547 54612 165643 208665 144114 -77216 -2462 -6620 -48808 213979 76554 298137 172647
12536 172647 8371 330457 42482 128175 -70556 -84403 272702 -21955 216843 -114877 -210330
12525 -210330 -43879 -111915 90056 -31268 105028 -115766 -335782 -149334 -179705 -108180 38968
12513 68357 316689 -4986 -263055 39445 123359 5190 16263 222435 26157 332149 299609
12502 299609 308763 -60744 252197 -87044 -272863 77881 235087 -115292 238634 -138672
12491 95752 -97145 212958 283778 -307901 -214991 92050 -178362 198351 -40818 -200332 -134447
12480 -134447 65660 -149829 181422 -128013 -57754 -81143 36672 -2043 206123 -32432 180677
12468 178934 -42617 227787 39470 -202558 129688 290203 -56749 68586 146180 210346 -223329
12456 49489 -154056 -123150 302464 101600 107301 246591 235490 43611 8764 -300710 23358
12444 45853 -218722 -302169 -195972 128177 -78880 273308 -222943 166276 -124356 236256
12433 -42477 -103439 123491 343241 -135100 -382628 -328900 46562 -45355 186651 -107446
12422 -147016 -98270 22382 -63506 27816 -191806 89587 156459 52868 94202 285678 9705
12410 -294194 -210141 352624 436423 42026 185062 194609 -30580 63929 -119709 70133 -172222
12398 -104742 -332976 -66484 -28486 164360 -27750 -26049 212 10761 -239102 -162986 152735
12386 583813 -67797 112517 152404 -138743 -44495 -270475 117616 209887 -14943 200590
12375 -217811 -158474 -164792 -83090 13395 109092 5483 -75937 -42443 -34389 91261 256099 -22366
12362 92123 -244451 -60141 -75913 -63264 -59381 124343 110168 -146952 225604 -63974 -8366
12350 -11885 -118772 148689 -107080 -109567 76747 331650 46605 224520 14253 -229660 37453
12338 19850 -335213 69683 -195260 276484 101517 8416 -14373 -13445 351166 -70314 -160157
12327 -160157 117282 -82570 193647 -213509 234644 209860 -192026 107822 -73383 87762
12316 -282334 45147 -119592 48081 -140949 43437 234109 336403 -24662 196833 198534 -20209
12304 -175093 342597 144272 231521 -115102 -122035 86445 -153926 -15426 35001 269399 175264
12293 175264 212247 171610 -279176 74878 -49243 214449 79932 179858 -44157 253466 -178183
12281 230809 433310 4758 9354 68601 -124662 374287 353456 206153 5952 599669 18348
12269 49020 19312 75879 383051 19871 11372 123886 284657 55845 -28993 151810 105349
12258 105349 202877 62910 -69284 96921 -310177 114289 275688 -8337 -54789 -11570 97353
12246 -4010 328776 74518 -221239 94373 -239471 74468 136808 -93694 -266997 285726 123072
12234 42519 -220941 -109371 -426805 308510 -94348 21933 201631 220174 48620 278011
12224 278011 182052 -112562 315012 115476 135520 1681 95791 192623 301832 83657 227609
12213 227609 261854 11455 77688 29921 376719 152641 16433 202926 256381 178371 94286
12202 94286 292908 308776 208317 420135 -117408 164065 416876 229593 234022 313403
12192 313403 43474 186449 274158 162143 274903 109242 113535 -44677 44710 -132740 201286
12180 66886 172549 18292 25263 12180 192506 -63893 31397 43964 329904 220952 -458153
12168 56671 74884 366420 241207 -91050 259567 146041 -93601 117829 93951 14547 47044
12157 47044 78153 -196458 2487 -64144 101517 -109017 171384 126262 118988 96002 65583
12146 65583 142206 -3716 -162337 -173273 -37926 301835 -85987 93030 -401712 -206903 -210011
12135 -210011 -173406 -285458 -180506 107958 -250176 275727 42520 173980 153493 80748
12125 80748 21147 34253 262513 336340 -33153 149180 -165742 -8517 17700 110710 -27113
12113 -168895 130170 121537 -83380 196976 -74233 -120983 -52606 171753 71083 -3664 -62879
12102 -62879 -248853 72715 -276667 -32646 -24734 172317 -113726 47026 -224969 -208366 -176712
12091 -176712 72638 -15908 -135899 -4980 29667 -321259 61135 -116610 -31393 348846 -129948
12079 11496 200738 335968 1081886 2612586 1245392 90201 212261 -138654 -22347 345624
12068 354936 143798 -128754 -134630 39031 -241073 108776 -501615 -57446 -135611 11718 220170
12057 220170 278481 -61297 -27326 96748 -17327 -18171 -45850 -63382 116465 25123 -65292 -31815
12044 -136476 302761 48769 -263588 131627 -54778 -57331 167809 -8099 -122890 -98015 32491
12032 -16003 131340 -212209 228045 -50439 -15156 -81741 -61026 12527 45456 -98904 -4638
12020 -47596 -173597 297992 305591 125976 -19386 -42615 245017 37441 -3111 -299455 138748
12008 126935 601940 -28591 -230679 -83582 -146641 -82278 -53245 -187551 212680 -215484
11997 47863 1314 -131582 -170259 138160 -153299 -143696 -292141 -400841 -238962 -27665 -61726
11986 -61726 -228886 21931 -223864 143784 25330 344956 49411 -105123 -72949 91974 148594
11975 148594 152193 -398910 -89707 -216190 128275 100396 -187030 34231 218454 35212 85088
11964 85088 -233383 32091 -209070 -94022 -9026 159522 -154759 -42605 -83046 -231994 220219
11952 173644 97203 360476 284888 -37524 47710 -107488 -45134 193963 -52839 -92514 -348539
11941 -348539 25652 -6562 -18811 57246 84594 -65744 -126020 -279666 -126943 183930 -142225
11929 130490 -93374 54552 -71647 -35821 174260 51543 -66142 179309 56528 -265796 307415
11917 119657 -66542 21785 -373683 -253715 -8304 -17299 -178186 239406 -63834 -115386 -328105
11906 -328105 -132882 -4446 -52164 14419 -71229 18026 -42179 -37283 -479062 163533 -268685
11894 345971 150235 -194492 -74683 69718 64065 405031 -30590 113574 -264469 -94595 98520
11882 44743 -36532 74463 -147326 39363 -28849 108853 -149431 -105888 97138 -59029 -185575
11871 -185575 -115157 -64222 -68053 -238356 132883 -214232 -113064 -151155 142466 -132295
11860 -193469 86052 -233381 -81702 -33147 -86512 -154699 -305773 -4978 45999 -283501 15903
11848 167987 -329479 157181 -370475 -95292 -219362 -9175 86184 -200619 -60600 18621 -196858
11836 83305 -118014 -17969 -189548 -47646 -170375 -208309 -527314 -39626 261996 -61301 -193569
11825 -193569 109652 -2393 24744 149504 -13180 -20931 -28825 -59370 -49670 -273337 -48625 -240533
11813 -240533 -75955 -36588 -48362 -52078 71687 -149799 -194953 -27685 -179627 29852 -178101
11801 -60587 93729 -64235 -55283 -38070 -322283 -85432 -11295 222283 200851 220403 68563
11789 216203 -446661 -257193 54755 -6843 153116 -20746 -13786 75638 19761 401037 216322
11778 216322 139929 179712 -115098 30564 174037 288955 -85828 11389 23258 -118126 71014
11766 -115374 411122 -32255 -93411 83014 18774 13702 -113842 -83001 -62811 -272675 185613
11754 130093 -140122 159341 216499 105522 60146 -113161 6857 49133 -191380 332508
11743 136505 186792 219793 -284030 -350271 69107 80729 -16726 -261304 -10149 60766 181859
11732 181859 53555 72092 -202429 248848 -319148 108724 -41297 233856 13676 148198
11722 148198 185088 346220 -297275 -133345 -165367 279597 -148568 89564 -288642 274368
11711 -14614 -163318 159894 -256644 -434592 148257 29027 -277666 -67233 -141014 241860
11700 -17406 145413 -550 216924 40654 -56532 109771 134170 -82091 -5084 19934 188730
11689 188730 368147 82950 217698 44763 -287005 118750 -263392 150882 -20894 304490
11678 -62165 214464 98405 -44590 212936 -305393 99374 306012 147220 62738 304915
11668 304915 68066 91518 37201 140338 389059 -119776 -80412 265009 -68766 225029
11657 -351191 272398 143926 -135054 182714 -153014 -197371 -264207 2865 -85746 38559 -167105
11645 -107816 28751 -90328 -220322 169624 30285 205182 394123 -62680 -75682 -372685
11635 -372685 310166 -109934 134253 259645 116250 36251 213964 200390 -8450 2172 -146183
11623 306534 58946 -347242 67287 37629 -39090 7819 521556 261406 313689 -115678 120063
11611 -15575 19720 130498 -4991 -297947 6152 -76787 100213 -128263 110075 204214 129963
11600 129963 56809 263127 32567 -91575 80828 309633 -40854 -178259 -451672 -156542
11589 127413 -128173 229506 -134770 -82083 72883 -86286 -52150 206238 -148235 232365
11578 54950 86611 48258 105976 101972 84002 318380 110383 58569 -247675 21010 -46050
11566 103574 -482 163152 206072 -11452 -1688 59646 135205 12785 256006 207763 93047 -103084
11553 -270705 304689 131587 309296 127985 3745 -4037 138293 -118978 -151697 31486 -48759
11541 -57920 252475 156181 252479 423976 -35037 8177 274228 343119 85510 101121 -19371
11529 199395 -24908 99134 210946 202123 178179 309239 -32972 117692 324722 229431 -11221
11517 322882 23692 199707 -62369 226157 242521 246126 -3252 117139 371559 202500 -70807
11505 149509 296833 217343 -203216 180913 233055 25798 38957 269911 -145853 68005
11494 55530 123828 39712 141471 388680 163091 248860 126373 -69639 -66314 128070 342303
11483 342303 5978 174459 184384 -139366 93990 122209 72957 382267 348998 -3814 31222
11471 -156847 -22281 -239165 152754 311037 185395 104107 8324 -92487 430523 -35426 -35762
11460 -35762 -169128 291391 334709 -296393 6784 157643 54262 -212244 95936 -164831 46988
11448 -20897 212317 -289754 265949 66735 36405 245496 -48924 -111900 242086 -8531 197004
11436 -43689 -148735 -198317 48669 14163 394228 336903 -49313 -125882 -113253 -21846 48403
11424 23661 27655 -24962 -403578 262722 97725 -58588 -157845 232280 -269332 -183950 17535
11412 -125095 -62897 186658 -206189 264711 11412 -19464 -83871 266708 229863 133352 -51724
11400 185455 363828 110326 360573 276653 -137781 477316 102981 188687 223693 126262
11390 126262 -205998 -194031 -196794 45651 40798 -139783 19515 -7866 -100604 293073 153703
11379 153703 -210394 -162089 -58188 -175986 313892 77589 -91314 163132 15892 161923
11369 161923 2408 -116700 -127454 -101787 212164 24066 -26564 -178039 125376 -79357 66308
11357 -197722 381971 -391640 133268 -479114 143801 5133 96881 -135917 -191502 -214788
11347 -214788 103365 12012 -24203 -24552 43457 71173 12594 -4586 -341580 30714 144147
11336 144147 -215799 -58134 -474831 37351 -176277 -37949 96417 -322302 400225 -352474
11325 -205839 105755 407180 -161739 110784 309038 107004 56823 -400151 362743 -73816
11314 -2377 58028 142739 23662 40463 90301 -247418 -271495 70912 -118876 -162685 -4818 -120931
11302 -120931 -39284 169962 -17876 -304107 -186415 11994 226477 200777 -150102 274276
11291 -76162 -260012 148606 98797 -132583 41437 54263 35852 -247921 139902 -179138
11280 -295587 -154925 -214789 -226838 57142 -126259 -183805 89496 -141315 -366213 -360574 89318
11268 -36796 -172317 -192642 359672 -164276 -140365 166478 160903 -220603 199617 67768 136462
11257 136462 44358 -48700 -303554 -46696 -75497 -258929 22934 11663 83762 47498 32913
11246 32913 67454 -229921 72692 422600 -118723 230729 77447 153383 -169498 82974 -31708
11234 -9531 113616 -100262 -283808 -15755 24664 109504 -56707 56767 -367973 -210747 15122
11222 95865 -156519 49789 -92748 46702 -342858 -171418 -63542 12495 -20169 54623 -37345
11210 -258420 -119009 -48483 -13985 -215571 27417 78824 -317082 302156 -178346 -2650 13585
11198 -81862 33963 66582 -59794 286192 -225767 -19404 -282845 -45694 -533657 73116 35642
11186 -237082 345101 -153387 91988 -196475 -135344 -186854 -64159 -154357 -104324 -13269 -163957
11175 -163957 149738 221556 56858 8152 -13961 -159527 32277 -105345 93068 24084 192688
11164 192688 -18662 -228317 -159185 165905 27662 202398 210019 -133338 -124585 132506 -70605
11152 -33605 -169894 -82764 -76351 -126720 180227 29384 -451294 45823 -26990 -81028 224456
11140 183019 -255584 -141690 3921 -9588 79363 257055 117516 -62786 52905 -407414 25869
11128 328810 403719 385536 19083 -13927 -306770 203633 -29820 -197983 132017 -344740
11117 164836 290038 224430 39225 256574 -25374 82864 8341 160748 144254 -90778 75447
11105 79655 107983 494423 -46043 157497 162832 316185 60532 104913 16273 412039 143342
11093 144871 339754 418131 419307 141921 203184 325696 474683 88307 198686 129802 51253
11081 -22999 59770 209104 83334 251967 504398 225429 380032 263875 180835 88192
11070 474064 573579 90972 531141 408033 40716 377077 256454 702956 630652 418393
11060 418393 321527 352377 652666 728377 561038 857051 777435 631219 651726 917178
11050 917178 721227 737882 951031 826173 805437 607286 570873 589188 761675 466177
11040 466177 777465 720178 685972 843400 596968 675805 188725 371198 412599 750647
11030 750647 746581 575350 685926 825249 766966 946739 807682 493507 722763 671609
11020 671609 821985 593285 630118 187867 602398 626560 773060 858317 463651 496655
11010 496655 880833 604868 652344 685670 808919 692918 506442 575157 513706 839338
11000 839338 494883 187488 372235 309508 799816 828801 899043 816047 712572 732998
10990 732998 808671 733300 718428 1147077 555301 777017 854754 995591 1203430 1236552
10980 1236552 1426931 1207262 1425739 1788022 1543912 1895339 2467848 2353250 2596219
10971 2596219 2429517 2783486 2304622 2299364 2260522 2033625 1938196 1832543 1595310 1427456
10961 1427456 1360788 1806677 1604814 1727303 1502241 1632928 1819372 1532373 1573541 1252533
10951 1252533 1220594 613956 773237 572052 644271 734519 274512 -65532 44973 359787
10941 359787 43072 303292 131845 25370 -137376 -80093 194065 -80988 100812 73025
10931 73025 -121763 54587 312310 161895 70318 33513 -189833 158426 276371 -180729
10920 152822 64627 35075 -463650 181639 -68225 -307254 -50741 -60969 -108118 59908 90
10908 288373 241447 -64733 250153 126127 170194 -9938 -69713 -128213 -132280 -205344 -63693
10896 129725 -249461 -65115 -102117 -99798 15536 -228139 -289909 420977 46886 -260768 249815
10884 -101376 -307242 2545 -25360 -27856 -367518 -13642 -18142 -70120 9546 184399 275212 -146136
10871 351129 -73923 167974 -46422 127117 -43627 22720 -131424 -204271 -187305 22945 100819
10860 100819 -165958 -107743 143074 -81265 132738 -13810 250139 -34600 101575 -92085
10849 -198246 340749 130283 102232 -117971 205956 184838 -249737 -268552 -128554 -222934
10839 -222934 -239720 -147817 344614 -177235 -146023 133649 91360 106820 88971 83149 -83278
10827 -218502 348841 -178459 -229338 -155560 386640 -89555 58947 -96366 197366 -136473
10816 -8256 179718 -127241 -114560 -32749 -145343 -30121 268560 -23784 294008 -38712 -180946
10805 -180946 -118825 -141245 -159250 -42400 -126527 60687 -176509 -9382 -137692 -17912 152833
10793 -53098 -61287 -31076 -528427 -253546 -106300 -128517 66210 -124548 -180654 -418919 183458
10781 -84852 -156830 295539 -235369 8602 -134915 -73847 70770 32171 -231590 168590 125292
10770 125292 -291164 53895 -17958 -50154 15693 59566 -250768 -58890 164662 160420 -108431
10758 -172399 11182 -172917 -47510 -21738 77948 12405 207415 -174199 62690 -194286 -69312
10746 21478 -81420 33608 -136860 -48323 -276366 -29664 60498 5043 -170176 -121277 319130
10734 -209939 209800 437446 -50960 -54108 162221 -247468 1288 117563 4944 39966 -163153
10722 45849 -290897 166967 155486 -130662 93784 49080 -291308 -73486 195391 32849 -142437
10710 -218234 -257356 -61123 171835 118495 -113882 -24939 153995 -84067 -162584 -85810 -286262
10699 -286262 -82527 99714 -133411 -141902 -243174 -230784 -51510 59899 -43136 -476082 195008
10687 -54132 -13157 41064 117734 85225 -107809 -150465 -220287 -273825 -233774 32793 -208522
10675 -281537 -112995 -113478 29134 -246714 -153535 39810 102475 -111248 -351184 333416 74208
10663 139193 92761 161495 48200 149821 91064 -173583 -162739 -69878 -200263 -186867 -86309
10651 325897 15870 -176733 -445403 128385 -248207 -77639 -232390 78875 76017 -241681
10640 -341992 104822 124652 73830 189289 157333 -42246 -144271 -169668 -266648 2442 -3403
10628 -187618 -177368 -159498 -281523 79153 -129800 -221196 192743 -160819 -130838 97823 75159
10617 75159 261742 264967 96519 5261 -222186 234675 101717 -85025 318964 317800 25748
10605 -34933 20665 -309145 -240847 -236201 66056 -128284 73462 339283 274946 -362535 -29872
10593 -293599 59200 -175423 -58487 -269110 -178655 304790 -7632 -161118 -322005 -349119 233972
10581 102950 -180529 364142 54946 -180478 33142 -29480 -76016 -15735 165381 465733
10571 465733 -86226 -30775 -1550 -281519 -311334 126302 67346 -289719 -161857 -51238 292862
10559 51619 99780 213454 -55053 254623 -83182 -202475 -114592 -9493 126228 -26250 -211321
10548 -211321 31107 -40244 -207494 40892 7715 56959 -8278 -146347 -385669 132795 -13154
10536 237526 -295034 233372 81016 223599 -195505 -178936 -101633 71490 -30835 86367 27538
10524 -142260 -152063 234619 -117778 42353 80995 -146140 189489 -491718 -42765 -117332 -120411
10513 -120411 264723 -287404 -145177 256880 -284826 -247011 -484214 -511878 92039 96954
10503 96954 -252786 -104712 -114608 -235184 -65066 -99982 25110 12697 65850 -296023 113309
10491 -251432 -287873 -43144 240708 1403 -170392 6667 -32106 167938 131694 146518 135140
10480 135140 453028 244652 317855 273932 433546 76406 -105530 -80351 107191 193336
10470 193336 79841 61005 130575 -268764 -376636 257316 -96662 208438 21390 136548
10460 136548 -67312 -45843 -76110 -176572 -244992 38431 -18491 72982 -46443 -176219 -149738
10449 -149738 11851 460027 92192 -80670 -210674 90859 61354 67869 413468 -342953 -183442
10438 -183442 28842 -191069 -49089 -201893 300295 -14873 -8343 185838 199186 -135430 103153
10426 -200878 102896 -105072 -138565 119368 -24644 -143909 19210 -260600 -35135 -250507
10416 -250507 433504 -26262 134966 -42494 -128324 80929 94261 -297959 46571 -9832 19020
10404 -209176 -178615 -35172 -4999 342114 -151280 -406004 -347330 41593 453748 412457 48375
10392 306607 -281379 -197393 -109625 135509 -120869 503252 19042 -347954 181224 127306
10382 127306 -53072 220308 246457 244081 129917 337132 165313 90527 96520 275964 525920
10371 525920 339327 282426 271689 15687 297218 204817 353661 439971 100647 258195
10361 258195 181961 190942 283249 -11798 344286 -194570 578356 121101 115023 178088 804074
10350 804074 676259 230916 232843 -14393 -59335 57573 27764 488662 545000 700000 87153
10338 601685 211366 9329 301120 293499 39381 419326 421773 434611 218435 46943 102282
10327 102282 -58273 203518 -23861 238239 22480 237976 447537 -28097 103402 112957 -73655
10315 155009 84017 512545 166391 -1333 -116450 157424 106633 17287 -68293 -85495 -48269
10304 -48269 -53413 61830 76186 -217911 86205 -35717 -184733 -166673 -196023 175044 179275
10293 179275 -153115 455898 92409 -34682 -12119 -91696 -105555 -101901 -68273 -117074 -80037
10282 -80037 -72554 -29445 52359 29098 58758 -38624 43983 142976 -74972 -304045 -206901 98355
10269 59943 -107663 94723 -135471 -156747 -249064 -156813 -17759 321449 -49830 -106181 482482
10257 289826 -277872 -97501 212875 290415 19912 -349290 93043 -174755 194105 -239733
10246 94570 120659 -293930 234838 186329 28493 -69303 -211906 389915 -162165 18252 1923
10234 -320303 -4451 165840 -153252 -199017 3634 -73151 -217951 -361675 -35575 -276309 -305610
10223 -305610 158058 307646 94216 332236 144363 405896 -424231 -111401 248845 160929
10213 160929 -389655 102284 -362878 -50748 286604 64351 -285641 -122950 -273042 -108250
10202 11707 308140 -36942 -151711 195133 -78611 -171575 107340 -105618 -98332 121043 2223
10190 -224382 18119 271096 -239117 105443 -238188 -358610 -288112 -188416 -134417 -303755
10180 -303755 129083 -4760 -75708 -185476 -318010 -271571 33764 -343309 -95392 -65661 -367067
10169 -367067 188605 -304842 11059 -48870 -126010 92385 -209644 290458 -190559 -54699
10158 36855 72770 -272676 160597 40626 17474 135980 79443 313314 146666 164115 -166358
10146 -339271 -230257 -393 -64058 100772 -176411 66530 -263407 -20764 -115469 -134106 143990
10134 47995 -24255 -146531 -100256 94925 -342255 -94330 -202333 243608 -101420 -205351
10124 -205351 360858 -99762 136686 -44552 -125776 -56364 -76998 39545 62917 -6045 -198368
10113 -198368 -96888 67993 46379 -347787 131650 3290 136819 -176857 219440 -15946 -230959
10102 -230959 -172715 -102851 78563 124475 239223 12840 -67247 283690 -272740 -262871 -175477
10091 -175477 -257386 99576 -313967 -69654 -123948 -31266 31390 28651 -284027 -162026 45586
10079 -269748 -86009 -31956 -235 -186210 -112426 -203452 -20406 234017 -89287 110185 -39183
10067 -133511 -275190 -469854 112510 -62680 126416 -33566 30105 3983 -322752 161893
10056 -530088 75651 11519 -6349 204131 -64951 -364457 230707 -125889 -398192 138285
10045 -105881 34712 -183114 82410 195600 71843 -104701 25288 -184587 -187511 -219218 99031
10033 -304407 76801 257663 317120 -247081 5160 -238383 -115593 -8341 -219815 -144414 -119710
10022 -119710 67310 -108767 104644 -280636 -120486 -68288 -8146 -124602 -168021 36852 37540
10011 37540 -95925 -126710 108704 -135305 -182644 -153836 -35260 10399 -48732 -257214 -1666
9999 -184973 -11855 -131985 -146247 -260990 -375859 19978 95752 88335 -299648 194716 -250356
9987 58792 167993 -61165 -260183 -49809 183778 -255495 162365 -50313 -42127 107351 -325031
9975 -53721 57320 167282 -193725 -331959 131145 -210788 85541 -68892 -176654 -143580 -57189
9963 -172041 -21742 -72946 128794 175141 -292832 759 -385542 36317 216383 -67779 -303455
9952 -303455 132411 -157528 -183910 -339598 37865 -305467 -142231 13742 440699 -40497
9941 -779776 -356631 26188 68161 254610 170044 27378 -158147 225420 -176131 -173831 -60188
9929 38128 -49193 116771 -368463 -32095 116139 -64578 -408437 283809 -551588 -139413
9918 5833 -387277 -76789 -30495 143544 -15644 465228 -87530 168055 -168349 -190277 -32403
9906 -235608 190176 1698 -517320 148766 210599 167303 -20178 -153890 175769 -266241 -31733
9894 264989 128506 302623 -358368 163143 -104810 185477 -142087 -55229 107860 -297260
9883 119432 302001 -171935 44408 -141651 3512 28962 -27235 185706 -378199 135671 -200905
9871 81805 -125736 -133490 56510 -545603 381353 -199622 231891 -113933 -362915 -173052
9860 -253782 -308551 2815 -129190 334222 -66873 -2034 -81191 65856 -204482 -149864 -22598
9848 60021 -79686 -336263 -508086 -94488 10062 -377133 -238215 -57234 264 -129014 14240
9836 283137 -99999 -386537 -302209 -53366 -116109 46043 65857 169777 123618 8442 87188
9825 87188 166934 -190888 -229654 -158818 -172691 -7482 -421594 -144981 -62311 -301601 -302252 -144965
9812 -210075 -61742 -90921 49709 -237046 -99868 250964 -333501 -381586 -21286 -289072 -30079
9800 -18719 -233886 -310959 -121413 -288788 -198322 172662 -467978 31082 -205064 140373
9789 -106473 -159964 24411 -131126 -150215 104786 -69834 -164974 -311410 23127 -303900 -102127
9777 -6436 16934 280317 -221558 40433 -53307 109422 -154835 -196331 -129952 -77270 114368
9765 84974 -132764 34001 -317787 -377509 -107196 506236 -195139 -104735 -90602 -29598 151688
9753 -28047 -2133 -28009 7053 -182147 33298 286974 -142550 126549 113859 -348498 78917
9741 -214895 -241186 71154 -122698 -188850 -113904 -372667 137256 139538 -8367 -238387 60633
9729 -244135 -10446 -188146 -302634 -151548 -283718 39970 65200 -161805 78914 -130404
9718 54962 -35407 93214 -281427 -333850 -61166 -287955 -93791 -67550 -74903 -140219 -1760 121316
9705 -70998 270061 -348260 263351 -526469 56766 -96878 1417 29376 -141592 -206448 173670
9693 31192 -100857 -21165 177576 128575 -9235 -65480 58636 -143633 48336 -206714 -81436
9681 1155 73209 -225736 -41353 -253164 -226368 -149399 -45669 -104633 -573135 -256912 -212970
9670 -212970 -95937 77999 -245466 110644 -151994 -24434 -204403 195556 90155 -262933
9659 37556 111059 -187390 -21468 -268650 162323 -156251 -39491 -18939 -71851 -66514 -257836
9648 -257836 279731 178796 -106169 148639 -65475 -60399 88744 -63609 36859 -20455 119735
9636 97414 67949 87613 44583 224616 81853 -276721 43555 -13555 40804 34050 142710
9625 142710 -344442 -62405 -21687 54171 -141703 78162 -247922 67022 -105792 14185 -114297
9613 41486 227504 -242655 10328 29884 257496 -263509 -113830 91995 81829 164978 -303177
9601 -108144 -213379 -28538 -13067 -176512 68932 -213304 137706 308762 193189 70458
9590 -193363 -268307 -343176 -3307 -28314 -83500 -5018 134353 -23551 -379973 99562 -8739 123866
9577 149464 62060 -342264 170567 -191043 339936 -117526 -197158 246568 -309458 -301114
9567 -301114 -46533 9642 -337578 -321961 -40434 -338852 -249269 -120094 -83283 -257688 196541
9555 63711 -85228 62817 -304161 -168017 22915 75546 45131 -43267 -83496 -66204 -144645
9544 -144645 54493 78258 -154286 -80438 -109661 202823 86552 82004 -15834 -366512 42360
9532 -251826 -43269 -69178 60114 -122573 -233648 -276365 58130 -170907 16619 -71298 -27547
9520 -34230 -77445 -258411 40492 -134737 20617 -99829 -8775 -73614 -181671 -242168 -115822
9508 -47837 96116 -200691 -94331 -89206 -30913 -99103 -26513 111413 -183001 -398536 -218950
9497 -218950 230808 65972 -124424 -25355 -171553 190881 -13730 -29845 -71549 132772 -195370
9485 -327255 23760 -161520 -132137 -152231 -229220 290842 -85799 -448748 187560 -241315 -7952
9473 208808 -138178 -175813 -942 -28249 -271898 125622 125647 -97816 106116 -529255 -7929 -177215
9461 -177215 -406520 141639 -84243 100656 -135226 -103297 -335428 -134656 -240275 -124528
9451 -124528 -169169 -219133 -48436 -160455 -171954 -56559 -180405 -42215 -61313 145078 17146
9439 36351 -393025 -138527 -1361 222295 64422 26198 125945 -299447 -125560 -187253 231968
9427 -200318 -333373 322673 163621 44603 -40632 86985 -104556 147902 21689 27859 -124993
9415 -320356 63390 62557 343612 -327780 -177380 194085 -106252 -133393 -93865 48443 37344
9404 37344 278692 36312 -15638 -143531 34641 253531 152186 233948 -271143 -313769 -149162
9392 18817 -49370 60748 -368167 -239393 143598 -465365 -286763 -30026 161633 97050 100476
9381 100476 -487138 -149162 75824 98790 -139312 290782 307571 -25811 -50451 37095 127506
9370 127506 -120351 -66424 -106566 216976 -176172 -23609 -95000 -316583 23729 -92808 27805
9358 137989 -107012 -72384 -108431 -211795 -320024 -83463 -83959 -236950 -394809 56923 -199368
9346 -320279 -186980 -334987 -96113 -176520 -133683 -293116 82080 -235267 53627 -121428 -75886
9335 -75886 -262723 204879 191964 -82980 128567 -126976 12465 -69552 -29105 -163021 46658
9323 74009 -290082 -129418 83097 208068 -341298 -325250 65289 -296726 189277 38984 171766
9312 171766 29913 101763 -43016 -308367 14925 -112916 -352896 67319 -35464 324897 -211909
9300 -168602 -325681 157193 -259399 -593 -79216 63460 89741 261532 -244257 -958 97229
9288 -108070 -125320 -10913 -64510 -110612 167553 -230168 14469 -121609 -65096 -191365 150518
9276 292008 35677 -194020 -244768 436154 42318 276552 50893 -124321 -223249 214542 -58271
9264 -152817 -361894 9911 -357765 -195786 230628 -74142 -123559 -124406 -100939 106635 -160190
9252 -177523 60178 98016 -130707 -511580 183256 139235 193159 -82986 -97465 -142646 -45561
9240 -41288 -84517 -68553 62928 261521 -154816 -52828 110340 517478 30405 -418795 53732
9228 31292 -289542 46202 66588 -107756 309603 -68897 -181008 80906 -360815 -185460 51337
9216 29515 29140 41609 16076 -279137 312589 -350566 -237269 -98259 -351645 101845 169595
9205 169595 -39064 -121624 -166905 3043 -44397 238751 -17971 140512 -115194 -66119 -277603
9194 -277603 -110294 -129551 181761 91515 -99940 376089 79702 -215827 -126419 -114587 -381839
9183 -381839 66212 62485 -327493 -266127 -314002 279550 -110403 -231710 -94313 -122150 -16612
9171 -30406 -90400 102467 -296420 -247949 117444 -33216 32799 4198 -155279 -184627 -190027
9160 -190027 238396 -82582 -540019 22494 -67890 -229394 -143636 -314202 -91042 134597 -40510
9148 57352 122324 -103029 129871 206870 56418 -81708 -418413 -329230 -373068 112098 -251639
9136 -73188 120034 155987 -262794 -87652 -204779 26697 20519 4385 -122841 -177702 90094
9124 -119441 247975 -11934 -541663 213659 -294742 -101007 13813 -84329 -274888 -305469
9114 -305469 -23387 -196115 -210466 -322999 -18011 197758 -102839 338779 139362 10 -100629
9102 -109689 -194903 -40270 138126 -396599 -251944 -176182 -138168 -146704 17058 -46592 -20347
9090 -204027 140517 -5819 19070 -219389 -14092 -175 -238087 120167 -114301 -49699 -105496
9079 -105496 194410 67682 -14644 -191594 -181065 216741 -146014 -212467 81604 -83976 -94833
9068 -94833 -274298 200792 -60810 -167933 -341939 155365 142248 -75318 -111512 -211648 -69246
9056 -59881 -55197 -506233 -171461 99167 -180380 40912 70437 -153239 293769 143860 11479
9044 93203 58493 11312 36481 24630 -344165 111064 -171102 62983 19937 299851 -186593
9032 76938 51161 -282157 -30907 313522 -282911 -213869 -221423 -103900 -138821 210379 -415367
9020 -121586 -124829 103155 231604 85279 146411 150170 -393572 396769 -43466 -179257 -74730
9008 -276668 -100465 650 52740 -249801 -77629 -355141 -88277 -51803 -1155 -86575 10004 77697
8996 77697 94849 -242304 47277 98523 -143238 -38419 66063 121134 -256817 -281713 -27285
8984 -124394 127234 -88490 128803 29120 118057 65006 13865 -168340 25627 -234877 -127620
8973 -127620 209858 240961 -43013 -37301 -94186 32295 -178191 -148947 94774 281352 -141100
8961 -313713 -290107 3292 -169597 -96807 -171521 -342173 -192120 180987 260811 337409 -150436
8949 -61923 -207932 247478 -192674 -108894 -133334 -211820 -154479 -197208 -64672 -41382 42064
8937 -361117 512473 258519 -105804 77591 568632 71712 18310 -379280 252352 -79230
8926 323167 149512 389729 399354 1812400 6662628 5441107 1066538 236198 19002 155996
8916 155996 34524 298174 -111842 -36917 -49972 16703 222288 73530 122530 -164140 89489
8904 -161291 117310 -117356 25115 -29102 259092 -15783 -148220 -428947 -231051 30474
8893 -172502 36116 -18251 -178853 -288198 26203 537042 -237660 49828 -932 -215441 -232262
8882 -232262 -127146 -12894 -199656 -98665 69394 -116726 16071 -401685 -179446 -73939 -579888
8871 -579888 -487513 74777 -61006 -13764 132519 126705 -94290 43673 -134111 -75995 -225063
8860 -225063 222801 54477 -66168 -154810 -53145 1437 158239 215647 -23664 -160820 -274736
8849 -274736 -69048 -386385 142649 -205820 6871 30334 -46276 188112 57819 219551 339420
8838 339420 -200047 87412 135891 -161089 -93192 33334 -100227 -267770 -316155 -328661 -310490
8827 -310490 -29507 -67513 -365759 -244100 -67783 -124717 155865 -57889 2547 -174065 11053
8815 -113448 -338983 37378 -67393 -66333 -371190 8525 -78146 -192815 -188303 -225257 -27934 -135977
8803 -135977 -212015 160089 -296841 62322 293009 -409352 122742 -67772 24573 101137 83299
8792 83299 -425430 -108782 168737 -210232 -78871 52738 96984 -142597 71984 107636 137757
8781 137757 248228 -124704 -66044 -123672 43056 33172 68695 51323 121620 -49681 -385308
8770 -385308 -106142 17197 -303868 168853 27421 -77553 384229 60751 -109687 -316345
8760 -316345 24857 -217170 74361 -318712 60059 -38025 -14488 -186053 -210305 314036 77774
8748 -327271 22140 238860 371685 98868 -226836 -219788 337548 -75933 -160491 -345896 -22849
8736 -446198 73618 179197 -1680 96754 -94382 -102355 -98443 -188370 150361 219220 -122650 14668
8723 -327556 -21498 -47001 -183459 -105977 -99147 -57151 -142403 -428989 -93633 -101211 -217852
8712 -217852 -214382 -93337 -339281 -6359 -49594 -210221 204813 -333654 148527 181464 186665
8701 186665 17665 246171 -322102 -203154 -169473 -101598 -219160 273931 -140619 44069
8690 346863 -105262 -92698 -129259 -344649 157438 -57390 -100435 148759 130616 197139 -159507
8678 59408 -25863 -25588 -23664 -43636 113094 40469 -84585 -279346 -201474 -302681 115517 -217279
8665 -150104 -266530 -72806 108333 -178335 -263457 -374033 21622 -231140 13748 -184253
8654 41619 -139841 -131703 13154 -231930 -141933 23505 -288108 2593 -5569 68111 36080 -132532
8641 -7632 -81611 -67992 117184 -83077 -265783 -104594 -12536 -109552 97369 61655 -161121
8629 -79899 15574 1310 305507 159682 299716 20665 -94610 -180006 -362254 -168860 -18689
8617 209522 -126447 -48402 112421 -122643 12299 14938 -297167 26651 4621 179622 -95097
8605 265978 2232 325057 26296 22004 -287812 122867 370068 24735 -524508 -45191 13355
8593 -33733 210855 44454 -40800 -231840 -82596 -256124 38844 250208 -303365 -61551 -110938
8582 -110938 178207 -115956 -28685 32833 -144627 -71603 199323 -67101 -105005 26115 216103
8571 216103 86771 -288538 -61289 -98615 97132 -151721 23130 218190 -236950 403313 156942
8559 169925 -12066 -68347 222127 -144780 -142317 -143622 -163940 133709 -38452 -288003 -108586
8547 -213423 11774 -254451 -306415 -76420 104218 180767 -115644 -187222 -114339 -116621 -174024
8536 -174024 -19600 -248071 199817 231056 -35959 -96038 181385 143840 -103878 -161710 -109285
8525 -109285 -195658 44293 -164393 111391 -427626 168200 -86647 21582 -113986 -150206 125007
8513 13017 22283 -157579 88142 -104574 -347411 -96289 -94079 -245226 -76833 179752 -101860
8501 -138177 99299 -56136 -182920 103584 28294 -8080 -191109 -31648 -260668 -316696 -27673
8489 -409672 26419 -235858 -65480 -115397 259823 -75207 -119456 -161104 -219320 -15735 -202802
8478 -202802 -80668 -336254 -153871 159998 43848 -188198 -283721 369455 -456924 106043
8467 -113720 -75026 287221 -375907 58803 -12029 261568 245926 145365 -53661 132545 -55796
8455 -51645 -308920 -215371 -129653 -81230 -309835 -375259 123038 -31246 10619 101857 -50444
8443 163691 173346 -294624 -57614 70482 -174847 25815 -422973 108052 -169161 -281242 50986
8431 188061 -48532 -96529 -111741 187271 50983 -15634 -150687 5776 -226809 -170686 -190123
8420 -190123 -248985 85057 -350753 -22278 15095 -104987 -288442 75602 -52861 -211127 299039
8408 -187778 -99602 -112171 144760 -51577 85978 126684 26490 -20274 -28995 170102 55682
8396 -39275 80252 -6676 -7749 182708 153256 -31299 32357 -113414 -75261 -192696 20868 58062
8384 58062 129791 -214544 -55660 102511 -61714 320483 116438 197561 282590 -136898 -167468
8373 -167468 -87154 8577 -35677 -286334 21543 -129159 244110 173927 -69556 942 82611 205144
8361 205144 -230985 43571 19672 -95930 -36841 118537 61063 189805 -261115 -210 22065
8349 15143 279260 86459 -122779 -93504 -150744 74749 -146432 79898 52951 58637 -82968
8337 -157454 -68 141193 -50773 -42115 -38382 -35442 -68368 -72172 -244608 4202 -80825 -316385 -118064
8323 361072 -32004 -420244 -199319 171893 -36029 -215314 -36094 -215575 25967 292346
8313 292346 -588987 235294 -41537 -18665 -116076 -305510 -249291 187137 -67970 -286231 -57067
8301 -232678 -210992 -46773 -68979 -196385 77644 -2116 75553 -269398 56226 -231845 -390613
8290 -390613 -104685 157616 -203712 -27761 -105815 -335939 146843 -16270 -86757 -28337 -326248
8279 -326248 105956 -332550 -74985 -388361 -209476 -125513 -185133 -242326 -1710 -62105 53334
8267 -46066 -275804 -286933 -303849 87243 -609283 162132 93610 37852 -5427 -8617 193637
8255 -293144 326127 -264475 30330 -32975 70489 -324394 300389 50954 109612 -40639 -218581
8244 -218581 -60231 138492 -72188 -223822 36650 -281987 -12383 -60748 249180 -412796 86347
8232 164014 79532 -155511 86717 -157485 -183379 -67239 -23990 137142 -95422 -57092 -244130
8221 -244130 -12972 -25586 -36084 53933 47433 245764 -157485 -4455 -126910 -5033 -172662
8210 -172662 -63627 42000 78001 101556 -100373 -143189 -369396 114005 56173 44648 -89489
8198 -65427 234137 12397 199666 13696 -332621 -129863 -210082 6344 -198501 -127401 247369
8186 -170040 -87834 -266455 -205302 393733 256504 -13307 -530036 -324775 -141820 52124
8175 83620 -76462 -148094 -43491 99742 56118 -167335 -97673 -164688 252529 -154205 -135980
8164 -135980 118571 87363 -5587 -130001 -37451 150618 -75581 112784 84676 182795 -330582
8152 -151113 178161 107140 -19190 87921 -57618 -119625 -191700 -258880 34080 111717 -131814
8140 -72034 13591 -138026 161982 -34192 73153 -305016 -198533 -84790 71312 5933 17253
8129 17253 -39995 -268186 -224734 390298 -369298 -217433 63619 149079 55929 -177408 86810
8117 -110889 -5429 -508226 -112641 -40015 64184 -204401 -81522 164420 30002 -295040 30390
8105 113071 -64781 -191979 -28472 -104129 -163564 101652 -132833 -180481 275151 -54433 121865
8093 256608 135474 -58893 102094 62538 -147152 105822 -530070 153323 22806 -228313
8082 211533 -140694 253680 -81941 -128511 262675 -36227 -88664 27598 -105089 214860 -228411
8070 -114462 -108938 -43109 -182843 -225125 145994 -43918 -399957 -312343 -412543 -42112 50366
8058 67180 -178684 -143403 42621 -143192 16461 -254318 -45283 -215648 129401 126182 75474
8047 75474 59271 -47964 -18706 -209106 2340 -60160 -216707 -201451 -14304 138520 283254
8036 283254 233398 -209434 21251 -399607 -66593 -17456 277765 138629 -286602 -135250
8025 70078 -140403 -223335 43560 -51049 -93260 -28729 -104616 204979 23776 -188561 -473096
8014 -473096 63878 120476 116431 35663 38240 62800 -247903 -179317 -146823 -286929 -207271 2635
8001 -514964 78795 -39179 -238573 207651 101097 -217918 -213150 -95727 -337419 161544 -242397
7989 135623 -381011 -163721 142506 -50499 -50737 105559 -356524 -251000 138589 -126986
7978 -69287 -289078 334046 94106 -91875 120129 108585 80621 297001 -170485 27691 251901
7967 251901 3139 242927 41294 -71059 -161321 25395 -82825 215659 184541 91019 -21732
7955 -114003 29195 230009 31331 40902 -203302 431388 46650 -22364 6428 -25506 -45898
7944 -45898 234821 86432 -122584 9818 67904 219245 6521 -64781 76387 -324503 22301
7932 -9309 -129286 -142986 348723 148663 152950 -158402 -135232 -31649 53457 279390 -359618
7920 -76345 122872 -3731 -296032 -91285 -29748 -76342 -244945 407363 -32816 121368 -103381
7908 -43501 -261278 118540 959 164108 -255944 -75151 78895 -144896 149578 -373475 145616
7896 -262881 -63633 30624 119793 -84121 -40725 -286161 -86341 -54231 -339265 -106182 -61951
7885 -61951 133350 184951 -127328 99770 -146630 16596 218071 -213256 109888 -194759
7874 20234 -95938 -96050 -305975 70146 113972 223590 -99395 79318 -47763 -86611 163211 -286407
7861 -194967 -130595 -431638 -413409 -93673 116180 -45162 -181971 -131395 -244333 -29510 -284486
7850 -284486 236695 -149831 -125242 11682 -60193 -139804 191071 -14600 16876 -118036 158527
7838 -64573 -81348 -172074 -372955 87776 178372 1662 131126 -183222 -90073 -122880 -63808
7827 -63808 33646 -257114 -284123 54325 -51656 -82906 -143582 -13260 -82769 -344833 -387135
7816 -387135 543 139629 -128800 -88402 -49878 -76697 -8314 62244 9613 135340 -34896 -84969
7804 -84969 -254578 155521 -37896 -372432 -11256 3196 -327295 -51116 325328 47568 332068
7793 332068 120854 -271684 -72035 -149206 -115496 189980 -50084 118307 -153222 -294691
7783 -294691 -152564 125695 139700 -397900 -95753 -104928 -28548 168925 29677 -12749 -188464
7772 -188464 9091 -94778 312936 186341 -236010 166477 148332 -24248 -96625 262121 -76039
7760 -21446 38716 -214668 -177432 -177277 5649 306755 202545 -134765 -98731 -115538 61781 -18501
7747 -20529 -141058 -39279 -182322 51000 -178389 -91308 -316734 193031 201169 221340 -4544
7735 261483 -115704 -2742 -23843 -23430 125996 -37645 89432 -64448 -136267 -76372 203488 -112846
7722 5771 101940 41748 -175892 -180642 130066 -160019 -82122 -64425 30461 119823 183264 -19471
7709 1884 188660 143743 -60588 -422188 189178 -138235 -202442 94241 130179 -70298 50449
7697 -241597 32032 -54045 -104177 -104077 44406 -72885 227314 -45170 49703 193306 -201987
7685 181479 -202616 -291836 -324721 -595697 -23132 -65777 196507 -278976 49037 58293 333517
7674 333517 -101447 -316587 -490572 91701 -205687 56069 119771 91558 91907 -98844 -85608
7663 -85608 -156269 170934 190010 140414 132773 328443 287879 -323571 151191 -315560 -1669
7651 -90700 1950 -47871 55406 -101507 63355 -124412 149620 50709 166468 -185302 -64485
7639 32644 -322290 17699 -86993 191266 81227 107781 41593 -7196 53340 3952 -285008 11173
7626 328604 88578 -418302 -144496 -215978 -152023 -280339 -292009 32365 32236 -78557 124505
7614 191129 -219272 -50264 129924 -9737 -54764 -358996 38494 -70601 -227845 -117652 -254480
7603 -254480 112496 -219060 326989 345804 -113056 245687 -6603 66830 435877 -70805 101967
7591 20970 -17141 112153 -292472 -27275 -147624 -167376 25431 -73523 162891 73854 101930
7580 101930 -158864 -47788 -48347 -85506 144315 -306310 58349 127771 50005 -111255 23724
7568 -209435 -23705 -419759 -463509 129289 141792 -90796 13235 -185958 -2411 191731 -45124
7556 -27832 95754 -129783 -15838 97868 -61027 28235 277856 -195647 -172954 -410210 10045
7544 75898 -101886 -141767 -317854 241266 85804 71482 60081 -8347 -115270 63100 395997
7533 395997 203131 -452975 -170909 -160653 -278386 5757 39859 29246 340552 -91216 381024
7521 -210324 -34080 -77746 22741 139993 92285 -169547 80277 13415 -197682 -393227 166004
7509 80261 -74366 -136131 139542 -314376 -226030 -266929 56044 -45643 -82250 41688 -289058
7497 -89446 -113237 -227834 -88111 247189 -23100 -353945 22795 73253 136229 -96593 -400196
7486 -400196 -202682 193527 -77172 4306 -10075 64274 -174873 -121041 -220765 55238 98946
7475 98946 -163757 -192722 -85073 104990 -100991 384735 -113062 136455 -197382 159114
7464 -2688 -82016 312506 86540 -78838 -159868 -127985 28903 -217442 229848 217118 14256
7452 -170062 141089 -48719 -11771 -59185 111578 -147472 115533 105176 -180262 130771
7441 -45355 -55990 -334794 30745 43007 5240 -41635 6143 -383481 -199761 25271 137159
7430 137159 91356 -156597 124847 -236839 -132910 -15146 -201491 63946 190098 -223438
7419 -170789 -125364 166666 -184010 -64671 100490 60326 10533 40395 -88108 -79711 129466
7407 -167745 146870 114166 -134707 197999 96950 -254678 -19907 -13149 -169277 -8393 217483
7395 200786 13016 6498 325871 -204280 -17256 -98829 190009 -189047 -101832 160336 -71950
7383 -151295 -80666 207868 157342 -209886 187804 -187258 44877 179821 -106096 -274370
7373 -274370 43255 -358986 48196 -247418 189720 42426 -88632 -328679 -37059 180979 11036
7361 116523 -28647 132188 -125215 -231535 -93433 -31353 193526 63262 -413881 -359373 -140944
7349 -282336 -260934 9289 -35864 24828 -47554 -315367 -293635 -163344 -29694 19870 -146175
7337 353350 265615 -122947 -223166 127847 -172339 -203222 -69510 113931 -278020 -35841
7326 59922 21475 17811 -8517 -152969 -70675 -57259 -120208 -381036 -17582 11372 -110037 -97030
7314 -97030 154858 -267858 -212933 -104025 -122456 -136379 -254764 -36188 -344884 -176800 -187452
7303 -187452 -55261 -138154 -137706 -152098 -316558 55951 229960 -519442 -475750 162889 38139
7291 -167219 -38503 -9962 117081 42883 138970 96666 138146 -267268 206843 87411 -81408
7279 78565 -54490 140151 -221261 58665 -2566 119534 -182885 26491 -71540 311984 -51679
7267 167819 155791 43072 293797 45675 25521 -82223 163938 63705 41314 299469 -20149
7255 124868 29328 83400 -354422 -230300 -77065 -228346 -61345 -8853 -66808 47504 147141
7244 147141 259505 -255076 133735 163132 -110776 12182 37743 -413672 -55589 -91229 -217886
7233 -217886 -227774 -169225 -118840 67796 267323 238203 42704 60817 -113941 -8739 57978 -183360
7220 -4122 -39942 1403 -184062 -193196 350819 279408 24315 -227790 -93775 -72918 70371 202799
7208 202799 -205264 -2235 -292728 1841 87271 -164274 -129862 200264 195335 47115 -118432
7196 -900 -97227 -284272 -298738 156334 -73019 -191540 218903 -22142 -121905 207875 156591
7185 156591 161344 -83359 268413 59421 -198458 -293477 65117 -4278 -117727 -129014 254543
7173 84792 -259298 339618 93777 -359358 -59694 103426 -259736 -214377 109803 109652 181975
7162 181975 -90217 -148260 8795 67091 -38932 82925 -51078 -67291 -747910 62818 76331 94898
7150 94898 353983 -47833 136398 -132450 12458 69344 136269 98938 238468 -95861 45766
7138 43245 -111799 221465 -110415 -82357 -261158 72609 -304052 -7027 131478 -112222 -66729
7127 -66729 -138805 83136 23809 -257584 66283 -197478 283107 -134938 450956 -57693 284946
7115 -34643 3317 -113323 -329126 -164581 -216864 -72743 228272 66700 42010 -110216 -95934
7104 -95934 112442 59169 -208030 174995 71208 152893 194006 -260372 -10189 124045 21396
7092 223445 -155845 -4865 -86051 -345797 -83285 -283466 -82327 57810 -52827 -395673 63880
7080 100847 -8024 -30719 284247 -290727 272587 -28105 159239 172294 -490189 144513 -287063
7068 -215628 -34841 -217627 -210764 -226437 -12391 247325 59155 -97822 4459 -206519 -217631
7057 -217631 -65637 -96913 -104947 -26382 125266 -170331 163503 61098 53557 -153247 -1758
7045 142255 26668 201311 88736 87179 -168224 67324 -32311 -182007 62823 -58786 -58621 -207362
7033 -207362 -349897 189120 -124370 200043 -69307 75420 -102155 -238632 -267982 -199315
7023 -199315 198831 192035 -229899 145229 214021 -55810 -225149 -119800 -183959 160852 181226
7012 181226 116145 -47305 -258361 -189653 -160790 354832 -53427 -63083 -295788 -266951 37628
7000 -151704 -198646 -139550 198273 -30412 2969 -60410 55893 163675 110379 -248651 39042
6988 28974 -195664 -17170 38768 2279 62646 -16171 -33089 -2913 150175 123319 40598 128161
6976 128161 -14514 -218409 195335 -40380 -42763 -109313 301282 -948 -271622 312720 27433
6964 -619714 114334 100093 198274 93929 -51910 -90936 11390 -75161 -232891 43471 -2711
6952 -104793 223520 -172589 -230950 -12804 -319665 432202 -151303 -17703 11001 -258476
6941 92472 109417 -125667 -162889 -105425 -139019 72045 -239355 337427 -72369 -138358 -25461
6929 83086 -201310 29196 360538 20450 -210340 -245885 104561 -7844 -244081 -32301 136608
6917 149274 15984 -204319 -4598 -246699 161348 211252 -220252 -41380 -92297 -75497 -4732
6905 -81277 140197 -195391 334164 3746 -18965 35254 -315037 -101284 191818 169140 184639
6894 184639 -120096 32068 -195501 -115667 -116256 88698 132406 56290 -168676 241171 103275
6882 -171497 -50634 -12365 -314539 37169 -115319 -143899 -124272 36894 85424 374654 -92285
6870 62259 -84738 -11351 -11271 -418203 48295 -87148 -7427 331082 -25254 130912 139663 -10584
6857 -271415 -227606 153354 -21790 -347136 223645 -322673 45482 -10819 564284 -144966
6846 -179242 -45919 70481 -353344 -78718 -288904 -97681 103136 -44174 232039 -87130 103839
6834 17168 8768 -272296 -270420 37349 49862 -145233 -12600 89728 -76261 -144172 29935 -17242
6821 107264 -124085 -93769 -241908 -72802 -10254 -109543 -123333 -143461 14503 -7422 -167813
6810 -167813 66123 305065 188239 239708 -162704 157673 282254 -196880 -50495 -40249
6800 -40249 89232 -51234 339745 17494 -41072 -157775 -3585 -141325 -153073 383292 192239
6789 192239 -122624 45688 254101 110630 95274 -43167 -97631 -46688 78986 -56267 98537
6777 -86291 -74009 52599 -183409 112366 195957 -474530 128377 127545 45313 -43440 401452
6765 10603 150603 -122062 204888 50431 36984 -147497 -210758 161705 -42408 89246 -93366
6753 226736 25815 -54128 136193 -161942 214104 115943 -203038 -249070 -440487 132537
6742 -18577 -140964 -51390 200973 18772 -93276 -169266 41931 193162 60732 -221059 -73265
6730 123265 68263 30561 -229531 191152 -28841 -38322 86892 39136 -88487 372620 -112180
6718 218090 -198396 -221078 94966 245865 169037 -2077 19365 -159698 138336 -285420 -46896
6706 200211 352134 128279 -3010 165140 -180066 31404 223969 -249727 -159736 -197178 -103043
6695 -103043 114558 49720 -189494 175606 33496 -158450 -42919 219952 -124296 -90760
6685 -90760 479918 -140808 11755 -200859 -247356 171443 40319 -429945 78438 208060 -53106
6673 -680356 -89705 -32842 -112626 -227901 -67719 476392 63186 122831 301272 -68779 -136078
6662 -136078 322905 -80430 231693 -329642 -134799 78988 -140538 -24010 -85273 41554 -78021
6650 -252232 -160049 -71294 46582 66190 108558 -8169 -78085 -94217 -57021 223038 1074 -247348
6637 78314 -169975 -306815 -90608 40558 234514 -107156 7461 -113775 110121 -71186 230085
6625 -212830 -100401 -11607 35109 92997 90439 -94813 -208137 238864 -82068 -220437 277666
6613 60888 228196 1307 -77261 251549 80761 29073 334128 -58394 240055 238644 42108
6601 -5965 -219751 145180 -16612 254624 -49913 -143431 15138 -6282 399399 273176 -187269
6589 -91363 -262170 -192504 72036 -286156 329659 -103811 125995 59397 -166484 197649
6578 -64005 10548 -3646 80027 -139805 -158088 216500 144779 -185450 -7676 -143611 26502
6566 -141594 -119520 -93158 163024 70870 -117689 144420 86093 99316 241918 -208595 -144144
6555 -144144 28887 -253507 157054 309469 -193295 -64343 -322638 -120700 -174409 -64615
6544 -134191 -10818 -323262 -150464 -37720 -224694 -239936 71812 75715 -132758 -2318 523159
6532 -302095 -148398 -82716 -108467 265716 -110757 377256 80435 -266035 43484 -448317
6521 -364145 -53466 -11745 37082 -35305 -61866 -23655 -44510 218009 -80108 -238796 59039
6509 -231743 218276 -25644 200249 332448 -137030 301861 -397505 280281 39533 -103993
6498 -69613 -286415 -67448 -77505 -420312 -164855 -64935 -92165 139883 -9027 -43845 -355128
6487 -355128 88502 -249615 -77241 -154264 -108788 24724 162636 -120844 57606 71294 -1322
6475 -3406 67072 322078 180342 73585 -8144 -84661 -155910 -155006 -168354 149467 -26979 -316659
6463 -316659 253978 212946 -118944 297079 90168 165080 -459 72571 -377929 349049 4139
6451 -104642 4443 155148 -3390 -49207 -208045 -64053 -161940 69219 -116023 -137404 -250181
6440 -250181 -204968 -197020 -174712 -48946 -184127 -78259 -24155 -186560 225624 -220375 -189780
6429 -189780 -24814 47448 -31937 92796 140727 263913 -121751 -27694 94366 56925 34202
6418 34202 -281772 316885 145886 123633 33276 144814 44023 98476 -162588 -108770 90324
6406 -87203 42641 160242 -227963 9546 138023 6441 -168956 48389 68482 -208877 55751
6394 -107793 88997 81608 100540 -185825 250130 21076 -68918 -236714 33396 62910 232734
6383 232734 141578 -249865 266943 101654 69942 -49892 -113442 283880 -206230 274887
6372 104458 -115608 278016 -207381 -244851 -182215 262543 -356207 263155 80868 -256842
6361 108718 223140 115795 68198 425720 -235884 -235490 -284448 -105137 111324 57588 -14475
6349 -250170 -236250 104066 39368 -12968 67422 -32544 -436125 -179651 276239 127997 -148922
6337 -1247 -51911 31379 155945 -87403 -52582 86110 -39845 157294 -64661 316294 -30745
6325 -30438 -222451 -192828 -62958 264503 233672 -104020 204668 98776 33575 -227269 332105
6313 94898 397659 -122523 -95510 -172734 -236619 156830 6926 -67513 -375055 -30662 -105509
6302 -105509 -209297 651350 385362 -64948 33871 132322 96485 430437 -256001 -180289 -51213
6290 -173182 -24860 -220411 133467 148207 184361 14493 -18762 3870 -39919 27043 -209011
6278 -36773 -111238 -84512 75747 -526719 -189666 159006 -38253 -116413 -38268 -114102 -414496
6267 -414496 27027 46340 348114 256907 91776 -89671 -241961 46013 92992 -155204 -392665
6256 -392665 75356 136385 -54635 218673 356678 -139477 147578 -213844 -276625 -80582 -190143
6245 -190143 311067 -212064 -183083 -132785 15547 25998 29523 -190688 -275860 -92707 226453
6233 -143882 -342524 9073 247128 75422 168189 -156726 -208221 -153375 -126549 -228576 48652
6221 -93890 -284769 -368384 -391165 522028 -21955 -41515 -23810 33802 18201 -111302 68561
6209 -248823 304406 -262925 -242483 -14180 256153 262154 347418 64923 114439 -35312 326254
6197 90888 328017 -132629 -138941 -45545 13453 250489 -18728 -71923 71355 119751 197449
6186 197449 175508 49232 -108698 53441 45170 269543 58239 116696 106794 -102198 67513
6174 245400 139294 187163 -20766 20979 -75882 396302 -14546 115470 104723 -191110 -266512
6163 -266512 -173082 87141 98556 27039 97598 283192 -250245 -4636 76199 126722 -172944
6151 26755 27142 71100 -262638 -471473 -123952 -82346 188067 -93056 -31059 155391 -119036
6139 49559 -68284 -48145 11939 465544 -123452 106487 33879 140225 -230687 696 -102590
6127 54440 52281 -203615 6777 115085 114755 -162575 101078 295356 249337 48498 10923 -218951
6114 154281 89681 -89694 96555 37004 -208993 92447 16146 98824 -92746 -199561 268883
6102 -248525 174702 129082 -57678 74475 -300157 45751 -104681 30714 -273179 -194867 223527
6090 32373 57922 -88643 85777 172791 -16231 91733 -193330 164248 -80066 48627 25376
6079 25376 264353 -137425 26266 -1951 94408 -163133 155290 -42902 382353 -274757 -254317
6068 -254317 -205086 -23050 -112403 -243983 -180654 -4569 -25020 -540434 -58286 290434 210780
6057 210780 -126956 65903 -130938 -32735 -178456 -285176 137347 61252 -109395 -274449
6047 -274449 101113 -243797 -160723 171577 -309818 -177524 69196 -163229 -143716 -17886
6036 -113333 118233 38061 70038 -68402 -184401 -69571 141341 311765 107633 -18303 74390
6024 230851 80177 378270 -264897 -322375 -143252 134938 222423 -205259 727 -234782 171153
6012 149200 -75519 224609 -118189 -217143 -209042 -219335 89720 -23359 -53542 16546 -389074
6000 17003 83103 110038 26856 -86334 244349 19954 -24657 -39726 -202011 -16057 -143998
5989 -143998 233926 -122971 -193635 5697 99176 79724 -70984 -115611 -147426 -85332 -153105
5978 -153105 -99644 22065 -138741 -221276 -41063 -47290 216912 -27074 -350714 203745 63053
5966 30801 -18580 -13480 261680 -134722 -355347 33832 -204760 -65082 -138238 -285437 19729
5954 192848 25988 -149396 414892 -2764 -117754 -15191 155213 -49263 -311112 50858 281504
5943 281504 -237163 400372 144153 -43722 -58319 -8991 13488 -30152 -387453 92685 163589
5932 163589 217750 335266 120755 189566 259453 200030 29126 125162 -128183 104100 -253302
5920 -190911 2604 192479 326959 53133 -42002 -91689 103807 -106283 72352 -356484 -121911
5908 -57830 -6441 253986 55339 168710 -109635 11797 111250 67370 -133884 17852 124239
5897 124239 176964 -139805 -302313 -89117 -18125 149294 30093 -46831 -139783 179082 -28677
5885 24650 101696 180702 190420 148402 -203402 215585 48334 203503 179809 133156 526 216754
5873 216754 34887 -147357 320100 225732 300904 28182 -55711 518688 -105961 235375 -58742
5861 -158597 66788 -85260 23126 -125549 -37604 -39567 -13921 -280942 70037 -5029 -152973
5850 -152973 74512 -103707 79614 -28304 -133939 -81327 -57950 28114 396728 252202 -11044
5838 39497 292396 120322 -45950 -76374 178109 28774 -5911 -110298 -134767 149136 -118034
5826 -141371 102656 -179743 -19608 -129427 132670 25384 164687 -143944 -108976 -135123
5816 -135123 -261400 33445 68726 -3630 8506 166187 191057 -169342 8227 -40400 18468 51077
5804 51077 99395 -112271 -79915 309847 171085 202391 -213100 65226 -169288 -8805 -154268
5793 -154268 -192985 7357 8394 363649 40340 172982 -222070 -49075 -153247 27637 367846
5782 367846 -183559 53447 106876 -22399 187635 93322 -29050 -171039 11377 198819 -95561
5770 -77094 -49840 218728 91963 61099 -84089 -124992 231932 174053 42780 -241592 140100
5758 30157 80750 -60858 -48125 -113526 114076 -280033 194756 -7726 33976 -234785 42663
5746 133171 -385445 -74474 159733 268990 28276 291037 -406609 76936 168939 -128085
5735 510890 40043 -22019 98142 225096 -72915 275349 7246 101203 223226 90313 334317
5724 334317 33415 304786 -227069 188659 -197074 56653 -256569 -231842 61229 -5744 58163
5712 33563 34217 -101513 -47205 -420585 -25585 -14236 -164352 135453 182681 -73035 -219522
5701 -219522 102978 61359 -347365 182675 -5796 56742 -120868 -385099 -410669 313416 -153994
5689 -242091 40214 -237078 -293840 -125913 -272334 -161430 -174141 -210256 114889 -301701
5678 181962 -140613 -126292 -74649 -166038 3539 -512737 -34034 298246 -376196 -200015 -32233
5666 139699 -133931 135205 -60505 23148 -187553 -203791 -107244 6767 -75039 -32591 140084
5654 -195040 238048 115622 86180 94704 -345518 -158716 -81598 -103924 105231 149541 84531
5643 84531 123558 -214505 104191 137154 31686 282616 -267044 45068 160917 119480 -219658
5631 -339930 80337 -95339 58154 924 54765 98908 155881 309725 -72189 -86795 -290774 104515
5618 -252571 195146 66002 80647 239863 -120011 176210 32159 91823 86346 66623 53906
5607 53906 52678 131530 -183280 -108352 -22109 -207002 216206 -78745 -186475 -97454 34803
5595 136875 127186 -229875 -204574 -180510 -295015 -248960 163136 -228874 75728 -205309 66280
5583 6587 -19719 -144552 -134543 -105952 125176 27683 -203155 -251838 14253 51990 56394 509
5570 26751 214721 97202 -217804 148116 -99984 156568 20603 49190 204283 66004 -4647
5558 -79680 -93060 -81603 272491 -34917 83656 291101 84222 -65727 -212390 -136651 52682
5546 98524 64691 -206840 -261061 239357 406374 -60499 -22666 35221 55188 184794 23787
5534 -259653 103312 116651 -82784 -190513 171322 121864 -63260 22383 -101388 -271358 412059
5522 -12733 175220 191422 -164239 31155 -24276 -224750 72220 -68461 83723 134786 27589
5510 222348 -137399 -185356 80222 -21465 259450 133381 106751 -93229 -69092 23568 102186
5499 102186 132297 -152952 32793 134647 51365 22370 -97683 186214 192002 101268 -19271
5487 -42642 176660 -177125 -243583 -372334 -258049 -9414 -132569 -127374 -9489 113214 58001
5476 58001 117705 -112956 -94212 -293222 -68646 -17026 30131 -39334 -176301 -124977 -124732 -120518
5464 -120518 -268809 233702 -108187 40625 -64233 123522 196982 -9619 84866 -97349 -201065
5453 -201065 -14457 -183240 -94356 -64885 79303 -60781 -212625 -91520 -155803 -223079 -85267
5441 -169036 -89227 -69706 -49177 297996 -112879 -140258 275294 20509 -185073 -90314 44228
5429 105656 40240 -145616 -278528 171354 -6232 253277 86363 -20096 185010 210265 -250935
5417 -4814 139905 -284417 -96932 267032 -74927 -8786 -93918 -203899 262786 -25128 82466
5405 215574 -43196 -259601 -65984 44349 -2927 75581 66860 -23433 -96212 61188 17616 -224819
5392 -177718 -38588 157126 -34051 64239 -100195 -121933 -337397 20560 358295 -99122 155030
5380 55280 51988 100999 90452 91382 863 476217 143840 -269370 -23996 113890 -6409 169825
5367 140116 280357 -539516 -72604 89507 284735 -212831 124720 -250902 -128174 -214178
5357 -214178 -157497 206203 176173 -202403 -52321 -711 242599 -12810 310070 92495 207735
5346 207735 312379 91013 -39085 -157818 -182443 423321 -120208 120283 133367 -77412 121196
5334 -86114 -10329 -127471 211267 -117962 -2587 -118687 -98263 23145 -296498 148705 193414
5323 193414 -6954 53441 202129 -182307 20030 -205285 -21484 -356971 123832 229978 256428
5312 256428 4168 -39672 347680 -19041 -205210 -141762 -183654 -158325 -162569 -28961 273510
5300 83532 -279084 104937 16465 -97456 -153557 53876 -120431 10611 14556 -260470 138899
5288 406702 -106840 -25601 -126649 -93711 -156330 147276 -238960 -136069 7458 96987 -79117
5276 -158181 131570 6803 81164 -1317 -193920 -159825 -139839 58898 337398 -158724 -42106
5264 -64244 193513 108089 24336 184129 -106898 -121067 10558 46396 -37894 145170 74573
5253 74573 354757 8191 167760 -58275 -151614 160420 219363 106225 -33692 -91928 -112920
5242 -112920 113395 37700 212860 111041 132786 168532 191306 -208925 47164 53261 -244504
5230 -300107 22921 35799 206714 -24074 127985 23185 124673 518269 -174753 5844 35134
5219 35134 164966 -162144 379240 -288845 -179170 265064 -265666 -186938 -228510 -114852
5209 -114852 154272 -62279 28050 79970 294835 -62896 137809 -246682 -120887 191806
5198 -165758 19456 -355283 158067 -414700 -97731 -29193 -147847 126583 -65927 264471
5187 272071 -102926 -5684 -29585 -222334 -181695 -224919 91896 -11699 -197207 293256 42896
5175 -60665 223417 99366 -256447 500754 687 -147866 -250147 -153688 -108370 26089 -98 181034
5162 236558 101897 -162115 -105872 223079 64357 -265487 -6778 -253563 -161470 43506 -234850
5150 -94611 -15120 98691 177304 -9465 -23578 47454 216058 -130892 245981 -84663 220410
5138 428119 16188 82673 -109918 126425 -193658 -92570 62258 196004 73708 -254080 -30422
5126 253493 -87912 -271768 -367722 -32940 278793 375386 421662 127298 100261 -98029 -143493
5115 -143493 -5244 -340044 -24832 114884 252491 3112 19514 -298020 -129162 102195 -175685
5103 -136135 -298253 -163244 20761 -174130 70625 91037 330824 38281 425517 263291
5093 263291 -50004 -369414 -58205 412667 -63515 -4581 -15899 -170662 132284 316611 252276
5082 252276 -102999 -144774 -105817 81099 -354542 -210869 -236859 219671 -22049 108375 7636
5070 -30469 -212917 -122716 -105548 6079 -106018 -13513 280910 -105532 3617 -109498 -45415
5058 -103782 110271 105904 32886 -126509 391460 135163 112090 76318 -124143 490668 -131776
5046 263089 -282095 -116915 53313 -25613 109584 -60040 11692 -160058 57196 120311 75850
5035 75850 -59242 -271110 248498 48400 40349 148513 -270751 -228239 18322 83878 -34820
5023 -347146 205295 71713 255315 76252 13450 41439 90129 -404911 154474 258439 -176522
5011 -33255 -261433 36466 208220 82031 -177977 -275721 95836 -213985 -135430 -22392 -234805
5000 -234805 -249594 -5574 156192 219122 -167763 52171 51236 132559 142762 318013 384448 177157
4987 -86535 -12254 -9075 -72246 -117495 -170643 -82989 241370 83334 -4050 106655 21798 277287
4975 277287 66602 17532 -116690 -117541 -18412 -35015 124724 -61082 -35928 -236722 -155456
4964 -155456 -189203 313054 298488 -10352 20397 118315 -29751 163198 -44995 33699 66369
4953 66369 27774 33890 161799 101504 228922 -89488 -343629 174102 -155708 473089 157504
4941 14601 -169564 133631 129548 -183403 -153617 198729 10779 -85721 121446 -136085 297550
4929 -75887 126088 81346 7673 48692 -83003 268291 -202712 -7744 -61222 -163605 -282320
4918 -282320 -164011 -229541 -79337 152446 252111 -22511 -69237 -282555 155264 -75194 -59514
4907 -59514 -130589 54983 -1326 -1686 -203855 -228808 -332047 76344 189563 15624 -91978 204696
4894 -287729 -98695 156154 -370001 244685 -19645 -87182 121989 -268529 -112932 -156040
4884 -156040 235035 217965 129205 -158037 35547 -32089 -8800 45194 -98115 2581 51157 -80926
4871 44195 -19448 129794 109328 -261942 -140921 -137836 -227705 257081 -276020 -64470 -125974
4860 -125974 54709 -114238 21705 378368 -241429 -14809 -51027 24564 -115911 124852 -20022
4848 -416609 275489 -16463 -371851 -64634 -73956 117718 -29383 -37072 55006 424769 -49247
4836 -27336 62037 -356355 -96984 49426 -58669 276445 126805 -217709 -25316 -220252 -307631
4825 -307631 153736 -46042 -17234 -201351 270732 -21153 202261 -174365 -27503 131031
4814 -404750 84676 293134 265051 127303 -74022 -58342 -159993 174934 -349184 -105965
4803 168524 -53948 176591 -37863 355388 -12805 193111 34 51706 -132887 -92897 200933
4791 186411 351922 291217 119616 196794 73142 92713 -581477 -141573 -302498 19714 197918
4780 197918 286744 -140188 35955 226188 64779 329709 59800 118945 -202148 -22703 -108791
4769 -108791 72208 -76478 129107 156475 248214 58197 156468 -377563 39902 -39084 -115541
4758 -115541 415462 -101714 -15867 88987 15861 129358 -29931 -165429 -219927 -225223 -147336
4747 -147336 25391 -204177 -202133 -183198 437932 18272 133822 144217 271721 263044 371654
4736 371654 238663 181091 160614 229323 107170 -166639 -176614 45387 -236284 -91229 215867
4724 80692 -214892 153077 58088 -310446 193250 -254793 -130108 269619 -39499 145756
4713 231304 -48613 158204 9376 99942 261251 -53440 62795 33872 151957 -65196 -116463
4702 -116463 -258925 -106614 -217989 -223299 -5776 10355 -97238 -187830 287487 -129374 179104
4690 -138289 -31881 10206 181581 -104936 257930 -185380 -55079 -9016 -130583 204811 -324948
4678 17310 -35288 79334 12539 80019 167302 117361 44269 -253247 -90936 354778 93249
4666 -281258 300456 -55302 -255534 113869 148591 -146858 -185575 20394 -168323 -62348 4545
4654 454792 219490 258274 -136881 -331366 135403 -55149 -21522 -38602 -197313 -3706 169438
4642 19174 82689 153199 -51207 -3911 74298 37065 -25471 -131864 -227500 -14926 -103011 75038
4629 -157985 -62560 -1375 25345 -50754 61468 -160951 194834 -170346 -176091 -47232 -12619
4617 24821 31247 89331 374017 433 5166 313955 -160090 -13637 127229 -147590 -25306 118481
4604 19778 -106365 116884 -98560 53343 -3676 236760 -177921 -270589 82370 -61541 -154969
4593 -154969 228473 10865 -57326 -10696 -352170 -370141 -157245 -155690 -29815 -43442 -251797
4582 -251797 -157342 -34832 247156 -238037 -83417 -185366 143497 38944 -92410 16734 -1995
4570 100840 -63381 -78013 -95694 102420 -99806 -315777 14554 -34462 189203 26242 42424
4559 42424 -48205 216644 24318 -14912 241869 135592 -87437 -150069 135134 -75348 -190
4547 52970 59699 191721 30316 75302 -12693 -74668 327516 172753 117937 151353 127049
4536 127049 282880 182143 67374 -291537 126994 76000 -80959 -161508 -154809 -196228 80617
4524 53745 79189 -76053 359527 101692 -144975 -12650 249426 -22697 -107281 27758 -65241
4512 -115405 -339410 228915 211151 4259 -354691 -361063 -105300 -201160 170807 123630 8766
4500 81858 -113501 -414297 227222 347961 -325932 -63264 -9314 181770 125086 96072 36852
$$ [...]
##END NTUPLES=NMR SPECTRUM
##END=
