
##TITLE=AC1318_SSUAH12147_6535344_7FNUsokbu0
##JCAMPDX= 6.0         $$ Bruker NMR JCAMP-DX V2.0
##DATA TYPE= NMR SPECTRUM
##DATA CLASS= NTUPLES
##ORIGIN= BRUKER
##OWNER= Administrator
$$ 1.72 TOPSPIN		Version 2.1
$$ 2012-12-13 18:44:52.531 -0500  Administrator@X
$$ Compression mode = diff/dup
##.OBSERVE FREQUENCY= 400.02188249412
##.OBSERVE NUCLEUS= ^1H
##.ACQUISITION MODE= SIMULTANEOUS (DQD)
##.ACQUISITION SCHEME= undefined
##.AVERAGES= 64
##.DIGITISER RES= 22
##SPECTROMETER/DATA SYSTEM= spect
##.PULSE SEQUENCE= noesygpps1d.comp
##.SOLVENT NAME= COFFEE_meoh
##.SHIFT REFERENCE= INTERNAL, COFFEE_meoh, 1, 14.96083
##AUDIT TRAIL= $$ (NUMBER, WHEN, WHO, WHERE, PROCESS, VERSION, WHAT)
$$ ##TITLE= Audit trail, TOPSPIN		Version 2.1
$$ ##JCAMPDX= 5.01
$$ ##ORIGIN= Bruker BioSpin GmbH
$$ ##OWNER= Administrator
$$ $$ E:\/data/COFFEE/nmr/AC1318_SSUAH12147_6535344_7FNUsokbu0/22/pdata/1/auditp.txt
$$ ##AUDIT TRAIL=  $$ (NUMBER, WHEN, WHO, WHERE, PROCESS, VERSION, WHAT)
(   1,<2012-12-13 18:44:46.734 -0500>,<Administrator>,<X>,<go>,<TOPSPIN 2.1>,
      <created by zg
	started at 2012-12-13 18:33:16.607 -0500,
	POWCHK enabled, PULCHK disabled,
       configuration hash MD5:
       86 BA 57 50 F2 9D 5C 9B 26 00 A9 28 5F 66 2E 89
       data hash MD5: 64K
       F3 8A 1E 70 D6 9B A2 52 EF 4F A7 83 11 49 6F 13>)
(   2,<2012-12-13 18:44:49.797 -0500>,<Administrator>,<X>,<proc1d>,<TOPSPIN 2.1>,
      <Start of raw data processing
       efp LB = 0.3 FT_mod = 6 PKNL = 1 PHC0 = 0 PHC1 = 0 SI = 128K 
       data hash MD5: 128K
       83 6E A7 0F 68 8B 62 63 39 20 B8 8B AA 49 7F C5>)
(   3,<2012-12-13 18:44:50.828 -0500>,<Administrator>,<X>,<proc1d>,<TOPSPIN 2.1>,
      <pk PHC0 = -77.65686 PHC1 = 0 
       data hash MD5: 128K
       A8 7B 3D 58 02 AB FE 56 14 93 31 90 4C 86 42 D6>)
(   4,<2012-12-13 18:44:51.500 -0500>,<Administrator>,<X>,<proc1d>,<TOPSPIN 2.1>,
      <abs ABSG = 1 
       data hash MD5: 128K
       EA 91 ED 19 78 08 91 C6 2F FA 4A 62 A0 7F 76 BF>)
(   5,<2012-12-13 18:44:51.672 -0500>,<Administrator>,<X>,<proc1d>,<TOPSPIN 2.1>,
      <abs ABSG = 2 
       data hash MD5: 128K
       37 E2 18 2F 7E 03 D9 4C 84 9A 9B 6B 8C D6 F0 34>)
(   6,<2012-12-13 18:44:51.844 -0500>,<Administrator>,<X>,<proc1d>,<TOPSPIN 2.1>,
      <abs ABSG = 3 
       data hash MD5: 128K
       AE 21 86 22 FF 92 1D D2 F3 28 22 83 5F 73 82 5C>)
(   7,<2012-12-13 18:44:52.000 -0500>,<Administrator>,<X>,<proc1d>,<TOPSPIN 2.1>,
      <abs ABSG = 4 
       data hash MD5: 128K
       97 EC E2 6F 62 DD 54 98 93 EA C0 E6 35 C6 AF 09>)
(   8,<2012-12-13 18:44:52.156 -0500>,<Administrator>,<X>,<proc1d>,<TOPSPIN 2.1>,
      <abs ABSG = 5 
       data hash MD5: 128K
       3B 3A 5D 7A F3 7C 7A 90 2D 91 71 C1 50 51 99 C2>)
$$ ##END=
$$ 
$$ $$ hash MD5
$$ $$ CE CC 6D 70 6C FD 46 59 BD 33 60 C8 A6 84 4D 5D
##$RELAX= 
##$RELAX= 
##$RELAX= 
##$RELAX= 
##$RELAX= 
##$RELAX= 
##$RELAX= 
##$RELAX= 
$$ Bruker specific parameters
$$ --------------------------
##$DU= <E:\>
##$EXPNO= 22
$$ [...]
##$TP07= 0
##$TPNAME0= <>
##$TPNAME1= <>
##$TPNAME2= <>
##$TPNAME3= <>
##$TPNAME4= <>
##$TPNAME5= <>
##$TPNAME6= <>
##$TPNAME7= <>
##$TPOAL= (0..7)
0.5 0.5 0.5 0.5 0.5 0.5 0.5 0.5
##$TPOFFS= (0..7)
0 0 0 0 0 0 0 0
##$TUNHIN= 0
##$TUNHOUT= 0
##$TUNXOUT= 0
##$USERA1= <user>
##$USERA2= <user>
##$USERA3= <user>
##$USERA4= <user>
##$USERA5= <user>
##$V9= 5
##$VALIST= <valist>
##$VCLIST= <CCCCCCCCCCCCCCC>
##$VD= 0
##$VDLIST= <DDDDDDDDDDDDDDD>
##$VPLIST= <PPPPPPPPPPPPPPP>
##$VTLIST= <TTTTTTTTTTTTTTT>
##$WBST= 1024
##$WBSW= 4
##$XGAIN= (0..3)
0 0 0 0
##$XL= 0
##$YL= 0
##$YMAX_a= 5949848
##$YMIN_a= -13199425
##$ZGOPTNS= <>
##$ZL1= 120
##$ZL2= 120
##$ZL3= 120
##$ZL4= 120
##$ABSF1= 14.96083
##$ABSF2= -5.597352
##$ABSG= 5
##$ABSL= 3
##$ALPHA= 0
##$AQORDER= 0
##$ASSFAC= 0
##$ASSFACI= 0
##$ASSFACX= 0
##$ASSWID= 0
##$AUNMP= <proc_prof1d_extract.lims>
##$AXLEFT= 0
##$AXNAME= <>
##$AXNUC= <1H>
##$AXRIGHT= 0
##$AXTYPE= 0
##$AXUNIT= <>
##$AZFE= 0.1
##$AZFW= 0.1
##$BCFW= 0
##$BC_mod= 0
##$BYTORDP= 0
##$COROFFS= 0
##$CY= 15
##$DATMOD= 1
##$DC= 0
##$DFILT= <>
##$DTYPP= 0
##$F1P= 0
##$F2P= 0
##$FCOR= 0.5
##$FTSIZE= 131072
##$FT_mod= 6
##$GAMMA= 0
##$GB= 0
##$INTBC= 1
##$INTSCL= 1
##$ISEN= 128
##$LB= 0.3
##$LEV0= 0
##$LPBIN= 0
##$MAXI= 10000
##$MC2= 0
##$MEAN= 0
##$ME_mod= 0
##$MI= 0
##$NCOEF= 0
##$NC_proc= -2
##$NLEV= 6
##$NOISF1= 0
##$NOISF2= 0
##$NSP= 0
##$NTH_PI= 0
##$NZP= 0
##$OFFSET= 14.96083
##$PC= 1
##$PHC0= -77.65686
##$PHC1= 0
##$PH_mod= 1
##$PKNL= yes
##$PPARMOD= 0
##$PPDIAG= 0
##$PPIPTYP= 0
##$PPMPNUM= 2147483647
##$PPRESOL= 1
##$PSCAL= 4
##$PSIGN= 0
##$PYNMP= <proc.py>
##$REVERSE= no
##$SF= 400.020009703887
##$SI= 131072
##$SIGF1= 0
##$SIGF2= 0
##$SINO= 400
##$SIOLD= 131072
##$SPECTYP= <>
##$SREGLST= <1H.CDCl3>
##$SSB= 0
##$STSI= 131072
##$STSR= 0
##$SW_p= 8223.68421052631
##$SYMM= 0
##$S_DEV= 0
##$TDeff= 65536
##$TDoff= 0
##$TI= <>
##$TILT= no
##$TM1= 0
##$TM2= 0
##$TOPLEV= 0
##$USERP1= <user>
##$USERP2= <user>
##$USERP3= <user>
##$USERP4= <user>
##$USERP5= <user>
##$WDW= 1
##$XDIM= 131072
##$YMAX_p= 464096646
##$YMIN_p= -12937
##$CURPLOT= <Network HP LaserJet P1505>
##$CURPRIN= <$Network HP LaserJet P1505>
##$DFORMAT= <normdp>
##$LAYOUT= <+/1D_H.xwp>
##$LFORMAT= <normlp>
##$PFORMAT= <normpl>
##$SURQMSG= 1
$$ End of Bruker specific parameters
$$ ---------------------------------
##NTUPLES= NMR SPECTRUM
##VAR_NAME=  FREQUENCY,     SPECTRUM/REAL,   SPECTRUM/IMAG
##SYMBOL=    X,             R,               I
##VAR_TYPE=  INDEPENDENT,   DEPENDENT,       DEPENDENT
##VAR_FORM=  AFFN,          ASDF,            ASDF
##VAR_DIM=   131072,        131072,          131072
##UNITS=     HZ,            ARBITRARY UNITS, ARBITRARY UNITS
##FACTOR=    0.0627417313425164, 1,          1
##FIRST=     8223.62146879497, 3636,         -58793
##LAST=      0,             5798,            -57726
##MIN=       0,             -12937,          0
##MAX=       8223.62146879497, 464096646,    0
$$ Real data points
##PAGE= N=1
##DATA TABLE= (X++(R..R)), XYDATA
$$ [...]
$$ plain form
63906 1770421 1637221 1520884 1419045 1330129 1252512 1184294 1124212 1071917 1026806 987289 951769
63895 951769 919774 891481 866489 843669 821964 800784 779747 758616 737573 717239 698283
63884 698283 681162 666135 653306 642595 633857 627161 622924 621687 623669 628524 635640 644739 656063
63871 656063 669870 685995 704065 723939 745534 768280 791126 813214 834383 855016 875536
63860 875536 895989 915824 934002 949472 961613 970233 975379 977308 976438 973003 966811 957572 945315
63847 945315 930247 912381 891681 868520 843650 817748 791268 764632 738158 711794 685224
63836 685224 658365 631520 605080 579269 554264 530374 508064 487788 469607 452967 437198
63825 437198 422359 409169 397827 387445 377100 367002 357959 350085 342837 336114 330442 326022 322342
$$ packed form
63906A770421j33200j16337j01839q8916p7617o8218o0082n2295m5111l9517l5520
63895I51769l1995k8293k4992k2820k1705k1180k1037k1131k1043k0334j8956
63884F98283j7121j5027j2829j0711q738o696m237j237J982M855P116R099J1324
63871F56063J3807J6125J8070J9874K1595K2746K2846K2088K1169K0633K0520
63860H75536K0453J9835J8178J5470J2141Q620N146J929q70l435o192r239j2257
63847I45315j5068j7866k0700k3161k4870k5902k6480k6636k6474k6364k6570
63836F85224k6859k6845k6440k5811k5005k3890k2310k0276j8181j6640j5769
63825D37198j4839j3190j1342j0382j0345j0098r043p874p248o723n672m420l680
$$ plain form
63812 322342 318842 315366 311851 308221 304716 301740 299263 297004 295250 294709 295252 295540 294439 292231 289906
63797 289906 287748 285273 282268 279230 276728 274753 272842 270621 268164 265818 263690 261457 258898 256461
63783 256461 254897 254326 254084 253549 252720 251815 250787 249517 248217 247338 247235 247993 249303 250452 250771 250248 249385
63766 249385 248449 247280 245980 245179 245250 245650 245511 244637 243572 242877 242754 243189 244029 244871 245185 244679 243499 242141
63748 242141 241198 241066 241764 243084 244863 247002 249325 251713 254343 257492 261110 264901 268747 272612 276071
63733 276071 278522 280071 281641 283866 286343 288347 289862 291478 293631 296405 299813 303807 308124 312584
63719 312584 317355 322554 327685 331915 334851 336670 337579 337599 336874 335785 334558 333088 331242 329121 326919
63704 326919 324735 322647 320786 319173 317627 316054 314805 314575 315790 318112 320680 322927 325164 328206
$$ packed form
63812C22342l500l476l515l630l505k976k477k259j754n41N43K88j101k208k325
63797B89906k158k475l005l038k502j975j911k221k457k346k128k233k559k437
63783B56461j564n71k42n35q29r05j028j270j300q79j03P58J310J149L19n23q63
63766B49385r36j169j300q01P1M00j39q74j065o95j23M35Q40Q42L14n06j180j358
63748B42141r43j32O98J320J779K139K323K388K630L149L618L791L846L865L459
63733B76071K451J549J570K225K477K004J515J616K153K774L408L994M317M460
63719C12584M771N199N131M230K936J819R09K0p25j089j227j470j846k121k202
63704C26919k184k088j861j613j546j573j249k30J215K322K568K247K237L042
$$ plain form
63690 328206 332403 337149 341440 344797 347517 350052 352342 353866 354272 353780 352942 352167 351617 351383 351447 351527 351321
63673 351321 351024 351240 352238 353627 354913 356048 357101 357870 358249 358629 359375 360104 360079 359122 357541 355286 351948
63656 351948 347595 342867 338070 332894 327261 321812 317182 313343 310064 307471 305678 304298 302903 301751
63642 301751 301495 302320 303770 305328 306846 308498 310638 313626 317486 321773 326048 330418 335357 341015 346984
63627 346984 352851 358739 365127 372209 379699 387428 395954 406224 418522 432106 446132 460643 476353
63614 476353 493878 513690 536453 562535 591216 621188 652036 684561 719322 755471 791259
63603 791259 824988 854967 879219 896109 905231 907300 903458 895146 884342 873169 863014 854148
63591 854148 846090 838052 829154 818544 805454 789098 768803 744580 717542 689491 661997 635928
$$ packed form
63690C28206M197M746M291L357K720K535K290J524M06m92q38p75n50k34O4Q0k06
63673C51321k97K16R98J389J286J135J053P69L79L80P46P29k5r57j581k255l338
63656C51948m353m728m797n176n633n449m630l839l279k593j793j380j395j152
63642C01751k56Q25J450J558J518J652K140K988L860M287M275M370M939N658N969
63627C46984N867N888O388P082P490P729Q526J0270J2298J3584J4026J4511J5710
63614D76353J7525J9812K2763K6082K8681K9972L0848L2525L4761L6149L5788
63603G91259L3729K9979K4252J6890R122K069l842q312j0804j1173j0155q866
63591H54148q058q038q898j0610j3090j6356k0295k4223k7038k8051k7494k6069
$$ plain form
63579 635928 611763 590054 571390 555914 543088 532168 522955 515809 510846 507558 505558 505229 507084
63566 507084 510742 515253 520314 526401 533693 541683 550002 558879 568487 578543 588861 599759 611567
63553 611567 624431 638977 656503 678007 703531 732906 766664 805748 850682 901079 954881
63542 954881 1007226 1050951 1079778 1091624 1088812 1075732 1056835 1036049 1016423 999598 985943 975230
63530 975230 966878 959774 952470 943595 931726 915170 892641 864222 831229 795139 757167 718737
63518 718737 681586 647045 615543 587007 561393 538651 518413 500014 482915 467122 453153
63507 453153 441435 431703 423263 415851 409798 405189 401383 397715 394190 391050 388087 384982 381962 379510
63493 379510 377670 376275 375582 375994 377168 378096 378151 377571 376909 376525 376651 377493 379131 381565 384830 388763 392826
$$ packed form
63579F35928k4165k1709j8664j5476j2826j0920r213p146m963l288k000l29J855
63566E07084L658M511N061O087P292P990Q319Q877R608J0056J0318J0898J1808
63553F11567J2864J4546J7526K1504K5524K9375L3758L9084M4934N0397N3802
63542I54881N2345M3725K8827J1846k812j3080j8897k0786j9626j6825j3655j0713
63530I75230q352p104p304q875j1869j6556k2529k8419l2993l6090l7972l8430
63518G18737l7151l4541l1502k8536k5614k2742k0238j8399j7099j5793j3969
63507D53153j1718r732q440p412o053m609l806l668l525l140k963l105l020k452
63493C79510j840j395o93M12J174R28N5n80o62l84J26Q42J638K434L265L933M063
$$ plain form
63476 392826 396579 400245 404334 408746 412604 414946 415292 413742 410911 407637 404310 400602 396207 391601
63462 391601 387611 384504 382017 379981 378260 376330 373825 371410 370322 370880 372238 373735 375738 378918
63448 378918 383413 389058 395816 403575 412037 421144 431210 442290 453937 465977 479144 494561 512971
63435 512971 534909 561304 593154 630263 670333 709278 742656 767402 782843 790365 792271 791028
63423 791028 789215 789457 793879 803613 818913 839611 865466 896379 932340 972914 1016495 1060059
63411 1060059 1099753 1131933 1154138 1165652 1167376 1161141 1149155 1133920 1118045 1103489 1090958 1080124
63399 1080124 1070064 1059165 1045127 1026029 1001493 972412 939645 903652 865338 826426 788654
63388 788654 752989 719761 689035 660733 634873 611870 592196 575682 561688 550035 541154 535146
$$ packed form
63476C92826L753L666M089M412L858K342L46j550k831l274l327l708m395m606
63462C91601l990l107k487k036j721j930k505k415j088N58J358J497K003L180
63448C78918M495N645O758P759Q462R107J0066J1080J1647J2040J3167J5417J8410
63435E12971K1938K6395L1850L7109M0070L8945L3378K4746J5441P522J906j243
63423G91028j813K42M422R734J5300K0698K5855L0913L5961M0574M3581M3564
63411A060059L9694L2180K2205J1514J724o235j1986j5235j5875j4556j2531j0834
63399A080124j0060j0899j4038j9098k4536k9081l2767l5993l8314l8912l7772
63388G88654l5665l3228l0726k8302k5860k3003j9674j6514j3994j1653q881o008
$$ plain form
63376 535146 531331 529109 528662 530361 534043 539373 546464 555520 566181 577869 590724 605652 623367
63363 623367 643680 665758 688832 712742 738148 766273 798199 834143 873301 914287 955696
63352 955696 996281 1034652 1068894 1096717 1116268 1126853 1128929 1123689 1112917 1098884 1083761 1068928
63340 1068928 1055007 1042267 1030440 1018210 1003537 984775 961294 933179 901015 866065 830027
63329 830027 794213 759305 726052 695693 669372 647517 630038 616756 607506 602349 601836 606164
63317 606164 613282 618325 616047 604222 584586 560818 536163 512626 491340 472880 457318 444317
63305 444317 433372 424091 416420 410574 406591 403959 401808 399505 396974 394450 392047 389638 387065 384308
63291 384308 381334 377864 373551 368501 363395 358907 355138 351792 348694 345866 343337 341275 340108 340052 340570
$$ packed form
63376E35146l815k222m47J699L682N330P091R056J0661J1688J2855J4928J7715
63363F23367K0313K2078K3074K3910K5406K8125L1926L5944L9158M0986M1409
63352I55696M0585L8371L4242K7823J9551J0585K076n240j0772j4033j5123j4833
63340A068928j3921j2740j1827j2230j4673j8762k3481k8115l2164l4950l6038
63329H30027l5814l4908l3253l0359k6321k1855j7479j3282r250n157n13M328
63317F06164P118N043k278j1825j9636k3768k4655k3537k1286j8460j5562j3001
63305D44317j0945r281p671n846l983k632k151k303k531k524k403k409k573k757
63291C84308k974l470m313n050n106m488l769l346l098k828k529k062j167n6N18
$$ plain form
63276 340570 340850 340829 341237 342509 344168 345463 346162 346491 346728 347114 347781 348499 348830 348817 349141 350327 352118 354042
63258 354042 356238 359223 362948 366647 369704 372373 375450 379435 384102 388853 393400 398086 403559 410197
63244 410197 417871 426220 435129 445037 456758 470752 486521 503071 520161 538636 559271 581779
63232 581779 605507 630569 657399 685450 713374 740546 767493 794599 821292 846897 871532
63221 871532 895735 919792 943873 968259 993021 1017991 1043373 1069717 1096711 1122507 1144884
63210 1144884 1162752 1175964 1184086 1186074 1181096 1169092 1150635 1126644 1098202 1066245 1031446 994596
63198 994596 956934 919904 884722 852329 823432 798334 776962 759245 745158 734286 725874 719630
63186 719630 716066 715676 718221 723248 730817 741113 753690 767700 782653 798419 814704 831088 847458
$$ packed form
63276C40570K80k1M08J272J659J295O99L29K37L86O67P18L31j3L24J186J791J924
63258C54042K196K985L725L699L057K669L077L985M667M751M547M686N473O638
63244D10197P674Q349Q909R908J1721J3994J5769J6550J7090J8475K0635K2508
63232E81779K3728K5062K6830K8051K7924K7172K6947K7106K6693K5605K4635
63221H71532K4203K4057K4081K4386K4762K4970K5382K6344K6994K5796K2377
63210A144884J7868J3212Q122J988m978j2004j8457k3991k8442l1957l4799l6850
63198I94596l7662l7030l5182l2393k8897k5098k1372j7717j4087j0872q412o244
63186G19630l564l90K545N027P569J0296J2577J4010J4953J5766J6285J6384J6370
$$ plain form
63173 847458 863933 880431 896704 912644 928158 942938 956772 969822 981989 992170 998695 1000535
63161 1000535 997663 990383 978813 963007 943096 919327 892407 863756 834880 806376 777980 749687
63149 749687 722388 697212 674588 654160 635440 618323 603043 589749 578175 567827 558529 550532
63137 550532 543973 538501 533725 529784 527146 525902 525568 525481 525266 525127 525919 528631 533434 539352 545243 550862
63121 550862 556609 562459 567772 572198 576267 580800 585968 591116 595495 599119 602758 606954 611189 614466
63107 614466 616692 618822 621419 623798 625161 625876 626756 627509 626921 624571 621460 618782 616833 615310 614011
63092 614011 612907 611999 611440 611378 611489 611082 609895 608478 607562 607372 607791 608809 610514 612875 615882 619732
63076 619732 624605 630341 636545 642956 649543 656329 663384 671002 679687 689795 701279 713965 727998
$$ packed form
63173H47458J6475J6498J6273J5940J5514J4780J3834J3050J2167J0181O525J840
63161A000535k872p280j1570j5806j9911k3769k6920k8651k8876k8504k8396k8293
63149G49687k7299k5176k2624k0428j8720j7117j5280j3294j1574j0348r298p997
63137E50532o559n472m776l941k638j244l34q7k15j39P92K712M803N918N891N619
63121E50862N747N850N313M426M069M533N168N148M379L624L639M196M235L277
63107F14466K226K130K597K379J363P15Q80P53n88k350l111k678j949j523j299
63092F14011j104r08n59o2J11m07j187j417r16j90M19J018J705K361L007L850
63076F19732M873N736O204O411O587O786P055P618Q685J0108J1484J2686J4033
$$ plain form
63063 727998 743757 761247 779962 799676 821103 845292 872526 902400 935001 971250 1011864
63052 1011864 1056597 1104886 1156627 1211864 1270223 1331173 1394415 1459476 1525332 1591018 1656228
63041 1656228 1720716 1783533 1843703 1901457 1958049 2014428 2070786 2127205 2183883 2240564 2296406
63030 2296406 2350429 2401391 2447094 2484543 2511111 2525185 2525658 2511538 2482391 2438741 2381808 2313236
63018 2313236 2235234 2150543 2061933 1971913 1882884 1797145 1716530 1642271 1575183 1515700 1463810
63007 1463810 1419456 1382980 1354754 1334445 1321206 1314630 1314846 1321563 1333553 1349352 1367991 1388934
62995 1388934 1411818 1436454 1462538 1489134 1514989 1539705 1564192 1589573 1615925 1642254 1667271
62984 1667271 1689929 1709563 1725898 1738639 1746870 1749079 1743938 1730812 1709565 1680438 1644281 1602317
$$ packed form
63063G27998J5759J7490J8715J9714K1427K4189K7234K9874L2601L6249M0614
63052A011864M4733M8289N1741N5237N8359O0950O3242O5061O5856O5686O5210
63041A656228O4488O2817O0170N7754N6592N6379N6358N6419N6678N6681N5842
63030B296406N4023N0962M5703L7449K6568J4074M73j4120k9147m3650n6933o8572
63018B313236p8002q4691q8610r0020q9029q5739q0615p4259o7088n9483n1890
63007A463810m4354l6476k8226k0309j3239o576K16O717J1990J5799J8639K0943
62995A388934K2884K4636K6084K6596K5855K4716K4487K5381K6352K6329K5017
62984A667271K2658J9634J6335J2741Q231K209n141j3126k1247k9127l6157m1964
$$ plain form
62972 1602317 1555403 1504011 1449214 1393056 1337464 1283265 1230688 1180375 1133281 1089891 1050179
62961 1050179 1014170 981984 953372 927631 903952 881589 859857 838358 817152 796453 776294
62950 776294 756706 737994 720467 704083 688649 674201 660802 648133 635750 623666 612230
62939 612230 601483 591071 580906 571466 563209 555986 549289 542968 537435 533134 529989 527471 525168
62926 525168 523067 521235 519469 517599 515936 514963 514534 513816 512238 510100 508026 506216 504493 502732 500841
62911 500841 498615 496061 493600 491463 489113 485819 481772 478074 475525 473872 472320 470360 467952 465385
62897 465385 463248 462232 462524 463560 464580 465382 466276 467383 468261 468312 467448 466303 465707 465881 466207 465973 465343
62880 465343 465268 466244 467501 467794 466856 465596 464914 464843 465005 465302 465728 465913 465520 464905 464788 465238 465558 465290 464768
$$ packed form
62972A602317m6914n1392n4797n6158n5592n4199n2577n0313m7094m3390l9712
62961A050179l6009l2186k8612k5741k3679k2363k1732k1499k1206k0699k0159
62950G76294j9588j8712j7527j6384j5434j4448j3399j2669j2383j2084j1436
62939F12230j0747j0412j0165r440q257p223o697o321n533m301l145k518k303
62926E25168k101j832j766j870j663r73m29p18j578k138k074j810j723j761j891
62911E00841k226k554k461k137k350l294m047l698k549j653j552j960k408k567
62897D65385k137j016K92J036J020Q02Q94J107Q78N1q64j145n96J74L26k34o30
62880D65343p5R76J257K93r38j260o82p1J62K97M26J85l93o15j17M50L20k68n22
$$ plain form
62861 464768 464441 464183 463681 463112 462961 463329 463851 464168 464206 464102 464189 464883 466297 468054 469741 471342 472933 474228
62843 474228 474909 475200 475581 475972 475743 474629 473117 471821 470877 470151 469648 469445 469458 469512 469534 469601 469908 470617 471535
62824 471535 472085 471964 471845 472947 475795 479755 483889 487842 491714 495553 499388 503470 508071 513152 518504
62809 518504 524115 530107 536364 542508 548296 553984 560252 567782 576782 586856 597368 608020 619033
62796 619033 630815 643527 656982 670909 685407 701184 719171 739817 762979 788758 818183
62785 818183 852592 892469 937371 987058 1042204 1103858 1172591 1248374 1330986 1420213 1515800
62774 1515800 1617267 1723522 1832466 1941198 2046773 2146694 2238630 2319947 2387774 2439528
62764 2439528 2473417 2488582 2484928 2462797 2422890 2366561 2295972 2213717 2122362 2024578 1923373
$$ packed form
62861D64768l27k58n02n69j51L68N22L17L8j04Q7O94J414J757J687J601J591J295
62843D74228O81K91L81L91k29j114j512j296r44p26n03k03J3N4K2O7L07P09R18
62824D71535N50j21j19J102K848L960M134L953L872L839L835M082M601N081N352
62809E18504N611N992O257O144N788N688O268P530R000J0074J0512J0652J1013
62796F19033J1782J2712J3455J3927J4498J5777J7987K0646K3162K5779K9425
62785H18183L4409L9877M4902M9687N5146O1654O8733P5783Q2612Q9227R5587
62774A515800J01467J06255J08944J08732J05575R9921R1936Q1317O7827N1754
62764B439528L3889J5165l654k2131l9907n6329p0589q2255r1355r7784j01205
$$ plain form
62753 1923373 1821600 1721080 1622595 1526789 1434679 1347254 1265094 1188614 1118291 1054341 996458
62742 996458 944190 897415 856137 819866 787465 757704 730018 704804 682899 664628 649353
62731 649353 635998 623825 612502 601731 591316 581572 573189 566555 561488 557713 555290 554446 555209
62718 555209 557313 560318 563885 568135 573603 580604 588801 597678 607261 618010 630307 644530 661360
62705 661360 681389 704537 730554 759945 793638 831734 873394 918062 965936 1017083 1071035
62694 1071035 1127662 1187583 1251100 1317317 1384724 1451914 1517087 1577449 1629942 1672376 1703437
62683 1703437 1722073 1727546 1719895 1699810 1668252 1626511 1576293 1519229 1456540 1389658 1320906 1252872
62671 1252872 1187091 1123706 1062455 1003658 948323 897527 851705 810403 772810 738601 708024
$$ packed form
62753A923373j01773j00520r8485r5806r2110q7425q2160p6480p0323o3950n7883
62742I96458n2268m6775m1278l6271l2401k9761k7686k5214k1905j8271j5275
62731F49353j3355j2173j1323j0771j0415r744q383o634n067l775k423q44P63
62718E55209K104L005L567M250N468P001Q197Q877R583J0749J2297J4223J6830
62705F61360K0029K3148K6017K9391L3693L8096M1660M4668M7874N1147N3952
62694A071035N6627N9921O3517O6217O7407O7190O5173O0362N2493M2434L1061
62683A703437J8636N473p651k0085l1558m1741n0218n7064o2689o6882o8752o8034
62671A252872o5781o3385o1251n8797n5335n0796m5822m1302l7593l4209l0577
$$ plain form
62660 708024 681158 657453 636209 617139 600223 585327 572240 560756 550503 540933 531721 522886
62648 522886 514391 505980 497602 489588 482203 475476 469618 465098 461980 459703 457879 456859 457147 458678
62634 458678 460999 463596 465637 466013 464289 461266 458119 455317 452813 450748 449313 448314 447540 447271 447820
62619 447820 448921 450248 452184 455299 459284 463219 466846 470883 476042 482340 489465 497239 505564 514294
62605 514294 523256 532277 541316 550927 562353 576806 594729 616014 640608 668492 699446 733436
62593 733436 771005 812673 858030 905944 955564 1006566 1058394 1109713 1158644 1203197 1241551
62582 1241551 1272278 1294302 1306566 1308156 1299144 1280915 1255204 1223045 1185119 1142663 1097320 1050304
62570 1050304 1002394 954627 908326 864431 823328 785199 749996 717225 686416 657827 632160
$$ packed form
62660G08024k6866k3705k1244j9070j6916j4896j3087j1484j0253r570r212q835
62648E22886q495q411q378q014p385o727n858m520l118k277j824j020K88J531
62634D58678K321K597K041L76j724l023l147k802k504k065j435r99p74k69N49
62619D47820J101J327J936L115L985L935L627M037N159O298P125P774Q325Q730
62605E14294Q962R021R039R611J1426J4453J7923K1285K4594K7884L0954L3990
62593G33436L7569M1668M5357M7914M9620N1002N1828N1319M8931M4553L8354
62582A241551L0727K2024J2264J590r012j8229k5711l2159l7926m2456m5343m7016
62570A050304m7910m7767m6301m3895m1103l8129l5203l2771l0809k8589k5667
$$ plain form
62559 632160 609675 590107 573319 559371 547933 538224 529595 521692 514131 506629 499457 493206 488075
62546 488075 483888 480777 479195 479106 479747 480317 480488 480217 479579 478883 478393 477792 476363 473916 471118 468813 467380
62529 467380 466941 467801 470394 474844 480740 487385 494468 502534 512506 524638 538381 553513 570737 590706
62515 590706 613084 637373 664119 694294 727765 763422 800718 840017 881307 923474 965071
62504 965071 1004972 1042055 1075073 1103166 1125907 1142628 1152441 1155233 1152042 1144120 1132266 1117454
62492 1117454 1101597 1087107 1075890 1068970 1066773 1069487 1077311 1090580 1109630 1134639 1165707 1202814
62480 1202814 1245438 1292606 1343692 1398438 1455154 1509222 1554634 1587507 1607740 1617552 1619201 1613602
62468 1613602 1599528 1573705 1533083 1478065 1413051 1343445 1272637 1201868 1131680 1062625 995369
$$ packed form
62559F32160k2485j9568j6788j3948j1438r709q629p903p561p502p172o251n131
62546D88075m187l111j582q9O41N70J71k71o38o96m90o01j429k447k798k305j433
62529D67380m39Q60K593M450N896O645P083Q066R972J2132J3743J5132J7224J9969
62515E90706K2378K4289K6746L0175L3471L5657L7296L9299M1290M2167M1597
62504I65071L9901L7083L3018K8093K2741J6721R813K792l191p922j1854j4812
62492A117454j5857j4490j1217o920k197K714P824J3269J9050K5009L1068L7107
62480A202814M2624M7168N1086N4746N6716N4068M5412L2873K0233R812J649n599
62468A613602j4074k5823m0622n5018o5014o9606p0808p0769p0188o9055o7256
$$ plain form
62457 995369 931189 872075 819684 774360 735559 702770 675539 653008 634066 617857 603906
62446 603906 591991 582124 574371 568559 564467 562307 562396 564263 566815 569699 573702 579363 585906 592041
62432 592041 597148 600984 602851 601948 598362 593032 586825 580059 572711 564622 555661 546041 536339 526970
62418 526970 517961 509461 502069 496269 491885 488346 485142 481716 477471 472384 467280 463015 459655 456798
62404 456798 454260 452052 450014 447991 446147 444777 444089 444387 445975 448528 451087 453175 455467 458836 463177
62389 463177 467673 471740 475096 477476 479096 481043 484309 488625 493079 497655 503201 509949 517117 524239
62375 524239 531944 540896 550684 560426 570125 580760 593068 606726 620873 635219 650453 667640
62363 667640 687416 709872 735064 763338 795164 831063 871810 918288 970723 1028217 1089274
$$ packed form
62457I95369o4180n9114n2391m5324l8801l2789k7231k2531j8942j6209j3951
62446F03906j1915r867p753n812m092k160Q9J867K552K884M003N661O543O135
62432E92041N107L836J867r03l586n330o207o766p348q089q961r620r702r369
62418E26970r009q500p392n800m384l539l204l426m245n087n104m265l360k857
62404D56798k538k208k038k023j844j370o88K98J588K553K559K088K292L369M341
62389D63177M496M067L356K380J620J947L266M316M454M576N546O748P168P122
62375E24239P705Q952R788R742R699J0635J2308J3658J4147J4346J5234J7187
62363F67640J9776K2456K5192K8274L1826L5899M0747M6478N2435N7494O1057
$$ plain form
62352 1089274 1152571 1216844 1280128 1339525 1391851 1434497 1465973 1486115 1495905 1496859 1490302 1477016
62340 1477016 1457308 1431320 1399406 1362415 1321589 1278147 1233018 1186981 1140999 1096414 1054816
62329 1054816 1017513 984874 956293 930970 908518 888601 870381 852901 835786 818954 801800
62318 801800 783384 763424 742391 720700 698589 676801 656390 637608 619897 603334 589086
62307 589086 577874 568870 560876 553861 548563 545197 543364 542774 543231 544230 545380 547030 549815 553839 558814
62292 558814 564689 571554 579235 587625 597079 607828 619244 630385 641059 651705 662396 672640
62280 672640 682026 690433 697661 703472 708019 711775 715061 717949 720413 722205 722961 723007 723756 726622 731742
62265 731742 738406 746552 757165 771295 789373 811498 837788 868432 903905 945047 992396 1045481
$$ packed form
62352A089274O3297O4273O3284N9397N2326M2646L1476K0142R790R54o557j3286
62340A477016j9708k5988l1914l6991m0826m3442m5129m6037m5982m4585m1598
62329A054816l7303l2639k8581k5323k2452j9917j8220j7480j7115j6832j7154
62318H01800j8416j9960k1033k1691k2111k1788k0411j8782j7711j6563j4248
62307E89086j1212r004p994p015n298l366j833n90M57R99J150J650K785M024M975
62292E58814N875O865P681Q390R454J0749J1416J1141J0674J0646J0691J0244
62280F72640R386Q407P228N811M547L756L286K888K464J792P56M6P49K866N120
62265G31742O664Q146J0613J4130J8078K2125K6290L0644L5473M1142M7349N3085
$$ plain form
62253 1045481 1103238 1164900 1229714 1295840 1360199 1419554 1471217 1512901 1542885 1560842 1568058
62242 1568058 1566436 1557324 1541139 1517590 1486159 1446810 1400343 1347934 1290580 1229558 1167240 1106604
62230 1106604 1049628 996624 947342 902180 861979 827018 796650 769866 746101 725494 708401
62219 708401 694579 683023 672754 663513 655411 648215 641498 635314 630055 625642 621395 616908 612639
62206 612639 609439 607716 607151 607035 606894 606980 608037 610377 613389 616283 619120 622654 627342 633008 639441
62191 639441 646747 655043 664206 674052 684441 695156 705959 716816 727915 739497 751811 764923
62179 764923 778223 790356 800158 807655 813867 819797 825956 832646 840296 849615 861696 877676 897933
62166 897933 922006 949796 982375 1020897 1064996 1112912 1162771 1212779 1260410 1302626 1337264
$$ packed form
62253A045481N7757O1662O4814O6126O4359N9355N1663M1684K9984J7957P216
62242A568058j622r112j6185k3549l1431l9349m6467n2409n7354o1022o2318o0636
62230A106604n6976n3004m9282m5162m0201l4961l0368k6784k3765k0607j7093
62219G08401j3822j1556j0269r241q102p196o717o184n259m413m247m487m269
62206F12639l200j723n65j16j41Q6J057K340L012K894K837L534M688N666O433
62191F39441P306Q296R163R846J0389J0715J0803J0857J1099J1582J2314J3112
62179G64923J3300J2133R802P497O212N930O159O690P650R319J2081J5980K0257
62166H97933K4073K7790L2579L8522M4099M7916M9859N0008M7631M2216L4638
$$ plain form
62155 1337264 1363562 1381400 1390904 1392921 1388840 1379440 1364535 1344035 1318635 1289077 1255422 1217665
62143 1217665 1176639 1133965 1091453 1050879 1013828 981153 952707 927901 906419 888293 873570
62132 873570 862069 853269 846259 840018 833818 827301 820381 813471 807620 803888 802472 802813 804441 807288
62118 807288 811324 816580 823581 832992 844606 857070 868692 877995 883573 884288 880116 872400 863124 854283
62104 854283 847688 844232 842737 840229 834091 823896 811132 797827 785779 776407 770414 767612 767336
62091 767336 768924 771723 775125 778957 783513 788931 794831 800791 806854 813355 820581 828781 838121 848446
62077 848446 859556 871857 886194 902741 920615 939061 958419 979341 1001439 1023452 1044701
62066 1044701 1065813 1087996 1112044 1138126 1166171 1196109 1227608 1259609 1290210 1317186 1338557
$$ packed form
62155A337264K6298J7838R504K017m081r400j4905k0500k5400k9558l3655l7757
62143A217665m1026m2674m2512m0574l7051l2675k8446k4806k1482j8126j4723
62132H73570j1501q800p010o241o200o517o920o910n851l732j416L41J628K847
62118H07288M036N256P001R411J1614J2464J1622R303N578P15m172p716r276q841
62104H54283o595l456j495k508o138j0195j2764j3305j2048r372n993k802k76
62091G67336J588K799L402L832M556N418N900N960O063O501P226Q200R340J0325
62077H48446J1110J2301J4337J6547J7874J8446J9358K0922K2098K2013K1249
62066A044701K1112K2183K4048K6082K8045K9938L1499L2001L0601K6976K1371
$$ plain form
62055 1338557 1352746 1358793 1357071 1349557 1338578 1325037 1308324 1287810 1263650 1235956 1204122 1167568
62043 1167568 1126680 1082675 1036988 991193 946908 905160 866006 829073 794293 761943 732428
62032 732428 706217 683522 663853 646436 631265 619035 609648 601616 593626 586017 579904 575292 570936
62019 570936 565778 559668 552838 545589 538560 532588 528029 524535 521538 518606 515428 511944 508591 506053
62005 506053 504672 504316 504749 505916 507919 511003 515442 521146 527435 533398 538468 542537 545761 548451 550940
61990 550940 553221 554824 555141 553707 550062 543847 535326 525514 515358 505093 494734 484827 476193 469152
61976 469152 463450 458753 454701 450716 446359 441860 437782 434226 430834 427513 424592 422250 420337 418852
61962 418852 418066 417943 417919 417571 417164 417158 417416 417346 416844 416681 417752 420114 423087 426273 430109 435241 441684 449029
$$ packed form
62055A338557J4189O047j722p514j0979j3541j6713k0514k4160k7694l1834l6554
62043A167568m0888m4005m5687m5795m4285m1748l9154l6933l4780l2350k9515
62032G32428k6211k2695j9669j7417j5171j2230r387q032p990p609o113m612m356
62019E70936n158o110o830p249p029n972m559l494k997k932l178l484l353k538
62005E06053j381l56M33J167K003L084M439N704O289N963N070M069L224K690K489
61990E50940K281J603L17j434l645o215q521r812j0156j0265j0359r907q634p041
61976D69152n702m697m052l985m357m499m078l556l392l321k921k342j913j485
61962D18852p86j23k4l48m07oK58p0n02j63J071K362K973L186L836N132O443P345
$$ plain form
61944 449029 457248 466701 477370 488772 500879 514528 530495 548553 567814 587503 606951 625326
61932 625326 642136 657864 673470 689241 704616 718957 731854 742682 750585 755247 757137 756665
61920 756665 753459 746928 737337 725943 714131 702777 692491 684074 678433 676120 677189 681509 688908
61907 688908 698950 710904 724260 739039 755142 771458 786027 797194 804366 807715 807592 804317
61895 804317 798097 788994 777339 764216 750985 738083 724767 710373 695443 681302 668930 658598
61883 658598 650159 643138 636716 630055 622592 613883 603613 592093 580391 569443 559309 549720 541035
61870 541035 534023 528898 525237 522795 521772 522209 523679 525819 528807 533069 538765 545682 553495 562125
61856 562125 571971 583792 598142 614957 633829 654568 677273 701969 728494 756705 786529 817663
$$ packed form
61944D49029Q219R453J0669J1402J2107J3649J5967J8058J9261J9689J9448J8375
61932F25326J6810J5728J5606J5771J5375J4341J2897J0828P903M662J890m72
61920G56665l206o531r591j1394j1812j1354j0286q417n641k313J069M320P399
61907F88908J0042J1954J3356J4779J6103J6316J4569J1167P172L349j23l275
61895H04317o220r103j1655j3123j3231j2902j3316j4394j4930j4141j2372j0332
61883F58598q439p021o422o661p463q709j0270j1520j1702j0948j0134r589q685
61870E41035p012n125l661k442j023M37J470K140K988M262N696O917P813Q630
61856E62125R846J1821J4350J6815J8872K0739K2705K4696K6525K8211K9824L1134
$$ plain form
61844 817663 849336 880233 908592 932656 951477 965292 974855 980360 981210 976893 967869 955585 941804
61831 941804 928010 915301 904553 896481 891535 889994 892310 899079 910277 924662 940352 955940
61819 955940 970582 983071 991592 994717 992181 984347 971435 953662 931698 906514 879075 850515
61807 850515 822223 795224 769740 745741 723651 704045 686919 671734 657981 645236 632955
61796 632955 620806 609172 598825 590097 582736 576454 571141 566542 562149 557582 552881 548407 544570
61783 544570 541528 538969 536336 533371 530206 526867 523095 518975 515246 512536 510659 509120 507984 507620
61769 507620 507815 507846 507358 506677 506219 506054 506094 506410 507408 509794 514093 519832 525581 530239 534030 537799 541728
61752 541728 545350 548440 551020 552649 552585 550760 547890 544521 540637 536303 531980 527942 524053 520418 517641
$$ packed form
61844H17663L1673L0897K8359K4064J8821J3815R563N505Q50m317r024j2284j3781
61831I41804j3794j2709j0748q072m946j541K316O769J1198J4385J5690J5588
61819I55940J4642J2489Q521L125k536p834j2912j7773k1964k5184k7439k8560
61807H50515k8292k6999k5484k3999k2090j9606j7126j5185j3753j2745j2281
61796F32955j2149j1634j0347q728p361o282n313m599m393m567m701m474l837
61783E44570l042k559k633k965l165l339l772m120l729k710j877j539j136l64
61769E07620J95L1m88o81m58j65M0L16R98K386M299N739N749M658L791L769L929
61752E41728L622L090K580J629o4j825k870l369l884m334m323m038l889l635k777
$$ plain form
61737 517641 515993 514756 512951 510467 508082 506500 505721 505356 505225 505515 506389 507649 508972 510459 512652
61722 512652 515790 519321 522451 524950 527094 528989 530398 531267 532037 533288 535183 537234 538574 538585 537383
61707 537383 535492 533060 529756 525526 520841 515902 510240 503681 497153 491758 487386 483030 478276 473633
61693 473633 469506 465679 461951 458509 455430 452412 449242 446090 443099 440041 436587 432707 428708 425072
61679 425072 422202 420130 418537 417218 416283 415722 415170 414432 413793 413365 412618 411145 409452 408385 408181 408755
61663 408755 410358 412957 415461 416730 417201 418356 420724 423566 426410 429488 432484 434325 434760 434968 435931
61648 435931 437227 438050 438467 438953 439639 440834 443423 447786 452830 456997 459868 462079 464100 465801 466867
61633 466867 466956 465712 463279 460554 458374 456695 455022 453232 451362 448933 445313 440694 436090 432338 429533
$$ packed form
61737E17641j648j237j805k484k385j582p79l65j31K90Q74J260J323J487K193
61722E12652L138L531L130K499K144J895J409Q69P70J251J895K051J340J1j202
61707E37383j891k432l304m230m685m939n662o559o528n395m372m356m754m643
61693D73633m127l827l728l442l079l018l170l152k991l058l454l880l999l636
61679D25072k870k072j593j319r35n61n52p38o39m28p47j473j693j067k04N74
61663D08755J603K599K504J269M71J155K368K842K844L078K996J841M35K08R63
61648D35931J296Q23M17M86O86J195K589M363N044M167K871K211K021J701J066
61633D66867Q9j244k433k725k180j679j673j790j870k429l620m619m604l752k805
$$ plain form
61618 429533 427344 425473 423841 422686 422366 422760 423043 422428 420944 419094 416944 414080 410338 406020 401363
61603 401363 396281 390862 385765 381814 379228 377372 375288 372492 369270 366165 363272 360233 356880 353592
61589 353592 350902 348962 347487 345979 343976 341389 338757 336906 336177 336192 336450 336840 337420 337965 338025 337314 335948
61572 335948 334377 333073 332098 331040 329653 328435 328147 328840 329834 330690 331627 332909 334451 336257 338611 341445
61556 341445 344011 345607 346312 346661 347000 347500 348465 350163 352456 354851 356721 357453 356811 355363 354163 353781
61540 353781 354024 354715 356118 358273 360539 362316 363760 365274 366753 367901 368870 369964 370994 371540 371645
61525 371645 371640 371444 370674 369375 368112 367244 366533 365480 363772 361454 358989 357058 356043 355789 356008 356628 357457
61508 357457 357922 357613 356853 356226 355761 355119 354326 353714 353272 352719 352258 352518 353598 354780 355470 355938 356752 357877
$$ packed form
61618D29533k189j871j632j155l20L94K83o15j484j850k150k864l742m318m657
61603D01363n082n419n097l951k586j856k084k796l222l105k893l039l353l288
61589C53592k690j940j475j508k003k587k632j851p29J5K58L90N80N45O0p11j366
61572C35948j571j304r75j058j387j218k88O93R94Q56R37J282J542J806K354K834
61556C41445K566J596P05L49L39N00R65J698K293K395J870P32o42j448j200l82
61540C53781K43O91J403K155K266J777J444J514J479J148R69J094J030N46J05
61525C71645nj96p70j299j263q68p11j053j708k318k465j931j015k54K19O20Q29
61508C57457M65l09p60o27m65o42p93o12m42n53m61K60J080J182O90M68Q14J125
$$ plain form
61490 357877 358789 359281 359749 360694 362224 364037 365710 367002 368051 369312 371167 373514 375886 378064 380384
61475 380384 383199 386165 388495 390020 391439 393162 394438 394310 393166 392491 393023 393913 393958 392962 391482 389865
61459 389865 388093 386255 384598 383212 382020 380998 380264 380049 380676 382230 384180 385713 386590 387240 387859 387971
61443 387971 387252 386249 385784 386017 386553 387190 388083 389417 391329 393928 397053 400275 403434 406827 410451 413543
61427 413543 415414 416433 417523 418913 420020 420430 420372 420293 420527 421391 423049 425171 427124 428644 430010 431560
61411 431560 433286 434858 435788 435671 434567 433106 431910 431014 430025 428679 426957 424889 422599 420374 418385
61396 418385 416570 415099 414554 415120 415883 415634 414285 412918 412517 413182 414478 415883 416825 416981 416760 417005 418009
61379 418009 419248 420226 421171 422684 425122 428488 432563 436874 440784 443900 446266 448183 450084 452517 455791
$$ packed form
61490C57877R12M92M68R45J530J813J673J292J049J261J855K347K372K178K320
61475C80384K815K966K330J525J419J723J276j28j144o75N32Q90M5r96j480j617
61459C89865j772j838j657j386j192j022p34k15O27J554J950J533Q77O50O19J12
61443C87971p19j003m65K33N36O37Q93J334J912K599L125L222L159L393L624L092
61427D13543J871J019J090J390J107M10n8p9K34Q64J658K122J953J520J366J550
61411D31560J726J572R30j17j104j461j196q96r89j346j722k068k290k225j989
61396D18385j815j471n45N66P63k49j349j367m01O65J296J405R42J56k21K45J004
61379D18009J239R78R45J513K438L366M075M311L910L116K366J917J901K433L274
$$ plain form
61364 455791 459411 462251 463552 463611 463360 463558 464530 466355 468968 472210 476132 481178 487788 495741 504104
61349 504104 512005 519411 526966 534999 542822 549204 553472 555928 557217 557680 557511 557078 556692 556243 555523 554817
61333 554817 554696 555133 555241 554077 551453 547801 543519 538774 533850 529273 525379 521962 518722 516019 514754
61318 514754 515271 516786 518357 520109 522891 526883 531360 536003 541622 549102 558273 568390 579351 591837
61304 591837 606415 622968 640772 658666 675219 689139 699576 706043 708409 707217 703575 698373
61292 698373 691878 684357 676523 668822 660738 651562 641632 632090 623576 615800 608358 601312 594901 589242
61278 589242 584413 580429 577195 574836 573956 575076 577960 581960 586829 592514 598258 602837 605910 608478
61264 608478 611678 615666 619959 624396 629376 635481 643191 652684 663544 674693 684768 692610 697614
$$ packed form
61364D55791L620K840J301N9k51J98R72J825K613L242L922N046O610P953Q363
61349E04104P901P406P555Q033P823O382M268K456J289M63j69m33l86m49p20p06
61333E54817j21M37J08j164k624l652m282m745m924m577l894l417l240k703j265
61318E14754N17J515J571J752K782L992M477M643N619P480R171J0117J0961J2486
61304E91837J4578J6553J7804J7894J6553J3920J0437O467K366j192l642n202
61292F98373o495p521p834p701q084r176r930r542q514p776p442p046o411n659
61278E89242m829l984l234k359q80J120K884M000M869N685N744M579L073K568
61264F08478L200L988M293M437M980O105P710R493J0860J1149J0075P842N004
$$ plain form
61251 697614 700000 700770 701047 701303 701279 700476 698482 695080 690497 685442 680433 675212 669357 663300 658055 653948
61235 653948 650361 646836 643688 641224 639151 637225 635938 636005 637551 640269 644019 648774 654258 660070 665997
61220 665997 671862 677333 682246 686875 691549 696249 701035 706543 713394 721172 728531 734377 738529 741262
61206 741262 742809 743548 744198 745420 747423 750207 753912 758671 764362 770975 779148 789919 803898 820942
61192 820942 840577 862158 884348 905008 922211 935261 944403 949881 951978 951828 951203 951021 950641 949078
61178 949078 946379 943255 939797 935323 929386 922202 914069 905086 895592 886263 877300 867925 857171 845032
61164 845032 832428 820055 807620 794392 780230 765853 752106 739189 726762 714708 703551
61153 703551 694095 686840 681877 679218 678986 681201 685443 690745 695849 699547 700845 699011 693811 685885
$$ packed form
61251F97614K386P70K77K56k4q03j994l402m583n055n009n221n855o057n245m107
61235F53948l587l525l148k464k073j926j287O7J546K718L750M755N484N812N927
61220F65997N865N471M913M629M674M700M786N508O851P778P359N846M152K733
61206G41262J547P39O50J222K003K784L705M759N691O613Q173J0771J3979J7044
61192H20942J9635K1581K2190K0660J7203J3050R142N478K097j50o25j82l80j563
61178I49078k699l124l458m474n937p184q133q983r494r329q963r375j0754j2139
61164H45032j2604j2373j2435j3228j4162j4377j3747j2917j2427j2054j1157
61153G03551r456p255m963k659k32K215M242N302N104L698J298j834n200p926
$$ plain form
61139 685885 676600 667195 658160 649662 642310 636945 633751 632200 631988 633478 636934 641887 647643 654055
61125 654055 661396 669816 679389 690473 703552 718804 736155 755617 777234 800771 825817 852190
61113 852190 879963 909018 938741 968229 996833 1024571 1051958 1079217 1105699 1130394 1153029
61102 1153029 1174226 1194381 1212658 1227256 1236360 1238844 1234655 1224961 1211590 1195931 1178486 1159509
61090 1159509 1139519 1118860 1097299 1074754 1052138 1030862 1011538 993650 976524 960255 945609
61079 945609 933311 923521 915838 909710 904881 901449 899639 899663 901734 905898 911848 919193 927924 938345
61065 938345 950573 964463 979903 996762 1014580 1032911 1052115 1073250 1096938 1122696 1149542
61054 1149542 1176884 1204715 1233327 1262995 1293686 1325094 1357141 1390213 1424537 1459697 1495268
$$ packed form
61139F85885r285r405r035q498p352n365l194j551k12J490L456M953N756O412
61125F54055P341Q420R573J1084J3079J5252J7351J9462K1617K3537K5046K6373
61113H52190K7773K9055K9723K9488K8604K7738K7387K7259K6482K4695K2635
61102A153029K1197K0155J8277J4598R104K484m189r694j3371j5659j7445j8977
61090A159509j9990k0659k1561k2545k2616k1276j9324j7888j7126j6269j4646
61079I45609j2298r790p683o128m829l432j810K4K071M164N950P345Q731J0421
61065I38345J2228J3890J5440J6859J7818J8331J9204K1135K3688K5758K6846
61054A149542K7342K7831K8612K9668L0691L1408L2047L3072L4324L5160L5571
$$ plain form
61043 1495268 1531399 1567996 1603852 1637650 1669507 1700416 1730518 1759187 1786488 1813023 1838478
61032 1838478 1861942 1883707 1905191 1927061 1949114 1972084 1997519 2025537 2054583 2083755 2113347
61021 2113347 2142881 2171199 2199419 2231478 2270821 2318787 2376954 2448108 2533369 2630805 2738426
61010 2738426 2856496 2986624 3132530 3303436 3513096 3773927 4096377 4495506 4992066
61001 4992066 5604412 6347511 7245691 8339101 9673477 11298647 13285732 15705878 18516464
60992 18516464 21430007 23940528 25568714 26146165 25886974 25207612 24502447 24063095 24096854
60983 24096854 24680369 25633294 26489491 26694168 25908530 24169900 21798176 19176295 16595466
60974 16595466 14225746 12146608 10374715 8886164 7643063 6611396 5760566 5059016
$$ packed form
61043A495268L6131L6597L5856L3798L1857L0909L0102K8669K7301K6535K5455
61032A838478K3464K1765K1484K1870K2053K2970K5435K8018K9046K9172K9592
61021B113347K9534K8318K8220L2059L9343M7966N8167P1154Q5261R7436J07621
61010B738426J18070J30128J45906J70906K09660K60831L22450L99129M96560
61001D992066O12346P43099Q98180J093410J334376J625170J987085K420146K810586
60992A8516464K913543K510521J628186N77451k59191o79362p05165m39352L3759
60983B4096854N83515R52925Q56197K04677p85638j738630k371724k621881k580829
60974A6595466k369720k079138j771893j488551j243101j031667q50830p01550
$$ plain form
60966 5059016 4478905 4001001 3609838 3287588 3016858 2786033 2587460 2413168 2256419
60957 2256419 2115057 1989165 1876839 1775298 1684238 1604647 1535761 1476067 1425500 1383398
60947 1383398 1345716 1307652 1268038 1228375 1188922 1149036 1110252 1075423 1044904 1016522 989005
60936 989005 962764 937556 912215 886807 862704 840440 819537 800185 782980 767237 751749
60925 751749 737018 724647 714781 706262 698921 693340 688487 682170 674111 666320 660086 654693 649422 644679
60911 644679 640591 636525 632757 630858 631577 633737 635827 637457 638819 639998 641214 642602 643520 643223 642221
60896 642221 641548 640669 637747 632301 625988 620260 614757 608625 602004 595456 588999 582440 575768 568678 560522
60881 560522 551238 541636 532472 523919 516117 509390 503700 498621 494035 490158 486863 483698 480621 478003
$$ packed form
60966E059016n80111m77904l91163l22250k70730k30825j98573j74292j56749
60957B256419j41362j25892j12326j01541r1060p9591o8886n9694n0567m2102
60947A383398l7682l8064l9614l9663l9453l9886l8784l4829l0519k8382k7517
60936I89005k6241k5208k5341k5408k4103k2264k0903j9352j7205j5743j5488
60925G51749j4731j2371r866q519p341n581m853o317q059p791o234n393n271m743
60911F44679m088m066l768j899P19K160K090J630J362J179J216J388R18k97j002
60896F42221o73q79k922n446o313n728n503o132o621o548o457o559o672p090q156
60881E60522r284r602r164q553p802o727n690n079m586l877l295l165l077k618
$$ plain form
60867 478003 476008 474730 474678 476193 478567 480697 482504 484823 488171 492616 498466 505809 513490 519756 523932
60852 523932 526488 527842 528362 529297 532118 536828 542109 547061 551507 554821 556106 555683 554832 553783 551397
60837 551397 547113 541742 535972 529567 522538 515776 509856 504349 498878 493826 489534 485763 482372 479578
60823 479578 477239 474831 472364 470264 468163 464973 460467 455658 451244 446843 442072 437246 432546 427664
60809 427664 422645 418038 413806 409234 404349 400275 397666 395897 394257 392839 391664 390110 387928 385865
60795 385865 384637 384043 383624 383347 383150 382732 382310 382748 384377 386465 388210 389539 390649 391703 393227 395780
60779 395780 398882 401273 402591 403754 405406 407159 408798 410909 413650 416076 417397 417940 418257 418347 418402 419210
60763 419210 420974 422638 423137 422539 421430 420148 419169 419099 419575 419179 417203 414473 411792 408816 405362 402586
$$ packed form
60867D78003j995j278n2J515K374K130J807K319L348M445N850P343P681O266M176
60852E23932K556J354N20R35K821M710N281M952M446L314J285m23q51j049k386
60837E51397m284n371n770o405p029o762n920n507n471n052m292l771l391k794
60823D79578k339k408k467k100k101l190m506m809m414m401m771m826m700m882
60809D27664n019m607m232m572m885m074k609j769j640j418j175j554k182k063
60795C85865j228n94m19k77j97m18m22M38J629K088J745J329J110J054J524K553
60779C95780L102K391J318J163J652J753J639K111K741K426J321N43L17R0N5Q08
60763D19210J764J664M99n98j109j282r79p0M76l96j976k730k681k976l454k776
$$ plain form
60747 402586 401604 401868 402132 402265 402902 403955 404690 404825 404468 403303 400804 396952 392085 386450 380555 375403
60731 375403 371634 368920 366774 365286 364438 363523 362120 360899 360557 360651 360480 360409 361193 362563 363660 364501 365779
60714 365779 367524 369156 370779 373278 376960 380924 383947 385439 385584 385223 385552 387298 390082 392963 395488
60699 395488 397794 399924 401586 402546 402840 402670 402311 401934 401330 400187 398797 397997 398121 398580 398795 398851 398768 397964
60681 397964 396255 394741 394706 396020 397534 398843 400627 403264 406011 407952 409189 410647 412817 414986 415779
60666 415779 414482 411667 408367 404942 401175 397250 393900 391513 389819 388626 388124 388173 388019 387186 386171
60651 386171 385918 387006 389479 392848 396133 398556 400458 402788 405546 407542 407971 407261 405959 403820 400640
60636 400640 397163 394308 392079 389921 387699 385780 384564 384328 385022 385923 386139 385750 385748 386571 387591 388337 389203
$$ packed form
60747D02586r82K64K64J33O37J053P35J35l57j165k499l852m867n635n895n152
60731C75403l769k714k146j488q48r15j403j221l42R4j71p1P84J370J097Q41J278
60714C65779J745J632J623K499L682L964L023J492J45l61L29J746K784K881K525
60699C95488K306K130J662R60K94j70l59l77o04j143j390q00J24M59K15N6q3q04
60681C97964j709j514l5J314J514J309J784K637K747J941J237J458K170K169P93
60666D15779j297k815l300l425l767l925l350k387j694j193n02M9j54q33j015
60651C86171k53J088K473L369L285K423J902K330K758J996M29p10j302k139l180
60636D00640l477k855k229k158k222j919j216k36O94R01K16l89kQ23J020P46Q66
$$ plain form
60619 389203 390427 391384 391574 391365 391125 390598 389885 389940 391141 392279 392083 391028 390612 391461 393153 395295 397652
60602 397652 399630 400632 400819 400805 400923 401244 401841 402536 402979 403444 404761 406999 409130 410603 412158 414274
60586 414274 416042 416609 416662 417157 417594 417031 416066 416252 417975 420336 422741 425204 427438 429083 430769 433774
60570 433774 438771 445860 455425 467655 481479 495294 508730 522554 536914 550862 563564 574826
60558 574826 584233 590750 593381 591617 585381 575413 563598 552124 542238 534326 528733 525628 524428 524351
60544 524351 525382 527872 531567 536021 541714 549734 560508 573722 589240 607123 626994 648429 671717
60531 671717 697087 723214 747499 767787 782988 792351 795353 792382 784555 772912 758610 743623
60519 743623 729969 718126 707109 696132 685345 675130 665805 658065 652680 649599 648111 647805 648595
$$ packed form
60619C89203J224R57J90k09k40n27p13N5J201J138j96j055m16Q49J692K142K357
60602C97652J978J002J87j4J18L21N97O95M43M65J317K238K131J473J555K116
60586D14274J768N67N3M95M37n63r65J86J723K361K405K463K234J645J686L005
60570D33774M997P089R565J2230J3824J3815J3436J3824J4360J3948J2702J1262
60558E74826R407O517K631j764o236r968j1815j1474r886p912n593l105j200p7
60544E24351J031K490L695M454N693Q020J0774J3214J5518J7883J9871K1435K3288
60531F71717K5370K6127K4285K0288J5201R363L002k971p827j1643j4302j4987
60519G43623j3654j1843j1017j0977j0787j0215r325p740n385l081j488l06P90
$$ plain form
60506 648595 650085 652043 655443 661940 672295 686258 703866 725730 752126 783038 819100 861206
60494 861206 908957 960672 1015104 1071883 1129896 1186531 1239154 1286404 1327478 1361147 1386212
60483 1386212 1402259 1409182 1406353 1392776 1367885 1331990 1286268 1232509 1172648 1108561 1042543 977532
60471 977532 916217 859952 809016 763570 723750 689197 659397 634243 613466 595786 579664
60460 579664 564815 552040 541664 533043 525475 518595 511931 505055 498266 492251 487107 482464 478321
60447 478321 474802 471362 467399 463462 460565 458434 455824 452654 450350 449752 450047 450158 449911 449320 447954
60432 447954 445756 443510 441806 440266 438328 436125 434173 432842 432371 432725 433245 433237 433077 433872 435841 437947
60416 437947 439391 440471 441603 442439 442453 441684 440575 439715 439910 441679 444434 446898 448493 449578 450358 450683
$$ packed form
60506F48595J490J958L400O497J0355J3963J7608K1864K6396L0912L6062M2106
60494H61206M7751N1715N4432N6779N8013N6635N2623M7250M1074L3669K5065
60483A386212J6047O923k829j3577k4891l5895m5722n3759n9861o4087o6018o5011
60471I77532o1315n6265n0936m5446l9820l4553k9800k5154k0777j7680j6122
60460E79664j4849j2775j0376q621p568o880o664o876o789o015n144m643m143
60447D78321l519l440l963l937k897k131k610l170k304n98K95J11k47n91j366
60432D47954k198k246j704j540j938k203j952j331m71L54N20qj60P95J969K106
60416D37947J444J080J132Q36J4p69j109q60J95J769K755K464J595J085P80L25
$$ plain form
60400 450683 451053 452641 455814 459589 462951 465845 468557 471139 473805 476909 480039 482152 483119 484232 486585
60385 486585 489779 492797 495409 498076 501099 504388 507620 510301 512150 513543 515086 516797 518474 520645
60371 520645 524012 527954 530880 532275 533173 534348 535418 536149 537202 538907 540626 542056 543941 546679 549481
60356 549481 551872 554862 559529 565421 571577 578344 586942 597622 609193 620008 628742 634760 638474
60343 638474 640817 641797 640190 635275 628106 620378 612796 605411 598725 593347 588966 584672 580027 575164
60329 575164 570227 565424 561231 557801 554554 550979 547456 544606 542290 539970 537654 535761 534373 533392
60315 533392 533190 534430 537354 541812 547893 556070 566799 580231 596092 613481 631010 647515 662623
60302 662623 676758 690780 705249 719351 730722 737274 739174 738033 734121 725693 711487 692679
$$ packed form
60400D50683L70J588L173L775L362K894K712K582K666L104L130K113R67J113K353
60385D86585L194L018K612K667L023L289L232K681J849J393J543J711J677K171
60371E20645L367L942K926J395Q98J175J070P31J053J705J719J430J885K738K802
60356E49481K391K990M667N892O156O767Q598J0680J1571J0815Q734O018L714
60343F38474K343R80j607m915p169p728p582p385o686n378m381m294m645m863
60329E75164m937m803m193l430l247l575l523k850k316k320k316j893j388r81
60315E33392k02J240K924M458O081Q177J0729J3432J5861J7389J7529J6505J5108
60302F62623J4135J4022J4469J4102J1371O552J900j141l912q428j4206j8808
$$ plain form
60290 692679 671779 650768 631106 614393 601680 592551 585743 580320 575719 571389 567155 563487 560707
60277 560707 558338 555712 552684 549322 545560 541638 538201 535413 532650 529581 526695 524187 521202 517042
60263 517042 512384 508478 505795 504170 503508 503427 502875 501131 498825 497148 496459 496414 496902 497988 499301 500333
60247 500333 501117 502016 503110 504336 505846 507722 509716 511617 513355 514446 514136 512518 510670 509182 507536
60232 507536 505608 504639 505735 508304 511099 514048 517849 522383 526661 530001 532311 533680 534669 536451 539689
60217 539689 543666 547445 551367 556437 562801 569937 577856 586943 596934 607115 617351 627888 638350
60204 638350 647925 656371 663997 670939 677355 684007 691584 699591 706812 712744 717766 722119 725656 728415
60190 728415 730541 731614 730864 728061 723712 718511 713045 707632 701924 695110 687075 678826 671148 663606
$$ packed form
60290F92679k0900k1011j9662j6713j2713r129o808n423m601m330m234l668k780
60277E60707k369k626l028l362l762l922l437k788k763l069k886k508k985m160
60263E17042m658l906k683j625o62q1n52j744k306j677o89m5M88J086J313J032
60247E00333P84Q99J094J226J510J876J994J901J738J091l10j618j848j488j646
60232E07536j928r69J096K569K795K949L801M534M278L340K310J369R89J782L238
60217E39689L977L779L922N070O364P136P919R087R991J0181J0236J0537J0462
60204F38350R575Q446P626O942O416O652P577Q007P221N932N022M353L537K759
60190G28415K126J073p50k803m349n201n466n413n708o814q035q249p678p542
$$ plain form
60176 663606 655713 648324 642713 638788 635347 631710 628028 624450 621119 618661 617430 616517 614665 612017
60162 612017 609838 608648 607825 606921 606209 605835 605551 605420 605872 606959 608274 609615 610966 611971 612268 612241 612660
60145 612660 613742 615274 617284 619659 621547 622326 622968 625197 629451 634850 641026 648578 657533 666769 675372
60130 675372 683461 691201 697989 703153 706770 709375 711496 713688 716346 719229 721734 723785 725906 728389
60116 728389 731023 733654 736370 739061 741468 743647 745826 747846 749358 750412 751149 751117 749699 747030 743559
60101 743559 738901 732240 723938 715683 708778 703165 698291 694010 690283 686939 684160 682590 682513 683432 684696
60086 684696 686074 687507 688822 689836 690351 689980 688500 686459 684914 684402 684497 684349 683243 680731 676715 671450
60070 671450 665229 658220 650801 643552 636480 628825 620229 611560 603825 596828 589792 582872 576989 572484
$$ packed form
60176F63606p893p389n611l925l441l637l682l578l331k458j231r13j852k648
60162F12017k179j190q23r04p12l74k84j31M52J087J315J341J351J005K97k7M19
60145F12660J082J532K010K375J888P79O42K229M254N399O176P552Q955R236Q603
60130F75372Q089P740O788N164L617K605K121K192K658K883K505K051K121K483
60116G28389K634K631K716K691K407K179K179K020J512J054P37l2j418k669l471
60101G43559m658o661q302q255o905n613m874m281l727l344k779j570p7R19J264
60086F84696J378J433J315J014N15l71j480k041j545n12R5j48j106k512m016n265
60070F71450o221p009p419p249p072p655q596q669p735o997p036o920n883m505
$$ plain form
60056 572484 568924 565996 563609 561382 559052 557260 556925 557981 559682 561912 565167 569424 574152 579281
60042 579281 585072 591203 597148 603313 610555 618622 626306 633096 639325 644681 648108 649524 650198 650910 650928
60027 650928 649335 646212 641974 636613 630198 623164 615503 606490 595823 584238 572520 560711 548789
60014 548789 537382 527197 518335 510635 504148 498857 494478 490872 488167 486221 484523 482884 481728 481469
60000 481469 482055 483188 484514 485614 486389 487364 489006 490884 492315 493653 495955 499397 503058 506371 509752
59985 509752 513588 517612 521599 525788 530204 534262 537276 538776 538336 535925 532474 529181 526184 522790
59971 522790 518920 515268 511982 508451 504639 501396 499132 497307 495725 495195 496379 498975 502489 506885
59957 506885 511940 516858 521118 524868 528074 530063 530379 529389 527736 526013 525138 525942 527950 529612 530255
$$ packed form
60056E72484l560k928k387k227k330j792l35J056J701K230L255M257M728N129
60042E79281N791O131N945O165P242Q067P684O790O229N356L427J416O74P12J8
60027F50928j593l123m238n361o415p034p661r013j0667j1585j1718j1809j1922
60014E48789j1407j0185q862p700o487n291m379l606k705j946j698j639j156k59
60000D81469N86J133J326J100P75R75J642J878J431J338K302L442L661L313L381
59985E09752L836M024L987M189M416M058L014J500m40k411l451l293k997l394
59971E22790l870l652l286l531l812l243k264j825j582n30J184K596L514M396
59957E06885N055M918M260L750L206J989L16r90j653j723q75Q04K008J662O43
$$ plain form
59942 530255 530819 532086 533190 532655 530101 526213 521753 517370 513757 511266 509682 508789 508704 509420 510701 512774
59926 512774 516444 522097 529148 536757 544455 551747 557775 561720 563071 561582 557710 553112 549685 547897
59912 547897 546890 546199 546225 546984 547856 548981 551526 555895 560824 564948 568163 570811 572674 573669 574483 575613
59896 575613 576563 576840 576997 577891 579617 581910 584919 588842 593408 598386 603969 610127 616259 622076 628155
59881 628155 635085 642732 650801 659363 668315 677120 685567 693968 702116 708961 713905 717476 720077 721069
59867 721069 719851 717039 713688 710083 706053 701771 697483 693005 688170 683237 678422 673676 669334 666135
59853 666135 664167 662692 661519 661494 663059 665450 668128 671939 677939 685948 695045 704422 712790 718047 718860
59838 718860 716107 711909 708002 705819 706959 711964 719074 725393 729069 729665 727252 722421 716748 711940
$$ packed form
59942E30255N64J267J104n35k554l888m460m383l613k491j584q93q5P16J281K073
59926E12774L670N653P051P609P698P292O028L945J351j489l872m598l427j788
59912E47897j007o91K6P59Q72J125K545M369M929M124L215K648J863R95Q14J130
59896E75613R50K77J57Q94J726K293L009L923M566M978N583O158O132N817O079
59881F28155O930P647Q069Q562Q952Q805Q447Q401Q148O845M944L571K601R92
59867G21069j218k812l351l605m030m282m288m478m835m933m815m746m342l199
59853F66135j968j475j173k5J565K391K678L811O000Q009R097R377Q368N257Q13
59838G18860k753m198l907k183J140N005P110O319L676N96k413m831n673m808
$$ plain form
59824 711940 708400 705335 701967 697964 693065 687135 680461 673500 666558 659958 653935 648092 641737 635149
59810 635149 629585 625539 622023 618167 614371 611044 607431 602860 598188 594788 592838 591708 591211 591205 590672
59795 590672 588615 585504 582638 580445 578380 576141 573939 571928 570254 569259 568808 567966 566157 564102 562689
59780 562689 561640 560250 558732 557741 557222 556918 557368 559095 561326 562911 564172 566473 570195 574443 578728
59765 578728 583609 589455 595613 601096 605527 609311 613297 618108 623417 628249 632341 636599 641779 647580
59751 647580 653677 660673 668985 677573 684936 690756 695617 699805 703563 707786 713157 718969 723979 727994
59737 727994 731508 734358 735995 736703 737228 737547 737187 736454 736059 735807 734906 733408 732204 731697 731575 731731 732361
59720 732361 733316 734285 735383 736575 736910 735435 732606 729723 727250 724753 722154 719848 717822 715786 714027
$$ packed form
59824G11940l540l065l368m003m899n930o674o961o942o600o023n843o355o588
59810F35149n564m046l516l856l796l327l613m571m672l400j950j130m97on33
59795E90672k057l111k866k193k065k239k202k011j674r95m51q42j809k055j413
59780E62689j049j390j518r91n19l04M50J727K231J585J261K301L722M248M285
59765E78728M881N846O158N483M431L784L986M811N309M832M092M258N180N801
59751F47580O097O996Q312Q588P363N820M861M188L758M223N371N812N010M015
59737G27994L514K850J637P08N25L19l60p33l95k52r01j498j204n07j22J56O30
59720G32361R55R69J098J192L35j475k829k883k473k497k599k306k026k036j759
$$ plain form
59705 714027 713081 712782 712672 713104 714792 717471 720094 722118 723619 724427 724373 724186 724948 726705 728570 729956
59689 729956 730698 730315 728384 725491 722707 720249 717725 715405 714049 713629 713324 712625 711371 708990 704956
59674 704956 699821 694592 689243 683001 675941 669083 663000 657550 652840 649209 646308 643396 640559 638544
59660 638544 637458 636709 636175 636322 637222 638498 640100 642198 644570 647149 650740 655968 661825 666512 669421
59645 669421 671035 671347 669900 667141 664086 660649 655795 649301 642043 634673 627459 621249 616959 614086
59631 614086 611224 608051 605327 603034 600174 596476 592687 589103 585393 581880 579294 577189 574392 571114
59617 571114 568648 566744 563413 557975 552334 548363 545820 543740 542252 541907 542550 543883 546014 548660 550957
59602 550957 552725 554763 557274 559302 560369 561344 562863 564309 565252 566617 569220 572169 573911 574125 573652
$$ packed form
59705G14027r46k99j10M32J688K679K623K024J501Q08n4j87P62J757J865J386
59689G29956P42l83j931k893k784k458k524k320j356m20l05o99j254k381m034
59674G04956n135n229n349o242p060o858o083n450m710l631k901k912k837k015
59660F38544j086p49n34J47R00J276J602K098K372K579L591N228N857M687K909
59645F69421J614L12j447k759l055l437m854o494p258p370p214o210m290k873
59631F14086k862l173k724k293k860l698l789l584l710l513k586k105k797l278
59617E71114k466j904l331n438n641l971k543k080j488l45O43J333K131K646K297
59602E50957J768K038K511K028J067R75J519J446R43J365K603K949J742K14m73
$$ plain form
59587 573652 573198 572962 572975 573036 572669 571567 569669 566758 562750 558478 555173 552987 551077 549231 548084 547469
59571 547469 546131 543731 541724 541347 541984 542379 542334 542209 541799 540790 539566 538620 537788 536872 536309 536438 536728
59554 536728 536526 535992 535614 535355 535007 534925 535769 537850 541067 545083 549261 553070 556921 562064 569221 577892
59538 577892 587481 598871 614484 636444 663865 691305 710772 716904 710678 697599 682894 669366
59526 669366 658738 652402 650274 650742 652582 655766 660069 664415 668208 671898 675567 678228 679099 678277 675606
59511 675606 670329 662618 654132 646126 638153 629472 620577 612384 604868 597430 589809 582031 574306 567524
59497 567524 562801 559915 557239 553887 550819 549168 548666 548530 548786 549699 550835 551691 552539 553838 555476 557231
59481 557231 559303 561793 564443 567341 571004 575315 579360 582850 586596 591056 595568 599677 604005 608957
$$ packed form
59587E73652m54k36J3O1l67j102j898k911m008m272l305k186j910j846j147o15
59571E47469j338k400k007l77O37L95m5j25m10j009j224r46q32r16n63J29K90
59554E36728k02n34l78k59l48q2Q44K081L217M016M178L809L851N143P157Q671
59538E77892R589J1390J5613K1960K7421K7440J9467O132o226j3079j4705j3528
59526F69366j0628o336k128M68J840L184M303M346L793L690L669K661Q71q22k671
59511F75606n277p711q486q006p973q681q895q193p516p438p621p778p725o782
59497E67524m723k886k676l352l068j651n02j36K56R13J136Q56Q48J299J638J755
59481E57231K072K490K650K898L663M311M045L490L746M460M512M109M328M952
$$ plain form
59467 608957 613636 617003 619212 620951 622329 623251 624128 625370 626823 628346 630282 632863 635940 639720 644892
59452 644892 651624 659346 667849 677441 687646 697010 704723 711208 716602 720046 721087 720334 717901 712659
59438 712659 704062 693494 682795 672578 662948 654668 648445 643938 640435 637717 635585 633635 632311
59425 632311 633106 636818 642579 649367 657430 667520 679886 694818 712992 734329 757447 781055 805279
59412 805279 831439 861457 896855 935821 970783 991726 993823 980740 960025 937495 916715 900512
59400 900512 890353 886215 889164 901701 922624 943332 952804 946279 927178 901764 874668 848819
59388 848819 826205 807430 791942 779203 768805 759950 752134 746011 742327 740439 739019 737635 736473
59375 736473 735291 733939 733139 733395 733862 733600 733108 733241 733554 733277 732980 733572 734515 734859 735353 737641 741865
$$ packed form
59467F08957M679L367K209J739J378R22Q77J242J453J523J936K581L077L780N172
59452F44892O732P722Q503R592J0205R364P713O485N394L444J041p53k433n242
59438G12659q597j0568j0699j0217r630q280o223m507l503k718k132j950j324
59425F32311P95L712N761O788Q063J0090J2366J4932J8174K1337K3118K3608K4224
59412H05279K6160L0018L5398L8966L4962K0943K097j3083k0715k2530k0780j6203
59400I00512j0159m138K949J2537K0923K0708R472o525j9101k5414k7096k5849
59388H48819k2614j8775j5488j2739j0398q855p816o123l684j888j420j384j162
59375G36473j182j352q00K56M67k62m92J33L13k77k97N92R43L44M94K288M224
$$ plain form
59358 741865 746799 751889 757480 763469 769494 776133 784352 794133 805046 817623 832600 849308 866469
59345 866469 884066 902803 922219 941077 959175 977003 993955 1008637 1020655 1030363 1037134 1039711
59333 1039711 1038190 1033946 1027572 1018462 1006365 991791 974805 955008 932945 910323 888639 868477
59321 868477 849913 832614 815858 799528 784673 772107 761063 750337 739987 730614 721863 713165
59309 713165 705181 698765 693230 687445 682079 678845 677947 678185 679278 682153 687190 694109 703615 717313
59295 717313 735659 756968 777924 793814 799449 792437 775759 755374 735325 716550 699502 685311
59283 685311 674297 665670 659221 655542 654434 654887 656867 661329 668267 676507 685679 696704 710063 725117
59269 725117 741327 758542 775950 792333 807585 822465 836753 849152 859035 866720 872038 874294
$$ packed form
59358G41865M934N090N591N989O025O639Q219R781J0913J2577J4977J6708J7161
59345H66469J7597J8737J9416J8858J8098J7828J6952J4682J2018R708O771K577
59333A039711j521m244o374r110j2097j4574j6986j9797k2063k2622k1684k0162
59321H68477j8564j7299j6756j6330j4855j2566j1044j0726j0350r373q751q698
59309G13165p984o416n535n785n366l234q98K38J093K875N037O919R506J3698
59295G17313J8346K1309K0956J5890N635p012j6678k0385k0049j8775j7048j4191
59283F85311j1014q627o449l679j108M53J980M462O938Q240R172J1025J3359J5054
59269G25117J6210J7215J7408J6383J5252J4880J4288J2399R883P685N318K256
$$ plain form
59257 874294 873643 870796 865417 856699 845642 834767 825288 816363 807481 799661 793811 789650 786858 785661
59243 785661 785825 786582 788049 791214 796055 801204 805908 810893 816821 823231 829398 834901 839066 841197 841569
59228 841569 840862 838561 833425 825635 816816 807731 797650 786238 774316 762382 750124 737837 726666
59215 726666 716913 707687 698697 690825 684400 678536 672810 668074 664939 662764 660710 658576 656175 653238
59201 653238 650374 648856 649058 650252 652074 654850 658406 662017 665719 670156 675050 679395 683211 687379
59187 687379 691701 695048 697625 701058 705829 710616 714611 718447 722268 724981 726183 726886 727500 727073 725410
59172 725410 724025 723872 723943 723299 722908 724158 726892 730067 733220 736280 738905 740874 742292 743016 742884 742556
59156 742556 742673 742066 738636 732346 725348 718575 710395 699622 687808 677239 668262 659911 651774 644008
$$ packed form
59257H74294o51k847n379q718j1057j0875r479q925q882p820n850m161k792j197
59243G85661J64P57J467L165M841N149M704M985N928O410O167N503M165K131L72
59228H41569p07k301n136p790q819r085j0081j1412j1922j1934j2258j2287j1171
59215G26666r753r226q990p872o425n864n726m736l135k175k054k134k401k937
59201F53238k864j518K02J194J822K776L556L611L702M437M894M345L816M168
59187F87379M322L347K577L433M771M787L995L836L821K713J202P03O14m27j663
59172G25410j385j53P1o44l91J250K734L175L153L060K625J969J418P24j32l28
59156G42556J17o07l430o290o998o773q180j0773j1814j0569q977q351q137p766
$$ plain form
59142 644008 636664 630065 624789 620534 616092 611034 606107 601529 596494 590978 586332 583239 580733 578081
59128 578081 576004 575134 574998 575531 577967 582993 589400 595674 601683 607944 614637 622237 631619 642556 653500
59113 653500 663746 674369 686188 698369 709990 721290 732315 741989 749822 757063 764844 772446
59101 772446 778517 782768 785423 786332 785665 784277 782457 779614 775898 772621 770235 767596 764153 761136 759517
59086 759517 758516 757240 755998 754794 752382 748217 743601 739379 734257 726991 718606 710698 703097 695000
59072 695000 687043 680331 674518 668642 662926 658164 654159 650203 646242 642378 638235 633998 630854 629185
59058 629185 627586 624889 621868 619676 618003 616160 614542 613463 611957 609377 606982 606281 606884 607470 607730
59043 607730 607868 607424 606137 604830 603938 602364 599343 596150 594386 593798 593483 593973 596257 599806 603417 607153
$$ packed form
59142F44008p344o599n276m255m442n058m927m578n035n516m646l093k506k652
59128E78081k077q70j36N33K436N026O407O274O009O261O693P600R382J0937J0944
59113F53500J0246J0623J1819J2181J1621J1300J1025R674P833P241P781P602
59101G72446O071M251K655R09o67j388j820k843l716l277k386k639l443l017j619
59086G59517j001j276j242j204k412m165m616m222n122p266q385p908p601q097
59072F95000p957o712n813n876n716m762m005l956l961l864m143m237l144j669
59058F29185j599k697l021k192j673j843j618j079j506k580k395p01O03N86K60
59043F07730J38m44j287j307q92j574l021l193j764n88l15M90K284L549L611L736
$$ plain form
59027 607153 611740 617027 622706 629654 638872 649976 662245 676155 692208 709292 725907 742090
59015 742090 758316 773409 785336 793420 798099 799270 796531 790496 782402 773090 763578 755608 750144
59002 750144 746247 742901 740938 741712 744909 749249 754277 759842 764902 768605 771607 774714 777263 778473
58988 778473 779246 780796 782533 783151 782737 781879 779801 775519 770050 765469 762465 760705 760668 762981 766726 770587
58972 770587 775206 782357 792250 803554 815590 828522 841806 854382 866203 877941 889481 900235
58960 900235 910470 920790 930758 939398 946376 951291 952657 949222 941535 930706 916594 898975 879519
58947 879519 860584 842683 824930 807315 790717 775377 761093 748281 737227 727101 717461 709750
58935 709750 705436 703595 702274 701294 701622 702837 703517 703524 703827 704543 705092 705685 706758 707530 706938 705267 703171
$$ packed form
59027F07153M587N287N679O948R218J1104J2269J3910J6053J7084J6615J6183
59015G42090J6226J5093J1927Q084M679J171k739o035q094r312r512p970n464
59002G50144l897l346j963P74L197M340N028N565N060L703L002L107K549J210
58988G78473P73J550J737O18m14q58k078m282n469m581l004j760l7K313L745L861
58972G70587M619P151R893J1304J2036J2932J3284J2576J1821J1738J1540J0754
58960I00235J0235J0320R968Q640O978M915J366l435p687j0829j4112j7619j9456
58947H79519j8935j7901j7753j7615j6598j5340j4284j2812j1054j0126r640p711
58935G09750m314j841j321r80L28J215O80PL03P16N49N93J073P72n92j671k096
$$ plain form
58918 703171 700148 695898 691940 689606 687598 684025 679904 677994 678953 681285 684335 688567 693397 697676
58904 697676 702158 708921 718425 729475 741635 755205 769239 782279 794859 808648 823280 836715
58892 836715 848674 861068 874936 889649 905326 923394 944280 966808 990222 1014552 1038676
58881 1038676 1060246 1078043 1092568 1104120 1112201 1116881 1118784 1117582 1112309 1103135 1091099 1076443
58869 1076443 1059233 1041233 1024879 1010532 996894 983867 972689 963370 954423 945170 936101 926952
58857 926952 916712 905532 894453 883278 870885 857503 844504 832093 819524 807346 797049
58846 797049 788637 780933 774039 768908 764658 759033 751557 743603 735416 725819 714964 704570 695236 686188
58832 686188 677807 671522 666938 662017 656582 652809 651646 651536 651340 651777 653216 654661 655820 657798 660948
$$ packed form
58918G03171l023m250l958k334k008l573m121j910R59K332L050M232M830M279
58904F97676M482O763R504J1050J2160J3570J4034J3040J2580J3789J4632J3435
58892H36715J1959J2394J3868J4713J5677J8068K0886K2528K3414K4330K4124
58881A038676K1570J7797J4525J1552Q081M680J903j202n273r174j2036j4656
58869A076443j7210j8000j6354j4347j3638j3027j1178r319q947r253r069r149
58857I26952j0240j1180j1079j1175j2393j3382j2999j2411j2569j2178j0297
58846G97049q412p704o894n131m250n625p476p954q187r597j0855j0394r334r048
58832F86188q381o285m584m921n435l773j163j10j96M37J439J445J159J978L150
$$ plain form
58817 660948 664284 667631 672045 677526 682577 686534 690091 693196 694834 695245 695843 696528 695637 692966 690197
58802 690197 687850 684545 679879 675323 671589 667803 663866 660867 658440 654529 648694 642932 638346 633782
58788 633782 628704 624629 622535 621477 620936 622001 625047 628739 632504 637542 644198 650694 655777 660362
58774 660362 665382 670160 673923 676739 677976 676126 671169 664982 658545 651011 642264 633928 626918 620513
58760 620513 614710 610857 608895 606629 602997 599646 598117 597918 598563 600954 605402 610543 615476 620770 626349
58745 626349 630765 633669 636640 640515 644302 647731 652312 658694 665472 671776 678552 686233 693700 700655
58731 700655 708367 716952 724595 730654 736776 743723 749983 754796 759638 765219 769967 773073 776181 780413
58717 780413 784600 788163 792906 800049 808202 816114 824661 834194 842608 848112 851406 853251 852439 848107
$$ packed form
58817F60948L336L347M414N481N051L957L557L105J638M11N98O85q91k671k769
58802F90197k347l305m666m556l734l786l937k999k427l911n835n762m586m564
58788F33782n078m075k094j058n41J065L046L692L765N038O656O496N083M585
58774F60362N020M778L763K816J237j850m957o187o437p534q747q336p010o405
58760F20513n803l853j962k266l632l351j529j99O45K391M448N141M933N294N579
58745F26349M416K904K971L875L787L429M581O382O778O304O776P681P467O955
58731G00655P712Q585P643O059O122O947O260M813M842N581M748L106L108M232
58717G80413M187L563M743P143Q153P912Q547R533Q414N504L294J845q12m332
$$ plain form
58703 848107 841548 833715 823382 809673 793893 776983 757794 735935 713798 693627 674989 657104
58691 657104 641134 628069 616793 606324 597580 590970 584771 577929 571883 567551 563201 557465 551787
58678 551787 547544 543509 538622 534623 533247 533271 532974 533209 535339 538437 541172 544382 549276 555233 561852
58663 561852 570979 584135 599927 616220 632450 647455 657695 660660 658095 653240 646987 639179 631172
58650 631172 624142 616970 608665 600912 595494 591238 586205 580852 576353 571984 567052 563326 562609 563749
58636 563749 564802 566180 569001 572421 575426 579200 584757 590191 593137 594099 594613 594246 592270 590153 589279
58621 589279 588235 585408 582247 580854 580259 578296 575417 573643 573529 575128 579975 588887 599489 608853
58607 608853 616812 623981 628857 630129 629735 630168 630647 629250 626891 625715 625330 624037 622106 620571 618574
$$ packed form
58703H48107o559p833j0333j3709j5780j6910j9189k1859k2137k0171j8638j7885
58691F57104j5970j3065j1276j0469q744o610o199o842o046m332m350n736n678
58678E51787m243m035m887l999j376K4k97K35K130L098K735L210M894N957O619
58663E61852R127J3156J5792J6293J6230J5005J0240K965k565m855o253p808q007
58650F31172p030p172q305p753n418m256n033n353m499m369m932l726p17J140
58636E63749J053J378K821L420L005L774N557N434K946R62N14l67j976k117q74
58621E89279j044k827l161j393n95j963k879j774j14J599M847Q912J0602R364
58607F08853P959P169M876J272l94M33M79j397k359j176l85j293j931j535j997
$$ plain form
58592 618574 615211 612199 611484 612136 612833 615264 621495 630133 638939 649142 663107 679418 694411 707200
58578 707200 719324 730769 740251 748238 756014 762868 767599 771477 776495 782250 787870 795165 806367
58565 806367 820667 836589 855718 880141 908233 937169 967701 1002064 1038784 1073899 1105746
58554 1105746 1134164 1156628 1169985 1175071 1175329 1171959 1164541 1155001 1146422 1138894 1130777 1122905 1117310
58541 1117310 1112953 1106932 1098609 1088305 1073574 1051632 1024389 996405 968942 940610 912578 888101
58529 888101 867611 849096 832580 819600 809099 798595 788678 781688 776806 771240 765360 761720 759786
58516 759786 756627 752199 748907 746523 742644 737694 734399 732642 729904 726438 724979 725566 725610 724836 725194
58501 725194 726242 725698 724283 724848 726872 727037 725114 724114 724628 724308 723056 723500 726072 728669 731347 736351
$$ packed form
58592F18574l363l012p15O52O97K431O231Q638Q806J0203J3965J6311J4993J2789
58578G07200J2124J1445R482P987P776O854M731L878N018N755N620P295J1202
58565H06367J4300J5922J9129K4423K8092K8936L0532L4363L6720L5115L1847
58554A105746K8418K2464J3357N086K58l370p418r540q579p528q117p872n595
58541A117310m357o021q323j0304j4731k1942k7243k7984k7463k8332k8032k4477
58529H88101k0490j8515j6516j2980j0501j0504r917o990m882n566n880l640j934
58516G59786l159m428l292k384l879m950l295j757k738l466j459N87M4p74L58
58501G25194J048n44j415N65K024J65j923j000N14l20j252M44K572K597K678N004
$$ plain form
58485 736351 743374 749835 755971 764601 775859 787311 799299 814788 833744 852998 871881 892588
58473 892588 914655 934457 950544 964053 973545 975160 968683 958167 945909 931045 914505 899722
58461 899722 887635 876316 866248 860720 860323 862416 866609 875331 888354 902357 916665 933847 953719
58448 953719 972124 986423 996857 1002047 998966 988297 974330 958879 940850 922056 907086 896546
58436 896546 886611 876329 869186 866317 864495 862232 861747 863469 864759 865624 869671 877760 886639 895335
58422 895335 906829 921802 936624 949141 960514 969989 973943 971788 966896 960395 950106 936795
58410 936795 924945 915818 906159 895116 885778 878441 869465 858588 850337 846156 842173 836877 833899
58397 833899 834840 836418 837277 840635 847489 854061 858616 864075 871273 876512 878503 880975 885756 890037 892873
$$ packed form
58485G36351P023O461O136Q630J1258J1452J1988J5489J8956J9254J8883K0707
58473H92588K2067J9802J6087J3509R492J615o477j0516j2258j4864j6540j4783
58461H99722j2087j1319j0068n528l97K093M193Q722J3023J4003J4308J7182J9872
58448I53719J8405J4299J0434N190l081j0669j3967j5451j8029j8794j4970j0540
58436H96546r935j0282p143k869j822k263m85J722J290Q65M047Q089Q879Q696
58422H95335J1494J4973J4822J2517J1373R475L954k155m892o501j0289j3311
58410I36795j1850r127r659j1043r338p337q976j0877q251m181l983n296k978
58397H33899R41J578Q59L358O854O572M555N459P198N239J991K472M781M281K836
$$ plain form
58382 892873 897333 903647 907442 907460 907850 910192 910780 908609 908305 911984 915793 917806 921733 929450 937455
58367 937455 944124 952881 964815 975946 985210 997183 1013360 1028892 1041704 1056491 1075603 1094319
58355 1094319 1109381 1123838 1138942 1149743 1153619 1155131 1157598 1157946 1154542 1151831 1152297 1152062 1149416 1149354
58341 1149354 1154678 1161059 1165969 1173861 1187225 1201327 1213353 1227933 1247855 1268162 1285367 1303680
58329 1303680 1326043 1347926 1366095 1384497 1405049 1421727 1430506 1436237 1443095 1447352 1446383 1445516 1448755
58316 1448755 1451806 1451362 1452111 1457458 1462812 1465364 1470855 1483106 1496563 1506825 1518583 1535332 1551635
58303 1551635 1563877 1578200 1599114 1620754 1638330 1657421 1682448 1706818 1724525 1740925 1761815
58292 1761815 1782462 1797989 1813998 1836008 1858831 1877392 1897483 1924580 1952605 1975326 1998213
$$ packed form
58382H92873M460O314L795J8L90K342N88k171l04L679L809K013L927P717Q005
58367I37455O669Q757J1934J1131R264J1973J6177J5532J2812J4787J9112J8716
58355A094319J5062J4457J5104J0801L876J512K467L48l404k711M66k35k646o2
58341A149354N324O381M910P892J3364J4102J2026J4580J9922K0307J7205J8313
58329A303680K2363K1883J8169J8402K0552J6678Q779N731O858M257r69q67L239
58316A448755L051m44P49N347N354K552N491J2251J3457J0262J1758J6749J6303
58303A551635J2242J4323K0914K1640J7576J9091K5027K4370J7707J6400K0890
58292A761815K0647J5527J6009K2010K2823J8561K0091K7097K8025K2721K2887
$$ plain form
58281 1998213 2027330 2057362 2082753 2109800 2145239 2183682 2218952 2256821 2303593 2353227 2398937
58270 2398937 2446268 2501271 2557369 2607843 2659466 2719530 2781460 2838100 2896946 2966818 3041758
58259 3041758 3113676 3188101 3271073 3353639 3426551 3497304 3575072 3652311 3719730 3785843 3862353
58248 3862353 3943709 4020908 4101802 4197117 4300235 4401971 4511305 4639601 4778594 4916501
58238 4916501 5061127 5223761 5395704 5565426 5743231 5943197 6156698 6370575 6595007
58229 6595007 6845260 7112738 7383577 7668656 7984563 8322901 8670694 9042304 9457038
58220 9457038 9904725 10369743 10868783 11426420 12034777 12678642 13378438 14164172 15029860
58211 15029860 15961128 16984264 18137738 19421065 20827175 22399089 24196027 26233444
$$ packed form
58281A998213K9117L0032K5391K7047L5439L8443L5270L7869M6772M9634M5710
58270B398937M7331N5003N6098N0474N1623O0064O1930N6640N8846O9872P4940
58259C041758P1918P4425Q2972Q2566P2912P0753P7768P7239O7419O6113P6510
58248C862353Q1356P7199Q0894R5315J03118J01736J09334J28296J38993J37907
58238D916501J44626J62634J71943J69722J77805J99966K13501K13877K24432
58229F595007K50253K67478K70839K85079L15907L38338L47793L71610M14734
58220I457038M47687M65018M99040N57637O08357O43865O99796P85734Q65688
58211A5029860R31268J023136J153474J283327J406110J571914J796938K037417
$$ plain form
58203 26233444 28522961 31141474 34190452 37724275 41804593 46594944 52319222 59178242
58195 59178242 67418883 77437691 89690410 104560090 122476666 144110353 170273866
58188 170273866 201749284 239424569 284123351 335032810 387383885 432156260 459548067
58181 459548067 464096646 447247372 415548667 376603488 336045828 296822677 259982151
58174 259982151 225785188 194474852 166459900 142047735 121193055 103574811 88815802
58167 88815802 76544050 66347770 57826128 50685387 44714374 39697025 35424109 31761957
58159 31761957 28633427 25946849 23603973 21554918 19780228 18231315 16843088 15590099
58151 15590099 14476045 13479188 12558016 11700424 10919696 10209756 9547843 8933392 8382248
$$ packed form
58203B6233444K289517K618513L048978L533823M080318M790351N724278O859020
58195E9178242Q240641J0018808J2252719J4869680J7916576K1633687K6163513
58188A70273866L1475418L7675285M4698782N0909459N2351075M4772375K7391807
58181D59548067M548579j6849274l1698705l8945179m0557660l9223151l6840526
58174B59982151l4196963l1310336k8014952k4412165k0854680j7618244j4759009
58167H8815802j2271752j0196280q521642p140741n971013n017349m272916l662152
58159C1761957l128530k686578k342876k049055j774690j548913j388227j252989
58151A5590099j114054r96857r21172q57592p80728p09940o61913o14451n51144
$$ plain form
58142 8382248 7888271 7428933 7002714 6624587 6290579 5981394 5694775 5440251 5207658
58133 5207658 4974278 4739140 4519277 4316543 4118363 3926778 3756303 3605612 3459736
58124 3459736 3317956 3192355 3081183 2970251 2859018 2759800 2672604 2585234 2497026 2418619
58114 2418619 2349217 2277157 2202322 2135848 2078239 2019190 1958391 1905436 1859629 1810461 1757882
58103 1757882 1712099 1673361 1631472 1585454 1544671 1510150 1473377 1434072 1401159 1375469 1348842
58092 1348842 1320789 1298846 1281965 1260671 1234493 1212613 1196326 1177236 1153904 1134147 1119336
58081 1119336 1102024 1080693 1061798 1045663 1025174 1000117 978359 961228 941780 919033 899852
58070 899852 885110 867890 847301 830517 819120 806635 791525 779568 771372 760535 746401 735985
$$ packed form
58142H382248m93977m59338m26219l78127l34008l09185k86619k54524k32593
58133E207658k33380k35138k19863k02734j98180j91585j70475j50691j45876
58124C459736j41780j25601j11172j10932j11233r9218q7196q7370q8208p8407
58114B418619o9402p2060p4835o6474n7609n9049o0799n2955m5807m9168n2579
58103A757882m5783l8738m1889m6018m0783l4521l6773l9305l2913k5690k6627
58092A348842k8053k1943j6881k1294k6178k1880j6287j9090k3332j9757j4811
58081A119336j7312k1331j8895j6135k0489k5057k1758j7131j9448k2747j9181
58070H99852j4742j7220k0589j6784j1397j2485j5110j1957q196j0837j4134j0416
$$ plain form
58058 735985 730850 724402 714446 706300 701072 692958 680756 670372 663305 654094 641721 632277 627613
58045 627613 622413 615102 610697 610079 607282 600379 594558 591529 586220 577001 569125 564986 560615 554581
58031 554581 550710 549162 544420 534959 525696 518324 508605 495749 484893 477515 468826 457517 448776
58018 448776 444654 440595 434510 430286 429328 427601 424020 422766 424295 423108 417685 413656 413741 413497 410566
58003 410566 409179 411593 413760 413581 415079 420142 424294 424993 426293 430850 434885 435428 435123 435406 432177
57988 432177 422961 411836 402833 394745 386360 380369 377941 375576 371204 367534 366010 363706 359521 356949
57974 356949 357237 356317 352129 348537 348332 348829 348051 348673 351895 353891 352576 351680 353933 356254 355927 355577
57958 355577 357716 360031 360341 360659 362199 361901 358072 354082 352388 350338 345945 342233 341615 341407 339328
$$ packed form
58058G35985n135o448r956q146n228q114j2202j0384p067r211j2373r444m664
58045F27613n200p311m405o18k797o903n821l029n309r219p876m139m371o034
58031E54581l871j548m742r461r263p372r719j2856j0856p378q689j1309q741
58018D48776m122m059o085m224r58j727l581j254J529j187n423m029Q5k44k931
58003D10566j387K414K167j79J498N063M152O99J300M557M035N43l05K83l229
57988D32177r216j1125r003q088q385n991k428k365m372l670j524k304m185k572
57974C56949K88r20m188l592k05M97p78O22L222J996j315q96K253K321l27l50
57958C55577K139K315L10L18J540k98l829l990j694k050m393l712o18k08k079
$$ plain form
57943 339328 338099 340139 342943 344256 346773 352975 360186 365469 370958 379748 390752 401992 414571
57930 414571 428975 441655 449654 454668 458530 458941 453807 445609 437261 427686 415573 403353 393193
57917 393193 383082 371064 359462 350782 343379 335248 328133 323769 320119 315549 312791 314315 317552
57904 317552 319083 319896 322073 323991 323394 321847 321584 321159 318657 316063 316013 317213 317441 318143 321727 326990
57888 326990 331404 335304 339932 344102 346623 349217 353289 356715 357632 358372 361682 365970 368244 368863 369432
57873 369432 368892 365798 361814 359055 356632 353504 351721 352930 354636 354027 352561 352708 353205 351923 350544
57858 350544 351785 354574 356480 358475 362780 368300 372729 376964 382960 389248 393043 394837 396638 397662
57844 397662 396116 393298 391522 389786 385883 381052 378152 376750 374423 371516 370301 370684 370854 371050 372673
$$ packed form
57943C39328j229K040K804J313K517O202P211N283N489Q790J1004J1240J2579
57930D14571J4404J2680P999N014L862M11n134q198q348r575j2113j2220j0160
57917C93193j0111j2018j1602q680p403q131p115m364l650m570k758J524L237
57904C17552J531Q13K177J918n97j547k63m25k502k594n0J200K28P02L584N263
57888C26990M414L900M628M170K521K594M072L426R17P40L310M288K274O19N69
57873C69432n40l094l984k759k423l128j783J209J706o09j466J47M97j282j379
57858C50544J241K789J906J995M305N520M429M235N996O288L795J794J801J024
57844C97662j546k818j776j736l903m831k900j402k327k907j215L83J70J96J623
$$ plain form
57829 372673 374778 375325 374937 375833 378127 380497 383172 386832 390020 391044 391072 392018 392950 391938 389705 388040
57813 388040 386403 383641 381074 379989 377884 371197 360347 348381 336326 323741 312075 303254 296200
57800 296200 288683 281329 276034 271998 267256 262570 259674 257224 252850 247870 245521 245640 245566 245296 247192
57785 247192 251244 255135 258615 263607 270254 276908 283725 292328 302153 310908 318402 326293 334335 340500
57771 340500 344556 348070 351161 352582 352504 351919 349890 344820 337818 331484 326081 320258 314612 310906 308649
57756 308649 306191 304284 304741 306460 306852 306471 307933 310847 312205 311578 311551 313014 314230 314638 315443 316190
57740 316190 314858 311735 309367 308284 306519 303702 301838 301558 301263 300438 300322 300842 300410 299159 298932 299692
57724 299692 299366 297599 296211 295659 294634 293493 294319 296970 298718 298569 298485 299622 300844 301784 303849 307160
$$ packed form
57829C72673K105N47l88Q96K294K370K675L660L188J024K8R46R32j012k233j665
57813C88040j637k762k567j085k105o687j0850j1966j2055j2585j1666q821p054
57800B96200p517p354n295m036m742m686k896k450m374m980k349J19p4k70J896
57785B47192M052L891L480M992O647O654O817Q603R825Q755P494P891Q042O165
57771C40500M056L514L091J421p8n85k029n070p002o334n403n823n646l706k257
57756C08649k458j907M57J719L92l81J462K914J358o27k7J463J216M08Q05P47
57740C16190j332l123k368j083j765k817j864k80k95q25j16N20m32j251k27P60
57724B99692l26j767j388n52j025j141Q26K651J748j49q4J137J222R40K065L311
$$ plain form
57708 307160 309736 310749 311523 312472 312152 310383 309270 310113 311993 314188 317142 320284 321795 321418 320863 320702
57692 320702 319560 316951 314105 311390 307737 303243 299516 296822 293723 290104 287678 286935 286623 286840 289529
57677 289529 295117 301794 309151 319491 334551 353854 377419 407222 444824 490389 545387 613193
57665 613193 694443 782499 864005 922958 945983 928390 877380 807493 731625 657035 588056
57654 588056 528113 478076 436176 401088 372825 350217 330632 313202 299403 289550 281648 274663
57642 274663 269937 268104 267406 266292 265129 264278 263093 261849 262032 263639 264759 264739 265167 266845 268598 269909
57626 269909 271787 273963 274251 272026 269502 268229 267040 264759 262237 260324 258402 256248 254800 253997 252446
57611 252446 250325 249727 251009 251729 250546 249161 248990 248932 248041 247457 247937 248281 247929 248327 249918 250606 249089
$$ packed form
57708C07160K576J013P74R49l20j769j113Q43J880K195K954L142J511l77n55j61
57692C20702j142k609k846k715l653m494l727k694l099l619k426p43l12K17K689
57677B89529N588O677P357J0340J5060J9303K3565K9803L7602M5565N4998O7806
57665F13193Q1250Q8056Q1506N8953K3025j7593n1010o9887p5868p4590o8979
57654E88056n9943n0037m1900l5088k8263k2608j9585j7430j3799r853p902o985
57642B74663m726j833o98j114j163q51j185j244J83J607J120k0M28J678J753J311
57626B69909J878K176K88k225k524j273j189k281k522j913j922k154j448q03j551
57611B52446k121n98J282P20j183j385j71n8q91n84M80L44l52L98J591O88j517
$$ plain form
57594 249089 247028 246023 245084 243020 240655 238714 236169 232707 230226 229716 229274 227416 225804 226352 228075
57579 228075 229191 230021 231367 232254 231801 231249 231664 231572 229358 226133 223836 222324 220724 219801 220430 221360 221012
57562 221012 220041 219812 219836 219051 218147 218280 218817 218637 218415 219393 221082 222275 223138 224317 225209 225102 224812 225232
57544 225232 225493 224505 223091 222711 223193 223566 223986 225084 226515 227778 229255 230934 231451 229910 227271 224547
57528 224547 221319 217511 214744 214124 214471 214574 215286 217381 219313 219459 218909 219656 221515 223197 224957 227689
57512 227689 230656 232578 233925 235852 237933 239166 240205 242344 245200 247479 249182 251108 253103 254659
57498 254659 256240 258180 259377 258919 257920 257926 258669 259202 259883 261354 262910 263909 265426 268425 271610 273257
57482 273257 273921 275192 277013 278507 280217 283160 286663 289278 290879 291882 291707 290100 288697 288984 289987
$$ packed form
57594B49089k061j005r39k064k365j941k545l462k481n10m42j858j612N48J723
57579B28075J116Q30J346Q87m53n52M15r2k214l225k297j512j600r23O29R30l48
57562B21012r71k29K4p85r04J33N37j80k22R78J689J193Q63J179Q92j07k90M20
57544B25232K61r88j414l80M82L73M20J098J431J263J477J679N17j541k639k724
57528B24547l228l808k767o20L47J03P12K095J932J46n50P47J859J682J760K732
57512B27689K967J922J347J927K081J233J039K139K856K279J703J926J995J556
57498B54659J581J940J197m58r99OP43N33O81J471J556R99J517K999L185J647
57482B73257O64J271J821J494J710K943L503K615J601J003j75j607j403K87J003
$$ plain form
57467 289987 290197 290390 292064 294522 296223 297787 300814 304703 307494 309068 310744 312458 313211 313671 315511
57452 315511 318441 320578 321495 322471 324020 325510 326941 328798 330485 331073 331256 332517 334883 337497 340613
57437 340613 344772 348779 350950 351781 353020 354805 356169 357655 360730 365036 368868 372014 375577 379413
57423 379413 382363 384733 387897 391635 394460 396375 398745 401565 403564 405047 407881 412414 416916 420471
57409 420471 424127 428777 433999 439337 444762 449616 452925 454947 456829 458865 460697 462792 465812 469061
57395 469061 471528 473989 477906 482812 487051 490579 494626 499109 502918 506470 511384 517896 525051 532983
57381 532983 542270 551394 557888 561960 566138 571321 576102 580078 584668 590189 595108 598841 602568 606692
57367 606692 610143 612851 616298 620972 625783 630580 636677 644233 651699 658559 666042 674353 681808 687690
$$ packed form
57467B89987K10J93J674K458J701J564L027L889K791J574J676J714P53M60J840
57452C15511K930K137R17R76J549J490J431J857J687N88J83J261K366K614L116
57437C40613M159M007K171Q31J239J785J364J486L075M306L832L146L563L836
57423C79413K950K370L164L738K825J915K370K820J999J483K834M533M502L555
57409D20471L656M650N222N338N425M854L309K022J882K036J832K095L020L249
57395D69061K467K461L917M906M239L528M047M483L809L552M914O512P155P932
57381E32983R287R124O494M072M178N183M781L976M590N521M919L733L727M124
57367F06692L451K708L447M674M811M797O097P556P466O860P483Q311P455N882
$$ plain form
57353 687690 693571 700781 708783 716894 725389 734104 742147 749813 758507 768027 776317 782753 789232 796975
57339 796975 804668 810961 816556 822578 828959 835683 843585 852634 861313 868876 876450 884878 893399 901500
57325 901500 910120 919788 929394 938075 946648 955988 965653 975255 985556 996972 1008496 1019235 1029698
57312 1029698 1040643 1052034 1063947 1076958 1090781 1103969 1115809 1127148 1138742 1150359 1162072
57301 1162072 1174756 1188584 1202665 1216766 1231651 1247226 1262247 1276544 1291571 1307993 1324657
57290 1324657 1340751 1356874 1373202 1388696 1403221 1418472 1435606 1453768 1471979 1490625 1510070
57279 1510070 1529671 1549300 1570002 1592162 1614837 1637794 1662133 1687795 1712585 1735071 1756486
57268 1756486 1778468 1800808 1822847 1845177 1868422 1891947 1915212 1938837 1963135 1987231 2010825
$$ packed form
57353F87690N881P210Q002Q111Q495Q715Q043P666Q694R520Q290O436O479P743
57339G96975P693O293N595O022O381O724P902R049Q679P563P574Q428Q521Q101
57325I01500Q620R668R606Q681Q573R340R665R602J0301J1416J1524J0739J0463
57312A029698J0945J1391J1913J3011J3823J3188J1840J1339J1594J1617J1713
57301A162072J2684J3828J4081J4101J4885J5575J5021J4297J5027J6422J6664
57290A324657J6094J6123J6328J5494J4525J5251J7134J8162J8211J8646J9445
57279A510070J9601J9629K0702K2160K2675K2957K4339K5662K4790K2486K1415
57268A756486K1982K2340K2039K2330K3245K3525K3265K3625K4298K4096K3594
$$ plain form
57257 2010825 2035051 2060405 2085750 2110587 2136300 2163656 2191139 2217454 2243747 2271514 2300068
57246 2300068 2327901 2354994 2381949 2408393 2434162 2460676 2489262 2519263 2549431 2579956 2611631
57235 2611631 2644310 2677707 2712402 2748481 2784571 2819801 2855349 2892542 2930808 2969079 3007715
57224 3007715 3047345 3087247 3126679 3166489 3207619 3249183 3289749 3329345 3368516 3406604 3442749
57213 3442749 3477502 3511834 3545680 3578927 3612482 3646716 3680236 3712062 3743738 3777422 3813163
57202 3813163 3850018 3888600 3930346 3975123 4021617 4069355 4118466 4168125 4216952 4264286 4309675
57191 4309675 4352093 4391187 4428224 4464204 4498221 4529353 4558835 4588419 4617800 4645830 4673260
57180 4673260 4701980 4732311 4763229 4794671 4827542 4861866 4896829 4932218 4968022 5003188 5036574
$$ packed form
57257B010825K4226K5354K5345K4837K5713K7356K7483K6315K6293K7767K8554
57246B300068K7833K7093K6955K6444K5769K6514K8586L0001L0168L0525L1675
57235B611631L2679L3397L4695L6079L6090L5230L5548L7193L8266L8271L8636
57224C007715L9630L9902L9432L9810M1130M1564M0566L9596L9171L8088L6145
57213C442749L4753L4332L3846L3247L3555L4234L3520L1826L1676L3684L5741
57202C813163L6855L8582M1746M4777M6494M7738M9111M9659M8827M7334M5389
57191D309675M2418L9094L7037L5980L4017L1132K9482K9584K9381K8030K7430
57180D673260K8720L0331L0918L1442L2871L4324L4963L5389L5804L5166L3386
$$ plain form
57169 5036574 5068745 5101187 5134213 5167143 5199891 5232759 5265334 5297205 5329119 5361796 5394295
57158 5394295 5425146 5454373 5482745 5509772 5534175 5555668 5574601 5590456 5602340 5610265 5614384 5613753
57146 5613753 5607495 5596441 5582072 5564701 5544291 5521938 5498677 5473833 5446537 5417908 5389708
57135 5389708 5361813 5333224 5304754 5278444 5254938 5233646 5214834 5199310 5186516 5175073 5164710
57124 5164710 5155517 5145902 5133568 5118129 5100738 5081826 5061671 5042643 5028255 5020061 5017734 5021860
57112 5021860 5034097 5054702 5082418 5117109 5160441 5214152 5280204 5363041 5469671 5607137 5781595
57101 5781595 5999732 6269197 6597947 6995636 7476259 8058068 8761318 9607489 10619001
57092 10619001 11815744 13210360 14807193 16603157 18585365 20727708 22992591 25335185
$$ packed form
57169E036574L2171L2442L3026L2930L2748L2868L2575L1871L1914L2677L2499
57158E394295L0851K9227K8372K7027K4403K1493J8933J5855J1884P925M119o31
57146E613753o258j1054j4369j7371k0410k2353k3261k4844k7296k8629k8200
57135E389708k7895k8589k8470k6310k3506k1292j8812j5524j2794j1443j0363
57124E164710r193r615j2334j5439j7391j8912k0155j9028j4388q194k327M126
57112E021860J2237K0605K7716L4691M3332N3711O6052Q2837J06630J37466J74458
57101E781595K18137K69465L28750L97689M80623N81809P03250Q46171J011512
57092A0619001J196743J394616J596833J795964J982208K142343K264883K342594
$$ plain form
57084 25335185 27702547 30030909 32251689 34302772 36127715 37660594 38820352 39533429
57076 39533429 39768089 39545556 38917135 37931368 36619845 35006300 33122838 31017873 28753351
57067 28753351 26397593 24018976 21680855 19436853 17327825 15381955 13616296 12037407
57059 12037407 10641911 9419281 8355675 7435724 6642558 5958996 5369889 4862602 4425314
57050 4425314 4046232 3714821 3422751 3163392 2931278 2722201 2532885 2360343 2202168
57041 2202168 2057188 1924875 1804223 1693988 1593522 1502353 1419379 1343692 1275676 1216029
57031 1216029 1164275 1119781 1083721 1058302 1044278 1041091 1049564 1072678 1112781 1168007 1230122 1284555
57019 1284555 1314386 1308184 1265925 1197080 1113520 1024974 938905 860498 791560 731437 679699
$$ packed form
57084B5335185K367362K328362K220780K051083J824943J532879J159758P13077
57076C9533429K34660k22533o28421r85767j311523j613545j883462k104965k264522
57067B8753351k355758k378617k338121k244002k109028j945870j765659j578889
57059A2037407j395496j222630j063606r19951p93166o83562n89107n07287m37288
57050D425314l79082l31411k92070k59359k32114k09077j89316j72542j58175
57041B202168j44980j32313j20652j10235j00466r1169q2974p5687o8016n9647
57031A216029n1754m4494l6060k5419j4024l187Q473K3114M0103N5226O2115N4433
57019A284555K9831o202m2259o8845q3560q8546q6069p8407o8938o0123n1738
$$ plain form
57008 679699 636643 601440 572053 547345 527367 511340 497394 484693 473893 465048 456937 448873
56996 448873 441308 434170 426424 417907 409873 403138 397269 392108 388542 387280 388337 392056 399092 409086
56982 409086 420766 433294 445638 454639 456095 448589 434593 417375 398637 379494 361490 345645
56970 345645 332134 321559 314866 311480 309395 307856 308244 311700 317693 325656 336277 350286 367606
56957 367606 388407 413183 440645 466772 486775 497165 496091 483715 462991 438410 413230 388950
56945 388950 367147 349563 336055 324805 315314 309194 307403 308956 313243 321398 334273 351059 371085
56932 371085 395269 424741 459482 498546 539068 574085 594206 593914 575342 545104 509111 471165
56920 471165 433954 399061 367064 338950 316281 299124 285452 273635 263895 256393 249801 243105
$$ packed form
57008F79699m3056l5203k9387k4708j9978j6027j3946j2701j0800q845q111q064
56996D48873p565p138p746q517q034o735n869n161l566j262J057L719P036R994
56982D09086J1680J2528J2344R001J456p506j3996j7218j8738j9143j8004j5845
56970C45645j3511j0575o693l386k085j539L88L456N993P963J0621J4009J7320
56957C67606K0801K4776K7462K6127K0003J0390j074j2376k0724k4581k5180k4280
56945C88950k1803j7584j3508j1250r491o120j791J553M287Q155J2875J6786K0026
56932C71085K4184K9472L4741L9064M0522L5017K0121k92j8572l0238l5993l7946
56920D71165l7211l4893l1997k8114k2669j7157j3672j1817r740p502o592o696
$$ plain form
56908 243105 237062 232533 228950 225710 223489 222857 223059 223269 223552 223664 222800 221657 222683 226876 232222 236858
56892 236858 241890 249465 259884 272474 287664 306369 328685 354716 384834 417060 445580 464091
56880 464091 470029 464447 449524 428170 404596 382715 364165 349160 338305 332188 330229 331636
56868 331636 336866 346920 362137 382797 409864 443977 484810 532723 589919 658429 737009 819723
56856 819723 895894 951675 975437 964677 927067 873848 813607 752418 695971 648270 609910
56845 609910 580243 560015 549979 548793 554849 569045 593551 629172 676037 735636 810007 900277
56833 900277 1007718 1133307 1271557 1404699 1506804 1556265 1545554 1481953 1382198 1265417
56823 1265417 1146838 1035105 934376 847362 775358 717287 671248 636732 614024 602569 601721
$$ packed form
56908B43105o043m529l583l240k221o32K02K10K83J12q64j143J026M193N346M636
56892B36858N032P575J0419J2590J5190J8705K2316K6031L0118L2226K8520J8511
56880D64091N938n582j4923k1354k3574k1881j8550j5005j0855o117j959J407
56868C31636N230J0054J5217K0660K7067L4113M0833M7913N7196O8510P8580Q2714
56856H19723P6171N5781K3762j0760l7610n3219o0241o1189n6447m7701l8360
56845F09910k9667k0228j0036j186O056J4196K4506L5621M6865N9599P4371R0270
56833I00277J07441J25589J38250J33142J02105M9461j0711o3601r9755j16781
56823A265417j18579j11733j00729q7014p2004n8071m6039l4516k2708j1455q48
$$ plain form
56812 601721 612114 634488 668063 712032 768016 839090 926198 1025248 1125293 1208340 1254596
56801 1254596 1252916 1207159 1131357 1039889 943314 849981 766256 694526 633899 583371 542610
56790 542610 510468 485477 467735 458127 455954 459531 468861 485580 510600 543922 586072 636549
56778 636549 689992 735914 763352 765731 742680 699522 644885 586688 529568 476102 428748 388777
56766 388777 354751 324531 298157 276682 259208 243606 229619 218635 210629 203773 197044 190977
56754 190977 185856 181197 176972 173512 170310 166673 163235 161031 159608 157862 156164 155587 155657 155080 154158
56739 154158 154236 155175 155686 155749 156346 157132 156771 155416 154578 154613 154571 154339 154638 155082 154548 153472 153521 155037 156898
56720 156898 158738 161095 163545 165010 165849 167432 169675 171241 172087 173516 175751 177649 178787 179670 180099
$$ packed form
56812F01721J0393K2374L3575M3969N5984P1074Q7108R9050J00045Q3047M6256
56801A254596j680m5757p5802r1468r6575r3333q3725p1730o0627n0528m0761
56790E42610l2142k4991j7742r608k173L577R330J6719K5020L3322M2150N0477
56778F36549N3443M5922K7438K379k3051m3158n4637n8197n7120n3466m7354l9971
56766C88777l4026l0220k6374k1475j7474j5602j3987j0984q006o856o729o067
56754A90977n121m659m225l460l202l637l438k204j423j746j698n77P0n77r22
56739A54158P8R39N11O3N97P86l61j355q38L5m2k32K99M44n34j076M9J516J861
56720A56898J840K357K450J465Q39J583K243J566Q46J429K235J898J138Q83M29
$$ plain form
56705 180099 179548 178911 179497 180514 180036 178236 177028 176648 175420 173039 171248 170835 170629 169964 169661 170026 170162
56688 170162 169773 169501 169195 168006 166340 165478 165241 164469 163728 164826 167432 169011 168487 167301 166367 164818
56672 164818 162385 160268 158800 156719 153600 150680 148666 147104 146422 147959 151265 153971 155141 156297
56658 156297 158367 160204 160998 161614 162550 163015 163002 163877 165935 167750 168939 171127 175085 179240 182214 184658
56642 184658 187445 190188 192595 195166 197549 198371 197689 197472 198631 199743 199683 199254 199109 198313 196211 193746
56626 193746 191744 189767 187631 186126 185333 184236 182758 182007 181797 180314 177154 174237 172769 171804 170906
56611 170906 171469 173944 176269 176770 176411 176594 176905 176625 176455 177048 177636 177568 177431 177433 176568 174673 173335 173412 173606
56592 173606 172826 172021 172309 173164 173814 174646 175966 177153 178123 179729 181741 182546 181897 181691 182880 183921 183619
$$ packed form
56705A80099n51o37N86J017m78j800j208l80j228k381j791m13k06o65l03L65J36
56688A70162l89k72l06j189j666q62k37p72p41J098K606J579n24j186r34j549
56672A64818k433k117j468k081l119k920k014j562o82J537L306K706J170J156
56658A56297K070J837P94O16R36M65j3Q75K058J815J189K188L958M155K974K444
56642A84658K787K743K407K571K383Q22o82k17J159J112o0m29j45p96k102k465
56626A93746k002j977k136j505p93j097j478p51k10j483l160k917j468r65q98
56611A70906N63K475K325N01l59J83L11k80j70N93N88o8j37Kq65j895j338P7J94
56592A73606p80q05K88Q55O50Q32J320J187R70J606K012Q05o49k06J189J041l02
$$ plain form
56575 183619 183114 183606 184415 184880 185929 188109 190229 191535 193186 196042 199186 202184 206546 213236 220917
56560 220917 228486 237238 248613 261661 274395 285630 293940 297142 294960 290306 285957 281713 276451
56547 276451 270901 266395 262729 259203 256131 253619 250624 246828 243622 241662 239542 236466 233933 232909
56533 232909 231694 228751 225487 223907 223486 222680 221719 221559 221709 221428 221577 223192 225578 227651 229578 231304
56517 231304 231239 228439 224486 221331 218870 216324 214097 212393 209982 206441 203811 203952 205942 207968 209930
56502 209930 212214 213893 214282 214498 215427 215947 215117 214134 214095 213887 212421 210914 210664 210630 209528 208359 208516
56485 208516 209260 209442 209779 211099 212209 211868 211019 210907 210917 210399 210432 211529 211929 210561 209302 209779 210485 209829
56467 209829 209405 211073 213242 213408 212255 211868 211878 210768 209082 208034 206836 204730 203660 205371 207765
$$ packed form
56575A83619n05M92Q09M65J049K180K120J306J651K856L144K998M362O690P681
56560B20917P569Q752J1375J3048J2734J1235Q310L202k182m654m349m244n262
56547B76451n550m506l666l526l072k512k995l796l206j960k120l076k533j024
56533B32909j215k943l264j580m21q06r61j60J50k81J49J615K386K073J927J726
56517B31304o5k800l953l155k461k546k227j704k411l541k630J41J990K026J962
56502B09930K284J679L89K16R29N20q30r83l9k08j466j507k50l4j102j169J57
56485B08516P44J82L37J320J110l41q49j12J0n18L3J097M00j368j259M77P06o56
56467B09829m24J668K169J66j153l87J0j110j686j048j198k106j070J711K394
$$ plain form
56452 207765 207807 206297 206085 207217 207705 207620 208487 209827 210068 209852 210767 211895 211253 209679 209729 211591 213427
56435 213427 214782 216327 217338 216839 216178 217118 218517 218345 217632 218754 221053 222004 221671 222091 223156 223111 222425
56418 222425 223252 225513 227234 228222 229790 231464 231660 231104 231920 233842 234945 235555 237635 240738 242349 242005
56402 242005 241468 241101 239599 237120 235225 233958 232327 231263 232671 235885 238455 240019 242047 244289 245074
56387 245074 244815 245712 248173 250690 252779 254855 255959 254998 253499 253652 254475 253498 251247 250155 249994 248591
56371 248591 246426 246177 248110 250069 251671 254261 257053 257670 256456 256147 257287 257996 258080 259189 261043 261671
56355 261671 261348 262186 263938 264385 263789 264654 267121 268877 269623 271267 273718 274985 275518 277949 282286 285828
56339 285828 288038 290958 294563 296459 296673 298079 301454 304559 306629 309231 312182 313403 313560 316127 321904
$$ packed form
56452B07765M2j510k12J132M88q5Q67J340K41k16R15J128o42j574N0J862J836
56435B13427J355J545J011m99o61R40J399j72p13J122K299R51l33M20J065m5o86
56418B22425Q27K261J721R88J568J674J96n56Q16J922J103O10K080L103J611l44
56402B42005n37l67j502k479j895j267j631j064J408L214K570J564K028K242P85
56387B45074k59Q97K461K517K089K076J104r61j499J53Q23r77k251j092j61j403
56371B48591k165k49J933J959J602K590K792O17j214l09J140P09Q4J109J854O28
56355B61671l23Q38J752M47n96Q65K467J756P46J644K451J267N33K431M337L542
56339B85828K210K920L605J896K14J406L375L105K070K602K951J221J57K567N777
$$ plain form
56324 321904 327948 332689 337558 342724 345971 346844 347397 347834 346021 342291 340015 340170 339972 338210 337356 338939
56308 338939 341198 342818 344787 347243 348682 349548 352418 357464 361968 365353 370198 377105 383176 386934
56294 386934 390299 394283 397256 398983 401941 407064 412360 417148 423368 431395 438900 445180 452288 460664
56280 460664 468137 474492 482374 492412 502072 510633 520529 532464 544098 554961 567698 582991 598260
56267 598260 612923 629793 649651 669668 689028 710853 736676 764307 793110 826085 864664
56256 864664 906809 952466 1005416 1067431 1136035 1210541 1294759 1390998 1496695 1609709 1731621
56245 1731621 1862848 1999771 2139626 2283136 2429326 2572736 2708551 2835379 2950249
56236 2950249 3046435 3119518 3170464 3199720 3203769 3180920 3135213 3071111 2989475 2892092 2784734
$$ packed form
56324C21904O044M741M869N166L247Q73N53M37j813l730k276J55j98j762q54J583
56308C38939K259J620J969K456J439Q66K870N046M504L385M845O907O071L758
56294C86934L365L984K973J727K958N123N296M788O220Q027P505O280P108Q376
56280D60664P473O355P882J0038R660Q561R896J1935J1634J0863J2737J5293J5269
56267E98260J4663J6870J9858K0017J9360K1825K5823K7631K8803L2975L8579
56256H64664M2145M5657N2950O2015O8604P4506Q4218R6239J05697J13014J21912
56245A731621J31227J36923J39855J43510J46190J43410J35815J26828J14870
56236B950249R6186P3083N0946K9256M049k2849m5707o4102q1636r7383j07358
$$ plain form
56225 2784734 2671880 2553380 2429893 2306481 2187187 2071074 1957234 1848588 1747029
56216 1747029 1650108 1556466 1469563 1392091 1321562 1255119 1193707 1137870 1084783 1033399 987231
56205 987231 948057 912177 876860 844906 818616 794939 771185 749934 733480 718876 703455
56194 703455 689868 680508 672178 661650 651461 644865 639900 633809 628519 626314 624724 621089 617653
56181 617653 616872 616244 613111 610079 610318 611911 612095 612608 615644 618976 620291 621827 625692 629366 630968
56166 630968 634017 641558 650526 657375 664278 674108 684421 692397 700791 712974 726796 739284 752605
56153 752605 769508 787831 805601 826517 854144 885702 917948 954234 999325 1052338 1111491
56142 1111491 1180757 1264775 1361764 1468129 1585160 1714079 1848753 1979865 2101904 2210356
$$ packed form
56225B784734j12854j18500j23487j23412j19294j16113j13840j08646j01559
56216A747029r6921r3642q6903p7472p0529o6443o1412n5837n3087n1384m6168
56205I87231l9174l5880l5317l1954k6290k3677k3754k1251j6454j4604j5421
56194G03455j3587r360q330j0528j0189o596m965o091n290k205j590l635l436
56181F17653p81o28l133l032K39J593J84N13L036L332J315J536L865L674J602
56166F30968L049P541Q968O849O903R830J0313P976Q394J2183J3822J2488J3321
56153G52605J6903J8323J7770K0916K7627L1558L2246L6286M5091N3013N9153
56142A111491O9266Q4018R6989J06365J17031J28919J34674J31112J22039J08452
$$ plain form
56132 2210356 2298182 2362885 2412443 2457287 2500814 2543254 2587643 2633712 2671846 2692019 2694498
56121 2694498 2684938 2665169 2636838 2607242 2581252 2551790 2507139 2443271 2361194 2258728 2135283
56110 2135283 2000077 1865551 1736262 1612624 1500214 1405359 1326000 1256674 1198387 1154308
56100 1154308 1120448 1090548 1065822 1050197 1040423 1030765 1022859 1020805 1021230 1018537 1015366 1017291 1021726
56087 1021726 1022804 1022758 1027507 1035268 1040528 1044960 1053391 1063348 1069773 1075621 1086460 1099134 1107416 1114243
56073 1114243 1126365 1141482 1152909 1162514 1176599 1193466 1207696 1222139 1242613 1265216 1282272
56062 1282272 1296564 1316157 1339552 1359747 1378524 1402317 1428007 1447432 1462206 1479598 1497767
56051 1497767 1509900 1518892 1532711 1549237 1561129 1571659 1589770 1613361 1633635 1652050 1676371
$$ packed form
56132B210356Q7826O4703M9558M4844M3527M2440M4389M6069L8134K0173K479
56121B694498r560j9769k8331k9596k5990k9462m4651o3868q2077j02466j23445
56110B135283j35206j34526j29289j23638j12410r4855p9359o9326n8287m4079
56100A154308l3860k9900k4726j5625r774r658p906k054M25k693l171J925M435
56087A021726J078m6M749P761N260M432Q431R957O425N848J0839J2674Q282O827
56073A114243J2122J5117J1427R605J4085J6867J4230J4443K0474K2603J7056
56062A282272J4292J9593K3395K0195J8777K3793K5690J9425J4774J7392J8169
56051A497767J2133Q992J3819J6526J1892J0530J8111K3591K0274J8415K4321
$$ plain form
56040 1676371 1703979 1726365 1746454 1773992 1807391 1837880 1867848 1906652 1951776 1993020 2031992
56029 2031992 2078243 2129509 2175518 2218142 2267473 2321104 2368175 2411117 2462017 2520178 2574997
56018 2574997 2628341 2691496 2762425 2829071 2892955 2965990 3046306 3121587 3194264 3278272 3372587
56007 3372587 3463639 3552288 3652071 3762318 3870199 3978061 4100810 4237372 4373294 4510153
55997 4510153 4662741 4828764 4992490 5157093 5341088 5543906 5748682 5957889 6190748
55988 6190748 6446166 6705355 6970903 7264676 7587180 7919544 8265830 8650627 9074181
55979 9074181 9514943 9977798 10492568 11063356 11669478 12318418 13044682 13853809 14724421
55970 14724421 15668988 16732336 17926904 19235328 20681969 22332004 24215675 26331595
$$ packed form
56040A676371K7608K2386K0089K7538L3399L0489K9968L8804M5124M1244L8972
56029B031992M6251N1266M6009M2624M9331N3631M7071M2942N0900N8161N4819
56018B574997N3344O3155P0929O6646O3884P3035Q0316P5281P2677Q4008R4315
56007C372587R1052Q8649R9783J10247J07881J07862J22749J36562J35922J36859
55997D510153J52588J66023J63726J64603J83995K02818K04776K09207K32859
55988F190748K55418K59189K65548K93773L22504L32364L46286L84797M23554
55979I074181M40762M62855N14770N70788O06122O48940P26264Q09127Q70612
55970A4724421R44567J063348J194568J308424J446641J650035J883671K115920
$$ plain form
55962 26331595 28732262 31523917 34778693 38545829 42963319 48259866 54646207 62332426
55954 62332426 71663589 83093803 97017752 113810745 134061075 158562715 188096263
55947 188096263 223507465 265773355 314785903 366857440 413564489 444482807 452530413
55940 452530413 437492715 405012076 362758022 317298765 273113874 232805251 197479268
55933 197479268 167217045 141649407 120303041 102620067 87970242 75800299 65702989
55926 65702989 57321469 50300097 44364768 39351744 35116701 31490794 28347838 25632501
55918 25632501 23290604 21236944 19413252 17811294 16413272 15166245 14035344 13026283
55910 13026283 12134351 11322177 10567088 9881859 9269596 8703131 8166808 7675601 7235405
$$ packed form
55962B6331595K400667K791655L254776L767136M417490N296547O386341P686219
55954F2332426R331163J1430214J3923949J6792993K0250330K4501640K9533548
55947A88096263L5411202M2265890M9012548N2071537M6707049L0918318Q047606
55940D52530413j5037698l2480639m2254054m5459257m4184891m0308623l5325983
55933A97479268l0262223k5567638k1346366j7682974j4649825j2169943j0097310
55926F5702989q381520p021372n935329n013024m235043l625907l142956k715337
55918B5632501k341897k053660j823692j601958j398022j247027j130901j009061
55910A3026283q91932q12174p55089o85229o12263n66465n36323m91207m40196
$$ plain form
55901 7235405 6824743 6432393 6074526 5758129 5463751 5180147 4921200 4693314 4479343
55892 4479343 4269798 4078251 3911195 3753002 3595025 3450435 3326278 3208797 3090152
55883 3090152 2982813 2894054 2812003 2729898 2658792 2602755 2545490 2474986 2399232 2325445 2246098
55872 2246098 2157813 2072506 1997279 1923292 1845903 1775903 1719527 1666863 1611248 1561133 1521796
55861 1521796 1483986 1441707 1403166 1373234 1342766 1306274 1273035 1249787 1228903 1204275 1182646
55850 1182646 1168508 1153540 1131655 1109412 1091206 1069135 1038019 1006006 979949 954224 924154
55839 924154 896620 877057 859130 837372 817318 803338 789131 770107 752901 742886 734098 721080
55827 721080 709049 702885 697493 688349 680375 677081 671920 659693 645896 635825 625008 609424 594632
$$ packed form
55901G235405m10662l92350l57867l16397k94378k83604k58947k27886k13971
55892D479343k09545j91547j67056j58193j57977j44590j24157j17481j18645
55883C090152j07339q8759q2051q2105p1106n6037n7265p0504p5754p3787p9347
55872B246098q8285q5307p5227p3987p7389p0000n6376n2664n5615n0115l9337
55861A521796l7810m2279l8541k9932l0468l6492l3239k3248k0884k4628k1629
55850A182646j4138j4968k1885k2243j8206k2071l1116l2013k6057k5725l0070
55839I24154k7534j9563j7927k1758k0054j3980j4207j9024j7206j0015q788j3018
55827G21080j2031o164n392r144p974l294n161j2227j3797j0071j0817j5584j4792
$$ plain form
55814 594632 585582 577504 565985 556120 552588 550336 544240 538729 538811 540602 539653 539864 545386 552225 556494
55799 556494 562593 574664 588073 597619 605974 615852 622115 620148 614322 609927 604370 594305 583686
55786 583686 576639 569927 560482 552663 549826 546167 535293 519879 504910 488706 469039 451013 440171
55773 440171 434014 428397 425998 430441 438283 444702 450937 458382 461841 456875 447910 441119 435114 426409
55759 426409 417882 413539 410571 404887 399193 397480 396754 392236 385668 380429 373428 360082 342882 327200
55745 327200 312947 298002 285282 278501 274901 269787 264484 262592 262395 260226 257456 257015 256846 253860
55731 253860 250565 250856 252926 253034 252328 253240 253214 248947 242953 239025 235197 228158 220614 216968 215406 211593
55715 211593 206778 204995 205497 205229 205744 210513 218076 224648 230684 238316 245302 248251 248998 251144 253074
$$ packed form
55814E94632r050q078j1519r865l532k252o096n511Q2J791r49K11N522O839M269
55799E56494O099J2071J3409R546Q355R878O263j967n826m395n557j0065j0619
55786E83686p047o712r445p819k837l659j0874j5414j4969j6204j9667j8026j0842
55773D40171o157n617k399M443P842O419O235P445L459m966q965o791o005q705
55759D26409q527m343k968n684n694j713p26m518o568n239p001j3346j7200j5682
55745C27200j4253j4945j2720o781l600n114n303j892j97k169k770m41j69k986
55731B53860l295K91K070J08p06R12k6m267n994l928l828p039p544l646j562l813
55715B11593m815j783N02k68N15M769P563O572O036P632O986K949P47K146J930
$$ plain form
55700 253074 250916 245572 240376 234749 226682 218486 213427 209564 203519 197365 195012 194812 192725 189952
55686 189952 190264 192385 192350 191160 192857 197003 200102 202625 207650 214320 219462 223900 230348 236802 238957
55671 238957 237589 236724 236044 232081 225637 220995 218683 215744 212291 211204 212057 211813 210885 212293 215476
55656 215476 217132 217489 219656 223435 225870 227242 230403 234701 236602 235990 235857 236146 233771 228492 223079
55641 223079 217861 210753 202482 196187 191921 186866 180759 175867 171980 166817 161104 157854 156840 155048
55627 155048 152350 151426 152271 152083 150485 149700 149691 148325 146239 146295 148208 148734 147147 145589 144183 140924 136424
55610 136424 133643 132789 131345 129113 128346 128891 128181 126111 125026 124873 123265 120393 118933 118967 117902 115572
55594 115572 114483 114859 114327 112777 112634 114019 114414 113440 113186 113606 112465 110123 109456 110621 110798 109623
$$ packed form
55700B53074k158n344n196n627q067q196n059l863o045o154k353k00k087k773
55686A89952L12K121l5j190J697M146L099K523N025O670N142M438O448O454K155
55671B38957j368q65o80l963o444m642k312k939l453j087Q53k44r28J408L183
55656B15476J656L57K167L779K435J372L161M298J901o12j33K89k375n279n413
55641B23079n218p108q271o295m266n055o107m892l887n163n713l250j014j792
55627A55048k698r24Q45j88j598p85rj366k086N6J913N26j587j558j406l259m500
55610A36424k781q54j444k232p67N45p10k070j085j53j608k872j460L4j065k330
55594A15572j089L76n32j550j43J385L95r74k54M20j141k342o67J165J77j175
$$ plain form
55578 109623 109932 112475 114789 116043 118223 121681 124238 125601 128127 132265 135758 138237 142070 147654
55564 147654 152238 154485 155943 156997 155688 151682 147338 143672 139198 133716 129340 126706 123929 120245
55550 120245 117027 114478 111149 107437 105744 106429 107305 107701 109173 111668 113094 113424 115200 119144 123120
55535 123120 126151 129552 133395 135863 136937 138810 141752 143367 142698 141393 140163 137903 134854 132671
55521 132671 130875 127271 122326 118979 117638 115825 113247 112481 113691 113481 110369 106836 104492 101625 97223
55506 97223 93150 90545 87961 84720 82397 81535 80606 79542 80375 83139 85077 85242 85873 87918 89342 89346
55490 89346 90049 92312 93989 94015 94189 95175 94883 92660 90983 90961 90231 87533 85431 86138 88249 89862 91408
55473 91408 93195 93684 92497 91828 92724 93215 92070 90982 91061 90785 89551 89610 92085 94522 94879 94607 95367
$$ packed form
55578A09623L09K543K314J254K180L458K557J363K526M138L493K479L833N584
55564A47654M584K247J458J054j309m006m344l666m474n482m376k634k777l684
55550A20245l218k549l329l712j693O85Q76L96J472K495J426L30J776L944L976
55535A23120L031L401L843K468J074J873K942J615o69j305j230k260l049k183
55521A32671j796l604m945l347j341j813k578p66J210k10l112l533k344k867m402
55506I7223m073k605k584l241k323q62r29j064Q33K764J938J65O31K045J424M
55490H9346P03K263J677K6J74R86k92k223j677k2p30k698k102P07K111J613J546
55473I1408J787M89j187o69Q96M91j145j088P9k76j234N9K475K437L57k72P60
$$ plain form
55456 95367 96011 95387 94985 96141 97522 97919 98688 100930 102998 103236 102549 102063 100974 98949 97838 98687 99678
55439 99678 99262 98698 99320 100009 99529 98752 98464 97636 95908 95013 95695 96091 95150 94652 95646 96035 94191 92002
55421 92002 91681 92348 92377 92460 93654 94934 95224 95457 96209 95858 93541 91393 91276 91787 91041 89910 89898 90256
55403 90256 89849 89571 90308 90800 90039 89523 90601 91926 92028 92016 93130 94024 93261 92150 92329 92761 91979 91162
55385 91162 92044 93787 94779 95611 97423 99141 99240 98577 98768 99390 99353 99305 100093 100568 99488 97957 97452 97128
55367 97128 95613 93786 93255 93702 94089 94830 96433 97708 97629 97203 97336 96824 94798 93016 93210 94222 94272
55350 94272 94011 94673 95395 95131 95125 96551 97747 96795 94900 94128 93771 92193 90439 90588 92035 92807 93137 94409
55332 94409 95837 95549 93925 92718 91925 90591 89605 90515 92496 93518 93698 94552 95791 95801 94547 93213
$$ packed form
55456I5367O44o24m02J156J381L97P69K242K068K38o87m86j089k025j111Q49R91
55439I9678m16n64O22O89m80p77k88q28j728q95O82L96r41m98R94L89j844k189
55421I2002l21O67K9Q3J194J280K90K33P52l51k317k148j17N11p46j131j2L58
55403I0256m07k78P37M92p61n16J078J325J02j2J114Q94p63j111J79M32p82q17
55385I1162Q82J743R92Q32J812J718R9o63J91O22l7m8P88M75j080j531n05l24
55367I7128j515j827n31M47L87P41J603J275p9m26J33n12k026j782J94J012N0
55350I4272k61O62P22k64oJ426J196r52j895p72l57j578j754J49J447P72L30J272
55332I4409J428k88j624j207p93j334r86R10J981J022J80Q54J239J0j254j334
$$ plain form
55316 93213 91762 89533 87416 86721 86715 85813 84366 83707 83523 82767 82100 82753 84013 84527 84898 86183 87083 85732
55298 85732 83255 82354 83203 83883 84137 85412 87589 88830 88585 88024 87690 87218 87031 87868 89054 89477 89625
55281 89625 90394 90819 89574 87736 87297 87771 87225 85909 85813 87096 87987 87937 88025 88428 88221 87552 87482 87823 87555
55262 87555 87046 87477 88496 88804 88621 89137 90099 90400 90484 91625 93409 94455 94997 96121 97228 97006 96230
55245 96230 96634 97592 97022 95122 94110 94472 94611 94096 94210 95189 95783 95688 95713 95596 94408 93011 93243 94702
55227 94702 95263 94813 95460 97760 99705 99929 99213 98340 97067 95669 95041 94867 94003 92843 92906 94005 94438
55210 94438 94076 94533 96041 96942 96708 96652 97077 96465 94348 92488 92229 92836 93304 93788 94501 94959 94956 94755 94142
55191 94142 92930 92198 93107 94734 95220 94765 95074 96187 96610 96427 97342 99385 100528 100056 99443 99392 98793 97377
$$ packed form
55316I3213j451k229k117o95or02j447o59j84p56o67O53J260N14L71J285R00j351
55298H5732k477r01Q49O80K54J275K177J241k45n61l34m72j87Q37J186M23J48
55281H9625P69M25j245j838m39M74n46j316r6J283Q91n0Q8M03k07o69p0L41k68
55262H7555n09M31J019L08j83N16R62L01Q4J141J784J046N42J124J107k22p76
55245I6230M04R58n70j900j012L62J39n15J14R79N94r5K5j17j188j397K32J459
55227I4702N61m50O47K300J945K24p16q73j273j398o28j74q64j160O3J099M33
55210I4438l62M57J508R01k34n6M25o12k117j860k59O07M68M84P13M58lk01o13
55191I4142j212p32R09J627M86m55L09J113M23j83R15K043J143m72o13n1n99j416
$$ plain form
55173 97377 96562 96767 96434 94855 93594 94057 95711 97659 99934 102381 104156 105123 106053 106969 107102 106695 106790
55156 106790 107105 106400 105134 105196 106635 107343 106533 105770 105810 105222 103266 101518 101290 101751 101908 102286 103321 104028
55138 104028 103599 102636 101726 100523 99104 98497 98966 99497 99727 100557 102210 103578 104189 104812 105483 105075 103573
55121 103573 102605 102824 102949 102303 102039 102780 103322 102949 102903 104163 105684 106255 106354 106818 107331 107515 107948 108888 109457
55102 109457 109166 108810 108932 109005 108901 109480 110781 111434 110905 110532 111335 112530 113243 113901 114837 115261 114814 114448
55084 114448 114684 114667 113970 113526 113683 113249 111781 110909 111893 113569 114289 114299 114601 114938 114622 114131 114264 114698 114796
55065 114796 114890 115456 115979 115763 114989 113970 112460 110652 109731 110311 111345 111625 111381 111478 112012 112691 113646 114971
55047 114971 116208 116943 117175 116706 115214 113199 111692 110750 109556 108206 107789 108447 109082 109359 110101 111243
$$ packed form
55173I7377q15K05l33j579j261M63J654J948K275K447J775R67R30R16J33m07R5
55156A06790L15p05j266O2J439P08q10p63M0n88j956j748k28M61J57L78J035P07
55138A04028m29r63r10j203j419o07M69N31K30Q30J653J368O11O23O71m08j502
55121A03573r68K19J25o46k64P41N42l73m6J260J521N71R9M64N13J84M33R40N69
55102A09457k91l56J22P3j04N79J301O53n29l73Q03J195P13O58R36M24m47l66
55084A14448K36j7o97m44J57m34j468q72R84J676P20J0L02L37l16m91J33M34R8
55065A14796R4N66N23k16p74j019j510j808r21N80J034K80k44R7N34O79R55J325
55047A14971J237P35K32m69j492k015j507r42j194j350m17O58O35K77P42J142
$$ plain form
55031 111243 111457 110501 109905 110469 111078 110941 110934 111632 111980 111221 110290 110025 109753 109003 108859 110203 112106 113335
55013 113335 113994 114483 114379 113658 113514 114598 115779 115856 115146 114365 113405 112341 112084 112858 113499 113369 113436 114398
54995 114398 115383 115622 115723 116159 116226 115689 115645 116450 116703 115677 114863 115523 116574 116640 116404 117042 118010 118375 118874
54976 118874 120612 122913 124368 124949 125325 125228 124220 123142 123121 123999 125013 125999 126786 126687 125805 125424 125876 125712
54958 125712 124326 123539 124870 127053 128125 128312 128709 128731 127171 124621 122617 121383 120384 120009 120717 121555
54942 121555 121492 121234 121859 122777 122955 122962 123726 124375 123503 121666 120544 120532 121160 122828 125929 129196 131186 132730
54924 132730 135728 140278 145131 150210 156349 163155 169490 175690 183016 191103 198048 202818 205667 206429
54910 206429 204393 199792 193689 186600 178745 171212 165124 160044 154844 149740 145788 142869 139975 137070
$$ packed form
55031A11243K14r56n96N64O09j37pO98L48p59r31k65k72p50j44J344J903J229
55013A13335O59M89j04p21j44J084J181P7p10p81r60j064k57P74O41j30O7R62
54995A14398R85K39J01M36O7n37m4Q05K53j026q14O60J051O6k36O38R68L65M99
54976A18874J738K301J455N81L76r7j008j078k1Q78J014R86P87r9q82l81M52j64
54958A25712j386p87J331K183J072J87L97K2j560k550k004j234r99l75P08Q38
54942A21555o3k58O25R18J78PP64O49q72j837j122j2O28J668L101L267J990J544
54924A32730K998M550M853N079O139O806O335O200P326Q087O945M770K849P62
54910B06429k036m601o103p089p855p533o088n080n200n104l952k919k894k905
$$ plain form
54896 137070 134904 133399 131972 131014 131278 132222 132676 132770 133467 134646 135452 136125 137645 139881 141932 143986
54880 143986 147109 151439 156310 161844 168687 176460 184135 191581 199099 205858 210521 212983 213814 212542
54866 212542 208463 202582 196689 190856 183912 176100 169079 163382 158057 152789 148296 144524 140577 136670
54852 136670 134114 133026 131885 129814 127603 126094 125121 124471 124379 124662 124615 124062 123441 122802 121869 120927 120493
54835 120493 120347 120153 120558 122155 123793 123654 121758 119717 118292 116998 115868 115642 116180 116546 116752 117654
54819 117654 119084 119882 119865 119970 120335 120059 119069 118449 118606 118834 118974 119798 121375 122703 123397 124197 125411 126317
54801 126317 126500 126410 126260 125760 125221 125566 126907 128359 129392 130189 130697 130690 130728 131501 132282 131658 129820 128464
54783 128464 128317 128534 128739 129762 131844 133876 135090 136073 137452 138927 140194 141669 143821 146753 150655
$$ packed form
54896A37070k166j505j427r58K64R44M54R4O97J179Q06O73J520K236K051K054
54880A43986L123M330M871N534O843P773P675P446P518O759M663K462Q31j272
54866B12542m079n881n893n833o944p812p021n697n325n268m493l772l947l907
54852A36670k556j088j141k071k211j509r73o50r2K83m7n53o21o39r33r42m34
54835A20493j46j94M05J597J638j39j896k041j425j294j130k26N38L66K06R02
54819A17654J430P98j7J05L65k76r90o20J57K28J40Q24J577J328O94Q00J214R06
54801A26317J83r0j50n00n39L45J341J452J033P97N08pL8P73P81o24j838j356
54783A28464j47K17K05J023K082K032J214R83J379J475J267J475K152K932L902
$$ plain form
54768 150655 155556 160614 164893 168905 174092 180775 187983 195152 202326 208675 212631 213825 213221 211066
54754 211066 206484 199552 191969 184983 178131 170741 163299 156640 150991 146441 143269 141361 140252 140002
54740 140002 140968 142608 143742 144074 144174 143942 142597 140331 138519 138038 138775 140802 144405 148772 152370 155019
54724 155019 158013 161947 166042 169982 174679 180672 187339 194110 200831 206481 209252 208651 206004 202370
54710 202370 197465 191201 184620 178508 172562 166685 161703 158068 155145 152432 150222 148551 146827 145053
54696 145053 144062 144018 144069 143883 144017 144353 143876 142572 141818 142107 142168 141191 140177 139990 139718 138309 136419 135243
54678 135243 134598 133536 132076 131101 131053 131628 132292 132560 132256 131830 131803 131820 131133 129988 129393 129510 129583 129436 129525
54659 129525 129461 128235 126208 125121 125638 126625 127295 128239 129700 130719 130851 131005 131684 132053 131588 130970 130492
$$ packed form
54768A50655M901N058M279M012N187O683P208P169P174O349L956J194o04k155
54754B11066m582o932p583o986o852p390p442o659n649m550l172j908j109k50
54740A40002R66J640J134L32J00k32j345k266j812m81P37K027L603M367L598K649
54724A55019K994L934M095L940M697N993O667O771O721N650K771o01k647l634
54710B02370m905o264o581o112n946n877m982l635k923k713k210j671j724j774
54696A45053r91m4N1j86J34L36m77j304p54K89O1r77j014j87k72j409j890j176
54678A35243o45j062j460r75m8N75O64K68l04m26k7J7o87j145n95J17P3j47Q9
54659A29525o4j226k027j087N17R87O70R44J461J019J32J54O79L69m65o18m78
$$ plain form
54642 130492 129344 127502 126551 127417 128830 129238 128791 128293 127687 126847 126514 127134 127920 128168 128355 128948 129415 129402
54624 129402 129612 130485 131391 132100 133541 135893 137428 136643 134321 132154 130550 129070 127893 127471 127715 128627
54608 128627 130673 133450 135211 134923 133700 133063 132949 132556 131959 131615 131369 131124 131443 132413 133058 132940 133068
54591 133068 134125 135147 135187 134873 134995 134958 134104 133211 133100 133042 132135 131084 130992 131485 131643 131686 132075 132056 130835
54572 130835 129274 128681 128839 128902 129257 130706 132623 133738 134083 134483 134824 134587 134366 135073 136166 136453 136122
54555 136122 136341 137280 138193 138994 140130 141291 141807 141935 142304 142532 141912 141003 141029 142095 143418 144842 146649
54538 146649 148362 149264 149705 150473 151322 151553 151441 151513 151017 148885 145797 143521 142448 141474 140074 138826 138007
54521 138007 137324 136945 137201 137408 136567 135198 134851 135759 136578 136519 136208 136185 136030 135397 134703 134430 134671 135528 137042
$$ packed form
54642A30492j148j842r51Q66J413M08m47m98o06q40l33O20P86K48J87N93M67j3
54624A29402K10Q73R06P09J441K352J535p85k322k167j604j480j177m22K44R12
54608A28627K046K777J761k88j223o37j14l93n97l44k46k45L19R70O45j18J28
54591A33068J057J022M0l14J22l7q54q93j11n8r07j051r2M93J58M3L89j9j221
54572A30835j561n93J58O3L55J449J917J115L45M00L41k37k21P07J093K87l31
54555A36122K19R39R13Q01J136J161N16J28L69K28o20r09K6J066J323J424J807
54538A46649J713R02M41P68Q49K31j12P2m96k132l088k276j073r74j400j248q19
54521A38007o83l79K56K07q41j369l47R08Q19n9l11k3j55o33o94k73K41Q57J514
$$ plain form
54502 137042 138673 139730 140298 140910 141548 141876 142138 142788 143549 143888 144048 144494 144744 144049 142935 142698 143535 144441
54484 144441 144833 145002 145101 144942 144770 145011 145343 145154 144833 145435 147133 149104 150881 152726 154706 156478 157921
54467 157921 159103 159860 160299 161285 163325 165399 166125 165715 165446 165576 165258 164340 163734 163890 164197 164006 163234 161988
54449 161988 160515 159318 158402 156867 154258 151780 150872 151201 151429 151332 151508 151616 150837 149771 149796 150648 150711 149821
54431 149821 149630 150778 151816 151661 151273 151919 153347 154676 155875 157266 158595 159507 160328 161606 163344 165019
54415 165019 165871 165172 162953 160518 159386 159655 160171 160169 159814 159343 158843 158789 159510 160163 159517 157838 156705 156875
54397 156875 157659 158525 159814 161534 162902 163689 164765 166678 168709 169920 170268 170213 170057 170026 170233 170312 169825
54380 169825 169089 168750 168647 168117 167384 167374 168119 168747 169221 170661 173494 176657 179153 181205 183330 185501 187834
$$ packed form
54502A37042J631J057N68O12O38L28K62O50P61L39J60M46K50o95j114k37Q37R06
54484A44441L92J69R9j59j72K41L32j89l21O02J698J971J777J845J980J772J443
54467A57921J182P57M39R86K040K074P26m10k69J30l18r18o06J56L07j91p72j246
54449A61988j473j197r16j535k609k478r08L29K28r7J76J08p79j066K5Q52O3q90
54431A49821j91J148J038j55l88O46J428J329J199J391J329R12Q21J278J738J675
54415A65019Q52o99k219k435j132K69N16kl55m71n00n4P21O53o46j679j133J70
54397A56875P84Q66J289J720J368P87J076J913K031J211L48n5j56l1K07P9m87
54380A69825p36l39j03n30p33j0P45O28M74J440K833L163K496K052K125K171K333
$$ plain form
54363 187834 190945 194832 198332 200425 201315 201626 201339 200206 198556 197005 195796 194798 193735 192165 189702
54348 189702 186459 182890 179253 175759 172999 171399 170423 169220 167911 167245 167130 166633 165458 164276 163494
54333 163494 162849 162335 162413 163027 163443 163300 162928 162556 162206 162372 163671 165756 167638 169048 170297 170965 170203
54316 170203 168478 167435 167703 168255 168291 168198 168196 167597 166146 164780 164206 163832 162846 161367 159911 158666 157852 157800
54298 157800 158154 157964 157042 156246 156058 156000 155858 156255 157419 158554 159066 159361 159852 160254 160455 161006 162095 163037
54280 163037 163404 163606 163784 163260 161813 160461 160145 160530 160832 161051 161681 162923 164702 166707 168067 167911 166670
54263 166670 165876 166362 167621 169151 171035 172875 173673 173458 173570 174564 175292 175050 175079 176631 178832 179905 179613
54246 179613 179124 179107 179266 179160 178455 176829 174558 172666 171748 171254 170637 170352 170899 171749 172273 172925 174362 176032
$$ packed form
54363A87834L111L887L500K093Q90L11k87j133j650j551j209r98j063j570k463
54348A89702l243l569l637l494k760j600r76j203j309o66j15m97j175j182p82
54333A63494o45n14P8O14M16j43l72l72l50J66J299K085J882J410J249O68p62
54316A70203j725j043K68N52L6r3kn99j451j366n74l74r86j479j456j245q14n2
54298A57800L54j90r22p96j88n8j42L97J164J135N12K95M91M02K01N51J089R42
54280A63037L67K02J78n24j447j352l16L85L02K19O30J242J779K005J360j56j241
54263A66670p94M86J259J530J884J840P98k15J12R94P28k42K9J552K201J073k92
54246A79613m89j7J59j06p05j626k271j892r18m94o17k85N47Q50N24O52J437J670
$$ plain form
54228 176032 176772 176397 175636 174874 173919 172750 171676 170931 170670 171082 172003 172911 173729 175069 177147 179098 179946
54211 179946 179644 178653 177169 175400 173941 173195 172905 172717 172597 172370 171676 170798 170619 171251 171674 171258 170629 170398
54193 170398 170203 169805 169901 170852 171692 171587 171251 171712 172548 172685 172216 172032 172202 172037 171398 170727 170142 169618 169746
54174 169746 171156 173399 175358 176584 177312 177501 176864 175629 174371 173245 172166 171458 171472 171745 171402 170286
54158 170286 168970 167865 166960 166331 166224 166697 167644 168972 170430 171569 172253 172767 173070 172574 171116 169519
54142 169519 168531 167864 166954 166050 165783 166110 166477 166688 166955 167421 168172 169357 170831 172063 172805 173348 173868 174152
54124 174152 174292 174784 175521 175639 174938 174416 174714 175100 174890 174863 176173 178689 181536 184502 187771 190903 193284
54107 193284 195134 197023 198818 200123 201385 203644 207575 213406 221038 229253 235558 238017 236921 233854
$$ packed form
54228A76032P40l75p61p62r55j169j074p45k61M12R21R08Q18J340K078J951Q48
54211A79946l02r91j484j769j459p46k90j88j20k27o94q78j79O32M23m16o29k31
54193A70398j95l98R6R51Q40j05l36M61Q36J37m69j84J70j65o39o71n85n24J28
54174A69746J410K243J959J226P28J89o37j235j258j126j079p08J4K73l43j116
54158A70286j316j105r05o29j07M73R47J328J458J139O84N14L03m96j458j597
54142A69519r88o67r10r04k67L27L67K11K67M66P51J185J474J232P42N43N20K84
54124A74152J40M92P37J18p01n22K98L86k10k7J310K516K847K966L269L132K381
54107A93284J850J889J795J305J262K259L931N831P632Q215O305K459j096l067
$$ plain form
54093 233854 229789 225074 220486 216866 214071 211501 209410 208632 209324 210976 213321 216176 218733 220032 219971
54078 219971 218998 217303 215186 213609 213180 213002 211753 209544 207565 206207 204819 203114 201503 200088 198513
54063 198513 196880 195749 195156 194596 194013 193898 194343 194855 195197 195673 196503 197538 198623 199718 200724 201618 202580
54046 202580 203680 204848 206434 209159 213021 217001 220446 223907 227968 232212 236282 240926 246826 253207
54032 253207 258884 263949 269081 273973 277952 281551 285849 290619 294669 297707 300368 302632 303788 303908
54018 303908 303902 304087 303974 303426 302737 301606 299306 295831 291738 287025 281400 275447 270120 265252 260027 254753
54002 254753 250611 247656 244732 241558 239174 237928 236645 234463 232128 230744 230326 230232 230062 229548 228417
53987 228417 226864 225422 224067 222243 219987 218152 217215 216784 216480 216451 216762 217142 217657 218770 220496 222272
$$ packed form
54093B33854m065m715m588l620k795k570k091p78O92J652K345K855K557J299o1
54078B19971r73j695k117j577m29j78j249k209j979j358j388j705j611j415j575
54063A98513j633j131n93n60n83j15M45N12L42M76Q30J035J085J095J006Q94R62
54046B02580J100J168J586K725L862L980L445L461M061M244M070M644N900O381
54032B53207N677N065N132M892L979L599M298M770M050L038K661K264J156J20
54018C03908oJ85j13n48o89j131k300l475m093m713n625n953n327m868n225n274
54002B54753m142k955k924l174k384j246j283k182k335j384m18r4j70n14j131
53987B28417j553j442j355j824k256j835r37m31l04k9L11L80N15J113J726J776
$$ plain form
53971 222272 223887 225773 228215 231080 234474 238905 244681 251976 261470 273882 288517 302994 314588
53958 314588 321318 322103 317114 308174 297772 287342 277201 267986 260870 256138 252752 249822 247655 246941
53944 246941 247742 249639 252123 254555 256478 258279 260911 264706 269015 273055 276530 279544 282552 286170
53930 286170 290190 293086 293541 292306 291420 291778 292742 294065 296615 300898 306216 311800 317601 323550 329181
53915 329181 334524 340363 347088 354176 361196 368403 375832 382749 388544 393426 397765 401368 403736 404505
53901 404505 403499 401001 398028 395619 393847 392198 390618 389143 386834 382511 376533 370402 364417 357244
53887 357244 348210 338543 329712 321924 314953 309174 304856 301351 297808 293963 289739 284978 280106 276178
53873 276178 273638 271805 269991 268278 266740 264905 262540 260073 257634 254524 250259 245447 241125 237842
$$ packed form
53971B22272J615J886K442K865L394M431N776P295R494J2412J4635J4477J1594
53958C14588O730P85m989q940j0402j0430j0141r215p116m732l386k930k167p14
53944B46941Q01J897K484K432J923J801K632L795M309M040L475L014L008L618
53930B86170M020K896M55j235q86L58R64J323K550M283N318N584N801N949N631
53915C29181N343N839O725P088P020P207P429O917N795M882M339L603K368P69
53901D04505j006k498k973k409j772j649j580j475k309m323n978o131n985p173
53887C57244r034r667q831p788o971n779m318l505l543l845m224m761m872l928
53873B76178k540j833j814j713j538j835k365k467k439l110m265m812m322l283
$$ plain form
53859 237842 235649 234251 232908 231047 229166 228256 228219 228000 227406 227416 228286 228814 228134 226925 226065 225297 224147
53842 224147 223002 222371 221992 221568 221429 221681 221612 220798 219921 219663 219707 219711 220278 221874 223573 223997 223039 221755 221041
53823 221041 221188 222176 223615 224796 225489 226214 227272 228152 228420 228463 228758 229177 229646 230673 232480 234373 235802
53806 235802 237376 240087 244144 249217 255119 261497 267555 272902 278112 283713 289250 294030 298169 302187
53792 302187 306164 309944 313586 316995 319764 322030 324671 327932 330610 331419 330485 328733 326503 323624 320134
53777 320134 316034 310902 304623 298020 291998 286638 281787 277819 274959 272505 269606 266255 262804 259220
53763 259220 255677 253118 252134 251846 250859 248842 246333 243565 240525 237639 235333 233328 231270 229598 228821
53748 228821 228418 227557 226546 226469 227601 229158 230429 231223 231381 230801 229912 229389 229397 229654 230036 230567 231129 231694
$$ packed form
53859B37842k193j398j343j861j881r10l7k19n94J0Q70N28o80j209q60p68j150
53842B24147j145o31l79m24j39K52o9q14q77k58M4MN67J596J699M24r58j284p14
53823B21041J47R88J439J181O93P25J058Q80K68M3K95M19M69J027J807J893J429
53806B35802J574K711M057N073N902O378O058N347N210N601N537M780M139M018
53792C02187L977L780L642L409K769K266K641L261K678Q09r34j752k230k879l490
53777C20134m100n132o279o603o022n360m851l968k860k454k899l351l451l584
53763B59220l543k559r84k88r87k017k509k768l040k886k306k005k058j672p77
53748B28821m03q61j011p7J132J557J271P94J58n80q89n23QK57L82N31N62N65
$$ plain form
53730 231694 232509 233531 234156 234094 233962 234424 235321 236366 237951 240386 242974 244892 246499 248715 251483 253933
53714 253933 255799 257597 259521 261120 262138 262908 263975 265870 269010 273181 277404 280902 283907 286894
53700 286894 289658 291921 294376 298067 302957 307997 312442 316322 319809 322907 325666 328005 329491 329811
53686 329811 329227 328113 326508 324705 323578 323521 323567 322532 320570 318714 317315 315932 314424 313084 311889
53671 311889 310590 309447 309001 309229 309668 310188 310877 311365 311060 309909 308331 306706 305499 305341 306160 306736 306058
53654 306058 304727 304012 304023 303884 303367 303181 303765 304902 306386 308045 309258 309514 309400 310000 311382 312716 313846
53637 313846 315610 318434 321655 324532 327080 329630 332306 335181 338391 341939 345848 350490 356188 362547
53623 362547 368686 374036 378453 381818 384202 386153 388187 390142 391619 392776 394090 395681 397571 400143
$$ packed form
53730B31694Q15J022O25o2j32M62Q97J045J585K435K588J918J607K216K768K450
53714B53933J866J798J924J599J018P70J067J895L140M171M223L498L005K987
53700B86894K764K263K455L691M890N040M445L880L487L098K759K339J486L20
53686C29811n84j114j605j803j127n7M6j035j962j856j399j383j508j340j195
53671C11889j299j143m46K28M39N20O89M88l05j151j578j625j207j58Q19N76o78
53654C06058j331p15J1j39n17j86N84J137J484J659J213K56j14O00J382J334J130
53637C13846J764K824L221K877K548K550K676K875L210L548L909M642N698O359
53623C62547O139N350M417L365K384J951K034J955J477J157J314J591J890K572
$$ plain form
53609 400143 403542 407016 409761 412101 414884 418037 420724 422727 424638 426817 429100 431452 433914 435951
53595 435951 436759 436264 435166 434086 433372 433358 433918 434039 432788 430563 428544 427211 426273 425659 425407 424812 422926
53578 422926 419874 416628 413625 410683 408114 406605 405902 404814 402706 400031 397313 394636 392210 390379
53564 390379 388950 387479 386299 386255 387378 388835 390196 391630 392839 393072 392493 392365 393418 394989 396175
53549 396175 396952 397814 399074 400840 403045 405283 407223 409181 411611 414247 416649 419381 423529 429089 434981
53534 434981 440669 446610 453034 459572 466346 474200 483480 493701 504659 516716 529664 542478 554720
53521 554720 567108 580241 593827 607672 622391 638475 655575 673333 692119 712336 733674
53510 733674 755635 778192 801555 825835 851178 877536 904094 929658 953870 977262 999982
$$ packed form
53609D00143L399L474K745K340K783L153K687K003J911K179K283K352K462K037
53595D35951Q08m95j098j080p14j4N60J21j251k225k019j333r38o14k52n95j886
53578D22926l052l246l003k942k569j509p03j088k108k675k718k677k426j831
53564C90379j429j471j180m4J123J457J361J434J209K33n79j28J053J571J186
53549C96175P77Q62J260J766K205K238J940J958K430K636K402K732M148N560N892
53534D34981N688N941O424O538O774P854R280J0221J0958J2057J2948J2814J2242
53521E54720J2388J3133J3586J3845J4719J6084J7100J7758J8786K0217K1338
53510G33674K1961K2557K3363K4280K5343K6358K6558K5564K4212K3392K2720
$$ plain form
53499 999982 1021446 1041496 1060914 1080376 1099793 1119020 1138231 1157127 1174797 1191028 1206956
53488 1206956 1223788 1241487 1259232 1276558 1293522 1310336 1327293 1344663 1362343 1380043 1397802
53477 1397802 1415711 1433107 1448824 1462240 1473328 1481764 1487029 1489407 1489663 1487622 1482316 1473760 1463195
53464 1463195 1451199 1437031 1420568 1403495 1387599 1372932 1358530 1343921 1328859 1312484 1293967
53453 1293967 1273615 1252536 1231597 1211283 1191960 1173569 1155495 1137263 1118946 1100594 1082053
53442 1082053 1063808 1047204 1033207 1021617 1012020 1004742 1000172 997811 996676 996173 996084 996250 996783 998061
53428 998061 1000209 1003215 1007737 1014823 1024387 1034980 1045678 1057207 1070561 1085543 1101507 1118592
53416 1118592 1137229 1157191 1178118 1200320 1224146 1249184 1275119 1302754 1333064 1365564 1398669
$$ packed form
53499I99982K1464K0050J9418J9462J9417J9227J9211J8896J7670J6231J5928
53488A206956J6832J7699J7745J7326J6964J6814J6957J7370J7680J7700J7759
53477A397802J7909J7396J5717J3416J1088Q436N265K378K56k041n306q556j0565
53464A463195j1996j4168j6463j7073j5896j4667j4402j4609j5062j6375j8517
53453A293967k0352k1079k0939k0314j9323j8391j8074j8232j8317j8352j8541
53442A082053j8245j6604j3997j1590r597p278m570k361j135n03q9J66N33J278
53428I98061K148L006M522P086R564J0593J0698J1529J3354J4982J5964J7085
53416A118592J8637J9962K0927K2202K3826K5038K5935K7635L0310L2500L3105
$$ plain form
53405 1398669 1431581 1464994 1500094 1537554 1577415 1619337 1663008 1708646 1756874 1807800 1860652
53394 1860652 1914639 1969665 2025781 2082561 2139559 2196895 2254721 2312403 2368715 2422581 2473393
53383 2473393 2521090 2566262 2609716 2651597 2691331 2728397 2762399 2792301 2816714 2835396 2849447
53372 2849447 2859512 2864801 2864520 2859128 2849195 2833879 2811620 2781771 2744739 2701212 2652253 2599675
53360 2599675 2545316 2490132 2434568 2379190 2324249 2269263 2213956 2159253 2106633 2056936 2010376
53349 2010376 1967069 1926658 1887932 1849641 1811387 1773099 1734318 1694833 1655539 1617793 1582260
53338 1582260 1549080 1518654 1491354 1466770 1444087 1423009 1403755 1386532 1371565 1359171 1349109
53327 1349109 1340198 1331143 1321290 1310233 1297497 1283319 1268977 1255467 1242482 1229531 1217317 1206971
$$ packed form
53405A398669L2912L3413L5100L7460L9861M1922M3671M5638M8228N0926N2852
53394A860652N3987N5026N6116N6780N6998N7336N7826N7682N6312N3866N0812
53383B473393M7697M5172M3454M1881L9734L7066L4002K9902K4413J8682J4051
53372B849447J0065N289k81n392r933j5316k2259k9849l7032m3527m8959n2578
53360B599675n4359n5184n5564n5378n4941n4986n5307n4703n2620m9697m6560
53349B010376m3307m0411l8726l8291l8254l8288l8781l9485l9294l7746l5533
53338A582260l3180l0426k7300k4584k2683k1078j9254j7223j4967j2394j0062
53327A349109q911r055r853j1057j2736j4178j4342j3510j2985j2951j2214j0346
$$ plain form
53315 1206971 1198466 1190823 1183551 1176970 1171543 1167770 1166248 1166879 1168438 1169840 1171512 1174645 1179608 1185992
53301 1185992 1193731 1203062 1213772 1225585 1239080 1255207 1274014 1294750 1316965 1340684 1365749 1391836
53289 1391836 1418853 1446459 1473548 1499107 1523287 1546689 1568937 1588943 1606298 1621385 1634307
53278 1634307 1644654 1652138 1656555 1657397 1654417 1648350 1640182 1629971 1617281 1602366 1585798 1567224 1545742
53265 1545742 1521340 1494947 1467231 1438476 1409377 1380677 1352012 1322421 1291974 1261704 1231876
53254 1231876 1201726 1171169 1141440 1113570 1087336 1062195 1038145 1014974 991646 967298 942369
53243 942369 918104 895220 873463 852120 830673 809287 788953 770836 755287 741594 728738
53232 728738 716236 704368 693855 685191 678034 671465 664990 658792 652771 646024 637839 628573 618810
$$ packed form
53315A206971q505p643p272o581n427l773j522O31J559J402J672L133M963O384
53301A185992P739R331J0710J1813J3495J6127J8807K0736K2215K3719K5065K6087
53289A391836K7017K7606K7089K5559K4180K3402K2248K0006J7355J5087J2922
53278A634307J0347P484M417Q42k980o067q168j0211j2690j4915j6568j8574k1482
53265A545742k4402k6393k7716k8755k9099k8700k8665k9591l0447l0270k9828
53254A231876l0150l0557k9729k7870k6234k5141k4050k3171k3328k4348k4929
53243I42369k4265k2884k1757k1343k1447k1386k0334j8117j5549j3693j2856
53232G28738j2502j1868j0513q664p157o569o475o198o021o747q185r266r763
$$ plain form
53219 618810 608268 596423 583647 570713 557623 543952 530029 516699 504166 492140 480935
53208 480935 471268 463014 455213 447338 439633 432270 425100 418208 411830 405735 399518 393300 387273 380836
53194 380836 373254 364978 357173 350085 343054 336025 329746 324420 319474 314834 311180 308671 306521 304088
53180 304088 301384 298388 295018 291909 289968 288908 287431 285150 283032 281623 280236 278413 276873 276185
53166 276185 275695 274596 273124 271883 270862 269875 269205 269044 268995 268796 268838 269339 269747 269621 269374 269397 269114 267757
53148 267757 265549 263336 261477 259839 258498 257710 257419 257423 257796 258631 259580 260152 260336 260525 260990 261707 262520 263212
53130 263212 263620 263932 264635 266018 267904 269941 271879 273531 274819 275920 277039 278059 278834 279745 281432
53115 281432 283940 286638 289002 290964 292501 293471 293854 293630 292520 290459 288185 286591 285521 283971 281476
$$ packed form
53219F18810j0542j1845j2776j2934j3090j3671j3923j3330j2533j2026j1205
53208D80935r667q254p801p875p705p363p170o892o378o095o217o218o027o437
53194C80836p582q276p805p088p031p029o279n326m946m640l654k509k150k433
53180C04088k704k996l370l109j941j060j477k281k118j409j387j823j540o88
53166B76185m90j099j472j241j021r87o70j61m9j99M2N01M08j26k47K3k83j357
53148B67757k208k213j859j638j341p88k91ML73Q35R49N72J84J89M65P17Q13O92
53130B63212M08L12P03J383J886K037J938J652J288J101J119J020P75R11J687
53115B81432K508K698K364J962J537R70L83k24j110k061k274j594j070j550k495
$$ plain form
53100 281476 278491 275505 272737 270740 270193 270842 271544 271586 271047 269844 267577 264653 262365 261340 260940 260663
53084 260663 260968 262010 262724 262128 260721 259659 259253 259160 259364 259932 260202 259282 257268 255282 254354 254636 255502
53067 255502 255991 255425 253974 252421 251261 250403 249812 249738 250040 250071 249605 249202 249205 249135 248617 248187 248503 249365 250240
53048 250240 251264 252965 255340 257863 260071 261556 261769 260510 258453 256657 255679 255452 255635 255680 254979 253480
53032 253480 251976 251381 251930 253278 254948 256393 257113 257192 257322 257942 258682 259036 259163 259613 260621 262022 263495
53015 263495 264599 265002 265040 265662 267382 269621 271317 271863 271296 270081 268948 268439 268327 267921 267094 266377 265983
52998 265983 265526 265027 265238 266434 267720 268163 267944 267756 267732 267655 267652 267972 268493 269075 269953 271287 272855 274631
52980 274631 277034 280084 282995 285229 287221 289295 290666 290512 289427 288776 288995 289510 289974 290547 291166 291581
$$ packed form
53100B81476k985k986k768j997n47O49P02M2n39j203k267k924k288j025m00k77
53084B60663L05J042P14n96j407j062m06r3K04N68K70r20k014j986r28K82Q66
53067B55502M89n66j451j553j160q58n91p4L02L1m66m03Lp0n18m30L16Q62Q75
53048B50240J024J701K375K523K208J485K13j259k057j796r78k27J83M5p01j499
53032B53480j504n95N49J348J670J445P20P9J30O20P40L54J27M50J008J401J473
53015B63495J104M03L8O22J720K239J696N46n67j215j133n09j12m06q27p17l94
52998B65983m57m99K11J196J286M43k19j88k4p7lL20N21N82Q78J334J568J776
52980B74631K403L050K911K234J992K074J371j54j085o51K19N15M64N73O19M15
$$ plain form
52964 291581 292066 293201 294854 296174 296639 296535 296373 296335 296270 295804 294604 292866 291264 289982 288257 285533
52948 285533 282645 281021 280840 280784 279581 277155 274335 272100 271143 271504 272412 272913 272784 272595 272894 273616 274252
52931 274252 274367 274013 273697 273738 273686 272832 271329 270157 269726 269321 268355 267373 267202 267787 268631 269677 270891 271576
52913 271576 271192 270445 270589 271815 273286 274447 275308 275592 274750 272927 271032 269675 268814 268505 269141 270690
52897 270690 272406 273573 274018 273733 272699 271394 270896 272006 274453 277181 279214 280151 280080 279239 277829 276167
52881 276167 274847 274350 274384 274112 273282 272657 272989 274088 275381 276840 278727 280845 282778 284591 286616 288794
52865 288794 290864 292930 295144 297102 298363 299318 300723 302416 303274 302501 300286 297255 293952 290822 287948
52850 287948 284703 280345 275035 269755 265195 261347 258148 255790 254267 253273 252679 252606 252882 253026 252871 252641
$$ packed form
52964B91581M85J135J653J320M65j04j62l8o5m66j200j738j602j282j725k724
52948B85533k888j624j81n6j203k426k820k235r57L61R08N01j29j89K99P22O36
52931B74252J15l54l16M1n2q54j503j172m31m05r66r82j71N85Q44J046J214O85
52913B71576l84p47J44J226J471J161Q61K84q42j823j895j357q61l09O36J549
52897B70690J716J167M45k85j034j305m98J110K447K728K033R37p1q41j410j662
52881B76167j320m97L4k72q30o25L32J099J293J459J887K118J933J813K025K178
52865B88794K070K066K214J958J261R55J405J693Q58p73k215l031l303l130k874
52850B87948l245m358n310n280m560l848l199k358j523r94n94p3K76J44j55k30
$$ plain form
52834 252641 252338 251664 250713 250156 250454 251351 252366 253340 254265 255044 255689 256385 257054 257184 256375 254903 253524 252835
52816 252835 252890 253229 253224 252561 251548 250909 251283 252925 255710 259207 262866 266280 269145 270931 270955 269055 265988
52799 265988 262841 260215 258081 256095 253813 251033 248286 246614 246440 247018 247349 247254 247135 247179 247413 248060 249160
52782 249160 250153 250579 250858 251645 252681 253145 252949 252765 252857 252764 252284 251869 251844 251927 251806 251592 251406 250981 250004 248591
52762 248591 247285 246710 247072 247735 247580 246287 244995 245127 246729 248596 249838 250515 250897 251092 251594 253316
52746 253316 256587 260666 264549 267840 270593 272835 274568 275920 276964 277614 277839 277783 277587 277321 277082 276949
52730 276949 276883 276943 277437 278564 280075 281657 283372 285193 286322 285706 283272 280056 277084 274721 273128 272586
52714 272586 273007 273631 273566 272440 270476 268306 266806 266627 267580 268743 269368 269491 269602 269947 270358 270617 270792
$$ packed form
52834B52641l03o74r51n57K98Q97J015R74R25P79O45O96O69J30q09j472j379o89
52816B52835N5L39no63j013o39L74J642K785L497L659L414K865J786K4j900l067
52799B65988l147k626k134j986k282k780k747j672j74N78L31r5j19M4K34O47J100
52782B49160R93M26K79P87J036M64j96j84R2r3m80m15k5Q3j21k14j86m25r77j413
52762B48591j306n75L62O63j55j293j292J32J602J867J242O77L82J95N02J722
52746B53316L271M079L883L291K753K242J733J352J044O50K25n6j96k66k39j33
52730B76949o6O0M94J127J511J582J715J821J129o16k434l216k972k363j593n42
52714B72586M21O24o5j126j964k170j500j79R53J163O25J23J11L45M11K59J75
$$ plain form
52697 270792 271128 271572 271605 270846 269721 269085 269172 269488 269813 270466 271243 271101 269653 268211 268323 269801 271188 271743
52679 271743 271828 271568 270432 268293 265919 264122 263102 262775 263044 263557 263824 263759 263682 263838 264344 265458 267330
52662 267330 269544 271437 272733 273468 273707 273934 275203 278009 281463 284554 287723 291959 296660 299863 300584
52647 300584 299527 297409 294117 289903 285965 283146 281177 279803 279491 280312 281167 281086 280473 280297 280714 281293
52631 281293 281978 282946 283987 284879 286121 288531 292165 296065 299014 300277 299865 298360 296328 293833 290770
52616 290770 287630 285392 284541 284710 285380 286322 287178 287299 286360 284704 282849 281113 279860 279472 279809 280201 280223
52599 280223 280038 279881 279763 279829 280349 281136 281585 281490 281259 281140 280881 280358 279912 279838 280122 280828 282047 283373 284193
52580 284193 284677 285629 287184 288535 289205 289586 289862 289506 288424 287542 287458 287389 286347 284642 283320 282673 282168
$$ packed form
52697B70792L36M44L3p59j125o36Q7L16L25O53P77j42j448j442J12J478J387N55
52679B71743Q5k60j136k139k374j797j020l27K69N13K67o5p7J56N06J114J872
52662B67330K214J893J296P35K39K27J269K806L454L091L169M236M701L203P21
52647C00584j057k118l292m214l938k819j969j374l12Q21Q55q1o13j76M17N79
52631B81293O85R68J041Q92J242K410L634L900K949J263m12j505k032k495l063
52616B90770l140k238q51J69O70R42Q56J21r39j656j855j736j253l88L37L92K2
52599B80223j85j57j18O6N20P87M49r5k31j19k59n23m46p4K84P06J219J326Q20
52580B84193M84R52J555J351O70L81K76l56j082q82q4o9j042j705j322o47n05
$$ plain form
52563 282168 281473 280728 280156 280051 280817 282327 283571 283600 282603 281518 280838 280313 279600 278665 277713 277053 276891 276988
52545 276988 276898 276683 276917 277728 278448 278619 278698 279175 279608 279233 278187 277354 277154 277133 276790 276379 276731 278375 280815
52526 280815 282799 283564 283637 283969 284545 284658 284431 284950 286564 288132 288532 288115 288079 289121 291304 294504 298215
52509 298215 301554 304216 307029 310927 315691 320192 323357 324454 323048 319410 314582 309531 304575 299920
52495 299920 296095 293266 290806 288213 285922 284621 284247 284310 284618 285074 285307 285157 285033 285170 285098 284503 283972
52478 283972 284109 284521 284543 284439 284966 286173 287516 288850 290420 292189 293933 295671 297312 298350 298766 299773
52462 299773 302693 307380 312596 317513 321874 325105 326542 326468 325812 324801 322835 319687 315843 311626 306942
52447 306942 302127 298088 295326 293464 291936 290545 289188 287677 285993 284269 282512 280822 279719 279552
$$ packed form
52563B82168o95p45n72j05P66J510J244K9r97j085o80n25p13r35r52o60j62R7
52545B76988r0k15K34Q11P20J71P9M77M33l75j046q33k00k1l43m11L52J644K440
52526B80815J984P65P3L32N76J13k27N19J614J568M00m17l6J042K183L200L711
52509B98215L339K662K813L898M764M501L165J097j406l638m828n051m956m655
52495B99920l825k829k460k593k291j301l74O3L08M56K33j50j24J37p2n95n31
52478B83972J37M12K2j04N27J207J343J334J570J769J744J738J641J038M16J007
52462B99773K920M687N216M917M361L231J437p4o56j011j966l148l844m217m684
52447C06942m815m039k762j862j528j391j357j511j684j724j757j690j103j67
$$ plain form
52433 279552 279683 279054 277686 276806 277312 278779 280220 281168 281716 282029 282269 282699 283548 284891 286724 288875 290846
52416 290846 292047 292355 292288 292597 293812 296059 299124 302708 306713 311204 316198 321916 329273 339391 352208
52401 352208 365919 378056 386617 390116 387728 380334 370668 361330 352925 344877 337447 331775 328240 326043
52387 326043 324459 323492 323120 322889 322540 322308 322371 322554 322752 323110 323701 324503 325760 327876 330944 334735 339090
52370 339090 343872 348782 353721 359055 364890 370318 374150 376218 377187 377241 375908 373193 369995 367185 364989
52355 364989 363440 362700 362697 363048 363559 364321 365238 366042 366805 367865 369154 370237 371114 372406 374617 377756 381718
52338 381718 386431 391520 396486 401405 406877 413111 419669 426315 433574 442152 452239 463595 475918
52325 475918 488920 502456 516711 531968 548171 565043 582584 600917 619649 637962 655417
$$ packed form
52433B79552J31o29j368q80N06J467J441R48N48L13K40M30Q49J343J833K151J971
52416B90846J201L08o7L09J215K247L065L584M005M491M994N718P357J0118J2817
52401C52208J3711J2137Q561L499k388p394r666r338q405q048p430n672l535k197
52387C26043j584r67l72k31l49k32O3J83J98L58N91Q02J257K116L068L791M355
52370C39090M782M910M939N334N835N428L832K068R69N4j333k715l198k810k196
52355C64989j549p40lL51N11P62R17Q04P63J060J289J083Q77J292K211L139L962
52338C81718M713N089M966M919N472O234O558O646P259Q578J0087J1356J2323
52325D75918J3002J3536J4255J5257J6203J6872J7541J8333J8732J8313J7455
$$ plain form
52314 655417 672255 688871 705552 722731 740884 759930 779289 798694 818473 838802 859200
52303 859200 879046 898199 916847 935087 952894 970300 987304 1003662 1018806 1031904 1042128
52292 1042128 1049143 1053215 1054653 1053348 1049192 1042708 1034805 1026056 1016596 1006532 996032 985205 974447
52279 974447 964725 956990 951344 947272 944460 942869 942290 942559 944147 947827 953741 961352 970159 979760 989367
52264 989367 998171 1006418 1015393 1026050 1038214 1051282 1065124 1080012 1096094 1113126 1130497 1147496
52252 1147496 1163903 1180213 1196815 1213034 1227435 1238991 1247480 1252907 1255163 1254249 1250313 1243504 1234203
52239 1234203 1223257 1211475 1199027 1185759 1171822 1157464 1142585 1127220 1112097 1097922 1084399
52228 1084399 1070757 1056894 1043088 1029041 1014408 1000080 987637 977425 968395 959872 952281 946004
$$ packed form
52314F55417J6838J6616J6681J7179J8153J9046J9359J9405J9779K0329K0398
52303H59200J9846J9153J8648J8240J7807J7406J7004J6358J5144J3098J0224
52292A042128P015M072J438j305m156o484p903q749r460j0064j0500j0827j0758
52279I74447r722p735n646m072k812j591n79K69J588L680N914P611Q807R601R607
52264I89367Q804Q247Q975J0657J2164J3068J3842J4888J6082J7032J7371J6999
52252A147496J6407J6310J6602J6219J4401J1556Q489N427K256r14l936o809r301
52239A234203j0946j1782j2448j3268j3937j4358j4879j5365j5123j4175j3523
52228A084399j3642j3863j3806j4047j4633j4328j2443j0212r030q523p591o277
$$ plain form
52216 946004 940791 936671 934199 933367 933297 933447 934122 935434 936851 938292 940522 943842 947363 950258 952818
52201 952818 955581 958379 961035 964212 968661 974173 980046 986049 992194 998111 1003447 1008570 1014185 1020482
52187 1020482 1027068 1033346 1038481 1041461 1041736 1039578 1035470 1029571 1022115 1013749 1004978 995701 985778 975719
52173 975719 966341 958085 951029 945262 940797 937396 934770 932752 931192 930110 930078 931898 935684 940724 946413
52158 946413 952713 959433 965719 970649 973890 975501 975662 974835 973710 972740 972171 972523 974225 976674 978606
52143 978606 979732 981156 983787 987229 990681 993861 996458 997680 997352 996734 997301 999222 1001884 1005432 1010922
52128 1010922 1019225 1030540 1044682 1061220 1079591 1099666 1121951 1146771 1173668 1202065 1232001
$$ packed form
52216I46004n213m120k472q32p0J50O75J312J417J441K230L320L521K895K560
52201I52818K763K798K656L177M449N512N873O003O145N917N336N123N615O297
52187A020482O586O278N135K980K75k158m108n899p456q366q771r277r923j0059
52173I75719r378q256p056n767m465l401k626k018j560j082l2J820L786N040N689
52158I46413O300O720O286M930L241J611J61q27j125r70n69L52J702K449J932
52143I78606J126J424K631L442L452L180K597J222l28o18N67J921K662L548N490
52128A010922Q303J1315J4142J6538J8371K0075K2285K4820K6897K8397K9936
$$ [...]
##END NTUPLES=NMR SPECTRUM
##END=
