
##TITLE=AC1319_SBAAH12148_6535496_yrQSxQsGen
##JCAMPDX= 6.0         $$ Bruker NMR JCAMP-DX V2.0
##DATA TYPE= NMR SPECTRUM
##DATA CLASS= NTUPLES
##ORIGIN= BRUKER
##OWNER= Administrator
$$ 1.72 TOPSPIN		Version 2.1
$$ 2012-07-17 16:48:06.328 -0500  Administrator@TOPSPIN
$$ Compression mode = diff/dup
##.OBSERVE FREQUENCY= 400.02188249412
##.OBSERVE NUCLEUS= ^1H
##.ACQUISITION MODE= SIMULTANEOUS (DQD)
##.ACQUISITION SCHEME= undefined
##.AVERAGES= 64
##.DIGITISER RES= 22
##SPECTROMETER/DATA SYSTEM= spect
##.PULSE SEQUENCE= noesygpps1d.comp
##.SOLVENT NAME= COFFEE_meoh
##.SHIFT REFERENCE= INTERNAL, COFFEE_meoh, 1, 14.96062
##AUDIT TRAIL= $$ (NUMBER, WHEN, WHO, WHERE, PROCESS, VERSION, WHAT)
$$ ##TITLE= Audit trail, TOPSPIN		Version 2.1
$$ ##JCAMPDX= 5.01
$$ ##ORIGIN= Bruker BioSpin GmbH
$$ ##OWNER= Administrator
$$ $$ C:\Bruker\TOPSPIN/data/COFFEE/nmr/AC1319_SBAAH12148_6535496_yrQSxQsGen/12/pdata/1/auditp.txt
$$ ##AUDIT TRAIL=  $$ (NUMBER, WHEN, WHO, WHERE, PROCESS, VERSION, WHAT)
(   1,<2012-07-17 16:48:01.187 -0500>,<Administrator>,<TOPSPIN>,<go>,<TOPSPIN 2.1>,
      <created by zg
	started at 2012-07-17 16:36:30.921 -0500,
	POWCHK enabled, PULCHK disabled,
       configuration hash MD5:
       6B 1B 68 BB D9 2E 58 E2 7F 35 AD 54 07 DF 0E 41
       data hash MD5: 64K
       94 97 6F DA 54 27 79 C1 AF 6B BE E6 13 A5 11 93>)
(   2,<2012-07-17 16:48:04.203 -0500>,<Administrator>,<TOPSPIN>,<proc1d>,<TOPSPIN 2.1>,
      <Start of raw data processing
       efp LB = 0.3 FT_mod = 6 PKNL = 1 PHC0 = 0 PHC1 = 0 SI = 128K 
       data hash MD5: 128K
       57 39 2F F5 D2 6A 3A 1A ED 76 2C 24 1D 0E 89 48>)
(   3,<2012-07-17 16:48:05.265 -0500>,<Administrator>,<TOPSPIN>,<proc1d>,<TOPSPIN 2.1>,
      <pk PHC0 = -1.411743 PHC1 = 0 
       data hash MD5: 128K
       83 4A D2 D9 F8 FE 16 65 C0 45 18 B8 E9 EC 1F 06>)
(   4,<2012-07-17 16:48:05.953 -0500>,<Administrator>,<TOPSPIN>,<proc1d>,<TOPSPIN 2.1>,
      <abs ABSG = 1 
       data hash MD5: 128K
       31 45 2D 4A A5 EF 44 86 07 5D 54 86 AB 2F 28 19>)
(   5,<2012-07-17 16:48:06.046 -0500>,<Administrator>,<TOPSPIN>,<proc1d>,<TOPSPIN 2.1>,
      <abs ABSG = 2 
       data hash MD5: 128K
       61 74 52 35 5E F4 1C 0B C7 A9 B1 FC F6 24 12 66>)
(   6,<2012-07-17 16:48:06.093 -0500>,<Administrator>,<TOPSPIN>,<proc1d>,<TOPSPIN 2.1>,
      <abs ABSG = 3 
       data hash MD5: 128K
       92 B2 DD 29 1D AA B2 69 57 13 8D 3E 6D 0F B2 72>)
(   7,<2012-07-17 16:48:06.156 -0500>,<Administrator>,<TOPSPIN>,<proc1d>,<TOPSPIN 2.1>,
      <abs ABSG = 4 
       data hash MD5: 128K
       88 55 DE 90 6C 9B CD A2 DD E9 A7 27 4F 65 56 31>)
(   8,<2012-07-17 16:48:06.218 -0500>,<Administrator>,<TOPSPIN>,<proc1d>,<TOPSPIN 2.1>,
      <abs ABSG = 5 
       data hash MD5: 128K
       A2 18 F4 78 D0 05 8F 46 60 AD 99 15 A5 32 98 73>)
$$ ##END=
$$ 
$$ $$ hash MD5
$$ $$ E5 FB 7E 4F 6C E1 07 56 6A 2C 7E 78 92 FC 56 8D
##$RELAX= 
##$RELAX= 
##$RELAX= 
##$RELAX= 
##$RELAX= 
##$RELAX= 
##$RELAX= 
##$RELAX= 
$$ Bruker specific parameters
$$ [...]
##$TP07= 0
##$TPNAME0= <>
##$TPNAME1= <>
##$TPNAME2= <>
##$TPNAME3= <>
##$TPNAME4= <>
##$TPNAME5= <>
##$TPNAME6= <>
##$TPNAME7= <>
##$TPOAL= (0..7)
0.5 0.5 0.5 0.5 0.5 0.5 0.5 0.5
##$TPOFFS= (0..7)
0 0 0 0 0 0 0 0
##$TUNHIN= 0
##$TUNHOUT= 0
##$TUNXOUT= 0
##$USERA1= <user>
##$USERA2= <user>
##$USERA3= <user>
##$USERA4= <user>
##$USERA5= <user>
##$V9= 5
##$VALIST= <valist>
##$VCLIST= <CCCCCCCCCCCCCCC>
##$VD= 0
##$VDLIST= <DDDDDDDDDDDDDDD>
##$VPLIST= <PPPPPPPPPPPPPPP>
##$VTLIST= <TTTTTTTTTTTTTTT>
##$WBST= 2048
##$WBSW= 25
##$XGAIN= (0..3)
0 0 0 0
##$XL= 0
##$YL= 0
##$YMAX_a= 11405523
##$YMIN_a= -8946580
##$ZGOPTNS= <>
##$ZL1= 120
##$ZL2= 120
##$ZL3= 120
##$ZL4= 120
##$ABSF1= 14.96062
##$ABSF2= -5.597562
##$ABSG= 5
##$ABSL= 3
##$ALPHA= 0
##$AQORDER= 0
##$ASSFAC= 0
##$ASSFACI= 0
##$ASSFACX= 0
##$ASSWID= 0
##$AUNMP= <proc_prof1d_extract.lims>
##$AXLEFT= 0
##$AXNAME= <>
##$AXNUC= <1H>
##$AXRIGHT= 0
##$AXTYPE= 0
##$AXUNIT= <>
##$AZFE= 0.1
##$AZFW= 0.1
##$BCFW= 0
##$BC_mod= 0
##$BYTORDP= 0
##$COROFFS= 0
##$CY= 15
##$DATMOD= 1
##$DC= 0
##$DFILT= <>
##$DTYPP= 0
##$F1P= 0
##$F2P= 0
##$FCOR= 0.5
##$FTSIZE= 131072
##$FT_mod= 6
##$GAMMA= 0
##$GB= 0
##$INTBC= 1
##$INTSCL= 1
##$ISEN= 128
##$LB= 0.3
##$LEV0= 0
##$LPBIN= 0
##$MAXI= 10000
##$MC2= 0
##$MEAN= 0
##$ME_mod= 0
##$MI= 0
##$NCOEF= 0
##$NC_proc= -2
##$NLEV= 6
##$NOISF1= 0
##$NOISF2= 0
##$NSP= 0
##$NTH_PI= 0
##$NZP= 0
##$OFFSET= 14.96062
##$PC= 1
##$PHC0= -1.411743
##$PHC1= 0
##$PH_mod= 1
##$PKNL= yes
##$PPARMOD= 0
##$PPDIAG= 0
##$PPIPTYP= 0
##$PPMPNUM= 2147483647
##$PPRESOL= 1
##$PSCAL= 4
##$PSIGN= 0
##$PYNMP= <proc.py>
##$REVERSE= no
##$SF= 400.020009787706
##$SI= 131072
##$SIGF1= 0
##$SIGF2= 0
##$SINO= 400
##$SIOLD= 131072
##$SPECTYP= <>
##$SREGLST= <1H.CDCl3>
##$SSB= 0
##$STSI= 131072
##$STSR= 0
##$SW_p= 8223.68421052631
##$SYMM= 0
##$S_DEV= 0
##$TDeff= 65536
##$TDoff= 0
##$TI= <>
##$TILT= no
##$TM1= 0
##$TM2= 0
##$TOPLEV= 0
##$USERP1= <user>
##$USERP2= <user>
##$USERP3= <user>
##$USERP4= <user>
##$USERP5= <user>
##$WDW= 1
##$XDIM= 131072
##$YMAX_p= 430346641
##$YMIN_p= -12618
##$CURPLOT= <Network HP LaserJet P1505>
##$CURPRIN= <$Network HP LaserJet P1505>
##$DFORMAT= <normdp>
##$LAYOUT= <+/1D_H.xwp>
##$LFORMAT= <normlp>
##$PFORMAT= <normpl>
##$SURQMSG= 1
$$ End of Bruker specific parameters
$$ ---------------------------------
##NTUPLES= NMR SPECTRUM
##VAR_NAME=  FREQUENCY,     SPECTRUM/REAL,   SPECTRUM/IMAG
##SYMBOL=    X,             R,               I
##VAR_TYPE=  INDEPENDENT,   DEPENDENT,       DEPENDENT
##VAR_FORM=  AFFN,          ASDF,            ASDF
##VAR_DIM=   131072,        131072,          131072
##UNITS=     HZ,            ARBITRARY UNITS, ARBITRARY UNITS
##FACTOR=    0.0627417313425164, 1,          1
##FIRST=     8223.62146879497, 2598,         -54126
##LAST=      0,             3689,            -54392
##MIN=       0,             -12618,          0
##MAX=       8223.62146879497, 430346641,    0
$$ Real data points
##PAGE= N=1
##DATA TABLE= (X++(R..R)), XYDATA
$$ [...]
65152 199505 203870 208120 212793 217902 223184 228973 236038 244626 254467 265715 279183 295493 314465
65139 314465 335357 357164 378677 398879 417484 434777 451012 466398 481495 496922 512485
65128 512485 527080 539534 549124 555302 557544 555756 550519 542800 533618 523819 513671 502578 489573
65115 489573 474151 456478 437092 416903 397160 378647 360982 343404 326176 310461 296791
65104 296791 284580 273292 263137 254214 245872 237523 229412 222008 215158 208465 202004 196063 190582
65091 190582 185433 180965 177673 175543 174218 173562 173607 174184 175112 176509 178424 180332 181516 181807 181467 180539
65075 180539 178854 176681 174840 174044 174462 175844 177688 179287 180034 179810 178904 177601 176159 174977 174348 174038
65059 174038 173528 172692 171889 171326 170774 170058 169477 169555 170566 172393 174576 176416 177305 177167 176425 175469 174349
65042 174349 173068 171818 170740 169666 168406 167175 166445 166389 166666 166783 166474 165654 164197 162007 159312 156679
65026 156679 154561 152878 151234 149453 147711 146138 144629 143179 142079 141530 141248 140788 140158 139792 139986 140671
65010 140671 141748 143225 144962 146585 147922 149258 150974 153082 155384 157949 161104 164874 168663 171693
64996 171693 173750 175406 177489 180361 183683 186714 188780 189600 189452 189073 189241 190266 191885 193671 195434
64981 195434 197272 199339 201667 204066 206123 207449 208012 208102 207934 207440 206501 205119 203225 200619 197358 193945
64965 193945 190770 187558 183762 179439 175311 171958 169329 167094 165055 163109 161180 159393 158083 157412
64951 157412 157180 157122 157168 157219 156920 155943 154491 153272 152916 153399 154017 153931 152887 151454 150478 150303 150597 150829 150738
64932 150738 150447 150406 151162 152819 154728 156135 157139 158471 160170 161151 160564 159055 157982 157736 157542 156799
64916 156799 155777 154937 154319 153940 154118 154969 156028 156812 157473 158401 159538 160609 161777 163461 165509 167224
64900 167224 168378 169686 171969 175353 179606 184869 191480 199256 207459 215518 223355 231015 238411 245524
64886 245524 252358 258536 263380 266799 269694 273058 276893 280496 283509 285972 287473 287064 284337 279917
64872 279917 274530 268178 260815 253402 247451 243552 240903 238362 235506 232627 230227 228741 228337 228640 228816
64857 228816 228137 226415 223862 220783 217448 214009 210354 206216 201560 196694 191950 187417 183059 178870
64843 178870 174852 171147 168279 166909 167073 167947 168636 168926 169039 169044 168948 169099 169889 171068 171850 171713 170754 169301
64825 169301 167662 166327 165920 166679 168202 169808 170948 171359 171294 171704 173647 177234 181535 185725 189912 194541
64809 194541 199495 204388 209459 215530 223109 231988 241745 252100 262628 272498 280784 286869 290461 291465
64795 291465 290069 286825 282395 277171 271250 264774 258162 251831 245724 239360 232572 226017 220621 216583
64781 216583 213334 210534 208603 207954 208162 208339 208111 207754 207568 207636 208199 209746 212572 216522 221272 226621
64765 226621 232519 239026 246229 254040 262124 270267 278633 287271 295543 302597 308466 314135 320341 326772
64751 326772 332679 337751 342073 345634 348416 350764 353135 355450 356988 356996 355277 352213 348332 343781 338122
64736 338122 330768 321724 311771 301774 291943 281994 271945 262588 255089 250113 247268 245414 243682 242235
64722 242235 241879 242881 244398 245162 244575 243041 241489 240776 241331 243083 245662 248763 252378 256708 261922
64707 261922 267901 274016 279254 282860 284894 285846 285711 283901 280134 274985 269286 263370 257220 250999 245021
64692 245021 239383 234001 228891 224163 219817 215815 212222 209134 206661 205069 204619 205014 205422 205382 205382 206176
64676 206176 207868 210126 212919 216439 220581 225190 230697 237772 246362 255753 265599 276098 286929 296771
64662 296771 304374 309590 312865 314159 312949 309099 303236 296292 289061 282130 275816 270049 264536 259191
64648 259191 254286 250148 246780 243920 241487 239886 239706 241080 243464 246205 249239 253090 258286 264919
64634 264919 272754 281570 291406 302601 315497 329953 345271 360657 375560 389336 400971 409598
64622 409598 415152 418007 418058 414750 408073 398969 388529 377309 365627 354054 343176 333225 324318
64609 324318 316818 311031 306688 303129 299967 297286 295251 293815 292850 292263 291922 291599 291105 290365 289288 287653
64593 287653 285319 282578 280030 277815 275090 270769 264935 259095 254695 251750 249362 247192 245746 245431
64579 245431 246167 247952 251037 255256 259885 264583 269915 276480 283938 291352 298181 304453 310176 315008
64565 315008 318338 319401 317543 312792 306027 298256 289872 280925 271835 263309 255568 248126 240542 233107
64551 233107 226626 221611 217809 214609 211921 210431 210620 211644 211842 210675 209596 210459 213395 216867 219615
64536 219615 221794 224153 226753 228878 229780 229131 227009 223890 220656 218178 216622 215263 213289 210825 208914
64521 208914 208337 208750 209304 209771 210512 211481 212035 211908 211699 212018 212675 213140 213367 213745 214615 216290 219159 223242
64503 223242 227914 232608 237537 243302 250037 257430 265268 273375 281308 288782 296213 304184 312490 320294
64489 320294 327089 332730 336664 337974 336394 332581 327283 320845 313701 306628 300292 295061 291366 289537
64475 289537 289019 288412 286724 284056 280809 276909 272302 267609 263653 260633 258233 256284 254870 254064 253947
64460 253947 254667 256164 258167 260745 264424 269291 274305 278005 279714 279687 278462 276633 274997 274239 274434
64445 274434 275312 276885 279399 282727 286394 290219 294487 299412 304863 310765 317375 324993 333634 343197
64431 343197 353789 365820 379830 396203 414971 436020 459587 486362 516980 551804 591670
64420 591670 638574 694968 762356 840949 930447 1030154 1137884 1249424 1359893 1465814 1565747
64409 1565747 1659210 1745294 1822046 1886641 1936025 1967798 1980923 1975903 1954406 1918670 1870855
64398 1870855 1812436 1743933 1665301 1576806 1479766 1376632 1270475 1164425 1061445 964238
64388 964238 874885 794405 722811 659755 605007 558220 518539 484765 455944 431592 411391
64377 411391 394868 381360 370079 360181 350991 342262 334150 326877 320466 314730 309398 304252 299225
64364 299225 294338 289481 284364 278828 273057 267329 261654 255928 250372 245552 241967 239756 238760 238663 239166
64349 239166 240291 242495 246236 251477 257854 265149 273173 281246 288290 293568 296965 298526 298210 296255
64335 296255 293229 289481 285008 280195 276158 273746 272537 271381 269793 268309 267607 267850 268854 270293 271609
64320 271609 272185 271841 270930 269823 268572 267114 265512 263872 262305 261062 260431 260340 260280 259724 258466 256552
64304 256552 254171 251650 249153 246251 242190 236870 231197 226152 221849 217914 214447 212017 210795 210284
64290 210284 210047 210212 211049 212393 213740 214755 215541 216577 218431 221326 224893 228559 232222 236259 240795
64275 240795 245392 249728 254222 259628 266240 273821 282039 290433 298155 304404 309168 312997 315894 317086
64261 317086 316221 314226 312467 311447 310928 311001 312206 314488 316779 318000 318041 317346 315858 312896 307955 301186
64245 301186 293022 283762 273795 264017 255643 249426 245110 241718 238383 234948 231835 229518 228159 227619
64231 227619 227598 227749 227770 227538 227194 227072 227515 228623 230050 231136 231445 231222 231101 231279 231181 230143 228297 226523
64213 226523 225493 224975 224170 222598 220484 218349 216413 214539 212673 211132 210377 210579 211481 212532 213100 212835
64197 212835 212113 212032 213478 216140 218865 221118 223652 227466 232616 238575 245385 253715 263865 275437
64183 275437 288071 301804 316357 330687 343732 355209 365156 372901 377059 376593 371571 362942 351880
64170 351880 339408 326292 313124 300460 288838 278586 269721 262109 255587 249864 244565 239590 235194
64157 235194 231491 228182 225149 222945 222088 222022 221509 220169 219023 219302 221242 224274 227812 231427 234744
64142 234744 237746 240976 244929 249339 253431 256727 259230 260986 261950 262267 262239 261970 261301 260112 258343 255812
64126 255812 252464 248913 246300 245334 245697 246539 247360 248328 249991 252859 257061 262224 267807 273632 279971
64111 279971 287143 295303 304613 315200 326770 338613 350255 361623 372267 380888 386350 388997 390313
64098 390313 391399 392433 393681 396106 400505 406610 413642 421360 429880 438647 446300 451652 454342 454385 451647
64083 451647 446089 438170 428591 417796 406044 393812 381721 370009 358450 346986 336202 326889
64071 326889 319193 312498 306254 300704 296578 294159 292933 292176 291650 291535 291930 292659 293462 294065 294150 293587 292746
64054 292746 292319 292789 294239 296582 299573 302604 305061 307130 309825 313878 319046 324871 331645 339955 349585
64039 349585 359643 369707 380087 390899 401614 411763 421452 430775 439184 445874 450460 452996 453640
64026 453640 452670 450531 447484 443459 438534 433356 428751 425174 422824 421971 422657 424194 425396 425288 423388
64011 423388 419525 413863 407047 399910 392996 386515 380599 375297 370523 366360 363246 361422 360339 359074
63997 359074 357222 354949 352393 349692 347521 346840 347841 349781 352036 354728 358010 361437 364637 368131
63983 368131 372812 378802 385385 392005 398872 406549 415305 424926 434936 444889 454623 464281 474157 484609
63969 484609 496110 509076 523469 538784 554622 571144 588782 607722 627921 649522 672990
63958 672990 698914 727810 760064 795954 835914 880924 932477 992018 1060680 1139820 1231567
63947 1231567 1338325 1461701 1602135 1759434 1933211 2122725 2326752 2543982 2773394
63938 2773394 3013965 3263911 3520186 3778436 4033128 4277702 4505012 4708261 4882051
63929 4882051 5022735 5127969 5196099 5226040 5217303 5169675 5083023 4958038 4797453 4606232
63919 4606232 4390416 4156008 3908958 3655399 3401020 3150109 2905587 2670050 2446515
63910 2446515 2238123 2047288 1875120 1721478 1585533 1466341 1362881 1273649 1196586 1129661
63900 1129661 1071390 1020675 976396 937488 903242 873120 846313 821792 798816 777178 756927
63889 756927 738021 720218 703139 686499 670455 655605 642449 630864 620363 610820 602778 597043
63877 597043 594095 593872 596019 600375 607154 616446 627660 639887 652985 667778 684844 703581 722867
63864 722867 742135 761166 779309 795826 810899 825348 839241 851544 861368 868762 873988 876717
63852 876717 876457 873320 867877 860532 851370 840307 827119 811605 793960 774713 754137 732122 708809
63839 708809 684819 660561 635841 610622 585664 561841 539154 517063 495455 474681 454821
63828 454821 435717 417682 401481 387393 374824 363059 351988 341918 333053 325356 318625 312454
63816 312454 306371 300196 294178 288732 284187 280731 278259 276193 273810 270977 268361 266696 266018 265819 265789
63801 265789 266112 267030 268301 269198 269041 267680 265474 262876 260184 257670 255617 253949 252022 249208 245695
63786 245695 242375 239878 237993 236125 233978 231658 229474 227872 227264 227523 227855 227494 226491 225544 225170 225347
63770 225347 225873 226637 227470 228078 228326 228379 228379 228150 227398 226146 224826 223965 223830 224294 224958 225411 225463 225123 224455
63751 224455 223603 222918 222827 223455 224491 225502 226225 226556 226532 226503 227096 228698 231063 233664 236298 239119 242216
63734 242216 245445 248650 251689 254300 256263 257742 259197 260978 263247 266223 270047 274414 278870 283543
63720 283543 288997 295094 300693 304910 308179 311446 314793 317532 319392 320725 321621 321553 320092 317354 313632
63705 313632 309228 304846 301536 299795 299072 298472 297594 296464 295138 293853 293198 293620 294837 296196 297493
63690 297493 299085 301222 303665 306047 308308 310706 313529 316879 320519 323906 326475 328025 328809 329230 329476
63675 329476 329438 328986 328311 327888 328037 328652 329565 330972 333177 335976 338739 341171 343492 345673 347003 346836
63659 346836 345438 343628 341747 339406 336134 331819 326538 320401 313721 307118 301306 296827 293873 292150
63645 292150 291037 290101 289443 289326 289594 289816 289941 290447 291699 293445 295125 296598 298403 301349 305771 311203
63629 311203 316850 322470 328555 335498 342890 350008 356759 363662 371050 378920 387617 397921 410052 423141
63615 423141 436251 449732 465029 483260 504375 527707 552892 580094 609642 641695 676142
63604 676142 712618 750450 788508 825003 857645 884320 903870 916206 921737 921027 915184 906275
63592 906275 896729 888069 880379 873004 865306 856419 844726 828419 806832 780954 752593 723360 694404
63579 694404 666457 639749 614234 590243 568624 549987 534149 520681 509595 501026 494657 490092
63567 490092 487570 487608 490059 494160 499427 505784 512840 519971 527340 535973 546356 557646 568748 579610
63553 579610 590902 603069 616415 631740 650115 672173 698216 728889 765136 807467 855523
63542 855523 907883 961494 1011447 1052420 1081016 1096661 1100564 1094671 1081762 1065469 1049150 1034658
63530 1034658 1022419 1012313 1003937 996177 987188 975117 958794 937756 911913 881407 846782 809164
63518 809164 770082 730976 692880 656539 622616 591550 563298 537568 514280 493575 475383
63507 475383 459317 445047 432418 421111 410628 400795 391950 384377 377892 372242 367464 363470 359687
63494 359687 355701 352028 349579 348444 347815 347147 346723 346892 347399 347859 348427 349528 351252 353439 356090 359213
63478 359213 362431 365327 368186 371890 376877 382540 387843 392215 395566 397644 397811 395607 391385 386231
63464 386231 381229 376840 372928 369234 365683 362258 358862 355512 352600 350747 350314 351123 352680 354595 356796
63449 356796 359455 362769 366776 371352 376403 382016 388359 395463 403282 411952 421864 433300 446143 460210
63435 460210 475974 494791 518116 546415 578904 614196 650742 686397 718066 742695 759094
63424 759094 768576 773687 776622 779010 782641 789584 801452 818884 841892 870440 904561 943999 987659
63411 987659 1033254 1077609 1117596 1150871 1175776 1191095 1196579 1193693 1185173 1173600 1160665 1147585
63399 1147585 1135346 1123977 1112083 1097674 1079364 1056598 1029209 997328 961539 922710 881757
63388 881757 839900 798835 760121 724454 691865 662389 636041 612413 590971 571814 555527
63377 555527 542221 531362 522715 516805 514091 514198 516356 520197 525734 532869 541434 551486 563164
63364 563164 576392 591106 607595 626232 647019 669839 695130 723865 756714 793562 833872
63353 833872 877110 922533 968785 1013985 1056168 1093494 1124153 1146473 1159483 1163537 1160339 1152165
63341 1152165 1140968 1128104 1114640 1101383 1088409 1074835 1059381 1041035 1019022 992598 961548
63330 961548 926897 890488 853668 816788 780106 744628 711692 682150 656433 635086 618714
63319 618714 607563 601530 600253 602389 604815 603475 595645 581274 562116 540141 517062 494611 474265
63306 474265 456547 441059 427277 415030 404253 394758 386443 379448 373894 369589 366106 363102 360519
63293 360519 358471 356863 355069 352196 347902 342827 337981 333789 330031 326554 323575 321287 319590 318320
63279 318320 317379 316484 315199 313394 311428 309701 308346 307507 307502 308444 309974 311686 313529 315587 317743 319855
63263 319855 321938 323889 325420 326619 328179 330579 333404 336066 338866 342557 347025 351326 355087 359028
63249 359028 363831 369315 375096 381355 388346 395696 402907 410321 418997 429764 442792 457910 474722
63236 474722 492485 510485 528727 547873 568376 590021 612473 635886 660570 686225 711878
63225 711878 736648 760357 783303 805683 827488 848907 870525 892920 916200 940037 963974
63214 963974 987419 1009463 1029044 1045362 1057873 1065842 1068329 1064845 1055688 1041328 1021680 996491
63202 996491 966409 933248 899065 865234 832563 801899 774146 749708 728292 709498 693445
63191 693445 680674 671512 665747 662851 662294 663626 666530 671032 677512 686327 697439 710468 724930
63178 724930 740243 755693 770729 785301 799730 814250 828846 843442 857897 871795 884509
63167 884509 895545 904599 911258 914947 915221 911858 904614 893237 877936 859480 838598 815505 790275
63154 790275 763465 736045 708795 682146 656557 632712 611137 591792 574231 558206 544005
63143 544005 532056 522192 513519 505196 497222 490164 484189 478794 473590 468919 465399 463139 461661 460450
63129 460450 459308 458369 458057 458889 461033 464073 467426 470881 474626 478905 483841 489334 494825 499454 502915
63114 502915 506083 510209 515500 520958 525684 529768 533683 537403 540609 543416 546276 549298 552218 555025
63100 555025 558052 561187 563522 564248 563747 563336 563955 565449 567148 568720 570162 571297 571740 571370 570514 569549
63084 569549 568543 567467 566626 566658 567994 570334 572804 574767 576513 579051 583200 589018 596099 604109 612798
63069 612798 621810 630881 640198 650275 661508 674080 688110 703571 720225 738113 758028 780955
63057 780955 807022 835620 866659 901055 939621 982141 1027966 1076979 1129322 1184509 1241499
63046 1241499 1299501 1358171 1417092 1475646 1533395 1590116 1645426 1698965 1751159 1803393 1857069
63035 1857069 1912560 1969101 2025477 2080607 2133574 2183252 2227972 2265628 2294100 2311558 2316521
63024 2316521 2308073 2286274 2252034 2206341 2149861 2083668 2010070 1932171 1852618 1773166 1695374
63013 1695374 1621113 1552162 1489656 1434152 1385970 1345261 1311932 1285786 1266747 1254847 1249936
63002 1249936 1251412 1258279 1269554 1284610 1302930 1323557 1345200 1367120 1389557 1412987 1437231 1461640
62990 1461640 1485886 1510083 1534264 1558168 1581417 1603440 1623300 1640012 1652845 1660851 1662320 1655466
62978 1655466 1639750 1615986 1585180 1547995 1505363 1458728 1409260 1357510 1304282 1251186 1199739
62967 1199739 1150409 1103150 1058522 1017555 980675 947386 916987 889139 863692 840398 818878
62956 818878 798708 779572 761478 744671 729091 714134 699243 684551 670555 657316 644438
62945 644438 631732 619400 607476 595576 583423 571327 559875 549375 539771 530963 523005 515999
62933 515999 510001 505017 500989 497727 494876 492002 488789 485200 481510 478210 475848 474807 474993 475698 475982
62918 475982 475326 473915 472300 470903 469851 469032 468162 466899 465070 462750 460077 457179 454311 451857 449934
62903 449934 448111 445743 442602 439097 435916 433514 431906 430869 430327 430477 431383 432544 433171 433019 432635 432642
62887 432642 433041 433498 433972 434668 435532 436267 436850 437596 438589 439378 439392 438542 437297 436354 436264 437135 438507 439642
62869 439642 440090 439960 439609 439160 438410 437094 435144 432785 430504 428883 428276 428652 429759 431395 433387 435369
62853 435369 436822 437530 437900 438623 439913 441242 441932 441965 442030 442743 443914 444666 444285 442886 441199 439743 438354
62836 438354 436622 434652 433106 432485 432655 433246 434218 435734 437575 439066 439616 439188 438272 437586 437754 439014
62820 439014 441173 443949 447325 451424 456170 461280 466475 471439 475737 479142 482004 484973 488368 492137
62806 492137 496339 501197 506712 512757 519603 527792 537347 547654 558366 569837 582325 595338 608325
62793 608325 621609 636125 652499 670906 691575 714872 740929 769694 801406 836730 876468
62782 876468 921351 971974 1028640 1091418 1160582 1236703 1320004 1409846 1505153 1604896 1707531
62771 1707531 1810166 1909022 2000753 2082882 2153159 2209356 2249886 2274041 2281426 2271760 2245573
62760 2245573 2204547 2150722 2085650 2010654 1927620 1839095 1747684 1655594 1564558 1475834 1390184
62749 1390184 1308052 1229836 1156005 1087017 1023139 964363 910604 862035 818937 780960 746815
62738 746815 715273 686443 661405 640416 622036 604498 587448 571878 558631 547593 538252 530401
62726 530401 523999 518781 514393 510849 508553 507761 508182 509210 510533 512398 515284 519459 524834 531064 537706
62711 537706 544587 552248 561872 574452 590120 608512 629557 653521 680437 710120 742791 779177
62699 779177 819744 864257 912277 963651 1018182 1075202 1133906 1193931 1255259 1317627 1380102
62688 1380102 1440882 1497179 1545681 1583740 1610254 1625231 1628701 1620378 1600251 1569072 1528273 1479703
62676 1479703 1425358 1366958 1305639 1242274 1178069 1114582 1053158 994579 939293 887665 839946
62665 839946 796231 756537 720711 688267 658673 631878 608224 587632 569291 552454 537272
62654 537272 524363 513682 504335 495531 487214 479515 472049 464251 456257 448851 442474 436723 431048 425557
62640 425557 420746 416697 413086 409877 407504 406240 405853 406073 406988 408631 410465 411751 412292 412482 412726 413119
62624 413119 413570 413829 413475 412320 410935 410350 411060 412633 414444 416457 419101 422727 427461 433376 440401
62609 440401 448165 456233 464433 472792 481340 490253 500080 511409 524311 538436 553750 570967 591119
62596 591119 614888 642368 673341 707735 745927 788426 834979 884044 933485 981795 1028232
62585 1028232 1071816 1110788 1143329 1168377 1185370 1193711 1192996 1183495 1165853 1140532 1108136 1070208
62573 1070208 1029053 986576 943716 901015 859202 818975 780649 744317 710130 678181 648419
62562 648419 620909 595949 573704 553850 535782 519166 504208 491462 481294 473364 466727 460676
62550 460676 455317 450931 447037 442842 438569 435451 434067 433545 432888 432307 432512 433387 434340 435487 437418 439951
62534 439951 442171 443695 444959 446112 446630 446330 445919 446116 446957 448495 451523 456957 464886 474775 486247
62519 486247 499129 513134 528217 545176 565290 589217 616589 646663 679018 713517 749924
62508 749924 787725 826260 864904 903041 939745 973543 1002767 1026275 1043699 1055025 1060329 1060062
62496 1060062 1055149 1046372 1033972 1018358 1001055 984399 970242 959329 951964 948803 950718 958170
62484 958170 971050 989149 1012596 1041808 1077045 1118104 1164482 1215747 1271544 1331056 1392531
62473 1392531 1453334 1510257 1559848 1599060 1626401 1642537 1649261 1647303 1635112 1609927 1570191 1517136
62461 1517136 1454273 1385487 1313542 1240113 1166704 1095009 1026330 961208 900079 844042 794406
62450 794406 751494 714410 682206 654811 632448 614457 599306 585871 574342 565655 560215 557362
62438 557362 555912 554956 554250 554154 555291 557971 561705 565379 568030 569291 568986 566666 561978 555360 547804
62423 547804 539840 531170 521473 511153 501020 491534 482653 474201 466062 458186 450721 444082 438641 434433
62409 434433 431320 429231 427916 426645 424537 421324 417600 414351 412326 411614 411529 410973 409339 407099 405334
62394 405334 404731 405307 406906 409424 412491 415442 417909 420170 422626 425186 427441 429350 431475 434568 439007
62379 439007 444562 450654 456909 463468 470675 478570 486969 496055 506418 518310 531122 543976 556595
62366 556595 569394 582938 597726 614366 633491 655484 680635 709567 743119 781732 825376
62355 825376 874182 928624 988685 1053162 1120155 1187920 1254655 1317674 1373661 1420122 1456199
62344 1456199 1481852 1496847 1501085 1495601 1482389 1462937 1437338 1405017 1366076 1321710 1273569 1223134
62332 1223134 1171799 1121262 1073503 1030158 991855 958229 928547 902190 878512 856649 835935
62321 835935 816428 798567 782173 766157 749358 731344 712221 692136 671412 650943 631840
62310 631840 614560 598638 583335 568288 553583 539568 526814 515969 507368 500743 495420 490761
62298 490761 486449 482485 479032 476261 474276 473222 473360 474901 477614 480670 483129 484775 486497 489622
62284 489622 494672 500857 506994 512809 518981 525943 533168 539970 546564 553761 561884 570638 580027 590719
62270 590719 603192 617062 631663 646926 663311 681123 700394 721322 744299 769506 796907
62259 796907 826828 860182 897884 940272 987254 1038762 1094768 1154947 1218529 1284268 1350180
62248 1350180 1413365 1470571 1519219 1557864 1585783 1602603 1608594 1604929 1593054 1573711 1546740 1511765
62236 1511765 1468829 1418494 1361773 1300147 1235422 1169451 1104070 1041139 982204 927962 878392
62225 878392 833520 793742 759204 729295 703068 679947 659642 641725 625785 611872 600169
62214 600169 590177 580752 571228 562201 554852 549676 546083 543118 540233 537283 534080 530365 526335 522935
62200 522935 521240 521511 523156 525587 528738 532604 536844 541309 546566 553259 561118 569301 577732 587460
62186 587460 599401 613160 627294 640443 652124 662886 673973 686406 699970 713211 724620
62175 724620 733651 740628 746193 751259 757075 764776 774872 787490 802968 821981 845263 873541 907486
62162 907486 947213 991894 1040203 1091015 1143112 1194194 1240755 1279389 1308241 1327417 1338418
62151 1338418 1343149 1342807 1337197 1325249 1306394 1281374 1251650 1218379 1182160 1143522 1103336 1062851
62139 1062851 1023584 987034 954260 925663 901186 880520 863050 848004 835005 824357 816409
62128 816409 810718 806161 801842 797615 793754 790541 788272 787348 788111 790727 795266 801631 809204 816736 822825
62113 822825 826492 827330 825367 821036 815182 808825 802770 797349 792373 787240 781206 773670 764283 752983
62099 752983 740267 727458 716290 707824 701882 697709 694993 694035 695087 697933 702081 707064 712486 718067
62085 718067 723714 729442 735215 741058 747259 754266 762257 771063 780626 791470 804600 820823 839991
62072 839991 860880 882004 902780 923811 945848 968758 991915 1015488 1040814 1069309 1101352
62061 1101352 1136373 1173635 1212516 1252068 1290622 1325933 1355776 1378501 1393279 1400130 1399946 1394307
62049 1394307 1384628 1371051 1352355 1327298 1295883 1259036 1217464 1171575 1122470 1072211 1022777
62038 1022777 975067 929089 884705 842079 801772 764555 730879 700519 673155 649150 629087
62027 629087 612536 598072 584717 572551 561603 551074 540348 529981 520854 512811 504959 496902
62015 496902 488919 481263 474142 468175 464009 461518 460040 459284 459327 459921 460593 461422 462944 465281 468102 471502
61999 471502 476104 482069 488676 495097 500982 506081 509988 512623 514434 515760 516402 516026 514533 511762 507347
61984 507347 501212 493849 485854 477522 469113 461060 453572 446415 439408 432872 427289 422802 419242 416345
61970 416345 413721 410941 407886 404764 401676 398531 395545 393295 392007 391204 390436 389980 390418 391829 393688
61955 393688 395333 396263 396338 396073 396408 397783 399696 401542 403578 406595 410890 416096 421941 428630 436477
61940 436477 445570 455906 467535 480393 494114 508119 521964 535731 550006 565172 580661 595286
61928 595286 608492 620875 633187 645161 655683 663806 669227 672044 672548 671188 668351 664212 658983
61915 658983 653156 647234 641489 636322 632597 631187 632321 635749 641416 649490 659770 671454 683541
61902 683541 695222 705950 715431 723467 729535 732679 732162 728142 721445 712833 702791 691757 680046
61889 680046 667703 654950 642672 631848 622476 613617 604585 595519 586724 578100 569520 561187 553129
61876 553129 544720 535222 524643 513769 503502 494448 486960 481169 476907 473847 471682 470109 468839
61863 468839 467892 467808 469274 472466 476943 482214 488236 495347 503970 514539 527528 543185 561242 581067
61849 581067 602257 624847 648879 673985 699634 725553 751535 776943 800771 822174 840546
61838 840546 855100 864927 869670 869684 865402 857067 845461 832300 819295 807129 795917 786427 780148
61825 780148 778160 780472 786507 795709 807531 821174 835520 849167 860653 868892 873323 873395 868241
61812 868241 857347 841383 821762 799440 774775 748565 722465 697995 675622 655081 636112
61801 636112 618520 602002 586535 572750 561399 552379 544557 536638 528135 519553 511778 505253 499752
61788 499752 494849 490418 486464 482686 478696 474631 471100 468405 466189 463998 461776 459635 457553 455621
61774 455621 454236 453672 453654 453645 453336 452600 451274 449426 447683 446779 446723 446787 446409 445866 445891 446860 448539 450522 452653
61755 452653 454920 457205 459406 461742 464517 467392 469316 469700 469382 469809 471235 472306 471616 469085 465594
61740 465594 461871 458269 455173 452913 451344 450011 448741 447753 447218 447088 447338 448025 449025 449981 450644 451196
61724 451196 452215 454261 457329 460610 463076 464493 465621 467228 469226 471152 473112 475642 478730 481631
61710 481631 483692 484819 485015 484054 481922 479152 476361 473699 471006 468162 464979 461061 456268 451195 446761
61695 446761 443303 440334 437151 433410 429153 424632 420216 416247 412778 409603 406542 403621 400966 398672
61681 398672 396771 395193 393742 392263 390826 389587 388462 387178 385645 384051 382483 380772 378873 377160
61667 377160 376058 375472 374840 373735 372278 370964 370206 369999 369984 369941 370198 371331 373383 375711 377778 379731
61651 379731 381882 384001 385659 387053 388842 391202 393640 395863 398252 401200 404458 407403 409668 411258
61637 411258 412359 413219 413961 414368 414120 413301 412322 411308 410063 408743 407881 407456 406584 404634 402083 399735
61621 399735 397627 395329 392834 390367 387721 384647 381643 379432 377726 375438 372215 368893 366285 364271
61607 364271 362335 360250 357857 354815 351047 347017 343196 339632 336242 333074 330034 326787 323272 319898
61593 319898 316968 314345 311990 310293 309411 308719 307473 305738 304054 302397 300086 296787 293112 290066 288139
61578 288139 287040 286173 285274 284603 284518 284905 285229 285132 284738 284386 284332 284738 285511 286024 285512 284051 282776 282721 283731
61559 283731 284880 285614 286053 286451 286945 287797 289340 291555 294012 296307 298383 300365 302256 303804 304650 304721
61543 304721 304512 304679 305221 305427 304904 304284 304458 305417 306386 306931 307314 307826 308444 309279 310701 312691 314482 315269
61525 315269 315107 314810 315088 315997 317088 317822 317832 317001 315485 313708 312291 311757 312097 312647 312606 311754 310575 309712
61507 309712 309442 309670 310194 310825 311361 311661 311774 311936 312324 312745 312662 311676 310026 308445 307464 307004 306720 306500
61489 306500 306388 306197 305641 304849 304418 304766 305604 306302 306708 307382 308960 311400 314028 316273 318198 320266 322758
61472 322758 325560 328312 330533 331749 331825 331152 330244 329211 327964 326859 326556 327138 327897 328313 328760 329823
61456 329823 331352 332696 333602 334318 334946 335262 335234 335215 335530 336159 336921 337689 338359 338786 338854 338476 337655 336700 336224
61437 336224 336588 337441 338150 338681 339736 341984 345381 349228 352596 354769 355642 355784 355864 355982 355800 355288 354935
61420 354935 355228 356233 357779 359629 361357 362487 362986 363367 364064 364969 365735 366272 366668 366901 366912 366784 366528
61403 366528 365822 364339 362277 360342 359132 358668 358467 357923 356715 355033 353421 352265 351499 350947 350788 351411
61387 351411 352818 354423 355521 355807 355434 354771 354213 354013 354171 354510 354974 355814 357404 359891 362989 366073
61371 366073 368554 370353 372006 374103 376520 378503 379612 380320 381381 382848 384165 385086 385999 387320 389071
61356 389071 391307 394425 398602 403235 407524 411600 416658 423812 433008 443022 452357 460156 466478 471793
61342 471793 476243 479504 481429 482567 483812 485721 488368 491581 494952 497865 499989 501601 503016 503872
61328 503872 503519 501953 499705 496858 492925 487915 482776 478485 475286 473088 471975 471814 471947 471869 471913 472737
61312 472737 474466 476858 480077 484719 491130 499111 508208 517990 528206 539048 551141 564860 579581
61299 579581 593809 605952 614893 620176 622015 621061 617896 612849 606329 598998 591414 583855 576668 570279
61285 570279 564581 558861 552786 546934 541804 536890 531520 526157 521977 519420 518077 517783 518763 520676 522576
61270 522576 524138 526076 528928 532239 535373 538426 541724 544914 547314 549024 551166 554987 560973 568750
61256 568750 577559 586699 595559 603358 609254 613014 615396 617396 619205 620342 620694 620780 620884 620591 619490
61241 619490 617792 615877 613636 610743 607273 603638 600068 596533 593049 589780 586836 584234 582079 580640
61227 580640 580257 581162 583334 586461 590141 594151 598406 602755 607005 611163 615460 620114 625195 630674 636374
61212 636374 641920 647005 651702 656296 660806 664885 668157 670457 671842 672599 673238 674244 675934 678663 682930
61197 682930 688950 696379 704872 714669 726183 739292 753596 769063 785553 801813 815859 826658
61185 826658 834700 840812 845181 847901 849598 850922 851907 852348 852324 851858 850543 848040 844607 840648 836099
61170 836099 830830 825315 820240 815506 810192 803515 795455 786439 776847 766867 756507 745606 734040
61157 734040 721995 709938 698255 686981 675924 665093 655064 646827 641079 637703 636115 635956 637036
61144 637036 638612 639231 637559 633186 626599 618725 610575 602907 595936 589562 583900 579279 575703 572764
61130 572764 570293 568669 568317 569308 571672 575648 581250 587944 595173 603047 612238 623419 636996 653107
61116 653107 671523 691681 713043 735365 758578 782627 807539 833375 859965 886885 913733
61105 913733 940240 966144 991264 1015597 1038868 1060026 1077775 1091681 1102171 1109354 1112580 1111417
61093 1111417 1106371 1098211 1087209 1073492 1057657 1040511 1022546 1004022 985155 965918 946114 926054
61081 926054 906696 888698 871763 855258 839006 823136 807740 793228 780494 770105 761697 754628
61069 754628 748855 744707 742251 741413 742223 744417 747211 750123 753620 758452 764768 772423 781606 792464
61055 792464 804518 817217 830774 845782 862354 880277 899609 920407 942255 964872 988877
61044 988877 1015191 1043928 1074634 1107304 1142275 1179406 1218207 1258701 1301365 1346398 1393752
61033 1393752 1443650 1496288 1551300 1608359 1667995 1730890 1796586 1863834 1931991 2001055 2070576
61022 2070576 2139828 2209231 2280579 2355786 2436253 2523291 2617928 2720034 2828622 2943272 3064757
61011 3064757 3194917 3337462 3498994 3688088 3913646 4185820 4518562 4929981 5441332
61002 5441332 6079269 6879967 7888029 9149334 10703857 12574062 14732083 17048874
60994 17048874 19272511 21089738 22260191 22734445 22668035 22332312 22002277 21887306 22096923
60985 22096923 22604417 23219588 23627918 23515885 22714257 21260360 19347366 17217928 15080005
60976 15080005 13074642 11278395 9717524 8385543 7260623 6316988 5528694 4870820
60968 4870820 4321610 3863637 3482220 3163488 2894550 2664634 2465387 2290556 2135821
60959 2135821 1998306 1875629 1765542 1666486 1577921 1499762 1431696 1373004 1322506 1278439 1238734
60948 1238734 1201594 1165685 1130070 1094603 1060249 1028293 999013 971705 946106 922929 902605
60937 902605 884206 866258 848186 830288 812636 794860 776995 759771 743688 728236 712471
60926 712471 696180 680155 665432 652599 641810 633023 625873 619570 613318 606980 601085 596113 591934
60913 591934 587976 583765 579292 575087 572005 570622 570604 570852 570509 569719 569255 569603 570697 572380 574682 577552
60897 577552 580658 583679 586585 589394 591710 592867 592598 591361 589719 587530 584035 578747 571943 564199
60883 564199 555810 546859 537579 528303 519211 510400 502011 494097 486594 479675 473762 468800 463884 458216
60869 458216 452203 446985 443092 440288 438516 438080 438768 439774 440805 442463 445135 448239 451073 453650 456134
60854 456134 458099 459149 459874 461392 464061 467238 470178 472691 475043 477643 480688 483759 485924 486658 486424
60839 486424 486005 485522 484558 483017 481226 479299 476973 474096 470835 467331 463605 459883 456604 453917 451469
60824 451469 448896 446335 444250 442791 441497 439731 437420 435166 433480 432082 430261 427754 424778 421273
60810 421273 416810 411514 406442 402578 399846 397468 394889 391898 388315 384136 379763 375598 371586 367556
60796 367556 363706 360326 357357 354743 352900 352228 352378 352649 352927 353538 354262 354296 353354 352253 352173 353689 356534
60779 356534 359856 362665 364478 365652 366840 368204 369563 371090 373206 375817 378366 380801 383777 387558
60765 387558 391377 394353 396597 398832 401242 403362 405036 406805 409054 411128 411745 410280 407356 404042
60751 404042 400745 397188 393288 389543 386465 384133 382633 382454 383929 386425 388576 389291 388306 385931 382668
60736 382668 378918 374637 369355 362927 356167 350305 345827 342250 338985 335984 333511 331732 330661 330185
60722 330185 330015 329883 329777 329766 329666 329256 328750 328679 329260 330199 331060 331464 331129 330220 329613 330196 331849 333648 335120
60703 335120 336651 338540 340441 342177 344430 347963 352466 356759 360010 362296 364130 365866 367559 369035
60689 369035 370097 370866 371807 373156 374482 375190 375416 376015 377522 379421 380713 381030 380922 381113 381799 382760 383839
60672 383839 385000 386031 386554 386417 385766 384698 383098 380957 378497 375807 372679 369051 365339 362042 359347
60657 359347 357379 356469 356656 357198 357181 356590 356308 357082 358913 361369 364062 366767 369480 372298 374903 376339
60641 376339 375840 373866 371744 370259 369087 367635 365790 363691 361378 358992 356890 355239 353802 352318
60627 352318 350849 349618 348819 348664 349232 350130 350758 351057 351579 352600 353576 353785 353179 352354 351902 352018 352484 352863
60609 352863 352916 352959 353536 354725 356103 357393 358672 359901 360828 361532 362501 363847 364939 365216 364975 364986 365657
60592 365657 366841 368147 369126 369501 369538 369887 370832 372047 373219 374360 375270 375408 374787 374393 375081 376536 377974
60575 377974 379360 381166 383378 385724 388725 393469 400245 408300 417172 427507 440116 454773 470326
60562 470326 485537 499412 511050 519677 524875 526625 525149 520803 514058 505536 496098 486752 478304
60549 478304 471244 466113 463700 464441 467695 472115 476854 482080 488336 495865 504752 515382 528325 543835
60535 543835 561599 580864 600724 620313 638700 654590 666350 672802 674140 671798 667254 661126
60523 661126 653456 644566 635254 626251 617698 609263 600721 592442 585302 579999 576423 573791 571469 569543
60509 569543 568499 568496 569236 570637 573382 578574 586882 598326 612908 631110 653531 680309 711303 746657
60495 746657 786665 831056 878939 929487 981968 1034676 1084466 1128091 1163883 1191591 1210750
60484 1210750 1219969 1217886 1204242 1179803 1145735 1103489 1055029 1002721 948834 895146 842906 793118
60472 793118 746902 705456 669397 638135 610291 584943 562227 542549 525519 510117 495857
60461 495857 483289 473074 464779 457031 448895 440795 433839 428445 424029 420003 416582 414262 412830 411340
60447 411340 409047 406034 402892 400095 397844 396219 395255 394844 394686 394283 393112 391053 388745 387265 387182 387945
60431 387945 388398 387903 386820 385937 385604 385520 385166 384262 382815 380965 378932 377075 375842 375584 376347 377772 379270
60414 379270 380424 381317 382375 383848 385549 387189 388805 390647 392708 394607 396033 397167 398601 400852
60400 400852 403921 407259 410195 412474 414269 415691 416546 416799 416978 417728 419102 420739 422622 425117 428200
60385 428200 431218 433664 435776 438040 440523 442957 445160 446988 448210 448864 449601 451248 454022 457436 460843
60370 460843 463814 466161 467959 469539 471172 472768 474091 475238 476619 478478 480611 482606 484269 485902
60356 485902 488247 492040 497426 503970 511307 519528 528698 538356 547843 556910 565533 573290 579423 583448
60342 583448 585242 584560 581114 575288 568266 561179 554512 548501 543528 539692 536402 532992 529554 526590
60328 526590 523942 520681 516248 511181 506445 502369 498642 495057 491770 488839 486037 483319 481199 480370
60314 480370 481105 483277 486853 492048 499023 507730 518173 530612 545264 561866 579659 597853 616013
60301 616013 633858 650579 664492 673693 677231 675473 669190 658608 643690 625113 604476 583513
60289 583513 563486 545263 529430 516141 505258 496856 491269 488489 487845 488438 489538 490400 490247 488811
60275 488811 486633 484457 482574 481027 480015 479556 478991 477415 474665 471458 468533 465997 463538 460927 458194
60260 458194 455488 452935 450580 448451 446665 445342 444430 443777 443349 443094 442598 441354 439633 438615 439215 441068
60244 441068 443064 444668 446265 448420 451175 454061 456416 457822 458517 459251 460449 461713 462424 462548 462461 462333
60228 462333 462235 462514 463377 464252 464374 463994 464223 465479 466861 467520 468039 469867 473665 478688 483738 488284 492658
60211 492658 497419 502729 508325 513987 519874 526366 533711 541942 550936 560379 569785 578731 587007 594506
60197 594506 601300 607940 615204 623108 630553 636427 640734 644096 646545 647642 647580 647222 646903 646015 644017
60182 644017 641080 637354 632361 625703 617959 610260 603190 596532 589987 583684 577978 572948 568236 563380
60168 563380 558321 553477 549254 545688 542743 540601 539296 538349 537330 536535 536461 536793 536715 536194 536096 536859 537925
60151 537925 538769 539639 540792 541730 541827 541201 540384 539563 538711 538189 538616 540296 543094 546699 550725 554856 559209
60134 559209 564239 570139 576663 583697 591405 599486 606927 613020 618082 622703 626841 630283 633436 636863
60120 636863 640460 643891 647458 651672 656182 660131 663443 666830 670458 673519 675347 676177 676557 676769 677112
60105 677112 678040 679530 680735 680710 679171 676356 672571 668192 663677 659160 654282 648775 642997 637617 632981
60090 632981 629060 625830 623302 621281 619387 617388 615343 613464 611942 610912 610470 610655 611383 612389 613329
60075 613329 614010 614373 614185 612944 610413 607029 603370 599318 594180 587660 580212 572320 563961 555115 546354
60060 546354 538466 531690 525663 520010 514699 509934 505989 503096 501247 500114 499291 498601 498157 498286 499471
60045 499471 502048 505782 510016 514510 519788 526247 533238 539666 545379 551260 557836 564485 570366 575509
60031 575509 580457 585239 589262 592057 593562 593767 592639 590433 587566 584062 579472 573515 566388 558322
60017 558322 549153 538621 526853 514361 501857 490280 480648 473457 468238 463946 459693 455064 450062
60004 450062 445145 441137 438689 437782 437830 438138 438130 437512 436540 435885 435857 436065 436226 436911 438792 441485 443938 445906
59986 445906 448185 451299 454818 458229 461680 465443 469347 473110 476655 479642 481315 481305 480084 478207 475687
59971 475687 472599 469577 466982 464191 460575 456732 453800 451937 450499 449456 449464 450546 451853 452983 454538
59956 454538 456973 459805 462424 464892 467357 469364 470393 470627 470585 470373 469873 469318 469085 469121 469119 469078 469192 469329
59938 469329 469160 468712 468302 467891 466976 465252 463079 461153 459959 459597 459983 461141 463350 466924 471747 477173
59922 477173 482560 487741 492730 497191 500542 502499 503146 502564 500907 498815 497245 496613 496489 496405 496643 497874
59906 497874 500186 502866 505150 506940 508710 510875 513321 515509 516993 517824 518417 519107 519959 520998 522408
59891 522408 524457 527360 531258 536139 541710 547569 553619 560090 567036 574124 581103 588176 595524 602755
59877 602755 609319 615347 621505 628001 634206 639386 643292 645803 646441 644711 640735 635257 629148 623063
59863 623063 617359 612047 606902 601821 596991 592592 588622 585226 582905 582012 582250 583079 584580 587521 592538
59848 592538 599599 608230 617821 627473 635826 641415 643412 642110 638805 635134 632332 631010 631424 633547
59834 633547 636695 639408 640167 638264 633938 627979 621533 615905 611908 609316 607356 605633 604130 602455
59820 602455 599821 595960 591470 586936 582135 576476 569885 562924 556258 550308 545258 541055 537459 534207
59806 534207 531086 527899 524595 521494 519061 517377 516094 514965 514065 513420 512790 511969 510908 509384 507039
59791 507039 504036 501233 499327 498167 497285 496704 496701 497042 497096 496685 496319 496532 497350 498470 499634 500678 501406
59774 501406 501632 501311 500674 500194 500314 501121 502368 503770 505130 506271 507231 508518 510701 513593 516315 518423
59758 518423 520490 523207 526398 529465 532416 535790 539797 544221 549111 554907 561738 569097 576412 583566
59744 583566 590731 598004 605391 612846 620197 627118 633336 638786 643525 647569 650754 652755 653389 653012 652410
59729 652410 652117 652037 651825 651354 650592 649392 647819 646404 645584 645031 644000 642215 639992 637588 634931 631995
59713 631995 628951 625850 622536 618948 615241 611638 608494 606413 605803 606191 606459 605944 605036 604563 604839 605442
59697 605442 605680 605204 604366 604010 604674 606037 607376 608484 609675 610898 611453 610877 609654 608616 607936 607150
59681 607150 606122 605456 605767 606755 607313 606568 604617 602126 599431 596303 592538 588308 583779 578792 573247
59666 573247 567540 562323 557964 554481 551719 549295 546701 543972 542019 541774 543102 544997 546707 548194
59652 548194 549604 551002 552649 554958 557958 561297 564876 568958 573400 577236 579304 579019 576458 572119
59638 572119 566833 561506 556561 551754 546732 541600 536915 533333 531337 530942 531542 532287 532712 532806 532463 531353
59622 531353 529438 527196 525067 522997 520714 518161 515403 512395 509114 505720 502355 498989 495674 492828
59608 492828 491062 490791 492054 494511 497570 500739 503897 507040 509781 511498 512061 512029 511917 511629 510848 509732
59592 509732 508952 509203 510769 513355 516159 518302 519360 519345 518294 516282 513844 511857 510689 509850 508747
59577 508747 507392 506001 504314 501838 498672 495595 493307 491842 490721 489518 488255 487355 487152 487420 487560
59562 487560 487322 487023 486994 487126 487212 487373 487753 488063 487835 487059 486187 485576 485281 485397 486219 487912 490269 492952
59544 492952 495820 498889 502144 505649 509860 515601 523568 534087 547548 564729 585807 608596 628338
59531 628338 640222 642516 637172 627724 617060 606885 598190 591542 587174 585158 585401 587448 590642 594605
59517 594605 599187 603839 607518 609514 609913 609001 606634 602635 597420 591650 585480 578664 571311 563963 556858
59502 556858 549564 541660 533530 526194 520310 515556 511119 506729 502973 500506 499230 498479 497752 496877 495686
59487 495686 494128 492750 492519 493944 496702 500108 503544 506429 508490 510326 513103 517295 522176 526906
59473 526906 531559 536594 541748 546145 549306 551532 553394 555285 557403 559732 562014 563976 565524 566587
59459 566587 566998 566820 566590 566951 568201 570402 573666 578022 583213 588944 595224 602222 609965 618334 627051
59444 627051 635391 642224 646703 648714 648413 645760 640874 634486 627415 619883 611894 604104 597582 592716
59430 592716 588933 585597 582640 580244 578472 577461 577569 579033 581727 585575 591027 598886 609637 623090
59416 623090 638724 656372 676449 699419 725260 753760 785042 818751 852120 879529 895216
59405 895216 896943 887013 870162 851001 833045 818794 809845 807105 811028 821055 834283 845213
59393 845213 847917 839266 820328 794956 767351 740725 717217 697923 682748 670813 661498 654883
59381 654883 650975 648927 647610 646756 646944 648449 650743 653152 655445 657609 659642 661800 664421 667168 668998
59366 668998 669283 668534 667623 666849 666229 666136 666955 668446 670119 672009 674463 677436 680658 684308 688889 694519
59350 694519 701025 708592 717622 727950 738966 750658 763810 778843 794950 810741 825391 838953
59338 838953 851925 864811 877705 889896 899929 906444 909082 908490 905468 900227 892524 882394 870444
59325 870444 857300 843086 827849 812335 797717 784440 771954 759775 748231 737768 728147 718891
59313 718891 710028 701777 693893 686049 678588 672125 666594 661434 656631 652912 650971 651171 654036 660314
59299 660314 670331 683685 699364 715383 728326 734332 731366 720411 704331 685947 667184 649171
59287 649171 632419 617095 603578 592669 584935 579973 576606 573867 571657 570492 570733 572199 574555
59274 574555 577944 583014 590320 599926 611597 624951 639322 653943 668645 683921 699893 715573
59262 715573 729621 741484 751241 758685 763228 764548 762709 757823 750234 740984 731407 722245 713570 705426
59248 705426 697961 691111 684833 679544 675694 673033 671060 670064 670840 673357 676581 679797 683230 687178 691457
59233 691457 696105 701757 708747 716457 724016 731079 737379 742062 744127 743296 740029 734863 728065 719693
59219 719693 709798 698797 687686 677473 668255 659345 650420 641969 634376 627281 620252 613528 607557
59206 607557 602291 597518 593458 590401 588004 585568 582957 580761 579588 579550 580367 581611 582850 583830 584578
59191 584578 585239 585894 586588 587385 588264 589120 589962 590969 592402 594644 598212 603241 608969 614231 618681 623038
59175 623038 627945 633087 637752 641824 645803 650132 654831 659595 663950 667576 670760 674310 678772 683909
59161 683909 689077 693776 697588 700019 700870 700550 699622 698104 695463 691205 685194 677501 668252 657685 646284
59146 646284 634833 624201 614811 606262 597706 588733 579760 571634 565016 559970 555764 551193 545621 539737
59132 539737 534823 531266 528400 525843 524212 524172 525446 527292 529458 532205 535726 540051 545251 551316 558056
59117 558056 565413 573607 582615 591867 600869 609917 619727 630506 641642 652199 661452 669172 675736
59104 675736 681856 687977 694041 699868 705417 710507 714682 717622 719414 720167 719709 717973 715348 712351 709312
59089 709312 706668 705131 704973 705324 704732 702456 698977 695353 692295 689635 686288 680927 673133 663919 654871
59074 654871 646823 639522 632394 625238 618171 611255 604451 597888 592002 587214 583431 580074 576806 573955
59060 573955 571872 570064 567548 563993 560057 556597 554135 553029 553275 553910 553447 551518 549492 548842 549306
59045 549306 549289 547797 545427 543566 543100 543809 544684 544817 544181 543533 543561 544349 545594 546879 547728 547957 548180 549433
59027 549433 552072 555592 559731 565063 572089 580455 589672 600090 612472 626888 642568 658536 673862
59014 673862 687702 699615 709652 717640 722779 724465 723252 720388 716697 712408 707872 703754 700595
59001 700595 698669 698217 699385 701951 705446 709479 713748 717975 722089 726158 729876 732518 733813 734438 735177
58986 735177 735914 735975 735104 733473 731013 727437 722893 718083 713732 710308 708094 707162 707406 708934 712194 717410
58970 717410 724186 732049 741014 751097 761664 771923 781888 792264 803439 815076 826605 837589
58958 837589 847642 856415 863643 868974 871887 872032 869359 863659 854388 841457 825862 809046 791843
58945 791843 774518 757479 741274 726072 711747 698480 686770 676855 668483 661220 654783 649234
58933 649234 644998 642373 640874 639527 638038 637060 636983 637258 637452 638145 639869 641921 643246 643985 644994 646148
58917 646148 646369 645287 643696 642258 640759 638950 637232 636148 635822 636138 637032 638505 640792 644500 650094
58902 650094 657348 665810 675635 687215 700143 713334 726166 738775 751224 763207 774724 786258
58890 786258 798039 809892 822109 835853 852214 871201 891904 913294 934597 955177 974388
58879 974388 991512 1005887 1017183 1025430 1030651 1032686 1031524 1027370 1020164 1009563 995873 980462 964644
58866 964644 948721 932777 917802 904940 894004 883825 873918 864728 856242 847519 837851 827530
58854 827530 817128 806695 795957 784776 773317 762134 751970 742922 734048 724529 715006 706914
58842 706914 700597 695015 689262 683402 677701 671984 666043 659917 653577 646963 640406 634321 628505 622474
58828 622474 616447 611133 606559 602134 597951 595014 593958 594478 596178 598972 602385 605536 608218 611107
58814 611107 614560 618199 621993 626582 631933 636767 640160 642833 645957 649344 651766 652599 652282 651407 650135
58799 650135 648464 646518 644447 642193 639313 635194 629788 623961 618528 613161 607070 600713 595738 592991
58785 592991 591619 590510 589591 589194 589238 589849 591875 595835 600972 606245 611734 618136 625239 631718 636252
58770 636252 638069 636652 631797 624120 614960 605661 597163 590053 584508 580095 575983 571540 566727 562113
58756 562113 558579 556827 556987 558663 561261 564192 567053 569970 573505 577758 581826 584775 586853 588975
58742 588975 591234 592983 594454 597106 601927 608253 614770 620934 626946 632993 639074 645098 650777 655871
58728 655871 660739 666027 671601 676552 680551 684396 688773 693300 697334 700918 704299 707185 709392 711754
58714 711754 715569 721339 728582 736604 744891 752943 760298 766748 772272 776800 780136 781880 781408 778260
58700 778260 772469 764121 752785 738109 720989 703245 685909 668631 650981 633432 616701 601059
58688 601059 586825 574765 565264 557720 551295 545705 540768 535935 530948 526426 523036 520510 518088 515571
58674 515571 513318 511541 510230 509580 509878 511107 513025 515577 519031 523847 530538 539373 550111 562190
58660 562190 575034 587731 598666 606276 610215 611145 609477 605241 599169 592780 586938 581196 574927 568331
58646 568331 561990 556273 551457 547635 544133 539859 534566 529025 523781 518771 514381 511555 510323 509416
58632 509416 508065 507135 507682 509407 511382 513339 515366 517126 518336 519382 520743 522451 524683 528049 532566
58617 532566 537178 541044 544539 548309 552252 556263 561045 567207 574270 581490 588846 596318 602975 607911
58603 607911 611506 614748 617805 620172 621683 622502 622606 622152 621835 622038 622130 621420 620319 619809 620228 621328 622986
58586 622986 625182 627831 631275 636389 643552 652153 661547 671719 682416 692603 701511 709348 716291
58573 716291 721845 726013 730003 734779 739954 745087 751033 758893 768701 780360 794788 812735 833373
58560 833373 855527 879501 906220 935226 964888 993934 1021329 1045309 1064134 1077502 1086001 1089700
58548 1089700 1088514 1083465 1076247 1067964 1059374 1051658 1045542 1040195 1034329 1027787 1020727 1011913 999398 982539
58534 982539 961966 938168 911735 884580 859207 836720 816733 798984 783806 771338 761517 754485
58522 754485 749783 745681 740655 735103 730314 726361 722410 718487 715299 712733 710146 707743 706069 704535
58508 704535 702103 699147 696966 695721 694465 692943 691706 690690 689368 688114 687788 688183 688509 689116 690884
58493 690884 693127 694028 693229 692175 691826 691874 692367 694242 697807 702281 707267 713314 720777 729442 739457
58478 739457 751296 764701 778974 794405 811982 831599 851769 871024 888258 901933 910541 913966
58466 913966 913041 907940 898540 886147 873156 860956 849654 839691 832053 826932 823854 823150 825766 831708
58452 831708 840324 851844 866815 884139 901495 917590 932094 943637 950113 951059 947641 940329 928848
58439 928848 914563 900425 887985 876613 866079 857595 851692 847357 844066 842641 843277 844773 846590
58426 846590 849797 855150 862055 870191 880279 892302 904698 916237 927085 937242 945595 951260 954308
58413 954308 954520 951145 944586 936637 928358 919397 909906 901174 893560 885707 876778 867703 859414 851680
58399 851680 844615 839470 836791 835425 834480 834758 837172 841229 846009 851226 856416 860545 863403 866116 869482
58384 869482 873068 876459 879922 883306 885964 888442 892547 899027 906766 914852 923632 933105 942168 950336
58370 950336 958372 966450 973636 980077 987662 997350 1007708 1017396 1027384 1039314 1053146 1067814 1082967
58357 1082967 1098869 1115547 1132936 1150906 1168499 1184174 1197227 1207901 1216049 1221149 1223733 1225210
58345 1225210 1226267 1227131 1229145 1233857 1240570 1247152 1253412 1261192 1271055 1281647 1292653 1305447 1320204
58332 1320204 1335333 1350540 1367504 1386633 1406125 1425224 1445327 1466657 1486850 1504221 1519595
58321 1519595 1533547 1544807 1552980 1560060 1567527 1574528 1580400 1586375 1593344 1600552 1607999 1617447 1629577
58308 1629577 1642780 1656100 1670615 1686659 1702739 1718660 1736621 1757542 1779319 1800357 1821802
58297 1821802 1844705 1868151 1891778 1916836 1943086 1968119 1991587 2016550 2044683 2073693 2101586
58286 2101586 2129751 2159576 2189719 2219193 2249564 2281570 2313193 2343613 2375507 2410902 2448387
58275 2448387 2486885 2528271 2573596 2620764 2668777 2720142 2776062 2833424 2889779 2947075 3007120
58264 3007120 3067706 3127049 3187881 3253202 3321837 3392053 3465572 3544097 3625758 3708935 3795651
58253 3795651 3887265 3980836 4073679 4167453 4263983 4361576 4459533 4561596 4670573 4784207 4900732
58242 4900732 5023613 5156204 5296839 5444022 5601256 5771635 5952848 6142642 6343767
58233 6343767 6558378 6783517 7017763 7266307 7533541 7816911 8114251 8430558 8771008
58224 8771008 9134177 9519171 9932355 10379710 10860020 11373379 11928577 12533797 13188286
58215 13188286 13892275 14656851 15494857 16411152 17411964 18514597 19737550 21091521 22591952
58206 22591952 24270237 26161137 28291620 30695956 33430341 36561363 40158914 44321468
58198 44321468 49198532 54979254 61888404 70225717 80401114 92922893 108387743 127506423
58190 127506423 151081759 179865968 214340442 254394172 298724528 344069637 385045312
58183 385045312 415398480 430346641 428444028 411659577 383915623 349442500 311898367
58176 311898367 274155914 238276901 205522912 176483886 151284037 129742147 111483110
58169 111483110 96059878 83055228 72103959 62872469 55066259 48451518 42841971
58162 42841971 38070119 33988913 30487678 27481401 24888367 22633209 20662028 18935706
58154 18935706 17413421 16056508 14841171 13752470 12771026 11877977 11066435 10334901 9674160
58145 9674160 9071802 8523934 8030747 7585295 7177514 6804756 6467656 6159459 5869368
58136 5869368 5593165 5331709 5082823 4843531 4616813 4407365 4213508 4030738 3859679
58127 3859679 3702831 3556999 3416771 3282486 3157447 3040428 2928144 2822032 2725290 2636030
58117 2636030 2550286 2469022 2395206 2326744 2259273 2193509 2132943 2076533 2020429 1964877 1912717
58106 1912717 1862893 1811993 1760674 1712336 1666817 1621346 1576356 1534496 1495216 1456043 1417929
58095 1417929 1383703 1352370 1320469 1288141 1258478 1231812 1205806 1180358 1157320 1136140 1114698
58084 1114698 1093663 1075260 1058465 1040230 1020737 1002737 986324 969008 950480 932740 915926
58073 915926 898394 880631 864834 850826 836400 821444 807879 795858 783808 771803 761252
58062 761252 751660 741351 730898 722307 715405 708466 701527 695388 688279 677617 664509 652501 642366
58049 642366 632066 621444 612729 606460 600875 595542 591835 589632 587072 583739 580785 577846 573280 567474
58035 567474 562501 558376 552961 545650 537878 529912 520502 509890 499889 490759 481171 471377 463148 456354
58021 456354 448873 440282 432508 426461 421153 416486 413736 412691 411344 409058 407165 405917 403784 400468
58007 400468 397813 396941 396947 396990 397223 397244 396178 394729 394589 395466 395300 393742 392732 393238 394219 395260 397310 400103
57989 400103 401735 401720 401841 403066 404141 404174 403993 403934 402692 399545 395563 391594 387233 382683 379402 377785
57973 377785 376284 373868 371422 369759 368242 366393 364896 363950 362490 360162 358268 357695 357557 356988 356645
57958 356645 357372 358807 360270 361652 362586 362138 360153 357647 355266 352726 350215 348734 348353 347769 346363
57943 346363 345188 345232 346173 347637 350188 354202 359120 364694 371739 380773 390952 401027 410387 418680
57929 418680 425494 430944 435603 439443 441670 441789 439880 435897 429830 422482 414816 406730 397774 388731
57915 388731 380852 373838 366488 359158 353532 349940 347011 344139 342154 341218 340243 338899 338118 338116 337918 337308
57899 337308 337177 337435 336852 335592 335667 337986 341140 344025 347454 352093 357004 361466 366210 371511 376034
57884 376034 379105 382281 387030 392374 396430 398901 400554 401539 401732 401585 401206 399633 396370 392598 389585
57869 389585 386880 383285 378689 373777 368852 364093 360167 357481 355511 353720 352377 351823 351863 352614 354901
57854 354901 358990 363898 368702 373547 378659 383458 387409 390755 393711 395958 397487 398743 399430 398500 395975
57839 395975 393350 391546 389922 388053 386818 386750 386950 386734 386789 387508 387756 386693 385414 385290 385936 386286 386518
57822 386518 387389 388656 389632 390425 391320 391871 391898 392459 394398 396721 397647 396478 393282 387773 379916 370806
57806 370806 361551 352006 341831 331990 323785 317085 310784 304404 298099 291791 285549 280153 276086 272628
57792 272628 269033 265827 263830 262777 262143 262424 264206 266809 269302 272122 276173 280999 285473 289741 294876
57777 294876 301023 307521 314543 322911 332338 341364 349189 356341 363420 370238 376278 381076 384118 385190
57763 385190 384800 383655 381930 379626 377232 375347 374171 373901 374948 377012 378788 379481 379842 380797 382040
57748 382040 383078 384627 387463 390758 393173 395009 397573 400819 403237 403859 402929 400874 398094 395559 394004
57733 394004 392594 389880 386087 383020 381676 381318 381021 380679 380265 379437 378301 377480 377158 376972 376937 377416 378063
57716 378063 377980 377177 376806 377656 379337 381250 383346 385631 387776 389619 391310 392687 393254 393059 392889 393332
57700 393332 394193 395001 395424 395072 393588 391241 388863 387021 385584 384104 382164 379441 376084 372997 371075
57685 371075 370098 369011 367336 365705 364944 365295 366761 369618 374246 380709 388785 398440 410400 426373
57671 426373 448412 477863 515216 560999 616079 680242 750322 819610 878717 917743 929826
57660 929826 914458 877376 826740 769578 711465 657226 609866 569473 534754 505438 482011
57649 482011 463731 448629 435442 424212 414987 407270 400912 396313 393416 391481 390072 389409 389636 390524
57635 390524 392012 394171 396565 398465 399813 401254 403095 404882 406020 406193 405319 403756 402409 401875 401648
57620 401648 400954 400080 399919 400379 400345 399288 397982 397471 398110 399696 401800 403903 405802 407836 410194 412308
57604 412308 413692 414958 417001 419446 420979 421140 420758 420721 421309 422603 424422 425894 426224 425930 426205 427089
57588 427089 427461 426910 426356 426571 427282 428067 428988 429967 430626 431144 432297 434211 436040 437240 438176 439122 439745
57571 439745 440090 440962 442632 444098 444438 444151 444384 445475 447062 449097 451832 455082 458281 461242 464355
57556 464355 467955 471828 475463 478717 482188 486770 492640 498898 504394 508593 511345 512388 511774 510442
57542 510442 509554 509451 509917 511099 513255 515874 518135 520202 523005 526725 530482 533657 536505 539359 542168
57527 542168 545031 548232 551519 554186 556076 557669 559058 559788 559910 560260 561318 562610 563427 563499 562866 562036
57511 562036 562260 564583 568354 571690 573683 575173 577192 579837 583041 587206 592443 598176 604079 610481
57497 610481 617393 624149 630534 637241 644556 651620 657757 663552 669810 676315 682522 688677 695352 702423
57483 702423 709375 716049 722364 727900 732579 737228 742624 748355 753399 757436 760830 763730 765985 767773
57469 767773 769587 771711 774223 777379 781443 786268 791400 796539 801665 806995 813018 820193 828328 836556
57455 836556 844206 851364 858436 865621 873039 880909 889245 897733 906156 914543 922813 930783 938694 947144
57441 947144 956274 965589 974751 983966 993355 1002578 1011398 1020035 1028718 1037437 1046289 1055422 1064463 1072770
57427 1072770 1080468 1088446 1097056 1105726 1114213 1123298 1133676 1144954 1156248 1167095 1177264 1186501 1195090
57414 1195090 1203986 1213766 1224015 1234260 1244805 1256104 1267915 1279701 1291269 1302568 1313485 1324313
57402 1324313 1335719 1347752 1359658 1371154 1383009 1395744 1408637 1420828 1432648 1444973 1457965
57391 1457965 1471320 1485188 1499904 1515282 1531012 1547373 1564806 1583188 1602143 1621541 1641018
57380 1641018 1659664 1676982 1693641 1710467 1727249 1743373 1759039 1774828 1790485 1805213 1818995
57369 1818995 1832653 1846667 1860734 1874508 1888154 1902174 1917062 1932968 1949411 1965723 1982048
57358 1982048 1999340 2017998 2037265 2056433 2075795 2095672 2115430 2134519 2153778 2174573 2197075
57347 2197075 2220470 2244361 2268863 2293640 2318073 2342206 2366510 2390837 2414582 2437726 2460810
57336 2460810 2484019 2507195 2530620 2554774 2579439 2603979 2628499 2653728 2679694 2705470 2730448
57325 2730448 2755061 2780016 2805488 2831251 2857099 2882899 2908616 2934309 2959904 2985186 3010363
57314 3010363 3036205 3063154 3090659 3117993 3145290 3173068 3201160 3228981 3256516 3284187 3311981
57303 3311981 3339676 3367726 3396971 3427503 3458643 3490050 3522046 3554813 3588030 3621357 3654623
57292 3654623 3687535 3719822 3751681 3783610 3815982 3849223 3883933 3920084 3956454 3991803 4026372
57281 4026372 4061411 4097461 4134022 4170682 4207489 4244276 4280621 4316483 4352036 4387013 4421199
57270 4421199 4455451 4491046 4527983 4564963 4601123 4636673 4671780 4706141 4740031 4774525 4810107
57259 4810107 4845994 4881410 4916575 4951895 4987116 5021992 5057082 5093153 5130304 5168252 5206916
57248 5206916 5246073 5284863 5322313 5358175 5392847 5426717 5459921 5492416 5523898 5553860 5582080
57237 5582080 5608901 5634806 5659849 5683686 5706072 5727305 5748353 5770452 5794299 5819605 5845622
57226 5845622 5871947 5898589 5925606 5953165 5981672 6011172 6040867 6069929 6098636 6127950 6158070
57215 6158070 6188247 6218062 6247921 6278033 6307744 6336275 6363504 6389638 6414683 6438650 6461816
57204 6461816 6484471 6506760 6528899 6551111 6573150 6594367 6614341 6632967 6649905 6664702 6677809
57193 6677809 6690847 6705299 6721260 6737776 6754034 6769882 6785515 6801083 6816496 6831399 6845434
57182 6845434 6858552 6870934 6882601 6893410 6903423 6912964 6922330 6931656 6940963 6949945 6957828 6963874 6967997
57169 6967997 6970502 6971272 6969702 6965371 6958302 6948581 6936165 6921110 6903551 6883448 6860674 6835257 6807137
57156 6807137 6775962 6741626 6704782 6666184 6625715 6582785 6537596 6491298 6444971 6399219 6354750
57145 6354750 6312586 6273557 6238257 6207533 6182259 6162443 6147193 6135646 6127203 6120684 6113960 6104779
57133 6104779 6091515 6073128 6049102 6019747 5986037 5948996 5909648 5869578 5830847 5795104 5763190
57122 5763190 5735553 5712421 5693466 5677927 5665191 5654768 5645856 5637783 5631148 5628003 5630818 5641738
57110 5641738 5662712 5695376 5740574 5798693 5870842 5959445 6067818 6199865 6360311 6554766
57100 6554766 6789757 7073604 7417466 7835245 8342834 8958294 9702389 10597365 11664078
57091 11664078 12919444 14374483 16031664 17882034 19904279 22065916 24325096 26633153
57083 26633153 28939143 31194798 33356110 35379659 37213782 38785667 39990736 40698626
57075 40698626 40785406 40179977 38895501 37026283 34717154 32126872 29400581 26654769
57067 26654769 23973604 21413777 19012187 16791505 14763607 12932864 11298601 9855410
57059 9855410 8592947 7497351 6553154 5743811 5051935 4460878 3956251 3525485 3156856
57050 3156856 2839972 2566585 2329836 2123261 1941518 1781411 1640877 1517154 1406912
57041 1406912 1307795 1218818 1139427 1068998 1006962 952542 904566 862180 825529 795323 772232
57030 772232 757120 751161 755321 770801 800139 845291 901911 956225 990336 992100 960267 901971
57018 901971 827591 747359 669298 597816 534073 477949 429227 387344 351393 320851 295498
57007 295498 274541 256703 241405 228968 219446 212096 206174 201474 197777 194500 191238 188105 185320
56994 185320 182856 180582 178313 175826 173359 171966 172722 175597 179719 184721 191158 199590 209747 220392
56980 220392 229343 233826 231814 223409 210581 195680 180525 166402 153961 143091 133643 126254 121788
56967 121788 120129 120337 121861 124840 129398 135732 144816 157913 175101 195193 217161 240473 263579
56954 263579 283163 295728 299537 294747 282552 264872 244207 222847 202177 183008 166179 152397
56942 152397 141747 133902 128823 126947 128692 133973 142301 153378 167607 185892 208868 236366 267320
56929 267320 299432 328613 349696 358801 355272 341103 319029 291750 262323 233803 208046 185408
56917 185408 165695 148795 134361 121698 110346 100415 92193 85777 81097 77920 75808 74469 74068
56904 74068 74741 76030 77369 79071 82128 87007 93198 100032 107356 115350 124238 134324 145849 158753
56890 158753 172943 188850 207308 228811 253156 279510 306198 330470 349086 359471 360441 352403
56878 352403 337388 318535 298707 279506 261736 246263 233762 224289 218030 216090 219551 228041
56866 228041 240443 256879 278867 307594 343348 386755 438922 499296 563778 625263 675553
56855 675553 707263 715908 701847 670101 627657 580725 533967 490849 453663 423464 400550 385007
56843 385007 376849 376208 383593 399706 425036 460191 506501 565588 638253 724174 821895 927187
56831 927187 1030574 1117786 1174535 1192227 1170544 1116336 1040437 953973 865638 781224 704653
56820 704653 638363 582863 537299 501191 474982 458765 451619 452907 463370 484234 516016 558879
56808 558879 613277 678806 752069 825814 889983 933962 949702 934788 893238 833077 762789
56797 762789 689367 618059 552391 494214 444154 402171 367738 340130 319038 304657 296928 295179
56785 295179 298977 308923 326125 351095 383317 421102 460949 497220 523436 534697 529371 509077
56773 509077 477503 438949 397318 355762 316571 280893 248719 219711 194110 172424 154451
56762 154451 139261 126143 114840 104928 95889 87990 82103 78194 74859 70888 66634 63197 60890
56749 60890 59156 57552 56148 55222 55000 55459 56091 56225 55792 55316 54978 54266 52896 51437 50604 50507 50920 51697
56731 51697 52533 52985 53225 54134 56117 58455 60334 61823 63231 64231 64512 64713 65757 67571 69303 70568
56715 70568 71633 72509 72668 71725 69933 68027 66954 67455 69429 71843 73730 75100 76552 78309 80107
56700 80107 81710 82989 83687 83627 83062 82464 82102 82072 82446 83047 83446 83516 83628 83904 83748 82669 81231 80592 81265
56681 81265 82810 84487 85783 86533 87043 87944 89483 91065 91817 91450 90373 89161 88169 87367 86355 84829
56665 84829 83145 81901 80810 78660 74820 70140 65855 62157 58394 54158 49542 44751 40114 36156
56651 36156 33102 30613 28444 26947 26446 26591 26920 27561 28849 30705 33005 36040 39933 44096 48000
56636 48000 51994 56565 61225 65011 67765 70122 72555 75242 78487 82261 85589 87476 88395 89845 92295
56621 92295 94547 95370 94937 94320 94255 94760 95445 95787 95378 94188 92555 90946 89824 89494 89729 89786 89154 88106
56603 88106 87212 86564 85865 85018 84146 83310 82621 82409 82860 83766 84968 86593 88406 89510 89400 88857 89020 89918
56585 89918 90794 91548 92806 94584 95903 95971 95056 93921 93012 92449 92306 92610 93325 94491 96217 98524 101302
56568 101302 104325 107180 109537 111724 114729 119389 125891 134270 144811 157542 171835 186878 201890
56555 201890 215368 224910 228763 227248 222103 214984 207247 200328 195031 190695 186072 180822 175328 169538
56541 169538 163166 156820 151693 148063 145124 142341 139978 138201 136655 135131 133853 132866 131855 130721
56527 130721 129741 129114 128908 129404 130776 132513 133865 134790 135726 136553 136669 136067 135428 135021 134369 133214 132096
56510 132096 131751 132515 134365 136843 138887 139464 138588 137267 136427 136408 137299 138984 140763 141694 141472 140512 139261
56493 139261 138031 137349 137693 138780 139776 140213 140204 139853 139122 138204 137418 136828 136466 136624 137309 137829 137665 137316 137380
56474 137380 137349 136469 135357 135360 136450 137186 136814 136027 135474 134905 134188 133904 134381 135083 135463 135604 135681 135645 135685 136203
56454 136203 137126 138049 139154 140996 143273 144868 145358 145474 145833 146333 147000 148247 149845 150813 150829 150716 151026
56437 151026 151214 150801 150270 150122 149945 149192 148082 147072 146144 145241 144643 144260 143278 141276 139133 138097 138321
56420 138321 138892 138984 138558 138199 138602 139925 141531 142663 143252 143559 143316 142076 140280 138932 138200 137444 136681
56403 136681 136754 137738 138466 138214 137763 138126 139201 140309 141142 141538 141139 139964 138698 137901 137569 137817 139152
56386 139152 141665 144779 148268 152696 158397 164854 171523 178400 185293 191442 196426 200697 204760 208562
56372 208562 212075 215540 218715 220837 221784 222397 223184 223692 223582 223293 223098 222573 221604 220856 220643 220401 219948
56355 219948 220165 221639 223662 225429 227282 229871 232923 235653 237625 238574 238223 236991 236027 235894 236082 236318
56339 236318 237306 239479 242185 244790 247460 250154 252104 253223 254752 257500 260610 263095 265318 267835
56325 267835 270047 271390 272717 274976 277425 278647 278529 277884 276881 275312 273669 272491 271168 268763 265506
56310 265506 262325 259539 257266 256382 257625 260349 263451 266957 271350 276019 279969 283538 287881 293050
56296 293050 298097 302749 307535 312470 317097 321677 326962 332819 338339 343254 348068 352910 357485 362080
56282 362080 367389 373364 379367 385515 392750 401436 410812 420056 429124 438474 448601 459874 472307
56269 472307 485542 499406 514170 529976 546645 564450 584279 606381 629810 653933 679678
56258 679678 708458 740719 776537 816795 862605 914266 971906 1036433 1108839 1189292 1278012
56247 1278012 1376185 1484714 1602800 1728922 1862310 2002036 2145387 2288757 2429536 2565679
56237 2565679 2693898 2809800 2909470 2989710 3047445 3080521 3088835 3073511 3035567 2976642 2900182
56226 2900182 2810186 2709163 2598732 2481560 2361042 2239534 2118435 1999510 1884521 1774021
56216 1774021 1668092 1567817 1474447 1387733 1306778 1231985 1164331 1103170 1046661 993989 945403
56205 945403 900551 858754 820556 786954 757263 729735 704060 681240 661160 642455 624785
56194 624785 609176 595934 584162 573510 564562 557305 550987 545515 541255 537485 532993 528192 524667
56181 524667 522520 520216 517272 515108 514884 516322 518859 522115 525100 526922 528489 531585 536073 540063
56167 540063 543051 546697 552075 558291 564378 570501 576697 582470 588282 595539 604458 613741 622917 633157
56153 633157 645257 658788 673826 691518 712208 735006 760071 789519 825259 867790 917995
56142 917995 978268 1050692 1135398 1231388 1337345 1450710 1567214 1682031 1790402 1887378
56132 1887378 1969229 2036053 2091651 2140305 2184836 2227223 2268242 2305572 2334428 2351432 2356768
56121 2356768 2352511 2340970 2325018 2307285 2287361 2261128 2223670 2171595 2102755 2016604 1916275
56110 1916275 1808359 1699323 1593275 1493373 1402899 1323733 1255647 1198201 1151626 1114924 1085079
56099 1085079 1059422 1037343 1018935 1003627 991007 981241 973839 967579 962302 959111 958261 958649 959843
56086 959843 962643 967143 972359 978315 986234 996050 1005950 1015128 1024762 1035599 1046895 1058396 1070940
56073 1070940 1084398 1097462 1110189 1124277 1140157 1156433 1172781 1190449 1209125 1226494 1242063
56062 1242063 1258311 1276788 1296090 1315115 1335215 1357532 1381086 1405056 1430162 1456244 1481353
56051 1481353 1504773 1528145 1552230 1575525 1597499 1620006 1643902 1667496 1689969 1713016 1737355
56040 1737355 1761089 1783437 1806671 1832376 1859302 1886993 1917953 1953860 1993086 2034291 2078986
56029 2078986 2128047 2179193 2230391 2282330 2335143 2386407 2435131 2484153 2535879 2589209 2643309
56018 2643309 2700598 2763090 2829485 2898670 2972310 3051226 3133271 3217660 3307108 3402675 3501046
56007 3501046 3600219 3703193 3812479 3925731 4040716 4159904 4286058 4418008 4554876 4699718
55997 4699718 4854701 5017575 5187227 5367637 5561827 5767249 5981875 6209312 6452948
55988 6452948 6710867 6981906 7270828 7581948 7913827 8266078 8644949 9055934 9497611
55979 9497611 9969393 10478424 11031882 11629968 12274032 12974046 13740247 14575778 15486251
55970 15486251 16488099 17598659 18827647 20188720 21709994 23423176 25354116 27537137
55962 27537137 30028701 32896471 36210929 40066120 44599748 49984471 56425841 64199265
55954 64199265 73684492 85358058 99786123 117649819 139729836 166781274 199334952
55947 199334952 237404149 279920428 323951613 364387842 394942448 410369877 408562285
55940 408562285 391106612 362141620 326569919 288713783 251729292 217545254 187073965
55933 187073965 160543043 137799787 118493433 102175282 88389178 76738206 66889063
55926 66889063 58548451 51464542 45438613 40309592 35930007 32169119 28927227 26127639
55918 26127639 23698912 21576934 19715846 18081672 16639221 15355841 14211596 13193591
55910 13193591 12284389 11465576 10727315 10064045 9464837 8917042 8415109 7956856 7534858
55901 7534858 7140057 6770413 6427896 6110077 5812082 5533644 5276780 5039186 4816610
55892 4816610 4609068 4418415 4242556 4078065 3925616 3786861 3658867 3537652 3424437
55883 3424437 3322359 3229407 3140280 3052827 2967108 2880699 2790923 2699878 2611731 2526723 2442828
55872 2442828 2361232 2284774 2212641 2141862 2072623 2007184 1944944 1883495 1823324 1766806 1713708
55861 1713708 1662184 1613005 1568298 1527163 1487057 1448550 1414337 1384303 1355828 1328342 1303404
55850 1303404 1280694 1257819 1233866 1209651 1184878 1158442 1131140 1104925 1079904 1054957 1030576
55839 1030576 1008113 987014 965831 945122 926388 909030 891383 873867 858093 843748 829493
55828 829493 816060 805300 796844 788758 780758 773706 766700 757777 746984 735749 723894 710257 695687
55815 695687 682304 670302 658469 647353 638744 632347 626012 619102 612785 607326 602010 597589 595788
55802 595788 596413 597696 599451 603107 608601 614009 618357 622233 625459 626837 626444 625731 625068 623487 621061
55787 621061 619189 618220 616961 614815 612298 609162 603979 595933 585295 572099 556163 538510 521082
55774 521082 505018 490622 478597 469654 463375 459209 457849 459589 462111 462255 459484 455352 450306 443725
55760 443725 436610 431203 427867 424985 422011 419880 418290 415405 410824 406273 402787 399585 396192 393186
55746 393186 390184 385544 378979 372340 367001 362367 357678 353248 349218 345041 340989 338283 336938 335310
55732 335310 332552 329708 327606 325479 322603 319587 316991 314108 310128 305297 300143 294688 289045 283662
55718 283662 278510 273226 268362 265169 263813 263162 262667 263006 264607 267076 270432 275239 281038 286203 289919
55703 289919 292755 294836 295117 293135 289816 285825 280646 274122 267455 261756 256840 252203 247961 244099
55689 244099 240052 235781 232192 229820 228234 227257 227533 229229 231377 233253 235299 238059 241337 245018 249563
55674 249563 254959 260130 264006 266277 266735 265057 261752 258198 255154 252209 249099 246413 244542 243136
55660 243136 242096 241894 242420 242727 242530 242748 243979 245611 247024 248469 250103 251371 251999 252480 252931 252664
55644 252664 251571 250733 250880 251326 251200 250577 249626 247730 244397 240099 235383 230055 224008 217986 212714 208080
55628 208080 203899 200638 198618 197219 195543 193297 190644 187923 185828 184909 184492 183173 180742 178508 177353
55613 177353 176715 175990 175503 175294 174352 172080 169406 167390 165730 163575 160972 158537 156503 154857 153649
55598 153649 152462 150477 147700 145180 143453 141903 140320 139707 140573 141726 141930 141687 142130 143104 143614 143407
55582 143407 142911 142330 141871 142169 143400 144661 145257 145879 147504 149909 152397 155204 158963 163417 167847 172193
55566 172193 176569 180215 182164 182506 181907 180358 177503 173734 169719 165227 159585 153010 146450 140392 134913
55551 134913 130539 127867 126460 125170 123493 121744 120075 118289 116513 115123 114057 112981 112076 111921 112654
55536 112654 113829 115002 115927 116446 116792 117677 119519 121893 124232 126574 128965 130703 131049 130306 129373 128593
55520 128593 127852 127463 128015 129515 131383 133139 134535 135356 135773 136428 137542 138341 138149 137521 137495 138169 138926
55503 138926 139579 140257 140544 139847 138547 137706 137628 137538 136689 135022 132797 130356 128263 127010 126473 126140 125752
55486 125752 125296 124659 123848 123257 123141 123090 122587 121720 120742 119394 117332 114860 112544 110524 108871 108098 108457
55469 108457 109187 109364 109126 109143 109326 109089 108524 108227 108205 108069 108100 108943 110296 111061 110881 110485 110375 110204 109630
55450 109630 108875 108156 107410 106774 106619 106900 107169 107359 107844 108596 109046 108997 109021 109587 110272 110147 108719 106433 104464
55431 104464 103823 104368 104935 104815 104665 105433 106941 108304 109311 110392 111527 112244 112516 112600 112021 109942 106754
55414 106754 104203 103546 104316 105294 105902 106277 106626 106980 107225 107157 106752 106355 106250 106188 105896 105792 106427 107315 107229
55395 107229 105795 103989 102842 102383 102107 101852 101846 102338 103387 104655 105418 105267 104756 104849 105720 106660 107057 106819
55377 106819 105854 103971 101476 99204 97708 96931 96768 97344 98555 99902 100986 101779 102317 102618 102973 103827
55361 103827 105226 106752 107994 108770 109003 108830 108704 108874 108909 108254 107051 105900 105071 104587 104765 105837 107234
55344 107234 108103 108385 108577 108543 107576 105614 103500 101985 101263 101405 102268 103007 102678 101405 100060 98933 97761
55327 97761 96917 97174 98228 98863 98925 99614 101384 103040 103656 103876 104394 104498 103434 102091 101928 102915 103837 104146
55309 104146 104243 104300 104084 103823 104161 105156 106129 106578 106580 106403 106359 106939 108406 110252 111649 112424 113031 113574 113522 112554
55289 112554 111219 110480 110797 111781 112585 112607 111884 110880 109987 109414 109406 110074 110876 110793 109386 107318 105530 104185
55271 104185 102857 101450 100471 100426 101339 102791 104196 105061 105226 104933 104584 104450 104547 104627 104330 103554 102711 102371
55253 102371 102653 103217 103825 104561 105441 106157 106380 106118 105653 105221 104716 103604 101437 98754 97073 97416 99040
55236 99040 100217 100091 99164 98199 97567 97558 98341 99371 99739 99353 98991 98951 98612 97704 97043 97355 98181 98687 98875
55217 98875 99282 100057 101159 103016 106001 109416 111788 112310 111482 110306 109295 108280 106917 105314 104206
55202 104206 104314 105468 106654 107079 106840 106416 105894 105053 103886 102758 102186 102525 103603 104648 104981 104798 104813
55185 104813 105159 105315 105157 105263 105892 106512 106782 107240 108411 109898 110962 111495 111825 112049 112202 112618 113439 114129
55167 114129 114121 113636 113256 113019 112555 111840 111137 110394 109309 107897 106453 105164 104178 103834 104193 104551 104020 102561
55149 102561 100965 99872 99304 99068 99140 99551 100254 101142 102018 102624 102853 102748 102214 101075 99664 98897 99392 100764
55131 100764 102160 103086 103385 102867 101588 100184 99274 98718 98001 97217 97033 97724 98805 99695 100330 100977 101729
55114 101729 102333 102417 101909 101236 100956 101169 101552 102005 102827 104088 105326 106164 106823 107682 108728 109757 110729 111591
55096 111591 112145 112437 112834 113335 113306 112399 111216 110547 110354 110174 110114 110751 112194 113863 115090 115564 115390 115111
55078 115111 115380 116258 117150 117730 118368 119205 119514 118689 117320 116412 116014 115486 114699 114020 113443 112845 112809 114062
55060 114062 116105 117564 118017 118374 119214 119844 119517 118582 117798 117146 116073 114461 112780 111506 110832 110743 110980
55043 110980 111055 110647 109942 109439 109445 109821 110167 110216 110099 110125 110339 110460 110317 110011 109572 108923 108401 108719 109970 111160
55023 111160 111309 110570 109698 108918 108118 107701 108171 109084 109413 108970 108518 108465 108426 108191 108135 108315 108120 107334 106739 107121
55003 107121 108241 109347 110171 110862 111348 111396 111082 110722 110432 110150 109965 110158 110960 112394 114219 115915 116984
54986 116984 117428 117801 118622 119852 120986 121529 121328 120663 120095 120096 120749 121752 122629 122900 122369 121442 120893 120984 121136
54967 121136 120800 120297 120274 120628 120677 120302 120220 120998 122397 123786 124737 125053 124719 124032 123479 123278 123266 123271 123331 123520
54947 123520 123821 124136 124221 123762 122805 121837 121124 120274 118986 117852 117698 118358 118932 119170 119709 120833 121864 122111
54929 122111 121703 121149 120664 120352 120530 121420 122768 124110 125252 126442 128278 131409 136000 141486 147242 153361
54913 153361 160309 167923 175297 181638 186593 189802 190831 189749 187119 183267 178128 171964 165632 159860
54899 159860 154765 150211 146141 142424 138898 135751 133332 131517 129810 128126 126934 126608 127269 129159 132229
54884 132229 135274 136580 135860 134683 134527 135320 136382 137805 140078 143092 146457 150353 155247 161006 167002
54869 167002 172787 178072 182363 185274 186999 187946 188004 186688 183860 179861 175051 169610 163744 157798 152189
54854 152189 147300 143280 139905 136925 134526 132942 131635 129556 126441 123131 120306 117614 114606 111827
54840 111827 110248 109953 110030 109559 108327 106879 106189 106887 108451 109547 109524 109130 109402 110423 111582 112488 113056
54823 113056 113226 113156 113236 113430 113170 112406 112087 112846 113851 113873 112991 112289 112255 112499 112762 113180 113701 114225 115229
54804 115229 117265 119790 121551 122236 122832 124056 125356 125879 125698 125531 125700 125832 125343 123958 122083 120756
54788 120756 120875 122250 123708 124279 124048 123757 123964 124707 125691 126525 126929 126832 126259 125272 124183 123670 124332 126145
54770 126145 128565 131098 133539 135821 138048 140616 143987 148256 153135 158322 163699 169273 175133 181301
54756 181301 187401 192600 196072 197436 196691 194044 189965 185009 179304 172661 165458 158925 154042 150598
54742 150598 147826 145454 143527 141737 139836 138353 137968 138325 138368 137801 137304 137288 137308 136898 136179 135464 134932 134895
54724 134895 135722 137308 139183 141278 143963 147294 150941 155032 160213 166524 172936 178359 182458 185174
54710 185174 186204 185524 183754 181404 178244 174036 169391 165163 161343 157305 153018 149268 146606 144621
54696 144621 142435 139556 136190 133006 130708 129612 129396 129274 128457 126625 124111 121655 119849 118792 118374
54681 118374 118691 119869 121586 123214 124468 125501 126314 126589 126303 126032 126282 126832 127100 126859 126291 125576 124823
54664 124823 124245 124035 124099 124155 124086 123999 124012 124093 124074 123724 122912 121761 120521 119261 117873 116461 115469 115310 116004
54645 116004 117237 118572 119535 119874 119890 120264 121346 122786 124025 124863 125338 125313 124565 123218 121888 121356 122064
54628 122064 123730 125360 125947 125377 124449 123884 123609 123239 122876 122973 123515 123873 123485 122470 121491 121191 121734 122663
54610 122663 123216 122949 122142 121470 121294 121397 121327 120798 119810 118660 117897 118009 118930 119938 120310 120157 120437 121938
54592 121938 124299 126233 126826 126425 126057 126194 126349 125894 124915 124176 124433 125839 127811 129386 129910 129517 128881
54575 128881 128474 128265 128094 127948 127685 126876 125351 123701 122809 122915 123507 124139 124896 125892 126689 126681 125909 125117 125000
54556 125000 125656 126779 127999 128908 129180 128996 129033 129603 130082 129676 128645 128073 128479 129383 130411 132015 134589
54539 134589 137609 140330 142800 145349 147462 148137 147304 145996 144993 144084 142840 141332 139747 137997 136156
54524 136156 134790 134368 134679 135182 135605 135892 135968 135964 136297 137066 137657 137432 136615 135994 135873 135784 135279 134531 134026 133939
54504 133939 133970 133717 133184 132938 133624 135140 136427 136400 135078 133586 132987 133329 133867 134040 133990 134129 134386 134103
54486 134103 132818 130995 129760 129849 130968 132204 132818 132611 131888 131287 131482 132726 134661 136699 138526 140152
54470 140152 141558 142508 142728 142190 141223 140376 140105 140497 141293 142197 143125 144152 145294 146415 147345 148101 148963
54453 148963 150188 151593 152580 152733 152235 151499 150601 149369 147915 146630 145657 144743 143711 142709 141925 141356
54437 141356 140962 140708 140361 139630 138693 138217 138596 139473 140224 140595 140650 140455 140221 140463 141603 143475 145484 147081
54419 147081 147916 147878 147422 147575 149026 151236 152931 153480 153340 153152 152984 152688 152478 152643 152925 152707 151878 151143
54401 151143 151257 152165 153142 153735 154275 155315 156831 158211 158971 159201 159307 159600 160210 161120 162100 162790 163041 163042
54383 163042 162982 162768 162271 161692 161429 161638 162069 162354 162264 161735 160790 159557 158401 157976 158898 161112 163669 165533
54365 165533 166688 168131 170677 174166 178008 181979 185985 189436 191564 192329 192394 192120 191097 188885 185784
54350 185784 182545 179594 176871 174251 171795 169625 167775 166126 164386 162278 159906 157805 156325 155066
54336 155066 153299 150993 149046 148272 148487 148876 149019 149146 149569 150347 151528 153157 154867 155885 155805 155085 154508
54319 154508 154392 154571 154849 155090 155078 154745 154408 154407 154570 154413 153810 153072 152436 151867 151348 151005 150920 151160 151831 152687
54299 152687 152862 151671 149763 148795 149686 151681 153356 154005 153746 152904 151899 151404 151942 153330 154891 156140
54283 156140 157008 157525 157653 157444 157184 157298 158084 159357 160328 160128 158595 156424 154553 153629 153921 155197 156614
54266 156614 157301 157349 157753 159061 160595 161398 161451 161456 161768 162169 162428 162524 162446 162255 162259 162679 163209 163335 162988 162540 162223
54245 162223 161965 161705 161539 161580 161919 162547 163069 162767 161331 159319 157495 156041 154844 154196 154452 155233 155746
54228 155746 155953 156651 158249 160179 161721 162715 163142 162696 161351 159898 159291 159550 159730 158905 156970 154637
54212 154637 152946 152557 153186 153725 153234 151851 150587 150254 150770 151501 152015 152393 152917 153671 154511 155323 156118 156823
54194 156823 157111 156625 155430 154168 153706 154520 156299 158128 159173 159324 159117 159078 159265 159400 159233 158691 157921
54177 157921 157300 157208 157646 158276 158923 159762 160819 161681 162017 162124 162540 163257 163697 163413 162484 161306 160242 159460
54159 159460 158840 158092 157156 156364 155998 155869 155639 155284 154857 154049 152580 151017 150565 151772 153851 155563 156514
54142 156514 157315 158533 159831 160294 159554 158372 157894 158430 159372 160252 161347 162975 164762 166087 166848 167245
54126 167245 167152 166305 164900 163453 162212 161272 160993 161647 162778 163640 164223 165133 166532 167943 169112 170244
54110 170244 171291 171871 172140 172870 174232 175308 175337 174813 174774 175565 176893 178630 180804 183119 185140 186967
54094 186967 189309 192934 198204 204790 211475 216522 218723 218055 215214 210973 206261 202244 199562 197692
54080 197692 195625 193021 190195 187263 184053 180817 178261 176690 175781 175457 176399 179210 183393 187612 190945
54065 190945 193559 196166 199082 201959 204401 206566 208968 211686 214098 215550 216071 216157 216051 215596 214738 213782
54049 213782 213059 212601 212256 211890 211457 211044 211013 211869 213879 216880 220499 224416 228403 232352 236444 241121
54033 241121 246659 252776 258858 264501 269755 274801 279605 283922 287471 290041 291581 292374 292993 293859 294794
54018 294794 295230 294881 293989 292906 291639 289997 287909 285335 282046 277867 273110 268449 264244 260256 256120
54003 256120 251857 247808 244235 241156 238407 235707 232804 229763 226992 224773 222773 220326 217279 214338
53989 214338 212347 211333 210546 209467 208428 208080 208492 209095 209365 209240 208922 208680 208845 209553 210333 210361 209336
53972 209336 207807 206485 205592 205085 205002 205201 205247 205101 205595 207560 210677 213851 216691 220002 224733 231066
53956 231066 238695 247491 257563 268928 281204 293363 303684 310337 312380 310209 305206 299019 292877
53943 292877 287088 281290 275543 271034 269154 269974 272207 274643 276991 279221 280907 281687 281888 282267 283328
53928 283328 285146 287552 290317 293316 296624 300182 303450 305922 308018 310868 315043 320080 325474 331465
53914 331465 338417 345997 353564 360987 368488 375891 382493 387652 391201 393356 394413 394459 393328 391101 388604
53899 388604 386866 385927 384695 382241 378702 374586 369854 364263 358170 352295 346927 341843 336776 331455
53885 331455 325445 318511 311058 303828 297291 291604 286825 282762 278950 275267 272267 270308 268656 266174
53871 266174 262716 259100 255780 252326 248370 244262 240478 236949 233480 230446 228549 227891 227656 226858 225304
53856 225304 223696 222734 222273 221596 220382 219033 217952 217021 216028 215173 214683 214281 213552 212650 212152 212277 212615
53839 212615 212603 211935 210695 209412 208848 209295 210204 210826 211052 211282 211676 212043 212322 212646 212979 213175 213439 214241
53821 214241 215721 217495 219097 220278 220923 221024 220805 220603 220653 221159 222391 224382 226685 228827 230867 233184
53805 233184 235953 239211 243149 247743 252346 256350 260165 264807 270472 276195 281055 284998 288294 290855
53791 290855 292591 293971 295743 298261 301300 304334 306836 308535 309509 309921 309689 308641 306855 304487 301366
53776 301366 297223 292291 287153 282044 276826 271691 267255 263786 260922 258277 255742 253023 249654 245834
53762 245834 242580 240517 239055 237336 235451 234006 232851 231131 228631 226296 225110 224879 224444 222943 220656
53747 220656 218676 217884 218289 219244 220063 220314 219756 218500 217228 216835 217598 218982 220332 221444 222350 223029 223662
53730 223662 224762 226570 228542 229898 230615 231494 233248 235835 238636 240970 242410 242980 243252 244046 245721
53715 245721 247826 249611 250924 252407 254690 257615 260486 262963 265319 267787 270149 272232 274390 277012
53701 277012 279849 282330 284379 286403 288578 290717 292846 295366 298468 301834 304976 307494 308996 309295
53687 309295 308869 308601 308812 308976 308574 307833 307314 307158 307040 306609 305680 304241 302508 300830 299433 298389 297715
53670 297715 297160 296035 293880 291384 289950 290117 291018 291623 291777 291672 291135 290157 289486 289820 290741 291231 290998
53653 290998 290539 290109 289498 288805 288664 289468 290933 292636 294520 296742 299345 302182 304855 306747 307521 307630
53637 307630 307941 308793 309824 310783 312044 314120 317050 320493 324184 328034 332020 336212 340841 346105 351883
53622 351883 357703 363027 367591 371534 375148 378484 381387 383970 386831 390412 394308 397543 399610 400961
53608 400961 402450 404587 407452 410982 414977 418847 421670 422817 422602 422202 422688 424066 425380 425799 425414
53593 425414 424954 424973 425435 425871 425681 424498 422545 420489 418714 416875 414447 411545 408807 406546 404411 401971
53577 401971 399297 396824 394827 393188 391488 389300 386544 383710 381641 380966 381617 382802 383468 383042 381867
53562 381867 380815 380369 380282 380239 380438 381140 381979 382311 382213 382489 383568 384959 386086 387194 388920 391325 393926
53545 393926 396617 399939 404241 409016 413431 417307 421176 425503 430259 435296 440712 446562 452588 458633
53531 458633 465140 472834 481986 492343 503652 515797 528459 541251 554279 568026 582507 597141
53519 597141 611770 627171 644039 661981 680168 698616 718141 739272 761968 786210 812022
53508 812022 838770 865240 890786 915910 941412 967375 993237 1018453 1042760 1066065 1088396
53497 1088396 1109831 1130290 1149576 1167748 1185236 1202375 1219075 1235157 1250848 1266722 1283240
53486 1283240 1300485 1318162 1335708 1352575 1368679 1384500 1400518 1416584 1431925 1445709 1457421
53475 1457421 1466805 1473674 1477869 1479332 1478133 1474434 1468381 1460019 1449364 1436562 1421959 1406008 1389203
53462 1389203 1372063 1355037 1338286 1321584 1304499 1286663 1267936 1248439 1228535 1208680 1189161
53451 1189161 1169918 1150612 1130886 1110559 1089749 1068954 1049037 1030928 1015161 1001715 990424
53440 990424 981484 975344 971968 970472 969667 968870 968032 967395 967407 968787 972075 977021 982888 989547 997801 1008347
53424 1008347 1020806 1034096 1047516 1061178 1075660 1091598 1109351 1128806 1149682 1172170 1196849
53413 1196849 1223701 1251819 1280641 1310981 1344016 1379634 1416686 1454663 1494132 1535495 1578445
53402 1578445 1622971 1669868 1719552 1771055 1822942 1874828 1927399 1981299 2036595 2093052 2150225
53391 2150225 2207332 2263596 2318794 2373154 2426717 2479102 2529779 2578213 2623738 2665659 2703597
53380 2703597 2737545 2767610 2793885 2816422 2835088 2849419 2858848 2863055 2861897 2855104 2842283 2823133
53368 2823133 2797434 2764913 2725574 2680209 2630302 2577313 2522229 2465735 2408395 2350521 2292246
53357 2292246 2234005 2176774 2121591 2068991 2019023 1971527 1926104 1882069 1838869 1796522 1755254
53346 1755254 1714750 1674235 1633475 1593366 1555291 1520146 1488163 1459308 1433369 1409769 1387761
53335 1387761 1366976 1347648 1330294 1315328 1302880 1292562 1283317 1273744 1262885 1250703 1237820 1224917
53323 1224917 1212388 1200389 1189122 1179070 1170749 1164016 1157832 1151162 1144176 1138146 1134134 1132193 1131924
53310 1131924 1133206 1136001 1139961 1144714 1150278 1156812 1164279 1172815 1183113 1195908 1211196 1228385 1247081
53297 1247081 1267269 1288903 1311842 1336096 1361687 1388347 1415775 1443988 1472821 1501236 1527793
53286 1527793 1551841 1573579 1593030 1609765 1623823 1635965 1646514 1654572 1658940 1659314 1656092 1649465
53274 1649465 1639303 1625687 1609077 1590126 1569676 1548555 1526860 1503679 1478090 1450305 1421403
53263 1421403 1392156 1362621 1332697 1302483 1272033 1241338 1210635 1180310 1150389 1120571 1090927
53252 1090927 1062096 1034564 1008086 982076 956303 930906 905969 881472 857572 834553 812395
53241 812395 790664 769057 748020 728681 712043 698212 686372 675522 665228 655704 647296 639937
53229 639937 633127 626310 619170 611590 603451 594666 585423 576082 566622 556326 544392 530910 516967
53216 516967 503705 491506 480183 469581 459635 450089 440634 431390 422899 415523 409019 402824 396555
53203 396555 390082 383311 376138 368602 360868 352997 344935 336875 329466 323406 318741 314779 310812 306785
53189 306785 303168 300262 297789 295123 291836 288124 284769 282559 281553 281021 280205 278941 277325 275110 271969
53174 271969 268266 265013 262889 261699 260900 260247 259696 259147 258620 258431 258687 258831 258085 256368 254488 253368
53158 253368 253234 253562 253601 252958 251862 250912 250491 250328 249694 248062 245651 243330 241867 241179 240417 238980 237291
53141 237291 236326 236447 237104 237681 238188 238958 240071 241369 242738 244056 245089 245684 245914 245860 245482 244959 244851
53124 244851 245612 247121 248917 250700 252304 253482 254121 254514 255027 255621 256033 256294 256693 257350 258212 259362 260818
53107 260818 262155 262778 262624 262130 261514 260600 259411 258397 257775 257101 255829 254028 252270 250978 250113 249382
53091 249382 248593 247858 247480 247461 247158 245827 243593 241551 240717 241146 242214 243344 244205 244572 244514 244564 245232 246333
53073 246333 247060 246717 245203 242923 240504 238472 236868 235200 233044 230632 228584 227163 226221 225805 226289
53058 226289 227645 229102 229891 230048 230068 230077 229879 229711 230299 231930 233920 235347 236047 236532 237045 237171 236469 235245
53040 235245 234443 234809 236232 237876 238879 238905 238099 236715 234981 233326 232392 232558 233523 234582 235242 235408 235068
53023 235068 234219 233109 232233 231842 231742 231723 231986 232893 234499 236549 238760 240774 242033 242080 241028 239462 237941
53006 237941 236851 236572 237258 238361 238912 238499 237609 236778 235935 234954 234353 234731 235768 236536 236814 237324 238498
52989 238498 239784 240528 240972 241761 242912 243858 244270 244217 243727 242882 242296 242804 244552 246970 249738 253094 256965
52972 256965 260468 262811 264134 264966 265297 264858 264013 263593 263842 264188 264192 264184 264724 265820 266904 267405 267206 266697
52954 266697 266378 266328 266052 265026 263243 261041 258612 256023 253558 251621 250299 249385 248711 248068 246964 245103
52938 245103 243131 242262 242949 244406 245585 246111 246045 245421 244412 243502 242953 242433 241562 240508 239640 238892 238005
52921 238005 237160 236825 236992 237074 236650 235990 235691 235990 236537 236856 237023 237724 239391 241374 242406 241984 240820 239718
52903 239718 238593 237021 235285 234230 234253 234946 235661 236024 236024 236015 236475 237425 238216 238258 237735 237213 236797 236323 236149
52884 236149 236956 238606 239901 239873 238874 238091 238284 239323 240696 242066 243331 244453 245424 246440 247892 249955
52868 249955 252111 253437 253550 253030 252728 252976 253806 255460 258120 261347 264412 267043 269205 270249 269159
52853 269159 265911 261913 258704 256584 254789 252539 249586 246066 242352 238912 235998 233487 231136 228904
52839 228904 226944 225479 224709 224610 224754 224634 224233 223993 224081 224024 223313 222148 221402 221951 224059 227110 229813 231032
52821 231032 230669 229608 228634 227717 226483 225007 223809 223275 223416 224056 224955 225854 226632 227406 228350 229547 231099
52804 231099 233151 235529 237534 238338 237562 235314 231969 228177 224876 222810 221964 221735 221640 221542 221251 220377 218891
52787 218891 217467 216911 217301 217963 218303 218412 218776 219660 220957 222436 223899 225124 225953 226470 226864 227058 226722
52770 226722 225801 224764 224099 223710 223083 221958 220591 219425 218743 218631 218999 219601 220153 220483 220541 220384 220217 220288
52752 220288 220586 220870 221201 222124 223988 226307 228260 229733 231399 233812 236840 239942 242589 244428 245555
52737 245555 246672 248439 250549 251882 251720 250424 248808 247427 246662 246902 248185 249965 251593 252788 253420
52722 253420 253225 252107 250401 248517 246533 244431 242373 240403 238219 235763 233791 233259 234141 235317 235691
52707 235691 235092 234058 233108 232362 231636 230795 230118 230244 231547 233561 235290 236189 236650 237437 238730 239935 240382
52690 240382 240113 239858 240234 241093 241751 241783 241449 241376 241896 242705 243102 242607 241451 240346 239701 239302 238871 238583 238693
52671 238693 238954 238954 238837 239080 239686 240197 240514 241005 241741 242343 242731 243294 244087 244653 244978 245804 247444 249114 250184
52652 250184 251402 253938 257647 261219 263783 265421 266201 265750 263984 261481 258821 256077 253238 250663 248776
52637 248776 247583 246706 245763 244715 243989 244239 245773 248236 251041 253908 256779 259471 261877 264325 267184
52622 267184 270081 271912 271747 269521 265963 262166 259056 256893 255292 253995 253404 253918 255007 255556 255087
52607 255087 254062 253044 252199 251688 251867 252749 253807 254564 255022 255302 255263 254798 254182 253841 253977 254561 255444 256340
52589 256340 256968 257383 257882 258505 258899 258816 258428 258055 257895 258180 259212 261010 263180 265308 267209 268619 269046
52572 269046 268228 266504 264469 262465 260614 259051 257848 256860 255922 255062 254341 253695 253120 252750 252550 252192 251589
52555 251589 251248 251627 252295 252290 251351 250274 249871 250013 250091 250084 250635 252037 253697 254876 255585 256321 257119 257459 257186
52536 257186 256903 257078 257236 256606 255387 254791 255761 258044 260552 262305 263025 263182 263526 264304 264947 264776 263909
52519 263909 263065 262620 262467 262762 264056 266376 268821 270567 271874 273610 276119 279034 281964 284891 287936
52504 287936 291133 294353 297162 298807 298685 296834 293817 290194 286275 282271 278448 275133 272621 270973
52490 270973 269824 268582 266911 264908 262870 261175 260355 260726 261714 262124 261479 260656 260710 261504 262136 262346 262729
52473 262729 263693 265014 266510 268390 270693 273007 275120 277427 280310 283442 286137 288138 289704 291122
52459 291122 292515 293992 295600 297095 298041 298179 297505 295968 293372 289742 285663 282000 279199 276948 274615
52444 274615 271949 269223 266749 264531 262492 260808 259751 259328 259299 259511 259951 260588 261326 262058 262463 261963 260357
52427 260357 258482 257639 258162 259076 259493 259793 260912 262873 264751 265943 266793 267911 269461 271263 273049 274428
52411 274428 275120 275542 276721 279346 283369 288876 296747 307684 320828 334037 345465 354204 359579 360864
52397 360864 358147 352728 346097 338878 331202 323566 316725 310986 306266 302685 300503 299502 298969 298339 297467
52382 297467 296339 295135 294577 295592 298235 301406 303974 305895 307952 310684 313948 317399 321075 325509
52368 325509 331355 338709 346652 353703 358956 362623 365299 367017 367399 366446 364652 362325 359341 355789 352425
52353 352425 350171 349315 349441 349998 350700 351404 351958 352314 352704 353524 355065 357421 360623 364723 369668 375205
52337 375205 381046 387114 393529 400383 407626 415200 423204 431975 442043 453890 467580 482613 498355
52324 498355 514653 531892 550471 570415 591521 613471 635651 657147 677366 696601 715655
52313 715655 734847 753617 771178 787298 802337 816710 830583 844052 857400 870949 884660
52302 884660 897942 909966 920282 929205 937539 945899 954205 961744 967610 971047 971603 969285 964695 958697
52288 958697 951639 942964 932011 919256 906449 895341 886428 879107 872750 867369 863451 861554 862077
52275 862077 865060 870095 876537 883913 892112 901387 912289 925313 940247 955908 970876 984491 996957
52262 996957 1008636 1019636 1030010 1039914 1049512 1059021 1068853 1079289 1089994 1100299 1110009 1119424 1128429
52249 1128429 1136181 1141986 1145902 1148025 1147651 1143794 1136269 1125745 1112955 1098477 1083169 1068043 1053441
52236 1053441 1038764 1023312 1007159 991033 975663 961517 948904 937904 928110 918803 909618 900925
52224 900925 893324 886853 881024 875667 871239 868000 865339 862486 859673 857896 857595 858322 859791 862398 866290
52209 866290 870687 874729 878519 882652 887154 891533 895629 899669 903627 907157 910111 912562 914434 915745
52195 915745 917098 919176 921713 923729 925015 926635 929604 933700 938077 942489 947228 952158 956500 959587
52181 959587 961260 961428 959655 955566 949484 942424 935292 928187 920587 912248 903776 896192 890033 885072
52167 885072 880845 877208 874348 872521 871888 872538 874528 877913 882653 888459 894868 901536 908273 914636 919819
52152 919819 923323 925508 927064 928043 927974 926856 925445 924494 924291 925087 927267 930746 934756 938711 942788 947156
52136 947156 951162 954014 956030 958464 962228 967482 974435 983709 995605 1009631 1025229 1042619 1062534
52123 1062534 1085343 1110766 1138262 1167377 1197783 1229210 1261345 1293651 1325395 1355956 1385015
52112 1385015 1412342 1437508 1459968 1479272 1495021 1506811 1514529 1518675 1520166 1519756 1517712 1513951 1508338
52099 1508338 1501024 1492749 1484714 1477731 1471432 1464659 1456736 1448034 1439148 1429951 1419741 1407985 1394481
52086 1394481 1379060 1361728 1343169 1324656 1307323 1291726 1278081 1266566 1257279 1250281 1245872 1244558
52074 1244558 1246537 1251385 1258404 1267082 1277054 1287978 1299791 1312926 1327863 1344363 1361383 1377848
52062 1377848 1393364 1408134 1422317 1435605 1447426 1457430 1465661 1472286 1477344 1480968 1483583 1485532
52050 1485532 1486462 1485501 1482143 1476685 1469632 1461005 1450480 1437862 1423080 1405953 1386362 1364602 1341330
52037 1341330 1317250 1293099 1269765 1248032 1228216 1210278 1194179 1179876 1167065 1155304 1144370
52026 1144370 1134258 1124939 1116441 1108995 1102622 1096561 1089652 1081458 1072635 1064044 1055899 1048032 1040559 1033825
52012 1033825 1027869 1022349 1016956 1011567 1005877 999085 990133 978417 964367 949256 934228 919342 903743
51999 903743 886747 868571 849943 831326 812825 794677 777457 761800 748196 737083 728707 722602
51987 722602 717359 711393 704163 696484 689489 683412 677548 671221 664322 656781 648017 637292 624560 610642
51973 610642 596604 583191 570750 559404 549185 540170 532555 526565 522449 520683 521939 526466 533528
51960 533528 541780 550286 558963 568057 577467 586601 594572 600432 603532 603860 601887 597999 592269 584867
51946 584867 576471 568160 561098 556312 554458 555571 559260 565328 574024 585566 599651 615671 633269
51933 633269 652443 673177 695135 717624 739655 760065 777750 791741 800994 804211 800125 788054
51921 788054 768295 742174 711895 680109 649223 620663 594641 570633 548274 527980 510652
51910 510652 496645 485138 474833 465287 457293 451865 449133 448381 448876 450385 453104 457430 463801 472480
51896 472480 483292 495458 507554 517705 524268 526625 525240 520789 513510 503652 492255 480890 470589
51883 470589 461467 453512 447239 443217 441305 440874 441738 444385 449149 455536 462691 470270 478513 487466 496542
51868 496542 504956 512282 518366 522890 525331 525330 522949 518602 512787 505828 497837 489116 480704 474152 470448
51853 470448 469373 470202 472727 477027 482474 487743 491987 495336 497969 499306 498575 495743 491385 485929 479529
51838 479529 472488 465251 458022 450848 444066 438272 433767 430320 427618 425727 425034 425872 428110 430935 433183
51823 433183 434148 434002 433127 431251 427789 423011 418177 414263 411110 408249 406016 405107 405301 405523 405362 405867
51807 405867 408400 413026 418403 423011 426161 428013 429030 429422 428904 427057 424121 421208 419352 418465 417665
51792 417665 416542 415503 414720 413456 410860 407065 402991 399312 396098 393391 391657 391484 393007 395635 398317
51777 398317 400246 401506 402835 404653 406603 408214 409600 411177 413115 415610 419278 424615 431253 438511
51763 438511 446459 455705 466122 476703 486752 496324 505136 511882 515216 514855 511194 504423 494715 482909
51749 482909 470276 457713 445623 434409 424520 416089 408996 403270 399074 396364 394982 395101 397210
51736 397210 401544 407860 415933 426073 438764 453582 468492 480636 488299 492180 494511 497041 500261
51723 500261 504358 509850 516593 522676 525196 522353 514626 504159 493363 483932 476560 471194 467449 464665
51709 464665 461759 457540 451579 444648 438121 433125 430279 429817 431578 435104 439897 445287 449951 452269
51695 452269 451663 449221 446574 444530 443264 443173 444686 447433 450404 452793 454088 453560 450623 445778 440440
51680 440440 435613 431260 427102 423340 420436 418743 418588 420223 423471 427894 433528 440954 450400 461308
51666 461308 473115 486087 500924 517689 535275 551590 564093 570607 570196 563339 551317 535675
51654 535675 518321 501530 487347 477039 471188 469888 472459 477221 482117 485658 487180 486376 483014
51641 483014 477136 469277 460302 451055 442097 433687 426006 419348 414018 410067 407329 405755 405510 406568
51627 406568 408405 410304 411892 413170 414073 414275 413504 411862 409592 406647 402785 398203 393828 390612 388662
51612 388662 387299 385921 384402 382604 380050 376473 372427 368946 366710 365726 365587 365818 366206 367121 369344
51597 369344 373305 378740 385365 393514 403635 415413 427791 439574 449433 455670 456943 453419 446725
51584 446725 438707 430657 423566 418264 415039 413668 414018 416209 420179 425740 433181 443141 455620 469716
51570 469716 484665 500562 517725 535929 554720 573913 593244 611889 628947 644329 658970
51559 658970 674493 692894 716012 744624 778090 815112 854430 894345 931912 963373 985691
51548 985691 997668 999840 993613 980285 960530 934710 903635 868735 831433 792785 753967 716636
51536 716636 682392 652123 626072 604148 585864 570473 557630 547600 540397 535166 530936 527502
51524 527502 524830 522029 517819 511892 504950 497460 489255 480499 472097 464692 457912 451090 444240 437829
51510 437829 431950 426309 420900 416228 412796 410540 408811 406831 404235 401252 398280 395380 392372 389423
51496 389423 387251 386612 387718 390182 393305 396345 398762 400444 401649 402658 403574 404420 405242 406029 406650 406952
51480 406952 406782 405931 404293 402113 399831 397541 394855 391501 387829 384409 381271 378014 374695 372083 370690
51465 370690 369839 368253 365534 362566 360310 358641 356756 354320 351698 349305 347350 346208 346360 347699 349429
51450 349429 350942 352417 354285 356579 359249 362732 367632 374069 381916 391600 404065 419646 437188
51437 437188 454291 468296 477378 481330 481577 480229 478933 478546 479428 481354 483159 483147 480332 475120 468617
51422 468617 461581 454290 447037 440216 433953 428009 422206 416747 411992 408076 404886 402333 400495 399503
51408 399503 399452 400392 402199 404302 405846 406485 406953 408393 411030 413808 415485 415778 415312 414889 415175 416723
51392 416723 419793 424132 429332 435349 442398 450451 459255 468935 480232 494067 511036 531479 555840
51379 555840 584816 619091 658882 703807 753410 807788 867134 930117 992833 1049922 1096964
51368 1096964 1131853 1154345 1164986 1164550 1153795 1133230 1103278 1064892 1019880 970424 918402 865234
51356 865234 812168 760456 711244 665444 623711 586498 554107 526584 503523 484080 467426
51345 467426 453202 441408 431881 424016 417013 410292 403704 397538 392322 388373 385460 382995 380586 378309
51331 378309 376484 375329 374831 374835 375218 375979 377130 378527 379930 381254 382548 383640 384073 383550 382248 380478
51315 380478 378304 375783 373319 371377 370003 368975 368300 368151 368382 368519 368239 367531 366443 365019 363446 361925
51299 361925 360441 358956 357738 357079 356848 356736 356805 357199 357400 356542 354632 352770 351856 351701 351802 352451 354506
51282 354506 358384 363749 369964 376428 382645 388377 393683 398543 402529 405054 405901 405390 404148 402859 402072
51267 402072 402116 403272 405913 410100 415019 419344 422407 424613 426422 427428 426824 424411 420603 415802 410391
51252 410391 405173 400985 397722 394256 389614 383884 377770 371746 366051 361220 358028 356697 356491 356307 355556
51237 355556 354310 352848 351474 350771 351417 353360 355503 356738 357132 357634 358770 360237 361762 363612 365993
51222 365993 368503 370525 371757 372118 371651 370860 370577 370987 371221 370503 369345 368944 369630 370637 371338 371956 372889
51205 372889 373992 374888 375615 376662 378535 381471 385309 389383 392664 394331 394367 393578 392933 392826 393036 393378
51189 393378 394164 395694 397461 398411 398128 397313 396817 396655 396274 395383 394092 392573 391055 389849 388896 387600
51173 387600 385746 384320 384685 386982 390009 392632 394645 396218 397351 398217 399394 401238 403411 405439 407414
51158 407414 409749 412432 414894 416496 416943 416260 414547 411797 407978 403446 399041 395482 392667 390016 387395
51143 387395 385208 383536 381850 379860 378068 377019 376500 375955 375407 375366 376026 377043 378068 379101 380306 381790
51127 381790 383574 385588 387704 389948 392554 395642 398996 402276 405189 407310 408130 407683 406827 406415 406411 406335
51111 406335 406366 407301 409413 412002 414328 416445 418797 421373 423698 425477 426926 428475 430272 431953 433010
51096 433010 433525 434410 436474 439282 441456 442264 442365 442683 443110 442918 442090 441465 441594 442114 442416 442384 442255 442155
51078 442155 442112 442243 442570 442864 443005 443410 444717 447067 450016 453237 456965 461498 466516 471281 475634 480544
51062 480544 487551 497800 511760 529617 551415 576464 602722 627146 647073 661610 672026 681000
51050 681000 691337 704820 721487 739518 756031 768673 776954 781921 784275 783009 776286 763594
51038 763594 746689 728472 711552 697898 688785 683955 680939 676132 667066 653649 637440 620241
51026 620241 603337 587395 572570 558916 546869 537184 530312 526081 524059 523892 525232 527773 531610
51013 531610 537185 544608 553351 562903 573309 584706 596772 609170 622151 635987 649978 662795
51001 662795 673888 683762 692727 700102 705124 708060 709834 710822 710575 708664 705374 701546 697998 695067
50987 695067 692520 689935 687393 685832 686551 690392 697429 707323 719686 734102 749983 766522 782814
50974 782814 798115 812287 826158 841360 859601 881915 908512 939245 974087 1013175 1056610
50963 1056610 1104509 1157142 1214680 1276616 1341680 1408563 1476506 1545000 1613126 1679577 1743125
50952 1743125 1802614 1856523 1903078 1941108 1970621 1992498 2007839 2017529 2021969 2021144 2015395 2006337
50940 2006337 1996520 1987649 1979200 1969027 1955232 1937450 1916713 1894548 1872091 1849621 1826790 1803295
50928 1803295 1779112 1754031 1727251 1697794 1665198 1629542 1590951 1549424 1505126 1458566 1410446
50917 1410446 1361507 1312524 1264322 1217811 1174068 1134114 1098359 1066376 1037494 1011533 988650
50906 988650 968530 950142 932494 915432 899573 885535 873320 862333 851874 841637 831812 822797
50894 822797 814877 808104 802378 797579 793719 790967 789445 789067 789719 791441 794116 797108 799693 801928 804574
50879 804574 807997 811712 815321 819345 824602 831205 838803 847469 857593 869047 881174 893693 907027
50866 907027 921687 937888 955904 976214 999122 1024640 1052868 1084033 1118002 1154320 1193036
50855 1193036 1235147 1281911 1334055 1391985 1456485 1528862 1610429 1702039 1803916 1915716 2036803
50844 2036803 2166534 2304196 2448763 2599032 2753969 2912366 3071856 3228524 3377679
50835 3377679 3514774 3635572 3736260 3814196 3868535 3899695 3908413 3895795 3864167 3817200 3758938
50824 3758938 3693044 3623141 3553354 3487904 3430004 3381267 3342047 3311901 3289423 3271832 3255274
50813 3255274 3235944 3211012 3178523 3136769 3084143 3019607 2943028 2855061 2756903 2650205 2536956
50802 2536956 2419434 2300359 2182866 2069788 1962817 1862619 1769784 1685250 1609693 1543077
50792 1543077 1485158 1435994 1395520 1362879 1336718 1316138 1300991 1291256 1286260 1284452 1283825 1282837 1281236
50779 1281236 1279763 1278826 1277708 1275378 1271696 1267235 1262154 1255980 1248498 1240103 1231023 1220797 1208912 1195524
50765 1195524 1181117 1165825 1149529 1132404 1114868 1097174 1079465 1062219 1046189 1031792 1018956
50754 1018956 1007693 998421 991454 986477 982959 981061 981720 985680 992709 1002040 1013504 1027978 1046686
50741 1046686 1070235 1098404 1130693 1166877 1207060 1251377 1299745 1351892 1407586 1466884 1530127
50730 1530127 1597538 1668721 1742552 1817698 1893310 1969236 2045507 2121732 2196989 2270257 2340750
50719 2340750 2407632 2469387 2523513 2566994 2597126 2612017 2610528 2592217 2557902 2510370 2454163
50708 2454163 2394103 2333870 2275917 2222354 2175294 2136258 2105772 2083714 2069560 2061916 2058299 2056031
50696 2056031 2053264 2048622 2040034 2024669 2000231 1965981 1922436 1870691 1812367 1749690 1685050 1620419
50684 1620419 1557377 1497474 1442273 1393019 1350408 1314651 1285729 1263727 1248899 1241238 1240101 1244660
50672 1244660 1254734 1270665 1292190 1317938 1346389 1376801 1408670 1440720 1471140 1498726 1523199
50661 1523199 1544588 1563047 1579368 1594866 1610452 1626215 1642138 1658642 1676106 1694383 1713330
50650 1713330 1733439 1755416 1779400 1805218 1833274 1864479 1899210 1936966 1977248 2020284 2066518
50639 2066518 2115812 2167498 2220855 2275093 2329134 2381967 2433071 2482014 2527831 2569559 2607520
50628 2607520 2643425 2678954 2714641 2749966 2783179 2810008 2823447 2816742 2787639 2739865 2680882
50617 2680882 2618654 2559825 2508999 2468493 2438827 2419823 2411023 2411129 2417876 2428894 2442229 2455690
50605 2455690 2466315 2471043 2467578 2454172 2429203 2391695 2342030 2281613 2212273 2136492 2057590 1978532
50593 1978532 1900588 1823974 1749630 1679361 1614157 1553479 1496508 1443200 1393727 1347857 1305510
50582 1305510 1267169 1232977 1202123 1173972 1149205 1128781 1112102 1097436 1084268 1074139 1068716
50571 1068716 1067794 1069732 1073236 1078054 1084355 1092195 1101633 1112797 1125742 1140475 1157124 1175776 1196273
50558 1196273 1218519 1243037 1270693 1301527 1334195 1366979 1399217 1431425 1464048 1496536 1527772
50547 1527772 1557154 1585010 1612095 1638911 1665663 1692865 1721860 1754461 1791851 1833962 1880167
50536 1880167 1930558 1986274 2048697 2118696 2196672 2282752 2376670 2477851 2585998 2701287 2823655
50525 2823655 2952128 3085257 3221968 3361526 3502802 3644077 3783445 3918745 4046978
50516 4046978 4164305 4266880 4351458 4415244 4455861 4471984 4463835 4432661 4379784 4306273 4213360
50505 4213360 4103106 3979015 3846336 3711527 3580884 3459376 3350660 3257904 3184279 3132621
50495 3132621 3104678 3100533 3118470 3155374 3207345 3269953 3337797 3404003 3460480 3499090 3513063
50484 3513063 3497999 3452297 3377110 3275947 3153954 3017007 2870949 2721220 2572738 2429554
50474 2429554 2294256 2167874 2050700 1943202 1845955 1758904 1681244 1612084 1550720 1496091
50464 1496091 1446548 1400648 1357945 1318660 1282921 1250801 1222849 1199874 1182043 1168637 1158809
50453 1158809 1152201 1148652 1147738 1148946 1152147 1157624 1165657 1176223 1189022 1203694 1220145 1238767 1260078
50440 1260078 1283851 1308559 1331886 1351842 1367444 1378628 1385965 1390544 1393734 1396691 1400004 1403844
50428 1403844 1408285 1413376 1419066 1425318 1432242 1439954 1448404 1457643 1468312 1481587 1498594 1520119 1546871
50415 1546871 1579567 1618472 1663243 1713635 1770062 1832897 1901309 1973358 2047285 2122189 2197361
50404 2197361 2271630 2343743 2412881 2478177 2538026 2590496 2634460 2669718 2695769 2710753 2711891
50393 2711891 2696935 2665234 2617771 2556564 2484083 2403055 2316590 2228209 2141533 2059808 1985638
50382 1985638 1920959 1867033 1824506 1793716 1775077 1768970 1775056 1791687 1816098 1845114 1875576 1904247
50370 1904247 1927708 1942727 1946793 1938302 1916462 1881374 1834302 1777592 1714131 1646878 1578665 1511952
50358 1511952 1448368 1388681 1333475 1283605 1239615 1200952 1166427 1135544 1108937 1087431 1071193
50347 1071193 1059821 1052384 1046706 1039218 1026628 1008087 985462 961559 938484 917477 899378 884689
50335 884689 873457 865490 860564 858219 857646 858135 859524 861911 865041 868368 871750 875742 880964 887451
50321 887451 894744 902372 909883 916556 921648 925106 927697 930052 931805 932053 930586 928248 926062 924457
50307 924457 923563 923803 925731 929412 934358 940136 946727 954261 962584 971306 980281 990083 1002027 1017473
50293 1017473 1036853 1059454 1084472 1112297 1144550 1182879 1228137 1280635 1340044 1403543 1463672
50282 1463672 1509226 1530129 1522769 1491316 1444394 1390629 1336361 1285554 1240214 1200789 1166993
50271 1166993 1138638 1115573 1097036 1081728 1068658 1057518 1048189 1040473 1034548 1030988 1029910 1030665 1032985
50258 1032985 1038012 1047360 1061243 1078218 1096767 1116371 1136852 1157346 1176534 1193700 1209233 1224181
50246 1224181 1239527 1255737 1272745 1290187 1307409 1323112 1335213 1341624 1341390 1334905 1323050 1306572
50234 1306572 1286446 1264303 1241917 1220364 1200081 1181651 1166050 1153843 1144240 1135061 1123583 1107483
50222 1107483 1085379 1057062 1023627 987324 950850 916314 884692 856184 830903 809098 790833
50211 790833 775715 763020 752026 742334 734002 727316 722331 718659 715779 713377 711263 709126 706686
50198 706686 703935 701007 697959 694976 692556 691035 690009 688641 686476 683524 679677 674763 669286 664421
50184 664421 660848 657997 654731 650456 645364 640094 635445 631939 629280 626563 623374 620346 618377 617752
50170 617752 618366 620260 623366 627188 631348 636083 641552 647107 652054 656831 662452 668838 674742 679581
50156 679581 684519 691331 700778 712386 725245 738671 752564 767571 784533 803413 822971 841792
50144 841792 859552 877339 897035 920290 947480 977401 1008412 1040057 1073173 1108329 1144865
50133 1144865 1181775 1218886 1256632 1295202 1334518 1374634 1415402 1455778 1493827 1527266 1553678
50122 1553678 1570676 1576594 1571067 1554626 1528051 1492590 1450470 1404372 1356331 1307613 1259517 1213565
50110 1213565 1170865 1131908 1097123 1067018 1041513 1019626 1000116 982044 964594 946935 928779
50099 928779 910901 894676 880991 869536 858988 848009 836414 825488 816791 810659 806202 802689
50087 802689 800336 799524 799979 801201 803288 806766 811731 817587 823472 828619 832548 835298 837364 839051 839984
50072 839984 839563 837711 834796 831031 826408 821198 816067 811502 807442 803508 799356 794831 790083 785551
50058 785551 781601 778122 774786 771671 769303 767985 767452 767288 767423 768077 769528 772150 776407 782478 789981
50043 789981 798279 806986 816087 825760 836227 847549 859284 870530 880677 890131 899960 910766 922137
50030 922137 933289 943966 954534 965410 976688 988270 1000197 1012768 1026486 1041856 1059111
50019 1059111 1078078 1098377 1119750 1142054 1164913 1187488 1208644 1227243 1242331 1253420 1260989
50008 1260989 1266593 1271959 1277665 1282732 1285452 1284363 1278317 1266060 1246449 1219410 1186590 1150866 1115088
49995 1115088 1081109 1049752 1021427 996556 975357 957414 941724 927237 913266 899541 886192
49984 886192 873723 862575 852419 842102 830595 817847 804402 790402 775395 759167 742401
49973 742401 726322 711922 699575 689126 680139 672112 664640 657482 650601 644201 638559 633620 628858
49960 628858 623777 618542 613904 610552 608729 608315 608913 609973 611315 613709 618471 626285 636703 648961
49946 648961 662770 677891 693371 707789 720282 730923 740198 748452 755826 762344 767898 772306 775267
49933 775267 775961 772831 764433 750774 733553 714864 695972 677539 660476 645825 633806 623596
49921 623596 614347 606128 599617 595211 592773 592073 592963 595012 597402 599411 600865 602000 603157 604816 607600
49906 607600 611822 617076 622659 628441 634914 642356 650393 658667 667670 678529 691964 707571 723952
49893 723952 739349 752314 762181 769099 773569 775961 776474 775321 772644 768240 761640 752666 741823 729962
49879 729962 717555 704402 690164 675113 660166 646110 633043 620857 610109 601873 596529 593088
49867 593088 590040 586711 583530 581226 580203 580584 582360 585316 589099 593565 598865 605150 612348 620390
49853 620390 629408 639570 650805 662905 675803 689526 703818 717906 730757 741592 750095 756201
49841 756201 759881 761262 760811 759000 755694 750114 741657 730659 718197 705325 692726 680950 670581
49828 670581 661985 655058 649294 644111 639225 634925 631884 630537 630674 631821 633941 637491 642865 650112
49814 650112 659158 669904 681938 694478 706849 718800 730187 740560 749390 756613 762680 768026
49802 768026 772648 776246 778658 780010 780387 779446 776613 771761 765436 758079 749186 737706 723332 707050
49788 707050 690343 674241 659299 646012 634803 625740 618569 612885 608126 603696 599405 595601 592575
49775 592575 590055 587622 585461 584282 584641 586700 590529 596070 602802 609980 617459 625865 635696 646503
49761 646503 657223 667048 675700 683094 689204 694314 699120 704271 709664 714175 716129 714251 708369 699345
49747 699345 688502 677133 666242 656342 647353 638991 631415 625349 621417 619383 618218 616889 615104
49734 615104 613333 612241 612209 613352 615807 619619 624300 628829 632375 634910 636903 638738 640759 643703 648538
49719 648538 655837 665624 677748 691923 707456 723447 739299 754439 767430 776125 779242 777415
49707 777415 772421 765795 758450 750993 743671 736388 729397 723814 720912 720993 723337 726845 730060 730889 727381
49692 727381 719196 707923 695825 684568 674995 667478 662191 659372 659367 662147 666958 672968 680201 689235
49678 689235 700046 711858 724377 738566 755985 777650 803300 830754 855788 873772 882461 883074
49666 883074 878503 871116 862586 854766 849513 847825 849949 856194 866921 881564 897941 912400 920583
49653 920583 918874 906171 884471 857445 828537 800455 775441 754778 738088 724041 711892 701819
49641 701819 693974 688027 683719 681100 680125 680571 682338 685058 687460 688000 686433 683939 681447 678600 674676
49626 674676 669635 663644 656444 648026 639480 632209 626418 621131 615710 610777 607494 606264 606271 606146 605098
49611 605098 603528 602470 602472 603251 604440 606141 608449 610866 612693 613845 614783 615725 616337 616267 615732 615401 615781
49594 615781 616699 617515 617943 618530 620058 622525 625144 627337 629242 631118 632859 634348 635770 637164 638077
49579 638077 638139 637636 637148 636927 637015 637554 638562 639798 641375 644177 649009 655587 662955 670722 679314 689152
49563 689152 700227 712276 724640 735950 744777 750811 754827 757292 757530 754558 748326 739884 730734
49550 730734 722189 714984 709099 704122 699956 697066 695950 696612 698600 701321 704166 706612 708416 709688
49536 709688 710756 711999 713737 716104 719109 722992 728397 735895 745432 756520 768918 782834 798556
49523 798556 816230 835843 856885 877849 896458 910632 919353 922910 922763 921041 919567 919074 919573
49510 919573 921465 926001 934638 948091 965746 985502 1004235 1018981 1027880 1029851 1023892 1009587 988393
49497 988393 963475 937776 912669 888643 866514 847352 831645 819154 809353 801583 795014 788982
49485 788982 783396 778619 774994 772625 771403 771053 771295 772137 773832 776385 779312 781978 784047 785554 786834
49470 786834 788421 790735 793732 797095 800736 804733 808886 812860 816810 821223 825995 830373 834054 837596
49456 837596 841291 844365 845984 846451 846554 846097 843944 839464 833272 826597 820501 815576 811730 808183 804244
49441 804244 800301 797633 797170 798769 801780 805879 811136 817540 824720 832106 839306 846338 853525 861191
49427 861191 869614 879265 890873 905324 923742 947528 977731 1014338 1056740 1104635 1156852 1208217
49415 1208217 1248808 1268513 1263388 1237633 1200009 1159091 1120963 1088999 1064338 1046904 1036638
49404 1036638 1033624 1037058 1044834 1054646 1065161 1075928 1086729 1097434 1108115 1118847 1129636 1140659
49392 1140659 1152183 1163894 1174714 1183666 1190634 1195882 1199082 1199226 1195411 1187454 1175979 1162267 1147859
49379 1147859 1133862 1120546 1107809 1095950 1085717 1077630 1071571 1067156 1064240 1062923 1063173 1064750 1067552
49366 1067552 1071784 1077462 1083789 1089331 1093024 1094819 1095190 1094208 1091367 1086164 1078568 1069128 1058943 1049343
49352 1049343 1041117 1034011 1027330 1020995 1015673 1011993 1010069 1009756 1010783 1012563 1014481 1016619 1019711 1024057
49338 1024057 1028856 1032886 1035473 1036393 1035242 1031505 1025210 1017156 1008398 999691 991415 983925 977926 974416
49324 974416 974091 976866 982297 990461 1002048 1017545 1036753 1059227 1084573 1111771 1138405 1161060
49312 1161060 1176586 1183137 1180518 1170025 1153783 1133792 1111455 1087893 1064277 1041612 1020526 1001539
49300 1001539 985221 971744 960607 951302 944083 939607 937925 938250 939698 941893 944855 948610 952907
49287 952907 957073 960259 962140 963282 964527 966048 967250 967391 965999 962932 958576 953944 950058 947203
49273 947203 945131 943885 943801 944690 945704 946304 946801 947622 948511 948861 948472 947551 946224 944528 942734 941330 940788
49256 940788 941733 945291 952936 965927 984989 1010235 1040961 1075590 1112237 1149311 1185095 1216693
49244 1216693 1240142 1252306 1252722 1243374 1226818 1204896 1179112 1151450 1124203 1099028 1076494 1056629
49232 1056629 1039704 1026408 1017359 1012457 1010664 1010520 1011117 1012560 1015294 1019058 1022833 1025903 1028524 1031310
49218 1031310 1034336 1037348 1040573 1044710 1050053 1056167 1062666 1069849 1078277 1087961 1098303 1108741 1119145
49205 1119145 1129621 1140149 1150584 1161060 1172332 1185479 1200963 1217991 1235112 1251451 1267082
49194 1267082 1282198 1296505 1309696 1322006 1333737 1344491 1353498 1360632 1366548 1371805 1376468 1380720
49182 1380720 1385281 1390798 1397248 1404440 1412866 1423553 1437183 1453888 1473975 1498430 1528482 1565088
49170 1565088 1609145 1661786 1723502 1792205 1862103 1924834 1972314 1999370 2004883 1991655 1965574
49159 1965574 1934103 1904041 1879582 1861922 1850443 1844097 1841870 1842624 1845160 1848570 1852355 1856182 1859701
49146 1859701 1862659 1865120 1867513 1870460 1874507 1879955 1886886 1895309 1905215 1916554 1929283 1943381 1958676
49133 1958676 1974666 1990796 2006905 2023214 2039784 2056345 2072757 2089281 2106123 2123041 2139754
49122 2139754 2156475 2173597 2191088 2208702 2226669 2245664 2266137 2288245 2312522 2340025 2371698
49111 2371698 2408143 2450405 2500745 2562649 2640639 2740112 2866059 3020002 3196829 3384487
49101 3384487 3568194 3738057 3895545 4052177 4217692 4385067 4526731 4608948 4614106 4551789
49091 4551789 4449656 4333503 4213363 4084200 3936725 3768036 3585002 3400288 3225969
49082 3225969 3069834 2935475 2823722 2733239 2660718 2601992 2553711 2514077 2482146 2456776 2436337
49071 2436337 2419124 2403785 2389324 2374943 2360187 2345366 2331557 2319820 2310275 2302119 2294572 2287652
49059 2287652 2281961 2277889 2275185 2273265 2271822 2271058 2271310 2272563 2274508 2277049 2280400 2284598 2289314 2294479
49045 2294479 2300721 2308668 2318074 2328200 2338894 2350419 2362075 2371775 2377515 2378896 2376971 2373140 2368688
49032 2368688 2364922 2362939 2363086 2364960 2367887 2371279 2374677 2377823 2380591 2382675 2383459 2382555 2380425 2378232 2377087
49017 2377087 2377522 2379499 2382687 2386828 2392081 2398864 2407149 2416103 2424837 2433417 2442729 2453275 2464448 2475161
49003 2475161 2484890 2493889 2502493 2510484 2517231 2522360 2526069 2528631 2529742 2528801 2525923 2522192 2518520 2514509
48989 2514509 2508966 2501393 2492529 2483442 2474596 2465877 2457027 2447838 2438300 2428898 2420557 2414022 2409403 2406406
48975 2406406 2404760 2404164 2404078 2403967 2403747 2403755 2404263 2405251 2406558 2407990 2409225 2409908 2409951 2409583 2409026 2408358 2407818 2407952
48957 2407952 2409205 2411537 2414827 2419488 2426244 2435291 2446231 2459032 2474507 2493401 2515410 2539683
48945 2539683 2566071 2595188 2627220 2661334 2696420 2731839 2767250 2802313 2837062 2872182 2908449
48934 2908449 2946160 2985451 3026831 3070824 3117300 3165753 3216074 3268425 3322401 3377050 3431946
48923 3431946 3487663 3544809 3603054 3661532 3719916 3778611 3837993 3897742 3956910 4014372 4069298
48912 4069298 4121448 4171079 4218457 4263546 4306262 4346826 4385574 4422463 4457059 4489037 4518499
48901 4518499 4545756 4571056 4594624 4616735 4637495 4656620 4673612 4688101 4699852 4708466 4713337 4713989
48889 4713989 4710355 4702679 4691272 4676485 4658773 4638540 4615911 4590757 4563004 4532840 4500671 4466975
48877 4466975 4432218 4396703 4360363 4322654 4282674 4239433 4192256 4141235 4087272 4031428 3974157
48866 3974157 3915448 3855788 3796551 3739109 3683898 3630830 3580347 3533380 3490236 3450298 3413181
48855 3413181 3379621 3350657 3326360 3305965 3288946 3275130 3263820 3253745 3244288 3236121 3230125 3226249
48843 3226249 3224079 3224059 3227267 3234061 3243722 3255560 3269644 3286147 3304606 3324236 3344597 3365608 3387312
48830 3387312 3410000 3434138 3459602 3485171 3509312 3531482 3552317 3572704 3593097 3613598 3634210
48819 3634210 3654872 3675525 3696193 3716839 3737280 3757521 3777956 3798813 3819543 3839262 3857812
48808 3857812 3875940 3894398 3913334 3932671 3952580 3973351 3995066 4017575 4040538 4063523 4086384
48797 4086384 4109575 4133724 4158921 4184809 4211238 4238135 4264630 4289069 4310284 4328410 4344182
48786 4344182 4358027 4370131 4380689 4389473 4395580 4398213 4397325 4392883 4383757 4368018 4344311 4312548 4273501
48773 4273501 4228338 4178435 4125011 4068770 4010182 3950016 3889155 3828040 3766803 3705897 3646051
48762 3646051 3587540 3530018 3473291 3417809 3364164 3312495 3262713 3215067 3170161 3128443 3089980
48751 3089980 3054764 3023001 2994913 2970307 2948618 2929545 2913498 2901071 2892111 2885608 2880572 2876669
48739 2876669 2873996 2872669 2872855 2874758 2878182 2882434 2887010 2891990 2897377 2902403 2906078 2908253 2909681 2911155
48725 2911155 2912979 2915040 2916872 2917808 2917625 2917000 2916787 2916898 2916354 2914407 2911068 2906648 2901499 2896380 2892390
48710 2892390 2890131 2889288 2889236 2889647 2890302 2890830 2891078 2891457 2892512 2894210 2895990 2897404 2898521 2899770 2901516 2903807
48694 2903807 2906454 2909435 2913220 2918582 2926086 2935824 2947477 2960353 2973411 2985570 2996142 3004866 3011700
48681 3011700 3016881 3021175 3025623 3030832 3036716 3042946 3049306 3055419 3060427 3063283 3063371 3060867 3056620 3051694
48667 3051694 3046764 3041689 3035610 3027405 3016026 3000606 2980566 2955795 2926688 2894020 2858765 2821762
48655 2821762 2783309 2743142 2701026 2657310 2612843 2568637 2525851 2485773 2449315 2416554 2387127
48644 2387127 2360901 2337851 2317452 2298769 2281159 2264355 2247815 2230664 2212483 2193703 2174925
48633 2174925 2156259 2137655 2119515 2102587 2087346 2073630 2060795 2048082 2035060 2021860 2008839
48622 2008839 1995976 1982771 1968823 1954313 1939912 1926403 1914405 1904187 1895670 1888792 1883880 1881412
48610 1881412 1881430 1883501 1887250 1892575 1899278 1906809 1914507 1921762 1927893 1932221 1934480 1935015 1934459 1933417 1932509
48595 1932509 1932461 1934011 1937744 1943764 1951132 1957709 1961102 1960024 1954553 1945229 1932407 1916552 1898590 1879633
48581 1879633 1860543 1841834 1823625 1805628 1787627 1770134 1754143 1740066 1727384 1715585 1705003
48570 1705003 1696375 1689941 1685411 1682609 1681731 1682980 1686204 1690862 1696203 1701518 1706244 1709781 1711306 1710035
48556 1710035 1705680 1698402 1688396 1675919 1661768 1647320 1633865 1622036 1611840 1602919 1594815 1587270
48544 1587270 1580212 1573102 1564539 1553154 1538938 1523050 1506345 1488859 1470885 1453608 1438189 1424909
48532 1424909 1413725 1404990 1398930 1394999 1392620 1392308 1395323 1402332 1413087 1427243 1444509 1463504 1480947
48519 1480947 1492539 1494912 1487039 1470366 1448012 1423560 1399892 1378513 1359777 1343825 1331249 1322681
48507 1322681 1317938 1316254 1317592 1323197 1334373 1351196 1372953 1399258 1429755 1462788 1495060 1522501
48495 1522501 1540950 1546829 1538936 1520053 1495688 1470597 1446990 1425717 1407491 1392213 1378440 1364757
48483 1364757 1351047 1337699 1324378 1310539 1296487 1282900 1269774 1256829 1244601 1234025 1225063
48472 1225063 1216654 1208074 1199624 1191963 1185460 1180217 1176144 1172826 1169730 1166651 1163821 1161711 1160922 1161910
48458 1161910 1164496 1167947 1171894 1176827 1183276 1190813 1198317 1204855 1209753 1212198 1211541 1208035 1202772 1196928
48444 1196928 1191374 1186758 1183385 1180983 1178948 1176787 1174109 1170440 1165472 1159365 1152501 1145032 1136935 1128363
48430 1128363 1119668 1111228 1103393 1096346 1089813 1083258 1076537 1070070 1064160 1058525 1052719 1046539 1039748 1031933
48416 1031933 1023038 1013669 1004489 995664 987227 979530 972894 967169 961986 957167 952663 948497 944946 942353
48402 942353 940555 939041 937784 937199 937101 936511 934904 932841 930886 928728 925887 922537 919046 915430 911798
48387 911798 908614 905989 903503 901225 899978 899978 900269 900248 900722 902485 904884 906902 908703 910778 912356 912138
48371 912138 910276 908312 907393 907567 908557 910165 912018 913820 915824 918585 922487 927899 935203 944306 954889
48356 954889 967540 983626 1003468 1025740 1049183 1073501 1097611 1118597 1133780 1142850 1146923 1146974
48344 1146974 1144554 1142612 1143722 1148265 1155563 1165625 1178535 1193620 1210856 1231735 1257169 1285980
48332 1285980 1317095 1351555 1390586 1433527 1479798 1531123 1589515 1654872 1726942 1807752 1899681
48321 1899681 2003271 2119642 2252687 2406163 2581633 2782923 3019879 3304422 3647143
48312 3647143 4063137 4578393 5226783 6047240 7091345 8427906 10130501 12262105 14864970
48303 14864970 17917602 21232632 24376587 26750946 27847793 27498443 25916988 23534883
48295 23534883 20793016 18027756 15452213 13173709 11220712 9577487 8212639 7088792
48287 7088792 6164031 5399244 4765471 4241223 3806510 3443851 3141599 2891224 2682971
48278 2682971 2507397 2358772 2233485 2126934 2034869 1955814 1889220 1832736 1783684 1741462
48268 1741462 1705995 1675431 1647686 1622779 1601411 1582686 1565458 1550555 1539345 1531206 1524403 1518445
48256 1518445 1513592 1509101 1504046 1499118 1495787 1494347 1494459 1496924 1503175 1513211 1525149 1536145 1542747
48243 1542747 1541544 1531235 1513843 1492837 1470558 1448147 1426695 1407026 1389102 1372988 1359625
48232 1359625 1349417 1340815 1331671 1321349 1310251 1298043 1283930 1268258 1252349 1236862 1221492 1206080
48220 1206080 1190879 1175821 1160500 1144861 1129225 1113792 1098593 1083515 1067850 1050449 1030961
48209 1030961 1010391 989823 969290 948505 927812 907557 887406 867286 848206 830998 815008
48198 815008 799185 783839 770054 757855 746297 735079 724817 715880 708009 700992 694787 689116
48186 689116 683809 679281 675830 672753 669041 664655 660275 656190 652384 649328 647590 646812 646101 645218 644430
48171 644430 643470 641777 639667 638162 637602 637398 637150 637057 637176 637249 637360 637838 638431 638434 637809 637348 637550 638130 638775
48152 638775 639562 640424 640937 640941 640745 640532 640157 639719 639755 640667 642428 644864 647642 649989 651141 651238 651215 651728 652805
48133 652805 654562 657392 661204 665260 669142 673208 677700 682066 685683 688747 691918 695426 699073 702856
48119 702856 707085 711916 717120 722309 727241 731996 736991 742783 749734 757924 767250 777419 787970 798634
48105 798634 809608 821174 833133 845039 856970 869554 883158 897501 912227 927270 942385
48094 942385 956948 970738 984560 999420 1015208 1030711 1044950 1057991 1070402 1082487 1094308
48083 1094308 1106021 1117616 1128484 1137785 1145272 1151451 1156870 1161718 1166212 1170872 1176059 1181654 1187556
48070 1187556 1194101 1201441 1208962 1215999 1222844 1230180 1237709 1244421 1250324 1256722 1264278 1271779 1277539 1281206
48056 1281206 1283343 1283885 1282147 1278078 1272519 1266154 1258895 1250297 1239954 1227445 1212553 1195779 1178309
48043 1178309 1161215 1144715 1128077 1110117 1090095 1068417 1046312 1024618 1003225 981931 961301
48032 961301 942119 924397 907617 891662 876741 862540 848227 833446 818658 804353 790485
48021 790485 776906 763930 752114 741697 732403 723754 715506 707840 700968 694504 687584 679867 672089
48008 672089 665273 659714 655192 651793 649807 648946 648381 647641 646907 646361 645764 644846 643691 642533 641463 640497
47992 640497 639719 639259 639217 639529 639809 639535 638635 637622 636900 636221 635184 633843 632326 630255 627259 623888 621188
47975 621188 619377 617609 615179 612305 609616 607396 605556 603867 602039 599957 597968 596616 596047 596056 596648
47960 596648 598102 600369 602913 605270 607456 609737 612333 615347 618668 621952 625082 628589 633280 639519
47946 639519 647212 656193 666089 676050 685384 694398 703878 713792 723318 732214 741180 750624 759942 768442
47932 768442 776209 783521 790078 795362 799254 801794 802777 802102 800134 797219 793193 787760 781013 773203 764413
47917 764413 754901 745385 736463 728091 720073 712665 706083 699721 692634 684802 677325 671269 666724 663079
47903 663079 659897 657360 656055 656324 657808 659732 661688 663884 666612 669898 673970 679505 686821 695100
47889 695100 703026 710139 717064 724496 732486 740732 749015 757190 765192 773237 781623 790142 797966 804381
47875 804381 809407 813463 816601 818291 817907 815234 810622 804692 797853 789987 780785 770446 759829 749593
47861 749593 739309 727851 714793 701109 688241 676743 666178 656168 646960 638852 631580 624719
47849 624719 618371 612961 608479 604486 600997 598867 598915 600890 603637 606200 608468 610812 613454 616426 619937
47834 619937 624327 629551 634911 639582 643317 646403 649013 650982 652339 653703 655813 658804 662214 665529
47820 665529 668488 670981 673049 674996 677216 679844 682807 686273 690806 696896 704531 713486 724071 737337
47806 737337 754254 774665 797314 821084 845972 872514 900500 928761 956166 982192 1006357
47795 1006357 1027776 1045639 1059690 1069845 1075808 1077485 1075364 1070036 1061808 1051244 1039509 1027421
47783 1027421 1014575 1000260 985008 970289 956814 944117 931920 920916 911796 904262 897459 890819
47771 890819 884036 876699 868511 859703 850898 842589 834817 827191 819198 810723 802218 794114 786251 778286
47757 778286 770469 763432 757333 751922 747434 744643 743795 744226 745340 747313 750469 754580 759259 764578 770813
47742 770813 777964 785954 794979 805283 816842 829636 843882 859627 876368 893408 910378 927127
47730 927127 943356 958722 973061 986197 997677 1006994 1013992 1018835 1021731 1022803 1022083 1019475 1014847
47717 1014847 1008174 999423 988429 975298 960840 946021 930903 914729 897302 879666 863118 848122
47705 848122 834610 822735 812626 803825 795718 788498 783177 780529 780343 781690 783736 786310 789862 794851
47691 794851 801159 808306 816189 825295 836085 848440 861790 875507 889161 902851 917284 933012
47679 933012 949439 965111 979157 991851 1003585 1013974 1022415 1028902 1033755 1036998 1038488 1038228 1036091
47666 1036091 1031647 1024728 1015833 1005508 993754 980444 965926 950748 935212 919652 904695 890738
47654 890738 877593 865161 853963 844399 835962 827895 820234 813522 807905 803308 800110 798701 798535 798551
47640 798551 798457 798846 800131 802177 804930 808533 812720 816829 820621 824482 828758 833579 839417 847111 857081
47625 857081 869117 883145 899600 918798 940525 964476 990602 1018593 1047407 1075613 1101988
47614 1101988 1125694 1146209 1163289 1176730 1186002 1190312 1189046 1181889 1168602 1149120 1123945 1094129
47602 1094129 1060763 1024813 987380 949628 912323 875793 840474 807143 776471 748656 723611
47591 723611 701238 681385 663777 648101 634002 621106 609318 599016 590594 583874 578307 573616
47579 573616 569806 566603 563469 560325 557777 556349 555801 555337 554292 552549 550535 548829 547526 545983 543477
47564 543477 540062 536441 533120 530115 527408 525106 523057 520806 518171 515494 513193 511384 510032 509126
47550 509126 508511 507853 506882 505471 503548 501267 499217 498029 497723 497801 497995 498495 499403 500435 501234 501559 501133
47533 501133 499801 498008 496626 496095 496073 496067 495976 495889 495790 495705 495771 495969 496138 496393 497167 498625 500382 501891 502838
47514 502838 503147 502975 502773 502931 503289 503438 503483 503935 504813 505506 505704 505778 505978 505943 505314 504231 502865 501102 499167
47495 499167 497881 497696 498027 498157 498305 499108 500504 501941 503423 505465 508048 510456 512245 513736 515266
47480 515266 516502 516905 516621 516517 517272 518656 519878 520594 521245 522191 522947 522931 522772 523965 527049 530925 534374
47463 534374 537454 540739 543901 545892 546167 544970 542734 539992 537628 536372 536034 535889 535796 536301 537707 539801
47447 539801 542583 546560 552092 558948 566679 574983 583633 592594 602374 613805 627300 642719 660029
47434 660029 679538 701245 724491 748559 773151 797937 822040 844437 864617 882428 897453
47423 897453 908977 916589 920464 921000 918281 912025 901979 888403 872170 854333 835709 816957 798838
47410 798838 781982 766330 751180 735965 720816 706346 693184 681773 672180 663903 656223 649023
47398 649023 642988 638712 635899 633767 631908 630363 629148 628274 628127 629255 631746 635259 639664 645098 651290
47383 651290 657433 663040 668491 674329 680337 685779 690332 694345 698199 701760 704425 705497 704585 701885
47369 701885 698062 693618 688494 682379 675187 666894 657225 646058 634065 622370 611441 600830 590074
47356 590074 579337 568961 558916 549039 539417 530188 521318 512901 505348 498943 493503 488765 484769
47343 484769 481509 478618 475858 473604 472327 471861 471718 471865 472531 473514 474332 475054 476294 478317 480722 483081
47327 483081 485369 487741 490373 493583 497473 501368 504210 505768 506912 508458 510222 511486 511891 511584 510868
47312 510868 510075 509513 509232 509015 508663 508084 507071 505508 503884 503155 503813 505507 507746 510533 514064 518313
47296 518313 523272 529165 536054 543499 550974 558398 566000 573985 582573 592051 602413 613226 624110
47283 624110 635074 646162 657060 667389 677059 686171 694927 703919 714036 725649 738168 750788
47271 750788 763465 776893 791757 808143 825027 839869 849205 850506 843612 830312 812946 793671
47259 793671 774411 756521 740402 725810 712432 699992 688201 677075 667004 658067 649681 641435
47247 641435 633864 627750 623016 619034 615728 613534 612390 611606 610766 610035 609569 609342 609667 611155 613958 617601
47231 617601 621723 626418 631767 637670 644338 652342 661792 671914 681692 690586 698482 705451 711858 718295
47217 718295 724995 731502 737128 741523 744623 746315 746390 744723 741437 737036 732277 727563 722487 716299 708950
47202 708950 701340 694509 688912 684492 681031 678264 676013 674423 673839 674330 675617 677552 680421 684697 690695
47187 690695 698472 707801 718220 729395 741379 754294 767919 782030 796943 813143 830404 847870
47175 847870 865036 882045 899002 915654 931845 947554 962269 975085 985776 995021 1003135 1009250
47163 1009250 1012330 1012454 1010585 1007572 1003890 999733 994645 987606 978296 967996 958469 950221 942590 935139
47149 935139 927963 920807 913119 905237 898558 894016 891115 888935 887432 887138 888130 890025 892732 896501 901259
47134 901259 906493 911893 917692 924189 931172 937902 943499 947253 948771 947950 944801 939332 931714 922530
47120 922530 912602 902435 891924 880671 868472 855422 841765 827846 814159 801234 789461 779011
47108 779011 769745 761031 751945 742104 732248 723570 716364 709722 702724 695488 688784 683019 678036 673647
47094 673647 669894 666914 664928 664301 665157 666980 668984 670931 673338 676853 681646 687374 693512 699763 706325
47079 706325 713590 721395 728889 735488 741595 747771 753515 757678 759986 761316 762369 762955 762896 762747 763076
47064 763076 763695 764211 764821 765914 767257 768318 769175 770517 772813 775935 779512 783259 787058 791091 795751
47049 795751 801120 806735 812331 818556 826307 835370 844291 851776 857836 863419 869330 875718 882383 889260
47035 889260 896633 904921 914200 924035 933907 943732 953703 963701 973135 981418 988441 994517 999967 1004750
47021 1004750 1008383 1010271 1010233 1008647 1005977 1002343 997780 992704 987752 983123 978400 973049 966908 960222
47007 960222 953519 947480 942618 938860 935633 932484 929538 927325 926300 926587 927994 930157 932740 935590
46993 935590 938720 942250 946438 951650 957995 964989 971885 978465 985327 993221 1002277 1012061 1022302 1033255
46979 1033255 1045280 1058256 1071589 1084842 1098168 1112005 1126393 1140780 1154566 1167672 1180426
46968 1180426 1192989 1205028 1215917 1225129 1232445 1237918 1241744 1244183 1245594 1246417 1246948 1247096 1246588 1245546
46954 1245546 1244629 1244445 1244966 1245819 1247024 1249172 1252835 1258041 1264358 1271221 1278136 1284805 1291289 1297957 1305107
46939 1305107 1312691 1320497 1328583 1337444 1347680 1359481 1372425 1385751 1398805 1411186 1422533 1432353
46927 1432353 1440099 1445339 1447805 1447440 1444432 1438974 1430952 1420150 1406919 1392298 1377060 1360919 1343178
46914 1343178 1324027 1304576 1285627 1267159 1249276 1232930 1219031 1207313 1196884 1187815 1181408 1178763
46902 1178763 1179670 1183246 1189189 1197946 1209908 1224878 1242288 1261625 1282553 1304796 1327977 1351566
46890 1351566 1375088 1398415 1421713 1445010 1467976 1490218 1511464 1531239 1548723 1563355 1575430
46879 1575430 1585623 1594054 1600390 1604788 1608083 1610861 1613009 1614509 1616097 1618662 1622443 1627352 1633711 1642033
46865 1642033 1652265 1663846 1676444 1690178 1705187 1721404 1738622 1756294 1773412 1789177 1803792
46854 1803792 1817981 1831650 1843644 1852908 1859315 1863107 1864211 1862576 1858645 1852940 1845482 1836146 1825462
46841 1825462 1814516 1804026 1793887 1783790 1774040 1765484 1758677 1753381 1749083 1745904 1744593 1745562 1748380
46828 1748380 1752568 1758458 1766687 1777138 1788997 1801693 1815102 1828913 1842538 1855627 1867867 1878283
46816 1878283 1885698 1890154 1892836 1894208 1893205 1888935 1882191 1874369 1865645 1855324 1843438 1830800 1817693
46803 1817693 1803668 1788692 1773517 1758708 1744113 1729534 1715317 1702034 1690001 1679240 1669515
46792 1669515 1660403 1651797 1644328 1638806 1635265 1633039 1631730 1631439 1632033 1632956 1634013 1635704 1638398 1641619 1644532
46777 1644532 1646773 1648568 1650331 1652382 1654760 1657137 1659199 1661306 1664345 1668728 1673911 1679201 1684631 1690674
46763 1690674 1697437 1704697 1712578 1721613 1732058 1743489 1755349 1767649 1780850 1795103 1809804 1823998
46751 1823998 1837064 1848886 1859518 1869082 1877983 1886754 1895410 1903257 1909634 1914568 1918420 1921237 1922973
46738 1922973 1924086 1925228 1926403 1927025 1926853 1926388 1926329 1927170 1929304 1932834 1937058 1940808 1943676 1946528 1950426
46723 1950426 1955463 1960951 1966332 1971434 1976141 1980288 1983778 1986362 1987403 1986175 1982474 1976785 1969867 1962200
46709 1962200 1953653 1943529 1931094 1916236 1899586 1881922 1863582 1844416 1824089 1802372 1779411
46698 1779411 1755833 1732392 1709439 1686953 1665073 1644195 1624433 1605400 1586760 1568701 1551622
46687 1551622 1535759 1521355 1508833 1498281 1488964 1479763 1470109 1460282 1450977 1442898 1436579 1432110 1428980
46674 1428980 1426409 1423964 1421760 1420185 1419641 1420473 1422911 1427003 1432722 1440148 1449415 1460556 1473447 1487814
46660 1487814 1503215 1519125 1535099 1550820 1565913 1579901 1592405 1603227 1612172 1618967 1623491 1625919
46648 1625919 1626509 1625447 1623029 1619873 1616752 1614324 1613017 1613028 1614356 1617081 1621691 1628914 1639131 1652166
46634 1652166 1667715 1685583 1705422 1726666 1749014 1772535 1796924 1820995 1843324 1863135 1880124
46623 1880124 1893709 1903065 1907857 1908446 1905338 1898775 1888815 1875436 1858566 1838392 1815675 1791446 1766324
46610 1766324 1740410 1713813 1686971 1660436 1634676 1610122 1587152 1565953 1546547 1528847 1512438
46599 1512438 1496528 1480630 1465293 1451739 1440633 1431543 1423573 1415998 1408225 1399790 1390826 1382114 1374191
46586 1374191 1366621 1358530 1349631 1340358 1331163 1322206 1313666 1305901 1299092 1293020 1287348 1281979 1277079 1272871
46572 1272871 1269454 1266679 1264229 1261983 1260271 1259524 1259647 1259982 1260027 1259901 1259967 1260326 1260945 1261989 1263562 1265325
46556 1265325 1266837 1268260 1270194 1272788 1275569 1278317 1281509 1285620 1290498 1295853 1301791 1308274 1314551 1320004
46542 1320004 1325368 1332262 1341472 1352355 1363937 1375865 1388217 1401219 1415388 1431294 1448851 1467475
46530 1467475 1487153 1508597 1531978 1556351 1580856 1605714 1631349 1657271 1682682 1707615 1732452
46519 1732452 1756717 1779343 1799973 1818983 1836363 1851558 1864437 1875448 1884751 1892088 1897688 1902333
46507 1902333 1906226 1908596 1908859 1907438 1905052 1901857 1897814 1893242 1888470 1883436 1878161 1873118 1868520 1863629
46493 1863629 1857365 1849365 1839943 1829268 1817160 1803527 1788484 1772060 1754158 1734693 1713520 1690455
46481 1690455 1665676 1639771 1613017 1584977 1555389 1525101 1495355 1466316 1437201 1407939 1379862
46470 1379862 1354366 1331583 1310903 1292354 1276814 1264942 1256418 1250338 1246119 1243971 1244554 1248174 1254308
46457 1254308 1262033 1270980 1281569 1294206 1308519 1323671 1339200 1355104 1371108 1386296 1399773 1411469
46445 1411469 1421995 1431772 1440494 1447495 1452436 1455569 1457429 1458388 1458457 1457439 1455280 1452383 1449574 1447693
46431 1447693 1447074 1447317 1447527 1446992 1445942 1445696 1447810 1452894 1460441 1469963 1481932 1497239 1515977 1537328
$$ [...]
##END NTUPLES=NMR SPECTRUM
##END=
