
##TITLE=AC1320_SSOAH12149_6608770_IfrrvIvZNJ
##JCAMPDX= 6.0         $$ Bruker NMR JCAMP-DX V2.0
##DATA TYPE= NMR SPECTRUM
##DATA CLASS= NTUPLES
##ORIGIN= BRUKER
##OWNER= Administrator
$$ 1.72 TOPSPIN		Version 2.1
$$ 2012-08-01 16:55:20.421 -0500  Administrator@TOPSPIN
$$ Compression mode = diff/dup
##.OBSERVE FREQUENCY= 400.02188249412
##.OBSERVE NUCLEUS= ^1H
##.ACQUISITION MODE= SIMULTANEOUS (DQD)
##.ACQUISITION SCHEME= undefined
##.AVERAGES= 8
##.DIGITISER RES= 22
##SPECTROMETER/DATA SYSTEM= spect
##.PULSE SEQUENCE= zg30
##.SOLVENT NAME= COFFEE_meoh
##.SHIFT REFERENCE= INTERNAL, COFFEE_meoh, 1, 14.98509
##AUDIT TRAIL= $$ (NUMBER, WHEN, WHO, WHERE, PROCESS, VERSION, WHAT)
$$ ##TITLE= Audit trail, TOPSPIN		Version 2.1
$$ ##JCAMPDX= 5.01
$$ ##ORIGIN= Bruker BioSpin GmbH
$$ ##OWNER= Administrator
$$ $$ C:\Bruker\TOPSPIN/data/COFFEE/nmr/AC1320_SSOAH12149_6608770_IfrrvIvZNJ/10/pdata/1/auditp.txt
$$ ##AUDIT TRAIL=  $$ (NUMBER, WHEN, WHO, WHERE, PROCESS, VERSION, WHAT)
(   1,<2012-08-01 16:55:12.718 -0500>,<Administrator>,<TOPSPIN>,<go>,<TOPSPIN 2.1>,
      <created by zg
	started at 2012-08-01 16:54:06.171 -0500,
	POWCHK enabled, PULCHK disabled,
       configuration hash MD5:
       6B 1B 68 BB D9 2E 58 E2 7F 35 AD 54 07 DF 0E 41
       data hash MD5: 64K
       FD B6 34 7B 37 4E 8C A0 CE 29 38 A1 A6 11 AD CB>)
(   2,<2012-08-01 16:55:15.718 -0500>,<Administrator>,<TOPSPIN>,<proc1d>,<TOPSPIN 2.1>,
      <Start of raw data processing
       efp LB = 0 FT_mod = 6 PKNL = 1 PHC0 = 0 PHC1 = 0 SI = 32K 
       data hash MD5: 32K
       B4 D4 B4 CF FD FD 63 0D FE F1 5E BE 45 DB 9A 00>)
(   3,<2012-08-01 16:55:16.031 -0500>,<Administrator>,<TOPSPIN>,<proc1d>,<TOPSPIN 2.1>,
      <pk PHC0 = 177.9236 PHC1 = 0 
       data hash MD5: 32K
       92 0A 19 3E 1C 80 3F E5 2A B1 F4 FD 10 BD 71 99>)
(   4,<2012-08-01 16:55:16.140 -0500>,<Administrator>,<TOPSPIN>,<proc1d>,<TOPSPIN 2.1>,
      <abs ABSG = 1 
       data hash MD5: 32K
       84 9B 90 39 02 3F 0D 9D ED 66 7E 0F F1 33 2F BC>)
(   5,<2012-08-01 16:55:16.187 -0500>,<Administrator>,<TOPSPIN>,<proc1d>,<TOPSPIN 2.1>,
      <abs ABSG = 2 
       data hash MD5: 32K
       A8 79 61 6D 74 F1 E9 C5 08 2C 05 DB 6C 17 53 63>)
(   6,<2012-08-01 16:55:16.218 -0500>,<Administrator>,<TOPSPIN>,<proc1d>,<TOPSPIN 2.1>,
      <abs ABSG = 3 
       data hash MD5: 32K
       4F 91 23 81 E3 14 E7 4D 69 D3 7B 34 16 17 98 24>)
(   7,<2012-08-01 16:55:16.250 -0500>,<Administrator>,<TOPSPIN>,<proc1d>,<TOPSPIN 2.1>,
      <abs ABSG = 4 
       data hash MD5: 32K
       2B 50 27 88 E3 C3 EB 9D 4C BC 43 B1 6B AD D4 0A>)
(   8,<2012-08-01 16:55:16.265 -0500>,<Administrator>,<TOPSPIN>,<proc1d>,<TOPSPIN 2.1>,
      <abs ABSG = 5 
       data hash MD5: 32K
       FA BF C1 3E 7A 74 B5 2B 9A 8E 33 9F 2D A4 6E DB>)
$$ ##END=
$$ 
$$ $$ hash MD5
$$ $$ 3A 7F 20 9D 87 7A A4 C2 72 2C 4F DE A3 A7 71 BA
##$RELAX= 
##$RELAX= 
##$RELAX= 
##$RELAX= 
##$RELAX= 
##$RELAX= 
##$RELAX= 
$$ Bruker specific parameters
$$ --------------------------
$$ [...]
##$TP= (0..7)
150 150 150 150 150 150 150 150
##$TP07= 0
##$TPNAME0= <>
##$TPNAME1= <>
##$TPNAME2= <>
##$TPNAME3= <>
##$TPNAME4= <>
##$TPNAME5= <>
##$TPNAME6= <>
##$TPNAME7= <>
##$TPOAL= (0..7)
0.5 0.5 0.5 0.5 0.5 0.5 0.5 0.5
##$TPOFFS= (0..7)
0 0 0 0 0 0 0 0
##$TUNHIN= 0
##$TUNHOUT= 0
##$TUNXOUT= 0
##$USERA1= <user>
##$USERA2= <user>
##$USERA3= <user>
##$USERA4= <user>
##$USERA5= <user>
##$V9= 5
##$VALIST= <valist>
##$VCLIST= <CCCCCCCCCCCCCCC>
##$VD= 0
##$VDLIST= <DDDDDDDDDDDDDDD>
##$VPLIST= <PPPPPPPPPPPPPPP>
##$VTLIST= <TTTTTTTTTTTTTTT>
##$WBST= 1024
##$WBSW= 4
##$XGAIN= (0..3)
0 0 0 0
##$XL= 0
##$YL= 0
##$YMAX_a= 481559
##$YMIN_a= -628862
##$ZGOPTNS= <>
##$ZL1= 120
##$ZL2= 120
##$ZL3= 120
##$ZL4= 120
##$ABSF1= 14.98509
##$ABSF2= -5.573092
##$ABSG= 5
##$ABSL= 3
##$ALPHA= 0
##$AQORDER= 0
##$ASSFAC= 0
##$ASSFACI= 0
##$ASSFACX= 0
##$ASSWID= 0
##$AUNMP= <proc_prof1d_extract_pilot.lims>
##$AXLEFT= 0
##$AXNAME= <>
##$AXNUC= <1H>
##$AXRIGHT= 0
##$AXTYPE= 0
##$AXUNIT= <>
##$AZFE= 0.1
##$AZFW= 0.1
##$BCFW= 0
##$BC_mod= 0
##$BYTORDP= 0
##$COROFFS= 0
##$CY= 15
##$DATMOD= 1
##$DC= 0
##$DFILT= <>
##$DTYPP= 0
##$F1P= 0
##$F2P= 0
##$FCOR= 0.5
##$FTSIZE= 32768
##$FT_mod= 6
##$GAMMA= 0
##$GB= 0
##$INTBC= 1
##$INTSCL= 1
##$ISEN= 128
##$LB= 0
##$LEV0= 0
##$LPBIN= 0
##$MAXI= 10000
##$MC2= 0
##$MEAN= 0
##$ME_mod= 0
##$MI= 0
##$NCOEF= 0
##$NC_proc= -8
##$NLEV= 6
##$NOISF1= 0
##$NOISF2= 0
##$NSP= 0
##$NTH_PI= 0
##$NZP= 0
##$OFFSET= 14.98509
##$PC= 1
##$PHC0= 177.9236
##$PHC1= 0
##$PH_mod= 1
##$PKNL= yes
##$PPARMOD= 0
##$PPDIAG= 0
##$PPIPTYP= 0
##$PPMPNUM= 2147483647
##$PPRESOL= 1
##$PSCAL= 4
##$PSIGN= 0
##$PYNMP= <proc.py>
##$REVERSE= no
##$SF= 400.02
##$SI= 32768
##$SIGF1= 0
##$SIGF2= 0
##$SINO= 400
##$SIOLD= 32768
##$SPECTYP= <>
##$SREGLST= <1H.CDCl3>
##$SSB= 0
##$STSI= 32768
##$STSR= 0
##$SW_p= 8223.68421052631
##$SYMM= 0
##$S_DEV= 0
##$TDeff= 65536
##$TDoff= 0
##$TI= <>
##$TILT= no
##$TM1= 0
##$TM2= 0
##$TOPLEV= 0
##$USERP1= <user>
##$USERP2= <user>
##$USERP3= <user>
##$USERP4= <user>
##$USERP5= <user>
##$WDW= 1
##$XDIM= 32768
##$YMAX_p= 459807228
##$YMIN_p= -704174
##$CURPLOT= <Network HP LaserJet P1505>
##$CURPRIN= <$Network HP LaserJet P1505>
##$DFORMAT= <normdp>
##$LAYOUT= <+/1D_H.xwp>
##$LFORMAT= <normlp>
##$PFORMAT= <normpl>
##$SURQMSG= 1
$$ End of Bruker specific parameters
$$ ---------------------------------
##NTUPLES= NMR SPECTRUM
##VAR_NAME=  FREQUENCY,     SPECTRUM/REAL,   SPECTRUM/IMAG
##SYMBOL=    X,             R,               I
##VAR_TYPE=  INDEPENDENT,   DEPENDENT,       DEPENDENT
##VAR_FORM=  AFFN,          ASDF,            ASDF
##VAR_DIM=   32768,         32768,           32768
##UNITS=     HZ,            ARBITRARY UNITS, ARBITRARY UNITS
##FACTOR=    0.250966925370066, 1,           1
##FIRST=     8223.43324360094, -40974,       98330
##LAST=      0,             -81786,          -23334
##MIN=       0,             -704174,         0
##MAX=       8223.43324360094, 459807228,    0
$$ Real data points
##PAGE= N=1
##DATA TABLE= (X++(R..R)), XYDATA
$$ [...]
$$ plain form
19491 -82953 109120 -84729 -88277 33843 -12775 13659 -403483 -3083 -162732 -56287 -80585
19480 -80585 -139511 30219 -144933 -2161 -48171 -190358 222223 48826 -423726 211983 -288902
19468 44088 -1960 -15433 -130252 -77520 69582 -165549 79779 -87615 -141277 220228 -32239
19456 132134 157207 -124913 178718 -214129 48466 -81891 57593 -68746 -143010 -200199 -474422
19445 -474422 -98769 205567 218571 94906 -167205 -22445 -26278 -16291 -179942 -325 -154350
19434 -154350 -62645 -123223 -256140 142796 151403 -109641 -299716 31457 -292208 -296409 282105
19422 -303399 -81143 137559 259717 111657 -123065 -71165 -141187 309545 -64625 -46439
19412 -46439 -6958 -122478 -61814 -228662 21697 -2279 -195678 -180820 158521 -220824 272642
$$ packed form
19491h2953A09120h4729l548C3843a2775A3659d03483c083j59649e6287k4298
19480h0585n8926C0219a44933b161m6010j42187B22223D8826d23726B11983b88902
19468D4088a960j3473j14819N2732F9582a65549G9779h7615n3662B20228c2239
19456A32134K5073a24913A78718b14129D8466h1891E7593f8746p4264n7189k74223
19445d74422i8769B05567J3004I4906a67205b2445l833R987j63651c25j54025
19434a54350f2645o0578j32917A42796Q607a09641j90075C1457b92208m201B82105
19422c03399h1143A37559J22158A11657a23065N1900p0022C09545f4625J8186
19412d6439f958j15520O0664j66848B1697b279j93399J4858A58521b20824B72642
$$ plain form
19400 -158626 46975 -169945 -219469 -198326 -103608 -395576 -109700 163502 -83458 -306952
19390 -306952 -325474 28866 -317520 280769 718741 129575 -392340 -52298 -124213 -176491
19380 -176491 -116640 -17472 -65971 -55051 58699 -136159 -72473 5889 -91265 -227920 12384
19368 39690 -181859 -59316 -8517 14302 -469687 220950 -33077 -220426 -202102 -282489 -267611
19357 -267611 120537 287310 -182331 200781 -336081 274742 22750 85018 83621 -92128
19346 -67749 -60671 -66116 2764 87121 -402591 -188727 -235086 -200411 -89507 95034 -276413 -280989
19334 -280989 187690 -226406 -155539 -66261 227970 -252383 -103271 94302 -293644 -90736
19323 328297 -95361 70184 92727 12059 -221070 87554 -119623 -82434 119902 -259231 119865
$$ packed form
19400a58626D6975a69945m9524K1143R4718k91968a09700A63502h3458k23494
19390c06952j8522B8866c17520B80769M37972A29575c92340e2298p1915n2278
19380a76491N9851a7472m8499J0920E8699a36159O3686E889i1265j36655A2384
19368C9690a81859e9316h517A4302d69687B20950c3077j87349J8324q0387J4878
19357b67611A20537J66773a82331B00781c36081B74742B2750O2268j397i2128
19346f7749P078n445B764Q4357d02591a88727m6359L4675h9507I5034b76413m576
19334b80989A87690b26406P0867f6261B27970b52383a03271I4302b93644i0736
19323C28297i5361G0184K2543A2059b21070H7554a19623L7189A19902b59231A19865
$$ plain form
19311 -465622 -199332 25428 -305891 -344247 32189 -453628 -85661 -128946 -120571 144747 125200
19300 125200 -50829 -11833 -70699 215008 -327213 -296264 -38310 5405 -315781 -372511 13229
19288 -201436 126110 -311769 37012 -52758 71065 -173003 -198176 -326776 -303677 -67804 57473
19276 -1773 -38461 -6813 -3962 156347 -78066 178424 -110092 -307027 -363915 -270883 -64827
19264 -191105 -322232 -172643 29469 -90945 -30885 32262 -66170 -12597 -147568 -262170 -2187
19252 -175867 -200641 -204993 21385 -564532 -184757 -132426 -77064 -184241 -319380 -51395 191997
19240 -4497 238087 -167707 48156 -337059 -192093 -109962 -9032 -8362 -378644 -57411 -100694
19229 -100694 20302 80114 39827 -203382 5297 -175544 70986 -242099 46197 -46855 -16915
$$ packed form
19311d65622a99332B5428c05891l8356C2189d53628h5661m3285Q375A44747j9547
19300A25200e0829a1833n8866B15008c27213L0949c8310E405c15781n6730A3229
19288b01436A26110c11769C7012e2758G1065a73003k5173j28600K3099f7804E7473
19276a773l6688f813K851A56347g8066A78424a10092j96935n6888R3032f4827
19264a91105j31127J49589B9469i0945c0885C2262f6170a2597j34971j14602b187
19252a75867k4774m352B1385e64532a84757N2331N5362j07177j35139e1395A91997
19240d497B38087a67707D8156c37059J44966Q2131i032O70l70282e7411m3283
19229a00694B0302N9812C9827b03382E297a75544G0986b42099D6197d6855a6915
$$ plain form
19217 28315 -249561 -204726 -241082 -309188 88813 -79663 30433 -323879 -310635 -366079 -172847
19205 296686 18800 24618 -148021 67912 -112858 -152740 -110113 3599 -79969 -136583 165311
19193 198198 8519 170973 -116126 -128920 -172165 13422 224003 129713 -65010 21610 115881
19182 115881 -150374 -286777 -130556 -57895 -103873 -41950 10329 -164986 -67545 -17632 27479
19170 52238 -283068 -278424 -245422 904 132843 -89702 -40337 -206234 -416778 2258 71840 97891
19158 97891 -138867 -175023 37420 -50343 -215706 -66441 32374 -242253 -36890 -155262 64394
19146 115859 -117452 -193289 -123016 -59903 212176 -169173 230407 85259 145355 -307655
19135 257017 202899 -3559 47409 37839 -157616 121489 -178100 16486 148393 150284 -153428
$$ packed form
19217B8315b49561M4835l6356o8106H8813g9663C0433c23879J3244n5444a72847
19205B96686A8800N818a48021F7912a12858l9882M2627C599g9969n6614A65311
19193A98198H519J62454a16126j2794m3245A3422K10581r4290f5010B1610R4271
19182A15881a50374j36403a30556e7895m5978d1950A0329a64986f7545a7632B7479
19170E2238b83068M644L3002I04J31939h9702d0337j65897k10544B258O9582K6051
19158I7891a38867l6156C7420e0343j65363f6441C2374b42253c6890j18372F4394
19146A15859a17452p5837P0273e9903B12176a69173B30407H5259O0096c07655
19135B57017n4118c559D7409r570a57616A21489a78100A6486J31907J891a53428
$$ plain form
19123 -137913 -119862 219935 -223832 -205788 -5285 -102861 -5811 -11143 -48988 -87512 318002
19111 -191888 -172449 103119 158620 63028 -41709 -198169 -175022 -67865 -585 173366 229124
19100 229124 -82597 -392743 -161670 -115237 -79055 -122172 -97527 -21784 -61715 77782 33554
19088 157474 -171868 -72296 -208395 137060 -211233 -204711 356421 214770 17190 25788 -90508
19076 134862 398405 -147773 -60294 208931 -168448 -227657 -60473 -100452 -139421 293173
19065 -164310 17723 -108140 -158394 -19313 -186943 79867 -139994 -180245 47665 -150978 117384
19053 53960 -181364 -45239 -71550 -135560 28857 -50921 -48110 260228 -208577 -339720 -25691
19041 183788 58445 -27130 -301194 -187705 -158069 189757 -48149 -31198 -92941 5994 -30909
$$ packed form
19123a37913J8051B19935b23832J8044e285r7576e811n332l7845l8524C18002
19111a91888J9439A03119N5501F3028d1709j56460K3147f7865e85A73366N5758
19100B29124h2597l10146a61670M6433L6182m3117K4645b1784l9931G7782C3554
19088A57474a71868g2296j36099A37060b11233O522C56421j41651A7190Q598i0508
19076A34862K63543a47773f0294B08931a68448n9209f0473l9979l8969B93173
19065a64310A7723a08140n0254a9313j67630G9867a39994m0251D7665a50978A17384
19053E3960a81364d5239k6311o4010B8857e0921K811B60228b08577j31143b5691
19041A83788E8445b7130k74064J13489K9636A89757d8149J6951o1743E994c0909
$$ plain form
19029 -150063 23767 57992 -118487 -102854 18729 -275837 -30157 121616 307606 46407 143295
19018 143295 -25881 -117732 -79045 -107479 -370155 -49370 -577 177650 -179562 33314 -117252
19006 137090 -152802 -23995 -85596 -129652 100395 159858 -154371 181629 3876 69493 151792
18995 151792 -104219 221028 36050 -2495 62631 -123446 183515 103369 145483 -55261 -30132
18984 -30132 -184496 -38033 -126097 -35046 -223976 26863 -166390 -309404 67101 -186432 67306
18972 -205648 42100 37279 472722 692233 492934 350508 139236 -21978 106782 -348405
18961 -148819 161417 187963 -21823 199420 -31421 -118652 -39629 392380 -380340 148256
18950 -73936 -74655 63689 183163 -144953 72390 -294881 -187076 -394133 -24161 -266011 -9774
$$ packed form
19029a50063B3767L4225a18487J5633A8729b75837c0157A21616J85990D6407R6888
19018A43295b5881r1851L8687k8434k62676d9370e77A77650a79562C3314a17252
19006A37090a52802b3995o1601m4056A00395N9463a54371A81629C876O5617Q2299
18995A51792a04219B21028C6050b495F2631a23446A83515q0146M2114e5261K5129
18984c0132j54364c8033q8064c5046j88930B6863a66390j43014F7101a86432F7306
18972b05648D2100m821M35443K19511j99299j42426A39236b1978A06782c48405
18961a48819A61417K6546b1823A99420c1421q7231c9629C92380c80340A48256
18950g3936p19F3689J19474a44953G2390b94881J07805k07057b4161k41850i774
$$ plain form
18938 97356 -36166 101856 275859 -330926 -67867 -246892 -107875 -421844 -428152 -198760
18927 -577125 -82438 322909 53664 5539 133842 -169810 100460 -225333 -86709 -118989 4655
18915 -164586 -61439 96263 45992 39725 100108 -14784 135120 425471 -155876 297210 433191
18904 433191 373774 -14154 -150482 -9122 200507 -99148 94904 -145858 -30422 -950 155536
18892 -271162 94182 238873 -189788 12398 233932 65652 -136210 156196 -93585 -55651
18882 -55651 -432730 -202022 -162418 -205207 4303 -161009 152478 -104707 -31911 -160928 -70700
18870 189752 -283212 59564 -380611 -396951 -3413 -291414 33453 -130812 94433 -22056 -46855
18859 -46855 -159681 231798 -75683 -145904 -101509 -101745 169558 213053 -310677 -238131 11739
$$ packed form
18938I7356c6166A01856J74003c30926f7867j79025a07875l13969o308a98760
18927e77125h2438C22909E3664E539J28303a69810A00460b25333h6709l2280D655
18915a64586f1439I6263D5992o267O0383a4784A35120K90351a55876B97210J35981
18904D33191n9417a4154j36328i122B00507i9148I4904a45858c0422i50A55536
18892b71162I4182J44691a89788A2398K21534F5652a36210A56196i3585L7934
18882e5651l77079b02022L9604m2789D303a61009A52478a04707c1911j29017g0700
18870A89752b83212E9564c80611j6340c413k88001C3453a30812I4433b2056k4799
18859d6855j12826B31798g5683p0221M4395k36A69558M3495c10677P2546A1739
$$ plain form
18847 292205 -194035 -128581 -80159 14511 86235 -22054 55181 -294493 -38745 79566 -201472
18835 102966 190394 -326124 -109471 -61096 -418077 -177973 -106495 42840 -159656 137637
18824 182710 -22345 269390 206263 -136659 -15282 -274265 -111624 109526 -235379 36613
18813 102427 -58618 -177582 277920 -105351 276862 28906 56622 245599 66897 148836
18803 148836 249254 163126 91934 -222186 -76736 -18143 -19622 -165164 -26968 241502 30746
18791 22137 -97784 -16544 -32000 31790 174402 31139 -237459 108039 128862 -57367 -299375
18780 -299375 60854 -153952 -115178 -13242 -27917 74330 -45031 387682 -218171 -188988 -50543
18768 -13356 -201686 104042 -370730 54789 37 327903 -128728 -175313 110772 175111 -63048
$$ packed form
18847B92205a94035O5454M8422A4511P1724b2054E5181b94493c8745G9566b01472
18835A02966Q7428c26124a09471M8375l56981a77973P1478D2840a59656A37637
18824A82710b2345B69390o3127a36659a5282k58983a11624A09526b35379C6613
18813A02427e8618j18964B77920a05351B76862B8906K7716J88977F6897Q1939
18803A48836J00418q6128p1192b22186g6736a8143j479j45542b6968B41502C0746
18791B2137i7784a6544j5456C1790J42612C1139b37459A08039K0823e7367k42008
18780b99375F0854a53952L8774a3242j4675G4330d5031C87682b18171K9183e0543
18768a3356j88330A04042c70730E4789C7L27866a28728m6585A10772O4339f3048
$$ plain form
18756 -34640 11502 -12973 -60641 -376070 -421958 -50762 -19459 -172170 121972 -88033 -425936
18745 -425936 18822 -135262 -98066 -150540 103545 -60192 86976 98215 -399076 -74233 57141
18733 -115169 -75549 -307655 -210784 -219768 -166450 -150157 -192399 -111085 -6424 -145896 12085
18721 29840 -308273 -188485 181410 -157660 -17170 -172095 -94261 -58064 14461 -264977
18710 -255051 -32473 -144212 -97618 24838 -126915 -158757 32788 -233231 -269597 90535 -287656
18698 -128280 -48711 -79985 132162 19658 -151742 123572 66924 -100434 23411 -104429
18687 9306 -120904 -122176 -195320 -59936 121348 60076 37894 154459 -93020 -380007 118286
18675 -280527 -222781 15762 -349669 115983 -648907 -118694 -327394 -145340 -132755 -202041
$$ packed form
18756c4640A1502a2973m7668l15429m5888e0762a9459j52711A21972h8033l37903
18745d25936A8822a35262L7196n2474A03545f0192H6976J1239c99076g4233E7141
18733a15169L9620k32106R6871q984N3318J6293m2242Q1314f424j39472A2085
18721B9840c08273J19788A81410a57660a7170j54925P7834L6197A4461b64977
18710b55051c2473j11739M6594B4838a26915l1842C2788b33231l6366I0535b87656
18698a28280d8711l1274A32162A9658a51742A23572n6648a00434B3411a04429
18687I306a20904j272p3144e9936A21348F0076k2182J16565i3020k86987A18286
18675b80527N7746A5762c49669A15983f48907a18694k08700a45340J2585o9286
$$ plain form
18665 -202041 222278 -232012 72165 -214064 -284246 34672 -97139 -72060 -48572 -233480 146171
18653 -24505 27538 -64241 -84781 -84145 -53553 -189645 -43783 -200392 -331869 187849 68996
18641 -134596 127387 -189678 -294665 -22749 19473 -12347 -191761 -111850 25157 134269
18631 134269 -115774 -25205 -54786 -126999 -126363 -186108 -341946 -64081 -410045 4157 -106853
18619 -84103 93111 251201 -218096 -84026 77009 -340533 185263 -318765 124173 -97227
18608 -179156 141268 196580 -16204 8235 -208965 -150315 -61127 183806 53851 -85943 -7728
18596 -314140 -127396 -496193 82546 164971 -168113 -206407 -252106 30039 31878 -85041 -162559
18585 -162559 -181004 -34368 43900 -7586 -4478 262971 -10530 -415347 -249344 247179 10138
$$ packed form
18665b02041B22278b32012G2165b14064p0182C4672i7139K5079K3488j84908A46171
18653b4505B7538f4241k0540O36L0592j36092d3783j56609j31477A87849F8996
18641a34596A27387a89678j04987b2749A9473a2347j79414P9911B5157J09112
18631A34269a15774b5205k9581p2213O36n9745j55838f4081l45964D157a06853
18619h4103I3111J58090b18096h4026G7009c40533A85263c18765A24173i7227
18608a79156A41268N5312a6204H235b08965N8650f1127A83806E3851h5943g728
18596c14140a27396l68797H2546Q2425a68113l8294m5699C0039J839h5041p7518
18585a62559j8445c4368D3900g586L108B62971a0530m04817J66003B47179A0138
$$ plain form
18573 -479120 -134899 -26276 -89548 190528 -227351 160478 -91713 -286652 -259648 -20785
18562 -283984 -177823 218642 -338826 122622 16300 36777 -269342 36476 306529 -222390
18551 59898 247512 -214211 -91806 -49935 -163526 132672 -203468 -327803 -190868 139831
18540 -71008 -47756 -293633 124895 143899 74803 -178245 -185801 -154419 -72237 -97085 57479
18528 250456 -126327 106119 103683 -230849 290009 -101767 40035 -202797 -321267 -194421
18518 -194421 219937 -110629 82936 -15494 -75419 -17030 193768 138830 -175136 -27547 -95878
18507 -95878 234557 -219876 -220608 -277450 124651 -209598 -112852 41735 33066 189692 -28228
18495 -63306 -55372 -20464 -73067 -187546 -31251 180995 -225728 -267075 -45085 -301204 -329489
$$ packed form
18573d79120a34899b6276o3272A90528b27351A60478i1713j94939K7004b0785
18562b83984J06161B18642c38826A22622A6300K0477b69342C6476K70053b22390
18551E9898J87614b14211i1806M1871j13591A32672b03468j24335J36935A39831
18540g1008K3252k45877A24895J9004o9096a78245p556L1382g2237k4848E7479
18528B50456a26327A06119k436b30849B90009a01767D0035b02797j18470J26846
18518a94421B19937a10629H2936a5494n9925a7030A93768n4938a75136b7547o8331
18507i5878B34557b19876p32n6842A24651b09598R6746D1735q669J56626b8228
18495f3306P934b0464n2603j14479c1251A80995b25728m1347d5085k56119k8285
$$ plain form
18484 -329489 -69797 -278176 -70653 -114994 1753 121864 -288766 -80299 -190028 -75738 -110467
18473 -110467 -247491 20480 -223654 -118386 56692 123301 72600 162030 90435 173799 -252518
18461 -39609 -210436 169682 -124306 -135506 -9225 54299 74560 122908 -222256 138726 172319
18450 172319 -418525 -131317 -57063 -90645 -144107 -138826 224129 -498754 -46782 113316 -189795
18438 -159620 306724 -108775 5927 -151776 -66337 194711 10128 262297 -140314 -16848
18427 277146 146909 -40323 17622 -67917 -83138 -70353 -105409 58955 342916 -87452 -86024
18416 -86024 181140 -214511 39111 -15985 62274 96307 9293 195412 -240336 -181760 265897
18404 18896 119223 -68081 -109410 -168260 -34014 -10156 50271 -7623 100565 287751 95850
$$ packed form
18484c29489f9797k08379g0653m4341A753J20111b88766h0299j09729g5738l4729
18473a10467j37024B0480b23654J05268E6692O6609n0701Q9430p1595Q3364b52518
18461c9609j70827A69682a24306j1200i225E4299K0261M8348b22256A38726L3593
18450A72319d18525a31317e7063l3582n3462N281B24129d98754d6782A13316a89795
18438a59620C06724a08775E927a51776f6337A94711A0128K52169a40314a6848
18427B77146j30237d0323A7622f7917j5221J2785l5056E8955K83961h7452J428
18416h6024A81140b14511C9111a5985F2274L4033I293J86119b40336N8576B65897
18404A8896J00327f8081m1329n8850c4014a0156E0271g623A00565J87186I5850
$$ plain form
18392 59503 73668 158643 -171807 -204797 -12904 104103 159646 -66922 -61955 118932 23670
18380 -181300 12558 -424731 -97319 -138525 114537 -54022 -425112 -124119 90309 -73641 -147251
18369 -147251 21547 -333427 -207779 158809 10475 23512 -69607 -18197 -153943 137786
18358 -152951 88574 130744 49576 -193452 -123637 118473 -98096 18652 85230 114045 -336580
18346 -207745 -49966 -250473 -143330 80610 -53630 -130406 -166500 -152847 -116694 -227480 411292
18334 -117770 -391887 -438761 19025 -559589 22719 -19723 -216340 51494 41605 -326767 9846
18322 181975 -236050 -53464 278009 175473 -136535 -15077 -49980 -246895 205819 13891
18311 -77773 33478 -211095 90645 -344544 -65931 -263797 82248 -189796 51156 109237 -56169
$$ packed form
18392E9503J4165Q4975a71807l2990a2904A04103N5543f6922M967A18932B3670
18380a81300A2558d24731i7319m1206A14537e4022l71090a24119I0309g3641p3610
18369a47251B1547c33427J25648A58809A0475J3037f9607a8197j35746A37786
18358a52951H8574M2170D9576a93452O9815A18473i8096A8652O6578K8815c36580
18346b07745d9966k00507J07143H0610e3630p6776l6094J3653L6153j10786D11292
18334a17770k74117m6874A9025e59589B2719a9723j96617E1494r889c26767I846
18322A81975b36050e3464B78009j02536a36535a5077l4903j96915B05819A3891
18311g7773C3478b11095I0645c44544f5931j97866H2248a89796E1156N8081e6169
$$ plain form
18299 12713 73962 -205112 66616 241397 -85546 -49454 125812 12976 305450 65979 -341164
18287 -18717 97331 57189 179141 496556 52158 -183575 -277003 16002 -241754 -12597 245909
18275 -159763 -195410 146903 -141588 45982 6122 -66404 -18429 -122148 317112 285286 -159058
18263 -38029 -123722 -175938 125623 -139782 66498 -178999 -214144 -258577 -49992 -94945 63123
18251 -4088 -211448 -146852 -276745 -193863 116545 -6552 -69792 -236307 -91995 -217756 313284
18239 -8215 11674 99594 -45217 -226288 68952 -219940 -56250 1497 -59461 -224789 -8776 -123824
18227 -123824 166002 -169860 62936 64775 4429 -9607 -153330 -42484 -45849 66738 -14380 -56259
18215 -56259 -159924 -68137 4341 45125 155813 -45997 134876 162639 24321 -144252 37084
$$ packed form
18299A2713O1249b05112F6616J74781h5546L6092A25812A2976K92474F5979c41164
18287a8717I7331m0142J21952L17415E2158a83575r3428A6002b41754a2597B45909
18275a59763l5647A46903a41588D5982F122f6404a8429j03719C17112l1826a59058
18263c8029q5693n2216A25623a39782F6498a78999l5145m4433d9992m4953F3123
18251d088k07360O4596j29893Q2882A16545f552o3240j66515i1995j25761C13284
18239h215A1674Q7920d5217j81071F8952b19940e6250A497e9461j65328h776j15048
18227a23824A66002a69860F2936J839D429i607j43723d2484l365F6738a4380m1879
18215e6259j03665f8137D341M0784J10688d5997A34876K7763B4321a44252C7084
$$ plain form
18203 65692 8724 171414 147363 89750 -224131 -165604 89736 -80774 159536 211128 -288489
18191 125013 -100362 77905 181000 -235107 -104232 -215490 10320 -224623 136239 -100349
18180 188799 -375228 -140136 -66370 121791 -7958 -19022 -182241 -85662 -55795 -92410 198103
18168 -299490 233308 200954 -141516 71816 -299345 119171 59950 15208 -12351 224082
18157 -9340 37168 192663 24944 34807 16659 -398223 216968 -113081 -139633 241666 -9813
18145 169276 -62721 -27516 359347 218205 -27728 132737 36006 190828 -156907 61183
18134 -44496 -99637 117077 -166179 -260732 85532 354550 113761 -124391 -304615 -20011
18123 -30395 307900 -21617 82606 186629 -119059 173566 78622 -186202 -105107 -202966 -381844
$$ packed form
18203F5692H724J62690k4051n7613b24131N8527H9736h0774A59536N1592b88489
18191A25013a00362G7905J03095b35107a04232j11258A0320b24623A36239a00349
18180A88799c75228a40136f6370A21791g958j1064j63219h5662K9867l6615A98103
18168b99490B33308l2354a41516G1816b99345A19171n9221A5208a2351B24082
18157i340C7168J55495B4944R863A6659c98223B16968a13081k6552B41666i813
18145A69276f2721b7516C59347j41142b7728A32737C6006J54822a56907F1183
18134d4496n5141A17077a66179r4553H5532K69018A13761a24391j80224b0011
18123c0395C07900b1617H2606J04023a19059A73566G8622a86202Q1095r7859j78878
$$ plain form
18112 -381844 -251920 187160 -25484 -5630 201656 -240784 -139140 103653 102816 -125092 -214370
18101 -214370 209510 -216508 -49941 142050 33874 77960 -324099 38589 -29588 -83688 -47558
18090 -47558 -349466 101021 -142429 -150634 -215537 -114845 260206 22068 195501 -191223
18079 -109157 -81017 -171151 23767 8119 -137859 -148473 -153555 -141651 107121 -7607 147148
18067 -162262 76481 266209 -100965 -221459 237692 -263427 -149856 233174 182678 158414
18057 158414 171342 91656 265685 177364 -215717 -16970 -84061 -203044 -65409 85607 -120246
18045 -241365 -135104 89418 -13726 -59063 -16625 -175166 -9655 66282 60191 128754 22428
18033 -33315 -22773 -290803 -127278 38594 -640 117053 110660 -111056 -66525 259892 356528
$$ packed form
18112c81844J29924A87160b5484e630B01656b40784J01644A03653q37a25092q9278
18101b14370B09510b16508d9941A42050C3874M4086c24099C8589b9588n4100L6130
18090d7558l01908A01021a42429q205o4903J00692B60206B2068J73433a91223
18079a09157K8140r0134B3767H119a37859j0614n082J1904A07121g607A47148
18067a62262G6481J89728a00965j20494B37692b63427J13571B33174n0496k4264
18057A58414J2928p9686J74029q8321b15717a6970o7091j18983f5409H5607a20246
18045b41365J06261H9418a3726m5337a6625j58541i655F6282o091O8563B2428
18033c3315J0542k68030a27278C8594f40A17053o393a11056M4531B59892R6636
$$ plain form
18022 356528 -258050 301933 263201 113190 -51880 -17841 -3856 147242 49540 64414 276465
18011 276465 -174575 343453 255910 -299200 19664 32700 88624 142193 -252356 211094
18000 111016 -124200 18236 -116579 -207272 299463 370256 -27655 57656 -43505 -33147 -270440
17989 -270440 156817 -11137 253001 -102131 33291 -199053 194672 103406 139682 -67839
17978 -204824 135799 -50296 125463 105979 20597 13133 -288442 -114656 -78515 -31254 -31250 -112699
17966 -112699 198584 -26416 -156720 124645 -220248 249077 -30770 -21884 -80060 274155
17955 84981 -131340 -153623 -25231 -106798 393904 161851 172634 173296 -33715 -108915 246687
17943 134392 36238 -88029 -191013 394121 95781 -326114 -48733 -122454 167456 167997 -221034
$$ packed form
18022C56528b58050C01933l8732A13190e1880a7841c856A47242D9540J4874K12051
18011B76465a74575C43453q7543b99200A9664J3036N5924N3569b52356B11094
18000A11016a24200A8236a16579r0693B99463P0793b7655E7656d3505J0358k37293
17989b70440A56817a1137B53001a02131C3291a99053A94672r1266L6276f7839
17978b04824A35799e0296A25463j9484B0597p464b88442a14656L6141c1254Mq1449
17966a12699A98584b6416j30304A24645b20248B49077c0770Q886n8176B74155
17955H4981a31340k2283b5231q1567C93904A61851J0783O62c3715p5200B46687
17943A34392C6238h8029j02984C94121I5781c26114d8733p3721A67456N41b21034
$$ plain form
17931 110082 -116896 239846 186924 191308 33452 -95655 -120235 -132065 60632 -93060 75102
17919 -151528 93509 -37199 39164 -25290 160355 -174735 -30976 61992 -64537 -83592 116902
17907 164710 228515 -53591 142266 -65351 -102658 247977 321854 -185666 202542 146103 14615
17895 69077 139820 88983 37761 -176123 -189298 -53913 86259 -77875 -13539 224834 -131876
17883 -140275 204354 9502 203600 178345 24015 25207 -2391 66168 351170 232209 -87695
17871 60129 -137696 277614 -20317 44543 -109784 -45208 85490 161390 -106322 -216417 20501
17859 214051 15589 262635 -67958 -143849 244033 173382 -132531 -41315 -122849 -147508 -100884
17848 -100884 -14680 160410 -145107 -223157 246315 -172742 -243742 25028 -72918 -38595 -221235
$$ packed form
17931A10082a16896B39846n2922M384C3452i5655k4580j1830F0632i3060G5102
17919a51528I3509c7199C9164b5290A60355a74735c0976F1992f4537j9055A16902
17907A64710O3805e3591A42266f5351l7307B47977P3877a85666B02542n6439A4615
17895F9077P0743n0837C7761a76123j3175e3913H6259g7875a3539B24834a31876
17883a40275B04354I502J94098k5255B4015J192b391F6168K85002j18961h7695
17871F0129a37696B77614b0317D4543a09784d5208H5490P5900a06322j10095B0501
17859B14051A5589K47046f7958p5891B44033p0651a32531d1315q1534k4659M6624
17848a00884a4680A60410a45107p8050B46315a72742p1000B5028g2918L4323j82640
$$ plain form
17837 -221235 34303 110316 239874 -187065 315336 362171 32655 138380 175639 27223 151534
17826 151534 176076 68522 -187952 40245 65651 336776 -111216 36148 -278665 118278
17815 3204 -358381 -279135 301695 67390 64435 280023 -230747 -66759 224226 97750 -56739
17803 -99687 208607 168252 -30702 9011 38105 358501 38234 143906 -132091 31143 304124
17792 304124 -20828 217752 -149538 95549 80107 126867 82535 253829 156083 77302 -188079
17780 -61208 69175 205014 -38668 18869 35199 -264676 465901 119230 158643 -35223 74521
17768 -253020 -46265 -97844 -24406 53879 275362 107181 358875 -167352 -41562 -197712
17758 -197712 313485 -164762 -62468 88822 15877 -153028 -357209 497573 233099 91130
$$ packed form
17837b21235C4303P6013J29558a87065C15336M6835C2655J05725L7259B7223J24311
17826A51534K4542F8522a87952D0245K5406K71125a11216C6148b78665A18278
17815C204c58381P9246C01695F7390k955K15588b30747f6759B24226I7750e6739
17803i9687B08607m0355c0702I011K9094L20396C8234J05672a32091C1143K72981
17792C04124b0828B17752a49538I5549j5442M6760m4332J71294r7746G7302a88079
17780f1208F9175J35839c8668A8869J6330b64676D65901A19230L9413c5223G4521
17768b53020d6265n1579b4406E3879K21483A07181K51694a67352d1562j56150
17758a97712C13485a64762f2468H8822A5877a53028k04181D97573B33099I1130
$$ plain form
17747 347972 99932 -16194 -58338 86014 -79109 110034 -123797 93797 248463 -20063 -125328
17736 -125328 -36259 176845 152070 40368 49285 -40272 -652916 -64145 63297 58759 2266 110724
17724 110724 -91813 42399 257871 37880 -258015 -105461 272369 210670 284516 -179231
17713 132913 -120131 -231000 314970 -53629 204739 285088 226257 258858 320925 155711
17702 105855 132903 111439 8293 191041 -8920 75883 141651 91502 22117 265509 -229853
17690 -45717 60800 102748 409662 215014 151323 -4125 10252 -71898 186363 -192089 327452
17678 -69293 125732 -256570 85262 -165800 46158 5030 48258 378948 57197 98830 64000
17667 64000 75701 159998 60516 151574 171219 167798 131771 -50983 -202502 110094 61711
$$ packed form
17747C47972I9932a6194m2144H6014g9109A10034a23797I3797J54666b0063j05265
17736a25328c6259A76845k4775D0368Q917d0272o12644f4145F3297m538B266J08458
17724A10724i1813D2399K15472C7880b58015a05461B72369o1699P3846a79231
17713A32913a20131j10869C14970e3629B04739Q0349n8831L2601O2067A55711
17702A05855K7048k1464H293J82748h920G5883O5768n0149B2117K43392b29853
17690d5717F0800M1948L06914j94648o3691d125A0252g1898A86363a92089C27452
17678f9293A25732b56570H5262a65800D6158E030M3228L30690E7197M1633l4830
17667F4000J1701Q4297F0516R1058J9645l421l6027e0983j51519A10094m8383
$$ plain form
17656 61711 54270 515371 276430 201841 -190515 283614 161955 -43051 -97018 297827 225934
17645 225934 303332 226010 -18937 -87798 -181845 -59358 213614 352364 98761 -195465 30940
17633 -82300 111629 146879 210877 -103616 2457 274112 70568 -65388 141715 -20530 258890
17621 74796 39266 435778 -13957 6357 180522 145080 294303 -38392 94879 230180 124154
17610 124154 129075 415552 307273 207375 171889 19174 329767 -92226 52682 54825 148589
17599 148589 -165094 743861 -209302 23095 11006 138514 204330 77440 -133548 -19133
17588 -2885 31942 -33514 55464 65367 52713 -151100 290167 137265 77666 -104461 99106
17576 -42455 -293509 150239 224749 64320 193269 30885 28393 503839 99706 260581 132317
$$ packed form
17656F1711p441M61101k38941p4589a90515B83614j21659d3051n3967B97827p1893
17645B25934P7398p7322a8937o8861r4047e9358B13614J38750I8761a95465C0940
17633h2300A11629L5250O3998a03616B457K71655G0568f5388A41715b0530B58890
17621G4796l5530L96512a3957F357J74165l5442J49223c8392I4879J35301j06026
17610A24154M921K86477j08279r9898l5486A9174L10593i2226E2682K143R3764
17599A48589a65094G43861b09302B3095A1006J27508O5816G7440a33548a9133
17588b885C1942c3514E5464R903j2654a51100B90167A37265n9599a04461I9106
17576d2455k51054A50239P4510F4320J28949C0885k492M75446I9706J60875j28264
$$ plain form
17565 132317 138208 301521 186719 32573 -150056 196895 27307 294641 544772 108421
17554 329248 83184 101633 -115324 471457 56655 -127921 590287 11906 88373 170529 36429
17542 416662 240643 246436 145030 481180 109337 179757 -71562 -11752 94159 397482 152249
17530 -8432 530882 597793 541295 485240 817340 784741 1275137 1241232 1409549 756024 789209
17519 789209 420457 510619 376161 373353 433482 443077 185847 582744 887563 692716 1060064
17508 1060064 1085090 1081648 589301 647146 647509 323935 484991 579727 150032 535778 183803
17496 267744 156564 292221 149290 294020 211925 152044 492501 279099 298902 434915
17486 434915 173402 106874 456718 60501 23435 -68761 304243 386416 244160 172709 270313
$$ packed form
17565A32317N891J63313j14802C2573a50056A96895B7307K67334K50131A08421
17554C29248H3184J8449a15324D71457E6655a27921E90287A1906P6467Q2156C6429
17542D16662j76019N793j01406L36150A09337P0420g1562a1752I4159L03323A52249
17530h432E30882O6911n6498n6055L32100l2599M90396l3905J68317o53525L3185
17519G89209l68752R0162j34458k808O0129R595A85847L96897L04819j94847L67348
17508A060064K5026l442m92347N7845L63l23574J61056R4736A50032L85746A83803
17496B67744j11180J35657j42931J44730q2095n9881L40457k13402J9803J36013
17486D34915A73402o6528L49844F0501B3435f8761C04243Q2173j42256p1451R7604
$$ plain form
17475 270313 188840 -42784 244568 139324 108859 169746 400314 673038 363657 415138
17465 415138 278453 299066 558903 35945 136537 110818 313254 153729 235247 158988
17455 158988 233830 511151 54805 380951 144264 219095 340441 52727 307777 454955
17445 454955 315144 208532 259472 -184914 125220 -1078 257015 520546 320280 511319
17435 511319 161245 413080 405762 419440 562762 194350 224260 441565 354895 344346 306599
17424 306599 204318 333374 176958 805946 356586 -49124 430671 226897 413860 397505
17414 397505 321814 51695 356171 501972 286177 -118546 498115 202175 459563 129475
17403 186244 285415 274060 30188 128940 72383 206041 588404 -175504 97439 523790 524617
$$ packed form
17475B70313q1473d2784B44568j05244l0465O0887K30568K72724l09381N1481
17465D15138j36685K0613K59837C5945J00592k5719K02436A53729Q1518p6259
17455A58988P4842K77321E4805L26146A44264P4831J21346E2727K55050J47178
17445D54955j39811j06612N0940a84914A25220a078B57015K63531k00266J91039
17435E11319A61245K51835p318J3678J43322A94350K9910K17305q6670j0549l7747
17424C06599j02281J29056j56416O28988C56586d9124D30671k03774J86963j6355
17414C97505p5691E1695L04476J45801k15795a18546D98115B02175K57388A29475
17403A86244R9171j1355C0188R8752n6557J33658L82363a75504I7439M26351Q27
$$ plain form
17392 524617 478746 343851 332710 92825 366365 291882 179977 444724 308425 73260
17381 341817 90003 157282 84750 164176 296870 451517 335046 194271 419889 265129
17371 265129 332846 142569 203462 348657 -19259 147588 10146 883583 322881 3129 196661
17360 196661 523402 146937 117373 185537 33526 170800 314271 201025 192889 -88921 -4747
17348 134652 29613 44422 616701 421759 39771 277978 299663 283195 287114 176823 107556
17337 107556 343321 350955 260759 117637 122367 239986 444244 110643 14791 194808 216985
17326 216985 321162 232707 130422 -221443 416845 308784 380983 445433 227992 430120
17316 430120 437465 126350 22890 38540 284317 607717 276404 367278 180045 181922 25451
$$ packed form
17392E24617m5871j34895j1141I2825K73540p4483j11905K64747j36299G3260
17381C41817I0003O7279p2532P9426J32694J54647j16471j40775K25618j54760
17371B65129O7717A42569O0893J45195a9259A47588A0146Q73437C22881C129J93532
17360A96661L26741A46937k9564O8164C3526J37274J43471j13246q136h8921d747
17348A34652B9613J4809N72279j94942C9771K38207K1685j6468L919j10291o9267
17337A07556K35765P634r0196A17637M730J17619K04258A10643A4791J80017K2177
17326B16985J04177q8455j02285b21443D16845j08061P2199O4450k17441K02128
17316D30120P345A26350B2890J5650K45777L23400B76404R0874A80045J877B5451
$$ plain form
17304 564639 37447 194470 177182 418728 -50796 468943 215684 106288 427006 290897
17294 290897 447457 112583 277797 394897 457150 193277 473024 253740 428923 -20801
17283 227781 225229 372550 542685 139007 454239 491836 534891 361176 458952 516479 288829
17272 288829 163292 152961 265393 256144 172787 305135 205602 247233 353496 117854 397204
17261 397204 411801 248028 -1503 581738 72989 581597 640295 393266 429063 762774 676993
17250 676993 541559 186942 532645 76493 268811 493460 261670 278585 275761 474372
17240 474372 356173 241874 448774 370589 338727 411009 414072 105242 483409 562561 399079
17229 399079 90173 166746 248184 413378 604840 315833 134559 531579 599376 634663
$$ packed form
17304E64639C7447J57023j7288K41546e0796D68943B15684A06288L20718j36109
17294B90897J56560A12583J65214J17100O2253A93277K79747k19284J75183b0801
17283B27781k552J47321J70135A39007L15232L7597M3055j73715R7776N7527k27650
17272B88829j25537j0331J12432r249q3357J32348r9533M1631J06263A17854K79350
17261C97204J4597j63773a503E81738G2989N08608N8698k47029L5797L33711q5781
17250F76993j35434A86942L45703G6493J92318K24649k31790J6915k824J98611
17240D74372j18199j14299K06900p8185l1862P2282L063A05242L78167P9152j63482
17229C99079I0173P6573Q1438J65194J91462k89007A34559L97020O7797L5287
$$ plain form
17219 634663 205100 452023 616565 548513 266654 305195 188453 533584 306983 323048
17209 323048 800867 506571 371721 456810 469770 414507 432301 460876 334607 343603 223617
17198 223617 295781 515531 415192 433445 332434 495683 788953 677594 166340 290280
17188 290280 392607 318593 748990 557301 395906 263603 682517 441879 235470 124038
17178 124038 461836 230418 501350 519837 237148 417327 344343 576594 593801 164618
17167 485494 437256 632492 267655 414639 441598 343143 783097 362409 559026 608949
17157 608949 567237 603218 398880 293995 448988 503923 472500 771533 673051 594686 716368
17146 716368 514047 504317 412027 670045 393634 726760 648979 702084 414023 478277 366553
$$ packed form
17219F34663B05100K46923J64542o8052B66654L8541j16742L45131k26601J6065
17209C23048M77819k94296j34850Q5089J2960n5263J7794K8575j26269Q996j19986
17198B23617P2164K19750j00339J8253j01011J63249K93270j11359A66340J23940
17188B90280J02327p4014M30397j91689j61395j32303M18914k40638k06409j11432
17178A24038L37798B30418K70932J8487B37148J80179p2984K32251J7207A64618
17167D85494m8238J95236B67655J46984K6959r8455M39954C62409J96617M9923
17157F08949m1712L5981k04338j04885J54993N4935l1423K99033r8482p8365J21682
17146G16368k02321r730r2290K58018k76411L33126p7781N3105k88061O4254j11724
$$ plain form
17135 366553 705309 452877 806675 1005591 626905 911758 512067 849165 988045 533973
17125 533973 665806 431776 753195 415186 554590 705342 750349 590227 464904 819043
17115 819043 481968 796450 341398 383972 526515 720705 405541 916550 978992 823821
17105 823821 675456 518507 675573 767969 762842 700683 823355 651164 606115 621267 805120
17094 805120 585389 283485 604669 549694 755236 860659 620883 505470 570678 796617
17084 796617 1077658 781490 853641 696927 936486 726902 862475 784970 690055 746161
17074 746161 735015 632223 864291 722220 677732 985461 749638 945824 851755 897023
17064 897023 1020591 1028271 962547 843778 747086 739550 627462 665813 1029670 948434 814951
$$ packed form
17135C66553L38756k52432L53798J98916l78686K84853l99691L37098J38880m54072
17125E33973J31833k34030L21419l38009J39404J50752M5007j60122j25323L54139
17115H19043l37075L14482C41398M2574J42543J94190l15164N11009O2442j55171
17105H23821j48365j56949J57066R2396n127o2159J22672j72191m5049J5152J83853
17094H05120k19731B83485L21184n4975K05542J05423k39776j15413O5208K25939
17084G96617K81041k96168P2151j56714K39559k09584J35573p7505r4915N6106
17074G46161j1146j02792K32068j42071m4488L07729k35823J96186r4069M5268
17064H97023J23568P680o5724j18769r6692p536j12088L8351L63857q1236j33483
$$ plain form
17053 814951 691083 624043 956720 1013214 472550 882588 824952 784348 786015 900511 770885
17042 770885 1280688 802854 961023 1044530 915763 731614 876921 843481 971429 1041486
17032 1041486 818922 888099 929496 947172 975235 809390 991619 1233152 1052142 911504
17022 911504 925651 996806 1035747 982404 1507273 865855 951011 1012407 1099032 1031627 1190808
17011 1190808 1125833 1153662 1051267 1360727 1420104 1120951 1459622 1222260 1154898 1085900
17001 1085900 1191055 1305788 1517369 903977 1185967 1133849 1249233 1349451 1291872 1380474
16991 1380474 1308766 1384299 1418245 1457995 1263615 1611339 1682133 1392183 1156428 1145252
16981 1145252 1360609 1539993 1281383 1572098 1612275 1602141 1626798 1686345 1039085 1420044
$$ packed form
17053H14951j23868o7040L32677N6494D72550M10038n7636m0604J667J14496j29626
17042G70885N09803m77834J58169Q3507j28767j84149J45307l3440J27948P0057
17032A041486k22564O9177M1397J7676K8063j65845J82229K41533j81010j40638
17022I11504J4147P1155L8941n3343N24869o41418Q5156O1396Q6625o7405J59181
17011A190808o4975K7829j02395L09460N9377k99153L38671k37362o7362o8998
17001A085900J05155J14733K11581o13392K81990n2118J15384J00218n7579Q8602
16991A380474p1708P5533L3946L9750j94380L47724P0794k89950k35755j1176
16981A145252K15357J79384k58610K90715M0177j0134K4657N9547o47260L80959
$$ plain form
16971 1420044 1600995 1268384 1743067 1395101 1725584 1419300 1673365 1846912 1253643
16962 1253643 1395824 1641634 1992204 1871267 1692538 1754062 1854941 1903960 1942720 1805377
16952 1805377 1743791 1742390 2134785 2006474 1816704 1910896 1626487 2077217 1934429 1914139
16942 1914139 1412953 1828356 2079555 1807768 2282769 1719946 2180503 1899989 2088200
16933 2088200 2001177 2257334 2143717 2478485 2036866 2572422 2200375 2201586 2327121 2349218
16923 2349218 2072113 2354980 2342886 2119726 2398193 2767518 2332533 2262189 2437159 2711885
16913 2711885 2655721 2577533 2592185 2395291 2958647 2676089 2838697 2780001 2708600 2842137
16903 2842137 2550419 2852709 2874577 2841846 2823435 3011204 2977209 3181240 3213881 3024649
$$ packed form
16971A420044J80951l32611M74683l47966L30483l06284K54065J73547n93269
16962A253643J42181K45810L50570j20937j78729O1524J00879M9019L8760j37343
16952A805377o1586j401L92395j28311j89770R4192k84409M50730j42788k0290
16942A914139n01186M15403K51199k71787M75001n62823M60557k80514J88211
16933B088200q7023K56157j13617L34768m41619N35556l72047J211J25535K2097
16923B349218k77105K82867j2094k23160K78467L69325m34985p0344J74970K74726
16913B711885n6164p8188J4652j96894N63356k82558J62608n8696p1401J33537
16903B842137k91718L02290K1868l2731j8411J87769l3995K04031L2641j89232
$$ plain form
16893 3024649 3023149 3221108 3470082 3346758 3038593 3459041 3210478 3208481 3664807 3563260
16883 3563260 3582818 3470174 3382367 3798054 3705696 3482384 3839913 4033944 3896484 3945911
16873 3945911 3704184 3979892 4133232 4250363 4264717 4143827 4445555 4399183 4594789 4385786
16863 4385786 4575219 4646447 4887419 4885818 4638852 4797135 4953501 4913178 4941477 5318337
16853 5318337 5133663 5290688 5404404 5514080 5657167 5573395 5892577 5774130 5926015 5722474
16843 5722474 6259425 6026321 5968763 6375734 6629207 6741135 6371848 7041413 6550110 6846707
16833 6846707 7198148 7472943 7190938 7443674 7829770 8016475 7830937 8115483 8096738 8066104
16823 8066104 8310927 8315566 8805508 8942171 9196210 9284667 9501626 9197471 9800247 10323153
$$ packed form
16893C024649j500J97959K48974j23324l08165M20448k48563j997M56326j01547
16883C563260J9558j12644q7807M15687r2358k23312L57529J94031j37460M9427
16873C945911k41727K75708J53340J17131J4354j20890L01728m6372J95606k09003
16863D385786J89433P1228K40972j601k46966J58283J56366m0323K8299L76860
16853E318337j84674J57025J13716J09676J43087q3772L19182j18447J51885k03541
16843E722474N36951k33104n7558M06971K53473J11928l69287O69565m91303K96597
16833F846707L51441K74795k82005K52736L86096J86705j85538K84546j8745l0634
16823H066104K44823M639M89942J36663K54039Q8457K16959l04155O02776N22906
$$ plain form
16813 10323153 10587989 10400841 10237177 10800752 11147719 11123177 11582826 11842955 11983216
16804 11983216 12659115 12573148 12984623 13167439 13411841 14242050 13937223 14381520 15027012
16795 15027012 15247757 15426606 15815195 16087554 16811810 17401476 17394968 18193654 18181403 18989553
16785 18989553 19520731 20007925 20480737 20664807 21491876 22161701 22842915 23180457 23953845
16776 23953845 24821416 25351436 26153438 27286586 27956333 28611077 29666458 30413001 31614827
16767 31614827 32449475 33315454 34873840 35927714 37003715 38068981 39010446 40974757
16759 40974757 41996204 43390126 45057290 46811614 48296236 50068614 51880993 53774321
16751 53774321 55651138 57622936 59615729 61937187 64366387 66441646 69263013 71532657
$$ packed form
16813A0323153K64836j87148j63664N63575L46967k4542M59649K60129J40261
16804A1983216O75899q5967M11475J82816K44402Q30209l04827M44297O45492
16795A5027012K20745J78849L88589K72359P24256N89666o508P98686j2251Q08150
16785A8989553N31178M87194M72812J84070Q27069O69825O81214L37542P73388
16776B3953845Q67571N30020Q02002J133148O69747O54744J055381P46543J201826
16767C1614827Q34648Q65979J558386J053874J076001J065266R41465J964311
16759D0974757J021447J393922J667164J754324J484622J772378J812379J893328
16751E3774321J876817J971798J992793K321458K429200K075259K821367K269644
$$ plain form
16743 71532657 73796745 76601847 79315240 81946211 84596965 87451822 90077287 93030200
16735 93030200 95546389 98738303 101435639 103775207 106273018 108796354 110683416 112629038
16727 112629038 114420422 116050854 117474976 118418923 119118822 119239859 119935649 119791622 119002046
16718 119002046 118035995 117176065 116035040 114449259 112352387 110023015 107979738 105482535
16710 105482535 103354115 100539379 97833660 94767740 92414911 89330405 86812130 83362696
16702 83362696 81101090 78313698 75540287 72843885 70414428 67967813 65624534 62975158
16694 62975158 60732166 58430963 56388974 54279707 52141606 50666818 48596912 46906412
16686 46906412 45344502 43650756 42102550 40571108 39275000 37815087 36246612 35405380
$$ packed form
16743G1532657K264088K805102K713393K630971K650754K854857K625465K952913
16735I3030200K516189L191914K697336K339568K497811K523336J887062J945622
16727A12629038J791384J630432J424122R43947O99899J21037O95790j44027p89576
16718A19002046r66051q59930j141025j585781k096872k329372k043277k497203
16710A05482535k128420k814736k705719l065920k352829l084506k518275l449434
16702H3362696k261606k787392k773411k696402k429457k446615k343279k649376
16694F2975158k242992k301203k041989k109267k138101j474788k069906j690500
16686D6906412j561910j693746j548206j531442j296108j459913j568475q41232
$$ plain form
16678 35405380 34199602 33284611 31956041 30817272 29962546 29058567 28121610 27394173 26508311
16669 26508311 25539584 24798916 24349016 23381077 22919702 22090272 21157810 20911666 20149137
16660 20149137 19526551 18996074 18660711 18489814 17626053 16931096 16802605 16379604 15942274
16651 15942274 15378625 15448894 14710531 14239938 14178194 13785714 13374468 13207676 12596281 12693972
16641 12693972 12399986 11873828 11837183 11072245 10751769 10799982 10532311 9975686 10123625 10065485
16631 10065485 9928419 9749920 9377031 9268414 8896126 8683585 8632293 8544177 8338218 8527673
16621 8527673 8169155 7880499 7842507 7684595 7445115 7098990 7464393 6828240 7112426 6654220
16611 6654220 6956333 6777153 6443449 6522887 6151393 6409414 5865156 5877201 6032128 5525420
$$ packed form
16678C5405380j205778r14991j328570j138769q54726r03979r36957p27437q85862
16669B6508311r68727p40668m49900r67939m61375q29430r32462k46144p62529
16660B0149137o22586n30477l35363j70897q63761o94957j28491m23001m37330
16651A5942274n63649P0269p38363m70593o1744l92480m11246j66792o11395R7691
16641A2693972k93986n26158l6645p64938l20476M8213k67671n56625J47939n8140
16631A0065485j37066j78499l72889j08617l72288k12541n1292q8116k05959J89455
16621H527673l58518k88656l7992j57912k39480l46125L65403o36153K84186m58206
16611F654220L02113j79180l33704P9438l71494K58021n44258J2045J54927n06708
$$ plain form
16601 5525420 5883848 5896944 5597321 5278018 5485179 4983490 4919134 5066907 5011567 5344910
16591 5344910 4881290 4867261 4660277 4308350 4424102 4643297 4397505 4586864 4347112 4533786
16581 4533786 3826365 3984531 4483959 4226215 4004858 3653207 3739781 4125152 3442226 3698345
16571 3698345 3909491 3260798 3607375 3731327 3459388 3762968 3219348 3198630 3187703 3273103
16561 3273103 3495313 3075384 3296988 3419283 3112488 3088178 3037504 2845736 2700902 3034257
16551 3034257 3358454 2587986 2706531 2963169 2831966 2573472 2908161 2743870 2589815
16542 2589815 2271344 2523496 2649265 2507268 2314453 2485862 2523369 2449600 2320181 2169222
16532 2169222 2400383 2106101 2279107 2319521 1670286 1843226 2083243 2490022 2360577 2203906
$$ packed form
16601E525420L58428J3096k99623l19303K07161n01689o4356J47773n5340L33343
16591E344910m63620j4029k06984l51927J15752K19195k45792J89359k39752J86674
16581D533786p07421J58166M99428k57744k21357l51651Q6574L85371o82926K56119
16571C698345K11146o48693L46577J23952k71939L03580n43620k0718j0927Q5400
16561C273103K22210m19929K21604J22295l06795k4310n0674j91768j44834L33355
16551C034257L24197p70468J18545K56638j31203k58494L34689j64291j54055
16542B589815l18471K52152J25769j41997j92815J71409L7507p3769j29419j50959
16532B169222K31161k94282J73006M0414o49235J72940K40017M06779j29445j56671
$$ plain form
16522 2203906 2044869 1912339 2185434 2189187 1847113 2241373 2047042 1765922 1812414 1888674
16512 1888674 1659851 1764408 1996051 1835118 1691444 1863808 1904866 1804367 1925560 1776761
16502 1776761 1768871 1457124 1823492 1457884 1603591 1392050 1698497 1947767 1283465 1974866
16492 1974866 1282118 1527208 1494052 1522260 1527872 1716567 1373360 1649754 1533718 1574593
16482 1574593 1129459 1146990 1680425 1229273 1079530 1543539 1287563 1367697 1325403 1314464
16472 1314464 1386907 1280094 1443293 1270485 1093332 1373846 1487388 1259956 1273659 1202063
16462 1202063 1180729 1381113 1204359 896706 1232068 1204202 1231731 1299142 1354449 1012533
16452 1012533 1493365 1192743 1013871 1143107 1157428 730183 1096367 895843 1036211 1123596
$$ packed form
16522B203906j59037j32530K73095L753l42074L94260j94331k81120M6492P6260
16512A888674k28823J04557K31643j60933j43674J72364M1058j00499J21193j48799
16502A776761p890l11747L66368l65608J45707k11541L06447K49270o64302O91401
16492A974866o92748K45090l3156K8208N612J88695l43207K76394j16036M0875
16482A574593m45134J7531N33435m51152j49743M64009k55976Q0134m2294j0939
16472A314464P2443j06813J63199j72808j77153K80514J13542k27432J3703p1596
16462A202063k1334K00384j76754l07653L35362k7866K7529O7411N5307l41916
16452A012533M80832l00622j78872J29236J4321m27245L66184k00524J40368Q7385
$$ plain form
16442 1123596 998929 840480 1103812 1119136 1119899 1206123 835906 991049 871919 1084223
16432 1084223 1117337 1006341 1062065 1139193 976616 695436 877504 789921 826589 1320612
16422 1320612 963001 913330 872105 864896 674537 658091 1128324 975321 870318 927937
16412 927937 796428 725265 1131617 611715 524995 675003 1047669 973400 743151 963372
16402 963372 781515 872547 424430 913663 847524 728408 756724 421704 700560 959562
16392 959562 891674 912038 796705 803947 790281 783577 749699 510385 830448 478687 616870
16381 616870 711521 692157 339109 684345 599369 290051 593555 578221 506024 608503
16371 608503 362168 694197 452432 903855 885746 346675 418960 696429 544907 582474
$$ packed form
16442A123596j24667j58449K63332J5324P63Q6224l70217J55143j19130K12304
16432A084223L3114j10996N5724P7128j62577k81180J82068q7583L6668M94023
16422A320612l57611m9671m1225p209j90359j6446M70233j53003j05003N7619
16412I27937j31509p1163M06352n19902q6720J50008L72666p4269k30249K20221
16402I63372j81857R1032D24430M89233o6139j19116K8316l35020K78856K59002
16392I59562o7888K0364j15333P242j3666o704l3878k39314L20063l51761J38183
16381F16870R4651j9364C39109L45236q4976B90051L03504j5334p2197J02479
16371F08503k46335L32029k41765M51423j8109C46675P2285K77469j51522L7567
$$ plain form
16361 582474 522726 697740 751625 970500 805203 430424 584624 552364 286888 555827
16351 555827 719021 346742 481191 642896 382154 696274 442385 565338 1003863 536391
16341 536391 419285 387300 702314 696295 581482 378572 612682 333720 304274 356810
16331 356810 243636 501694 270165 657221 390615 707523 462608 749270 303284 628414
16321 628414 317137 686101 509569 521787 400335 449482 307341 582132 251830 459093
16311 459093 535716 49257 595424 482596 352780 520442 294508 329802 385586 451805
16301 451805 384723 550839 776395 219807 307204 526283 349500 587887 378307 453672
16291 453672 470350 374434 341669 327709 317991 208577 400798 487880 704534 400498 258583
$$ packed form
16361E82474n9748J75014N3885K18875j65297l74779J54200l2260k65476K68939
16351E55827J63194C46742J34449J61705k60742L14120k53889J22953M38525m67472
16341E36391j17106l1985L15014o019j14813k02910K34110k78962k9446N2536
16331C56810j13174K58058k31529L87056k66606L16908k44915K86662C03284L25130
16321F28414l11277L68964j76532J2218j21452M9147j42141K74791B51830K07263
16311D59093P6623D9257N46167j12828j29816J67662k25934L5294N5784O6219
16301D51805o7082J66116K25556B19807Q7397K19079j76783K38387k09580P5365
16291D53672J6678r5916l2765j3960r718j09414J92221Q7082K16654l04036j41915
$$ plain form
16280 258583 276504 285878 428742 481441 100806 352523 456621 250479 314197 447495
16270 447495 267083 297598 24032 241563 455853 387877 153081 230512 342131 303017
16260 303017 150105 434725 320892 512476 -1474 406446 304704 286735 263091 254238 293685
16249 293685 -35161 154892 244919 357347 176057 355757 639242 64004 411294 282161
16239 282161 301135 284983 407072 204893 341524 312580 -103089 388104 243723 449554
16229 449554 338781 531416 405520 380754 17077 83009 192957 419607 226303 3366
16218 188826 127186 359909 213053 513264 200354 84298 339929 293721 247551 451528
16208 451528 256020 463976 416375 508251 490055 30601 78476 190028 276102 155464 239445
$$ packed form
16280B58583J7921R374J42864N2699A00806K51717J04098k06142O3718J33298
16270D47495j80412L0515B4032K17531K14290o7976A53081P7431J11619l9114
16260C03017A50105K84620j13833J91584a474D06446j01742j7969k3644q853L9447
16249B93685c5161A54892R0027J12428A76057J79700K83485F4004L47290j29133
16239B82161J8974j6152J22089k02179J36631k8944a03089C88104j44381K05831
16229D49554j10773J92635j25896k4766A7077O5932J09948K26650j93304C366
16218A88826o1640K32723j46856L00211B00354H4298K55631m6208m6170K03977
16208D51528j95508K07956m7601R1876j8196C0601M7875J11552Q6074j20638Q3981
$$ plain form
16197 239445 190149 78653 328357 13302 252725 98648 156806 80654 91786 140322 195956
16186 195956 204831 411369 154054 136609 277403 264790 315860 168669 417776 167921
16175 -34047 -350607 74614 -66236 -200491 127395 -99839 304663 79200 -355059 474363
16164 263029 86627 11801 144794 338045 -105624 -130190 201810 -260706 323639 124332
16153 189146 388580 236405 115283 37032 6829 439824 -17112 105532 210182 170792
16143 170792 57208 5286 168431 101565 159140 265326 97783 451160 318407 -101459 234731
16131 29454 75862 374664 -233247 423835 -116413 151590 45574 62989 304240 145840
16120 531762 184143 -167661 51465 32970 103207 42970 96371 22243 215255 82222 -378092
$$ packed form
16197B39445m9296G8653K49704A3302K39423I8648N8158p6152J1132M8536N5634
16186A95956Q875K06538A54054j7445J40794j2613N1070j47191K49107A67921
16175c4047l16560G4614f6236j34255A27395i9839C04663G9200c55059D74363
16164B63029H6627A1801J32993J93251a05624k4566B01810b60706C23639A24332
16153A89146J99434j52175A15283C7032F829M32995a7112A05532J04650l9390
16143A70792E7208E286J63145o6866N7575J06186I7783L53377j32753a01459B34731
16131B9454M6408K98802b33247D23835a16413A51590D5574J7415K41251A45840
16120E31762A84143a67661E1465j8495P0237D2970N3401B2243J93012H2222c78092
$$ plain form
16108 220828 -110359 223735 102921 -47818 -66432 -101017 279436 185272 285510 167653
16098 167653 -44243 178813 87713 -219559 165608 122871 289241 131136 -82938 -1161 192572
16086 -83849 217586 50067 69280 118109 -54113 575681 144825 118695 194298 11518 260556
16075 260556 -283358 144212 79024 157427 115758 131327 -259999 -74768 -33882 -23537 -101303
16064 -101303 197610 -56707 353760 36098 25786 272367 144355 -195101 345642 199440
16054 199440 -168915 23375 112948 -64793 26769 509801 345178 -46712 -283020 275950
16043 98461 122933 28907 113 122647 -218971 31051 226490 61264 89232 121280 110108
16032 110108 167430 -87580 -45747 190834 74545 174808 59970 -152761 127668 176318 -239491
$$ packed form
16108B20828a10359B23735A02921d7818j8614l4585B79436r4164J00238j17857
16098A67653d4243A78813H7713b19559A65608m2737J66370A31136h2938a161A92572
16086h3849B17586E0067J9213M8829e4113E75681A44825k6130P5603A1518K49038
16075B60556b83358A44212o5188P8403m1669J5569b59999g4768c3882J0345p7766
16064a01303A97610e6707C53760C6098j0312K46581j28012a95101C45642j46202
16054A99440a68915B3375Q9573f4793B6769M83032j64623d6712k36308B75950
16043I8461K4472B8907A13J22534b18971C1051J95439F1264K7968L2048j1172
16032A10108N7322h7580M1833A90834G4545J00263E9970a52761A27668M8650b39491
$$ plain form
16020 -200457 18977 -31859 204195 112051 91005 -32833 17158 192 192456 -300548 -70527
16008 168139 110528 -124484 -95241 214958 -174719 6838 -195130 57715 131780 -29694 53865
15996 -50539 209940 137730 40829 56775 162326 179905 -235772 177326 -25333 167915 210864
15985 210864 647210 846205 1027313 1143046 951872 634896 810110 607976 79951 285089
15975 285089 304024 502973 -339823 299400 -53402 288798 -87534 -464726 5123 -452728
15964 -252426 339337 260430 -15864 65452 134789 32414 -113781 225631 117647 226221
15954 226221 312960 -110975 -121741 163220 -255675 56633 311914 8136 -186589 -47867 -36324
15943 -36324 259877 734 -7994 216550 -2817 -119598 279272 337281 -139091 215398 466177
$$ packed form
16020b00457A8977c1859B04195r2144k1046c2833A7158A92J92264c00548g0527
16008A68139n7611a24484K9243B14958a74719F838a95130E7715P4065b9694E3865
15996e0539B09940p2210D0829J5946J05551J7579b35772A77326b5333A67915M2949
15985B10864M36346J98995J81108J15733j91174l16976J75214k02134G9951K05138
15975B85089J8935J98949c39823B99400e3402B88798h7534l77192E123d52728
15964b52426C39337p8907a5864F5452O9337C2414a13781B25631j07984J08574
15954B26221Q6739a10975j0766A63220b55675E6633K55281H136a86589d7867J1543
15943c6324B59877G34g994B16550b817j16781B79272N8009a39091B15398K50779
$$ plain form
15932 466177 -184609 -20775 219371 -39189 239469 119407 23083 275598 31341 277634
15922 277634 132137 -270639 21924 127360 -133323 -100347 -141533 397628 243530 151983
15912 151983 153721 -77633 62247 -32143 84091 260652 -304351 22256 114847 -180578 77475
15900 -96715 136113 -4574 55265 -188614 259261 32061 92817 91323 162064 14561 146282
15889 146282 116777 -247350 -194587 -81100 271960 223237 8413 -84478 -223478 -37740 -322527
15878 -322527 179470 -155612 309307 -7695 367560 -384506 119722 -58765 125319 243384
15868 243384 -110448 -84083 -66371 -259049 -105268 212401 178164 38817 172675 -329325
15857 -9390 -376954 -313847 186537 214348 219472 -100877 -120429 -248991 -46675 -143302 90042
$$ packed form
15932D66177a84609b0775B19371c9189B39469A19407B3083K52515C1341K46293
15922B77634A32137b70639B1924J05436a33323L2976m1186C97628j54098r1547
15912A51983J738g7633F2247c2143H4091J76561c04351B2256R2591a80578G7475
15900i6715A36113d574E5265a88614B59261C2061O0756j494P0741A4561J31721
15889A46282k9505b47350N2763h1100B71960m8723H413h4478j39000c7740k84787
15878c22527A79470a55612C09307g695C67560c84506A19722e8765A25319J18065
15868B43384a10448K6365J7712j92678a05268B12401l4237C8817J33858c29325
15857i390l67564O3107A86537K7811N124a00877j9552j28562d6675r6627I0042
$$ plain form
15845 -170786 100301 -53318 -72107 -72103 70552 -10089 127991 125743 104478 -211870 97640 -159555
15832 -79216 -14848 70795 -391965 -14322 156325 115207 -72785 15777 -109589 -58117 -336337
15821 -336337 80156 -32980 39062 223866 -363908 97389 -351007 60539 -291338 -270277 34678
15809 -360551 -19813 -212385 -239106 128272 -270458 44929 179732 -132629 23160 -161255
15798 122285 193186 18605 23791 26601 146250 194796 34871 258494 167828 161444 -125071
15786 -257990 -94674 -33282 360296 -87256 283938 53828 46775 19394 -185684 20941 -101492
15774 209363 -41273 112655 155946 -141923 119444 103731 -331060 -118720 436284 45638
15763 18306 -119858 -12839 10128 139097 52752 -126617 -145679 139436 427179 -272484
$$ packed form
15845a70786A00301e3318j8789MG0552a0089A27991k248k1265b11870I7640a59555
15832g9216a4848G0795c91965a4322A56325m1118g2785A5777a09589N1472k78220
15821c36337H0156c2980C9062J84804c63908I7389c51007F0539b91338K1061C4678
15809c60551a9813j92572k6721A28272b70458D4929J34803a32629B3160a61255
15798A22285P0901A8605N186K810J19649M8546C4871K23623r0666o384a25071
15786b57990i4674c3282C60296h7256B83938E3828p053A9394a85684B0941a01492
15774B09363d1273A12655M3291a41923A19444j5713c31060a18720D36284D5638
15763A8306a19858a2839A0128J28969E2752a26617j9062A39436K87743b72484
$$ plain form
15752 23188 165068 91969 -322806 -8843 121433 -33699 -185084 -316239 210414 -255507
15741 111684 -249082 24918 -218917 16153 -28619 -151378 -114166 186085 -65812 16237 -277217
15729 168861 -256653 19054 -304123 -256440 -262009 -19682 -37968 76714 2181 401420 6960
15717 -49198 -69887 151004 56461 -97138 -124677 359094 39906 -68499 15750 -271778 21406
15705 214170 167972 87032 -531301 -244733 -199943 114415 -122343 185790 -9464 3877 -202883
15693 104807 190060 -147453 -163289 11653 -74649 -79201 -282264 48955 52887 150557 84413
15682 84413 -165924 -134440 -118904 49995 -218727 -362582 40801 -131011 -216587 -285500 196462
15670 91226 296201 -96980 -37086 -469807 -161163 -217156 -242182 80089 -138690 166588 218779
$$ packed form
15752B3188J41880p3099c22806h843A21433c3699j51385j31155B10414b55507
15741A11684b49082B4918b18917A6153b8619j22759L7212A86085f5812A6237b77217
15729A68861b56653A9054c04123M7683n569a9682j8286G6714B181L99239F960
15717d9198k0689A51004E6461i7138k7539C59094C9906f8499A5750b71778B1406
15705B14170m6198q0940e31301b44733M4790A14415a22343A85790i464C877b02883
15693A04807Q5253a47453j5836A1653g4649m552k03063D8955L932R7670o6144
15682H4413a65924L1484J5536D9995b18727j43855D0801a31011q5576o8913A96462
15670I1226K04975i6980c7086m32721a61163n5993k5026H0089a38690A66588N2191
$$ plain form
15659 218779 93504 169220 -39698 -29856 203132 -74665 279215 -281450 115286 97171 -148469
15647 -123847 -3611 -217349 -18298 -408550 88523 -154106 -11565 -70740 44160 71803 49628
15636 49628 309782 -312494 -107442 -282737 208245 -152635 -160834 101866 -141876 11753
15625 -186369 103640 174729 310210 -164269 48512 -31234 47609 26735 -49938 18488 41084
15614 41084 -210486 137154 7111 -99042 -257836 280116 202946 -241111 -139035 -86770 119224
15602 -118498 -22896 161289 -19491 17263 -202168 -71894 -155164 -109320 -184930 -162707 21374
15590 -125608 -76779 -178103 18111 -12937 -69911 107622 22449 6315 196543 -268717 26271
15578 -81584 15476 317559 148918 376345 11567 -190141 31416 253951 -132172 124899
$$ packed form
15659B18779I3504P5716c9698R842B03132g4665B79215b81450A15286j8115a48469
15647a23847c611k13738a8298l90252H8523a54106a1565n9175D4160K7643k2175
15636D9628K60154c12494a07442j75295B08245a52635q199A01866a41876A1753
15625a86369A03640P1089J35481a64269D8512c1234D7609k0874d9938A8488K2596
15614D1084b10486A37154G111i9042j58794B80116p7170b41111J02076N2265A19224
15602a18498b2896A61289a9491A7263b02168g1894q3270M5844p5610K2223B1374
15590a25608M8829j01324A8111a2937n6974A07622B2449F315J90228b68717B6271
15578h1584A5476L02083A48918K27427A1567a90141C1416K22535a32172A24899
$$ plain form
15567 24603 -26408 198388 90882 124403 180514 164817 391713 2170 -30694 -102347 56082
15555 -63106 154341 74557 12068 -213579 95427 -89553 -6887 95110 -200611 89486 -336655
15543 -352127 157418 -181089 103748 31108 -245818 126896 41308 158880 -366996 180710
15532 -182926 -300340 -295719 -236087 72026 286158 268038 -370093 146802 62596 185470 269901
15521 269901 273947 269537 151439 -16947 -70720 249451 248751 325538 268112 334899 307482 2729
15508 173343 233328 -199462 -103081 137737 72127 -87183 134057 17791 230478 73301 270407
15497 270407 142719 131837 165663 258876 69496 216943 170479 215039 486709 -113532 245810
15485 5412 412028 -73437 -160532 62187 -395498 120452 85578 -159878 178372 90261 -44503
$$ packed form
15567B4603b6408A98388I0882L3521N6111j5697K26896B170c0694p1653E6082
15555f3106A54341G4557A2068b13579I5427h9553f887I5110b00611H9486c36655
15543c52127A57418a81089A03748C1108b45818A26896D1308J17572c66996A80710
15532a82926j17414M621N9632G2026K14132j8120c70093A46802F2596J22874Q4431
15521B69901M046m410j18098a6947n3773B49451p00P6787n7426O6787k7417B729
15508A73343N9985a99462R6381A37737o5610h7183A34057A7791K12687G3301J97106
15497B70407j27688j0882L3826R3213F9496J47447m6464M4560K71670a13532B45810
15485E412M06616g3437q7095F2187c95498A20452l4874a59878A78372q8111d4503
$$ plain form
15473 521748 895442 894633 649872 209795 271658 120352 -60439 -348080 -167023 259746
15462 14426 45078 -40881 31624 -6656 -140550 87443 -23864 61648 -77807 -211843 4169 305106
15450 305106 209858 -142489 -203113 -13231 -90912 145332 -120635 319622 412432 1091792
15440 1091792 1643125 1061798 562945 627808 78349 6326 342378 118808 103097 128526
15430 128526 174386 -183152 -65617 77713 265561 38642 -15983 34634 299428 32560 -167076
15418 -25994 -12687 -22898 173070 22194 -221412 312404 146440 58523 101903 272071 253531
15407 253531 216865 -10539 30739 175188 -223421 -44739 -31697 -100217 -28809 154091 260200
15396 260200 245381 45423 143987 -57480 310997 -101384 222980 -203143 -10269 243197
$$ packed form
15473E21748L73694q09k44761B09795O1863A20352f0439k87641a67023B59746
15462A4426L0652d0881C1624f656j33894H7443b3864F1648g7807j34036D169L00937
15450C05106r5248a42489o0624a3231p7681A45332a20635C19622R2810O79360
15440A091792N51333n81327m98853O4863G8349F326L36052A18808j5711K5429
15430A28526M5860a83152f5617G7713J87848C8642a5983C4634K64794C2560a67076
15418b5994a2687j0211A73070B2194b21412C12404A46440E8523M3380J70168j8540
15407B53531l6666a0539C0739J44449b23421d4739J3042o8520b8809A54091J06109
15396B60200j4819D5423R8564e7480C10997a01384B22980b03143a0269B43197
$$ plain form
15385 -112774 79853 297604 95614 178654 -178422 144448 -11851 280054 201986 133860 27646
15373 -128318 136129 -43448 201495 52022 -185025 -78388 -57563 241993 241695 35335 142487
15362 142487 386212 74223 66776 502740 383506 282082 146098 150232 354128 89118 125307
15351 125307 134000 42359 168013 94618 23132 105784 159365 426566 270565 375564 319643
15340 319643 459212 77769 409064 190838 -251839 -103649 216157 125136 -265269 99011
15329 166345 507567 294417 -26758 107671 96008 -41992 296873 23 114221 -10327 175461
15317 265741 139725 194011 -96317 157948 1901 -310182 219882 258877 56128 33061 182520
15306 182520 113882 77349 78942 -341214 -63549 152129 -54989 95004 -136564 103626 240350
$$ packed form
15385a12774G9853K17751I5614Q3040a78422A44448a1851B80054p8068o8126B7646
15373a28318A36129d3448B01495E2022a85025g8388K0825B41993k98C5335J07152
15362A42487K43725G4223p447M35964j19234j01424j35984M134K03896H9118L6189
15351A25307Q693D2359J25654p3395B3132Q2652N3581K67201j56001J04999n5921
15340C19643J39569G7769L31295A90838b51839a03649B16157r1021b65269I9011
15329A66345L41222k13150b6758A07671j1663d1992B96873B3J14198a0327A75461
15317B65741j26016N4286i6317A57948A901c10182B19882L8995E6128k3067J49459
15306A82520o8638l6533J593c41214f3549A52129e4989I5004a36564A03626J36724
$$ plain form
15295 240350 -230595 13464 159753 209021 134699 11019 -41267 -26474 16364 40738 -90699
15283 -238022 242778 -333263 19867 268827 -231384 -18385 -55065 -26715 100826 317990
15273 317990 155178 62994 42357 9157 -74360 42549 83724 -107125 71308 -113423 -385379
15262 -385379 228395 84023 127569 175770 -197556 165242 -208714 -357042 23536 -100982
15251 138482 -8843 270308 92646 277340 272498 29598 -138535 -68494 188713 -10860 793356
15239 1042448 2729521 1582242 1910130 1727192 689289 393494 402741 6856 88154 321630
15229 321630 -161013 68727 426114 -176981 -7007 22389 189653 -55106 -233442 138224
15218 -158493 -115796 500735 -138711 32596 71502 280751 1631 4193 209450 253624 243374
$$ packed form
15295B40350b30595A3464J46289M9268p4322A1019d1267J4793A6364K4374i0699
15283b38022B42778c33263A9867K48960b31384a8385l6680b6715A00826K17164
15273C17990A55178F2994k0637I157g4360D2549M1175a07125G1308a13423k71956
15262c85379B28395H4023M3546M8201a97556A65242b08714j48328B3536a00982
15251A38482h843B70308I2646J84694m842B9598a38535f8494A88713a0860G93356
15239A042448J687073j147279L27888j82938F89289k95795R247F856Q1298K33476
15229C21630a61013F8727L57387a76981g007B2389J67264e5106j78336A38224
15218a58493M2697E00735a38711C2596L8906K09249A631K562K05257M4174j0250
$$ plain form
15207 243374 -43210 65652 -92267 258774 197800 235964 102266 -15515 -123587 -60234 58166
15195 206765 429517 282141 149719 -69794 101869 76239 261625 275900 110788 230763
15185 230763 126077 -110957 81114 -94042 -99934 -91840 -112720 120734 -102052 -368859 -230314
15174 -230314 65394 356943 122300 -69965 77886 54596 -21881 -131345 -70986 -117977 -179661
15163 -179661 -23028 -64702 81918 43526 213662 -57591 219440 187906 89267 96794 302329
15152 302329 74962 188665 157892 -33494 249432 -56247 -25943 -96542 -4285 40398 392758
15141 392758 297001 138703 343105 403326 265815 302439 -26699 -256 -113468 258915 -128043
15129 10451 266458 80393 59709 310217 -15056 277966 246362 34992 -203674 89468 387640
$$ packed form
15207B43374d3210F5652i2267B58774o0974L8164A02266a5515j08072f0234E8166
15195B06765K22752j47376j32422f9794A01869k5630J85386J4275A10788J19975
15185B30763j04686a10957H1114i4042n892Q094k0880A20734a02052k66807J38545
15174b30314F5394K91549A22300f9965G7886k3290b1881j09464O0359m6991o1684
15163a79661b3028m1674H1918l8392J70136e7591B19440l1534H9267P527K05535
15152C02329G4962J13703l0773c3494B49432e6247b5943p0599d285D0398L52360
15141C92758r5757A38703K04402O0221j37511L6624b6699b56j13212B58915a28043
15129A0451K56007H0393k0684K50508a5056B77966l1604C4992b03674H9468K98172
$$ plain form
15118 387640 467644 508736 78855 294624 326979 -22291 338913 -78817 167653 322893 -164985
15106 -146957 207103 -255862 509834 265314 105997 159719 205056 153925 311435 -297799
15095 179443 200831 -14977 71469 -94531 -2309 -63402 444364 -78655 -18624 -265735 223949
15083 232367 239507 -10313 169592 251048 -5291 53055 225517 432770 170160 122179 245994
15072 245994 304987 203586 59225 93612 82135 138108 109154 242195 196569 227118 160875
15061 160875 151249 138455 134254 94888 452022 156763 288809 331535 327726 337780 68062
15049 459494 355647 570495 412387 394891 183029 250514 473099 463161 261815 96081
15038 256582 409905 627356 429861 522980 379097 269347 765795 533699 656913 807453
$$ packed form
15118C87640Q0004M1092G8855K15769L2355b2291C38913g8817A67653J55240a64985
15106a46957B07103b55862E09834k44520A05997N3722M5337n1131J57510b97799
15095A79443K1388a4977G1469i4531b309o1093D44364g8655a8624k47111B23949
15083B32367P140a0313A69592Q1456e291E3055J72462K07253A70160m7981J23815
15072B45994N8993j01401E9225L4387j1477N5973k8954J33041m5626L0549o6243
15061A60875r626j2794m201l9366L57134A56763J32046M2726l809J0054F8062
15049D59494j03847K14848j58108j7496A83029O7485K22585r938k01346I6081
15038B56582J53323K17451j97495R3119j43883j09750M96448k32096J23214J50540
$$ plain form
15028 807453 797867 704676 376225 425330 360608 220394 -7848 421165 386616 626066 256899
15016 420488 359395 303531 162963 364403 552290 425926 459181 707740 665098 633164
15006 633164 403267 334447 183651 437052 455640 410723 118163 716319 841156 516123
14996 516123 477280 244769 449842 224818 326897 347410 281203 404061 492825 484941 638079
14985 638079 758361 627980 651859 741913 954646 1081047 459241 577201 651893 395338
14975 395338 412283 426748 469359 1034204 814418 647568 540393 692321 275063 306191
14965 306191 172927 313834 483048 412314 336402 551824 192944 407948 329528 362494
14955 362494 252205 344042 450630 152777 353344 357573 305401 408277 617188 384785
$$ packed form
15028H07453r586r3191l28451M9105o4722j40214g848D21165l4549K39450B56899
15016D20488o1093n5864j40568K01440J87887j26364L3255K48559m2642l1934
15006F33164k29897o8820j50796K53401J8588m4917A18163N98156J24837l25033
14996E16123l8843k32511K05073B24818J02079K0513o6207J22858Q8764p884J53138
14985F38079J20282j30381K3879R0054K12733J26401D59241J17960P4692k56555
14975C95338J6945J4465M2611N64845k19786j66850j07175J51928B75063L1128
14965C06191j33264J40907J69214p0734p5912K15422A92944K15004p8420L2966
14955C62494j10289R1837J06588A52777K00567M229n2172J02876K08911k32403
$$ plain form
14945 384785 575940 638818 610381 761776 867932 602834 505956 515110 273206 185367 673927
14934 673927 497739 558411 810081 1067830 826434 1144682 1409600 1410983 1592847 1558379
14924 1558379 1890758 1771812 1850513 1607350 1581830 1549387 1873987 2294476 2450699 2537675
14914 2537675 1882719 1325832 1273109 999340 940964 657885 716237 458190 537926 576594
14904 576594 520898 585499 605615 328681 564970 310826 272480 177724 470310 15676 267982
14893 267982 575455 269129 698427 775154 185058 450429 441998 887975 871863 948397
14883 948397 1038978 959296 1096389 725846 806552 856370 924617 286489 933709 742161
14873 742161 290515 328855 480834 125406 615403 419265 635598 1013579 571140 775000
$$ packed form
14945C84785J91155O2878k8437J51395J06156k65098r6878R154k41904q7839M88560
14934F73927j76188O0672K51670K57749k41396L18248K64918J383J81864l4468
14924A558379L32379j18946P8701k43163k5520l2443L24600M20489J56223Q6976
14914B537675o54956n56887n2723k73769n8376k83079N8352k58047P9736L8668
14904E76594n5696O4601K0116k76934K36289k54144l8346r4756K92586A5676K52306
14893B67982L07473B69129M29298P6727A85058K65371q431M45977j6112P6534
14883I48397R0581p9682J37093l70543Q0706M9818O8247B86489O47220j91548
14873G42161B90515L8340J51979A25406M89997j96138K16333L77981m42439K03860
$$ plain form
14863 775000 803058 788268 646485 553481 267714 439125 505105 605224 634837 808985
14853 808985 88566 365535 53744 323637 242127 516083 451436 762750 835929 937314
14843 937314 1149350 784008 778730 993053 1365300 837140 1230188 727495 942599 387929
14832 190650 893015 573800 646939 486061 654318 602040 613619 556132 606094 648194 642953
14821 642953 982775 486867 939002 741737 556422 1089637 508066 431345 659507 604203
14811 604203 693076 589904 894802 833924 649251 749951 990915 1172016 1189467 946171
14801 946171 520946 603806 666338 574226 551720 555953 712612 381973 441858 507119 726676
14790 726676 519239 431774 680563 593561 600823 704654 691783 762483 531056 408737 474134
$$ packed form
14863G75000K8058j4790j41783r3004B67714J71411O5980J00119K9613J74148
14853H08985H8566K76969E3744K69893q1510K73956o4647L11314P3179J01385
14843I37314K12036l65342n278K14323L72247n28160L93048n02693K15104C87929
14832A90650P02365l19215P3139j60878J68257n2278J1579n7487M9962M2100n241
14821F42953L39822D86867M52135j97265j85315N33215E08066p6721K28162n5304
14811F04203Q8873j03172L04898o0878j84673J00700K40964J81101J7451k43296
14801I46171m25225Q2860O2532r2112k2506M233J56659l30639N9885O5261K19557
14790G26676k07437q7465K48789q7002P262J03831j2871P0700k31427j22319O5397
$$ plain form
14779 474134 761531 925753 953483 525754 972411 693926 692830 794003 692772 711004
14769 711004 800071 609321 532917 810952 755440 514450 606331 425505 582117 612171
14759 612171 654638 619620 769765 486198 871798 450557 704193 880614 547374 794843
14749 794843 790880 690531 579228 743172 563856 787289 618426 501822 625753 784407
14739 784407 556886 877307 711573 738639 815162 1029853 985613 965892 1041147 1379486
14729 1379486 1675395 1817402 1879718 2234528 1919853 1465612 1275777 921284 995668 968504
14719 968504 963688 1007946 899085 1120604 854574 789474 691113 826555 895538 893055 1083314
14708 1083314 939334 1145312 891194 1064277 1514170 1508131 1481835 2159110 1846313 1939008
$$ packed form
14779D74134K87397J64222K7730m27729M46657k78485j096J01173j01231J8232
14769G11004Q9067j90750p6404K78035n5512k40990R1881j80826J56612L0054
14759F12171M2467l5018J50145k83567L85600m21241K53636J76421l33240K47469
14749G94843l963j00349j11303J63944j79316K23433j68863j16604J23931J58654
14739G84407k27521L20421j65734K7066P6523K14691m4240j9721P5255L38339
14729A379486K95909J42007O2316L54810l14675m54241j89835l54493P4384k7164
14719I68504m816M4258j08861K21519k66030o5100r8361J35442O8983k483J90259
14708A083314j43980K05978k54118J73083M49893o039k6296O77275l12797R2695
$$ plain form
14698 1939008 1301787 1701466 895090 1017323 937763 1335213 924141 1208077 863703 1057767
14688 1057767 905754 633606 925553 799882 970617 531609 855668 666844 840865
14679 840865 1008234 667630 1007307 1138788 1217939 1050736 952982 957910 871693 798878 1040605
14668 1040605 886566 1291390 593320 745635 936507 1155597 961630 861942 1226916 1102423
14658 1102423 997188 1137726 1094920 1344713 1120168 992784 1397441 1123511 1236735 1418541
14648 1418541 1405934 718664 956249 1181812 1181881 1103246 1404193 1145158 1594218 1045577
14638 1045577 1166530 1351103 1379944 1369567 1571211 1279787 1102156 981338 1333806 1331131
14628 1331131 1151076 1154313 1394062 1368274 1327971 1317181 1067162 1218212 1385573 1232552
$$ packed form
14698A939008o37221L99679q06376J22233p9560L97450m11072K83936l44374J94064
14688A057767j52013k72148K91947j25671J70735m39008L24059j88824J74021
14679H40865J67369l40604L39677J31481P9151j67203r7754M928q6217p2815K41727
14668A040605j54039M04824E93320J52315J90872K19090j93967r9688L64974j24493
14658A102423j05235J40538m2806K49793k24545j27384M04657k73930J13224J81806
14648A418541j2607o87270K37585K25563O9p8635L00947k59035M49060n48641
14638A045577J20953J84573K8841j0377K01644k91424j77631j20818L52468k675
14628A331131j80055L237K39749k5788m0303j0790k50019J51050J67361j53021
$$ plain form
14618 1232552 1237852 1609884 1251160 1254200 1230332 1354300 1304245 1012789 1366078 1379898 1396759
14607 1396759 1577370 1785410 1514358 1499952 1498428 1476067 1885956 1827353 1514289 1333130
14597 1333130 1475713 1481136 1735955 1584783 1879922 1726051 1705545 1413822 1429917 1692479
14587 1692479 1958999 2061187 1826151 1919629 1744741 1845989 1822124 1918754 1930486 2015363
14577 2015363 1954825 2212190 2135994 1896578 2178741 2110893 2084985 2356052 2382169 2292704
14567 2292704 2201379 2063868 2108630 2298372 2121240 2610804 2745526 2785538 2647858 2688008
14557 2688008 2807631 3014985 2780087 3196505 3674487 3973483 4496502 5699440 7636245
14548 7636245 11098873 18530095 37500836 47187215 18435784 8065619 4594672 3631489
$$ packed form
14618A232552N300L72032l58724L040k3868J23968n0055k91456L53289J3820J6861
14607A396759J80611K08040k71052j4406j524k2361M09889n8603l13064j81159
14597A333130J42583N423K54819j51172K95139j53871k0506k91723J6095K62562
14587A692479K66520J02188k35036R3478j74888J01248k3865R6630J1732Q4877
14577B015363o0538K57365p6196k39416K82163o7848k5908K71067K6117q9465
14567B292704r1325j37511M4762J89742j77132M89564J34722M0012j37680M0150
14557B688008J19623K07354k34898M16418M77982K98996N23019J202938J936805
14548G636245L462628P431222J8970741R686379A8435784H065619l470947r63183
$$ plain form
14540 3631489 3046289 2400138 2521013 2966331 3683567 5805792 4848428 2896021 2534917
14531 2534917 2330880 2370131 2397887 1924244 1910673 2293839 2296716 2331179 2047593 2583919
14521 2583919 2590925 2298604 2196213 2518288 2677430 2315289 2572581 2441091 2701976 2690169
14511 2690169 2665682 3054172 2795088 2677859 2758647 2825976 2984225 3249329 2948002 3004961
14501 3004961 3035717 2821581 3200966 3127863 3164002 3280013 3206604 3224811 3419044 3473889
14491 3473889 3360044 3438495 3164013 3422963 3569037 3589867 3741152 3528558 3624581 3758654
14481 3758654 3570752 3788710 3742194 3837856 3765478 4112799 3470232 3709794 4287499 4224307
14471 4224307 4312855 3962852 4266686 4538779 4706656 4439136 4262420 4714303 4693375 4563151
$$ packed form
14540C631489n85200o46151J20875M45318P17236K122225r57364j952407l61104
14531B534917k04037L9251K7756m73643j3571L83166K877L4463k83586N36326
14521B583919P006k92321j02391L22075J59142l62141K57292j31490K60885j1807
14511B690169k4487L88490k59084j17229Q0788O7329J58249K65104l01327N6959
14501C004961L0756k14136L79385p3103L6139J16011p3409J8207J94233N4845
14491C473889j13845P8451k74482K58950J46074K0830J51285k12594R6023J34073
14481C758654j87902K17958m6516R5662p2378L47321o42567K39562N77705o3192
14471D224307Q8548l50003L03834K72093J67877k67520j76716M51883k0928j30224
$$ plain form
14461 4563151 4536031 4726197 4519640 4911431 5108704 5100353 5087878 5166778 5223568 5296430 5285536
14450 5285536 5178623 5376894 5250400 5584927 5487978 5456491 5796217 5850957 5695722 5948927
14440 5948927 6032812 5927117 6317448 6275978 6135749 6515256 6422321 6414624 6778333 6804732
14430 6804732 6961022 6867227 7078449 7057640 7416917 7785916 7417596 8037840 7789332 8179566
14420 8179566 8462143 8601542 8433573 8560972 8556286 8653979 8637173 8749750 8705057 9097816
14410 9097816 9036961 9271436 9266589 9759178 9679790 10000965 10508510 10313408 10215342 9962775
14400 9962775 10607147 10821397 10974427 10646529 11042788 11328555 11643819 11724688 12267035 12190431
14390 12190431 12499378 12899161 13106208 13197419 13460657 13612199 14111637 14340421 14346260 14791326
$$ packed form
14461D563151k7120J90166k06557L91791J97273q351j2475P8900N6790P2862j0894
14450E285536j06913J98271j26494L34527r6949l1487L39726N4740j55235K53205
14440E948927Q3885j05695L90331m1470j40229L79507r2935p697L63709K6399
14430F804732J56290r3795K11222k0809L59277L68999l68320O20244k48508L90234
14420H179566K82577J39399j67969J27399m686R7693j6806J12577m4693L92759
14410I097816o0855K34475m847M92589p9388L21175N07545j95102r8066k52567
14400I962775O44372K14250J53030l27898L96259K85767L15264Q0869N42347p6604
14390A2190431L08947L99783K07047R1211K63238J51542M99438K28784N839M45066
$$ plain form
14380 14791326 15021068 15709063 15565606 15825235 16105647 16171240 16218156 17400745 17227183
14371 17227183 17623161 18247015 18361757 18866678 19103666 19714555 19913125 20429989 20709932
14362 20709932 21084128 21440458 22161431 22595240 22917017 23274628 23886771 24526382 25351208
14353 25351208 25721585 26432367 27251802 27788368 28165821 29103544 29837340 30817622 31390612
14344 31390612 31960330 32693703 33898788 34824175 35969674 36844962 38229335 39037939 39679026
14335 39679026 41023267 42376674 43591790 45265063 46319275 47672839 49035846 50833439
14327 50833439 52378021 54311860 55720375 57938118 59846951 61863068 64000528 66597016
14319 66597016 69151799 71089007 73707802 76407800 79047487 82291133 85371302 89076236
$$ packed form
14380A4791326K29742O87995j43457K59629K80412O5593M6916J182589j73562
14371A7227183L95978O23854J14742N04921K36988O10889J98570N16864K79943
14362B0709932L74196L56330P20973M33809L21777L57611O12143O39611Q24826
14353B5351208L70377P10782Q19435N36566L77453R37723P33796R80282N72990
14344C1390612N69718P33373J205085R25387J145499Q75288J384373Q08604O41087
14335C9679026J344241J353407J215116J673273J054212J353564J363007J797593
14327E0833439J544582J933839J408515K217743J908833K016117K137460K596488
14319F6597016K554783J937208K618795K699998K639687L243646L080169L704934
$$ plain form
14311 89076236 92575185 96302965 100412465 104841422 108894449 113963583 119066286 124346937
14303 124346937 130021439 136029407 142365797 148979322 156044995 163399607 171142444 179926939
14295 179926939 188738301 198259773 208429453 218637256 229886102 241688453 253951814
14288 253951814 266799261 279740816 293973498 308053284 323143584 337837840 352850588
14281 352850588 368068636 382922762 397580720 411798011 424977031 436742735 447160797
14274 447160797 454063939 456471822 457846795 458507114 459807228 458778635 452867892 445750491
14266 445750491 436955521 427384894 417167204 405759715 393120577 380078335 365741819
14259 365741819 350973563 336095925 320968221 306077056 291048747 277005289 262990322
$$ packed form
14311H9076236L498949L727780M109500M428957M053027N069134N102703N280651
14303A24346937N674502O007968O336390O613525P065673P354612P742837Q784495
14295A79926939Q811362R521472J0169680J0207803J1248846J1802351J2263361
14288B53951814J2847447J2941555J4232682J4079786J5090300J4694256J5012748
14281C52850588J5218048J4854126J4657958J4217291J3179020J1765704J0418062
14274D47160797O903142K407883J374973O60319J300114j028593n910743p117401
14266D45750491q794970r570627j0217690j1407489j2639138j3042242j4336516
14259C65741819j4768256j4877638j5127704j4891165j5028309j4043458j4014967
$$ plain form
14252 262990322 249633592 236965533 224972400 213666129 202580285 192453887 184272478
14245 184272478 176373428 168152404 159612121 152234565 144938728 138358513 132121709 126637016
14237 126637016 120856893 115838825 110769238 105593018 101317159 97201089 93737299 90314118
14229 90314118 86305035 82806412 79531352 76718975 74062431 71387468 68670924 66364877
14221 66364877 63916152 62062980 59814276 58000625 55909738 54073921 52145624 51104372
14213 51104372 49729866 48153324 46502237 44853963 43654526 42553921 42008538 40569382
14205 40569382 39270927 38262546 37303625 36035149 35006064 34890545 33526147 32271841
14197 32271841 31961637 30917947 29972899 29535201 28744153 28101858 27158271 26628551 26079227
$$ packed form
14252B62990322j3356730j2668059j1993133j1306271j1085844j0126398q181409
14245A84272478p899050q221024q540283p377556p295837o580215o236804n484693
14237A26637016n780123n018068n069587n176220m275859m116070l463790l423181
14229I0314118m009083l498623l275060k812377k656544k674963k716544k306047
14221F6364877k448725j853172k248704j813651k090887j835817j928297j041252
14213E1104372j374506j576542j651087j648274j199437j100605n45383j439156
14205D0569382j298455j008381r58921j268476j029085j15519j364398j254306
14197C2271841l10204j043690r45048m37698p91048o42295r43587n29720n49324
$$ plain form
14188 26079227 25613635 24912598 24437077 23667689 23230760 22463645 22432552 21733707 21526137
14179 21526137 21117116 20594969 19595146 19445025 18897888 18735444 18168257 18210232 17716836
14170 17716836 17515883 16940151 16556801 16523400 16054317 15675834 15395545 15327022 15228132 14653218
14160 14653218 14628261 14562867 13840016 13739561 13542360 13642766 13143998 13023507 12610424 12758121
14150 12758121 12196341 12030954 11777479 11914228 11378754 11201829 11127276 10769040 11050421
14141 11050421 10638945 10410998 10007852 10247064 9934507 9993422 9910946 9693134 9576535 9289239
14131 9289239 9343856 8979597 8803390 8730579 8720790 8761138 8501176 8591205 8199144 8219480 7938326
14120 7938326 7851871 7916746 7541245 7489633 7295129 7488682 7263142 7668932 7178212 7014964
$$ packed form
14188B6079227m65592p01037m75521p69388m36929p67115l1093o98845k07570
14179B1526137m09021n22147r99823j50121n47137j62444n67187M1975m93396
14170A7716836k00953n75732l83350l3401m69083l78483k80289o8523r8890n74914
14160A4653218k4957o5394p22851j00455j97201J00406m98768j20491m13083J47697
14150A2758121n61780j65387k53475J36749n35474j76925p4553l58236K81381
14141A1050421m11476k27947m03146K39212l12557N8915q2476k17812j16599k87296
14131I289239N4617l64259j76207p2811r789M0348k59962R0029l92061K0336k81154
14120G938326q6455O4875l75501n1612j94504J93553k25540M05790m90720j63248
$$ plain form
14110 7014964 7180483 6750949 6994833 6982354 6527403 6582997 6420572 6338313 6391762 5865685
14100 5865685 6316543 6357492 6041662 5865104 5938557 6090741 5986529 5779311 5660005 5398992
14090 5398992 5636140 5665812 5272587 5326318 5338830 5119684 5463198 4739926 4894077 5061909
14080 5061909 4917398 4913558 4832247 4656060 4865104 4980950 4874466 4454799 4365307 4777967
14070 4777967 4262615 4330740 4266572 4109383 4365531 4047264 3999755 4072385 4393581 4422464
14060 4422464 4084411 4318149 3944919 4050638 4245024 4239241 3997628 3771470 4080454 3837156
14050 3837156 3753793 3411363 3612201 3533406 3586046 3451578 3596637 3373669 3564597 3226299
14040 3226299 3609070 3365021 3166672 3276647 3174156 3351839 2868882 2879387 2892442 3234176
$$ packed form
14110G014964J65519m29534K43884j2479m54951N5594j62425q2259N3449n26077
14100E865685M50858M0949l15830j76558P3453J52184j04212k07218j19306k61013
14090E398992K37148K9672l93225N3731J2512k19146L43514p23272J54151J67832
14080E061909j44511l840q1311j76187K09044J15846j06484m19667q9492M12660
14070D777967n15352O8125o4168j57189K56148l18267m7509P2630L21196K8883
14060D422464l38053K33738l73230J05719J94386n783k41613k26158L08984k43298
14050C837156q3363l42430K00838p8795N2640j34468J45059k22968J90928l38298
14040C226299L82771k44049j98349J09975j02491J77683m82957J0505J3055L41734
$$ plain form
14030 3234176 3357637 3519474 3017041 3321125 3310681 3066721 2636387 2971441 2850184 2887374
14020 2887374 2857788 2902837 2675867 2581264 2601173 2560185 2804231 2418221 2407362 2248184
14010 2248184 2429258 2396551 2443123 2349506 2251828 2117976 2238683 2063470 2491959 2308866
14000 2308866 2167703 2036548 2446740 1987739 2167982 1986964 1906478 1826599 2148527 2033795
13990 2033795 2745238 3699161 6315198 11562304 27533583 51361687 25944327 13692571
13982 13692571 8611622 6553985 5099225 4658766 3832156 3704765 3538644 3252804 2795968
13973 2795968 2903176 2522468 2695812 2575583 2905858 2414763 2289687 2401057 2244622
13964 2244622 2252520 2382419 2158250 2089455 2246044 2161753 2146611 2051410 2122994 2111898 1718533
$$ packed form
14030C234176J23461J61837n02433L04084j0444k43960m30334L35054j21257L7190
14020B887374k9586M5049k26970r4603J9909m0988K44046l86010j0859j59178
14010B248184J81074l2707M6572r3617r7678j33852J20707j75213M28489j83093
14000B308866j41163j31155M10192m59001J80243j81018q0486p9879L21928j14732
13990B033795P11443R53923K616037N247106J5971279K3828104k5417360j2251756
13982A3692571n080949k057637j454760m40459q26610j27391j66121k85840m56836
13973B795968J07208l80708J73344j20229L30275m91095j25076J11370j56435
13964B244622P898J29899k24169o8795J56589q4291j5142r5201P1584j1096l93365
$$ plain form
13953 1718533 1828575 2096642 1744430 2050047 2059094 2005544 1774789 1898058 1880363 1707110
13943 1707110 1721526 1853246 1818918 1675561 1812321 1709147 1731630 1593967 1912348 1773368
13933 1773368 1921405 1682041 1770062 1683766 1694794 1847233 1743751 1425490 1574558 1848725
13923 1848725 1695879 1662061 1694758 1536262 1688043 1498032 1425274 1324965 1494618 1331591
13913 1331591 1385216 1704252 1649279 1530946 1700785 1628873 1485727 1174665 1263818 1519079
13903 1519079 1614201 1455683 1397442 1492447 1464420 1433308 1317561 1455948 1360924 1297645 1387310
13892 1387310 1397298 1108545 1360022 1309557 1329629 1211034 1413922 1265388 1184626 1142262
13882 1142262 1176327 1164112 1265542 1174600 1147722 1034939 1222788 1137236 1043925 1228396
$$ packed form
13953A718533J10042K68067l52212L05617R047n3550k30755J23269j7695j73253
13943A707110J4416J31720l4328j43357J36760j03174K2483j37663L18381j38980
13933A773368J48037k39364Q8021q6296J1028J52439j03482l18261J49068K74167
13923A848725j52846l3818L2697j58496J51781j90011p2758j00309J69653j63027
13913A331591N3625L19036n4973j18333J69839p1912j43146l11062Q9153K55261
13903A519079R5122j58518n8241R5005k8027l1112j15747J38387r5024o3279Q9665
13892A387310R988k88753K51477n0465K0072j18595K02888j48534q0762m2364
13882A142262L4065j2215J01430r0942k6878j12783J87849q5552r3311J84471
$$ plain form
13872 1228396 1011430 1462411 1254775 1019394 1184025 1161867 1158485 1400870 1387260 913248
13862 913248 1491866 1089121 1255382 1205289 952386 1209266 1154012 1216661 806980 1018358
13852 1018358 1020269 1174555 1021051 938126 884237 1029372 926345 1148594 834264 1236994
13842 1236994 1162882 998050 997952 1197075 978246 758437 962999 787221 1063490 757580
13832 757580 1056032 848993 938271 1043978 859431 928688 1096099 920027 878194 875332
13822 875332 899668 810293 1032176 1115079 970369 487202 1070813 962772 683730 979189
13812 979189 649031 745322 978807 1032200 971172 942177 1218280 860683 1069451 979427
13802 979427 670111 1040467 865894 952413 691167 705270 1205108 951817 918626 633701
$$ packed form
13872A228396k16966M50981k07636k35381J64631k2158l382K42385j3610m74012
13862I13248N78618m02745J66261n0093k52903K56880n5254O2649m09681K11378
13852A018358J911J54286j53504q2925n3889J45135j03027K22249l14330M02730
13842A236994p4112j64832r8J99123k18829k19809K04562j75778K76269l05910
13832G57580K98452k07039Q9278J05707j84547O9257J67411j76072m1833k862
13822H75332K4336q9375K21883Q2903j44710m83167N83611j08041k79042K95459
13812I79189l30158R6291K33485N3393o1028k8995K76103l57597K08768r0024
13802I79427l09316L70356j74573Q6519k61246J4103M99838k53291l3191k84925
$$ plain form
13792 633701 1121510 511197 583373 465263 656044 512188 720615 774932 666840 580349
13782 580349 1114276 355847 770305 743093 550022 602449 891126 711843 527278 574052
13772 574052 728594 500547 660811 735314 526492 559433 805882 378990 611401 1074029
13762 1074029 822360 807032 421968 880942 535477 764961 515960 410115 753740 519911
13752 519911 601602 777755 899314 654246 573464 894610 553575 819608 786652 837346
13742 837346 725000 1002559 736664 222280 434556 624866 465723 552741 702162 447203
13732 447203 696382 252133 625336 507368 530973 869825 656417 669243 594322 584865
13722 584865 761766 649160 500956 391042 544224 771993 418436 406575 173788 514804
$$ packed form
13792F33701M87809E11197P2176j18110J90781j43856K08427N4317j08092q6491
13782E80349N33927C55847M14458k7212j93071N2427K88677j79283j84565M6774
13772E74052J54542k28047J60264P4503k08822L2941K46449C78990K32411M62628
13762A074029k51669j5328l85064M58974l45465K29484k49001j05845L43625k33829
13752E19911Q1691J76153J21559k45068q0782L21146l41035K66033l2956N0694
13742H37346j12346K77559k65895B22280K12276J90310j59143Q7018J49421k54959
13732D47203K49179B52133L73203j17968K3605L38852k13408J2826p4921r457
13722E84865J76901j12606j48204j09914J53182K27769l53557j1861A73788L41016
$$ plain form
13712 514804 543655 558186 339881 656195 634959 360484 633134 624138 523526 543286 496428
13701 496428 751733 447291 516813 241653 405303 325366 657332 460123 299397 481190
13691 481190 563216 481771 512984 327773 503673 359224 417064 568677 360509 608832
13681 608832 485448 460020 383668 395569 607477 662063 432023 441106 360867 759006 606408
13670 606408 460246 267526 337051 238776 453791 331899 308816 441350 704512 623603
13660 623603 427443 298293 520217 642805 448547 496111 498249 285914 625068 410721
13650 410721 245177 231531 308778 250025 143176 639778 142657 790799 372879 366220
13640 366220 224591 385980 699903 737770 315028 529286 740783 343801 269929 259310
$$ packed form
13712E14804K8851J4531k18305L16314k1236k74475K72650q996j00612J9760m6858
13701D96428K55305l04442O9522B41653J63650p9937L31966j97209j60726J81793
13691D81190Q2026q1445L1213j85211J75900j44449N7840J51613k08168K48323
13681F08832j23384k5428p6352J1901K11908N4586k30040R083q0239L98139j52598
13670F06408j46162j92720O9525r8275K15015j21892k3083J32534K63162q0909
13660F23603j96160j29150K21924J22588j94258M7564K138k12335L39154k14347
13650D10721j65544j3646P7247n8753j06849M96602A42657O48142C72879o659
13640C66220j41629J61389L13923L7867C15028K14258K11497C43801p3872j0619
$$ plain form
13630 259310 546341 403482 154630 770155 274594 532583 453324 388536 367206 83754
13619 632700 265887 493620 583214 383237 345879 317178 656095 81891 457913 440502
13609 440502 240618 153501 412199 287513 452760 197349 315291 755375 577798 585920
13599 585920 192852 13807 366187 283006 219630 762551 414044 754271 248107 207548
13589 207548 458436 336399 182673 67474 294376 743786 500491 222381 589448 413607
13579 413607 363547 315052 276836 405571 452570 613207 486199 291792 473047 108994
13568 330001 570957 528448 382556 277382 61647 275552 241436 145957 182243 377975
13558 377975 215332 228486 764427 124096 474993 612884 250843 105152 577836 284302
$$ packed form
13630B59310K87031j42859A54630O15525B74594K57989p9259o4788k1330H3754
13619F32700B65887K27733Q9594j99977l7358k8701L38917H1891L76022j7411
13609D40502j99884q7117K58698j24686J65247A97349J17942M40084j77577Q122
13599E85920A92852A3807L52380q3181o3376N42921l48507L40227B48107m0559
13589B07548K50888j22037j53726F7474K26902M49410k43295B22381L67067j75841
13579D13607n0060m8495l8216J28735M6999J60637j27008j94407J81255A08994
13568C30001K40956m2509j45892j05174F1647K13905l4116r5479L6286J95732
13558C77975j62643J3154N35941A24096L50897J37891B50843A05152M72684B84302
$$ plain form
13547 373264 280967 198891 128850 518000 411703 312912 389496 357418 477128 298287 65377
13535 -125177 27387 231773 389208 153023 462354 280321 420046 716767 299813 396210
13525 396210 119431 277210 96631 390723 37628 23258 141575 251826 528529 253064
13514 387957 261030 455699 171084 103679 417160 623277 16203 336514 241947 174678
13504 174678 466899 93887 145624 383155 251936 242159 -66295 374319 184532 167233 -69128
13492 217746 351805 115115 439151 120682 372279 195474 447249 455458 259431 154460
13482 154460 167482 113305 582997 94700 103679 951851 269029 221569 406558 299309 178432
13471 178432 -157803 362592 -48689 325448 -194360 219424 237359 206989 212062 76516 661878
$$ packed form
13547C73264r2297q2076p0041L89150j06297r8791P6584l2078J19710j78841F5377
13535a25177B7387K04386J57435A53023L09331j82033J39725K96721B99813R6397
13525C96210A19431J57779I6631K94092C7628j4370J18317J10251K76703B53064
13514C87957j26927J94669A71084o7405L13481K06117A6203L20311r4567o7269
13504A74678K92221I3887N1737K37531j31219r777f6295C74319A84532j7299f9128
13492B17746J34059A15115L24036A20682K51597j76805K51775Q209j96027j04971
13482A54460J3022n4177M69692I4700Q979Q48172B69029m7460J84989j07249j20877
13471A78432a57803C62592d8689C25448a94360B19424J7935l0370N073G6516N85362
$$ plain form
13460 661878 353356 26825 357005 32611 129164 22493 7407 87941 123451 417144 49666
13448 170530 312775 -68938 402806 34776 314181 193558 382701 281147 -44981 339417
13437 188071 329294 52303 250713 -22182 357687 248944 93803 12050 -24307 -66579 56307
13425 241150 148586 87355 469827 261041 171699 -43278 181364 178206 245643 -12317 275744
13413 313378 329345 94738 479437 212111 331248 165938 551670 -151607 238340 11126
13402 328906 -6779 129928 215332 16803 38644 6752 344881 217106 -153487 391922 -16994
13390 192032 -126602 42600 83918 333609 300459 338059 190256 33454 228658 146081 117336
13379 117336 43086 -17363 34335 262853 392558 163037 392871 154126 219293 123592
$$ packed form
13460F61878l08522B6825L30180C2611R6553B2493G407Q0534L5510K93693D9666
13448A70530J42245f8938D02806C4776K79405j20623J89143j01554d4981C39417
13437A88071J41223E2303J98410b2182C57687j08743I3803A2050b4307m2272E6307
13425B41150r2564o1231L82472k08786q9342d3278A81364l158O7437a2317B75744
13413C13378J5967I4738L84699B12111J19137j65310L85732a51607B38340A1126
13402C28906f779A29928Q5404A6803K1841F752L38129j27775a53487C91922a6994
13390A92032a26602D2600M1318K49691l3150L7600j47803C3454J95204q2577k8745
13379A17336D3086a7363C4335K28518J29705A63037K29834A54126O5167r5701
$$ plain form
13369 123592 221184 370595 211307 241198 44846 372111 58741 -104679 -12327 191194
13358 48537 234656 314349 23282 -5630 122590 376925 170458 308506 29147 326112 304584
13347 304584 97466 354054 676067 224517 362349 191211 562643 353273 -79337 199135
13336 177469 432342 198340 58629 428079 484240 118132 271715 439363 64175 36833
13326 36833 44722 51164 268755 21804 426455 386227 337113 206886 387040 22226 112113
13315 112113 111984 215848 308856 212218 531479 94196 52115 47423 74552 51256 197499
13304 197499 217609 432549 257529 352897 323852 430609 437427 73519 -222896 132806 55742
13292 161760 321508 151686 454270 193474 -105892 167914 -135632 65498 282810 435586
$$ packed form
13369A23592R7592J49411j59288K9891D4846L27265E8741a04679a2327A91194
13358D8537J86119P9693B3282e630A22590K54335A70458J38048B9147K96965k1528
13347C04584I7466K56588L22013B24517J37832j71138L71432k09370g9337A99135
13336A77469K54873A98340E8629L69450N6161A18132J53583J67648F4175k7342
13326C6833P889O442K17591B1804M04651m0228m9114j30227J80154B2226Q9887
13315A12113j29J03864R3008r6638L19261I4196m2081m692K7129k3296J46243
13304A97499K0110K14940j75020R5368k9045J06757O818G3519b22896A32806E5742
13292A61760J59748A51686L02584A93474a05892A67914a35632F5498K17312J52776
$$ plain form
13282 435586 234434 -71925 310345 194704 233976 169806 65877 443896 256480 -65160
13271 139459 152517 84801 416906 320487 239073 19716 -273070 62098 109327 -76194 421901
13259 90865 254734 -38350 116240 305363 247833 13880 149350 319679 -33812 135221
13248 255473 129242 14573 104649 6622 204092 67747 133645 46370 93672 210094 70537
13236 28432 131817 146886 316502 38493 250974 115296 125386 451109 21571 133106
13226 133106 -86657 202016 -67194 11256 168277 -25414 1394 100743 -223410 254748 273155
13215 273155 -206637 248662 357595 240818 330125 -111 -104426 81268 484216 424077 11780
13203 68387 338819 37351 70564 -127057 36382 -42409 359862 -15296 48976 141638 131435
$$ packed form
13282D35586k01152g1925C10345j15641L9272o4170F5877L78019j87416f5160
13271A39459J3058o7716L32105r6419q1414A9716b73070F2098M7229g6194D21901
13259I0865J63869c8350A16240J89123n7530A3880J35470J70329c3812A35221
13248B55473j26231A4573R0076F622J97470F7747O5898D6370M7302J16422G0537
13236B8432J03385J5069J69616C8493K12481A15296J0090L25723B1571J11535
13226A33106h6657B02016f7194A1256J57021b5414A394R9349b23410B54748J8407
13215B73155b06637B48662J08933j16777Q9307a11j04315H1268M02948o0139A1780
13203F8387K70432C7351L3213a27057C6382d2409C59862a5296D8976R2662j0203
$$ plain form
13192 131435 93374 -188728 85015 -142555 75744 202099 98752 327468 -78487 -163117 197389
13180 24690 -94151 322873 158164 -29982 254007 -141070 -153095 280586 98378 339534
13170 339534 -198481 177380 293363 53996 311896 -33639 -108639 69766 34715 360571
13160 360571 187967 -129225 243248 439646 169534 88274 78976 144065 170590 85023 -257605
13148 398088 -134134 110451 -56132 -495809 86183 290086 -214116 5327 127827 -9866 191679
13136 -458419 230792 63499 -159810 -93085 -315074 331548 -19592 212658 5548 -16380 -112643
13125 -112643 98694 81089 -162157 -78458 -195368 263249 -113412 208450 182165 360474
13115 360474 40724 214007 197293 31252 -72675 -284002 4417 -9199 -239185 -143528 -105425
$$ packed form
13192A31435l8061a88728H5015a42555G5744J26355I8752K28716g8487q4630A97389
13180B4690i4151C22873A58164b9982B54007a41070j2025B80586I8378K41156
13170C39534a98481A77380J15983E3996K57900c3639p5000F9766C4715L25856
13160C60571j72604a29225B43248J96398A69534q1260r298O5089K6525H5023b57605
13148C98088a34134A10451e6132m39677H6183K03903b14116E327J22500i866A91679
13136d58419B30792F3499a59810O6725k21989C31548a9592B12658E548a6380r6263
13125a12643I8694j7605a62157g8458j16910B63249a13412B08450k6285J78309
13115C60474D0724J73283j6714C1252g2675k11327D417i199k29986R5657L8103
$$ plain form
13104 -105425 -225030 33081 88081 55820 311499 371718 119124 6886 225687 96858 -69565
13092 90698 72576 -39 436775 249042 54443 307804 -244796 -143536 94886 -163047 446796
13080 -41436 56181 240679 -42880 59179 99929 -16197 63143 -132647 -126598 288247 -89358
13068 -195868 57445 340611 -243724 -359952 441646 131744 266709 35905 129496 32384
13057 -35475 88826 -47332 323763 386179 7917 159768 219257 -81026 140274 193206 -58390
13045 230128 98673 173792 164362 -150462 383322 -185308 -86814 91205 203353 -42455 -453646
13034 -453646 -11574 245244 116059 48557 109715 -76013 -50382 35422 73747 195898 -71843
13022 -94513 276135 64652 77285 84027 18759 192622 361708 -94136 13969 84362 255689
$$ packed form
13104a05425j19605C3081N5000l2261K55679O0219A19124F886K18801I6858f9565
13092I0698j8122c9D36775j87733E4443K53361b44796J01260I4886a63047D46796
13080d1436E6181J84498d2880E9179M0750a6197F3143a32647O049B88247h9358
13068a95868E7445K83166b43724j16228D41646A31744J34965C5905R3591C2384
13057c5475H8826d7332C23763O2416G917J51851N9489h1026A40274N2932e8390
13045B30128I8673P5119r430a50462C83322a85308h6814I1205J12148d2455m11191
13034d53646a1574B45244A16059D8557O1158g6013K5631C5422L8325J22151g1843
13022i4513B76135F4652J2633O742A8759J73863J69086i4136A3969P0393J71327
$$ plain form
13011 255689 23229 49040 -106993 192204 266008 213331 61342 107204 73468 -146742 45798
12999 261211 -200733 -340347 6869 87936 203199 194415 -283498 240045 -188300 -100505 -49881
12987 208649 303595 378869 -215320 -161176 185675 -7033 -138289 40723 364834 24412 -76960
12975 51737 -78777 -9721 -42438 -68570 177045 -50740 -38279 -186254 -84879 -304372 220771
12963 -78783 -185729 -7880 -1883 -12387 -37140 340675 -177570 191680 -69198 -266291 -33987
12951 -94224 132754 -179441 1927 137749 -114196 452484 191335 9223 -171804 -305370
12941 -305370 200966 14099 -189477 672 -40461 266983 -104199 149026 -25933 -86861 -27512
12929 -113434 -72753 -351802 -111720 246987 -125612 210554 116796 303177 402816 171236
$$ packed form
13011B55689B3229K5811a06993A92204P3804n2677F1342M5862l3736a46742D5798
12999B61211b00733j39614F869Q1067J15263q784b83498B40045a88300Q7795d9881
12987B08649R4946P5274b15320N4144A85675g033j31256D0723L24111B4412g6960
12975E1737g8777i721l2717k6132A77045e0740J2461j47975h4879k19493B20771
12963g8783j06946g880a883j0504k4753C40675a77570A91680f9198j97093c3987
12951i4224A32754a79441A927J35822a14196D52484A91335I223a71804j33566
12941c05370B00966A4099a89477F72d0461B66983a04199A49026b5933o0928b7512
12929a13434M0681k79049a11720B46987a25612B10554r3758J86381R9639A71236
$$ plain form
12918 67462 -14156 -38367 150198 66696 144079 52534 -32942 46355 7576 -132226 166326
12906 -213496 -111724 102922 98317 168549 -57130 218119 -91508 261827 -257412 -54853 -194261
12895 -194261 -32451 -70176 22576 -87567 193206 -41529 327689 223928 -237497 -241380 345028
12883 110104 -34658 -133168 -17914 174133 81645 -273068 -229082 132966 163620 272876 -76655
12871 -345930 -78858 -86533 84045 94806 102192 153569 155320 -153304 1591 91613 -353169 -118154
12858 -182706 -87757 197737 -425223 -140106 20659 91212 192488 65914 26640 -241817
12847 -75201 222747 108735 195348 40043 173312 323677 118667 567803 -109459 82310
12836 321550 -52402 175520 -17523 111190 184993 356715 176266 -223166 40429 -12489
$$ packed form
12918F7462a4156k4211A50198F6696P7383E2534c2942D6355G576a32226A66326
12906b13496J01772A02922m605P0232e7130B18119i1508B61827b57412e4853j39408
12895a94261c2451l7725B2576h7567A93206d1529C27689j03761b37497l883C45028
12883A10104c4658r8510a7914A74133H1645b73068M3986A32966L0654J09256g6655
12871c45930g8858p675H4045J0761P386N1377J751a53304A591R0022c53169a18154
12858a82706h7757A97737d25223a40106B0659P0553J01276F5914B6640b41817
12847g5201B22747A08735Q6613D0043J33269J50365A18667M49136a09459H2310
12836C21550e2402A75520a7523A11190P3803J71722A76266b23166D0429a2489
$$ plain form
12825 209410 -277909 64934 -95237 65552 -303241 27309 67152 -405045 104519 87307 -93567
12813 50667 -158714 -16437 48338 258735 122145 -147616 165623 -41739 -52 -260560 287204
12801 322701 135431 -100723 -59533 198680 241812 52558 -127602 -199539 99589 225359
12791 225359 147774 -200305 5136 -124728 -165765 -75665 95801 46941 -52478 -110284 -308091
12780 -308091 21323 135373 10077 -214985 -57909 102317 -122086 3665 205761 -40302 233049
12768 -8573 63137 -159970 -63706 -32615 82912 -120407 19805 -86189 -228585 109598 -174285
12756 148077 51103 36312 172562 -86084 -127453 -309078 10565 -163864 289983 45603 -102350
12744 212552 -2968 -59026 106030 -84025 288939 235686 -81639 1130 33990 69054 -97104
$$ packed form
12825B09410b77909F4934i5237F5552c03241B7309L9843d05045A04519j7212i3567
12813E0667a58714a6437D8338K10397A22145a47616A65623d1739e2k60508B87204
12801C22701A35431a00723M1190A98680M3132E2558a27602p1937I9589J25770
12791B25359p7585b00305E136a24728m1037g5665I5801D6941e2478n7806j97807
12780c08091B1323J14050A0077b14985e7909A02317a22086C665K02096d0302B33049
12768h573F3137a59970f3706L1091H2912a20407A9805h6189j42396A09598a74285
12756A48077E1103j4791J36250h6084m1369j81625A0565a63864B89983D5603a02350
12744B12552b968n6058A06030h4025B88939n3253h1639A130L2860L5064i7104
$$ plain form
12732 361826 349120 -73321 -144860 -184421 -275156 95810 -128536 9681 4144 243640 -121391
12720 61714 -43504 -133294 -106770 -355521 -233811 -118656 -149112 232029 130815 251156
12710 251156 191256 179527 368634 291947 435745 314943 57858 101327 59818 482212 -108840
12698 46574 4693 -102329 9062 123031 281930 136754 -163637 -300906 4308 -23909 -159352
12687 -159352 -94373 5333 -40151 -217693 141460 -112159 -50874 96809 151148 -80298 -103894
12676 -103894 16457 -84062 -14958 112869 156126 228062 35832 33639 162581 -5413 145387
12664 -83637 -128107 163661 -76606 -200762 126840 -87434 303772 50243 -18621 -32441 317975
12652 303956 67390 112485 60096 160857 126424 150587 -149405 -193446 182434 -44668 -66688
$$ packed form
12732C61826j2706g3321p1539l9561r0735I5810a28536I681D144K39496a21391
12720F1714d3504q9790K6524k48751J21710J15155l0456B32029j01214J20341
12710B51156n9900j1729J89107p6687J43798j20802E7858M3469m1509M22394a08840
12698D6574D693a02329I062J13969J58899A36754a63637j37269D308b3909j35443
12687a59352O4979E333d0151j77542A41460a12159e0874I6809N4339h0298k3596
12676a03894A6457h4062a4958A12869M3257P1936C5832k193J28942e413A45387
12664h3637m4470A63661g6606j24156A26840h7434C03772E0243a8621j3820C17975
12652C03956F7390M5095n2389J00761l4433K4163a49405m4041A82434d4668k2020
$$ plain form
12641 -66688 -72577 -126434 19558 -188890 -111148 -68099 46772 -28593 -42512 149661 -89121
12629 -29639 293671 178890 142407 7889 -54724 199260 34441 142987 -152907 257062 35753
12617 264589 98405 -50858 142790 180647 165481 123636 -111130 99254 31098 -185272 25381
12605 -141653 190435 -134555 72090 305379 -148966 94235 -119428 168708 279631 79141
12594 230859 51284 2936 -108851 34199 193090 48772 -73133 26580 54064 -265066 228052
12582 60209 -101764 168429 25330 84868 -94966 -76002 252750 212606 88712 -139576 126235
12570 53182 -276045 76866 -108255 -380777 -48439 27164 -11903 7847 -31149 -34105 256980
12558 54491 7998 -51655 -268349 17304 -40199 120416 235549 -5541 -122450 -81413 246217
$$ packed form
12641f6688n889n3857A9558a88890P7742M3049D6772b8593j3919A49661h9121
12629b9639B93671j14781l6483G889e4724A99260C4441J08546a52907B57062C5753
12617B64589I8405e0858A42790L7857j5166m1845a11130I9254C1098a85272B5381
12605a41653A90435a34555G2090K33289a48966I4235a19428A68708J10923G9141
12594B30859E1284B936a08851C4199J58891D8772g3133B6580K7484b65066B28052
12582F0209a01764A68429B5330N9538i4966J8964B52750m0144H8712a39576A26235
12570E3182b76045G6866a08255k72522d8439B7164a1903G847c1149k956B56980
12558E4491G998e1655k16694A7304d0199A20416J15133e541j16909M1037B46217
$$ plain form
12546 163251 432575 -263040 -26451 -28360 149523 173962 -35734 187678 -282749 160225
12535 -8534 27019 32892 52849 -124506 139708 86771 28196 200928 -207868 -82015 86361
12523 15557 -235025 25422 -4245 -43667 -145977 -19195 -237847 31847 -211118 271143 34835
12511 179210 -221184 159046 174606 200621 81572 -61001 -82178 -164055 -93545 181759 58540
12499 -46355 38850 2033 -342538 -102007 271713 159176 58 -337703 126616 111124 51430
12487 -323531 44750 -37007 -188353 232581 -94687 -316255 -125216 17581 -109586 -438887
12477 -438887 -82830 -205381 -416964 -125909 75668 -266663 140589 52098 -85112 357498
12466 -54569 -195248 -1204 29254 -134927 43366 -246699 -48432 142357 137868 -79184 -78931 90154
$$ packed form
12546A63251K69324b63040b6451j909A49523K4439c5734A87678b82749A60225
12535h534B7019N873J9957a24506A39708n2937B8196J72732b07868h2015H6361
12523A5557b35025B5422d245l9422j02310a9195k18652C1847b11118B71143C4835
12511A79210b21184A59046J5560K6015H1572f1001k1177q1877P0510A81759E8540
12499d6355C8850B033c42538a02007B71713j12537E8c37703A26616j5492E1430
12487c23531D4750c7007j51346B32581i4687k21568a25216A7581a09586l29301
12477d38887h2830j22551k11583a25909G5668b66663A40589E2098h5112C57498
12466e4569j40679a204B9254a34927D3366b46699d8432A42357m489g9184K53I0154
$$ plain form
12453 76307 -62534 164191 74936 -219088 15911 47257 117830 -127863 -114418 -375976 -308229
12442 -308229 -216529 102982 -168755 60537 180759 -218595 -31568 -111794 -143753 -2924 -99040
12431 -99040 -82617 -158073 226862 -55927 -191305 36823 -176362 88796 -40196 -35610 44465
12419 -148988 90036 -94472 -72482 22896 -352168 -55041 -99205 186703 227486 -229095 18802
12407 139034 -241038 -119572 -524 71072 33825 -66828 206984 -582902 25519 46351 302525
12396 302525 142241 -242009 204577 28333 64470 71559 239848 -92811 -13481 -35907 385609
12384 45582 143673 -34747 151477 464095 -245160 355781 -33999 292097 -168132 218652
12373 82077 318281 99763 112620 138245 306794 -218632 14436 249479 136379 23985 179119
$$ packed form
12453G6307f2534A64191G4936b19088A5911L1346P0573a27863J3445k61558O7747
12442c08229R1700A02982a68755F0537J20222b18595c1568q0226l1959b924r6116
12431i9040J6423p5456B26862e5927j35378C6823a76362H8796d0196M586D4465
12419a48988I0036i4472K1990B2896c52168e5041m4164A86703M0783b29095A8802
12407A39034b41038a19572e24G1072C3825f6828B06984e82902B5519K0832K56174
12396C02525A42241b42009B04577B8333L6137P089J68289i2811a3481k2426C85609
12384D5582R8091c4747A51477L12618b45160C55781c3999B92097a68132B18652
12373H2077K36204I9763J2857K5625J68549b18632A4436K35043j13100B3985J55134
$$ plain form
12362 179119 120475 29681 188450 93088 -387274 208700 -81136 159037 -244514 -191197
12352 -191197 80528 79176 104227 131376 -58365 -31155 76571 226652 -208166 15439 -277610
12340 237221 64810 -1455 214921 -59688 132726 51173 -85761 284801 -103547 127703 61982
12328 61380 -114999 385118 348047 223482 331070 128051 401350 -123595 167361 310458
12318 310458 232875 123372 129418 133769 157791 197849 -146591 242335 180331 -85862 -110176
12307 -110176 55786 11778 -119525 191185 -80194 101348 88949 -18997 79017 141207 145973
12296 145973 -103852 126427 77618 -78195 -206182 36743 170875 98377 34273 -25521 18277
12284 -236560 115604 -105118 -142001 16494 -32769 -65779 371003 -54687 465020 234339
$$ packed form
12362A79119n8644B9681J58769I3088c87274B08700h1136A59037b44514N3317
12352a91197H0528j352K5051K7149e8365K7210G6571J50081b08166A5439b77610
12340B37221F4810a455B14921e9688A32726E1173h5761B84801a03547A27703F1982
12328F1380a14999C85118l7071j24565J07588A28051K73299a23595A67361J43097
12318C10458p7583j09503O046M351K4022M0058a46591B42335o2004h5862k4314
12307a10176E5786A1778a19525A91185h0194A01348j2399a8997G9017O2190M766
12296A45973a03852A26427m8809g8195j27987C6743J34132p2498C4273b5521A8277
12284b36560A15604a05118l6883A6494c2769l3010C71003e4687D65020k30681
$$ plain form
12274 234339 119889 57678 270902 265395 -6781 -208910 59242 -60330 14304 316897 200331
12263 200331 354287 251241 559068 -108345 124007 305735 -111772 236822 -4880 63304
12252 -20429 193194 284168 236793 364946 -8060 106707 207558 246559 -101218 506749 234278
12240 197619 28892 4450 -245647 -57568 -314300 -40145 238675 -80167 187671 -172214 57138
12228 80640 97695 -83030 430092 271917 -38623 47009 16197 -250690 84385 410768 159017
12216 195768 -246897 314808 311223 204140 97870 133046 440523 150878 128635 245434
12206 245434 301754 256624 -116629 159831 -24733 -207003 -35202 -249397 181931 172712 -48767
12194 284606 610459 260960 303796 356008 337946 64220 94978 408906 239964 72457 376507
$$ packed form
12274B34339j14450E7678K13224n507f781k02129E9242f0330A4304L02593j16566
12263B00331J53956j03046L07827a08345A24007J81728a11772B36822d880F3304
12252b0429A93194R0974m7375J28153h060A06707J00851L9001a01218E06749B34278
12240A97619B8892D450b45647e7568k56732d0145B38675h0167A87671a72214E7138
12228H0640J7055h3030D30092j58175c8623D7009A6197b50690H4385L26383A59017
12216A95768b46897C14808l585j07083I7870L5176L07477A50878k2243J16799
12206B45434N6320m5130a16629A59831b4733j82270c5202k14195A81931r219d8767
12194B84606L25853B60960M2836N2212j8062F4220L0758L13928j68942G2457L04050
$$ plain form
12183 376507 209906 147990 195950 239964 430541 400100 153665 281827 294351 30648 -136480
12171 87276 278848 -20718 -154108 -28569 248483 345056 366916 687089 164495 31000 11540
12159 265132 221663 526150 151824 8168 248858 170694 114660 28471 -30545 131913 56038
12147 14661 -323117 158303 505628 185975 193385 156615 232105 -245603 -24312 -98032 133626
12135 189433 199316 423740 -408034 -58810 -152759 138367 213374 25516 586476 86600 234992
12124 234992 478601 233840 170348 351827 230222 403798 106928 -46071 218775 281176
12114 281176 -177078 23419 -48365 233417 -252714 257225 48139 147515 169757 74369 25282
12102 43711 36419 215001 -134575 -232786 171947 -39793 205009 -296259 -13563 -162278 -131829
$$ packed form
12183C76507j66601o1916M7960M4014J90577l0441A53665J28162J2524C0648a36480
12171H7276J91572b0718j33390b8569B48483R6573K1860L20173A64495C1000A1540
12159B65132m3469L04487A51824H168K40690p8164n6034B8471c0545A31913E6038
12147A4661c23117A58303L47325A85975P410l6770P5490b45603b4312p3720A33626
12135A89433R883K24424d08034e8810r3949A38367P5007B5516N60960H6600J48392
12124B34992K43609B33840o3492J81479j21605J73576A06928d6071B18775O2401
12114B81176a77078B3419d8365B33417b52714B57225D8139R9376K2242G4369B5282
12102D3711p292J78582a34575r8211A71947c9793B05009b96259a3563j48715L0449
$$ plain form
12091 -131829 160486 166880 177111 275573 -100609 168153 -9596 328751 43819 241479 201087
12080 201087 54721 -308790 8426 -97932 83971 161441 420541 176525 94904 109755 -129038
12068 249022 244981 242800 231570 -276787 -174718 -143780 14195 -180724 269707 -127640 -193557
12057 -193557 22708 261243 -268178 179819 -53240 180863 -43054 -263097 16683 420913
12047 420913 166018 -416285 -114782 174785 -145170 -17625 -379121 -202069 470340 177621
12036 -150229 -41060 -97598 -36735 -48488 -67237 41278 165047 392496 41369 122116 -25354
12024 245934 73832 173701 -97345 14236 31956 67135 356067 144364 59575 -389352 218205
12012 152483 23725 27907 84620 96104 368648 -195321 537 347464 -151611 188438 184239
$$ packed form
12091a31829A60486O394J0231R8462a00609A68153i596C28751D3819J97660m0392
12080B01087E4721c08790H426i7932H3971P7470K59100A76525q1621J4851a29038
12068B49022m041k181j1230b76787J02069L0938A4195a80724B69707a27640o5917
12057a93557B2708K38535b68178A79819e3240A80863d3054k20043A6683M04230
12047D20913A66018d16285a14782A74785a45170a7625l61496J77052D70340A77621
12036a50229d1060n6538c6735j1753j8749D1278J23769K27449D1369Q0747b5354
12024B45934G3832R9869i7345A4236J7720L5179K88932A44364E9575c89352B18205
12012A52483B3725M182N6713J1484K72544a95321E37L46927a51611A88438m199
$$ plain form
12001 184239 -82236 -172156 145994 -33282 237042 155578 24346 71599 172105 101953 69352
11990 69352 149511 -100335 -207606 459605 -219540 123085 141383 -121100 77819 -137812
11979 2411 -25717 -15074 -165870 -13610 -36991 -151976 202236 -33976 -223393 162835 49810
11967 -208631 195376 -145922 23695 -121221 -77340 -125568 -47848 -30008 -65490 -143826 323307
11955 -149438 -256924 93014 -121125 -105092 -279874 94282 145549 -267256 -9 11340 231782
11944 231782 -82565 -181295 -133163 16686 -99446 -172892 -430360 107123 45311 -140466 47643
11932 -58262 -259354 140873 -49697 281228 101752 164894 269465 122841 -126006 65982
11921 255346 -122216 108527 -123588 -131529 286091 -86968 91596 -257205 76860 187111
$$ packed form
12001A84239h2236q9920A45994c3282B37042q1464B4346M7253J00506p0152l2601
11990F9352Q0159a00335j07271D59605b19540A23085J8298a21100G7819a37812
11979B411b5717J0643j50796a3610k3381j14985B02236c3976j89417A62835D9810
11967b08631A95376a45922B3695a21221M3881m8228d7848J7840l5482p8336C23307
11955a49438j07486I3014a21125J6033j74782I4282N1267b67256iA1340K20442
11944B31782h2565r8730M8132A6686i9446p3446k57468A07123D5311a40466D7643
11932e8262k01092A40873d9697B81228A01752O3142J04571A22841a26006F5982
11921B55346a22216A08527a23588p941B86091h6968I1596b57205G6860J10251
$$ plain form
11911 187111 110477 150161 129543 131876 -223848 -226370 19030 8378 -27518 17378 264970 -244857
11898 9056 79929 -43164 -41929 180557 52290 -132909 86764 162441 333518 67955 -57797
11886 -171111 87154 -40312 61356 -21953 -264337 -78043 -303091 -107194 44622 169054 -214953
11874 -247527 -93560 -51316 -258 67578 -41690 -37976 -100583 70407 -155640 48595 -202678 -163656
11862 -163656 -38964 -289124 121955 -32877 -284840 310253 -212622 -397561 186485 376
11851 222139 -42980 -340323 320937 248544 43553 -319937 -153370 84488 -103043 214292
11840 -132041 -13187 229928 -3585 -246768 51384 -23834 -28079 -41038 -4489 200270 -186290
11828 64725 -28499 258677 -213806 -125663 -308205 -22134 138988 -192742 46286 164760
$$ packed form
11911A87111p6634L9684k0618K333b23848k522A9030H378b7518A7378K47592b44857
11898I056P0873d3164J235A80557E2290a32909H6764P5677J71077F7955e7797
11886a71111H7154d0312F1356b1953k42384g8043k25048a07194D4622J24432b14953
11874b47527i3560M2244b58F7578d1690L714o2607G0407a55640D8595b02678L9022
11862a63656c8964k50160A21955c2877k51963C10253b12622j84939A86485C76
11851B22139d2980k97343C20937p2393D3553c19937a53370H4488a03043B14292
11840a32041a3187B29928c585k43183E1384b3834m245j2959d489B00270a86290
11828F4725b8499B58677b13806Q8143j82542b2134A38988a92742D6286J18474
$$ plain form
11818 164760 158073 40692 -91590 43779 180090 -291980 -276500 -366092 146830 -28872 32287
11806 -1510 -372879 -111151 -37819 -256046 -144314 -185286 -239414 -172308 150400 -39148 -28538
11795 -28538 20409 283179 -227104 -147445 -23902 -16730 21832 81851 3313 -56064 165274
11783 -290690 355291 59941 179268 71305 55 12462 154366 72365 203668 14289 -212246
11771 -20354 187147 111598 229785 215587 -243523 -227835 17478 -389417 -329529 249337 -249474
11759 -82180 187735 -24469 -9148 82344 -61672 185086 -106704 -391451 271036 171720 152099
11748 152099 164595 -150082 -195693 -220513 -31423 31600 109161 22141 -40242 39992 123769
11737 123769 112210 -186258 -28340 680 41711 238138 91705 342801 -7925 -141421 -224779
$$ packed form
11818A64760o687D0692i1590D3779J36311b91980J5480q9592A46830b8872C2287
11806a510l71369a11151c7819k18227J11732m0972n4128O7106A50400c9148J0610
11795b8538B0409K62770b27104P9659b3902P172B1832O0019C313e6064A65274
11783b90690C55291E9941J19327G1305E5J2407J41904G2365J31303A4289b12246
11771b0354A87147p5549J18187j4198b43523J5688A7478c89417N9888B49337b49474
11759h2180A87735b4469i148H2344f1672A85086a06704k84747B71036r9316j9621
11748A52099J2496a50082m5611k4820c1423C1600P7561B2141d0242C9992Q3777
11737A23769j1559a86258b8340F80M1031J96427I1705K51096g925j33496q3358
$$ plain form
11726 -224779 170483 178234 117565 -109650 54328 -253237 79207 -104365 -195569 -29213 114079
11714 44214 -193203 -202195 81146 -249933 -167815 -135876 -168872 38905 -144177 208506 -58716
11702 -193231 -126745 -202782 331726 13339 50862 66107 58893 54198 -145729 258248 93608
11690 326394 -29391 -382224 38531 207795 42543 -155026 -103468 114726 -119298 246150
11679 59729 109339 63682 -143630 -280285 91706 -184390 -77731 47260 290602 -501 127794
11667 108977 47195 145724 -130248 183967 -79985 -48165 225940 -138404 175466 59796
11656 333888 -85706 85213 405319 -5925 379855 -415691 264743 6890 257802 174714 -68593
11644 290678 242528 -104376 161187 47398 511997 122466 291555 228407 42819 165087
$$ packed form
11726b24779A70483P751o0669a09650E4328b53237G9207a04365r1204b9213A14079
11714D4214a93203q992H1146b49933Q2118L1939l2996C8905a44177B08506e8716
11702a93231O6486p6037C31726A3339L7523J5245p214m695a45729B58248I3608
11690C26394b9391l52833C8531J69264D2543a55026N1558A14726a19298B46150
11679E9729M9610m5657a43630j36655I1706a84390g7731D7260K43342e01A27794
11667A08977D7195R8529a30248A83967g9985L1820B25940a38404A75466E9796
11656C33888h5706H5213L20106e925C79855d15691B64743F890K50912q3088f8593
11644B90678m8150a04376A61187D7398M64599A22466J69089o3148D2819J22268
$$ plain form
11634 165087 -90377 32594 -97102 299393 356480 -4743 -291730 121969 -10774 112204 60519
11623 60519 66891 33269 -257541 137894 83124 41326 87439 -248136 108315 -67981 -225131
11612 -225131 130362 299652 116511 -44104 159317 -253944 -233092 -48369 32453 -167593
11601 -245005 -20965 150873 -339793 -28757 274245 261355 34514 -172445 188075 -171025
11590 327008 258182 21301 74091 -10904 -62639 -347937 -72016 50208 113826 489001 -99818
11578 -307224 120357 121221 236952 163617 316839 85499 192602 278314 78868 -154967 132896
11566 108156 150125 -121500 182242 257893 191931 303968 357383 347071 386725 55749 -328542
11554 -153534 198165 -68827 315519 20723 43332 102625 -31077 -145565 117269 63711 151360
$$ packed form
11634A65087i0377C2594i7102B99393N7087d743k86987A21969a0774A12204n1685
11623F0519O372C3269b57541A37894n4770D1326M6113b48136A08315f7981j57150
11612b25131A30362J69290A16511d4104A59317b53944K0852d8369C2453a67593
11601b45005b0965A50873c39793b8757B74245j2890C4514a72445A88075a71025
11590C27008o8826B1301N2790a0904n1735k85298g2016E0208O3618L75175i9818
11578c07224A20357Q64J15731p3335J53222H5499J07103Q5712G8868a54967A32896
11566A08156M1969a21500A82242P5651o5962J12037N3415j0312L9654E5749c28542
11554a53534A98165f8827C15519B0723K2609N9293c1077j14488A17269n3558Q7649
$$ plain form
11543 151360 -63679 -249067 -7129 -77018 39339 274323 196857 7445 23316 35886 8003 116469
11531 116469 253209 17765 50489 -42467 95682 -109094 32486 -130216 219704 253867 175241
11520 175241 143449 13199 312905 -67327 171236 60279 198711 -161046 137704 -124872
11509 22574 311818 -199867 -115961 87012 215486 101955 115897 120904 16220 145109 191092
11498 191092 275554 -58010 52378 105897 -375656 172180 14958 -38771 58132 402876 -82187
11486 35817 -37430 112583 8817 503323 79630 130528 5100 125963 289343 -39496 365672
11474 268390 160044 32635 165565 -276603 124848 143510 -32315 193328 -91750 119614
11463 -91680 99202 281983 -2175 16669 109820 363800 120665 189882 116297 -147554 236824
$$ packed form
11543A51360f3679j85388g129o9889C9339K34984p7466G445J5871J2570H003J08466
11531A16469J36740A7765L2724d2467I5682a09094C2486a30216B19704L4163p8626
11520A75241l1792A3199K99706f7327A71236F0279J38432a61046A37704a24872
11509B2574K89244a99867Q3906H7012J28474A01955J3942N007A6220J28889M5983
11498A91092Q4462e8010E2378N3519c75656A72180A4958c8771E8132L44744h2187
11486C5817c7430A12583H817M94506G9630N0898E100J20863J63380c9496C65672
11474B68390j08346C2635J32930b76603A24848J8662c2315A93328i1750A19614
11463i1680I9202J82781b175A6669R3151K53980A20665O9217p3585a47554B36824
$$ plain form
11451 -43944 222356 77653 -168936 33984 27867 224320 27098 181524 -245699 204708 20220
11439 -51331 -96392 257662 -279987 -5778 -83804 -95674 -239226 -75122 215653 52053 -119224
11427 250397 -19451 209391 149431 89712 316366 -41580 -214031 -161878 -33531 -175603 161564
11415 21674 78605 52095 -55380 75243 116557 57328 40497 -79526 141959 6042 3629 69285
11403 69285 -50592 222540 30883 -275128 -102969 -174318 -127743 -100169 -192877 72889 165957
11392 165957 -84675 36681 -7472 -23622 226326 -320547 -35726 -255735 112816 310686 -212054
11380 -429249 -176444 3878 137179 -65337 -72912 -237243 14510 64741 -21649 127223 -198602
11368 1467 231432 -18891 17396 17372 -92318 94376 149773 -433956 -71529 7065 -49406 -50768
$$ packed form
11451d3944B22356G7653a68936C3984o117J96453B7098J54426b45699B04708B0220
11439e1331m5061B57662b79987e778p8026j1870j43552g5122B15653E2053a19224
11427B50397a9451B09391n9960n9719K26654d1580j72451N2153c3531j42072A61564
11415B1674N6931k6510e5380G5243M1314E7328j6831g9526A41959F042k413O5656
11403F9285e0592B22540C0883b75128a02969p1349M6575K7574r2708G2889R3068
11392A65957h4675C6681g472j6150B26326c20547c5726k20009A12816J97870b12054
11380d29249a76444C878J33301f5337p575j64331A4510N0231b1649A27223a98602
11368A467K29965a8891A7396k4i2318I4376N5397d33956g1529G065d9406j362
$$ plain form
11356 -50768 -123328 -190992 -90691 -119709 -367516 138231 139215 7695 -76350 71558 198250 295136
11344 295136 -212998 -117837 -84881 -49009 -98707 -120125 205128 -27008 33325 -127399 -240566
11333 -240566 -492894 -54371 49318 37286 -23044 22795 -520714 -160518 -82473 205049 -100063
11321 55417 -304662 -87408 -121900 264595 -39375 54877 249682 34309 -273318 -79931 138096
11309 -441737 39034 298615 -4248 272081 -169127 -185363 -276755 -101297 18711 167564 -257821
11297 103270 -16142 12410 328983 -168860 -376263 -224725 60898 -294886 -189433 -110283
11287 -110283 174524 41706 -11511 -163988 -359153 -198500 125416 -48747 -74799 -21456
11276 333483 -110774 -110673 -9477 -134678 -202151 59767 -151923 226497 -26490 27233 120774
$$ packed form
11356e0768p2560o7664i0691k9018k47807A38231R84G695g6350G1558J26692R6886
11344B95136b12998R5161L2956L5872m9698k1418B05128b7008C3325a27399j13167
11333b40566k52328e4371D9318j2032b3044B2795e20714a60518P8045B05049a00063
11321E5417c04662h7408l4492B64595c9375E4877J94805C4309b73318g9931A38096
11309d41737C9034K59581d248B72081a69127j6236r1392a01297A8711J48853b57821
11297A03270a6142A2410L16573a68860k07403J51538F0898b94886J05453P9150
11287a10283A74524D1706a1511j52477j95165J60653A25416d8747k6052b1456
11276C33483a10774J01i477j25201o7473E9767a51923B26497b6490B7233R3541
$$ plain form
11265 120774 250417 -189621 -133592 53326 -191326 -176976 185393 184719 176762 -132028 -156636
11254 -156636 -13399 313903 -440714 -16109 147507 -131356 -65806 -9219 114649 -184777
11243 174945 -10083 -46577 299566 -72737 174580 -165736 86065 -84182 -62324 -45229 210320
11231 -85014 -8161 -19826 -449200 -60366 -117716 -92209 -202988 -88528 -240773 -37338 -22764
11220 -22764 -239852 -140913 -24305 -92501 -133160 203198 -64102 117529 67704 -258655 -119788
11208 -440310 78484 18928 56715 11986 -123173 -103650 -17660 201823 -25536 -63720 238366
11196 9960 39037 110582 -118119 103509 -190962 45708 57633 -391191 -11182 119802 -282580
11184 20034 90854 -19101 -180004 -95252 170706 48414 104345 -135673 -9910 -3740 104515
$$ packed form
11265A20774J29643a89621N6029E3326a91326J4350A85393o74p957a32028k4608
11254a56636a3399C13903d40714a6109A47507a31356O5550i219A14649a84777
11243A74945a0083l6494B99566g2737A74580a65736H6065h4182K1858J7095B10320
11231h5014h161j1665m29374f0366n7350K5507j10779h8528j52245c7338J4574
11220b2764k17088R8939b4305o8196m0659B03198f4102A17529m9825b58655a19788
11208d40310G8484A8928L7787A1986a23173J9523a7660B01823b5536l8184B38366
11196I960K9077P1545a18119A03509a90962D5708J1925c91191a1182A19802b82580
11184B0034P0820a9101j60903Q4752A70706D8414N5931a35673i910c740A04515
$$ plain form
11172 -32728 21939 -183055 -138856 57620 115784 -142072 -57488 -88177 -46785 -111041 -187390
11161 -187390 -9761 -174451 -87057 -38642 72069 -187803 28741 -192687 -150382 -294282 -126548
11149 -145810 -280531 -42148 8059 -331812 -103260 83778 -135128 156604 84417 142453 -163211
11137 78057 11900 -321552 -79920 -264167 -199120 -67107 105792 -283410 250702 -155937
11126 -80245 421872 132731 -316542 161097 -132127 30811 -67265 -17375 -167186 47861
11115 185559 57392 168082 44221 -137249 -127382 270678 300748 320161 -206809 3014 -79736
11103 141892 16112 -153102 -294693 -40166 5140 314168 82204 52315 138235 95713 328832
11092 328832 178399 201255 -19940 -139309 -447647 106805 71441 171128 277101 82745
$$ packed form
11172c2728B1939a83055M4199E7620N8164a42072e7488l0689M1392o4256p6349
11161a87390i761j64690h7057c8642G2069a87803B8741a92687M2305j43900a26548
11149a45810j34721d2148H059c31812a03260H3778a35128A56604p2187N8036a63211
11137G8057A1900c21552g9920j84247O5047f7107A05792b83410B50702a55937
11126h0245D21872A32731c16542A61097a32127C0811f7265a7375j49811D7861
11115A85559E7392J10690D4221a37249R867B70678L0070J9413b06809C014g9736
11103A41892A6112a53102j41591d0166E140L09028H2204k9889Q5920m2522K33119
11092C28832j50433K2856a9940j19369l08338A06805l5364R9687J05973H2745
$$ plain form
11081 342505 89886 183463 -276166 25966 43309 45794 39919 63637 182968 136885 42122
11069 627032 63079 425281 440436 268183 273873 12536 -42996 520680 319139 475724 112451
11057 348796 331376 427903 269678 441445 514932 413558 612101 592914 585844 728580 424918
11046 424918 484937 378679 326018 493141 487161 375433 523336 502042 459500 545113 494403
11035 494403 524361 759684 581813 576108 878240 356658 497177 646673 499672 418876
11025 418876 458847 470446 509687 642352 785538 430347 555099 298128 927311 513519
11015 513519 706590 621096 548141 392976 525506 597646 469205 398023 491781 582982 649121
11004 649121 545299 381736 376137 468478 698346 590551 438355 507473 337023 649989
$$ packed form
11081C42505H9886R3577b76166B5966J7343K485n875K3718J19331m6083D2122
11069F27032F3079L62202J5155j72253N690A2536d2996E20680k01541J56585A12451
11057C48796j7420R6527j58225J71767P3487j01374J98543j9187p070J42736l03662
11046D24918O0019j06258n2661J67123n980j11728J47903k1294m2542Q5613n0710
11035D94403K9958K35323j77871n705L02132C56658J40519J49496j47001q0796
11025D18876L9971J1599L9241J32665J43186l55191J24752k56971O29183m13792
11015E13519J93071q5494p2955j55165J32530P2140j28441p1182R3758R1201O6139
11004F49121j03822j63563n599R2341K29868j07795j52196O9118j70450L12966
$$ plain form
10994 649989 395789 640381 616834 753359 820827 795387 537680 413253 651767 679128
10984 679128 467527 587735 453166 709185 682878 569654 993061 974844 1069686 965537
10974 965537 1335161 1523730 1384957 1736159 2112240 2093671 2354413 2358751 2280687 2079614
10964 2079614 1919922 2027077 1869651 2095477 1818420 1329229 1487713 1408296 1348218 1171455
10954 1171455 1417468 1583966 1808383 1380000 1582705 1166481 1127068 1175442 1014421 846851
10944 846851 895454 753796 308923 570416 167773 274004 78026 131648 174375 451307
10934 451307 302761 452415 34804 189528 -64609 370292 248115 503945 -215811 109248
10923 -236126 -11368 -60366 231564 114701 38602 -265992 24947 -108726 85276 -151051
$$ packed form
10994F49989k54200K44592k3547J36525O7468k5440k57707j24427K38514K7361
10984F79128k11601J20208j34569K56019k6307j13224M23407j8217R4842j04149
10974I65537L69624J88569j38773L51202L76081j8569K60742M338p8064k01073
10964B079614j59692J07155j57426K25826k77057m89191J58484p9417o0078j76763
10954A171455K46013J66498K24417m28383K02705m16224l9413M8374j61021j67570
10944H46851M8603j41658C08923K61493A67773J06231G8026N3622M2727K76932
10934D51307j48546J49654C4804J54724f4609C70292j22177K55830b15811A09248
10923b36126a1368m8998B31564A14701C8602b65992B4947a08726H5276a51051
$$ plain form
10912 -206892 -63949 -197303 -179718 13566 133380 107835 -92250 -62901 -15338 -205627 -229361
10901 -229361 -43259 162252 113168 -163166 131606 -137274 14094 -28426 -123311 114119
10890 157622 39250 -261608 -61628 19969 325566 -47008 -140866 134984 5364 121713 146412
10879 146412 15232 -280746 -73533 249109 -63391 33494 197632 10254 9712 -238595 -90759
10867 -40878 116291 -78815 -74964 132819 -208683 7261 -139510 -7087 -186788 -185708 -99135
10856 -99135 -137079 109473 -50202 -234318 -184423 -146795 52648 -267070 46285 41740 -135783
10844 -178163 -35849 -25996 -50037 -401355 -43485 -494676 -80182 97332 23169 261600 -37258
10832 -290761 -84145 -104190 255433 -40339 -138869 -251000 -167461 -97604 -54402 -230711 -156855
$$ packed form
10912b06892f3949j33354J7585A3566J19814k5545i2250K9349a5338j90289k3734
10901b29361d3259A62252m9084a63166A31606a37274A4094b8426r4885A14119
10890A57622C9250b61608f1628A9969L05597d7008r3858A34984E364J16349K4699
10879A46412A5232b80746g3533B49109f3391C3494J64138A0254n42b38595i0759
10867d0878A16291g8815L851A32819b08683G261a39510g087j79701J080Q6573
10856i9135l7944A09473e0202j84116M9895L7628E2648b67070D6285m545a35783
10844a78163c5849R853k4041l51318d3485m51191h0182I7332B3169K38431c7258
10832b90761h4145k0045B55433d0339r8530j12131Q3539O9857M3202j76309P3856
$$ plain form
10821 -156855 -212048 -148953 -218915 84986 -115755 -89038 -334560 -607660 -187064 109310
10810 -281680 70336 -162475 -119375 -221971 219399 80839 -361336 77300 -146781 -111609
10800 -111609 -267175 -188121 -12090 81664 21262 481223 156948 273860 -24970 -115716 250382
10788 -122934 -68428 84263 -274719 -186000 -267895 -70907 -60191 340052 -373832 -39173 -8824
10776 35784 150241 38934 -30924 222730 -467162 -109150 -176179 82741 -9786 -155596 -99255
10765 -99255 -90313 -353565 -87033 -153984 -106415 377822 -43475 -120253 -262297 -170219 36343
10753 -407258 140363 34649 166775 237524 351134 66962 -106190 -352598 -412541 59185
10742 -344070 -80670 -112318 10602 187505 258044 -96976 120828 80798 57742 -122045 -351062
$$ packed form
10821a56855n5193O3095o9962H4986a15755K6717k45522k73100a87064A09310
10810b81680G0336a62475M3100j02596B19399H0839c61336G7300a46781L5172
10800a11609j55566P9054a2090H1664B1262M59961A56948J16912b4970r0746B50382
10788a22934N4506H4263b74719Q8719q1895g0907J0716C40052c73832c9173h824
10776C5784J14457C8934c0924B22730d67162a09150o7029H2741i786j45810N6341
10765i9255Q942k63252h7033o6951M7569C77822d3475p6778j42044R2078C6343
10753d07258A40363C4649J32126P0749J13610F6962a06190k46408n9943E9185
10742c44070h0670l1648A0602J76903P0539i6976A20828m0030k3056a22045k29017
$$ plain form
10731 -351062 -269152 47699 142603 -67582 -80254 143819 -128295 47501 301127 29825 -247198
10719 82978 128398 292161 -68303 51390 -89428 170503 20258 -298232 198405 149440 45009
10707 77004 -158674 234278 -222512 40119 -303937 49751 144033 -22192 -416456 216934
10696 -57699 -151082 106831 16353 -30179 311090 -244722 -472091 100241 -257070 -402770
10686 -402770 -198635 -64326 -335343 -385345 388867 -33331 -127281 -37458 37600 35366 -537853
10674 44444 -196161 168272 183772 19173 -114211 244407 37021 -90834 -82029 -167162 -255821
10663 -255821 110765 -170921 -171660 -134967 -161743 56598 -79757 -42208 -170755 -147337 -81765
10652 -81765 -117849 -107914 84246 94845 -25176 -391651 -112624 -76492 -141855 -48372 51234
$$ packed form
10731c51062Q1910D7699R4904f7582j2672A43819a28295D7501K53626B9825b47198
10719H2978M5420J63763f8303E1390h9428A70503B0258b98232A98405m8965D5009
10707G7004a58674B34278b22512D0119c03937D9751R4282b2192l94264B16934
10696e7699r3383A06831A6353c0179C11090b44722k27369A00241b57070j45700
10686d02770a98635f4326k71017n0002C88867c3331r3950c7458C7600k234e37853
10674D4444a96161A68272J5500A9173a14211B44407C7021i0834Q805q5133q8659
10663b55821A10765a70921p39L6693k6776E6598g9757L7549j28547K3418O5572
10652h1765l6084R935H4246J0599b5176l66475a12624L6132o5363d8372E1234
$$ plain form
10640 275564 -231926 326015 -47991 -316189 -222594 195750 -74278 85778 -386769 -57877
10629 -187072 -371177 124486 20406 34969 -435359 35913 142370 -62647 87009 -170174
10618 -192305 55901 -38845 -353140 205117 -215136 -43960 7638 -86885 -163583 212817 240664
10607 240664 -159640 -38896 -43160 -131762 -184401 -101585 -12684 -29645 -158419 -324298 217018
10595 -56354 4706 -85482 -292914 72625 -311675 75479 -3666 -150308 400482 10428 -130114
10583 -79906 140895 25044 -130987 -169244 17550 -192592 53332 -66376 77458 -397123 -102140
10571 -21056 -24973 -167607 -50359 -399235 -201919 -144308 73343 -224108 -154849 -487650 191180
10559 27081 -223428 70917 -36188 116246 -212237 271526 -27608 -196013 61223 20921 42349
$$ packed form
10640B75564b31926C26015d7991k68198R3595A95750g4278H5778c86769e7877
10629a87072j84105A24486B0406J4563d35359C5913J06457f2647H7009a70174
10618a92305E5901c8845l14295B05117b15136d3960G638h6885p6698B12817K7847
10607B40664a59640c8896m264q8602n2639Q2816a2684j6961j28774j65879B17018
10595e6354D706h5482k07432G2625c11675G5479c666j46642D00482A0428a30114
10583g9906A40895B5044a30987l8257A7550a92592E3332f6376G7458c97123a02140
10571b1056l917j42634e0359l48876J97316N7611G3343b24108O9259l32801A91180
10559B7081b23428G0917c6188A16246b12237B71526b7608j68405F1223B0921K1428
$$ plain form
10548 42349 2111 -103361 -297908 182890 -139245 -153760 3131 -37189 73719 32550 -120508
10536 74303 55093 138828 -110944 -45028 278927 85761 194687 173721 75071 -218698 -39064
10524 107892 -45385 73019 72228 243093 8574 75391 -63756 -18277 223545 68905 207943
10513 207943 194449 -448632 -349707 307360 -159255 -32456 -229442 223867 -226987 -162517
10503 -162517 275898 69672 -227082 -83561 -69465 -64000 -48166 280722 -35082 263934 -100449
10491 -248566 57237 -164321 -5146 134972 155445 -68662 -72520 -309392 201377 195367 208924
10480 208924 12922 26221 72088 -42455 244632 223955 392411 701922 280510 398042
10470 398042 601855 -134705 -156342 45618 -172931 213381 246227 -195277 -21366 -15303 72163
$$ packed form
10548D2349B111a03361j94547A82890a39245j4515C131c7189G3719C2550a20508
10536G4303j9210Q3735a10944d5028B78927H5761J08926k0966G5071b18698c9064
10524A07892d5385G3019p91J70865H574O6817f3756a8277B23545F8905J39038
10513B07943j3494d48632R8925C07360a59255c2456j96986B23867b26987O4470
10503a62517B75898F9672b27082h3561J4096N465J5834B80722c5082B63934a00449
10491b48566E7237a64321e146A34972K0473f8662l858k36872B01377o010J3557
10480B08924A2922J3299M5867d2455B44632k0677J68456L09511B80510J17532
10470C98042K03813a34705k1637D5618a72931B13381L2846a95277b1366O063G2163
$$ plain form
10458 -189662 114132 204409 277971 -50167 -75335 -224383 -46780 45499 -240672 50844 11654
10446 30384 -340187 66630 -204777 182388 70599 -12663 -337330 -30447 42520 -62632 80324
10434 -147970 -210153 -242050 77241 -407332 -268912 -193736 230141 17616 -156078 -196839 -163038
10423 -163038 93967 -86425 -170711 -123270 -110410 34263 -166077 -247346 279712 -224211 -147437
10412 -147437 161904 -11276 65426 -468111 -303006 -146021 205264 -154627 -42535 -15997
10401 23835 -38629 -188957 203119 131276 36909 -162384 201608 197690 98903 26918 196796
10390 196796 65239 -188686 88166 180572 -51894 -106961 -123962 -41929 -38842 185623 286825
10379 286825 28927 61044 356134 80043 -125619 46348 17296 339001 -2393 263152 -26619
$$ packed form
10458a89662A14132R0277P3562e0167k5168j49048d6780D5499b40672E0844A1654
10446C0384c40187F6630b04777A82388G0599a2663l24667c0447D2520f2632H0324
10434a47970o2183l1897G7241d07332J38420P5176B30141A7616a56078m0761L3801
10423a63038I3967h6425q4286M7441J2860C4263a66077q1269B79712b24211P6774
10412a47437A61904a1276F5426d68111J65105a46021B05264a54627d2535a5997
10401B3835c8629j50328B03119p1843C6909a62384B01608l918r8787B6918J69878
10390A96796F5239a88686H8166R2406e1894n5067j7001d1929L087A85623J01202
10379B86825B8927L2117K95090H0043a25619D6348A7296L21705b393B63152b6619
$$ plain form
10367 152904 363724 450771 626582 78647 421784 -361358 310523 269563 191514 174775
10357 174775 329287 36140 -65294 267885 234537 -111257 305263 84846 508162 343813
10347 343813 326367 -200563 204875 339374 266007 51186 277908 658682 188533 102816
10337 102816 212722 454785 154770 277954 151458 -25071 259581 -40572 230865 128304
10327 128304 14445 233194 -154743 -270033 -100301 149929 182909 370657 -17086 116575
10316 23976 -146410 58147 276233 105452 106827 269761 313634 28584 1906 187177 -42411
10304 69122 -19478 54653 -301882 -225214 296109 200191 136761 72 -126930 -167514 46615 -196092
10291 366519 84404 47358 -142756 280456 -344894 123585 -127894 -42170 -9570 -222749
$$ packed form
10367A52904K10820Q7047J75811G8647L43137c61358C10523m0960p8049j6739
10357A74775J54512C6140f5294B67885l3348a11257C05263H4846M23316j64349
10347C43813j7446b00563B04875J34499p3367E1186K26722L80774A88533q5717
10337A02816J09906K42063A54770J23184j26496b5071B59581d0572B30865j02561
10327A28304A4445K18749a54743j15290a00301A49929L2980J87748a7086A16575
10316B3976a46410E8147K18086A05452J375J62934M3873B8584A906J85271d2411
10304F9122a9478E4653c01882P6668B96109r5918o3430G2a26930m0584D6615a96092
10291C66519H4404l7046a42756B80456c44894A23585a27894d2170i570k13179
$$ plain form
10281 -222749 -10821 3583 8695 6708 -49060 -518075 -17316 116525 -130187 -152604 -28404
10269 215018 88507 -195483 -27447 -273470 25829 -77303 -254440 50237 111078 -21405 6060
10257 -113054 124279 96252 68666 119338 -228314 -3387 218246 333293 509220 193623
10246 109965 108699 -97388 -184614 -69898 42458 -23544 24824 -112230 141408 -186416 35572
10234 4810 117696 -223046 -182263 61045 216542 -324995 -124554 -205047 151690 56557 397276
10223 397276 -21429 -97629 -102854 -53063 -179662 48408 -135313 -261567 237883 -156433 -299439
10212 -299439 3242 -65585 31224 -161639 -153466 234890 115938 -3764 -33810 -131086 -217294
10201 -217294 132825 -2166 49903 -121091 -97660 -31740 -74366 -162494 24902 -323131 -145335
$$ packed form
10281b22749a0821C583N112j987d9060m69015a7316A16525a30187k2417b8404
10269B15018H8507a95483b7447k46023B5829g7303j77137E0237O0841b1405F060
10257a13054A24279k8027k7586N0672b28314c387B18246J15047J75927A93623
10246A09965j266i7388q7226f9898D2458b3544B4824a12230A41408a86416C5572
10234D810J12886b23046M0783F1045J55497c24995a24554q0493A51690E6557L40719
10223C97276b1429p6200n225M9791j26599D8408a35313j26254B37883a56433j43006
10212b99439C242f5585C1224a61639Q173B34890A15938c764l0046r7276q6208
10201b17294A32825b166D9903a21091K3431c1740m2626q8128B4902c23131a45335
$$ plain form
10189 59888 -388890 232832 -17610 -46520 456107 -457068 -192627 -47290 -92034 123255
10178 -220480 94755 -101052 -260536 -12646 31090 -104336 -14976 -18569 -338147 155860 -128149
10166 -365151 33132 -108061 -11969 -82270 -134111 -7143 -130383 -220699 -118463 -59605 -81508
10155 -81508 -228425 169056 -213708 119226 -387668 -166452 -309463 -21497 3519 -5877 -93701
10144 -93701 132709 -364339 -216826 -316929 -218577 42548 -67163 35372 201728 6685 -6028
10132 -122038 -117725 -243403 -184939 -90785 -338406 289204 -172096 -82888 -5015 -262946 27025
10120 155740 67429 124688 433933 35512 62754 42352 34801 -274591 -228500 -36145 -311086
10109 -311086 -262768 -94986 -158117 10925 105981 -51010 -35660 -269847 -152572 64152 98513
$$ packed form
10189E9888c88890B32832a7610k8910D56107d57068a92627d7290m4744A23255
10178b20480I4755a01052j59484a2646C1090a04336a4976l593l19578A55860a28149
10166c65151C3132a08061a1969p0301n1841g143j23240r0316J02236N8858k1903
10155h1508j46917A69056b13708A19226c87668a66452j43011b1497C519e877q7824
10144i3701A32709c64339J47513j00103R8352D2548f7163C5372J66356F685f028
10132a22038M313j25678N8464i0785k47621B89204a72096h2888e015k57931B7025
10120A55740F7429N7259L09245C5512K7242k0402p551b74591M6091c6145k74941
10109c11086M8318i4986o3131A0925R5056e1010J5350k34187J17275F4152L4361
$$ plain form
10098 98513 147724 67306 84397 102557 164001 1060 -291543 280025 -24116 -89107 -34178
10086 228957 -42595 165428 -252937 -143495 -24859 -192375 -171159 -233313 -123916 -15931
10075 -220121 -224547 66126 -187149 30729 -156437 -221495 -273130 -86067 -256408 -171974 -342329
10064 -342329 -172671 -13574 -14169 -75082 -155431 -219987 -149787 -280150 -67674 -214176 -224695
10053 -224695 -28611 5547 2789 -186366 -61655 416603 -110695 -40127 -198192 4451 -188794
10041 -35576 -290701 -392614 -328235 -143836 -95120 -293908 -228933 -78954 -220461 -205175 -8338
10029 -88558 -256474 -145205 3225 -96556 99986 -166303 -112126 82420 155778 4624 172602
10018 172602 -95588 -54550 -283477 -224808 -246560 177626 252983 -223264 -214636 -69965 74075
$$ packed form
10098I8513M9211F7306J7091J8160O1444A060b91543B80025b4116o4991c4178
10086B28957d2595A65428b52937J09442b4859j67516K1216o2154J09397a5931
10075b20121m426F6126a87149C0729a56437o5058n1635h6067j70341Q4434j70355
10064c42329J69658a3574n95o0913q0349o4556P0200j30363f7674j46502j0519
10053b24695b8611E547k758a86366f1655D16603a10695d0127j58065D451a88794
10041c5576k55125j01913O4379a43836M8716j98788O4975g8954j41507J5286h338
10029h8558j67916J11269C225i6556I9986a66303N4177H2420P3358D624J67978
10018A72602i5588M1038k28927N8669k1752A77626P5357b23264Q628f9965G4075
$$ plain form
10006 -344629 -42146 -243107 -125500 216543 -317709 121199 -48708 -188622 -76755 -191472
9996 -191472 -172018 -12599 -214274 -279072 -165376 152237 137307 -90821 58899 -117426 71117
9984 -163965 161797 -56591 -56562 118031 -53140 -323782 -340742 108623 -242352 -163837 -37840
9972 152924 115749 -350864 31944 -36504 -169649 -22723 -662 19817 -185421 -1237 -250465
9961 -250465 -56788 -66002 -46837 -97852 209456 -391487 -230437 -102519 -169096 -141323 88497
9949 -191054 -2777 57632 -113085 159580 -10474 -269779 -34921 -14386 133607 6094 425087
9938 425087 38729 121351 -333945 -125772 -76238 -178996 -125269 -54143 -279170 -541094 2408
9926 123184 128724 -73691 -69925 -142720 81348 143168 161680 -21481 112746 56034 -67564 -327750
$$ packed form
10006c44629d2146k00961J17607B16543c17709A21199d8708j39914g6755j14717
9996a91472J9454a2599k01675o4798J13696A52237j4930i0821E8899a17426G1117
9984a63965A61797e6591K9A18031e3140k70642j6960A08623b42352P8515c7840
9972A52924l7175c50864C1944c6504j33145b2723f62A9817a85421a237k49228
9961b50465e6788r214J9165n1015B09456c91487J61050a02519o6577K7773H8497
9949a91054b777E7632a13085A59580a0474k59305c4921a4386A33607F094M18993
9938D25087C8729Q2622c33945a25772M9534j02758N3727e4143k25027k61924B408
9926A23184N540g3691L766p2795H1348O1820J8512b1481A12746E6034f7564k60186
$$ plain form
9914 -327750 177418 -282572 -342345 -223025 26779 -2257 -154436 358178 -187741 -59307 125401
9902 -24841 -96717 -56772 109054 272341 -158647 -28388 -10635 171115 -154975 -194813 -403034
9891 -403034 89143 -159046 62229 -193634 98565 -137014 -115710 -112035 -124211 -43844 -132660
9880 -132660 26502 -66627 -214914 -150797 -432054 -160257 193584 249899 76310 -325596 -265314
9869 -265314 70334 -154887 -102489 -129745 4196 -304904 -400039 -299501 -288015 6848 49314
9858 49314 -158264 -110250 -142712 -32520 -259846 -42263 -63413 -191674 -267852 81430 28098
9846 -172261 -454518 -97848 228213 -149625 -303625 208712 25923 -226078 285075 114972
9835 -171898 -314978 -262316 -292774 -112170 118717 72322 11855 -117723 -159229 -11997 111062
$$ packed form
9914c27750A77418b82572n9773J19320B6779b257j52179C58178a87741e9307A25401
9902b4841p1876L9945A09054J63287a58647b8388a0635A71115a54975l9838k08221
9891d03034H9143a59046F2229a93634I8565a37014K1304L675j2176d3844q8816
9880a32660B6502f6627j48287O4117k81257a60257A93584N6315G6310c25596O0282
9869b65314G0334a54887N2398k7256D196c04904r5135J00538J1486F848M2466
9858D9314a58264M8014l2462c2520k27326d2263k1150j28261p6178H1430B8098
9846a72261k82257i7848B28213a49625j54000B08712B5923b26078B85075A14972
9835a71898j43080N2662l0458a12170A18717m6395A1855a17723m1506a1997A11062
$$ plain form
9823 84842 259704 -115968 -141036 -183175 -382282 -89968 -144378 362147 1098 -133302 -203328
9812 -203328 -78006 278555 -197477 -304031 -309029 68305 -78089 58459 -135098 -176919 -130268
9801 -130268 -217478 -96294 363220 43796 -176562 243009 25983 124614 -41247 -308823 178638
9789 -9103 36336 -138567 -320627 58341 -5247 -30099 -44371 69947 -182369 227375 -52211
9777 66824 147486 -189812 -117281 -52507 -21510 -64909 -204138 112234 -328736 44930 -45122
9765 9614 -77811 50543 -172329 100893 59567 -196715 -208479 32014 -132988 -120364 -64568
9754 -64568 -211834 -23255 -281578 62487 235675 -66824 -36345 -365461 161803 -180182 231247
9742 12712 -64652 -132911 -72452 -15517 -233177 204290 -410026 -318868 13358 -146304 -75933
$$ packed form
9823H4842J74862a15968k5068m2139j99107h9968n4410C62147A098a33302p0026
9812b03328g8006B78555a97477j06554m998F8305g8089E8459a35098m1821M6651
9801a30268q7210i6294C63220D3796a76562B43009B5983R8631d1247k67576A78638
9789i103C6336a38567j82060E8341e247k4852j4272F9947a82369B27375e2211
9777F6824Q0662a89812P2531e2507b1510m3399j39229A12234c28736D4930d5122
9765I614g7811E0543a72329A00893m1326a96715j1764C2014a32988J2624N5796
9754f4568j47266b3255k58323F2487J73188f6824L0479l29116A61803a80182B31247
9742A2712f4652o8259O0459a5517k17660B04290d10026R1158A3358a46304P0371
$$ plain form
9731 -75933 -218585 -55126 59157 -122504 66615 -113641 44770 211489 56991 102177 -445873
9719 173278 -42280 84751 -38984 333873 -8495 48746 -187817 -134634 -403293 -314527 233822
9707 171722 -101568 238389 107961 272056 -15847 -169275 215672 -113688 -3829 35886
9696 -13626 -97424 65894 247180 -171556 -212044 23898 -193409 -186976 -139536 -9182 -112330
9685 -112330 -87631 -93909 21554 -105814 -44544 -203676 -19130 -430797 -7517 -13261 -792 72232
9672 -224333 2120 98949 -134008 38326 153519 -145736 383526 119632 11224 -218725 -354396
9661 -354396 -148774 160967 -135846 -436726 -110956 4121 4876 94101 -95891 -15670 -169837
9650 -169837 2862 -174333 108650 -289286 -150725 -205571 116193 -433633 -201652 -119552
$$ packed form
9731g5933j42652e5126E9157a22504F6615a13641D4770J66719E6991M5186d45873
9719A73278d2280H4751c8984C33873h495D8746a87817N3183k68659Q8766B33822
9707A71722a01568B38389A07961J64095a5847j53428B15672a13688c829C5886
9696a3626q3798F5894J81286a71556m0488B3898a93409O433M7440i182j03148
9685a12330K4699o278B1554a05814d4544j59132a9130m11667g517n744g92G2232
9672b24333B120R6829a34008C8326J15193a45736C83526A19632A1224b18725j35671
9661c54396a48774A60967a35846l00880a10956D121P55Q9225i5891a5670j54167
9650a69837B862a74333A08650b89286J38561n4846A16193d33633b01652Q2100
$$ plain form
9640 -119552 -81353 219487 -36701 -69300 -271044 -220217 -51318 30183 293295 156349 -71364
9628 -142250 -196138 50028 162552 -187294 -59529 -128488 -235747 195641 -154053 185762
9617 -167928 67905 -197619 -28018 -222928 -154438 -129500 -163680 -174999 58140 133191 122096
9606 122096 25138 94698 26508 -272470 -30702 -188951 134943 -18807 -30701 -48009 -247894
9595 -247894 -337715 -22921 118445 -75397 -314042 34989 33390 -217383 -97330 -84320 -68267
9584 -68267 -437828 -210652 164314 21319 -139401 86147 224247 27485 -7970 -178150 424089
9572 66383 164584 -135385 73622 -159698 -90558 218239 -333244 22798 -261134 -411300 25313
9560 11165 121418 -149505 2806 -26083 -325030 -46774 -27408 -58277 -27151 -271172 -15987
$$ packed form
9640a19552L8199B19487c6701l2599k01744N0827e1318C0183K63112j36946g1364
9628a42250n3888E0028J12524a87294e9529o8959j07259A95641a54053A85762
9617a67928F7905a97619b8018j94910O8490K4938l4180j1319E8140P5051j1095
9606A22096B5138O9560B6508b72470c0702j58249A34943a8807j1894j7308j99885
9595b47894q9821b2921A18445g5397k38645C4989j599b17383i7330J3010J6053
9584f8267l69561b10652A64314B1319a39401H6147J38100B7485g970j70180D24089
9572F6383R8201a35385G3622a59698O9140B18239c33244B2798b61134j50166B5313
9560A1165J10253a49505B806b6083k98947d6774J9366l0869b7151k44021a5987
$$ plain form
9548 84512 -326140 -103482 -413171 -196919 -17660 -53674 -225115 -136139 11534 217206 262130
9537 262130 -189703 -189727 77287 -101289 -159312 -96905 -68384 -175188 -113555 -260945 -69600
9525 -71023 102931 -82982 4404 -82844 37363 -13423 -333054 -440761 -107422 -507701 -255940
9514 -255940 -323416 -138524 -33488 -37020 -226981 36166 -168709 -314574 -391798 44488 306063
9503 306063 -76805 -264828 46034 153023 70639 -261464 -46276 -64652 -108291 -239859 -39709
9491 -121023 99521 87130 -300435 -401797 104253 -114620 55647 -568816 -57357 142679
9480 -251666 -160199 39968 -229676 -90256 -250801 68501 -158697 -138330 -386029 -37711 334038
9468 -439771 -94179 -104909 -12180 272728 44026 -179163 -81705 190069 -119141 267936 -212438
$$ packed form
9548H4512c26140a03482l09689a96919a7660l6014j71441Q8976A1534K05672M4924
9537B62130a89703k4G7287a01289n8023O2407K8521j06804O1633j47390f9600
9525g1023A02931h2982D404h2844C7363a3423l19631j07707a07422m00279K51761
9514b55940o7476a38524c3488l532j89961C6166a68709j45865p7224D4488K61575
9503C06063g6805j88023D6034J06989G0639b61464d6276j8376m3639j31568c9709
9491a21023I9521j2391c00435j01362A04253a14620E5647e68816e7357A42679
9480b51666R1467C9968b29676i0256j60545F8501a58697K0367k47699c7711C34038
9468d39771i4179j0730a2180B72728D4026a79163h1705A90069a19141B67936b12438
$$ plain form
9456 245034 79953 -106243 395550 -142280 14057 -487254 -287328 -41421 194076 276129
9446 276129 -68676 367896 -129437 156188 -30969 -336164 301472 -503654 -137087 -76351
9436 -76351 -69658 -289044 -142149 -58349 -225504 -229981 -209192 -90073 -65891 -250857 18981
9424 -463154 53548 -67487 160773 -10723 169880 72200 27403 -163724 -14683 -92131 -38297
9412 34607 -212526 -183465 30619 7899 294782 -32776 -446567 182336 448593 58601 -149236
9400 205097 -132385 147441 -62904 120747 -245255 48240 53738 -76786 -170087 -142773 -152222
9389 -152222 -226309 40670 -30815 160007 148335 -13584 175411 -230209 234491 156450 -455934
9377 -329969 -359165 -339550 63384 -61238 -37305 167099 -25093 241235 56924 -159055 -203438
$$ packed form
9456B45034G9953a06243C95550a42280A4057d87254J99926d1421A94076Q2053
9446B76129f8676C67896a29437A56188c0969l05195C01472e03654a37087O0736
9436g6351O693k19386a42149e8349j67155m477K0789i0073K4182j84966A8981
9424d63154E3548f7487A60773a0723A69880G2200B7403a63724a4683p7448c8297
9412C4607b12526K9061C0619G899K86883c2776m13791A82336K66257E8601a49236
9400B05097a32385A47441f2904A20747b45255D8240N498g6786r3301K7314r449
9389a52222p4087D0670c0815A60007j1672a3584A75411b30209B34491p8041d55934
9377c29969k9196J9615F3384f1238K3933A67099b5093B41235E6924a59055m4383
$$ plain form
9366 -203438 -178750 130431 -118730 -3102 -172353 49015 99077 -137043 -367894 104861 -141488
9354 -217825 -143223 135316 -104084 12870 19956 16437 234448 59052 104022 -318243 -384974
9343 -384974 -77479 -390363 -205615 -92953 128638 -181230 192703 -341878 -16817 89154
9332 85173 -254942 117250 -314674 54531 86152 -211513 -221103 -136085 365676 -158003 92623
9320 20191 102290 -154818 -126123 -320498 21263 -2687 -205293 -255942 44361 90983 -192920
9308 -317170 7747 -10542 -123541 -80236 -128358 -67311 -162498 37012 -25816 -107766 -372613
9297 -372613 -148839 144558 -61529 -142436 52533 222186 48853 44559 -301179 58538 -80184
9285 -193697 107298 81806 55751 47659 23304 -103033 -77986 206807 -255506 19325 -334515
$$ packed form
9366b03438K4688A30431a18730c102j69251D9015N0062a37043k30851A04861a41488
9354b17825P4602A35316a04084A2870P086l519K18011E9052M4970c18243o6731
9343c84974g7479l12884J84748i2953A28638a81230A92703c41878a6817H9154
9332H5173b54942A17250c14674E4531L1621b11513r590Q5018C65676a58003I2623
9320B0191Q2099a54818K8695j94375B1263b687k02606n0649D4361M6622a92920
9308c17170G747a0542j12999M3305m8122O1047r5187C7012b5816q1950k64847
9297c72613a48839A44558f1529q0907E2533J69653D8853m294c01179E8538h0184
9285a93697A07298k5492k6055q092B3304a03033K5047B06807b55506A9325c34515
$$ plain form
9273 -33680 -139691 -180809 136515 -69478 27188 -209363 -40855 162705 -233464 262726 19819
9261 4158 -115418 -82105 122046 -146118 124562 -294216 -164411 100909 -148528 -24293
9250 -119873 -137770 -111113 -48051 156325 -245199 61708 -276932 -232935 -251278 42301 226819
9239 226819 -223252 3774 59439 -303743 226908 -170795 -352252 -19280 104376 92499 -49566
9227 96191 73614 -230768 -179738 -6303 190878 -98144 -2882 -73304 128579 -148714 -122313
9216 -122313 117435 -271303 -204013 63598 249259 -116558 -77440 177058 -284756 -57477
9205 -300130 224416 -39606 -17756 135646 -352083 75269 -250108 -95191 160014 -12708 55152
9193 -159745 -100605 -80300 -78834 353586 -118371 -183716 -50482 -176878 128396 215098 125214
$$ packed form
9273c3680j06011m1118A36515f9478B7188b09363d0855A62705b33464B62726A9819
9261D158a15418L3313A22046a46118A24562b94216J29805A00909a48528b4293
9250a19873j7897K6657d8051A56325b45199F1708b76932M3997j8343D2301J84518
9239B26819b23252C774N5665c03743B26908a70795j81457a9280A04376j1877d9566
9227I6191k2577b30768N1030f303A90878i8144b882p0422A28579a48714K6401
9216a22313A17435b71303O7290F3598J85661a16558L9118A77058b84756e7477
9205c00130B24416c9606a7756A35646c52083G5269b50108i5191A60014a2708E5152
9193a59745N9140K0305J466C53586a18371o5345e0482j26396A28396Q6702q9884
$$ plain form
9182 125214 -72846 103111 35759 57659 -39453 -16373 -167643 -240288 48031 -157069 159462
9170 20784 1155 -71319 -45667 33529 204970 -51249 -153362 -61813 -210559 -66866 -808 -145870
9158 -145870 -160609 139119 -268141 68573 -176393 -167918 -30698 -117104 -224658 14392 37329
9147 37329 119701 -480123 75037 -181956 -146647 -173182 -30593 170127 -2013 -67760 -12608
9135 -44298 121133 148252 -277064 -7774 -100421 129944 -89296 260119 -337726 -193865 -342786
9124 -342786 -37913 -194647 -22407 -73626 -187481 325463 -301158 -61015 -268658 -16387 -200588
9113 -200588 85488 -200714 28139 -115670 -513495 -103807 -224772 -116761 51910 -91310
9102 177455 -123133 -10483 12047 -122787 -40415 -187084 71314 -239599 -90879 -351162 83549
$$ packed form
9182A25214g2846A03111C5759K1900c9453a6373j51270p2645D8031a57069A59462
9170B0784A155g1319K5652C3529J71441e1249j02113f1813j48746f6866h08j45062
9158a45870j4739A39119b68141F8573a76393Q475c0698q6406j07554A4392K2937
9147C7329Q2372d80123G5037a81956L5309k6535c0593A70127b013o5747a2608
9135d4298A21133K7119b77064g774r2647A29944h9296B60119c37726J43861j48921
9124c42786c7913j56734b2407n1219j13855C25463c01158f1015k07643a6387j84201
9113b00588H5488b00714B8139a15670l97825a03807j20965J08011E1910i1310
9102A77455a23133a0483A2047a22787d0415j46669G1314b39599i0879k60283H3549
$$ plain form
9090 -30269 -453202 53186 142822 -415453 154882 19283 -173247 -71687 -141981 -83694 111140
9078 -129505 -21141 -221289 -85131 -197152 28531 -243272 -279917 30036 -144323 -232691 -288485
9067 -288485 -185435 56868 -85710 63998 -62272 -59712 220795 163542 48575 -233980 -123960
9056 -123960 -9421 72429 -8571 -140862 129202 316562 41370 55746 -154036 253240 -79857
9044 -387049 159678 -90077 -44159 -164678 -261282 -121462 108456 -220268 -47731 -31684 -33499
9033 -33499 160206 -181637 35543 -190965 -208175 33488 190705 -2646 70759 -111417 -83607
9022 -83607 -122145 -40696 -145948 -81502 40577 -12199 140898 95831 -54200 -122010 -225835
9011 -225835 164740 -36071 -177714 -184367 38112 -190619 -50888 10956 -71686 172549 -80070
$$ packed form
9090c0269m22933E3186Q9636d15453A54882A9283a73247g1687p0294N8287A11140
9078a29505b1141k00148h5131j12021B8531b43272l6645C0036a44323q8368n5794
9067b88485J03050E6868h5710F3998f2272K560B20795n7253D8575b33980J10020
9056a23960i421G2429h571j32291A29202J87360D1370J4376a54036B53240g9857
9044c87049A59678i0077d4159j20519r6604a21462A08456b20268d7731J6047j815
9033c3499A60206a81637C5543a90965j7210C3488J57217b646G0759a11417K7810
9022h3607l8538d0696j05252O4446D0577a2199A40898m5067e4200o7810j03825
9011b25835A64740c6071j41643o653C8112a90619e0888A0956g1686A72549h0070
$$ plain form
8999 -102182 182629 -252171 -53150 -225622 -169063 150934 -225890 -16690 -279116 -99329
8988 -62820 -39529 184435 166986 -154940 -158606 -359160 -165543 -58603 -161634 341999 -250051
8976 40498 132527 132391 68270 -72642 -78877 66322 187864 189265 -553316 260403 191775 60533
8963 148556 -211679 227382 139591 118842 -12220 -146558 -229421 -17559 -385464 -143882 -989
8951 -260807 -190032 -44844 18152 -87623 -62287 -200218 -27294 -104870 90799 -216151 41329
8939 -34345 -179923 -239282 92646 255687 278531 -7750 -11324 171824 138763 23479 94289 -218536
8926 2328 -39509 27003 201024 197421 639988 1539699 3450954 14300034 6094644 1815576
8915 419951 386423 174942 110165 -48489 176377 -160523 -211174 41034 -55356 311312 398271
$$ packed form
8999a02182A82629b52171e3150j72472N6559A50934b25890a6690k62426i9329
8988f2820K3291A84435j7449a54940l666k00554a65543e8603j03031C41999b50051
8976D0498R2029j36o4121g2642o235F6322J21542J401e53316B60403o8628F0533
8963A48556b11679B27382q7791k0749a2220j34338q2863a7559l67905a43882i89
8951b60807P0775d4844A8152h7623K5336j37931b7294p7576I0799b16151D1329
8939c4345j45578n9359I2646J63041K2844g750l574A71824l3061B3479P0810b18536
8926B328c9509B7003J74021l603M42567Q99711J911255J0849080F094644A815576
8915D19951l3528A74942o4777d8489A76377a60523n0651D1034e5356C11312Q6959
$$ plain form
8904 398271 125601 147805 -395613 -144830 94880 123303 -140806 106124 -15845 -96969 -185893
8893 -185893 -201096 -395652 -93144 138704 -135914 30911 -281546 -171057 -140841 66370 102793
8882 102793 -236689 183793 -390938 -97089 37004 -217800 -189275 -110723 199265 92879 -19023
8870 14877 -131189 190586 -39324 -80817 -320082 -262901 104940 -116773 7197 138351 -183839
$$ packed form
8904C98271A25601K2204c95613a44830I4880K8423a40806A06124a5845q1124q8924
8893a85893j5203j94556i3144A38704a35914C0911b81546J10489L0216F6370L6423
8882A02793b36689A83793c90938i7089C7004b17800K8525P8552A99265I2879a9023
8870A4877a31189A90586c9324m1493k39265N7181A04940a16773G197J31154a83839
$$ [...]
##END NTUPLES=NMR SPECTRUM
##END=
