
##TITLE=AC1320_SSOAH12149_6535388_BeTgGdQVbO
##JCAMPDX= 6.0         $$ Bruker NMR JCAMP-DX V2.0
##DATA TYPE= NMR SPECTRUM
##DATA CLASS= NTUPLES
##ORIGIN= BRUKER
##OWNER= Administrator
$$ 1.72 TOPSPIN		Version 2.1
$$ 2012-07-17 18:24:23.937 -0500  Administrator@TOPSPIN
$$ Compression mode = diff/dup
##.OBSERVE FREQUENCY= 400.02188249412
##.OBSERVE NUCLEUS= ^1H
##.ACQUISITION MODE= SIMULTANEOUS (DQD)
##.ACQUISITION SCHEME= undefined
##.AVERAGES= 8
##.DIGITISER RES= 22
##SPECTROMETER/DATA SYSTEM= spect
##.PULSE SEQUENCE= zg30
##.SOLVENT NAME= COFFEE_meoh
##.SHIFT REFERENCE= INTERNAL, COFFEE_meoh, 1, 14.98509
##AUDIT TRAIL= $$ (NUMBER, WHEN, WHO, WHERE, PROCESS, VERSION, WHAT)
$$ ##TITLE= Audit trail, TOPSPIN		Version 2.1
$$ ##JCAMPDX= 5.01
$$ ##ORIGIN= Bruker BioSpin GmbH
$$ ##OWNER= Administrator
$$ $$ C:\Bruker\TOPSPIN/data/COFFEE/nmr/AC1320_SSOAH12149_6535388_BeTgGdQVbO/10/pdata/1/auditp.txt
$$ ##AUDIT TRAIL=  $$ (NUMBER, WHEN, WHO, WHERE, PROCESS, VERSION, WHAT)
(   1,<2012-07-17 18:24:16.781 -0500>,<Administrator>,<TOPSPIN>,<go>,<TOPSPIN 2.1>,
      <created by zg
	started at 2012-07-17 18:23:09.843 -0500,
	POWCHK enabled, PULCHK disabled,
       configuration hash MD5:
       6B 1B 68 BB D9 2E 58 E2 7F 35 AD 54 07 DF 0E 41
       data hash MD5: 64K
       44 C8 70 09 A5 20 67 0B 0E D0 17 88 D2 78 D4 08>)
(   2,<2012-07-17 18:24:19.750 -0500>,<Administrator>,<TOPSPIN>,<proc1d>,<TOPSPIN 2.1>,
      <Start of raw data processing
       efp LB = 0 FT_mod = 6 PKNL = 1 PHC0 = 0 PHC1 = 0 SI = 32K 
       data hash MD5: 32K
       AC E0 42 E0 0B 4E 1C 2D 0F E7 55 E6 53 77 EC 03>)
(   3,<2012-07-17 18:24:20.078 -0500>,<Administrator>,<TOPSPIN>,<proc1d>,<TOPSPIN 2.1>,
      <pk PHC0 = 175.7153 PHC1 = 0 
       data hash MD5: 32K
       54 9C F1 42 81 5F ED 64 E2 F2 ED 7A A2 3D 0C 46>)
(   4,<2012-07-17 18:24:20.140 -0500>,<Administrator>,<TOPSPIN>,<proc1d>,<TOPSPIN 2.1>,
      <abs ABSG = 1 
       data hash MD5: 32K
       71 79 D8 C3 94 98 A9 89 A9 18 09 E8 2A 42 FF 3B>)
(   5,<2012-07-17 18:24:20.171 -0500>,<Administrator>,<TOPSPIN>,<proc1d>,<TOPSPIN 2.1>,
      <abs ABSG = 2 
       data hash MD5: 32K
       CD E4 DC 23 B6 F9 1E 96 FB 4E 0C 93 54 C3 33 EF>)
(   6,<2012-07-17 18:24:20.203 -0500>,<Administrator>,<TOPSPIN>,<proc1d>,<TOPSPIN 2.1>,
      <abs ABSG = 3 
       data hash MD5: 32K
       FA EF F0 2B 4A 8E 78 6C 59 B0 C2 D4 B6 38 92 8C>)
(   7,<2012-07-17 18:24:20.390 -0500>,<Administrator>,<TOPSPIN>,<proc1d>,<TOPSPIN 2.1>,
      <abs ABSG = 4 
       data hash MD5: 32K
       DA FB 47 88 06 96 A5 5D B3 FF 80 84 05 52 F7 CE>)
(   8,<2012-07-17 18:24:20.421 -0500>,<Administrator>,<TOPSPIN>,<proc1d>,<TOPSPIN 2.1>,
      <abs ABSG = 5 
       data hash MD5: 32K
       83 E8 CD 95 BB B0 73 55 25 67 77 D7 E0 F2 FD 38>)
$$ ##END=
$$ 
$$ $$ hash MD5
$$ $$ 68 B1 B2 47 E8 35 E8 D4 59 4B BF C4 65 86 31 9E
##$RELAX= 
##$RELAX= 
##$RELAX= 
##$RELAX= 
##$RELAX= 
##$RELAX= 
##$RELAX= 
$$ Bruker specific parameters
$$ --------------------------
$$ [...]
150 150 150 150 150 150 150 150
##$TP07= 0
##$TPNAME0= <>
##$TPNAME1= <>
##$TPNAME2= <>
##$TPNAME3= <>
##$TPNAME4= <>
##$TPNAME5= <>
##$TPNAME6= <>
##$TPNAME7= <>
##$TPOAL= (0..7)
0.5 0.5 0.5 0.5 0.5 0.5 0.5 0.5
##$TPOFFS= (0..7)
0 0 0 0 0 0 0 0
##$TUNHIN= 0
##$TUNHOUT= 0
##$TUNXOUT= 0
##$USERA1= <user>
##$USERA2= <user>
##$USERA3= <user>
##$USERA4= <user>
##$USERA5= <user>
##$V9= 5
##$VALIST= <valist>
##$VCLIST= <CCCCCCCCCCCCCCC>
##$VD= 0
##$VDLIST= <DDDDDDDDDDDDDDD>
##$VPLIST= <PPPPPPPPPPPPPPP>
##$VTLIST= <TTTTTTTTTTTTTTT>
##$WBST= 2048
##$WBSW= 25
##$XGAIN= (0..3)
0 0 0 0
##$XL= 0
##$YL= 0
##$YMAX_a= 442980
##$YMIN_a= -559514
##$ZGOPTNS= <>
##$ZL1= 120
##$ZL2= 120
##$ZL3= 120
##$ZL4= 120
##$ABSF1= 14.98509
##$ABSF2= -5.573092
##$ABSG= 5
##$ABSL= 3
##$ALPHA= 0
##$AQORDER= 0
##$ASSFAC= 0
##$ASSFACI= 0
##$ASSFACX= 0
##$ASSWID= 0
##$AUNMP= <proc_prof1d_extract_pilot.lims>
##$AXLEFT= 0
##$AXNAME= <>
##$AXNUC= <1H>
##$AXRIGHT= 0
##$AXTYPE= 0
##$AXUNIT= <>
##$AZFE= 0.1
##$AZFW= 0.1
##$BCFW= 0
##$BC_mod= 0
##$BYTORDP= 0
##$COROFFS= 0
##$CY= 15
##$DATMOD= 1
##$DC= 0
##$DFILT= <>
##$DTYPP= 0
##$F1P= 0
##$F2P= 0
##$FCOR= 0.5
##$FTSIZE= 32768
##$FT_mod= 6
##$GAMMA= 0
##$GB= 0
##$INTBC= 1
##$INTSCL= 1
##$ISEN= 128
##$LB= 0
##$LEV0= 0
##$LPBIN= 0
##$MAXI= 10000
##$MC2= 0
##$MEAN= 0
##$ME_mod= 0
##$MI= 0
##$NCOEF= 0
##$NC_proc= -8
##$NLEV= 6
##$NOISF1= 0
##$NOISF2= 0
##$NSP= 0
##$NTH_PI= 0
##$NZP= 0
##$OFFSET= 14.98509
##$PC= 1
##$PHC0= 175.7153
##$PHC1= 0
##$PH_mod= 1
##$PKNL= yes
##$PPARMOD= 0
##$PPDIAG= 0
##$PPIPTYP= 0
##$PPMPNUM= 2147483647
##$PPRESOL= 1
##$PSCAL= 4
##$PSIGN= 0
##$PYNMP= <proc.py>
##$REVERSE= no
##$SF= 400.02
##$SI= 32768
##$SIGF1= 0
##$SIGF2= 0
##$SINO= 400
##$SIOLD= 32768
##$SPECTYP= <>
##$SREGLST= <1H.CDCl3>
##$SSB= 0
##$STSI= 32768
##$STSR= 0
##$SW_p= 8223.68421052631
##$SYMM= 0
##$S_DEV= 0
##$TDeff= 65536
##$TDoff= 0
##$TI= <>
##$TILT= no
##$TM1= 0
##$TM2= 0
##$TOPLEV= 0
##$USERP1= <user>
##$USERP2= <user>
##$USERP3= <user>
##$USERP4= <user>
##$USERP5= <user>
##$WDW= 1
##$XDIM= 32768
##$YMAX_p= 419344793
##$YMIN_p= -653643
##$CURPLOT= <Network HP LaserJet P1505>
##$CURPRIN= <$Network HP LaserJet P1505>
##$DFORMAT= <normdp>
##$LAYOUT= <+/1D_H.xwp>
##$LFORMAT= <normlp>
##$PFORMAT= <normpl>
##$SURQMSG= 1
$$ End of Bruker specific parameters
$$ ---------------------------------
##NTUPLES= NMR SPECTRUM
##VAR_NAME=  FREQUENCY,     SPECTRUM/REAL,   SPECTRUM/IMAG
##SYMBOL=    X,             R,               I
##VAR_TYPE=  INDEPENDENT,   DEPENDENT,       DEPENDENT
##VAR_FORM=  AFFN,          ASDF,            ASDF
##VAR_DIM=   32768,         32768,           32768
##UNITS=     HZ,            ARBITRARY UNITS, ARBITRARY UNITS
##FACTOR=    0.250966925370066, 1,           1
##FIRST=     8223.43324360094, 235543,       -39336
##LAST=      0,             23207,           -90526
##MIN=       0,             -653643,         0
##MAX=       8223.43324360094, 419344793,    0
$$ Real data points
##PAGE= N=1
##DATA TABLE= (X++(R..R)), XYDATA
$$ [...]
23860 38046 -114114 -216587 332316 -9374 86620 -67183 -180853 255668 4907 147605 -56450
23848 230306 -80145 267856 -177225 146561 -119384 -214884 2479 175245 14873 116217
23838 116217 -39353 28502 -142900 -74065 177218 211349 18407 -107584 -77071 163066 159496
23827 159496 -40218 -383401 -72564 -342913 211248 -255251 -265686 20078 -22611 222360
23816 -303263 -229792 -221537 -275685 70830 -111523 -61101 38434 19157 -125510 -203375 -119578
23805 -119578 173591 157915 173010 256451 30908 -36527 -146819 -151295 -50490 -129171 -304128
23794 -304128 129956 -10473 234872 231516 32856 120655 61918 200248 -39752 -140918 21984
23782 -68623 39865 238781 -9711 -264858 -54274 -134811 -170940 -314536 -126307 -23260 -207060
23771 -207060 -197622 -106301 -19910 5134 -53038 -289734 -55448 84904 -20413 -339861 102054
23759 59991 -151365 31046 432669 137184 -196662 182001 -143207 164971 -216701 130832
23748 148485 -4625 310214 -165880 253211 -169304 -62192 91411 -409245 -125891 -246352
23738 -246352 67314 197353 -69204 -353869 195069 -80775 -136373 163093 -61751 229514
23727 -183095 92958 -96873 -367725 120476 -211626 84162 -106729 -109181 -335517 73978 88566
23716 88566 6815 15894 -158587 -39840 10629 14953 -249449 -50387 -5231 397384 220505 -48708
23703 142154 -126204 375334 -420437 -83185 52944 -202539 -231804 258503 -106795 172150
23692 -354588 -287400 -280630 -202724 74104 106297 63157 -176918 -161538 -63558 -90558 142410
23680 -25310 262214 195612 -138566 94831 174615 64857 -15242 -41037 -25328 -156489 8136
23668 253208 -352766 -10540 14459 -131211 -124794 192830 470849 13651 63219 306718 4163
23656 197728 -31899 -169314 90550 21390 -131357 117466 -79589 -22447 64098 255394 61256
23644 214109 103040 144656 -211809 202136 -185185 -203779 -29352 64097 149368 205651 -83819
23632 550643 192378 -144115 -363419 -184510 10039 -48539 105957 -12086 102747 -131882
23621 274842 322876 -21646 -26151 -159954 75117 -397449 276874 -159416 -432358 -304249
23611 -304249 -122234 135823 -215165 157732 142275 -29899 -76961 -143524 -83380 -138198 132243
23599 -117943 -117429 -490146 85163 213312 -78913 213061 -173104 103851 -97473 -90216 174940
23587 107783 -66662 183775 -165667 84109 80092 -83659 -122386 89611 171273 -159199 -118413
23576 -118413 -55083 -382095 34114 -17458 -128953 4069 42053 97274 -165927 -19748 80366
23564 365218 106151 59711 -81762 257100 -89765 81520 -303168 -192759 23832 232331
23554 232331 -42818 -189070 -312503 114949 269910 -46765 -65653 161910 93720 -179697
23543 163166 -40681 -6513 -279560 -371807 73005 48668 -282149 -75416 -64006 10813 163563
23532 163563 -32942 -84528 -71096 -20425 -490916 201271 -468987 -294790 76793 -100931
23521 254410 -37399 127793 120206 -59230 -145562 375501 -97124 -146300 283371 98387 33680
23509 -68201 -236624 -62366 54052 12551 -54201 -113425 49718 -185048 -109571 -192783 -39671
23497 -125337 -344497 165368 175259 288846 -141215 -302392 -161603 -117953 -382704 273077
23486 -126645 64140 -166787 483471 171423 -5500 90261 6824 -245707 -53215 -197326 -56261
23474 -1988 -58334 -392762 -21952 174552 -2090 -100099 187542 -462346 -123069 133931 -262116
23462 -211351 219979 -211641 260432 -236436 -64645 -253893 -34604 -368370 -149415 109759
23451 -44850 3117 32567 39346 -58417 128743 -88614 174201 -82980 -102047 175484 -210375
23439 29211 44682 259280 -350516 342196 -121036 38008 -328446 157514 -136637 136909
23428 -27375 172670 -165478 48549 -126895 31410 -27371 292490 40613 -296925 28973 182396
23417 182396 334262 -112484 -389657 -112063 -67134 -408494 -232837 -196375 78904 -144365
23406 -58470 -52662 105848 146956 130029 -149268 -112153 81290 13109 -71867 415760 -69490
23394 -217843 41535 -156219 -362736 -222828 13222 75783 71279 131438 -83688 -342 -208177
23383 -208177 -12121 9829 -93750 64397 -85395 206109 -90528 -174156 69175 -280996 238215
23371 -102041 -277505 -236251 -43107 -344695 -89457 173464 -136609 146336 -5373 40460 -82391
23359 -134260 -206200 -42606 50358 -94429 -293429 192783 393942 115329 -192315 -168397
23349 -168397 -203268 -111012 44161 98054 -366929 -42430 -79750 98790 -68401 83498 113421
23338 113421 247710 316502 -4377 192118 48010 41531 72639 -293176 -108111 -129451 -235434
23327 -235434 -110156 -120392 -185244 -210722 -80121 -41 -118673 -21130 -43578 28022 60934 -46193
23314 -188033 -111021 -197949 -139596 -85555 -123030 25618 -92154 -321833 -260224 10798 -29024
23302 94653 70904 60230 207261 -47169 57990 185920 -81643 -94222 145912 11150 22880
23291 22880 -226435 -430668 -25219 51830 -119253 -80589 -182482 89187 -56877 -81876 88803
23279 -119458 -76049 -153033 -61742 -252307 3558 -68728 37435 -203334 192586 -65404 -100807
23268 -100807 149804 -44359 -250552 -43875 127821 -81714 52418 -222581 170476 16343
23257 -182794 61963 156571 -261677 -463447 65988 -39013 130381 345099 -142764 -68837
23246 -335862 10666 -51179 -37100 69047 11898 -62131 -327934 -1933 -345111 102230 151430
23235 151430 98482 -13727 301684 -146783 159318 -84325 80158 16438 26294 78121 129911
23224 129911 115957 126813 -44942 -59141 -106236 -68741 351812 90643 48368 -68997 209142
23212 131164 80937 -202360 -330958 -110018 168168 214505 3256 100121 429702 -129471
23201 -162958 -16055 -399441 141026 -48321 -267293 265281 -256706 -179714 47764 78132
23191 78132 -122857 -76128 -82540 6799 -55462 50657 -19185 -41908 -172414 267677 138111
23180 138111 134615 -236266 -38693 231442 -35169 131384 -61828 45041 4202 89239 65629
23169 65629 -256493 -148424 97254 -131552 -108833 -56071 -288804 277627 -202264 -143045
23159 -143045 72610 203445 10596 179764 -298368 251228 112295 46223 -58171 -112339
23149 -112339 112675 42076 213313 -134492 133724 -145136 219986 -183495 106168 -206457
23138 -106394 -3966 82926 40626 -2005 84226 -99753 -256123 136508 359442 12445 176050
23127 176050 -38564 364316 -79109 78800 -108265 -38949 -26654 189482 63897 -49245 -1900
23115 27442 174554 -280700 193860 62913 -187873 -175513 347882 47172 -176910 -371782
23105 -371782 -95873 -51059 -29720 328328 -2272 -49831 154526 88198 75976 -262451 96247
23093 133322 -199391 107505 -110594 -30030 -31553 -18153 -167950 19214 -155871 -326296
23083 -326296 19438 -28033 146060 62252 -172844 -328432 43831 177370 203243 -9201 183064
23071 -50702 -239211 945 96416 13203 -139302 -68828 69026 -49402 -105847 -555296 150306
23059 -32654 92420 42973 50686 194853 -227491 148161 -41112 -118844 -35652 62229 -79064
23047 20138 -28389 183907 -44946 -109467 -94364 310292 43130 98589 108666 72283 -86317
23035 188846 -57731 128672 -39224 109292 159442 198686 466204 -265903 -53410 -263535
23025 -263535 -109308 275306 -98449 -10767 -77418 -78 132480 48570 -66301 131072 -118648
23013 313311 -349622 -129741 -173491 -258921 -150484 277850 291075 -51144 353002 -226980
23002 281181 70100 25670 -163695 -296597 -4110 123199 34186 -41713 -39550 -80185 -96368
22991 -96368 -84259 -366315 -135252 -60396 72606 -59965 -4101 -200396 181653 63961 173437
22980 173437 63968 -71179 118694 -293326 -136394 191335 1344 113229 -130411 432325
22969 -176259 -6292 -143762 -8499 67346 -219107 192890 -329056 100448 -121055 -6038 -149109
22958 -149109 -249553 -127728 116604 -161666 -57059 -96606 -154234 -75151 220714 -24634
22947 -40126 -155514 92468 -242032 254631 -217383 -189009 -256585 -351820 -168499 86767 -26507
22935 142624 5076 -329579 -180158 -75201 -24601 -179550 -228127 42150 645232 79256 -496194
22923 257848 -158745 16478 -114275 -6886 322673 64989 -49813 -40041 -147851 69591 -241910
22911 -197656 -95788 -19587 -76532 -154249 -52130 310583 27961 -99400 -193020 154555 -135727
22899 177876 -416207 -225621 -112966 57238 -208310 -253738 -128049 33096 -5398 -44334 -30199
22888 -30199 198956 357175 217032 -123972 69363 77357 -124837 -395090 -359514 67439 -229102
22876 258494 -182365 -128622 -47206 -266334 24023 -3338 -18446 -158570 -62082 -82966 -44169
22865 -44169 -480578 -79334 134423 234456 -30333 -63007 -24325 -3802 340962 -13113 -287419
22854 -287419 221996 149860 242602 -24145 -124745 -91185 -104932 29810 211737 -207133 -129678
22843 -129678 107569 112947 -79287 43369 -84455 333124 -171440 -248862 116235 157702 -456956
22831 -233255 -25424 3046 63136 -1892 98145 -105091 163975 -215970 -84837 -434632 -102845
22819 -5262 -121046 -241933 -18110 335605 125037 -89804 286696 -250924 -121654 179495
22808 -29606 -152299 276617 70204 -77810 80579 238662 -167428 -158792 910 -247239 143809
22796 -187397 43441 86745 205357 199363 228025 -39837 -14846 -200539 35215 441871 65374
22784 -85646 294731 -43169 -60261 -18239 -372813 28165 -183344 27465 64604 -391093 91341
22772 101468 52504 -6622 44105 -96887 -56387 123253 -307718 -57852 -102364 119496 -389410
22760 -303911 -74665 -89798 -390696 93201 4805 25844 -329028 -207875 245388 -46924 350883
22748 64101 -550976 -407410 -331920 -95863 179595 -1852 172092 -291661 -86440 351408 -313568
22736 167008 -184919 -349412 291896 -192508 -349137 118861 -294231 288249 -110168 93492
22725 -113054 -218172 -106785 -185352 -140716 -92284 -213614 169005 -258493 213650 134638
22715 134638 31181 286386 -22555 -228022 -9594 -6653 -9952 -24104 -183085 -364921 79776
22703 382550 -229671 -65960 -294849 61010 68988 229006 -395504 109738 311648 94803
22692 -50137 -97524 -171516 185254 172459 -32321 246936 240554 -204731 15395 -133748 -6577
22680 -287475 -197514 386129 63385 -80056 -76801 33054 -175783 -110659 -123800 -89608 -136892
22669 -136892 76056 199632 81482 -126122 -149078 -79195 228044 289991 -145461 -460119
22659 -460119 -210790 238764 325072 -196656 -63872 -91386 -85745 -196624 -137520 -217769 -31431
22647 78159 -85675 -90810 -193862 236641 223758 352110 -225442 206285 -200518 142693
22636 -316491 -403411 -262707 -403138 -31741 -197125 148831 102890 25785 -105712 44841
22625 215650 -151863 -188504 25711 203004 -157103 18013 43834 29403 -115860 -31349 -7750
22613 -145653 97448 -46654 140048 138341 -6421 -305532 -93455 50522 -214924 86342 255588
22602 255588 107117 37320 41655 -7009 -109056 -431116 113599 152630 -300566 110263 -32855
22590 380269 -164290 -533849 65664 -233766 -74301 -2736 -63280 -193227 -250615 182661 -46243
22578 -106416 -15685 349743 -410185 -150070 380926 -236268 -37258 189737 130849 -28950
22567 -311701 971 -192359 -128280 317193 310929 -392750 -98389 40791 -130544 450337 170
22555 -36817 90639 -276210 -284777 21258 -41152 5890 96258 35946 49283 -42668 215506 -131915
22542 -62714 -86076 -9209 379887 -190209 51466 -47902 23288 114008 -159186 136331 -167462
22530 -30616 -165260 62978 28393 281111 233398 232669 -154969 -43791 36202 118817 -264196
22518 -141144 175071 32046 -7736 -144171 -414004 -56818 -192832 59441 -155205 173864
22507 -178826 68276 -134065 23696 -29214 -97851 -274249 4645 -8251 -391089 -240663 -441592
22496 -441592 343676 -280810 -197194 112737 -9395 -247023 -272838 -310207 -56765 146271 110554
22485 110554 263809 83222 -47164 -70216 -42265 59207 36960 -17986 -302358 -206804 -84286
22473 -337098 -20692 -408302 -165132 190858 -175565 -90634 -54868 -8146 74981 -59444 -156470
22462 -156470 120387 -228857 197046 4644 -308489 -756 -26096 -236138 -131349 -18730 197564
22450 -58751 -132293 75721 252751 108198 -60988 26225 101963 -338897 -451677 71115 252626
22439 252626 -107406 227220 139869 -235059 -94330 48596 31867 -213752 18851 -185044
22428 88691 11128 51075 206437 -572630 235198 -469911 48570 -39825 131838 -321721
22417 -141945 129819 -198921 91619 -208619 -121595 -211977 206278 22170 117577 -89157 91620
22405 -411414 -263437 -231144 100563 227460 223188 120743 -178372 11485 12859 -304319 -186029
22394 -186029 -34243 -118822 -170503 -118566 71246 -344246 -17268 -152930 128242 -295525 -119783
22382 -248065 82092 125248 22933 -235111 -237559 -198717 -110617 382464 -60813 32902 123514
22371 123514 248979 -57709 -409257 -85130 -60043 105563 211207 19674 -59155 -118248 37107
22359 -25829 -371139 -85289 -72353 237493 -148768 -134416 187291 27566 -306022 -242981 -391600
22348 -391600 122191 -136069 118123 -205760 -36126 -6577 69210 -18853 -11504 -185412 18649
22336 -621 -259339 23635 -21184 169666 17871 -100488 186255 -71968 -68794 -144324 -105617
22325 -105617 -52565 65195 172580 145149 46857 142371 59605 155871 99543 76352 -81867
22313 33671 54246 -10438 -119247 -137242 -146299 130104 -8133 -3269 -321301 -112911 -208421
22302 -208421 -466940 -17437 269569 19166 -288344 77434 63667 -221457 157120 -160088
22291 -48098 69622 -126638 -200864 -84063 118340 -96024 60055 25213 -68016 -288487 141035
22279 316828 -223130 -69504 -59137 84523 -88483 176504 202599 338442 89297 228076 -266771
22267 308277 -283279 -391390 -359204 -90533 233984 155143 -13918 314282 46837 -48802 -14242
22255 -436881 -63048 88480 -34983 58194 -293666 -303090 12293 148248 77798 88993 -52706
22243 -202648 -256089 17098 -141263 -1484 75998 101171 -46989 -93734 83961 67211 81869
22232 81869 284087 -25780 206599 -87038 5328 -206050 -310237 -58820 190354 93686 -71015
22220 -268420 -175128 -301274 276966 183389 -99114 -55688 -49683 -259145 -88182 -235609 -169117
22209 -169117 211683 179009 -393463 26463 170702 12293 92854 -26276 118164 77972 295838
22198 295838 270459 -3278 -385791 -152499 15291 -6086 -167455 301758 79644 144442 -211680
22186 142242 -180581 -254129 119306 -33640 -163455 237959 -215063 -205463 -311770 -118302
22175 224879 -11608 22233 -45618 95807 -68905 148870 -163640 26412 11808 174999 -146967
22163 -141647 68482 -96861 302955 22994 -243759 -368675 48787 -283983 -211251 -188350 -183129
22152 -183129 48181 -117883 -228070 253829 65907 106730 39325 -48723 106880 -194887
22141 191264 -153006 -398690 48546 45062 -169841 -127595 -327674 -98462 -98513 -170342 151616
22129 -40584 -378366 196832 78238 93633 99291 -3856 -49711 -12305 395648 185172 -148045
22117 -180465 -79301 89365 2547 147665 -268923 -333504 126008 -229814 -151358 158526 -70154
22105 91834 -134962 -160013 -127408 117093 -195384 -97853 1873 212240 -88075 117614 183219
22094 183219 63554 108648 127154 -188559 113272 63210 159430 138545 -238791 -129857 74200
22082 -5319 -43951 -114628 44191 -10778 299266 -123875 -393058 4937 -150175 -116937 -140401
22071 -140401 8757 -333318 81101 -135301 143696 -37091 48983 196726 83129 320630 -52477
22059 229539 124295 -120305 -209376 -196795 -40041 253009 -58955 152017 -34044 -93894 -47515
22048 -47515 96457 2232 383871 156585 -6493 -35046 -124974 -248717 -453573 55732 84285
22037 84285 -73705 -183377 -209766 -227492 15552 149905 -119383 -172088 -124826 -48047 55978
22025 -72124 -109371 -384777 -151877 88574 -53889 -10037 147901 -147556 -70853 -217855 -395972
22014 -395972 -26806 -292365 157215 8483 -10616 326234 68824 166873 -46813 -154302 -179945
22003 -179945 -270189 119802 181791 124754 275869 -233291 -41659 93617 25320 -208263 -173589
21992 -173589 -123843 203899 106122 -190475 145124 105286 -124697 85075 -12796 209691
21981 21984 -30350 119561 61869 58819 7321 190664 -193921 214011 124208 -304191 -213245
21970 -213245 73854 333662 -108711 154549 -68385 -221344 -29370 138055 -57072 24961
21959 -513334 73510 -342355 92909 -300609 175814 -86834 241943 46168 -75414 147121
21948 -133304 -66565 -40468 121856 230485 66401 -164841 -39634 -230078 -70728 -52610 -146735
21937 -146735 -289249 -111498 -56629 -119085 -37941 3640 -12837 19018 94808 -246864 12846
21925 -55071 -330547 -57871 -172286 -85824 -63074 -53017 -107257 260891 -218856 260775 -127657
21913 -387818 -151928 86301 -225117 42600 -106061 -64003 -357983 55965 -186202 -46378
21902 229918 -34829 -282090 -60834 -95981 -107252 -354082 11162 15691 -385512 -202370 205307
21890 6051 -240529 168184 -221028 154524 -351139 -88623 -239897 222561 75540 227152
21880 227152 -283413 -73756 -58614 231993 -317763 -19784 254741 -240303 -135876 222650
21869 -248078 -70914 129150 -224693 255792 47348 -131564 166167 -121256 -201697 -184228
21859 -184228 208947 -124887 -197764 -35256 -124272 64515 -41554 113223 182829 165998 -94050
21847 89250 22211 -298810 -168804 315670 -51599 30688 -218647 -366059 -7360 -59767 116399
21835 -19187 -92580 -131836 72850 -258778 -246609 -98213 96558 101502 39787 84714 -261568
21823 818 -135580 195311 72142 69489 -100809 -301217 -157076 -107970 103303 -26872 -153091
21812 -153091 159685 -182412 -308864 154410 -13247 -5055 8900 161631 9081 -17857 -185430
21801 -185430 253938 109682 343225 20653 -342730 -165977 -58654 -68368 -126042 296120
21790 -232022 -193462 -150343 142758 -136237 -68166 -92115 134775 -49243 -308425 -85852 -59822
21779 -59822 96217 171208 128310 -106504 196906 157337 159165 -261365 -58404 -43569 129765
21767 -5688 -75479 98386 45171 98152 -103081 -144011 80896 -33302 116847 -288532 73611
21755 -54068 -229882 -48861 332104 65398 261811 -342740 -14393 -235016 189962 181572 22203
21743 20595 87351 55219 33121 147879 -68378 290506 115448 80936 -14974 121094 -76421
21731 41866 -198287 -86594 -234273 -132323 -97282 -217416 -52960 -424559 299027 43116
21720 -11147 100110 -104029 -217602 -642808 48550 -280469 13909 85530 -122760 1035 143998
21709 143998 102267 -112657 -236035 -936 122733 -56640 -21334 -98330 -114241 -439502 34451
21697 -204482 20262 -75073 -114572 142573 -148747 -282254 -227889 -167933 -316015 -45025 -27620
21686 -27620 -52515 -114286 -355147 404425 -145653 -246822 73969 -116195 140619 77523
21676 77523 -410119 -315142 -255970 -283018 36127 -41966 -23005 70972 -6134 -51137 53384 166404
21664 166404 -64008 -126022 -184723 11393 188136 -121395 -103232 -146819 -116193 51920 20124
21652 -224120 466579 -147027 -21418 108135 122176 235537 -28339 -620138 -307485 -53754
21641 666 -56385 -379260 -86373 171666 89142 -30371 58332 238812 -66171 -93434 -64273
21630 -64273 90422 21258 20385 -400237 -287803 -60975 229497 67180 -39169 -57358 -8838 120644
21617 -50506 -291679 -132161 -436636 -101412 235243 249595 -11927 -60454 113841 -307347
21606 156336 -162682 -155573 -64554 16929 -255547 -294207 -120456 202986 121308 106032 -179142
21594 381366 -63467 111343 -39626 -456233 -146292 -115807 131540 242098 169540 -148239
21583 -221583 36090 147428 -334954 -70997 66251 114216 17734 -77904 39863 -46022 115425
21571 -112346 -150230 83260 -31577 -325110 -265389 -376972 278405 35835 -187820 -172744 -44485
21559 -34875 202953 104727 277402 117624 120206 141787 -328390 43425 201706 280882 269693
21548 269693 -76822 216089 26472 112563 120807 245811 2473 -186823 -251217 -52218 97899
21536 -35379 -34211 -188542 136209 160715 -13430 -121716 -167411 35530 19703 -78188 -47958
21525 -47958 -23968 215385 -238761 -265334 -170002 145714 -60753 -73398 190683 78619 69381
21514 69381 -77342 -207203 103630 -131902 -401617 18254 -9127 154311 92748 -325358 45699
21502 26668 -91490 -129544 -87196 87201 58697 -169965 -58982 -20831 -32737 -210918 158953
21490 350545 94611 -252701 180611 -48138 -55164 -14935 225349 177329 -272815 -104740 -117055
21479 -117055 77105 -211007 -212821 -259016 -161447 -69599 136589 -232519 -164426 -106327 -56348
21468 -56348 163748 -207587 44743 -106176 81490 176367 207791 -141412 132979 197038 -216256
21456 310906 -91313 -180683 -32496 -74781 -174882 -206920 -5000 11955 -92195 -7852 507 -257721
21443 -47632 -385974 -209808 214859 -177163 20523 258127 575968 256972 43854 142168
21433 142168 170592 320905 324737 92023 71407 -66041 91262 67716 -73252 -2512 -109339
21422 -109339 -221682 80984 36286 140590 -168942 227607 -215581 -99612 -269054 -110306
21411 -369651 -198802 50908 -330450 -73907 -99469 72346 -131182 241869 20774 -55148 -151663
21400 -151663 107885 -181535 94705 -11087 244548 -278542 -47292 47664 -17127 95757 -5182
21388 174265 81188 -468792 29258 -127129 -309384 152619 290999 -179132 -25277 -259963
21378 -259963 -316876 1099 -144951 -241316 96027 11588 -79350 165904 61044 -133875 -177048
21367 -177048 100629 -32721 -277271 -171906 151243 83976 -33620 -88294 -300950 12625
21356 166031 177426 -119162 -266419 229019 204749 -271266 10498 62196 -367612 9313 92111
21345 92111 -284242 20601 -452392 -294482 184583 -202649 -55878 -29413 224538 -49158
21334 -23913 -39603 -150598 -137420 189916 -102642 -121398 33537 153773 -6151 -279909 -109443
21322 -19137 -4302 55950 35084 -126513 -75335 2278 -71959 -57526 -74398 -98960 -125503 -98888
21310 -98888 -85453 -43085 -79363 255537 -194746 -249226 -149434 12766 -122224 -49748 229627
21298 -146050 -176302 -147599 6222 -243146 92104 115708 5560 39421 -237429 27761 -111239
21286 -406613 -54075 -372561 -213822 -56298 155162 -165879 -297043 -47365 169605 31226
21275 -12577 149870 -100058 287262 -285893 -335138 -309044 177730 -120796 -379601 198002
21264 -148128 146113 82901 -153864 217841 -111410 -122720 -181507 15893 251248 -130421
21253 403707 12646 -163646 32682 172693 16334 92130 155018 -95579 -1842 46275 -47918
21241 -266696 -111441 32323 -85908 124205 111658 111988 335190 -117118 -133700 -151589 -41174
21229 -107761 -278192 -70101 54170 136905 57051 -137133 -99585 -445890 -213248 -242647 -345475
21218 -345475 112827 -194715 -210044 186065 -127063 67886 242635 228344 148022 42324
21207 -7905 -34056 90953 32592 183248 186176 57261 -511309 -254721 -246300 58032 -115626
21195 -196050 -151437 -110440 -117488 -127828 -339933 142252 -89605 -189086 154844 285720 9852
21183 -37342 -145128 119116 -112972 135996 -155185 202208 -129669 -72927 50679 -228594
21172 -181070 -89244 -248394 226352 -129896 128928 26627 -168504 195230 -121332 -82420
21162 -82420 -46887 -90880 37515 -58848 -236648 -70036 -74645 -85676 -146512 -383213 32559
21150 -277761 -68359 6218 41225 -18785 -104468 58435 -259798 -177617 -349878 34195 228705
21139 228705 -365479 -50046 107523 40793 -83495 202976 -98306 -57841 -290201 123868
21128 -197237 -449306 83528 169897 193860 17738 -83782 63354 -187567 -89326 -122983 -101261
21117 -101261 266320 -136288 -343983 37825 -176299 37519 206757 187246 -145434 -206156
21107 -206156 11022 199997 96080 -11637 25240 27074 -101272 -3161 -155526 -70691 -231077
21096 -231077 175278 -21849 -200927 -110027 193995 323366 35268 -205814 65508 136819
21086 136819 -75372 -136057 -344689 -100569 -50073 47503 198175 -100159 9104 -93190 -84258
21075 -84258 -188045 -121000 218886 -232746 -12803 -118389 -338864 194652 -38312 199278
21064 166922 -22685 -181368 -95294 -52886 -210284 -35026 -101331 20909 -99377 97292 182188
21053 182188 -200898 -89679 -211327 32211 147073 -115437 -160775 55424 -62593 -147166 111976
21041 290364 -133005 -223951 -402548 -94924 84214 35345 -53411 -47609 60444 -55727 166861
21029 -1608 182687 -380833 67186 27723 14773 54076 135102 61535 -180625 32167 -227355
21017 155745 243766 15015 -56968 135559 -52692 -331680 -294935 272470 100731 38066 120858
21006 120858 485009 21812 59057 -51131 107813 -323754 -348239 -22436 -108331 -235677 -56581
20994 -164512 296202 173471 -154742 226334 -150138 33917 -203703 -129683 153724 -40834
20983 -67640 274513 41750 -177615 23118 -46235 -151812 349888 -333663 -183979 -92484
20973 -92484 -59509 46606 -519472 210974 -34318 15174 223000 -292295 -386409 7266 3704
20962 3704 -262022 15405 6511 -81778 -83011 70240 -335810 -2322 -100852 -78538 -211074 275928
20949 -161482 -87271 -39571 137842 -29838 -235789 85113 -471610 -116497 -65699 -110083 -186226
20938 -186226 -45235 362703 -395936 -42130 48669 42154 -411719 -165971 -96347 199764 -111540
20926 -300090 53068 -122521 -125088 152621 104716 -54280 213597 -165483 -263795 27013 -242053
20914 2395 297036 107311 -115371 80421 -237284 6598 145924 157955 116260 -35626 -35939
20903 -35939 93211 89432 47006 -282169 145692 226132 -176503 -217923 89261 213772 268654
20892 268654 -230606 -211032 139302 -84294 -227558 -36269 -118094 72256 -156549 -33466 -429
20880 -64860 22366 35557 -259623 -315215 276393 -373391 40887 -27481 121965 -196847 323458
20868 -138424 -94040 107490 -167617 67849 -27722 -128205 163401 -109460 -107863 -165239 -251399
20857 -251399 -90993 -184964 -179828 -285691 -5022 11224 -213619 -19389 104653 -367090 -229187
20846 -229187 55718 -160761 -88005 -33969 -18116 259188 -160646 132862 -41072 -4538 81986
20834 -124841 -533340 -220001 -37809 -242957 7118 55508 68047 -213165 -332247 -297612 -154332
20823 -154332 -85184 -80698 -230213 -230226 -30905 -103723 -11453 30060 96591 9954 -114157 54273
20810 -2890 261618 -358551 -228209 -2545 -115047 -430268 -102252 72821 292621 99072 -55178
20798 65809 51680 -39074 -192905 -74352 -145298 -219651 29762 263414 -99689 -222749 -42769
20786 35274 227237 -6875 -301852 30523 135946 80231 170948 -49003 13212 -52969 242480
20774 -202589 156601 219463 -99440 -244526 -149696 47137 -404329 258060 223136 23002 145085
20763 145085 -162103 -47331 -104558 -346141 -100473 -179777 -139251 -61889 127552 -110712
20752 -279635 152342 -29850 -51627 68371 -173964 103824 371659 -110226 155730 122818
20742 122818 -121109 -125269 -309679 145807 -156815 253100 -70799 -49636 64361 119913 174822
20731 174822 144715 -114364 30019 59923 -88688 19736 171312 -34766 -12217 291767 138766
20719 154623 -3944 -329825 31944 301657 249772 -12399 171046 -220517 -170840 -206325 -32964
20707 -54839 -37183 188148 62764 -38855 2430 128775 40739 -316228 117218 57438 -147350
20695 -128788 -97613 55995 131679 -14417 -186856 42002 -137610 -41362 -150982 24579 -321476
20683 -115584 -22846 -39184 -261463 190888 312773 -156606 -35484 -235795 -41110 -167595
20673 -167595 49571 82883 61007 -71652 27727 -420799 -222016 68251 -197216 -41742 286586
20661 227597 -70955 -176870 -63293 34207 -333411 24462 436632 -131043 -79927 -78265 182876
20649 -94619 -307316 -103850 12284 -164839 156551 -495686 -293261 -203854 -115605 -231686
20639 -231686 -156217 135152 59539 -288146 119989 -106905 34826 20471 -62446 -100839 262598
20627 13401 20964 211365 -142438 -93618 142598 -461665 -70167 194213 -186269 96892 -132244
20615 -267628 107646 175633 -121109 -54292 -221582 25007 147176 -58321 -157625 -2785 -248584
20604 -248584 -245240 -94879 30239 27013 154171 -198732 106028 -26349 -2277 -95775 -70434
20593 -70434 -38115 -432759 -492526 -150586 -121338 51992 72437 217624 -200559 111158 168243
20582 168243 -350167 248306 289654 168097 -100772 198083 -32876 -404813 93189 -238356
20571 48294 -218054 114319 -128791 220095 -288840 182697 -46328 -140645 -71891 -101043
20561 -101043 -41017 -52003 -351905 -29079 108852 -216124 -47366 -48858 -82105 79567 -35223
20549 236494 -140107 138572 113413 -401887 30597 -65789 -239654 -151526 271586 -57798
20538 -65121 43603 4366 -70994 -173934 83124 -312857 -87164 79364 -183302 -307185 -58099
20526 -104064 -211123 210586 15 -5165 9172 -104801 -94337 44591 -141531 213462 -242164
20514 -222173 494864 -110443 -396129 127934 52094 89680 29586 52194 226466 320804
20504 320804 241081 47117 -59640 -158299 -198584 179640 -324053 -191920 85758 -274557 229732
20492 -220686 73613 2979 -123368 -272744 -4107 -260464 -53981 -377951 775 131873 -444642
20480 -244177 -483601 12949 -152920 66369 -49066 113744 28337 -18426 -30398 -320079 -148855
20468 -26786 -110732 -143454 56720 12222 -58906 -68977 164019 56607 288595 -15710 -122268
20457 -122268 -69663 -319702 -99862 150569 112366 112622 36162 203775 -330556 -132786 -157478
20446 -157478 -44184 -161717 73104 -28188 180016 -126824 135024 -187058 -47488 -57642
20436 -57642 -209427 4860 -181800 4423 38813 -41083 -46552 62174 153714 86842 139118 -164546
20423 -32210 -96033 27575 -280760 -361135 68145 -6020 -335147 -55741 -357047 57599 -210534
20411 -168986 -216252 -110582 211033 106424 -6128 -111537 -43272 225189 -60337 179527
20400 -140641 -164385 -45137 -253396 -9422 -217363 86684 -106570 -69090 46019 -76944 36151
20388 -183831 67152 -210556 -133960 -28283 -320608 -192533 -209861 159066 252169 -127612
20377 -79606 120813 -348578 -48595 143370 -216074 186991 -202984 -106248 -263816 -4018
20366 -288428 286085 -134404 -27500 -303983 88244 88953 171082 62250 -144444 -173122 -144132
20355 -144132 -13225 20439 -23021 206482 15877 -236213 -111498 -66708 -23445 93695 -201487
20343 40665 255977 -90307 -74728 83802 -64393 80376 -59795 -151151 -187861 -370340 -164452
20331 -38316 37009 -278782 33048 -144520 87054 -134372 -335424 161932 -164659 96678
20320 -2808 63892 -53474 9482 229618 -43933 -379630 75615 -287504 -37849 202122 -150296
20308 -162187 20499 218675 111731 -136730 -117330 -132569 -241320 -263955 5553 -186247 -81498
20296 35839 -250982 -224904 210572 -131151 174352 147854 -197479 -31813 -37907 -3314 -184985
20285 -184985 -369557 -100705 145190 66713 -356174 153118 -47397 333216 -52108 -118366
20275 -118366 -53051 -66660 -40081 -353696 75773 -186471 98041 -71240 -38307 -82449 -144094
20264 -144094 94702 -13836 206026 -53842 -249833 61106 272454 -172439 -189785 -160764 10012
20252 72775 -141721 50107 115669 -95177 -4883 34489 -15557 -40626 126287 -119917 131637
20240 -108716 18155 36027 -60180 -227371 -164153 -120503 -12788 111320 -244478 -209401 255819
20228 -4039 -276108 -162638 -134310 -230996 120761 115146 -11949 229519 127548 -190997 128932
20216 -83416 -13591 -51860 163916 113971 138956 137138 84026 43720 217637 -447180 26962
20204 -261151 53317 206797 -135319 -32921 32336 163531 -256616 -8188 -122424 -277339
20194 -277339 -303678 -134342 -132338 -36741 62681 278358 -45671 -56643 -86560 72569 -350449
20182 -172872 164091 -9734 -50963 -63417 254127 -129248 238140 -16884 -59505 -32621 44452
20170 -58547 38711 -17227 105357 -344717 147034 24040 111169 -355253 44769 142222 3792
20158 210584 -215159 -249145 178261 -548617 -119275 83098 -5531 -308149 53729 -55367 -289320
20147 -289320 -314003 -101927 -80497 169057 -99770 -116071 56250 29610 -213669 -141224 -255264
20136 -255264 109351 66880 -99626 -105675 -66296 126247 -86344 -213772 64762 -129631 -109420
20125 -109420 44834 -57989 -17405 -64001 8036 54916 184925 -152095 -57246 -324364 -51477
20113 -328006 -92130 -227899 -233800 144775 179639 78113 -151569 -205736 -108812 248273 -292218
20101 176411 -100817 -131594 186755 -104901 -170364 84158 -193304 -106972 -127675 -43117 -48314
20090 -48314 66768 23556 -106699 -247831 160 -65736 156798 158395 57460 40429 81689 -71633
20077 -214154 -58505 -59752 -153948 -20638 -25949 186054 -45094 -23730 -385039 75482 -374446
20065 -211886 -105110 -268464 -377855 75826 -42970 -306728 245830 -63343 412325 -117572
20054 -13553 161248 -360170 100880 -70699 -50394 -22784 -199741 -24692 -37901 -91102 79783
20042 -233957 -16906 -163376 131815 -76441 -11447 -61101 31648 -443878 -245554 -128099
20032 -128099 133982 144559 211882 -41533 16433 -66882 -7856 -125885 9291 -103618 -263686
20021 -263686 112236 -79775 -37648 -140996 -109903 -187543 142192 -178306 -87336 -315186
20011 -315186 -116878 -93533 -110526 -222612 245878 73656 -18550 105401 -158329 67941
20000 -279920 -274267 180061 -54385 -69952 -21087 10254 226830 -138650 -178641 182269 -101893
19988 -284123 -59691 151578 -70571 181289 181651 -240400 148798 49977 198430 266961 49790
19976 164509 -66116 -306892 -93820 84595 15130 179821 348671 -141538 92962 -32020 -42333
19965 -42333 57999 -174983 -147771 -177349 390330 148661 -358481 -72304 220158 -91820 49795
19953 100634 -12308 65762 -256859 -153682 117246 -377 -429451 -49846 -181850 -125230 -33870
19941 -128425 104795 -150574 252608 -26926 -39671 156133 -268855 -130505 53150 99180
19931 99180 159121 82898 -3156 21416 64645 -236717 166382 -250724 7749 55637 1933 -224999
19918 77259 262868 -223844 245819 169075 -46374 -6442 72323 -13614 -60965 -646882 140066
19906 33906 -165609 -33311 298698 197815 -4879 -98216 -176016 -92891 -218370 -182020 26844
19894 -145976 -36387 -13684 -272129 60816 -50894 369757 -368545 -118755 -107081 12513 -114098
19882 -432877 -438108 -145674 -58236 153071 42725 211698 124021 22797 -79929 76492 9560
19870 -31858 253900 -9264 -3450 133551 -335785 70343 -308198 -172584 -275478 -131652 138506
19858 -259479 -172906 139602 15632 -236016 106517 -29074 115625 -70270 -19877 -216121
19848 -216121 -47413 90806 -21893 -153281 -52011 -273838 -189535 177561 -48240 -253189 -356837
19837 -356837 66808 -39391 -333905 -11059 208852 -155347 123435 -176236 -151798 150420
19826 -120196 5702 -108525 -44694 -144277 107089 160340 -10425 180406 167954 -160103 -54066
19814 -19470 -1809 -34790 -91303 -380966 -121971 -81971 225460 -275012 168877 49176 -24921
19802 -355357 -137816 -55996 289516 64204 -17730 -257118 -247700 -288042 -103406 -83645 -86243
19791 -86243 -271146 -6972 76142 -370944 33437 -159237 2452 -93728 227928 -360856 -301496
19780 -301496 -135142 -167477 111602 -173417 -136478 -291186 205902 156230 -27669 -118343
19770 -118343 116107 238179 -243222 -383607 140793 21287 30374 -136952 -307326 69747
19759 -45895 -90417 211669 94621 -64811 133583 -73242 -228294 95751 -220346 43805 -37947
19747 -240204 12796 -302065 -71288 -235797 -96699 -19196 -135785 323306 -40606 172418
19736 53698 -90753 337977 -58436 186245 75063 -123414 168993 275933 -498329 -183453
19725 -158109 -102085 154726 260892 -164342 55097 4032 -128189 168790 101353 -94159 -39847
19713 324583 73775 -308331 -220207 -352527 -72086 -118546 -180883 18465 106824 -47346 81294
19701 -15312 151567 -103924 -52465 -48673 72827 -186037 142245 97195 117460 -142026 -51337
19689 -23019 -148174 97341 -190433 309357 -120874 21041 -42301 -110791 223733 -277303
19678 -291902 3237 -385259 -171493 -73205 14419 99850 255037 -59648 -17706 163412 -107328
19666 136499 -40053 97566 -171571 332009 -117656 -74110 186150 -212238 166596 -408670
19655 65296 -106995 -308912 -141869 65028 54554 52321 -367079 -256087 -275545 -127387 -365475
19644 -365475 27415 -189217 372062 14332 351861 149775 95661 -148511 -36359 -41170 -35402
19633 -35402 19453 -28639 -208743 83956 -107718 -180839 -62208 -399514 -33318 109057 28902
19621 -171034 -221096 -19349 92873 -73840 98058 -126529 56196 -145710 -94359 -114680 -12490
19609 170425 -27998 140669 6099 167150 227492 173370 -192225 -381730 134935 -132457
19598 -151151 -220371 -112506 -290352 -427193 -484511 -129822 156119 -62982 273525 -29188
19587 15956 135698 -373397 -153081 116995 35604 55288 -142400 -254607 290080 -109010
19576 147181 38422 233358 -89576 -91302 -14607 -14761 25647 -103490 -97601 -214178 -90382 100247
19563 211825 -187889 -134562 245889 68688 81351 -207541 -94475 -255487 14341 69607 -177553
19551 206927 -77708 -25673 -16097 33213 -166498 137990 -179041 48537 -45301 93108 117329
19540 117329 -284459 103220 -252616 -267214 -185019 -155718 118289 129385 26178 -108873
19529 10825 -403085 19930 201812 -210516 56572 196756 125367 161602 64122 81337 -280218
19517 113215 257050 27012 -66409 -47349 -53653 232919 -17722 -384582 -465375 144639 56846
19505 -82824 -297377 -141511 -188039 22282 -176724 -236219 -394398 -241214 -44185 4080 -207180
19493 22173 22591 84245 131326 124165 -216759 38398 -82521 -41998 -32203 -132612 -455742 46677
19480 -78131 -82402 108145 -148843 -539426 130032 95694 -105550 -103362 125269 -17241 -55681
19469 -55681 -104032 -191662 14471 -183911 25698 -65078 159572 -187007 22703 -229057 211425
19457 368054 -207890 -47207 -64151 -329651 260675 -54984 265768 -171677 -97524 -52059
19447 -52059 -22078 165696 -223969 -157584 -221334 -175536 -84507 -279403 -138538 227594 31781
19435 134326 13076 -149089 13349 -97926 -400008 -142894 76869 -224956 57725 -306888
19424 -153327 297638 140600 255531 -179904 150857 -60958 -304828 13821 75795 55160
19414 55160 8166 -124536 -40157 -121319 -393906 124507 3180 -243265 -79441 183975 109784
19403 109784 439160 11970 6829 -28786 -111554 106023 -15049 -72691 283180 -83437 -148703
19392 -148703 -17588 -136301 -64674 76961 151438 -70039 76833 -20005 -101826 -331804 147160
19380 82025 -240385 -131604 84788 -124824 -108881 262024 -129839 -252003 -31692 284702
19369 5179 -37934 -18663 359890 -388987 159586 70574 -79054 175313 -93647 -103157 39389
19357 129059 -263691 -61711 -345396 51682 3604 142432 -328492 -125729 -264040 -150832
19347 -150832 -254406 162127 -211944 211133 -35602 -247482 -106360 -152384 -42479 28792
19336 -374237 -84343 -195698 -245015 -296200 28701 -135743 3276 -137942 -296015 -106303 -204702
19325 -204702 216762 102966 81136 -160676 57648 -353028 -144325 -189557 -411256 23210
19314 -30778 9291 -303243 -123981 -79946 -76603 92816 207174 -93144 -305920 -36729 138354
19302 171818 -149104 150646 -74850 -150964 -32326 67341 -244238 -315955 -503877 -65455 -100713
19291 -100713 -151817 -145701 -300817 -163395 142432 -304170 -436467 116379 -236005 -25302
19280 209082 -62199 -31346 -203979 -413788 -266028 -259594 -12106 -83657 -348299 -264093 105079
19268 -142772 268058 -41459 13969 72884 -141649 -170483 121240 -13848 -290322 -32439 163839
19256 -128584 -147008 73569 47869 171526 204818 -205519 -196426 -459947 283622 -347152 -275584
19245 -275584 -25165 75170 53214 -116756 -297473 -98135 270442 241097 27409 8210 306996
19234 306996 -196530 -259551 -250017 -139495 -8443 -70589 -46385 -8412 -191186 -112351 -84714
19223 -84714 101359 114914 -264298 224583 -251029 -182295 -85161 -247722 36315 -1283 130734
19211 112506 314161 7682 -201501 136216 -118054 99647 -179617 -30583 -3855 -142622 17891
19199 34059 34384 101134 -148065 -266536 -138621 -295955 67692 -44797 93091 -104324 -400370
19188 -400370 -160719 -42950 355846 -14130 -184549 -82954 245354 -37773 8388 -77729 -99202
19177 -99202 33136 -270975 24017 28460 -5277 64857 -85824 -253368 138089 -11114 125726
19165 -103860 -164868 129149 125155 -81416 77671 -46501 -85545 67557 111214 -215994 -118296
19154 -118296 -269641 245283 66230 315300 -148241 -13804 66799 -101094 -122630 -181252
19144 -181252 -229806 -51873 -94845 -541696 -141574 -475350 -160408 -170047 -38505 -192104 425655
19132 -109120 -29398 -361244 202093 -100783 55340 -214577 -161169 45243 -61630 -119470 -116972
19121 -116972 219050 307202 17632 -305515 292155 110998 -4147 -68038 18724 -167888 -409431
19110 -409431 18242 -119700 61611 -372421 -26493 92934 57090 -23881 61096 -202329 -113721
19099 -113721 65155 10033 8732 -64761 8924 37096 -45551 146549 -30843 -323163 57714
19087 -61349 6010 384085 -408359 46398 -150859 -325502 370279 270915 175710 45024 -132596
19075 -364319 299050 306204 -70484 -171670 -319300 15189 130745 158436 107545 -165301 239218
19063 25503 -86495 114411 47492 -232082 -143253 -190962 -337067 84411 -275998 217590 397077
19052 397077 119936 144203 38293 -132741 -36662 -341171 -152117 50980 205285 -226134
19041 123890 -116849 178767 103178 152387 -320597 -216012 -171265 -146979 -202759 -54299 154473
19029 235121 -23582 87081 -181193 -54022 313421 -33143 -88673 217948 -396445 255474
19018 -178182 116657 -183429 -47494 -10496 10473 -114002 -12618 195334 -302173 -15079
19007 117082 -290967 173367 134540 -196554 54379 -6171 20515 -76390 -161513 202028 -252161
18995 -102463 -9339 -293248 -64900 -230733 -207073 -255482 48825 105339 116351 5770 -95962
18983 -51080 106405 -5325 -176528 -128217 119856 31070 -413321 -237593 -103562 25350 -115340
18971 -73668 233158 -339811 299930 -157975 -265814 -190314 330873 -209579 -286359 -197864
18961 -197864 -422698 -35813 -203772 -315670 -189181 155451 110557 -12407 35555 -9458 203995
18949 -68060 -199588 72427 329256 -66415 -207532 195838 -199499 -61648 -231787 -51280
18938 -216768 9196 31868 -445561 38040 -137410 -169192 -128311 -321323 -164938 86570 -129910
18926 -56066 32917 -259297 -175668 -11669 32509 -187605 -32073 -3528 -231486 330126 -186510
18914 -213119 -177248 75884 -246041 33403 -140814 -135499 198266 110638 -82846 -25963 -17883
18903 -17883 144273 42674 139127 232652 -102333 67160 286339 11104 174420 -12465 122135
18891 -30935 180048 140676 45066 -159949 25453 -146207 -149311 -478 -252807 -89621 -116794
18880 -116794 -8209 355723 26059 113873 -157968 -108828 -170934 -108288 -162046 13007 56748
18869 56748 -138164 79810 5336 -105492 -253445 86369 -311678 146862 63485 75765 -155887
18857 98060 -216260 -269018 141112 -52287 -218510 238581 177357 131350 -75773 38584 92236
18846 92236 -45857 -54465 134334 -89123 178123 29239 -7031 -87757 75090 142137 -177852
18834 109509 -227515 389745 -195168 -87014 -212600 -125696 284121 -359537 -154133 133089
18823 60392 -53022 -35669 -242269 148153 -81721 70804 -214775 167408 24965 -40470 -53895
18812 -53895 100812 165342 -8974 350405 -154430 138726 -91208 255543 122207 33769 -247037
18800 -4484 106285 151844 13134 161128 -323762 -92974 -124005 -64013 17830 62406 131668
18789 131668 -52594 28135 91920 -207322 252013 -145884 146288 -103471 -386365 79136
18778 -131674 57895 80146 -48030 23251 -75592 -106104 75329 224074 -350300 -185285 -202756
18767 -202756 -92732 -199267 40714 -87928 -156717 -292741 155821 -137653 -153045 140835
18756 -266075 182150 -64649 -260386 37900 28671 163432 51333 85491 -228140 -236538 151983
18744 161172 -6219 122570 88645 -360233 -93802 -268684 -227670 123000 -36272 -353269 -62849
18732 -168939 28840 -124728 -77619 -135248 199871 -180632 -132012 -74428 21064 112729 -150337
18720 -388638 -88845 -174060 -133649 -14317 -108319 -336227 123855 -106846 -48095 -64264 -26514
18708 35121 -158326 -87761 -84821 -254115 -390506 16603 17433 -140429 141271 -266819 -18971
18696 25742 -128110 309770 -421906 -341323 32980 -144585 -111230 102940 -128283 -322975
18686 -322975 3728 -210165 171189 -282119 -227093 -265488 12515 -257347 -56928 -134965 -76650
18675 -76650 -241042 -261155 -144901 -269434 -281546 -54504 7911 123904 -268412 140905 -215863
18663 290584 -90747 176493 -212946 -13082 -84805 -48976 159174 224327 26152 36457 20847
18652 20847 -133979 237224 -24461 -252503 -116654 128794 -348369 -111922 -190660 157211
18641 132850 -143278 -98915 -136484 -84068 -48172 -348050 -13078 10921 -190299 35160 -195525
18629 -133742 -63516 -52843 -285178 -214629 272604 -293631 13157 51856 -109108 19748 129956
18618 129956 -92842 -286464 -296892 131044 61864 -15050 69436 -97161 -74026 161975 -21508
18606 74255 -90285 -122483 -42393 25547 39731 -62443 -47274 -313300 74479 -69942 -16010
18594 -346287 -140296 212812 -119941 62793 -191628 -92018 5001 -169621 -149095 -38639 403141
18582 -285129 163405 -49917 -177283 -13024 14282 -14130 -231212 19268 -138078 -38116 26229
18570 -127988 82464 -131251 -73383 -28640 -316691 4012 -48149 -99059 178050 -95605 145277
18558 149245 -272681 -250313 23304 -128 -5960 206191 -371628 33799 23591 72317 -143907
18546 -342422 -173232 82917 -43481 149047 -142 -84963 323874 -87946 5169 -103813 -32959
18534 -200408 202098 -91961 -221278 -153129 -118876 55740 138004 98328 168357 78152 120949
18523 120949 266149 -139720 -197555 -245733 -91458 -253015 -80523 -6676 -229096 257975 -45840
18511 -331974 -107668 131739 -241025 -179430 -50775 365431 234343 -44054 -238596 50260
18500 -111879 164136 31563 -247887 -108575 -369620 335712 -111702 31749 227068 -302710
18489 -127607 64510 80120 -164766 14595 165828 -154716 -137504 47593 -27978 370496 2957
18477 56089 70603 135250 75786 -285757 -358363 -48396 -338102 45739 201219 -221331 -92640
18465 -98506 246924 -1011 -284226 -221436 -405735 -57091 -81987 141051 16572 30526 -67003
18453 -32708 -1992 -159196 -86171 263470 -186705 -263723 -6001 -285750 65721 277513 276840
18442 276840 119219 158919 194895 123817 -894 -179209 254392 -84737 -132232 -256596 -66949
18430 -23275 55750 -60518 162874 -238626 72559 -396240 -22285 -67972 -193167 -172123 93770
18418 14059 152898 16458 -52550 32951 -164327 119957 -24283 330666 -54249 166319 168503
18407 168503 124649 216178 255748 35527 244206 498738 16202 -88365 37258 130160 -138345
18395 -23602 53934 -257185 -38672 13063 118054 -2614 -23836 -382670 197787 44911 43833
18384 43833 -54875 56572 -26474 -136946 84812 -108483 -145707 -74721 248979 -138949 -143225
18373 -143225 181578 -212120 -14896 -159263 136433 50109 -130675 -312400 -156536 71384
18362 31397 -221935 370529 -25545 8684 184606 -351056 -77860 -163273 -86192 -62477 87964
18350 258079 -18768 187822 -23296 -216830 -21433 -97466 190156 -174560 -122007 81562 97748
18339 97748 -268098 -352880 -25958 -29937 -295117 -132838 -385222 -201609 -469459 -109247
18328 -288158 -10473 -106145 57704 -39914 38918 -123508 -165011 -136084 -3284 67843 83680
18317 83680 -200011 -77407 84021 -80519 -59069 252363 39119 -221147 -25832 -337768 -34891
18305 -119615 -141870 -203215 -184090 -72935 33968 -44413 -74557 158591 74135 -106409 74534
18293 -317377 -129922 -283564 7191 -25958 -56705 156520 86577 310918 -265627 -99430 325328
18281 68744 -33086 -198418 118810 266859 -146757 36245 -208805 -67078 242617 -362372
18270 -55690 -113303 106765 -43190 -206633 93193 65556 -1127 72014 -128900 -125121 -204061
18259 -204061 -203829 173847 67441 201554 -246769 -89419 -24445 -391983 -327979 -70555 49268
18247 -49116 16280 -10615 -119455 127441 103599 -5291 96768 -7798 127085 87967 -241353
18235 -36883 -268579 310384 -162391 47586 -190725 -324624 -83871 -204156 19321 -114323
18224 -305219 -116526 124666 80126 -32124 -80327 -128293 9866 9861 126296 106276 -161831 53266
18211 -88974 -66133 -63495 -84058 230361 38506 -238019 -240767 149416 86978 62757 -58627
18199 166117 365058 210541 -168012 134923 82143 58189 781 29513 -68944 222209 -247647
18187 -49436 -42831 177712 -42387 -122538 230123 34761 -23031 228910 -194071 278568 -56442
18175 197661 139243 118654 -244768 -87690 398364 91619 4544 116217 -67785 -194339 155
18163 -25683 -65086 102953 119022 76333 88352 276602 33135 -176379 195322 -114374 -47006
18151 62435 236016 -17273 103273 129954 -129659 -73818 -50367 87533 -10343 168129 -80987
18139 -134182 411884 -203798 176748 134769 72881 -114329 -13604 -136883 -75436 -315363
18129 -315363 262477 -16315 -4990 227095 -74620 -221975 -82160 -390687 80678 181715 64902
18117 325057 -16063 16277 114993 -173877 125546 -186258 -52024 145605 -144258 -268957
18107 -268957 35200 -293504 322191 205385 -160129 -225101 149898 172158 -44607 -2418 -358080
18096 -358080 32614 76055 -128638 210158 85412 -78172 -133930 199517 85071 -85272 -53276
18085 -53276 -258451 -18713 281458 15662 -148299 226329 247746 82465 -102879 -346834
18075 -346834 -53512 34306 -155732 51510 73424 -275812 -104079 -117676 -177315 -159217 -110923
18064 -110923 -239868 -232826 95654 -137466 -212764 60203 -117938 -257778 43599 -238752 -22407
18052 47203 -375750 -7203 -22934 136024 1763 -168278 109264 170728 27929 -139037 -147038
18041 -147038 86640 122468 -10069 -170749 -86163 -251409 96348 12237 27064 95088 36337
18029 186273 2028 -142456 256920 -82832 137798 160977 143548 96210 -109208 106636 184235
18018 184235 87786 -33989 47281 -54336 138480 297433 415101 -353991 -65470 41135 -240202
18006 -391209 -119787 -91068 36460 -178626 -92186 -67790 363795 145274 47334 -125425
17995 -173767 -67229 109972 241116 -4170 312219 -124025 126389 120771 -164348 -344688
17985 -344688 2720 210805 447715 -145164 78959 20841 -282892 49896 434208 -459902
17974 23786 -23831 163578 86676 247076 221638 -54821 -223421 15878 -2745 30436 10224
17962 68650 79245 178909 178595 -110702 -133118 -237714 87207 -46056 63477 -109464 -243126
17951 -243126 -146310 -113580 147712 -196280 -33060 157822 213323 446484 135684 -92583
17940 -61138 53997 -292421 259210 59284 -242448 -217082 517833 6762 372415 -85936 -113996
17929 -113996 -104825 -149701 -146280 194738 70675 -80675 -343669 -110393 152440 -185758 -153993
17918 -153993 109383 131812 -377046 322941 288811 -345871 90035 -175137 107690 113913
17908 113913 -63816 -254817 -126133 3280 -201527 -38242 -410251 11876 -221041 177577
17897 -218983 36508 169682 -166314 163208 -91201 26630 318134 -40887 -119546 -248857
17887 -248857 -20236 -66437 -17285 209145 110244 115521 139772 -216940 -113692 -403778 -56586
17875 95032 59866 240862 65027 -127254 100312 -94496 -97571 -6361 96860 232160 197696
17864 197696 -83135 65479 -10941 202305 395592 -64552 142093 -909 -30940 -59174 114504
17852 -231512 -78632 21151 15462 140649 -70166 -105800 -209425 196318 -151914 186122 -26379
17840 235898 90765 -175610 -212013 201014 174228 -104711 148209 124903 -275879 -386968
17830 -386968 -280722 287385 51001 84207 -34325 42668 -13151 352005 114059 122944 -91674
17818 -268270 18552 150056 -39284 337503 44947 -85320 -6625 166284 -185833 4144 -51239
17806 -107886 -404711 -64064 245274 198037 353854 -75598 138894 -452656 373867 -119124
17795 46505 -570838 -205028 159381 161724 39427 24693 215156 9072 180327 -2034 20769
17783 108003 -75251 -85827 -67080 -142891 -25367 -290538 -117040 133105 -210883 131056
17772 -21245 104294 -32389 -259908 -29827 -13388 247273 74056 -139930 318562 167215
17762 167215 79363 37934 -145615 17895 26048 -303324 -82836 427163 -55396 102257 -132461
17750 42759 31035 148262 -70235 -144235 -204793 -112103 276343 74984 -16108 33350 8678
17738 312761 -132896 215190 -166385 -281263 133 -174439 -235111 131095 -243712 87635
17727 18421 -167237 60965 173857 94554 80736 -307299 175884 156780 -254105 -160075 -11976
17715 713 30918 -31867 -40303 -108253 225868 8076 -41255 -131933 -172474 341094 -49516 46764
17702 -74300 -304059 -97384 -408776 -15941 -20919 252791 -94474 161280 255720 125273 229352
17691 229352 35617 -247259 -336798 -246450 37289 -10509 115010 -234789 170435 -41893 235791
17679 76167 -277240 -34663 -108553 541445 -79611 -83229 306163 395663 216746 19102 99157
17668 99157 -290785 36410 81082 75504 431631 -91537 57750 356194 129144 -48624 476964
17656 57657 131968 78471 208152 -14255 -192414 -72863 -80753 129846 265892 18460 -147979
17644 -37540 225481 -138374 49910 -141518 -8618 -99148 104999 41249 48099 -173590 -19779
17632 164284 279091 58667 179980 -157460 379665 90579 -28817 299682 111183 -11317
17621 -71422 -46162 -204302 -223565 3000 212186 -180174 260653 340774 80102 450485 31781
17609 114337 -23817 -121026 -54109 219453 130280 300281 -41244 83653 39712 133671 -108952
17597 -88589 -161477 282961 -58922 -132766 -143360 -31965 22128 130441 224098 36855 -176538
17585 -13827 -14878 126739 66105 226290 -174921 -172232 24901 -96626 -76512 -28145 -155464
17574 -155464 -300150 -16128 248538 136706 509340 159720 -284669 223857 331854 -56627
17563 -26258 442672 -180465 -273845 75409 238915 -35295 83685 -542409 39461 -40300 -135479
17552 -135479 -365138 83844 -96225 100192 -189013 60026 -178008 54382 -156226 5305 203424
17541 203424 -11185 81328 97672 -225840 -22513 449849 178727 42842 271647 156855
17531 156855 76408 99434 70667 348395 160247 139328 82621 292237 223522 236040 -253102
17519 -21043 -323864 70310 -70704 31100 137077 187967 237548 377975 -193465 214325 -141471
17507 182526 160985 169353 -155989 116521 101452 176779 141803 259549 165841 53194 68384
17496 68384 41281 -216387 7188 148185 161887 219336 103424 5763 123155 293445 99327
17484 241539 -207423 -89735 6654 115515 9051 -123475 290903 76457 -50330 208731 -183182
17472 -10039 224310 202253 173581 11224 369120 -34439 21567 -27523 77945 133054 -97637
17460 -60255 404525 -229681 152115 -75190 242757 -56762 249607 710261 289750 -30888
17449 110611 254686 141978 -24938 253255 219666 -90041 14138 -21408 -3913 225520 195151
17438 195151 304563 183707 428166 132917 140963 73998 89178 344210 360395 369417 2771
17426 102564 312612 -155929 25967 57848 48439 -7677 321537 139908 226494 155652 326114
17415 326114 455080 -15587 -83268 -32017 460331 179176 148247 49259 156020 170160 323284
17404 323284 360691 -145563 177871 -22477 -111855 313715 -14372 -11418 368590 206949 124711
17393 124711 380397 163395 -67495 110860 -34559 329655 110802 128187 35843 156380
17383 156380 185826 -138835 169896 -8481 224887 -60811 140093 53099 1356 29624 330154
17372 330154 203940 104350 96277 177173 15250 -209002 8691 -222305 88815 52139 282748
17361 282748 190316 -70146 370601 286576 -62693 81403 -88725 29423 -110336 80335 299421
17350 299421 418174 354140 -21311 148762 343833 102501 246735 -58545 -57815 266269 -123855
17338 428526 248831 -59927 396794 116046 320993 118463 473433 251375 179517 -55221
17327 -14499 -134356 405327 132466 241427 -55404 236269 -218283 224890 194685 300972
17317 300972 307290 177097 328504 68933 403203 14049 161847 348849 -44839 133146
17306 356858 162351 176949 15495 213608 -39935 -14515 -173422 171892 379159 267243
17296 267243 202009 -34223 235818 -11875 -163044 175644 144885 371030 -23706 -100007 -6461
17284 -44320 -45538 49367 291467 -66355 184524 380353 29881 181670 -97632 280242 381802
17273 381802 237417 99423 275065 -61924 5059 235711 30485 184206 -88377 292355 443955
17262 443955 -56170 118346 -6072 189884 123788 166468 192025 -7742 233735 109790 -143431
17250 9950 125665 204878 -119078 568615 158573 31960 -28806 155259 240185 385492 50774
17238 -144345 68467 76318 98504 62265 -35829 656663 597682 173868 566291 81573 251377
17227 251377 532994 304491 284205 -69133 508695 -103604 64079 212514 281236 109382
17216 289273 142236 -145365 62846 132605 164789 -34620 566749 496500 75049 212220 188197
17205 188197 46395 406175 272628 221346 135588 288719 221874 -58724 153038 39650 291102
17194 291102 511114 250852 421161 285173 259795 420928 392929 224579 113845 158466
17184 158466 125061 -135749 -111895 53152 203019 -84443 116434 132565 225227 -66507 406254
17172 152023 89033 295254 157623 180231 203664 336405 217865 313443 470415 118056
17161 427470 299493 228332 128502 280602 113398 406181 258551 655429 379891 7006
17150 192817 380104 453747 -31062 342669 95029 166801 308714 171923 228952 131771 399845
17139 399845 233629 -293789 352122 129240 450450 92336 346780 245588 286811 61412
17128 144161 304645 40408 354171 285431 179351 381273 598544 440860 731874 361250
17117 268600 173150 341811 114953 146985 214411 346022 368004 385808 191701 345735
17107 345735 350873 158497 765640 758699 251535 693631 137706 293548 239178 512775
17097 512775 283572 456072 472059 428102 353335 169906 193707 162363 299858 516665
17087 516665 610632 289908 474132 480381 563875 231551 176827 397771 152540 75804 241166
17076 241166 558970 40834 209081 230384 278884 478341 548616 435297 502914 981851
17066 981851 200952 635239 439002 567048 165256 535399 120395 478805 453379 218019
17055 388533 1467 450087 340502 444157 557863 757745 669293 256561 450206 530697
17045 530697 791026 784342 73166 462865 542295 437202 594704 842196 481585 630560
17035 630560 206194 909992 565847 206349 486727 727522 311653 407602 344313 372190
17025 372190 375656 714195 484947 462212 738101 908698 732249 504561 441501 816330
17015 816330 367259 777405 607371 432072 347211 462226 499788 557020 657615 632680
17005 632680 302089 695695 846032 328017 765692 677630 492399 664788 961142 559113
16995 559113 805694 769701 874361 590439 379134 379870 1016697 577115 844397 828167
16985 828167 579571 713779 832958 775695 927383 619878 951719 1065201 688826 962975
16975 962975 937361 783678 830456 942955 580204 794975 951276 1010521 1182800 705423
16965 705423 621568 859702 650006 805567 625228 796133 868308 754527 582377 900564
16955 900564 940154 823150 871328 751988 921734 601575 797080 976716 630692 853883
16945 853883 963548 854096 926593 953384 912264 886941 1065023 1022327 823313 1066824
16935 1066824 1144355 831422 935021 1065886 1368871 1110174 1127103 1162145 1017772 1031213
16925 1031213 1096574 1277594 1091879 1215123 1310302 1229122 1042663 986559 1272451 1331172
16915 1331172 1391825 1223539 1175568 1473366 1452383 1656997 1099912 1006345 1245217 1584080
16905 1584080 1250486 1362227 1390207 1602172 1418076 1464757 1267802 1515763 1306686 1436133
16895 1436133 1748474 1508398 2071494 1838818 1674620 1572709 1645217 1876392 1741325 1650287
16885 1650287 2145242 1827920 1962816 1488538 1980158 2013197 1902740 1918743 1815413 2378885
16875 2378885 1883229 2066363 2097999 1831598 2350561 1959842 1982227 2182931 2116184 2333149
16865 2333149 2255573 2515947 2338042 2546727 2077735 2498197 2554922 2698895 2646135 2582215
16855 2582215 2535282 2585128 2584406 2445498 2563570 2891114 3042589 3019320 2591960 2865902
16845 2865902 3079527 2994114 3087373 3140986 3468496 3329924 2974539 3414481 3156100 3227568
16835 3227568 3573564 3329979 3523854 3507749 3650814 3924207 4010971 3912914 3689960 4307319
16825 4307319 4242152 4254630 4263588 4513145 4198094 4473810 4299790 4477183 4652828 4505115
16815 4505115 4754753 4655284 5100067 5136833 5251007 5621524 5235050 5643945 5844577 5676900
16805 5676900 5681908 5998627 6297791 6057660 6232807 6500205 6610947 7085700 7018368 7300754
16795 7300754 7494116 7244349 8289813 7509378 8064843 8256624 8496143 8993537 8924798
16786 8924798 8775156 9545221 9675210 10276212 10006428 10519494 11213864 11344691 11659785
16777 11659785 12046515 12239352 12793810 13216000 13429188 14195868 14355281 15139672 15278616
16768 15278616 15686204 16270219 16847308 17459283 18384316 18987450 19766809 20384540 20868755
16759 20868755 22094636 22984936 23764125 25071248 25931202 26806258 28330790 29297509 30781529
16750 30781529 32379004 33697675 35299614 37245519 39374891 41286685 43194325 45474177
16742 45474177 47996938 51178359 53783115 57020748 60412853 64088861 67867029 72039877
16734 72039877 76974265 81553620 86485865 92144222 98219995 104438447 110827750 118321877
16726 118321877 125512853 132777072 140686896 148204073 155665880 162752551 169233155 175433157
16718 175433157 180431112 184175587 186830078 187967353 187617566 185915230 183090108 178631867
16710 178631867 173041046 166754326 159605036 152328133 144868348 136996894 128957667 121268757
16702 121268757 114077794 107059690 100403460 93978820 87963651 82500642 77369205 72521365
16694 72521365 67951392 63856319 59789195 56443503 53059974 50214399 47346969 44701282
16686 44701282 42235888 39717422 37737613 35774523 34127229 32305150 30892602 29180563
16678 29180563 27857292 26723261 25448231 24086185 23190515 22068272 21382574 20262476
16670 20262476 19652914 18765874 18139677 17227191 16524396 15823859 15824936 14869537 14313865 13766577
16660 13766577 13448695 13061639 12615069 12122196 11502746 11514341 11093665 10488450 10347348
16651 10347348 9587737 9305088 9152427 8905791 8977737 8495578 8040159 7771129 8084773
16642 8084773 7434723 7246503 7574240 6953288 6912391 6612956 6266235 6491977 6325072 5891035
16632 5891035 6182451 5794990 5673154 5232551 5077894 5253337 5049237 4985022 4796657 4816006
16622 4816006 4632612 4308759 4277861 4191361 4322885 4139988 3720960 4379370 4049146 3874088
16612 3874088 3404491 3432024 3812343 3619915 3610831 3205087 3686415 3295596 3202698 3331454
16602 3331454 3234519 3167499 2970600 2934791 2807552 2827386 2762434 2562732 2725950 2168487
16592 2168487 2665835 2596075 2436382 2428304 2437413 2411817 2189560 2372537 1999478 2134858
16582 2134858 2369444 1919049 1735320 2200577 1771498 1796991 1918508 1810489 2114682 1914775
16572 1914775 1645920 1597471 1516044 1732010 1563002 1443870 1646337 1623267 1836752 1542261
16562 1542261 1475055 1545274 1665409 1558080 1336755 1318418 1206508 1274112 1412242 1486327
16552 1486327 1517419 1309459 1134493 1498571 1277041 1615473 1310853 1348890 1342152 1048357
16542 1048357 1390918 1039352 1475593 789693 1417219 960992 1106005 1041149 1228682 1029164
16532 1029164 811122 878933 925634 1203349 688918 1164209 1040467 849928 889393 704487
16522 704487 950458 943244 948704 871433 1100501 783564 718440 942585 1043535 753283 841960
16511 841960 863243 1060370 748454 382051 740859 666917 574130 924683 732458 1174793
16501 1174793 575987 870731 887870 635578 835182 694322 961689 787782 811512 685693
16491 685693 386014 430846 716528 521228 611986 366146 478812 597174 315106 382670
16481 382670 510238 564492 857333 389782 511299 541324 193708 628622 313283 349313
16471 349313 667719 295736 188545 244491 255633 658067 544431 338357 390544 266291
16461 266291 689319 428780 163737 268784 517684 454737 412081 191495 694202 3579
16450 297208 548259 433707 587737 432559 457466 317909 613473 337314 369339 782153
16440 782153 446103 369916 57049 586982 446258 380333 355158 307488 428154 376101 359318
16429 359318 152563 478863 271396 106849 408278 58685 88331 125100 280379 188801
16419 188801 140464 320328 305415 133412 -92862 -5157 327153 451868 385258 138173 326101
16408 326101 15085 409478 534738 23784 15132 280402 135605 191430 125535 -417 167238
16396 459665 301050 44963 396738 263041 -27077 72362 31256 133663 -13822 367313
16385 375840 186302 327554 64292 126941 311141 323726 136887 447987 10799 193669
16375 193669 -137617 229711 -101374 148404 457849 -145385 -176929 65992 282031 42215
16364 -293989 371698 216308 127618 207284 131398 138291 239979 139903 218820 -105938 332004
16352 -229133 237361 -8873 276664 48640 456457 381092 174575 -11138 52183 166036 272590
16341 272590 262347 152561 501781 -58774 9512 305829 101767 -77273 159124 67482 -60056
16329 249945 216019 83547 150685 211786 183291 119224 74691 232884 65798 48552 -224550
16317 -76911 49021 -76542 -220777 63215 70615 143137 205407 123118 35044 117583 -21642 131985
16304 411207 -153279 -102452 320466 419772 -57158 164732 240043 340578 -5254 1088 -20141
16292 189363 -287915 104407 51081 -149800 569098 273042 69156 29559 84679 5531 63509
16281 63509 333104 -147359 164747 78636 163025 149962 50840 172003 -63534 391990 39217
16269 -301995 -144405 10900 -73954 -27046 283303 -182240 -144254 144659 -156022 43293
16258 -5239 352 -10375 272016 188771 188326 -22909 -10563 -117660 -130529 389048 256657 202951
16246 202951 -154667 24044 -123659 260452 144550 217844 53308 281681 141319 158218
16236 158218 -318484 -276626 15054 -76511 -181650 -138214 -302224 67470 -240489 15376 -54755
16224 76011 93716 62445 160482 -41053 169572 142584 -38158 115914 57294 968 -61540 117265
16211 -297274 52318 75125 142406 -70987 106407 50784 -70643 57931 -59603 -37703 -322496
16200 -322496 267470 166227 198385 -535671 -63120 -19950 -6919 225508 130402 -33949 3175
16188 -52090 3257 66383 -73153 -105360 -144994 164248 153755 -120083 69772 -182274 366463
16176 156268 -264496 -97408 320891 23681 -60490 -6416 -73591 375858 -175418 140951 139785
16165 139785 104869 68455 -168138 510000 255796 -228819 73717 -106778 -322086 33780
16154 -156925 -3638 29225 -335887 -87437 160165 -49428 264846 -75518 -28019 -152293 -258495
16143 -258495 -76608 -200898 120577 -16551 -136299 54905 -81972 -58162 -74904 -271680 47809
16131 59855 197144 -322394 19526 213221 72927 151314 -136402 58549 310561 88761 382977
16120 382977 -168275 -288594 61401 146597 -374720 -386231 -5661 -38580 92827 -208286 20259
16108 109333 126426 -179733 233633 -168947 163702 -103289 308533 -33043 137412 -42728
16097 -7256 56458 96280 -9759 148398 -301899 171708 -48956 18804 119557 31792 -6111
16085 149707 -107095 23401 -240462 -202736 357459 15217 -107973 197526 -165418 10095
16074 -510637 29603 514955 205931 122394 -77105 50931 -16715 -46232 -72117 -118430 -80459
16063 -80459 -273792 71900 11769 -253495 145884 -127057 -53059 26906 132062 224492 310629
16052 310629 -155267 -322241 -21072 -59687 -109626 -77718 119148 163779 -14944 -69321 204210
16040 -209304 -6817 -183444 175712 -22869 -158710 145761 -15530 -207540 210865 -192734
16029 -244849 49607 -168742 270316 290094 345456 -251079 2550 15590 -144487 -91115 -266034
16018 -266034 103564 -78192 -162435 59583 3798 -64166 144566 -27515 27455 84052 -232103
16006 103682 -7241 -389075 87398 -231470 221424 -97991 122089 -96142 -45159 -184269 -163999
15995 -163999 -131954 -84910 -247395 29555 -41583 219596 35804 -92704 77502 119115 -11907
15983 -117137 40300 339432 498559 292942 -129712 -43000 -146251 -56055 146320 49807
15972 -145880 -206537 -120864 -139323 -145828 -78644 -115354 7854 266922 -141914 -351420 73904
15960 89165 -90791 -136357 248831 16332 70029 -185233 -4446 -288911 -50086 -219436 -91563
15948 -232302 31937 32798 69468 204925 -442472 108424 -88746 170127 33591 310391 -220662
15936 -11687 159847 47117 264451 136760 -134430 -299540 -132055 -191635 -27212 27509
15925 -40745 -43024 121389 140755 -44209 -267300 -192627 -2145 20334 -49587 -52999 -53901 -100884
15913 -100884 -6967 -120393 -237214 206543 -28131 267022 -282762 -16242 23638 -339211
15902 11933 -505924 -178434 127253 -56159 682022 -120634 178977 -103584 -779 -270878
15892 -270878 149690 129960 -161202 263843 191461 -339653 27449 -496804 195411 70350
15881 -200836 -117163 -37247 -174939 -5379 4815 38035 -79736 65555 5687 114178 -198946
15869 121472 -127727 -4857 100838 -55020 -77836 66662 21789 45281 113803 19319 -164253
15857 -204059 316145 -25389 7196 264620 -202381 267689 84065 34403 -38494 45350 -336955
15845 -116157 -245714 54999 -5260 -307584 -34028 -274640 37950 -158008 120600 151478 59606
15833 174305 -96370 -153892 80055 -81495 -166784 81055 19148 242806 52960 66527 168320
15822 168320 68840 -79665 -197801 -144038 32888 -193074 37208 12486 -43916 9011 209791
15811 209791 -29110 412612 -121051 -81097 94579 215843 -226376 -126908 -119728 -88072 -48526
15800 -48526 58810 197017 14766 -406437 72717 -171705 -256130 87789 26795 -39140 144759
15788 340855 -79803 38579 -116841 -95298 214307 -17945 46272 -189242 -174268 41166 192430
15777 192430 -228147 -121875 -12250 -25631 193965 90248 -64247 -452779 156921 -165173
15766 -26974 191486 -110508 64219 -186152 -26190 -47572 -197535 -140168 -272844 -126811
15755 77522 -240402 132417 80407 19971 -104950 -72852 -41200 430 -112127 -171865 -142705
15744 -142705 370544 -7129 1464 36779 -251385 78235 49854 -61781 -102074 -124354 162136
15732 -140094 -145268 21212 -102335 -33566 -57573 247232 -82186 27497 -97816 -21219 9319
15720 -250253 -429961 -158033 56044 266433 -252093 -32586 -284145 245491 -184704 -191776
15710 -191776 145819 41243 43101 -170044 -247553 4045 -56718 -265911 -132978 -190464 -39627
15698 98597 121343 2562 121138 -111450 7984 72063 12501 -41631 176927 -71253 324603
15686 -118246 -48742 166646 -1858 -161269 -162895 -71354 55302 -207482 -148269 -41545 121487
15674 212419 -83859 -82659 339096 196902 -90375 -170332 332128 242218 267439 186028 -39918
15662 23962 397957 212437 -265626 -103148 -266091 -123610 55693 -144805 -126201 -105509
15652 -105509 17833 -115960 122522 -309166 -105523 30389 -123115 -154972 -295251 -61035
15641 216798 84952 -189053 -88758 21184 -192802 -2831 -50411 -120195 -141771 9701 -4979 -303629
15629 -303629 -7322 -77923 93450 -7645 -137121 -7594 -242147 -171886 4450 -225655 106116
15617 -88743 457729 53095 -244480 68268 -100919 126041 -20738 -66323 -74530 -86374 98031
15605 353316 -37744 108957 97752 -31148 -34701 -243094 -110942 -47884 -284764 -9049 -116578
15594 -116578 26459 69759 -394185 12419 82579 -113857 156012 66900 -233414 166758
15583 -78323 479207 4357 1371 -132433 218146 396508 -151680 276206 12896 -282931 -1286
15571 16782 97734 -355674 -81705 234387 -89017 -231197 -175050 -29057 399320 -36845 -45526
15560 -45526 261541 149189 -140351 340268 -298532 -112267 87558 -68342 110667 -242727
15549 117582 -140143 85899 -269030 -42471 -241885 114624 29138 -133972 127949 -114746
15538 -133307 -36693 237596 -8944 101243 -56737 -109335 -345007 -159180 21129 53325 215784
15527 215784 -7140 239188 -126537 -173511 26282 127858 -90433 165097 -95327 -187763 48632
15515 -75875 95851 90151 -132735 -100490 100283 3504 354119 67375 -159969 -46423 7877
15503 192502 155459 -209489 -40243 274978 -112269 -124690 247885 137348 164582 37804
15492 -58734 68901 -165374 -34833 44945 -220852 -194222 -263815 -160401 72465 151563 -27246
15480 231250 -309273 -17489 -44380 -345551 -33636 157554 15870 373426 91542 211147
15470 211147 191536 -372640 379529 -143640 -95413 -190490 83027 144507 3373 -8389 -109803
15459 -109803 -172796 -162251 -27992 -147907 24267 248655 -95389 79279 173050 -87726 261471
15447 259209 -30258 101525 -78927 107354 263962 415188 108229 -86328 27899 45537
15437 45537 265774 10436 -247942 347151 -184432 3327 319028 -30801 7052 488923 -140435
15425 -94048 -54107 -136098 70080 112146 -121732 -55397 -85381 -46372 19444 -310278 -29068
15413 -177911 -71514 405084 -155926 -195444 267349 69448 2997 -211416 -103046 401186
15402 134562 69629 -273538 74807 -208897 133142 -164 -330258 88542 -249260 103610 122906
15391 122906 -18555 40595 187199 149031 -134376 99929 337671 260649 -4845 -200757 196667
15379 -68793 -156716 -12910 -15484 -65379 352118 310607 -83568 -363003 230133 71046 4249
15367 25806 -32182 -129231 181089 -32161 190791 217459 -34321 99632 232537 -380160 -296733
15356 -296733 -317668 -283340 -137605 40669 168003 -147181 400829 -26132 -111856 63561 -177882
15344 -176166 -41773 -129124 -597211 -420878 139427 161627 95911 -92680 -148621 58992 -272524
15332 269629 -221977 78292 -187639 -149593 134764 27157 1800 -36424 -211123 208746 106011
15321 106011 15219 -194487 156583 114343 69454 278984 -219864 307360 -299220 -1698
15310 234229 211817 -77139 -319943 150457 30838 132985 68577 233118 79643 447895
15300 447895 -88951 -105739 -4201 -14149 155791 -143661 43505 -147062 67863 -130861 118156
15288 131415 88513 -161454 208647 -120848 263735 271103 -29637 89919 89526 392702 47709
15276 -23047 407092 -88960 33531 277385 95185 92933 -236207 -68942 24584 -89700 -150538
15265 -150538 46600 22743 -69882 135602 172755 -112378 267554 145001 253821 -48314
15254 -16842 467004 -42105 491298 2897 96418 673918 1386063 1253702 997569 1443583
15244 1443583 648131 331778 496441 140882 222404 348271 171702 -30144 250643 199842
15234 199842 130990 -60962 -12385 95286 -139960 -24433 42277 206812 -65120 -205202 137554
15222 101571 253817 71781 -20308 24405 240098 -46411 -224441 -2377 227097 90169 125459
15211 125459 -48954 246653 -43882 435790 -94275 496059 -61138 -20470 112881 286108
15201 286108 -156676 258261 96907 -117052 65773 64739 298899 338249 -52929 260179 643820
15190 643820 220291 -113931 97718 -93448 -64858 392 23489 52991 135708 187779 113579
15179 113579 112315 275429 451 353676 10601 -201390 29096 -149187 417749 251863 234429
15168 234429 -5433 166632 47243 360970 209979 -25243 160802 122770 428219 -40299 25550
15156 32399 -42260 -249163 138208 293745 142518 182080 -13020 76654 75290 -74182 176005
15144 121304 277871 -64909 119318 -317181 182826 -128446 190559 296374 -60216 13910
15133 -26089 -49681 159321 216653 299098 48416 152302 267075 111225 -70672 223457 -66963
15121 -202509 -187877 23307 66348 49474 203333 -47513 9746 316705 -73426 -236309 9645
15109 412351 164872 52466 -35474 237238 168457 -258239 181003 -89857 10395 159733
15099 159733 55055 289843 -181528 -274645 210306 168212 -193018 -198610 192267 170741 36789
15087 7542 -43283 127621 200349 291371 143842 148771 194970 -26855 88887 78401 222781
15076 222781 -68920 62295 -154685 -253425 -304874 23493 75172 -113360 -325337 -122916 69377
15064 -150759 56925 121464 113666 -100292 344057 327380 230785 228170 -109618 330060 207302
15053 207302 -189771 128664 14952 515913 44109 203435 -70330 431664 118419 193948
15043 193948 197855 561720 415389 167572 246078 240284 -57686 739530 124866 276710 82341
15031 89008 204261 205180 162499 302471 118381 212974 568848 252488 241512 207194 453872
15020 453872 322457 74951 -20196 155427 87930 90716 101398 444025 318480 227421 319637
15009 319637 416585 456141 142106 327459 381737 142180 -24009 166540 491878 424879
14999 424879 -50995 285747 109646 459352 150017 200493 -117000 204078 237088 314678
14989 314678 438451 160943 263101 182055 232000 192648 343341 337722 219383 55871 -79212
14977 264370 547508 338145 186451 -122539 178377 512605 274957 93178 160912 -40426
14966 137746 403731 216234 359344 -41223 659731 150882 380862 96526 448277 -47508
14955 316895 525996 89753 468073 153307 88550 269623 28702 191996 274353 309595
14945 309595 394035 538875 95920 153536 301797 198212 407940 538506 256097 52070
14934 303991 146215 455629 461535 299583 367475 600732 145177 400729 149892 101296
14924 101296 458852 347881 239515 109705 380836 347337 404101 344251 441100 300009
14914 300009 348206 494081 246668 610613 356184 657915 344848 309880 409674 518697
14904 518697 266538 464906 419672 236021 461738 346764 565152 362778 -24056 122050
14893 336507 549058 165235 700749 238446 277123 390608 45682 317755 381465 113417
14882 507192 578501 350814 486072 552390 428601 296998 449817 417104 305337 107650
14871 485735 366351 226736 251277 544540 65214 338641 278156 176136 338501 142064
14860 146568 62338 262078 219091 217546 215620 271189 231118 318029 462718 258118 622997
14849 622997 906378 347129 554422 450318 581714 135307 -116619 563976 300788 658471
14839 658471 426589 651277 755130 142071 366741 545633 289638 490956 293587 478435
14829 478435 678099 470301 558932 235576 395834 90921 343118 518135 263790 326816
14819 326816 663730 614847 611538 288959 683687 462039 484948 604724 545428 436884
14809 436884 168113 423066 651834 546535 446571 422308 612571 492611 704408 491920
14799 491920 561181 281897 183238 593580 399407 384126 97041 581740 417323 646829
14789 646829 492922 782488 648960 449200 258000 724563 900485 490151 567962 750246
14779 750246 463572 793766 867882 339047 548468 732120 650607 752912 587378 438839
14769 438839 593938 467246 683991 748138 513298 734613 616432 456145 384098 617196
14759 617196 487096 53000 860810 343406 530505 429341 451749 590558 517308 717019
14749 717019 753257 434346 344086 728576 636233 404678 874288 788657 878632 634566
14739 634566 743586 500252 659230 851564 447761 557870 373365 564654 709634 823479
14729 823479 621827 670967 668206 514969 459637 965019 515437 611894 737097 416465
14719 416465 786256 829479 656777 796275 532153 838123 778031 804377 802612 324351
14708 541858 601573 842284 741520 750673 849771 552947 1058332 710714 1102756 635224
14698 635224 872171 740324 1240055 677935 805789 882151 998634 1084365 425235 703747
14688 703747 889852 555567 898572 887690 907775 1139872 869820 841017 866662 923345
14678 923345 897991 853091 772967 1218531 1082419 625139 1419165 626148 917040 1121243
14668 1121243 1142893 981086 1006417 538130 1042694 1127608 926246 980758 1290857 762536
14658 762536 962904 1043356 1014556 1062065 1434177 1010806 1003038 923882 1048862 1214195 1250524
14647 1250524 916506 1119340 1160143 1088548 967036 1202930 838003 1326477 1267594 1390424
14637 1390424 1471133 1157889 1152795 1289161 1490621 1048302 1226957 1168387 1370360 1181204
14627 1181204 1250649 1119802 955944 1210711 979772 1379160 1333033 1260358 1296709 1347858
14617 1347858 1550101 1510014 1354904 1450852 1552037 1266641 1485080 1718618 1488768 1632826
14607 1632826 1531925 1515793 1716989 1717018 1609257 1419784 1497789 1620224 1581096 1703208 1781676
14596 1781676 1602306 1418258 1422389 1792655 1637171 1741936 1302478 1298416 1392240 1691937
14586 1691937 1569542 1689961 1821186 1610196 1709453 1611317 1771159 1928880 2024322 2378880
14576 2378880 1791880 1892533 2001137 2037158 1927676 1819761 2124807 2175080 2213466 2297679
14566 2297679 2206048 2088840 2272440 2329112 2175155 2416375 2820761 2635607 2762398 2513992
14556 2513992 2816699 3138244 3214245 3591408 4029149 4546634 5014459 6123203 9071537
14547 9071537 17679902 37932056 40736777 21884506 9664516 4851194 3044127 2252980
14539 2252980 2122205 1790573 2057804 1705900 1916605 1811702 2173767 2320405 1875925
14530 1875925 2124081 1910638 2458553 2005161 1852376 2188700 2067827 2278947 1923882
14521 1923882 2350903 1982038 2395022 2615107 2191744 2598296 2369828 2624665 2576370 2431493
14511 2431493 2598924 2837782 2520561 2694396 2892639 2680268 2863265 2950866 2851672 2866706
14501 2866706 3092197 2981692 2810079 3047160 2999564 2994256 2809499 3559583 2962384 3177937
14491 3177937 3220793 3345463 3315283 3131046 3618008 3413349 3598498 3462366 3344945 3867434
14481 3867434 3637566 3663361 3613054 3796469 3720402 3722990 3697238 3850130 3848635 3700744 3954263
14470 3954263 3945382 4085431 4198146 4145059 4054486 3918762 4163169 4178708 4402464 4308965
14460 4308965 4451252 4433408 4367913 4516270 4961102 4591039 4831950 4971598 4725944 4887162
14450 4887162 5021316 4907673 5297126 4895500 4992038 5199632 5353478 5462146 5417358 5465418
14440 5465418 5785899 5973347 5969191 5639201 5654770 6076882 5847075 6101229 6422084 6569377
14430 6569377 5991486 6606168 6855817 6888961 6663026 7083343 6807743 7181992 6988626 7131812
14420 7131812 7283815 7544705 7759368 7647489 7668292 7631486 8095003 8244238 8279582 8522368
14410 8522368 8865434 8465248 8890949 9009994 9050311 9654428 9237627 9512309 9557026 9640592
14400 9640592 10086347 10165596 9976226 10567027 10224912 10569305 10734639 10976638 11262245 11587537
14390 11587537 11684243 11919554 11764331 12095523 12475605 12490725 12640040 13255407 13051677 13599417
14380 13599417 13697452 14050244 14457437 14376457 14860389 15265265 15364759 15693319 15810575 16515855
14370 16515855 16864220 16819985 17302183 17799998 18070808 18385933 19027117 19215442 19740926
14361 19740926 20028987 20518807 20982033 21520691 21958880 22330604 22953136 23679086 24047750
14352 24047750 24733236 25199479 25616282 26380518 26913292 28061768 28427851 29258030 29920932
14343 29920932 30943657 31566484 32418134 33603475 34146959 35172690 36044351 36952980 38241404
14334 38241404 39390440 40475782 42000916 42772138 44231426 45570134 47037404 48527528
14326 48527528 50461240 51765129 53615581 55608603 57489981 59272989 61123255 63700994
14318 63700994 65751801 68313920 71249796 73851311 76444710 79755247 82894951 85806431
14310 85806431 89553967 93195539 97252225 101384347 106035903 110600264 115635076 120809238
14302 120809238 126188717 132136974 138279144 144600413 151761243 159101109 166837360 175343012
14294 175343012 183719072 192866432 202272986 212815863 223470727 234417372 245858261
14287 245858261 257870148 270489209 283349355 296507410 309846432 323041417 336143116
14280 336143116 349444871 361908963 373999772 385116892 395368034 404380033 411486594
14273 411486594 416695732 419344793 418312985 414005818 410101280 406815366 402758494 395692628
14265 395692628 387538447 377942977 366993909 355186463 342526147 329899806 315829725
14258 315829725 302216620 288415242 274630701 261745980 249415268 237457364 225818926
14251 225818926 214439074 203813989 194018012 184294445 175585259 166678237 158937644 151671127
14243 151671127 144711359 137875252 131387691 125033750 119822669 114843314 109767052 105093134
14235 105093134 100690679 96303167 92490891 88749055 85422945 82149813 78764876 75816991
14227 75816991 73000333 70443845 67641495 64928191 62655173 60485409 58366509 56797215
14219 56797215 54808033 52894235 51142806 49177101 47912952 46550157 45163388 43831004
14211 43831004 42131710 41134717 40091702 38713940 38234255 37406603 36090124 34624756
14203 34624756 33956869 32843094 32042375 31687943 30494097 29529061 28817553 28251957 27319712
14194 27319712 26712976 26470190 25565725 25116822 24326250 23719404 23371010 22319276 22446077
14185 22446077 21516859 21109090 20626343 20254514 19907377 19226299 19075008 18475720 18233104
14176 18233104 17991838 17288364 17005663 16681226 16552571 15978471 15737634 15803026 15512882
14167 15512882 15170488 14524464 14214039 14273209 13869478 13755088 13304347 12768889 13131005
14158 13131005 12969463 12428553 12103035 11978657 11835852 11539685 11453434 11111570 11106527 10979224
14148 10979224 10773805 10422876 10625256 10281645 10203241 10044609 9751359 9592076 9476618
14139 9476618 9043211 9298552 8830634 8874292 8665550 8592992 8558663 8562782 8327806 8087423
14129 8087423 8099135 7839068 7726467 7775318 7498287 7520106 7382166 7556345 6859548 7027035
14119 7027035 6706907 6646470 6999384 6769030 6760958 6554523 6792530 6421267 6298337 6276217
14109 6276217 6068711 6169273 6051918 6026498 5783993 5735917 5789849 5754185 5590699 5429018
14099 5429018 5426979 5385319 5501263 5120204 5518546 5064062 5059942 4928099 4838898 5286343
14089 5286343 4751272 4647028 4840711 4636144 4470283 4564101 4716952 4695245 4606107 4341399
14079 4341399 4431491 4560790 4569264 4243521 4409378 4261687 4314621 4360863 4017364 4225100
14069 4225100 4331858 4105518 3728023 4043745 3606016 3689509 3597587 3678732 3601069 3461432
14059 3461432 3525007 4009082 3929832 3357672 3448321 3244638 3383914 3404944 3461711 3306142
14049 3306142 3228090 3106161 2834492 2968254 2909916 3188521 2762890 2921320 3039024 2746682
14039 2746682 3227984 2985437 2827757 2908393 2845366 2582102 2802589 2755989 2790653 2786040
14029 2786040 2610164 2873578 2473173 2581305 2657119 2624074 2442750 2153863 2529062 2444550
14019 2444550 2448795 2209571 2487860 2052689 1968234 2272909 2378120 2311091 2248082 2060667
14009 2060667 1821351 2208264 2018899 2234669 2282673 1577293 1975228 1848033 1798171 1992144
13999 1992144 1857841 1961449 1836982 1913196 2192129 1714133 2105813 2011006 2284730 2346805
13989 2346805 2754420 4077674 10570179 30735024 41677049 24938257 12824540 7813494
13981 7813494 5884739 4458901 3960883 3433356 3071846 3083827 2569690 2695999 2798063
13972 2798063 2643563 2392081 2154225 2295650 2268494 2088274 2065549 2033239 2160628 1971928
13962 1971928 2028772 1955862 2025445 2046028 2047665 1732163 1987113 1757609 1937192 1862940 1561610
13951 1561610 1969003 1678137 1810181 1509295 1729389 1789635 1471042 1810024 1631409 1536348
13941 1536348 1555358 1478429 1737958 1636721 1403851 1839121 1278789 1641372 1415341 1448347
13931 1448347 1639943 1493603 1493628 1590773 1727982 1541262 1381887 1655517 1332753 1165474
13921 1165474 1348451 1366714 1303943 1359490 1415885 1358653 1348217 1427739 1683954 1466723 1185319
13910 1185319 1240264 1351758 1249305 1383696 1128649 1023947 1374544 1684330 1207090 1273251
13900 1273251 1149002 1305580 1356601 1441288 1161002 1015700 1113066 1319636 1423022 1001491
13890 1001491 1020489 589455 1369367 1069364 778127 1036195 1113285 950277 1068299 1074450
13880 1074450 828222 1290133 964931 975479 1093724 1131528 760441 1271251 1364318 1080445
13870 1080445 975227 1021434 1082397 828723 936563 994568 1152647 1093524 1246282 978974
13860 978974 924678 1130911 1098046 873737 870012 658427 1047550 943418 1135893 980547
13850 980547 1078449 960988 998694 747144 1010734 674249 930989 861545 994131 714221
13840 714221 964897 1061538 787012 1156488 586489 632493 785971 787562 964371 766838
13830 766838 692218 647170 990119 994065 897170 797319 708958 820133 751038 524445 758830
13819 758830 712810 932595 960978 786306 779654 891439 947323 752511 939492 712746
13809 712746 783551 937015 807060 956707 788689 505609 828515 566716 907856 895164
13799 895164 763200 616114 631840 726462 726621 669351 966647 455035 606302 814221 789837
13788 789837 854123 448812 335967 316610 769752 644837 788243 863018 427977 579555
13778 579555 381191 791237 518025 556611 534174 843176 720557 485219 476685 690082
13768 690082 587890 586591 550923 781571 343725 557048 674448 730379 551379 483741
13758 483741 521686 672316 333379 883494 351274 642823 842153 513720 581703 275364
13747 556759 474862 654567 181278 340638 743593 491221 248900 558184 638709 350341
13737 350341 456156 749433 522387 338864 638920 439471 226350 507344 577728 564288
13727 564288 798087 508179 769934 365614 462151 687013 537143 653111 681447 504308
13717 504308 361898 426680 747754 146525 394524 212692 624737 638311 500848 375625
13707 375625 658729 766182 549810 247445 449037 435224 668466 468317 768271 491857
13697 491857 769334 574588 363657 639511 494514 398003 346695 303153 330539 687856
13687 687856 488301 385973 75719 286389 271575 404604 494935 746376 273874 464937
13677 464937 337965 644170 437667 388656 408822 610500 473851 784007 488333 175413
13666 317559 533440 323849 499670 440267 282063 371016 270194 327505 125769 484502
13656 484502 675782 374313 646441 538628 167712 324788 263230 309130 832063 272116
13645 345036 99485 438365 420548 306818 460123 769392 198166 588358 359712 656029
13635 656029 374615 400431 232967 390040 375826 155159 200386 332482 441836 275478
13625 275478 282553 -177582 130903 445627 435621 360476 60268 334008 513296 241546
13614 75658 267475 299676 282402 274274 125091 206654 246145 367374 530786 207941 575408
13603 575408 628927 6641 324068 227470 358932 444594 238849 331525 107708 230860 464553
13592 464553 529316 330787 406945 184073 230273 415965 271078 361953 496446 142407
13581 327463 300166 153613 49099 588597 140600 214255 399661 313940 524429 366322
13571 366322 -216277 380389 527377 503083 416237 565051 257848 387190 78065 316808
13561 316808 324585 104068 197004 -15295 374445 269445 268715 272238 443873 437151 -28032 200719
13548 115016 -11404 252617 184997 208875 282046 246858 303390 707022 338841 262081 237023
13537 237023 136427 110163 270104 300103 166113 527909 147871 -14851 265374 128613
13526 304010 245376 198870 201583 116743 91497 42050 180513 360413 258406 347286 267339
13515 267339 -88524 237374 -98267 250860 299846 540841 310725 269016 324071 408686 203142
13503 420168 263731 215241 112202 295601 46849 130877 315297 180760 368846 293853
13493 293853 210645 209461 229392 460721 177566 361335 209965 268465 239903 -235654 49147
13481 286752 126765 278283 289691 88083 298331 486721 154311 166279 382146 167537
13470 312243 53742 -79614 132353 243786 310426 -208360 295539 257033 154567 114088
13460 114088 -5536 208506 103562 190997 219321 301389 177458 -44423 367835 1031 469794
13449 469794 252858 199070 316360 375813 122196 84336 104886 -61695 101493 138819 557036
13438 557036 293700 326132 54872 197155 12349 454500 -30650 -47821 48329 23014 357565
13427 357565 233237 190255 1345 351 -51335 135530 67119 232668 41144 158861 164227
13416 164227 227533 476057 288553 -294952 166527 156610 21816 318206 410373 149233
13405 138822 153184 -28175 188103 119822 -101623 363138 170422 142912 378856 222775
13395 222775 -89488 99669 180082 252087 114430 375758 -63097 428309 259177 262392 97247
13383 458253 92785 260760 164913 585467 -163694 265480 208089 -6720 297476 135807
13372 358579 324693 119577 147740 10680 10436 283191 87030 320910 -165182 222376 347653
13361 347653 196221 150645 -46184 6106 1634 137877 220830 231383 240116 143959 228088 361802
13349 361802 18055 303851 194374 271033 -122170 519762 586692 370663 257978 380627
13339 380627 392061 212059 43324 276796 6088 245272 104800 8589 72808 89114 207668
13328 207668 48854 351537 8181 261473 -47925 306217 240048 -3257 58825 217846 -105074
13316 87011 400350 194169 145153 370645 256651 330718 154667 112139 31457 267058
13306 267058 438844 385895 -157462 294122 219726 398717 157609 135933 -61960 61802
13295 -11203 87638 -181248 196860 176375 -16836 -23995 -410123 1718 -16963 77714 196488
13284 196488 41495 130392 -50319 268306 92891 151941 -63417 -22864 -12566 225904 108458
13272 -122849 27874 -51262 242503 109533 405225 -202854 158072 -131533 215134 -22052
13261 -46663 140087 390348 292220 155345 267073 20425 198925 184913 -223451 -161493
13251 -161493 136210 31550 204339 110572 -11412 -63602 77995 151879 -193101 21576 -163311
13239 21727 -327303 -138101 191505 58702 -151109 -49872 25198 -154194 118738 51926
13228 68797 355340 444497 146305 192364 227538 -14498 -262671 105748 439885 -44 206843
13216 163450 217439 243943 564356 193972 -188785 16249 9492 367467 -120306 128282
13205 295058 -267595 90405 -83206 -3045 -144843 -134345 123658 -11811 144438 152264 -74570
13193 271790 240267 349600 265744 146789 10891 -323004 18688 -80839 205492 131054 102118
13182 102118 175248 142643 24322 332813 -415470 241588 109175 99276 -70621 104001 334604
13171 334604 35077 -144440 83428 88729 330802 -190591 -67800 37705 -288750 321111 -88156
13159 45936 -18196 128464 202084 195359 -41643 151566 214642 -106727 240768 63227 68414
13148 68414 477996 106028 164881 -102755 -317863 94807 292382 169950 20073 -133892
13137 542433 -39979 153326 384476 -65432 -76771 -190186 149982 253119 95366 -21302
13126 372066 284093 -71115 4713 175778 -240582 -170209 82913 308529 -68510 148409 363
13114 340494 9371 74040 -200300 86960 -27174 117255 179199 -275002 36138 353245 127604
13102 86406 -26164 -93921 140320 288823 312515 465195 52779 215902 -480736 71681 -169404
13090 34046 -289451 25132 15012 -79294 347799 138987 239692 -5158 298383 379473 350776
13079 350776 291469 53360 162006 -71907 15407 -35652 -62202 366143 65156 125396 297766
13068 297766 -41850 216259 -274286 185858 -283309 88178 144303 179179 21559 -543115
13057 -8852 166158 -257159 66241 49785 212966 56612 228062 -34426 -74613 45360 199044
13046 199044 264492 263556 158985 255306 140934 102559 27229 114947 60980 -67522 -40262
13035 -40262 -374938 374196 58040 283547 145673 245169 136563 205174 -16149 156145
13024 -168904 -142923 -53068 147390 -9109 228444 208738 -78984 48439 120595 334353 48630
13012 354594 136728 45821 3352 364520 63080 -14164 72038 41508 22380 -28547 119615
13000 35262 -11632 95069 -53253 372233 78950 -115020 -251097 -144188 276565 -145045
12989 -218640 68582 -125299 120812 -23435 -153742 94019 -152245 106349 156469 116255
12979 116255 13926 135302 146994 152776 -26852 -292270 59596 119425 -22676 318442 -7454
12967 258048 -47096 36576 -14925 6675 273371 -82129 133847 -163664 -43473 -64306 148239
12955 208155 -543121 -62585 59028 -91682 -150947 -109584 468871 259977 -25897 -212560 -304333
12944 -304333 -124444 -84881 160675 -231184 -168796 -66164 -168981 -51725 344955 313467
12934 313467 -33117 218268 -55402 -181209 -18477 183021 175887 150375 -280466 164906 -270601
12922 57935 342344 -130728 -232606 125098 34770 35783 -465242 365676 -91895 107778
12911 93361 2873 -60629 -61920 -203567 73479 179597 -252141 -43352 -227852 -118701 117837
12899 31336 747133 133193 -81200 188741 -301253 -7094 -279688 179909 155288 -104771
12888 58157 7680 201179 291587 -247964 27743 505035 213072 1452 162789 -6835 163278
12876 -214315 -133432 95107 -190164 106577 -35488 98859 -86470 -6844 96719 78187 -51040
12864 -133838 90189 340259 200156 224011 155153 -135303 -62480 -61035 -54518 113749 -150889
12852 158290 211959 -220935 24125 -95662 -159460 430488 -251143 285304 21062 223895
12842 223895 291818 -42523 216866 73438 -345108 380338 28648 -172933 112519 -107722
12831 -57699 -89134 130184 365649 -24565 237384 179900 -88069 -107719 -94514 -140911 194034
12819 22082 -136613 81485 211149 175470 208725 -118961 -70243 33952 7864 46065 -233802
12807 107718 -11032 174297 -31018 -153646 -42275 -39410 -25146 -225390 98827 -312581 98738
12795 308286 332808 238539 30068 199377 226261 289415 -48116 -16998 62513 57901 44601
12784 44601 95417 -433329 165580 -137506 197908 -84480 122554 -95375 -215213 -78164
12773 164593 -170015 -178502 -49384 -3155 -60219 -52004 234908 63123 165686 91985 -34018
12761 1539 -89560 343970 57761 -39351 -232694 -83121 -264668 -273107 200457 -16406 179614
12749 267988 86174 101911 -192155 121150 247423 242701 -246515 185800 -68470 -2951 -212764
12738 -212764 -142585 -54583 107070 343665 6427 -105687 232541 -28038 242522 106953
12727 -45325 46830 -252541 -241329 203177 -64104 -156562 47246 78527 -81621 192086 15019
12715 289042 338754 -609 20238 157678 107514 175007 245914 108123 250573 24240 435207
12704 435207 -163629 36331 230013 338115 109623 283918 679165 -157262 -3493 87198
12693 -411154 309074 296301 -73590 62261 -135681 22844 164258 154550 -93844 -99605 351600
12681 -36872 24177 183530 57143 43107 241796 87758 55119 92048 122090 325588 -227620
12669 116116 30321 -24967 -38199 186549 180561 284972 205043 -149673 -123457 26275 66060
12658 66060 127839 126765 53862 -65642 159950 194770 259044 190423 101829 -140889 -94230
12647 -94230 221599 40780 -133862 -99274 -254010 128327 18802 -217675 -88128 82767 89736
12636 89736 172813 -122271 174180 28751 96039 -288483 181805 -13422 231129 340463
12626 340463 171829 105973 38966 120189 133074 235507 233368 -163152 159836 119329 -182340
12614 -63449 202234 -98264 -194791 20484 159007 174322 -267250 -3860 497047 -76439 223316
12602 -208270 -105292 319928 119203 69883 119550 -13622 51600 -63836 71235 165799 -3849
12590 -243226 -154427 81383 -172196 -43406 -345408 -69089 7493 -54903 311426 -240932 -98034
12578 -97228 -157810 -331491 -64955 94709 -40815 -42866 79806 -65322 67765 332543 -120918
12566 -72424 -73429 -80901 86097 226771 -44752 -64699 -120660 149182 -179396 -181765 -246408 140292
12553 -147939 -4427 138298 -134602 52528 318837 -210714 -5385 -395882 -219162 -55740 20373
12541 137202 17029 -57234 -15316 -267360 372915 -16759 135133 126083 10423 -42061 -204320
12530 -204320 -13383 -98386 16182 248496 -207458 94920 -270788 274571 211991 -17094 472841
12518 -118548 -81105 -109759 -188557 201152 -265952 124556 -238220 121697 57637 -101543
12507 60684 98330 110739 -8541 34892 -67282 155274 -172210 213758 315036 534 123997
12496 123997 -63667 -219225 -493007 46086 34818 -304701 -314255 23368 -106590 -143797 95086
12484 315099 -177009 150700 192775 -106039 92997 116283 66832 280193 -488888 187798
12473 -128127 -19805 94164 68740 -306656 443564 237946 19839 99264 -129996 145002
12462 -39017 -1151 -92832 -68226 253020 2416 99087 -13051 -178304 -17381 -234046 -93955
12450 73805 -118410 -28620 98948 113480 242324 232433 93614 -81918 -199781 -123514 -102196
12439 -102196 -180429 356446 132645 56568 53579 87099 -314439 -283257 -74300 -221420 60777
12427 102294 105254 -364867 490054 -153884 -65966 -39363 -361868 57456 248111 83632 254663
12416 254663 188502 156616 102053 -61554 -24142 310787 224541 -218728 -473376 -168311 127620
12404 -27588 126439 146377 467009 -91921 -155723 -92092 -184173 -97926 -235225 311856 172427
12393 172427 -114647 -193146 153703 -32862 -128120 28928 102951 -276829 -143689 135743
12382 276415 64343 -71244 -100012 -160317 162724 21311 49415 204520 -14956 -325765 54516
12370 -286823 -9121 -220705 86918 -157651 1853 402844 18907 7214 300116 -135999 84234
12358 -150657 32344 107286 -147056 -255657 -60289 112518 -150713 -48860 64871 -243067
12347 -26730 -287582 -44954 -55381 -29862 -80483 89364 -99155 -218838 19796 -114367 380612
12335 -15134 -379203 77470 -133668 33343 43107 271103 164100 22823 251183 71056 -375275
12323 -273733 -44309 92004 156889 -197854 232165 355859 65082 -226423 -101486 47576
12312 -155021 -85240 -251170 -243341 -209495 -99610 -294220 41878 39059 -136330 -127310 157357
12300 205125 95018 29153 -20348 -105929 280038 -214911 125840 150501 315819 582515
12290 582515 215923 106312 -43776 2737 43692 -200803 -74023 111367 85077 -94851 103229
12278 -195373 264288 303888 148233 -57935 -76841 597854 219630 -53444 224164 185973
12268 185973 290895 63627 140455 215682 -133011 96025 26272 106443 -433654 191338 201042
12257 201042 -149890 2805 243067 -8557 179863 114434 -107649 -157830 -178337 90730 -43600
12245 69204 240607 313208 159781 261420 555418 -230093 -66922 141533 271503 -275958
12234 20065 142020 -34731 -2491 -4905 437456 146503 169967 370378 195581 237647 264780
12223 264780 378617 164597 148283 -195279 182955 109613 242035 44353 249993 290317
12213 290317 65515 250626 173526 170237 134291 39343 376421 11243 -229036 46683 -67468
12201 2969 424361 -24409 122073 75813 191813 295972 162503 61396 -85233 -237126 -267771
12190 -267771 -158110 142444 222291 -129566 69414 108610 397737 37668 129260 257783
12180 257783 -180555 452217 -107271 168479 118998 259762 -224891 104843 164126 29499
12169 -105844 581385 494285 -341570 272675 -13544 21122 301391 -211259 136863 -204193
12158 -160303 13822 -244 143596 456230 46451 232506 -238384 -475736 75360 71976 -163276
12146 -38207 -89830 -143894 77456 105280 -106529 108921 439135 336438 -388407 -223457
12136 -223457 66642 417547 -397719 -95750 -95706 170200 -67511 -99796 -82910 75238 -12658
12124 -265762 79961 246763 -115523 -136549 -154232 32180 176493 79465 153437 101914 272205
12113 272205 -21597 40908 -368793 179625 -8827 -86215 -811 864 104892 -106902 -219314
12102 -219314 -66989 36692 98317 190931 195860 99667 -216947 -180978 75337 171722 -58385
12090 -194065 56088 160550 -113227 13855 146271 -207246 127594 -65187 -383877 135647
12079 -114774 -73816 265424 1181602 1754180 690094 471507 121845 -34696 119110 220523
12069 220523 -39768 41697 77784 -2138 30131 298836 39076 -204431 413767 -182171 203264
12057 118062 -13111 4500 -126831 304240 -9785 -27303 189948 192255 57236 359585 -84847
12045 -214330 -44013 133764 -263729 178364 -87601 24984 70274 -145757 99763 -65124 72736
12033 283576 342476 -64596 -198665 -104902 -369201 -124473 352072 46337 -10086 -211431
12023 -211431 222743 -24514 -169643 -147707 -109117 218432 124102 113994 -121754 -309662
12013 -309662 -211389 53529 -48378 352410 -129534 98887 221865 -80961 -371452 -49192 241519
12001 35629 13974 -263760 116461 37608 195593 25821 -11083 -89799 -142843 5036 -80326
11989 -335142 273653 288550 -619228 43633 -8792 30365 -38851 -142688 -19147 -90736 149993
11977 -241304 -79889 -178668 280117 -12388 127463 18607 248439 -396377 -185143 -430296
11967 -430296 130591 -6985 38064 -164659 100723 -250466 -138311 -178762 -105636 166285
11956 -548282 -188805 -74965 -150361 -301467 -40654 -195792 2705 191457 -89678 -173478 142668
11944 -69195 -373722 3789 -190165 -133170 5593 52799 -246949 -64706 188309 123625 17419
11932 -57053 72785 -105750 -204503 211451 108938 -182954 163920 -19648 48678 387562
11922 387562 -452074 165856 1484 166353 -235901 1203 67104 -343075 -88685 173904 -48473
11910 -385509 -106503 -19895 11499 110161 -138536 -70912 -65423 74394 -20958 -414877 172018
11898 -116082 -288669 -86294 -231893 -64132 156456 -185561 -126230 -115188 -51202 -97504 -65397
11887 -65397 -96077 -48169 -74423 -63733 -44374 -74645 27281 236471 -187337 -36188 32255
11875 118009 -139388 -314656 -154667 -55907 149625 27280 124607 35819 -172976 71906
11864 139079 321899 -155966 -264873 -3041 60842 80405 -81190 130769 53177 -27868 -289946
11853 -289946 -83779 108310 -359644 256114 -230162 30392 -9826 -459 132821 -135456 -13234
11841 -1658 -216184 -319040 -16011 -133884 89231 425582 -88074 -13276 172025 -153297 -7317
11829 36331 -132734 -49529 53480 69336 -95820 322043 -449958 -96458 -35703 -185207 147345
11817 -68563 -107254 -238186 176043 147193 -27237 470443 -61862 -157723 -34506 111296 68155
11806 68155 122161 -267781 -245113 43822 -189650 -13825 -81184 -305434 -253516 -32786 -106519
11795 -106519 -13557 -775 125168 21118 -291300 307916 156209 -54683 -62209 66760 196962
11784 196962 -60668 77951 71762 -467543 -129320 -38906 3301 2139 -73186 -219181 502502
11772 -14559 73907 38484 -205079 -197131 -146446 -265427 34376 106541 -179588 -125185 -70651
11761 -70651 463798 -352982 -146138 105958 -320435 202451 324214 -13006 -167385 227166
11750 12475 -178443 214587 150356 71170 -95138 -18036 306105 -93095 -3626 -169914 176261
11738 -67713 98589 -389803 109726 84392 -26572 99483 -332003 141234 -40540 -65028 178741
11726 -132660 347736 224984 266368 -457415 49971 217146 3637 137353 181390 -317094
11715 -201805 -49642 195690 3035 245462 13610 256842 190137 -193261 -298614 49148 -182180
11703 56054 59747 -240977 453947 -326810 143762 -380274 49135 302752 290813 -154200
11692 76257 151526 27460 54349 -113338 -120747 -73239 84226 17411 -343395 -163104 -5515
11680 52333 82338 16413 -44856 21540 -278929 126386 -210873 190801 -10556 79794 65668
11669 65668 38760 -271007 103537 153083 -87048 166609 -2209 -208290 -115563 217062 71768
11657 144726 -16551 -89579 -196529 -66751 -110341 -56453 283781 195636 5919 187332 328280
11646 328280 -155947 -170812 -31003 -216652 -57540 196549 168167 235227 -133260 175685
11635 -173754 -232641 106901 -118392 -71267 251537 -42206 26386 7547 239004 -47857 61342
11623 301902 63115 213156 -158176 -72080 -241540 200504 -129485 28455 -146108 -81364
11613 -81364 -179833 -13221 -59117 -318488 100241 143841 10783 -24043 139746 -164835 566290
11601 129473 -24754 115942 -71967 -146527 -269941 -117303 -290915 -125548 -171657 102332
11590 268513 72187 -45396 -103455 -59381 51533 -42733 218065 163662 137330 -73825 -150787
11579 -150787 116027 21410 318066 -210723 277818 35677 -376262 113761 57445 -92847
11568 -54432 -94996 42019 155396 156171 -172003 169478 198366 -302521 -215035 -360289 -101989
11556 -16056 71064 128676 195136 219726 -11432 -318256 -214395 5437 19112 101163 100495 16478
11543 -12451 -150101 -221687 -130715 18231 -21887 -343089 161370 378138 -43454 36419 155109
11532 155109 -119132 305060 30784 143183 313830 148994 -159010 184160 382683 115234
11521 60746 212919 61237 -6402 67135 326108 94888 319781 317226 -92241 112347 -88686
11509 189217 310496 26463 165402 353615 -124385 42527 424491 155618 87638 178752
11499 178752 10129 -35964 290699 91765 381317 -105218 409247 360446 107121 -52837
11488 -191276 48331 10737 2964 121650 8743 35232 305787 -88914 184151 148053 -123190
11476 224698 -120734 -103145 -93445 81681 132404 289051 199406 3116 263800 -264640 -201769
11465 -201769 406776 162464 340798 58726 121247 126003 198222 246112 249929 -110303 -89284
11454 -89284 -145147 -210267 26942 -204933 159285 186426 29932 -115731 -155256 -8305 184526
11442 348537 43313 -225396 25653 -198474 -42828 132342 181598 182284 -332698 -131455 -247812
11431 -247812 -82201 124663 290037 -209662 -380114 522908 -138071 -237285 -41347 -105294
11421 -105294 28131 223958 -208275 41573 -100141 65799 122266 159550 185768 -267170 -62853
11409 -51615 -166773 42547 -102646 114394 30177 75316 -203623 41338 -270404 -41094 54544
11397 21905 -220674 51746 -36031 -18940 -34166 -239275 -174913 -95077 -388337 5040 -164177
11385 -116120 -15562 -33396 -38365 -52602 -78764 -50194 -125125 -2261 276542 -72350 48887 -204393
11372 249560 -122480 -221985 141164 344616 -154257 -3187 39597 40429 -204484 250839 -259476
11360 -171103 33028 -111661 -268333 -44778 54060 -184186 -153904 105066 -44564 170963
11349 132465 49775 99764 2583 -30956 -10640 -158175 -101668 248907 -58130 115259 -253588
11337 -19417 -185153 -318526 293301 -102733 115464 14806 -179803 -119398 -156574 -58440
11326 -106395 -120705 -190163 -239057 -456243 401080 146891 -219526 180397 43900 129600
11316 129600 -221133 -22671 99279 -131483 218198 -258904 -296766 -60309 -310580 -274651
11306 -274651 38409 5013 530066 30450 -199303 61504 -54747 -411220 -146001 53110 -25620
11294 -356531 101710 -142910 -195674 -108620 -397217 -184304 -132570 -5508 79617 21444 -17734
11282 141402 35827 44780 -227827 16327 -145905 185759 -183913 -127524 -44211 -16576 -100614
11271 -100614 -311086 -141975 -19014 312964 99397 149914 -212762 -157645 59710 -260261
11260 -254465 -153589 69066 -224381 -38376 171640 88813 301857 -63365 10856 -185460
11249 56052 -18418 89294 -165113 275921 -76199 177576 -295743 42609 57395 100178 -258511
11237 98217 -47518 -137055 121323 -2245 -166111 -173023 64856 16582 84460 -363189 39335
11225 -95902 -39357 -79346 -144337 135309 118893 51894 10561 193603 -98584 75239 -56836
11213 -145564 -246371 -187516 -102824 -50990 -311176 146911 -166225 -68843 -76539 278059 -108475
11201 254477 144090 -184970 432917 -69534 99345 -85442 -16650 -195672 170777 -43476
11190 31569 -7772 -124248 106191 -115631 147797 298230 143598 -164014 -119667 -186369
11180 -186369 304551 -328498 -52079 -227781 198243 212232 -278048 -293646 -10759 -80621
11170 -80621 -53423 -201985 286165 -113255 -99462 -239575 -55921 -150351 51865 9141 -170205
11158 84733 257842 84121 -46973 -97916 78357 -130043 -189269 225789 50961 -247719 12023
11146 9773 -72147 -35543 128649 9658 40842 -5563 -8079 12970 57878 -163845 -214461 -44345
11133 265111 14415 139811 -4656 155544 89292 -92398 -120860 155345 -79503 83069 -26052
11121 298804 50488 -32349 272085 -280749 169070 -69443 -20916 -121824 -15949 101676
11110 15840 226685 239344 -193136 267107 4913 170822 7815 -70135 56294 87965 -294089
11098 -39575 306574 117931 9553 -78840 -341888 175278 -127239 88673 424344 181361
11087 156697 277726 -8997 36497 322851 146638 306522 -28006 -32324 299954 412148 64673
11075 369962 -128300 459803 -20763 -59572 454630 276563 384153 183428 -24089 -777 100466
11063 197176 363677 524053 406375 532497 472028 405500 418031 742021 428574 364495
11053 364495 623439 767933 733120 574185 431181 572048 589522 518813 480283 552693
11043 552693 268491 376383 243026 499280 820633 623767 488181 670736 462428 531815
11033 531815 676130 527154 473654 314905 578665 627685 366900 683814 617187 801099
11023 801099 450143 455750 684134 619044 591365 640014 434580 725830 278858 517333
11013 517333 181779 511134 503763 277920 865515 417536 732815 510625 286986 339247
11003 339247 136940 382471 536256 430220 669203 838362 463828 612863 455526 461685
10993 461685 820443 774078 633947 347052 1095673 317061 701701 368593 824415 1030175
10983 1030175 918589 645885 782681 710446 1029048 952899 1311822 1610842 1685051 1698807
10973 1698807 2103998 2410831 2299726 2218179 1991552 1780557 1847701 1546182 1557171 1351914
10963 1351914 971858 1077389 1396394 1172522 1277319 1672513 1568390 1339777 1728621
10954 1728621 1399152 1019124 947572 779158 789856 707818 782958 671790 149917 123409
10944 123409 121945 12001 226431 63160 45023 532967 332612 -28491 -7795 29798 223799
10933 223799 -112131 19356 56168 256560 -165668 -64788 113745 -55774 -214509 -174444
10923 -174444 90426 -350708 91973 238167 207016 185464 118187 82154 287221 171609 4509
10911 -263617 -42701 -267525 41126 -238006 -129100 -58129 148740 237823 187966 34567 -125190
10899 -139947 364407 44782 167773 -157245 -164379 -314682 6222 -133922 93554 -111880 160257
10887 36063 24898 -92588 58864 -130160 -219292 74515 -798 59968 -305247 -51017 11536 264425
10875 264425 -121558 180966 -255618 201655 83008 -17487 42885 76346 177606 -207929
10864 31898 -252510 -122966 90160 89996 -364921 -173196 -124329 -84429 -46272 8398 35490
10853 35490 -209833 -60683 -113116 -22783 -132688 -40494 -117889 -39258 -205736 191214 59838
10841 86807 -224868 -74998 114040 -11337 -115672 252406 -333023 -160074 -135030 84150
10830 -129232 -148069 -153752 -23490 -96305 40236 -31468 -90820 -83770 -339851 -64078 163186
10818 52613 -374003 -7127 62327 168285 -103882 328870 -205666 -139695 79407 -25364 157751
10806 104495 -5696 65320 25090 297795 25345 36901 -210883 -468754 36651 101680 -160758
10794 49816 14449 15231 145371 84643 -64885 -172866 249266 15719 108326 -107257 -113427
10783 -113427 -286603 93440 -3795 -224618 -181106 -110634 102141 -108232 -77457 -36548 76631
10771 41459 -29899 27662 43734 -357585 106043 -282592 62031 135297 23153 -42717 128996
10759 9693 -60681 -68124 -325966 283743 -17573 -179235 -163384 64911 -46335 -50081 115849
10747 95435 55051 -86318 -16153 191245 -17128 -79939 387168 -62 72386 185088 -88992 -21898
10734 -106546 98480 247147 144238 -53296 -38460 79095 -345338 -202153 29942 -74266 -69263
10723 -69263 -1940 74075 350817 -217166 -133937 68513 -36853 -56301 -328338 -24662 -20966
10712 -20966 -193944 170582 -127750 -296084 -247270 158874 -45321 -259606 -330920 -257935
10702 -257935 -138635 -9315 -259656 -194156 -54597 -89190 40621 -101590 -194736 -230476 123368
10690 -265223 -107574 -88682 -15446 -50572 -202422 14459 -121581 -58438 39415 -57198 -169894
10679 -169894 26810 -6082 -149733 -214427 380306 91401 -113597 -201927 -39591 -72089 163740
10667 -6653 28124 -260298 -35782 5537 -33574 33226 101428 -26830 -68216 -125509 80735 178447
10655 178447 -106896 -104666 361508 62269 -9449 372103 -168283 -2006 -69812 82313 15546
10643 150322 -248190 85260 123203 -193976 64587 96725 -269156 -238684 19116 72972 -69531
10631 100720 -198153 -105144 -55638 -413 -252799 -174437 -233089 -282971 -41685 -116929 373401
10619 -330563 62528 -398186 -277224 -78684 -230686 -107248 -42484 55057 -171036 17238
10608 388997 -22264 160115 -107589 -36422 75279 -137049 -190187 23551 -9864 -63483 -213792
10597 -213792 24579 -118942 108519 -97585 165492 -111049 128909 -209418 -214763 -379404
10587 -379404 -169542 -305206 193208 -12979 -133978 50015 115114 -191447 64502 -143122
10576 -257210 -318414 -96223 -26907 122711 -119137 -54306 125982 -176694 159659 -79123
10565 -270584 -108495 -302117 -187005 -309459 6099 -149928 290796 -114056 -14052 112145
10554 -335086 -161848 -172113 -296567 110840 99701 -243569 188046 -190115 -77417 210986
10543 -51 18504 109644 114855 196777 303197 -142201 -431689 -63601 -147606 -440106 -15528 -139833
10531 -139833 -40091 82585 -113045 -24431 346773 -23978 17562 -336746 68647 -160277 167735
10519 222566 -179432 134153 29445 -64549 227452 -52091 19402 -5083 -29320 -95631 -242046
10508 -242046 -256103 -175865 -33342 79729 4612 -308250 125622 -337909 -537868 255799 -83917
10496 127405 -14795 129611 -9783 -133927 -28872 -10196 -158043 -27443 122041 255579 -120707
10484 -141590 195406 371640 179341 645269 170930 228884 172942 24601 158520 29745
10473 101964 115176 -39642 -9571 42097 10882 58621 21323 -97640 -42788 -79418 207791
10461 123795 -156927 324204 -62649 172860 -296497 17369 349166 147215 -508774 -123514
10450 -136262 173329 195310 9329 148884 85319 -331966 39484 -11754 -145424 400174 152050
10438 112192 27822 9949 241490 87369 111560 228373 -164335 -61105 64588 31894 104884
10427 104884 -74073 -254297 178981 143086 -31436 121720 -253262 2501 194391 -234563
10416 -111370 -131684 -182880 -131359 -219020 -187888 -49746 -120640 66897 -105195 -276257 -280817
10405 -280817 -312074 -128592 89936 -221649 -164795 -59758 214027 -224221 -19467 -235913
10395 -235913 307325 62673 130052 77799 88586 -25216 63253 133439 256690 -129985 216826
10383 -91096 -68835 1439 51640 -39107 238543 121027 448073 -110100 403345 245575 135631
10372 135631 36058 362409 435504 92599 263224 224051 494100 431848 290874 147926
10362 147926 53358 355649 205385 -84931 28656 71782 47222 220627 237956 296252 489709
10351 489709 547407 470281 603086 144017 358037 351053 195278 221384 214984 -98400 21716
10339 256278 -129175 420820 64989 196033 123786 294739 39684 182494 71195 138195
10329 138195 327283 -66785 213515 107373 136492 161890 40626 218564 186226 308940
10319 308940 128452 16260 -148921 248607 266372 46500 206537 91846 -15397 346180
10308 -71774 -83140 -83734 -100491 51931 230234 210784 -41366 -94210 -42460 84991 185781 164199
10296 164199 -70860 99995 -31710 57075 -30327 131697 -119371 269815 50762 62527 -195592
10284 -115322 358495 -584682 -121031 377968 -270522 -282583 -10209 317293 -245308 -295682
10274 -295682 -46343 121501 -132276 -50299 -163055 29763 -62530 -29746 62879 -76118 33630
10262 43622 255929 472937 -141829 47940 124848 119417 15213 2535 60937 85230 -381430
10250 -174385 78621 406036 -212997 12695 87526 -162586 177429 208897 -315453 119089
10239 -114234 -28422 -101461 19461 -14271 -54247 -181551 -239395 -29767 -112605 -3164 90297
10227 65825 -492952 -109186 330511 129112 -62047 49491 -39580 -17949 118432 62647 -110843
10215 220361 -108866 144267 -123555 49527 -12030 105108 -417 -200200 -225843 53217 -201219
10203 108376 162216 -75054 252594 -197425 257324 5753 -71604 -45889 -93869 -82292 125196
10191 169022 -262295 -95524 -229961 -91586 11127 6303 -8350 -316270 -265132 302978 34932
10179 65219 -37027 -333891 293941 -146541 283200 86973 -144107 -153814 187932 -130156
10168 7073 -94293 160754 -196622 -34941 184998 -221383 153432 55233 3265 128532 169772
10157 169772 28441 52459 -162548 -229729 68522 -224367 -164994 -215620 -158959 49024 35158
10146 35158 -107185 77864 -459678 -172305 76076 -258822 -28093 224579 -44080 199474
10135 -29173 125550 -114977 -56985 -498333 -313444 171098 -339724 -302446 -20274 -340605
10125 -340605 278221 174173 -146862 -55076 54081 -53459 -220492 -28098 -224751 -224624 -130038
10114 -130038 -166295 210338 -172703 243210 -84480 81804 130445 -353933 -242801 -171224
10104 -171224 84744 -111430 -409503 61438 -371282 -113276 -125557 -257577 -590077 -30800
10093 130631 -42897 209031 173543 -321317 -303759 160204 -20899 -18979 -52122 23021 -64751
10081 183857 305857 34622 -298450 23767 -246815 120669 -90567 -74235 79884 -13858 -268084
10070 -268084 -181716 -210292 54700 152274 145767 199717 -107763 -133923 -23227 15543 -200563
10058 -202620 -85587 193557 90681 -142019 -157729 -103836 43077 -96748 -272871 -81696 -156899
10047 -156899 -94567 -164112 -54844 -47690 -43259 -181464 -55794 -161351 -246474 -77329 -77344 112769
10034 -85988 -262347 200261 34947 16521 -335357 -27241 46500 -124179 23758 56985 -57980
10022 193956 48513 -27993 -96567 -99322 -104531 -447332 -142456 -83207 -112406 -134275 68193
10010 -2861 -262155 -38249 -198304 -189032 59336 -274117 226679 228990 -134454 3088 76956
9999 76956 -32929 -147359 411801 -183293 -161580 -193262 155778 -93018 -124235 -224528 -346127
9988 -346127 147536 -148727 -133569 127987 -173667 -26250 310431 -129906 -129599 64452 153724
9977 153724 -112089 113649 -65427 -101846 -77650 -99593 -150562 -31772 144165 137766 -94990
9965 -78163 -277060 94488 65273 -131104 -41588 21202 -96890 247866 -137915 -206327 4875
9953 338106 -13274 93599 -47351 -8885 -66880 198168 -305596 39946 -47033 -181065 -16519
9941 -28800 4388 -232544 108288 -203531 75924 -124883 -156061 -127246 26694 -63168 -57151
9930 -57151 117180 70253 -215571 163796 251863 -221466 142678 -181393 -157552 -57840 94883
9918 -22118 48226 95723 -144874 -12640 -102462 -342360 -98014 265303 90462 178478 -25356
9906 21031 -219507 -33254 315025 43201 -43144 -224278 18820 427589 285629 -164851 -80386
9894 -532583 -24263 -49771 306552 115374 -286416 19137 -186339 234936 -369422 -92729
9883 -9588 -489174 -155921 -357772 -85675 78656 167013 36307 156197 -280864 -106362 468321
9871 -177781 -25775 -144201 -216889 -95397 -94398 -468647 111895 -313128 137378 -95152 259452
9859 19376 -372269 376064 -114236 332429 -261918 55431 -269238 -449939 -64515 -11271
9848 -43778 -54953 -103197 30943 -132238 -208090 181199 -56223 -37143 42803 36110 -170004
9836 12702 -72500 -399963 -66209 153671 211989 123491 19495 -43771 -232803 347722 -6275
9824 -3948 227086 293967 -345126 152136 -82783 -325833 -232514 20420 -58958 -58386 -262245
9813 -262245 -114206 -85822 -382455 -229772 -308345 -26569 304707 21722 -86172 -144474 -69203
9801 -117133 -163121 -368099 26872 -470787 -136497 -103942 49519 331248 -145263 -76322 -61265
9790 -61265 -40376 79627 -319020 -109577 -56422 179264 174318 -310666 132842 37370 -154604
9778 -181293 237749 -88352 76556 -182524 -212557 -73821 -49734 -12024 -140164 -276220 84589
9766 5973 64112 -100829 -312481 -92565 16897 -265778 -167323 45860 12528 168974 -122765
9754 -136306 -99702 110600 -255659 -278393 105657 -79016 -63350 -191116 -62627 -92521 84594
9742 -230286 -117477 -270663 -21270 -179085 -249645 118089 139512 10766 -89140 -293845 -26013
9730 -261822 -289118 -429664 -100406 16274 -195523 -157796 -222378 -130840 -239066 35670 -105877
9718 -116024 143195 171731 -334155 61113 -113788 -120799 -106522 30908 62626 -108197 -77699
9707 -77699 -182984 -218866 40301 113990 136448 320011 -226429 -150182 -366379 -171353 108569
9695 -63646 -368164 10188 112450 -104497 -462971 238057 120188 171024 -145368 104269
9684 -197474 291450 -271101 -263910 116767 7555 -67817 7256 -16884 -133575 -165238 -136641
9673 -136641 85191 235773 152199 -107689 -151479 -14307 -102849 133222 -150182 -105915 72069
9661 37600 134841 -294343 -145918 -99096 -5324 -234911 -67911 -64131 19560 -29484 -298048
9650 -298048 60094 -168930 -183621 -193643 163785 -549309 284186 63938 25650 -19020 -63697
9639 -63697 -304991 112832 337426 -349630 44670 -9064 111394 55374 230529 -132157 89181
9627 206859 -291346 201697 -183937 -4583 320995 -46960 -198659 -228159 -167717 -8214 -173460
9616 -173460 -281606 -196659 126789 51231 -168544 -123835 168226 -509561 139768 138117 -21548
9604 -160967 198956 175629 -36752 -191695 -61071 -354815 86023 -364102 -115279 -572786
9594 -572786 -211437 -57178 -265748 -302479 -232306 -107050 -44701 -158833 -165204 139569 -157789
9582 -334054 10655 46796 -331350 -306617 259237 13056 -57211 -88669 -63370 349875 -213179
9570 -448873 263853 195275 -203217 -328188 -180954 -91093 122124 -115125 -190512 -178826
9560 -178826 -71511 -457583 -142804 21827 -272878 160973 204448 -67080 -79495 180914 -160668
9548 24467 94890 -149645 170283 -185217 117750 -100731 -20795 18398 -95767 13931 737
9536 29236 -130825 -116945 -88191 -439442 -35558 355961 32523 -218533 9606 63158 -89182
9524 -255368 -172895 -312301 -197304 -78139 131036 229386 -125850 -148968 -116010 174531 -104537
9512 -100637 38400 -43412 47085 39757 3528 217601 -61883 -212167 -211633 -31179 -115189 -474849
9500 -474849 39903 175361 -61232 -130636 76605 -127503 58441 80426 137228 -96003 -280672
9489 -280672 13670 55005 -137193 -212314 -5750 74940 27743 157649 4411 -381290 -341722
9478 -341722 -340942 53067 -88616 -183855 -10466 -198495 -302 -54359 -96129 -191308 217201 -112011
9465 -446650 -100585 128370 -225063 -159994 -226047 58366 -88424 -221431 29890 -181607 -1263
9453 -18591 -403810 -441918 -162816 -82620 -307065 153910 60917 -34742 -290347 -83746 390407
9441 -139036 -268949 249450 33791 212005 -171885 -271895 -421364 -202011 -11275 133961
9430 32300 -167668 264585 158217 194277 -158927 -62474 -202383 8051 -349060 101858 158454
9419 158454 -107733 -200033 27148 -267514 -137112 -402746 29793 -259858 160081 -184368
9408 59086 -112634 -150573 -273799 41742 309726 93886 -93349 -139557 -334377 -81527 1833
9396 -65618 127477 148 138944 -240734 -4950 -452201 -32020 -6856 -291034 -32234 -99166 321017
9383 -371947 22204 159098 -439332 -14514 126335 -124621 136188 -261407 305550 35097
9372 135397 -37326 87665 177578 -53398 -371184 -99151 87146 -74970 370346 -66530 -190631
9361 -190631 -147698 -265534 248313 326330 184535 -216058 -300150 8208 -40032 -105251 106038
9349 234194 141318 -39080 -266739 -52857 125019 24666 149216 -22605 65755 51116 288142
9338 288142 54072 -41229 -384005 87630 -168980 222163 254980 -197360 -30288 100401 65348
9327 65348 143638 4314 -424880 -50412 -305905 -116608 -308923 111675 -579142 -558449 -32813
9315 -144942 -39705 -177871 -99267 -5946 -284108 63419 -48725 -194480 -17347 179826 -217354
9303 -291168 -496093 31647 -296835 11249 -282298 -385716 -281029 -246162 103631 87382
9293 87382 -39004 -21756 229691 84604 -89487 264143 213537 -56612 154898 -169126 -185456
9282 -185456 87987 -134249 -28638 -88112 171060 35396 38156 286517 36082 -55968 -113326
9271 -113326 -86670 -77024 37404 -43060 -23888 -212228 -52220 228871 -298827 35174 -91575
9259 -220591 253098 -155996 -25566 -102366 58649 -148155 -64747 -108779 -178981 -113827 -54190
9247 79499 43175 -247270 -436007 -297334 117771 -440072 84948 149360 -47085 20177 152380
9236 152380 85437 -653643 -244205 179143 174269 -86559 -90580 92109 227495 -35388 -28616
9225 -28616 394640 -594551 -120569 -498088 -126711 -109645 -45930 226321 -103706 -69829
9215 -69829 12210 4761 7870 -99127 481699 -62642 108890 -82824 77910 108185 -144220 129887
9202 -296109 -166629 -251784 -85297 -130020 -173879 383779 -324453 -93772 42668 -42768 21603
9190 -410826 42963 138549 204843 -15560 349885 97510 -72772 370232 113500 -89795 82756
9178 -27341 -28501 -267342 -162932 63194 -273655 -132918 -131375 79324 1768 -4213 -64842 -134067
9166 -134067 99060 -31344 -91540 -32082 -75901 -497681 -84324 -110757 21710 -23420 16486
9154 256157 14284 266067 -172082 -411715 95786 -210909 225450 -153880 -178328 230037
9143 -244206 -27789 -481238 85719 95141 75344 175913 41843 -99241 -90010 -51107 31587 -185867
9130 -289176 333722 -178619 -34883 -437232 -192707 -143570 247930 -255523 38353 293861
9120 293861 346776 375646 -240563 -118796 -131888 148213 70638 119938 2675 65971 -329850
9108 -187205 -1971 -26683 -348100 87755 -196591 123780 138154 93480 -22837 1848 84716
9097 84716 -129685 16432 30758 -171183 69441 -56496 -84937 -108579 145311 -234421 -103642
9085 76551 -57681 96754 5262 -193415 -48862 233905 -54699 53386 102780 -242130 -129499
9074 -129499 96369 -234640 -53915 -61807 -67784 -37468 -215299 -130820 -185340 -189197 -387737 233366
9061 232574 -5373 16907 -209412 -55852 -142051 -158823 -19549 -157427 117557 -9428 -257098
9050 -257098 34055 -28216 -194097 267185 162798 152453 -196138 -13139 -53103 -244925 -43061
9038 150331 89104 -42918 109998 105661 -109470 64304 -116352 85396 -81211 -75889 -76471 -40174
9026 -40174 51511 -119899 -135290 471117 62153 -219623 40959 -251599 59100 581 -21573
9014 -154105 -110895 -104569 -106167 87315 -122917 -227646 154506 42860 236259 -83732 -538571
9003 -538571 -420174 -11649 -442268 -42951 -83985 -176379 -21876 38320 -77680 240442 -251224
8991 -87504 -62065 -201042 -221169 -167830 -202071 -97458 -91977 -110438 216120 203545 -123222
8979 -73630 -21596 -78190 191296 105678 -71049 42141 245428 -134168 87793 -198572 -224645
8968 -224645 149266 -318403 -132864 -43642 -174447 -15533 -11735 -153513 -185260 -280114 -87557
8956 90996 -72251 -71902 -144374 136397 -133766 -102531 21908 235147 229345 73339 -65318 -115415
8944 -115415 -148174 -95499 -143191 141420 -286357 4068 -136184 55870 54951 70788 35886 -272373
8931 -58531 211748 69870 258747 274936 236417 299243 -49122 326170 899960 4123876 2633649
8920 2633649 651219 346312 30931 355593 -175531 -156187 -22657 -67225 -14411 38370 -205845
8908 168201 25769 -273253 -249726 62758 -455764 -38478 -62288 -154297 13384 -6364 -263691
8897 -263691 118946 131377 162249 54322 -169140 -217526 46803 -397760 -368282 56289 -127073
8885 -88827 -187736 -110525 -543940 -220444 -179671 -154720 149882 115690 24612 -236874 31282
8873 43548 -413073 33214 74173 55010 -173081 -40472 233909 328762 9308 19924 97736
8862 97736 -160270 56258 -366277 207023 -93239 -61439 -312304 9012 -104246 -83750 107146
8850 -58267 79981 -11025 -347291 -95471 -123232 125293 -108536 186491 36547 -319085 -49664
8838 -135056 -113393 215687 -67000 42404 120524 -175113 133720 -158935 79972 265863 -428635
8826 -152912 67371 76036 -206889 39429 -185041 42817 96742 -630376 85871 -158912 -64730
8814 -281726 50350 -308584 -54519 -133837 -61444 -101239 33303 -335738 17915 -116168 -11386
8802 38015 209695 -425608 -4186 -16583 -43125 57425 -67906 -103052 44026 -49497 477802
8790 189895 -191316 140774 -72736 -95522 -370677 18419 -76429 -179746 77826 26445 163395
8779 163395 -52335 113252 107581 -238254 -15171 -188338 -247368 -33691 213299 -333199 -41985
8767 -12323 4039 81585 -99080 -114416 198688 -238408 -134620 -62279 -268734 101677 -242151
8755 240697 -65484 194943 -118728 54037 -55627 -282360 -180264 -163384 143181 54854 56086
8744 56086 45659 -293277 108165 -189291 -44832 84191 49078 -198887 262813 87762 -67263
8732 259230 -60585 204862 -54406 -247123 -17499 202595 -291131 -16852 37762 -88269 -40212
8720 -143803 -181401 -217180 235810 -66767 434292 16900 -207171 -177949 121331 -12520 92080
8708 -256589 -62464 90533 -264838 -115613 -347048 -191693 214094 -25899 98490 163931 -85964
8696 151315 45362 -113425 46545 -206387 117277 -132824 75619 34450 -154217 -340019
8686 -340019 -173474 -27742 -4559 -68739 251296 -30780 5956 119146 153425 -9664 89449 104788
8674 104788 158348 -233430 -163630 217483 159261 -31602 -32642 -291834 -75226 -168353 257826
8662 -403393 -100162 -72243 -82833 101417 -476919 -69042 289295 -148486 -441915 228346
8651 78666 107009 -369577 184256 -111315 -293660 -140467 -189788 -83549 87622 -390416 -107642
8639 81756 -379230 -210287 -179081 13113 -76691 -72515 -12510 -10198 181384 15732 151518
8628 151518 -22248 39105 -34959 68054 -24520 -72086 -193831 71914 -152130 -187029 -53789
8616 -165338 10840 -93077 230291 102168 184318 98982 423226 -17665 -2715 14169 -79303
8604 144161 -266987 -575667 238397 -359719 144611 -78291 8265 261869 -65103 224742
8593 -115901 -169478 55925 276279 225332 -79932 -68013 -136777 -45385 22311 -68848 22284
8581 -103334 -255570 -54113 -401630 -177713 -78402 145614 161139 -185574 -236915 -71925 173949
8569 114897 -197020 353330 69286 152368 -11644 -78984 -3742 -176366 -292146 245488 -291366
8557 -135951 -84579 -183762 -105946 -168783 5831 -32903 -68180 -115575 14608 -26935 -31785 164628
8544 -26231 77720 329541 208422 143110 -278064 -138585 278522 -256644 -278854 -52812 -369866
8533 -369866 33406 -100478 -114440 11740 221993 -65878 71484 -233968 -157470 30314 122040
8522 122040 -17149 255081 -202402 -107477 -34826 99446 -223777 -266252 -68946 -238052 -231112
8511 -231112 242079 23203 -171158 -359807 -391021 -11338 26908 -66678 -100448 -96381 -106152
8500 -106152 -69787 -138817 -297120 -383761 -320843 50599 -184376 97585 53559 37050 -299424
8488 39161 130584 -55737 76923 -237552 -74568 -123615 113577 -287326 -174355 150833 -230282
8476 158684 98633 43397 54618 -37865 -241559 -227926 -203064 341589 -330976 101700 56129
8465 56129 -56522 294693 49989 -196391 67875 135935 -174562 -170514 164491 -115134 -98755
8454 -98755 115744 -54817 -162003 105283 -37781 357765 -226750 109063 180479 41730 13534
8442 -214365 -149049 -130801 -168603 286345 3965 -86573 43926 -105753 256977 64455 -193469
8430 -289772 -101451 74281 -66100 73679 -8555 38926 -29701 168000 -114369 -107584 173066
8418 -169748 -96610 -77747 199089 327919 -169095 -243700 85225 -391596 -43008 -105610 -385475
8407 -385475 -2003 45439 46062 -33680 -101042 3385 -38655 -104778 -2291 -16874 -227446 -97606
8394 -117466 -84820 -370633 279772 91661 354309 -47168 165651 -220187 -173989 -140748 80249
8382 83615 282982 -106025 -67876 -86898 119357 -331493 -90728 88299 -9968 -43390 185166
8370 -43848 -72766 -64643 -224473 57178 -158948 -319515 131765 -330122 -186714 -133972 78077
8358 -132560 3384 101556 -282256 -127468 -111019 -115235 89110 68993 58812 86808 -312106
8346 32888 362185 -154865 180184 -208067 -10787 276012 -84322 104349 164744 328532
8336 328532 -124617 -104977 -277185 224538 188616 60706 101195 88951 105430 -119365 -64968
8325 -64968 -20043 210836 -23471 223086 -462428 -283323 211519 -109376 -87193 -280134
8315 -280134 4607 228645 -204185 -247318 202384 203903 276654 -137951 -228856 166450 -79734
8303 148901 230511 -177402 -333425 85465 -82286 -119639 -6184 -37859 266970 255844 -35519
8291 -30495 85826 -33598 225829 123099 75162 259853 -125050 -35874 -76297 66230 147780
8280 147780 -44155 -41871 -394488 -190243 24954 -45275 -106332 218931 109612 -169638 -308832
8269 -308832 119887 -46922 38389 -66055 -210992 80624 -40210 235817 33029 -8159 152121
8257 -138707 131292 20787 -113028 -65198 -168417 97057 -57171 -229801 95490 206973 70912
8245 -268036 -14229 61434 -26227 -34336 219489 79782 120679 188059 -116303 26267 412782
8234 412782 -86188 -91905 -336925 -216593 -253990 89965 -71265 -305977 -40002 210037 -3620
8222 28284 -77387 -64210 15841 40609 -49163 -37251 25432 -105015 158227 -71215 -261033
8211 -261033 -154041 220108 141004 -109230 -286983 13146 73061 -259607 -209173 -224829 -135664
8200 -135664 -464014 -123994 219810 45043 -115641 194600 -500780 72552 44248 461839
8190 461839 -92473 -103328 -39049 38722 38464 -214087 -8914 19029 -194654 -42368 21435 220155
8178 220155 259417 -34394 134114 -180895 213665 279241 -114024 -2863 -147583 107341 35550
8166 46505 -207649 -96916 -206220 -46960 80471 139487 -60207 -229645 -324041 386879 -239422
8154 -43972 71559 51727 93647 -165974 209717 -216906 26209 -196339 106566 174759 135603
8143 135603 -158634 -125473 27929 -70977 -198692 -410331 386784 31719 103375 -117165 -32543
8131 301647 403897 -27512 169826 -257473 -243935 -97725 -156739 -146087 -124676 67321 -178583
8119 -61236 -14426 -141222 288985 -232249 -176033 -395800 138075 67923 -163002 -47440 -70975
8108 -70975 -459370 184331 -233771 38761 81623 7444 193535 132931 -346038 -59798 -216394
8097 -216394 -88116 -236104 60339 41093 -185102 -136564 -335699 156422 -26034 -155239 167001
8085 215920 -259245 -407210 -313876 144573 -427650 -97856 -188231 235492 225674 -263377 -141433
8074 -141433 -125057 113460 -95113 -194615 238834 -58457 -54152 68807 238964 -194758 197399
8062 89566 -49336 29640 -45807 -2000 -180678 -113239 -107394 177401 360502 -25147 267748
8050 -406661 295696 224 88420 -157175 -155883 79024 4088 -166641 -204659 84908 -75606 -198292
8038 -198292 -171920 -186843 -267688 63056 11568 149817 -160747 105343 -309007 74409 141476
8027 141476 -129417 -45381 -417710 237165 209847 -37775 107999 315401 -110373 -65011
8017 -65011 7555 -215293 76479 -14570 -275295 -110790 -66294 -104835 3977 -66956 247025
8005 254111 -257486 140099 -233004 183227 -66030 -169080 100291 -132030 -119875 24979
7994 51643 -74372 111895 -271808 -22621 70765 -98383 -158367 152638 -81836 -34231 197293
7982 45823 -162672 -59088 -236208 -342858 -55691 185796 -117588 -108628 235276 -107354 70992
7970 108597 100874 -330283 10069 -210928 198680 140519 55578 136575 -154178 141012 -153933
7958 -119568 100713 -245939 -9548 76052 70860 204134 -185677 38418 -129320 -132965 413650
7946 -4759 -70730 -307101 -112420 89223 64163 -173674 -378079 -137424 -239624 -30166 -12422
7934 -69777 15097 -74260 23214 103299 -292073 -661 118427 89981 329139 147050 110805
7923 110805 -141595 53053 -39326 -179529 -208013 143985 214415 96776 157767 365039 -44701
7911 -149250 -260725 212332 -57992 -226248 87390 115299 -23522 -250840 312559 55680 -23962
7899 143155 38383 -138876 -174161 100954 339449 -209671 -82521 -44099 -133094 44984 -365542
7887 143165 -86460 24424 47090 -6950 -282083 -13686 167228 -50765 -52822 -75212 135791
7875 -324481 91642 -58130 -70846 133692 -315445 2625 281913 -119212 -224078 6348 -274764
7863 -120076 17857 -131030 -19432 -90271 273072 18278 281178 95458 134894 -152180 4638
7851 -26378 -153358 13835 -221513 -151010 66377 -365550 132767 201093 83779 -113191 -71201
7840 -71201 74471 -153399 -87906 112913 14227 -157093 -137318 -219010 137330 -304748 -208766
7829 -208766 -50972 42480 258824 -503202 -294719 -44477 -43396 -307358 88480 113303 -92479
7817 65512 -89111 -59565 -175530 33328 -195692 91647 -289020 -88389 -113124 -24030 -237892
7806 -237892 158644 136684 -19292 -212239 -279647 -81901 -277926 -207563 113509 -112948 -45145
7794 38904 -370255 -61132 134484 181609 -221447 -27304 125176 -19418 11684 -134473 -82452
7783 -82452 102536 -74544 304579 -23276 26557 -66032 -145835 -39565 230426 -239622 -274537
7772 -274537 -79126 -102626 284288 19611 38651 -20369 65974 -254517 39697 -23769 -81642
7761 -81642 113399 -97451 20613 -4609 120817 -216808 -185013 32403 260259 201642 217161
7750 217161 20690 46349 -227973 172477 49344 -39085 155427 -68755 22769 -180857 -92165
7739 -92165 -96107 -5125 -114429 85798 -36627 103980 88946 -127699 69238 164619 -288496
7727 207950 -231914 -152221 -115206 85888 35510 -310593 165293 308816 -238299 298940
7716 85511 -200336 327554 90573 -133873 -67295 -55132 -232004 82198 292123 -106392 -310138
7705 -310138 -59442 -22343 -16356 -93330 153471 -67168 -19842 -86796 262529 325113 130305
7693 -113418 234748 283755 298060 131089 -124629 177505 -156194 -79775 -54720 -71995 -21787
7681 19906 64333 246782 -116030 152901 72793 -69059 49970 163310 -42395 -151282 12048
7669 -173755 -135679 107741 25053 -126455 -110285 -66487 -136217 83034 -172262 -184948 200042
7657 152670 -210363 171962 36816 399073 2070 -9881 -206693 -72623 -122306 88680 -89187
7645 231971 -228950 -60683 -177053 -115662 147715 -262181 -152522 -198360 153316 -240103
7634 236455 -378849 -61915 9824 -70746 168899 152096 310232 -281362 -17553 48236 -311556
7622 -251443 50280 -129456 255525 62315 23073 120115 -62926 -159481 -141016 58434 -478873
7610 146746 -59489 42690 -49585 -328224 -229354 -86154 -87260 -35025 252394 -27974 -170529
7599 -170529 -179620 -80888 -278476 194808 -315916 -317487 -35195 3778 104957 285775 70645
7587 -29214 -202733 -197878 -294797 113718 -45709 -5128 -261043 -309353 -12430 -69675 -129867 -231103
7575 -231103 -14590 -89649 -142390 15378 66167 -127069 -161367 85152 10055 -38409 14555
7563 20424 -358907 28849 -87314 -13078 331638 -369336 -233286 -295566 143026 66836 -256267
7551 -63125 -54777 136858 -27886 -146686 -121873 -396087 -260250 -121512 333828 112085 53988
7539 222118 90800 -35476 12317 -47353 -25963 -59176 381247 -105710 -21414 -141351 -76871
7528 -76871 -148363 -37898 22414 -74639 -177913 97010 452263 -77932 -61754 -45127 -143208
7517 -143208 111214 134940 277155 -298194 336937 -206854 -174182 -169121 -388985 104722
7506 -213345 -88937 -5746 314796 -72941 97167 274839 -416099 -322680 55992 -177463 -98091
7495 -98091 -200035 147760 -16713 228891 -254255 -30267 -8215 -372662 -23308 5051 71185
7484 71185 165292 -200147 -55725 -165645 81683 41752 5102 -150269 7039 556341 -329736
7472 -103854 69951 -5893 296845 -71522 -88527 -124135 -239805 -22070 130212 -176682 -32454
7460 -38586 112817 289578 -41145 95470 -114856 -105884 3565 -346706 -179634 -137315 -59458
7448 290952 -56529 -187271 -132856 -287263 -411973 -14469 -315656 105164 -40662 91241 -415471
7436 -58837 140469 219096 -78896 150533 142339 132719 -139023 23949 371120 150239 -311677
7424 100115 139049 -164725 205216 21211 -324512 65786 -62765 -198258 -203492 -14340 -395425
7413 -395425 -128122 55152 366627 -35825 -52584 -74351 171254 -363331 -60850 -228195 63900
7401 10839 206407 -28550 12638 -97236 133272 -33763 -108463 -76871 165718 -66567 16559
7389 -267617 -7880 -108739 -44301 4507 -242600 -370121 -197398 51396 -424962 41647 40313
7378 40313 186651 57110 109951 -150971 -223805 -87318 34806 146699 223283 67811 -231450
7366 -196183 322089 -26412 -82107 -226896 242366 252676 -132153 -111425 161308 -83075 -351598
7355 -351598 -61185 -176428 -156684 -16387 137567 87540 -136981 -278829 16683 -200295 -223887
7344 -223887 33943 -91237 -50911 180993 257071 -211205 -142232 -171860 118397 -124013 -101934
7333 -101934 94691 19862 -39798 246556 41663 44489 -154277 -160531 86888 -354757 -157151
7321 -287404 -63060 -18742 -217978 39850 -53635 -244655 201491 -99119 -66185 33971 -4632
7309 -84609 -300872 35374 -327404 95425 154368 80372 -140091 45399 1188 -191338 -143732
7298 -143732 11395 104836 -272319 -211816 5203 120910 46958 -112897 54183 -217181 -89508
7286 574483 -41670 179949 -113879 -8308 -83740 -182326 -142376 66605 5331 63213 251177
7275 251177 -215244 -185522 -187109 122131 125612 323683 -184113 184708 -38815 34923 131988
7264 131988 214574 -163897 34495 137924 79801 -336791 130254 116892 -365362 -144815
7253 83343 -147520 96027 161539 -56902 -141279 149621 24662 231529 -338508 -191408 76069
7241 -391091 92423 -264043 -106308 -38723 16267 -20796 206133 17340 48271 -94072 45527
7229 4169 -62411 229919 -160860 243381 -112413 -42652 -335698 17197 -349596 -143194 184248
7217 78350 -97176 141136 404726 -19887 -36522 123139 -57629 -187539 44777 39797 96005
7206 96005 -242664 125957 106494 -72287 -307942 -194186 -253087 220266 47360 27274 136374
7195 136374 43766 -100207 -45780 126970 61443 34220 121560 201363 -17391 78715 -89593
7183 -132610 125757 -194113 320776 28508 -91669 64651 387301 234288 121208 -225414
7172 -209853 105577 22164 128070 -74167 -210292 -181054 253984 234654 -197957 -119700 -83980
7161 -83980 -154773 -200005 -141642 -188087 -176884 -48847 -84041 -191956 -58913 21424 -169252
7149 -90968 -160407 -362829 42419 -144251 -133195 -48752 -92667 145115 -25775 27290 -211138
7137 -296901 184055 141645 -11775 -292881 99471 -23434 -58848 76085 125177 -41380 -328484
7126 -328484 5548 -235580 -53759 -148939 112654 -363739 -8372 -125429 -158322 -113904 -51246
7114 -255715 -154259 -210742 -18826 128230 84823 -269919 203162 208462 -125227 -229052 112491
7102 187776 -351797 273619 -51221 253876 12159 57435 -188436 -38679 -44479 -437759 -37976
7090 60373 115088 -85669 296514 111262 97742 -80246 -179437 -180667 54701 -23732 -24125 3019
7077 -342719 67683 86073 -257848 -116350 -306687 86303 -224488 104759 328080 -261637
7066 179811 124123 172826 -68552 -155664 -122936 44642 30554 -95683 94694 -101252 -298923
7055 -298923 -447267 -104555 197575 273923 -40171 -130072 -160343 -208050 85035 -294924 -188794
7044 -188794 63553 65840 461968 -120560 91597 288874 -91180 -156654 159954 -146255 -44155
7032 114179 -160184 -296820 -139958 130019 -58875 96311 57592 84171 108259 28981 54248
7021 54248 97106 290029 172446 -34179 -166674 54612 175770 -127399 -8035 -262325 -324794
7010 -324794 -243608 94306 46583 -146421 121737 123128 -354032 -122519 205677 -86646 -89520
6999 -89520 -32109 23680 311989 -159864 49922 -273163 46924 134103 -132466 -92075 -174511
6988 -174511 244943 20729 -54408 -89735 -129435 23556 9499 124098 93971 71477 -206735
6976 -7530 -248173 207271 21004 -197691 -56301 -189840 18376 204150 196013 -108579 28736
6964 48455 169736 -150264 -96994 59072 -159438 -254696 -188374 -128176 -223427 -225321 40412
6952 -30833 -365719 78247 27495 32227 -6562 -196059 59709 239414 43588 224720 -309059
6940 -96912 53943 -841 -305927 -236851 261278 217025 240523 143869 152237 -171233 93717 -46445
6927 -209159 103244 -220520 -90636 186143 162896 -93596 -173645 75370 -33050 -119955 -118949
6916 -118949 -136221 68424 -120604 -182469 171682 -115786 -220389 -1943 199175 260952 -211372
6904 -71359 105032 43081 -9692 -275063 168273 258660 18091 169149 -389463 -126567 -184071
6893 -184071 66403 -111797 -415375 -183289 77711 -252062 -218472 95717 -27082 284242 166469
6882 166469 -26737 -274855 67579 89966 -140102 -3384 -232874 323657 -230566 184298 214124
6871 214124 -85464 138178 -199498 -117208 242931 10623 -99767 -111871 159384 225843 -63529
6859 -64935 1779 301734 -220647 259737 -283148 114026 124972 44399 16934 86000 -93686
6847 -150716 -83410 -182392 -1691 -284356 142439 -26821 -2567 23263 -51759 -384570 -79914
6835 -76526 113390 1317 289059 57819 -219247 -57486 -383816 -66389 204035 -93274 20757
6823 -104790 69232 112271 -52722 -43832 -31940 -89450 -111683 115110 109302 408221 -27777 62000
6810 -178834 55865 -199469 -234167 -277372 190462 251889 -65409 131243 -224115 -43630 222049
6798 -81942 118941 -19820 241943 -143588 64831 -229074 -176037 149656 53331 -272258 -293327
6787 -293327 -133377 86247 -363797 -127350 -93245 -213996 -216816 -252394 159855 6863 254167
6776 254167 -141413 120013 15048 -265903 -232184 -177514 -104957 153013 -80767 291228 -47889
6764 -269713 163612 2669 73162 9429 -23509 -197930 96834 -38790 -360451 -266313 -3703 10367
6751 -61766 -19511 269101 -224428 -323957 110168 109591 387314 271218 59210 225610 -3458
6739 224458 -99747 47008 -166515 -8840 -257127 172756 -88721 46706 141048 -168101 149228
6727 -285668 -314373 282503 -2184 -365695 -398815 -2742 -52827 51311 108461 -157701 105074
6715 20596 88691 136462 126434 -118250 54671 137508 129559 353003 -158536 -129566 -156747
6704 -156747 -151509 -115547 -436873 -140242 -466988 198665 -194034 -49643 163733 94998 -63325
6692 288932 10227 -132501 -118363 338023 -61692 190478 -90018 206241 141159 -136997 -51293
6680 -87888 -42445 48396 -36016 -34271 -218469 -178721 86117 -33795 -222606 -29996 -132898
6669 -132898 -2419 -124231 -168136 -12352 -60761 -175406 -89180 -132048 31081 -25106 275450
6657 148485 8879 280246 -108821 81420 214454 45338 42421 -235304 -14087 -16812 111373
6645 -312548 -120622 -37632 84470 -52846 234332 -154997 -54580 -9910 -182628 -219125 112803
6633 -244733 177533 -323089 -43716 -198151 85131 153979 -253695 -306526 -141780 -59248 -389168
6622 -389168 -68444 -95527 -44059 -21181 112007 -124491 87954 -222692 -75630 159853 -133977
6610 132954 120232 268779 49639 -172479 -79347 -127667 278030 -90735 117915 -73046 -39354
6599 -39354 -430790 -504486 135054 -59751 -291123 156949 -102844 -188585 226865 20889 -96186
6587 -308923 167848 230214 -34882 -51749 -121754 -1413 -63870 149291 -205264 159763 -619783
6575 35304 -9938 -138348 -182950 36468 102334 -249333 70608 -79381 -150736 293865 168651
6564 168651 50388 -222940 25667 100235 103188 81204 -211180 -35469 -184 181123 -201052
6552 -321669 70480 -18478 -333867 66806 -41638 32311 195336 170926 179772 19880 104311
6541 104311 70071 53494 -5070 -21691 235003 -185554 -11571 76122 73555 288458 -37314
6529 -236241 104646 204801 13596 445897 24081 103101 57074 41796 43014 -78955 17238
6517 214242 -11331 -230581 119188 -80879 -149928 268967 -12114 -498840 158990 184551 44550
6505 -337514 237341 134351 -31968 -230240 -145005 -218356 11817 -21906 135234 -89698 -95963
6494 -95963 62090 54265 -110145 -301670 -78240 67402 25453 89821 -204033 -145088 72605
6482 311419 -39649 -207864 -20136 -166278 239017 244918 150098 10819 -42522 26456 -135640
6470 -22715 -86199 71062 87377 -52306 -112037 -124705 -364378 77891 39180 -3194 25139 -55232
6457 -130275 28264 97765 218957 -57382 151090 -130649 162119 -171440 171612 386409
6447 386409 -11687 -332198 144030 39264 83626 274106 -42061 -30720 103392 -231298 -451
6435 -80974 -86346 51191 6055 510907 47031 86486 237479 300085 127926 120422 159176 -318057
6422 78169 -152735 -30594 114708 161941 -3778 -142273 -58460 -8060 151735 -128621 -296132
6411 -296132 -201406 -340496 -44917 -233123 8248 -50209 35106 222299 181290 191973 7615
6399 146227 -230704 -20615 -178293 -322691 413863 -211952 332727 -120387 -179334 166192
6388 -45351 -108317 -162936 -243441 -74144 -154584 -101741 -158721 58453 101224 133142 93619 146259
6376 146259 -186384 -162991 -83661 -19748 -351197 -106947 38779 33029 62886 279883 122639
6364 61942 -311256 -75065 59869 26628 219962 356418 -139350 -109040 493181 -64193 58407
6352 -283293 130161 -288552 60616 95367 -210193 -165108 -50291 276874 217687 18909 -261911
6340 -332833 36442 -137241 -328765 159006 176261 330074 -197069 -27511 34932 165123
6330 165123 -56976 -114359 -78104 16421 736 -216108 -114798 -144752 114776 242342 -4104
6318 44979 253017 143424 -2870 121231 -12619 40339 -332494 -232173 80285 107927 -145683
6306 -178834 -223731 15160 -13047 -273719 174919 81536 -89397 70488 -17544 -361374 53818
6294 77040 -160095 136420 -266775 -4068 -444779 -106981 284677 -129137 143512 62311
6283 -194026 -65382 -30444 246091 22348 -156751 250048 54578 -34794 82245 -311352 -7357
6271 -193291 -228228 208156 161652 154266 -300751 60995 -250270 84622 -317554 -133821 69095
6259 -282166 25158 45268 -13586 39589 -14377 -34413 -367733 93899 -153374 -164503 -245041
6248 -245041 -158105 -207412 -148617 66352 226000 72893 -177029 62178 194315 163760 204716
6237 204716 66958 222671 -41793 -261578 -10858 -344221 62340 75166 74170 -108469 724 376502
6225 376502 265557 66529 -124992 -179197 34364 232379 -73348 -184439 -239401 -28440 -9844
6213 -209177 -310933 -203909 -33257 -240478 62553 106913 25904 82890 31442 166979 -20049
6201 -29433 85267 -157695 -302983 171146 -118764 -325074 -449471 11053 146563 -149086
6190 -211362 -97017 -52202 -195641 -33469 -217180 -196309 -378878 324563 114258 348685
6180 348685 28054 173258 189355 -104147 -191473 -53204 -135350 -20507 53307 -313249 -93278
6168 31707 -234498 -109589 11016 -62818 51669 357813 113383 288162 -122884 -106456 65473
6156 13295 -37506 40495 330265 -48511 161069 166223 -208465 -92932 -140435 106056 -115958
6144 -126073 204442 120389 -128635 253737 -156723 -229268 -77006 222703 -211703 96591
6133 -238046 389737 -17673 -279621 5236 69513 7813 -321200 269847 23970 -165210 13166
6121 -134667 221750 -139652 -301160 59863 -93750 155642 16936 67283 -55741 110258 -149948
6109 -122355 -51990 -154511 -50665 142937 -151295 -127163 127355 -67046 44944 143480 41037
6097 -247995 35562 69857 104474 317282 -244898 108583 129401 44830 235507 40620 -14965
6085 42681 3264 -83299 -103058 -147844 -108351 22894 -1164 157565 177312 122314 -29661 191127
6072 -130721 -2640 -202303 -117379 130870 58249 189752 -85705 -133541 292927 279111 -289421
6060 -292594 121423 114196 38861 129885 -376706 73694 67503 -122503 -137085 175877 -45489
6048 140862 -153059 334180 85949 91948 283163 -80092 239050 -150034 124389 -324583
6037 -5561 122946 -195908 -43318 210940 96025 84681 337064 278831 -96341 143968 -9855
6025 150894 145435 110748 -106041 -240683 59791 88596 18006 -236341 228760 -280770 265616
6013 -10041 -43316 -24999 18497 -59155 153406 135073 -69401 288575 65993 -194291 -300443
6002 -300443 -144577 -44480 -129165 189898 437032 -179649 165517 303036 -245628 -37330
5991 80230 201094 -361177 78172 -82323 -172992 -199392 223231 -284151 -87224 -28223 -305942
5980 -305942 -78334 258098 130225 63032 -184174 114677 -189273 -84756 -391381 102227
5969 -56881 129739 -29442 74997 -100558 32814 -24016 140503 99777 158091 119513 -209994
5957 -76215 -14107 -363538 234691 83725 6123 -166472 -14086 -295257 96064 -165083 7289
5945 40376 -369232 71088 247724 90692 -35242 40390 -191990 -4509 167312 -190451 31660
5933 -33838 -22335 68060 150337 94681 106361 369414 11328 73174 -328347 84094 1912 -108259
5920 76396 -259871 155267 -37017 27606 18723 -275477 -123055 128086 372287 -79535 107045
5908 -182805 -28928 91722 139333 -5943 20819 139085 -21101 -109096 1910 -111785 2714 -71061
5895 -80473 -125124 127452 135310 139245 -99466 462319 -218450 -315866 -22900 110781 218821
5884 218821 -362823 223171 -7200 164795 250427 -222722 -232426 -127768 381859 60427 38730
5873 38730 313812 399115 -97828 -99984 -90452 -301602 -90482 -101447 -22959 91527 42698 90669
5861 90669 -73449 12094 -232501 -242589 113027 -325798 -63116 -415013 -205209 259944 -208497
5849 92196 -3787 -89612 -51460 157125 -82959 244378 89352 139650 -150468 167887 96778
5838 96778 -153119 -197541 -85458 -202369 -1849 -85349 134285 137965 64560 39493 161259
5827 161259 178517 -8663 -118269 -63736 -137025 -132612 -349820 93105 270112 -57441 -94756
5816 -94756 -136041 -8233 42526 -231997 -267902 33266 -37559 -281323 -18753 -128874 16065
5804 1799 21648 -20287 240067 192544 81002 27916 -192263 -53473 72757 -16720 403886
5792 172800 -112910 -305169 -228683 -58470 -62144 -45611 83852 115943 -172848 -48221 56546
5780 282651 90883 188673 -177062 -103472 144809 -38725 -95330 8036 -65099 101702 -139194
5768 -150150 -138820 281544 458634 -96404 139383 -7655 -28658 139839 169665 108891 -119115
5756 119448 234191 51932 339914 43734 -51715 -325276 -70975 189119 -393714 -219037
5746 -219037 245024 -515545 -225961 35144 208638 41258 194853 244363 -231909 151478
5735 -37279 -269099 31009 91219 19567 162729 94354 -223542 -195215 514768 -145999 -75443
5724 -75443 115859 342629 -64436 -187541 295621 -223570 -122506 -75475 -382649 92532
5713 -72361 -187670 -317802 500702 187799 -150458 218814 24566 -14221 14876 251663
5703 251663 -351577 342119 102328 -102610 8611 320375 316029 -60250 -169729 -134138 -26261
5691 245708 53516 -245368 53927 -81721 -119161 -69506 170118 -38837 50780 209683 -142804
5679 -63139 -116660 19883 63471 -278537 6486 -58793 91434 169539 185914 -248929 16030 189230
5667 189230 197693 267492 446 88706 -46010 -30761 485996 84669 171019 -69190 -35801 16786
5654 84859 -183930 285678 -272296 234651 -145668 118942 -177468 -200759 -166467 21731
5643 -281881 -89513 155804 -245060 316307 102554 56903 29687 110201 -123770 90803 320164
5632 320164 -115192 -61619 -114257 -497837 92430 207128 73423 -81177 -78857 90768 -215901
5620 253444 -197200 282669 100721 -35820 135666 106050 96358 64229 419954 123613 148314
5609 148314 -7560 -288391 -48893 -34439 192550 201536 32749 165668 21729 114869 127922
5598 127922 78947 -154764 -26120 -85770 25522 40605 -166613 -97816 22147 172690 -335978
5586 -208513 137453 -94360 332569 126380 -277191 142195 -104319 41336 -58903 -135332
5576 -135332 20494 -13010 136236 111771 -37759 -17963 -227908 271547 -66302 -119732 -5130
5564 -143865 -59267 32711 125541 -45286 27013 31118 56156 38186 376223 -315507 272383
5552 -93322 82079 104625 81687 -73622 -121540 31886 -128973 -94015 -61431 138394 11893
5540 -241414 42538 -10850 -76170 69413 273585 26061 -197192 106458 -201969 -5483 -204085
5529 -204085 17530 -60751 -197167 -156252 104743 -37555 -65291 -9567 -53221 252359 290554
5518 290554 -142044 38559 -47156 64595 -21343 -175654 -154262 -186289 -78291 -55843 324639
5506 164218 -106177 169749 164585 62387 -90968 -454880 -182306 -105879 -53186 -51302 -102538
5495 -102538 210095 -41290 188658 -71680 -89295 -263605 -169310 -64648 145952 65264 296243
5484 296243 144650 -50970 -168164 -11262 322932 158843 -45362 313002 35042 226848
5474 226848 93770 38372 -100441 -202890 142431 23312 50164 -210421 -45327 -85944 68531
5462 -135669 -108861 284851 -116201 -241845 -62554 -104391 166099 181839 -119309 -55531 46962
5450 -89536 -289215 608594 218721 239750 -221298 69052 -49102 180719 -221093 -35194 91
5438 74088 -287310 181101 -49051 -22366 27413 -8517 -72440 239106 -114617 232662 -214429
5426 105503 172116 197677 31147 143638 -209320 -143179 133229 -250679 11148 -227035 11949
5414 179023 -14268 227969 -188822 -315698 242668 -2197 -102724 -171513 201459 163435 12780
5402 183432 -225003 85242 -2112 -141406 75573 -344700 -35602 115897 179198 -68674 -46407
5391 -46407 -176105 -35071 106246 -38797 -36374 -79951 -231014 90570 162242 212039 -17126
5379 -72552 75530 114889 -266697 268101 55052 -43864 61515 -115981 186155 248488 93968
5367 -375199 6424 -210280 125040 23241 2750 18709 -39248 -60691 130315 187909 191658 5630
5354 -34602 123947 -75097 85143 294441 -324130 -144494 5700 138425 100404 261095 -151368
5342 269025 141278 -58950 121215 69124 -149579 -308642 241349 -91713 -223358 25130
5331 28697 25768 246833 -50956 379377 -147603 -60157 212717 124044 352474 171736 -17503
5319 176454 -408874 201452 197215 85645 116054 199993 149483 214564 59666 184510 51395
5307 -194819 84870 41334 -287449 -9046 -29795 132270 8412 26955 -24207 71144 -80871 36242
5294 -131276 -48752 142105 181089 -60575 86835 -28595 149765 -19967 199522 105522 -40870
5282 -61260 67638 -115659 -18974 294543 -68100 58502 54263 -120312 206182 154120 -154094
5270 -293123 -74112 -161725 -202313 -48717 -149263 40813 39727 205859 -116068 -29984 -143885
5259 -143885 -55447 69814 124235 -39359 -97645 15660 45629 -198389 140829 -88705 -30251
5247 14758 -253830 -46064 153329 48386 -92968 -136246 -94812 -4003 330020 -116054 -88245
5236 -88245 218684 372791 168499 38786 386912 -197466 359690 -3521 -80422 21265 -195791
5224 41419 65026 408813 -63127 -3185 -198707 -96548 61664 24526 104964 308716 313015 -216535
5211 503018 -175796 -145450 19777 -51255 59660 232773 -126983 7835 -515031 171945 -147995
5199 79244 -402733 2582 -89409 -57150 331968 -277100 -55861 -57756 -154799 -364927 38608
5187 53089 -66525 -142579 -279223 428790 200 22939 -83042 -215539 424804 -270448 284048
5175 -32436 10631 -46003 71236 103318 -49462 325168 241404 69081 54880 201201 -249224
5163 -60876 -18524 -148018 -25640 -356857 -125038 -180306 -7587 17680 240868 162200 -22961
5151 103793 -19693 -175263 258872 -67482 365417 131194 -11792 218478 41028 135033 195898
5140 195898 -291365 -123545 -273464 16845 331584 -131578 80104 -90233 89872 -33982 73966
5128 51519 153112 -223560 266999 342286 -176345 173892 32739 153348 364572 141526
5117 -96260 -19712 -192350 149404 -53399 80213 -78334 151788 192824 143341 -2879 87850
5105 34320 -319171 -44239 -144513 78600 -64199 269803 -230323 320965 -43591 -101722 107010
5093 -220210 174979 -78510 58185 17115 -145280 -80947 84370 194996 -82986 84116 96957
5082 96957 -215397 121192 -188938 -80887 -66890 14719 23411 -54366 -276634 154193 -5335
5070 -171004 -76685 -68606 108340 -318789 -46056 67790 -101647 355383 213198 -144332 -299309
5059 -299309 327723 -242914 354651 26012 -23432 159507 60395 -323098 60078 -19635 151107
5047 -20920 152948 -223597 412993 15826 -243118 184254 260836 -51431 -165822 282308
5036 131944 -138395 -215181 322022 -56341 47999 100202 128733 -53813 157740 -76871 85851
5024 -71209 170262 -192938 -115668 -49466 -205136 -23545 -186793 293336 -289906 135077
5013 -308266 50244 251880 264034 -116138 69700 13059 543 -189826 -81146 71136 251911
5002 251911 -129082 248595 143547 -223044 -433549 -42041 199125 -229911 -13902 -274503
4992 -274503 347442 57700 -180846 33499 161526 -16242 -7289 -267240 -205868 18822 145447
4981 145447 -97494 49082 49828 129816 91870 359210 129077 231400 -53360 -32350 -5763 -150407
4969 -150407 260171 270024 69569 -103729 -74924 410003 -12837 -405850 204586 20969 -59033
4957 -61086 -23963 197636 48916 230827 306704 34213 -108423 92706 259446 -303395 -82532
4945 201459 84329 185755 87338 -166709 -209763 47132 253328 906 -248693 -189200 -193634
4934 -193634 -225556 -247053 -150097 98514 -29654 72566 -26824 -5795 -13223 -231014 -89229 -297096
4922 -297096 31846 -67260 -74424 -4960 133968 203820 20078 -74629 -111594 327922 145351
4910 213953 95837 174191 -302064 79414 -130870 -226734 282416 -220742 -140027 -197994 85789
4898 -165051 -178208 145117 -71983 -79188 -93804 108008 -274739 163708 -190711 7372 -292234
4886 214100 -179152 32040 -128617 95946 167887 88511 -17158 165559 255470 125530 -145381
4874 -175969 54977 30619 32579 63453 252138 -191952 -104473 96428 -14066 -60300 107603
4862 -29587 -100667 197810 -87567 -65911 11210 242929 151947 -48768 -66457 -242396 113280
4850 7602 6024 -252725 128862 -168585 -405322 80360 112051 -10436 -1742 6716 183752 -94580
4837 48164 47753 -197939 -326336 -131830 -146257 -422878 -27053 -254418 79427 180387 252289
4826 252289 103123 -170583 -229521 -288014 -151657 229225 316769 -343584 150732 -75025
4815 -4215 52967 246096 206733 270561 67657 606064 -109078 -55333 157089 -166150 -6820
4803 -123621 77194 -75771 -10504 -277124 -9202 -69008 244802 258733 -298637 166824 227084
4792 227084 -232114 86168 -118318 74252 -9505 -251655 -170598 -199435 23156 376607 15338
4780 121192 -137613 -282858 -149076 46577 -193007 247898 -185460 -202442 109484 -209792
4769 -19506 -209026 183976 -102446 -292128 38437 225075 -61506 -119980 -23540 22033 -96756
4757 265731 -3045 -78351 66975 -271372 -121333 -93822 377900 45005 118014 -227182 128019
4745 25715 101593 145804 296992 122424 -115144 131333 294519 112985 71298 -113456
4734 -145195 32313 -48593 -309822 -274061 -70970 230284 -109291 130759 -94484 -336718 29025
4722 -24475 56081 120362 -62647 -41039 -110950 39601 -102539 -34756 108940 -158887 34478
4710 102019 378769 -200529 -130936 245144 15769 19652 -239239 -6670 231134 267204 276517
4699 276517 314093 144434 166777 180454 144887 132261 -43500 -122220 -157364 -463506 36440
4687 -93352 57735 257198 -37887 -93575 21675 34620 100246 -279393 -34658 -120674 266769
4675 -143334 26824 109621 -188188 191355 -62052 68678 -474 -102073 103670 28094 34196
4664 34196 167610 -2496 31180 -152116 47666 -198690 -53671 332241 -70365 192847 -52155
4652 146638 65456 -55407 345592 -137578 -253468 -267489 45872 -128760 -30308 95418 93468
4641 93468 267201 186653 88183 -375693 111118 143088 -116953 228242 -252843 205405
4630 85811 -252543 89378 135121 58895 -294970 86117 212556 59525 -45703 -33990 -26603
4619 -26603 132081 26521 168444 445049 -116925 272583 -52389 92794 76851 124702 66366
4608 66366 124845 245333 87473 -191893 -65728 26620 132372 -226786 48993 -118540 -96332
4597 -96332 -27579 -424258 181672 261539 -78573 72858 -157048 -69351 -262375 -4449 -183179
4586 -183179 46493 160299 41514 -70365 280200 -81809 -105989 -372794 207824 -220358 -20823
4574 243806 62642 -18809 11805 43448 235156 61933 25912 106034 175336 -189706 -144093
4563 -144093 200129 219506 100320 20430 -121733 -60905 11224 -52142 -2853 -13556 -48256
4552 -48256 -46798 -131676 63192 96112 231120 18995 155329 369552 -230714 114136 -51970
4540 -130469 -142425 168262 -137878 -104720 76228 261048 262116 380411 -205797 389371 34605
4528 142891 231582 -106816 306717 -56261 -69421 84029 -197221 -5455 185551 -33681 -151308
4517 -151308 -6476 218761 -339342 288385 -56267 -134785 -164067 625336 -283021 48963 114537
4506 114537 16928 -290786 -69161 167772 -81240 289 165688 -12481 19395 37594 247780
4495 247780 460064 116770 -7762 -120722 82163 -320427 -20410 -41339 46763 368942 60895
4483 154126 134630 20734 118831 68578 -141691 -313924 258917 -33000 -109131 -164052 116501
$$ [...]
##END NTUPLES=NMR SPECTRUM
##END=
