
##TITLE=AC1321_SOiAH12150_6535441_4qZrv8xbqo
##JCAMPDX= 6.0         $$ Bruker NMR JCAMP-DX V2.0
##DATA TYPE= NMR SPECTRUM
##DATA CLASS= NTUPLES
##ORIGIN= BRUKER
##OWNER= Administrator
$$ 1.72 TOPSPIN		Version 2.1
$$ 2012-07-17 17:24:19.265 -0500  Administrator@TOPSPIN
$$ Compression mode = diff/dup
##.OBSERVE FREQUENCY= 400.02188249412
##.OBSERVE NUCLEUS= ^1H
##.ACQUISITION MODE= SIMULTANEOUS (DQD)
##.ACQUISITION SCHEME= undefined
##.AVERAGES= 64
##.DIGITISER RES= 22
##SPECTROMETER/DATA SYSTEM= spect
##.PULSE SEQUENCE= noesygpps1d.comp
##.SOLVENT NAME= COFFEE_meoh
##.SHIFT REFERENCE= INTERNAL, COFFEE_meoh, 1, 14.96088
##AUDIT TRAIL= $$ (NUMBER, WHEN, WHO, WHERE, PROCESS, VERSION, WHAT)
$$ ##TITLE= Audit trail, TOPSPIN		Version 2.1
$$ ##JCAMPDX= 5.01
$$ ##ORIGIN= Bruker BioSpin GmbH
$$ ##OWNER= Administrator
$$ $$ C:\Bruker\TOPSPIN/data/COFFEE/nmr/AC1321_SOiAH12150_6535441_4qZrv8xbqo/12/pdata/1/auditp.txt
$$ ##AUDIT TRAIL=  $$ (NUMBER, WHEN, WHO, WHERE, PROCESS, VERSION, WHAT)
(   1,<2012-07-17 17:24:13.843 -0500>,<Administrator>,<TOPSPIN>,<go>,<TOPSPIN 2.1>,
      <created by zg
	started at 2012-07-17 17:12:43.687 -0500,
	POWCHK enabled, PULCHK disabled,
       configuration hash MD5:
       6B 1B 68 BB D9 2E 58 E2 7F 35 AD 54 07 DF 0E 41
       data hash MD5: 64K
       66 3D 18 9C 1F 29 54 FE 39 B8 05 1F 8A 7E 3E 49>)
(   2,<2012-07-17 17:24:16.843 -0500>,<Administrator>,<TOPSPIN>,<proc1d>,<TOPSPIN 2.1>,
      <Start of raw data processing
       efp LB = 0.3 FT_mod = 6 PKNL = 1 PHC0 = 0 PHC1 = 0 SI = 128K 
       data hash MD5: 128K
       EB 7D 51 5C BF DF D9 C0 2B AC 85 64 5F FD E7 07>)
(   3,<2012-07-17 17:24:18.171 -0500>,<Administrator>,<TOPSPIN>,<proc1d>,<TOPSPIN 2.1>,
      <pk PHC0 = -0.8074951 PHC1 = 0 
       data hash MD5: 128K
       CF 62 93 75 5B BE FC 31 AF 96 AF 09 D4 F7 B8 38>)
(   4,<2012-07-17 17:24:18.921 -0500>,<Administrator>,<TOPSPIN>,<proc1d>,<TOPSPIN 2.1>,
      <abs ABSG = 1 
       data hash MD5: 128K
       88 2C C8 E9 C8 3B 7D 84 37 6D CD 5E 75 7B C0 74>)
(   5,<2012-07-17 17:24:19.000 -0500>,<Administrator>,<TOPSPIN>,<proc1d>,<TOPSPIN 2.1>,
      <abs ABSG = 2 
       data hash MD5: 128K
       81 58 9D 0A 87 F3 66 93 8D 53 83 53 DA 1A AE 6D>)
(   6,<2012-07-17 17:24:19.062 -0500>,<Administrator>,<TOPSPIN>,<proc1d>,<TOPSPIN 2.1>,
      <abs ABSG = 3 
       data hash MD5: 128K
       55 53 1C 72 7D 6D B4 48 6A 35 CB CD 26 3D 2F B4>)
(   7,<2012-07-17 17:24:19.109 -0500>,<Administrator>,<TOPSPIN>,<proc1d>,<TOPSPIN 2.1>,
      <abs ABSG = 4 
       data hash MD5: 128K
       C3 E6 FA 52 F5 65 B4 21 93 82 AE F3 EA 00 F8 46>)
(   8,<2012-07-17 17:24:19.156 -0500>,<Administrator>,<TOPSPIN>,<proc1d>,<TOPSPIN 2.1>,
      <abs ABSG = 5 
       data hash MD5: 128K
       E1 4A 00 23 73 7D 61 54 56 16 A7 75 F9 4B 3F 91>)
$$ ##END=
$$ 
$$ $$ hash MD5
$$ $$ 9A 96 24 7A 1D 6B 2D 37 3A 57 31 0C E8 F6 5C 91
##$RELAX= 
##$RELAX= 
##$RELAX= 
##$RELAX= 
##$RELAX= 
##$RELAX= 
##$RELAX= 
##$RELAX= 
$$ Bruker specific parameters
$$ [...]
##$TP07= 0
##$TPNAME0= <>
##$TPNAME1= <>
##$TPNAME2= <>
##$TPNAME3= <>
##$TPNAME4= <>
##$TPNAME5= <>
##$TPNAME6= <>
##$TPNAME7= <>
##$TPOAL= (0..7)
0.5 0.5 0.5 0.5 0.5 0.5 0.5 0.5
##$TPOFFS= (0..7)
0 0 0 0 0 0 0 0
##$TUNHIN= 0
##$TUNHOUT= 0
##$TUNXOUT= 0
##$USERA1= <user>
##$USERA2= <user>
##$USERA3= <user>
##$USERA4= <user>
##$USERA5= <user>
##$V9= 5
##$VALIST= <valist>
##$VCLIST= <CCCCCCCCCCCCCCC>
##$VD= 0
##$VDLIST= <DDDDDDDDDDDDDDD>
##$VPLIST= <PPPPPPPPPPPPPPP>
##$VTLIST= <TTTTTTTTTTTTTTT>
##$WBST= 2048
##$WBSW= 25
##$XGAIN= (0..3)
0 0 0 0
##$XL= 0
##$YL= 0
##$YMAX_a= 12010513
##$YMIN_a= -9366968
##$ZGOPTNS= <>
##$ZL1= 120
##$ZL2= 120
##$ZL3= 120
##$ZL4= 120
##$ABSF1= 14.96088
##$ABSF2= -5.597301
##$ABSG= 5
##$ABSL= 3
##$ALPHA= 0
##$AQORDER= 0
##$ASSFAC= 0
##$ASSFACI= 0
##$ASSFACX= 0
##$ASSWID= 0
##$AUNMP= <proc_prof1d_extract.lims>
##$AXLEFT= 0
##$AXNAME= <>
##$AXNUC= <1H>
##$AXRIGHT= 0
##$AXTYPE= 0
##$AXUNIT= <>
##$AZFE= 0.1
##$AZFW= 0.1
##$BCFW= 0
##$BC_mod= 0
##$BYTORDP= 0
##$COROFFS= 0
##$CY= 15
##$DATMOD= 1
##$DC= 0
##$DFILT= <>
##$DTYPP= 0
##$F1P= 0
##$F2P= 0
##$FCOR= 0.5
##$FTSIZE= 131072
##$FT_mod= 6
##$GAMMA= 0
##$GB= 0
##$INTBC= 1
##$INTSCL= 1
##$ISEN= 128
##$LB= 0.3
##$LEV0= 0
##$LPBIN= 0
##$MAXI= 10000
##$MC2= 0
##$MEAN= 0
##$ME_mod= 0
##$MI= 0
##$NCOEF= 0
##$NC_proc= -2
##$NLEV= 6
##$NOISF1= 0
##$NOISF2= 0
##$NSP= 0
##$NTH_PI= 0
##$NZP= 0
##$OFFSET= 14.96088
##$PC= 1
##$PHC0= -0.8074951
##$PHC1= 0
##$PH_mod= 1
##$PKNL= yes
##$PPARMOD= 0
##$PPDIAG= 0
##$PPIPTYP= 0
##$PPMPNUM= 2147483647
##$PPRESOL= 1
##$PSCAL= 4
##$PSIGN= 0
##$PYNMP= <proc.py>
##$REVERSE= no
##$SF= 400.02000968428
##$SI= 131072
##$SIGF1= 0
##$SIGF2= 0
##$SINO= 400
##$SIOLD= 131072
##$SPECTYP= <>
##$SREGLST= <1H.CDCl3>
##$SSB= 0
##$STSI= 131072
##$STSR= 0
##$SW_p= 8223.68421052631
##$SYMM= 0
##$S_DEV= 0
##$TDeff= 65536
##$TDoff= 0
##$TI= <>
##$TILT= no
##$TM1= 0
##$TM2= 0
##$TOPLEV= 0
##$USERP1= <user>
##$USERP2= <user>
##$USERP3= <user>
##$USERP4= <user>
##$USERP5= <user>
##$WDW= 1
##$XDIM= 131072
##$YMAX_p= 419302261
##$YMIN_p= -11065
##$CURPLOT= <Network HP LaserJet P1505>
##$CURPRIN= <$Network HP LaserJet P1505>
##$DFORMAT= <normdp>
##$LAYOUT= <+/1D_H.xwp>
##$LFORMAT= <normlp>
##$PFORMAT= <normpl>
##$SURQMSG= 1
$$ End of Bruker specific parameters
$$ ---------------------------------
##NTUPLES= NMR SPECTRUM
##VAR_NAME=  FREQUENCY,     SPECTRUM/REAL,   SPECTRUM/IMAG
##SYMBOL=    X,             R,               I
##VAR_TYPE=  INDEPENDENT,   DEPENDENT,       DEPENDENT
##VAR_FORM=  AFFN,          ASDF,            ASDF
##VAR_DIM=   131072,        131072,          131072
##UNITS=     HZ,            ARBITRARY UNITS, ARBITRARY UNITS
##FACTOR=    0.0627417313425164, 1,          1
##FIRST=     8223.62146879497, 1368,         -63808
##LAST=      0,             4485,            -62820
##MIN=       0,             -11065,          0
##MAX=       8223.62146879497, 419302261,    0
$$ Real data points
##PAGE= N=1
##DATA TABLE= (X++(R..R)), XYDATA
$$ [...]
61600C79418l086k737k280j394o77j067k351l337l507l441l546l454k875k133
61586C43533j595j257j141j359j671j620j226r25q33p13o13p58q76n02O0Q9k48
61569C28345k9P61R87J38p02m52L84N94O0j95N15J775K665K705K176J770J777
61552C43274J717J047J45o3N97J319J457J208Q80L35m72j034q74j73N75J062J120
61535C52120P16K96N78J625K588K710K105J276M59k49o16n90m80m99n66p27j206
61518C59540j822j963j519j144j254j400j112n98j29N53J503J981J435N56M06
61503C55033Q52Q14o9r68j054m08L94J012J471J963K600L193L300K748J946J370
61487C74197J048P83O21P08Q80R22R70J249J545J475J181J251K010L154M045M111
$$ y = [379418, 376332, 373595, 371315, 369921, 369244, 368177, 365826, 362489, 358982, 355541, 351995, 348541, 345666, 343533, 341938, 340681, 339540, 338181, 336510, 334890, 333664, 332739, 331906, 331193, 330580, 329822, 328946, 328444, 328504, 328593, 328345, 328316, 329077, 330064, 330202, 329500, 329048, 329432, 330026, 330086, 329891, 330406, 332181, 334846, 337551, 339727, 341497, 343274, 344991, 346038, 346183, 346120, 346717, 348036, 349493, 350701, 351581, 351916, 351444, 350410, 349536, 349363, 349938, 351000, 352120, 352836, 353132, 353710, 355335, 357923, 360633, 362738, 364014, 364473, 364224, 363608, 363018, 362538, 362039, 361473, 360746, 359540, 357718, 355755, 354236, 353092, 351838, 350438, 349326, 348728, 348599, 349152, 350655, 352636, 354071, 354627, 355033, 355885, 356699, 356630, 355662, 354608, 354200, 354594, 355606, 357077, 359040, 361640, 364833, 368133, 370881, 372827, 374197, 375245, 376028, 376649, 377357, 378237, 379159, 380129, 381378, 382923, 384398, 385579, 386830, 388840, 391994, 396039, 400150]
61471D00150L169J674M11l83j256k535l502l271k230j727k354l266l425k773j945
61456C76737j399j240j457j839j891j254j34Q63J308J236J031J084J431J671J426
61441C77573R37Q78J460K080K130J846J874K255K380K002J657J828K214K262K035
61426D05411J983K045J723J015N94Q42J297J407J323J485J902K303K699L177L412
61411D32618K897J648K24q60j365j204n71k2M9q6J7K27J11j99j63K71O28P72J104
61392D36096J754K261K170J458L37p59j078k80P24N63o87j412o22P18J176P90
61376D43209O64J252J943K149J930J554J077M42l02r05r96m72J20J0q68j754k074
61359D46979k007j859j426m78O21J305J551J843K579L830N342O522O757O059N089
$$ y = [400150, 403319, 404993, 405404, 405021, 403765, 401230, 397728, 394457, 392227, 390500, 388146, 384880, 381455, 378682, 376737, 375338, 374098, 372641, 370802, 368911, 367657, 367523, 368386, 369694, 370930, 371961, 373045, 374476, 376147, 377573, 378510, 379388, 380848, 382928, 385058, 386904, 388778, 391033, 393413, 395415, 397072, 398900, 401114, 403376, 405411, 407394, 409439, 411162, 412177, 412771, 413613, 414910, 416317, 417640, 419125, 421027, 423330, 426029, 429206, 432618, 435515, 437163, 437387, 436527, 435162, 433958, 433387, 433365, 433414, 433328, 433345, 433572, 433683, 433484, 433321, 433592, 434220, 434992, 436096, 437850, 440111, 442281, 443739, 444076, 443317, 442239, 441959, 442683, 443246, 442559, 441147, 440525, 441243, 442419, 443209, 443873, 445125, 447068, 449217, 451147, 452701, 453778, 454220, 453918, 453013, 452017, 451545, 451665, 451675, 450807, 449053, 446979, 444972, 443113, 441687, 441209, 441830, 443135, 444686, 446529, 449108, 452938, 458280, 464802, 471559, 477618, 482707]
61344D82707M289L475K450J549J173J278J677K366L154L494L123K506K201K225
61330E17667K297K251J890J065K47K12P44N67p59j791j075P48J906J994K093K836
61314E32892L723M438N432O864Q097Q676Q997R631J0651J1937J3455J4905J5669
61301F55367J5440J4432J2777J0313P166L973J160j498m183o419p567p751p821
61288F85389q481r655j0676j0917j0374r632r202q918q170o715n038l849l440
61275E80322l440l114k008m61O72R99J038J418J987K186K051K151K634L015L068
61260E92518L298M194N437O192O003N103L999K969J974R48Q0l00j66J17K63M18
61244F33047P67J022P34n9q34j237j371j405j267q09p8O81J177J255J064R97J393
$$ y = [482707, 486996, 490471, 492921, 494470, 495643, 496921, 498598, 500964, 504118, 507612, 510735, 513241, 515442, 517667, 519964, 522215, 524105, 525170, 525417, 525629, 526373, 526940, 526181, 524390, 523315, 524063, 525969, 527963, 530056, 532892, 536615, 541053, 546485, 553349, 561446, 570122, 579119, 588750, 599401, 611338, 624793, 639698, 655367, 670807, 685239, 698016, 708329, 715495, 719468, 720628, 719130, 714947, 708528, 700961, 693210, 685389, 676908, 667253, 656577, 645660, 635286, 625654, 616452, 607534, 599364, 592649, 587611, 583762, 580322, 576882, 573768, 571760, 571299, 571971, 572970, 574008, 575426, 577413, 579599, 581650, 583801, 586435, 589450, 592518, 595816, 600010, 605447, 611639, 617642, 622745, 626744, 629713, 631687, 632635, 632715, 632415, 632249, 632366, 632629, 633047, 633814, 634836, 635570, 635511, 634677, 633440, 632069, 630664, 629397, 628588, 628510, 629191, 630368, 631623, 632687, 633684, 635077]
61227F35077K324L750N558P344Q445Q586Q255Q141Q362Q544Q501Q430Q481Q572
61213G38370Q583Q467Q072P134N536L515J669O61P66J532K165K312K312K607L329
61198G97030M544O362Q510J0266J1248J1902J2759J3602J3839J3283J2116J0362
61186I25823Q030N575L570K035N73r22k152k970l623m427n459o462o959o748o422
61171H99462o841p857q332p802p352p982r011r206q878r432j0977j1960j1373
61158G82459j0032r129q632p791o451n081l930k817j534l3J604L077L957M050
61144G39717L499K450R18q99k516l527l894l799l427k870k031o11J506L898N923
61129G34337P331Q339R186J0030J1168J2882J5042J7146J8916K0548K2374K4522
$$ y = [635077, 637401, 641151, 646709, 654053, 662498, 671084, 679339, 687480, 695842, 704386, 712887, 721317, 729798, 738370, 746953, 755420, 763492, 770626, 776162, 779677, 781346, 782007, 782773, 784305, 786470, 788782, 791094, 793701, 797030, 801574, 807936, 816446, 826712, 837960, 849862, 862621, 876223, 890062, 903345, 915461, 925823, 933853, 939428, 942998, 945033, 945606, 944684, 942532, 939562, 935939, 931512, 926053, 919591, 912632, 905884, 899462, 892621, 884764, 876432, 868630, 861278, 853296, 844285, 835079, 826201, 816769, 805792, 793832, 782459, 772427, 763298, 754666, 746875, 740424, 735343, 731413, 728596, 727062, 727029, 728633, 731710, 735667, 739717, 743216, 745666, 746584, 745685, 743169, 739642, 735748, 731949, 728522, 725652, 723621, 723010, 724516, 728414, 734337, 741668, 750007, 759193, 769223, 780391, 793273, 808315, 825461, 844377, 864925, 887299, 911821]
61117I11821K6867K9091L0870L2183L3340L4636L6101L7674L9196M0109L9773
61106A291661L8426L7216L6816L6556L5498L3711L1661K9005K5035K0031J4984
61095A630600J0256N476P25l407o962j0681j4636j7835j9648k0763k2194k4045
61083A506886k5732k6974k7954k8753k9087k8568k7164k5468k4394k4282k4536
61072A213974k4335k3517k2360k0884j8989j7042j5603j4686j3895j3139j2598
61061A016926j2081j1144r787q473p484o727o040n233m097k782j762r13O54L132
61047I44189N182N605N195N720P594R887J2078J4293J6111J6877J7140J8177K0064
61034A098112K1723K2924K4526K6607K8051K8437K8785K9969L1863L4331L7473
$$ y = [911821, 938688, 967779, 998649, 1030832, 1064172, 1098808, 1134909, 1172583, 1211779, 1251888, 1291661, 1330087, 1367303, 1404119, 1440675, 1476173, 1509884, 1541545, 1570550, 1595585, 1615616, 1630600, 1640856, 1646332, 1647057, 1643650, 1636688, 1626007, 1611371, 1593536, 1573888, 1553125, 1530931, 1506886, 1481154, 1454180, 1426226, 1397473, 1368386, 1339818, 1312654, 1287186, 1262792, 1238510, 1213974, 1189639, 1166122, 1143762, 1122878, 1103889, 1086847, 1071244, 1056558, 1042663, 1029524, 1016926, 1004845, 993701, 983914, 975441, 967957, 961230, 955190, 949957, 945860, 943078, 941316, 940403, 941057, 944189, 949371, 954976, 960171, 965891, 973485, 983372, 995450, 1009743, 1025854, 1042731, 1059871, 1078048, 1098112, 1119835, 1142759, 1167285, 1193892, 1221943, 1250380, 1279165, 1309134, 1340997, 1375328, 1412801]
61023A412801M0526M2109M2164M2112M2722M3529M4855M8427N5074O3562P2573
61012A950454Q2160R2374J02487J12727J25162J41798J63566J92109K30347K80034
61002C473218L41222M15778N08785O25033P67946R44290J163398J422748J694377
60993A1356795J931188K085207K112699J968073J619980J099149N28042P6082
60985B2777215j40156j22977L1928K11291L26855L05198Q2559l54378r24082j472215
60975B0721238j858311k028958k017297j890147j703986j495758j289381j098421
60967G338979r27406p77161o48835n42267m54179l80762l20366k72096k33712
60958B782195k02579j77257j56747j39438j24063j10572r8933q8112p7199o6551
$$ y = [1412801, 1453327, 1495436, 1537600, 1579712, 1622434, 1665963, 1710818, 1759245, 1814319, 1877881, 1950454, 2032614, 2124988, 2227475, 2340202, 2465364, 2607162, 2770728, 2962837, 3193184, 3473218, 3814440, 4230218, 4739003, 5364036, 6131982, 7076272, 8239670, 9662418, 11356795, 13287983, 15373190, 17485889, 19453962, 21073942, 22173091, 22701133, 22777215, 22637059, 22514082, 22546010, 22757301, 23084156, 23389354, 23471913, 23117535, 22193453, 20721238, 18862927, 16833969, 14816672, 12926525, 11222539, 9726781, 8437400, 7338979, 6411573, 5634412, 4985577, 4443310, 3989131, 3608369, 3288003, 3015907, 2782195, 2579616, 2402359, 2245612, 2106174, 1982111, 1871539, 1772606, 1684494, 1607295, 1540744]
60948A540744n6954m8619m1824l7416l5607l5100l4386l3265l2291l1534l0767
60937A122981l0186k9949k9541k8450k7089k6201k5669k4629k2686k0371j8483
60926H39727j7350j6664j5797j4475j3140j2358j1953j1286j0331r664r311q535
60914F88863p144o078o055o434o104m983l918l522l714m098m199l582k313j094
60900F25625n77o93r98j335j758k114k154j981k008k575l737n228o480o925o572
60885E80490o083o080o540p010p151o929o550o284o190o008n503m925m644m428
60871D96165l619k096n40M15Q01R28R29R60J298J953K573K995L444L927M003L513
60855E17649L005K988L191L081K733K607K744K686K144J235K10p14j251j248r65
$$ y = [1540744, 1483790, 1435171, 1393347, 1355931, 1320324, 1285224, 1250838, 1217573, 1185282, 1153748, 1122981, 1092795, 1062846, 1033305, 1004855, 977766, 951565, 925896, 901267, 878581, 858210, 839727, 822377, 805713, 789916, 775441, 762301, 749943, 737990, 726704, 716373, 706709, 697398, 688863, 681719, 675641, 669586, 663152, 657048, 652065, 648147, 644625, 640911, 636813, 632614, 629032, 626719, 625625, 625048, 624355, 623357, 622022, 620264, 618150, 615996, 614015, 612007, 609432, 605695, 600467, 593987, 587062, 580490, 574407, 568327, 561787, 554777, 547626, 540697, 534147, 527863, 521673, 515665, 510162, 505237, 500593, 496165, 492546, 490450, 489910, 490325, 491126, 492054, 492983, 493943, 495241, 497194, 499767, 502762, 506206, 510133, 514136, 517649, 520654, 523642, 526833, 529914, 532647, 535254, 537998, 540684, 542828, 544063, 544273, 543559, 542308, 541060, 540095]
60840E40095r13j339k131l163m480o059p596q622q858q443p769p112o436n649
60826D61525m886m393m226m236m271m136l568k516j448j019j442k350l193l581
60812D16260l422l052k990l259l204k469j705j673j901j260K17J175P91j67o11
60797C92730m55j20M62J466K332K260J346N15M10R14J588K017J807Q76k00o03
60781D07345k11K56J13n30j074j224j264j594k222k740k801k451j993j609j281
60766C86720r52n49QO22R26P06L12K69N23N06K9m79p05q83j160j101l47O01Q92
60747C85938M95K69Q88K057L008L324L053K312J198J3q46j344j898k689l235l004
60731C89539k341k118k411k263j152K8J68m15m70L45J088J140J086J630K370K389
$$ y = [540095, 539182, 537843, 535712, 532549, 528069, 522010, 514414, 505792, 496934, 488491, 480722, 473610, 467174, 461525, 456639, 452246, 448020, 443784, 439513, 435377, 431809, 429293, 427845, 426826, 425384, 423034, 419841, 416260, 412838, 409786, 406796, 403537, 400333, 397864, 396159, 394486, 392585, 391325, 391542, 392717, 393508, 393341, 392730, 392275, 392155, 392617, 394083, 396415, 398675, 400021, 400536, 400946, 401860, 403448, 405465, 407272, 408148, 407948, 407345, 407134, 407390, 407503, 406973, 405899, 404675, 403411, 401817, 399595, 396855, 394054, 391603, 389610, 388001, 386720, 385768, 385219, 385227, 385849, 386775, 387481, 387793, 388062, 388585, 389091, 389120, 388641, 387936, 387053, 385893, 384792, 384445, 385046, 385938, 386433, 386702, 387590, 389647, 392655, 395979, 399032, 401344, 402542, 402555, 401709, 400365, 398467, 395778, 392543, 389539, 387198, 385080, 382669, 380406, 379254, 379282, 379450, 379035, 378565, 378910, 379998, 381138, 382224, 383854, 386224, 388613]
60715C88613J601Q62Q71J429J789J418M43n41j046j109j063j038q73n78m76p99
60699C89503j343j675j567j140p66p70j155j576j722j622j463j251q75l80P5M48
60683C72721P75J063J429K066K824L108K657K080K179K912L599L909L973L752
60669D09047L026K049J370R69J96j206k634l344l150k292j163k69L6n2n6J16K56
60652D02899M89J075J682J645J087Q86J350J808J831J890K324K506J743L74p55
60637D22834j405j814j967j753j564j993k957l654l381k154o01M77P19N47P30
60622D02064J384J802J452P47M56P35J157J384J368J066M17l96r99j120p81k97
60606D10439k6NJ17M50N96K16k40j35K62J29m65m28P40K151K751K522J996J402
$$ y = [388613, 390214, 391076, 391947, 393376, 395165, 396583, 397026, 396485, 395439, 394330, 393267, 392229, 391356, 390778, 390302, 389503, 388160, 386485, 384918, 383778, 383012, 382242, 381087, 379511, 377789, 376167, 374704, 373453, 372578, 372198, 372273, 372721, 373496, 374559, 375988, 378054, 380878, 383986, 386643, 388723, 390902, 393814, 397413, 401322, 405295, 409047, 412073, 414122, 415492, 416461, 416657, 415451, 412817, 409473, 406323, 404031, 402868, 402599, 402635, 402583, 402527, 402643, 402899, 403388, 404463, 406145, 407790, 408877, 409763, 411113, 412921, 414752, 416642, 418966, 421472, 423215, 423589, 422834, 421429, 419615, 417648, 415895, 414331, 412338, 409381, 405727, 402346, 400192, 399591, 400068, 400787, 401334, 402064, 403448, 405250, 406702, 407449, 407905, 408640, 409797, 411181, 412549, 413615, 414032, 413636, 412637, 411517, 410736, 410439, 410413, 410418, 410535, 410985, 411581, 411797, 411557, 411422, 411684, 411813, 411348, 410920, 411660, 413811, 416562, 419084, 421080, 422482]
60588D22482Q39O60R75J320J352J357J539J493R21L04J85L64M53O82J393K301
60572D38620L003L759M994O456P724R062J0859J2617J3485J3614J3881J4398J4260
60559E66732J2837J0415P479M221R34j911m225o273p937q608q073o895n640m260
60545E48796k498m87J380K845L907M808O017P842J0000J1932J3601J5612J8390
60532F42145K1566K4393K6427K7613K7884K6925K4216J9411J2886N900j52m807
60520H54407q657j2342j5658j7826j8452j7979j7144j6157j4588j2120r179o569
60508F87736m622l004j424L0J394L223O040R727J3782J8045K2709K7787L2928
60495H14351L7752M2129M6099M9640N2403N3643N2672M9523M4942L9606L3733
$$ y = [422482, 423321, 423981, 424956, 426276, 427628, 428985, 430524, 432017, 432938, 433242, 433427, 433791, 434244, 434926, 436319, 438620, 441623, 445382, 450376, 456832, 464556, 473618, 484477, 497094, 510579, 524193, 538074, 552472, 566732, 579569, 589984, 597463, 601684, 602618, 600707, 596482, 590209, 582272, 573664, 565591, 558696, 553056, 548796, 546298, 545811, 547191, 550036, 553943, 558751, 564768, 572610, 582610, 594542, 608143, 623755, 642145, 663711, 688104, 714531, 742144, 770028, 796953, 821169, 840580, 853466, 859366, 859214, 854407, 845750, 833408, 817750, 799924, 781472, 763493, 746349, 730192, 715604, 703484, 694305, 687736, 683114, 680110, 678686, 678716, 680110, 683333, 689373, 699100, 712882, 730927, 753636, 781423, 814351, 852103, 894232, 940331, 989971, 1042374, 1096017, 1148689, 1198212, 1243154, 1282760, 1316493]
60484A316493K7578K1917J7566J4612J2323R549N051k037j1585k2461l3370m3466
60472A312170n2030n8190o1528o2535o1889n9661n5804n0953m6002m1128l5994
60461G26456l0817k6356k2867j9903j7318j5635j5016j4569j3256j1114r032p554
60449E23019o478n583n107n249n528n227m328l568l394l334k794k041j811k096
60435D66481k081j336l88P1k2m16j020j722k143j984j401p53k46Jl4r8J26N04
60417D53539O14M78N07P25Q06J010K059L699M431L407J692Q81J223J929K567L062
60401D82629L062K378J693J745K140J993J416J253J611J785J583J556J861K018
60387E08723J944K219L020L701L754L462L258L078K700K214J797J475J330J574
$$ y = [1316493, 1344071, 1365988, 1383554, 1398166, 1410489, 1420038, 1425089, 1423052, 1411467, 1389006, 1355636, 1312170, 1260140, 1201950, 1140422, 1077887, 1015998, 956337, 900533, 849580, 803578, 762450, 726456, 695639, 669283, 646416, 626513, 609195, 593560, 578544, 563975, 550719, 539605, 530573, 523019, 516541, 510958, 505851, 500602, 495074, 489847, 485519, 481951, 478557, 475223, 472429, 470388, 468577, 466481, 464400, 463064, 462676, 462747, 462725, 462309, 461289, 459567, 457424, 455440, 454039, 453286, 453040, 453041, 453007, 452909, 453035, 453539, 454153, 454631, 455138, 455863, 456669, 457679, 459738, 463437, 467868, 471275, 472967, 473848, 475071, 477000, 479567, 482629, 485691, 488069, 489762, 491507, 493647, 495640, 497056, 498309, 499920, 501705, 503288, 504844, 506705, 508723, 510667, 512886, 515906, 519607, 523361, 526823, 530081, 533159, 535859, 538073, 539870, 541345, 542675, 544249]
60373E44249K214K957L502L666L315K578K037K220K877L176K657J630P44M76R70
60358E79268J869K447K322J971K242L478N400P505R197R895R569Q860Q208P247
60344F59478N583L655K040M17j833m306n899o307o223o125n865n471n352n465
60330F18327n171m204l189k887l423m377n128n211m710m265m202l998l129k024
60316E62409j357q20M43K437M425O204Q209J0386J2074J3068J3804J4444J4732
60303F60458J4750J4791J4623J3902J3137J2864J2059R040M030r12m861r093j4447
60290G40341j9404k1967k1998k0518j7923j4324j0630p853n921m323l297l218
60278E88965l446l087k463k588l456m071l996l785l860l948l748l408l148l061
$$ y = [544249, 546463, 549420, 552922, 556588, 559903, 562481, 564518, 566738, 569615, 572791, 575448, 577078, 577822, 578298, 579268, 581137, 583584, 585906, 587877, 590119, 593597, 598997, 606502, 615699, 625594, 635163, 644023, 652231, 659478, 665061, 668716, 670756, 671173, 669340, 665034, 659135, 652828, 646605, 640480, 634615, 629144, 623792, 618327, 613156, 608952, 605763, 602876, 599453, 595076, 589948, 584737, 580027, 575762, 571560, 567562, 564433, 562409, 561052, 560232, 560675, 563112, 567537, 573741, 581950, 592336, 604410, 617478, 631282, 645726, 660458, 675208, 689999, 704622, 718524, 731661, 744525, 756584, 765624, 769654, 768742, 763881, 754788, 740341, 720937, 698970, 676972, 656454, 638531, 624207, 613577, 605724, 599803, 595480, 592183, 588965, 585519, 582432, 579969, 577381, 573925, 569854, 565858, 562073, 558213, 554265, 550517, 547109, 543961, 540900]
60264E40900l256l723m069l867l267k734k353j840j147n48j85J8O3n6p7L46J180
60247E15385K020K512K563K288K025K161K653K953K646J950J220L42r15k107k366
60232E35330j497l36J88R6K23J117K349L016K818K320K120K242K504L059L938
60217E59487M607M661M706N564O813P145O388N969O983Q743R917J0219J0320J0687
60203F62209J1273J1831J1893J0905R024P372O903P331P663P390O587N327L712
60190G69420K134Q89k78j663k912l575m067n273p206q793r189q745q413q553q662
60175F95114q140p078o142n720n425m644l450k505k132j967j629j261j168j436
60161F42417k040k854l373k945j595j45P70J257J565J533J098P89J097J772K197
$$ y = [540900, 537644, 533921, 529852, 525985, 522718, 519984, 517631, 515791, 514644, 514096, 513911, 513929, 513992, 513936, 513859, 514205, 515385, 517405, 519917, 522480, 524768, 526793, 528954, 531607, 534560, 537206, 539156, 540376, 540718, 539803, 537696, 535330, 533833, 533497, 533685, 533781, 534004, 535121, 537470, 540486, 543304, 545624, 547744, 549986, 552490, 555549, 559487, 564094, 568755, 573461, 579025, 585838, 592983, 599371, 605340, 612323, 621066, 630983, 641202, 651522, 662209, 673482, 685313, 697206, 708111, 717135, 724507, 731410, 738741, 746404, 753794, 760381, 765708, 769420, 771554, 772443, 772165, 770502, 767590, 764015, 759948, 754675, 747469, 738676, 729487, 720742, 712329, 703776, 695114, 686974, 679896, 673754, 668034, 662609, 657965, 654515, 652010, 649878, 647911, 646282, 645021, 643853, 642417, 640377, 637523, 634150, 631205, 629610, 629465, 630235, 631492, 633057, 634590, 635688, 636477, 637574, 639346, 641543]
60146F41543K157J759R83p7p90l76J299L597N684P066P800Q514R858J1746J3357
60131G14120J4089J4130J3915J3401J2272J0439Q095N560L230J372k22j844l125
60118H05432l267k228r54j14O28J654K523K696K401K100J720J067N47O14R02O72
60102H16393j64j153k105l135m121m776n118n378n535n434n064m472l629k750
60088G63559k279k177j783q26J9K12L24J129K318L023L254L750M573M828L907
60073G83831K130M3k282m987p896j0477j2172j2844j2999j3347j3884j3823j2731
60060F68562j1281j0401j0104r677q671p167n405l754k696k317k048j381n36J07
60046E93231P61J837L154M176M762N041M953M546M385M939N865O508O733O631
$$ y = [641543, 643700, 645459, 646442, 646365, 645575, 645199, 646498, 650095, 655779, 662845, 670645, 679159, 689017, 700763, 714120, 728209, 742339, 756254, 769655, 781927, 792366, 800461, 806021, 809251, 810623, 810401, 808557, 805432, 802165, 799937, 798983, 798869, 799497, 801151, 803674, 806370, 808771, 810871, 812591, 813658, 814205, 814819, 815721, 816393, 816229, 815076, 812971, 809836, 805715, 800939, 795821, 790443, 784908, 779474, 774410, 769938, 766309, 763559, 761280, 759103, 757320, 756494, 756513, 756725, 757049, 758178, 760496, 763519, 766773, 770523, 775096, 779924, 783831, 785961, 786004, 783722, 778735, 770839, 760362, 748190, 735346, 722347, 709000, 695116, 681293, 668562, 657281, 646880, 636776, 627099, 618428, 611261, 605856, 602102, 599406, 597089, 595041, 593660, 593124, 593231, 593992, 595829, 598983, 603159, 607921, 612962, 617915, 622461, 626846, 631785, 637650, 644158, 650891, 657522]
60032F57522N878M275K530J509R54j26j860l340m073m686n957p875r854j1379
60018F23518j2186j2262j1761j0787r413q100p571p783p549n907l456j618r37
60005E24188q93j068j470j879j790j109j88O92J311J245M39k31J15J101J626J532
59989E23621J646K271K760K724K684L161L977M722N265N553N441M912L948K338
59975E75023J83j619k229k086k332l072l266k339q27O54K057L287M011M516N660
59960E77621P597R446J0660J1665J2624J2621J0875Q013N234K803K50k459m777
59947F62173o371p275p489p059o423o078n892n327m287l336l033l357l851m050
59933E88345l702k808j562k02J143K465L723M697N041M600L647K604J592N20m14
$$ y = [657522, 663400, 667675, 670205, 671714, 672668, 672542, 670682, 667342, 663269, 658583, 652626, 644751, 634897, 623518, 611332, 599070, 587309, 576522, 567109, 559009, 551438, 543655, 536106, 530199, 526743, 525125, 524188, 523295, 522227, 520757, 518878, 517088, 515979, 515791, 516483, 517794, 519039, 519478, 519247, 519362, 520463, 522089, 523621, 525267, 527538, 530298, 533022, 535706, 538867, 542844, 547566, 552831, 558384, 563825, 568737, 572685, 575023, 575206, 573587, 571358, 569272, 566940, 563868, 560602, 558263, 557436, 558090, 560147, 563434, 567445, 571961, 577621, 585218, 594664, 605324, 616989, 629613, 642234, 653109, 661122, 666356, 669159, 669409, 666950, 662173, 655802, 648527, 641038, 633979, 627556, 621478, 615586, 610259, 605972, 602636, 599603, 596246, 592395, 588345, 584643, 581835, 580273, 580071, 581214, 583679, 587402, 592099, 597140, 601740, 605387, 607991, 609583, 610103, 609689]
59918F09689p95o99p01q76m18J212L324M849N712O595P708Q681R418J0163J0741
59903F74603J0603R672Q409O964N027K620L33j443k904m264n323n782n527m597
59889F88391l267k129j532r48M44K551M387N341N809O387P072P519P697P878Q269
59874G43869Q741Q835Q144O826N524M553L633K691K305K713L044K392J150L22
59860H04742l6o26j474j981k209k858l947m707m919n115n280m618k965j236n9
59845G62712R85K292L414L940M124M056L073Q13j826l540l893l288k195j036l25
59830G69306k80o50j275k389m038n606o454o620o637o909p504q202q564q260p461
59815F88457o611n787m727l417k153j071k08J31k44p33n30J50K84m28j184j365
$$ y = [609689, 608894, 608195, 607494, 606618, 606200, 607412, 610736, 615585, 621297, 627892, 635600, 644281, 653699, 663862, 674603, 685206, 694878, 703287, 710251, 715278, 717898, 718231, 716788, 713884, 709620, 704297, 698515, 692988, 688391, 685124, 682995, 681463, 680515, 680959, 683510, 687897, 693238, 699047, 705434, 712506, 720025, 727722, 735600, 743869, 752610, 761445, 769589, 776415, 781939, 786492, 790125, 792816, 795121, 797834, 800878, 803270, 804420, 804742, 804706, 804080, 802606, 800625, 798416, 795558, 791611, 786904, 781985, 776870, 771590, 766972, 764007, 762771, 762712, 763697, 765989, 769403, 773343, 777467, 781523, 784596, 785409, 783583, 780043, 776150, 772862, 770667, 769631, 769306, 769026, 768376, 767101, 764712, 760674, 755068, 748614, 741994, 735357, 728448, 720944, 712742, 704178, 695918, 688457, 681846, 676059, 671332, 667915, 665762, 664691, 664483, 664614, 664370, 663637, 663107, 663257, 663541, 663113, 661929, 660564]
59799F60564j240j133r15p09j127k269l252l337k930k926l533m194m261l448k088
59784F23202j053j014j647k110k196k406k918l262l105k599j881j031m53m16l07
59769E96804P19K364L540M063M754N783O323O120O058O706P572Q266R156J0329
59755F78557J1173J1559J2230J3480J4704J5747J7262J9075J9816J9094J8448
59744H51145J8997J9554J8509J6289J4406J3035J1198Q626N870L062k8k970m992
59731I72701o128p074q164r289j0390j1211j1119r986q722q121p770p061o425
59718H61241o569p142p335p230p351p366o551n173m172l703l178k522k179k005
59704G88765j267J43J490K175K290K127J944K076K651L276L540L593L717L655
$$ y = [660564, 659324, 658191, 657276, 656567, 655440, 653171, 649919, 646582, 643652, 640726, 637193, 632999, 628738, 625290, 623202, 622149, 621135, 619488, 617378, 615182, 612776, 609858, 606596, 603491, 600892, 599011, 597980, 597527, 597111, 596804, 597523, 599887, 603427, 607490, 612244, 618027, 624350, 630470, 636528, 643234, 650806, 659072, 668228, 678557, 689730, 701289, 713519, 726999, 741703, 757450, 774712, 793787, 813603, 832697, 851145, 870142, 889696, 908205, 924494, 938900, 951935, 963133, 971759, 977629, 980691, 980663, 977693, 972701, 966573, 959499, 951335, 942046, 931656, 920445, 909326, 899340, 890618, 882497, 874727, 867666, 861241, 854672, 847530, 840195, 832965, 825614, 818248, 811697, 806524, 802352, 798649, 795471, 792949, 790770, 788765, 787498, 787641, 789131, 791306, 793596, 795723, 797667, 799743, 802394, 805670, 809210, 812803, 816520, 820175]
59690H20175L017J914O71o90k083k977l103k997l127l145k713k415k911l849m626
59675G91141n517o938q238q499q082q013q236p870o901o168n757m896l519k582
59661F99925k531k644k264j618j083m83M49J642K937M192N023N087M661M284L926
59646G21503L205K317J866J751J090n89k802m936o860q515r518r535q675p401
59632F72901o281n744n702n544m891m133l870m119m552n076n627n802n296m512
59618F01752m042l962m055m325m646m506l822l371l578l537k268l53Q98J346J784
59603E63315K190J799Q35O34J740L104L514K787J387q7p75n9J457K326J997J340
59587E87504J164J203R24M54R1l54j141j993k410k336k076j839j607j305j005
$$ y = [820175, 823192, 825106, 825777, 825087, 823004, 820027, 816924, 813927, 810800, 807655, 804942, 802527, 799616, 795767, 791141, 785624, 778686, 770448, 761949, 753867, 745854, 737618, 729748, 722847, 716679, 710922, 706026, 702507, 699925, 697394, 694750, 692486, 690868, 689785, 689302, 689751, 691393, 694330, 698522, 703545, 708632, 713293, 717577, 721503, 724708, 727025, 728891, 730642, 731732, 731143, 728341, 723405, 716545, 708030, 698512, 688977, 680302, 672901, 666620, 660876, 655174, 649630, 644739, 640606, 636736, 632617, 628065, 622989, 617362, 611560, 606264, 601752, 597710, 593748, 589693, 585368, 580722, 576216, 572394, 569023, 565445, 561908, 559640, 559287, 560185, 561531, 563315, 565505, 567304, 568139, 568773, 570513, 573617, 577131, 579918, 581305, 581218, 580443, 580384, 581841, 584167, 586164, 587504, 588668, 589871, 590795, 591249, 591340, 590986, 589845, 587852, 585442, 583106, 581030, 579191, 577584, 576279, 575274]
59572E75274r74j388j909j875j252r47j631k619k628j437j14L70Q1k99l32j31
59556E58189j11m43o86l58K17K47k19k36M68R64P67P69J670K613K644K475L424
59539E72394N464P746J0232J3224J6006J7655J8531J9074J7701J2246L526m620
59527G09179r263j0611j0144q515o034l449j252P34K410L075K566J715J186P82
59513F72379J60o84j871l563n255o270o948q161r528r596q080o418n710n483n065
59498E89907m717m676m326l227j932j069m93J1K07J74N76J519K095J744J253J588
59482E78634K607L517L955M048L998M100M552M953M701M071L988M512M689M151
59468F36476L747M021M286L828L032K532K220J732J158O49J17j73L69J637K751
$$ y = [575274, 574300, 572912, 571003, 569128, 567876, 566929, 565298, 562679, 560051, 558614, 558500, 558870, 558951, 558652, 558320, 558189, 558078, 557635, 556949, 556591, 556808, 557055, 556836, 556600, 557068, 558032, 558799, 559568, 561238, 563851, 566495, 568970, 572394, 577858, 585604, 595836, 609060, 625066, 642721, 661252, 680326, 698027, 710273, 713799, 709179, 699916, 689305, 679161, 670646, 664612, 661163, 659911, 660645, 663055, 666130, 668696, 670411, 671597, 672379, 672539, 671855, 669984, 666421, 661166, 654896, 647948, 639787, 630259, 620663, 612583, 606165, 600455, 594972, 589907, 585190, 580514, 576188, 572961, 571029, 569960, 569467, 569478, 569685, 569859, 570435, 571954, 574049, 575793, 577046, 578634, 581241, 584758, 588713, 592761, 596759, 600859, 605411, 610364, 615065, 619136, 623124, 627636, 632325, 636476, 640223, 644244, 648530, 652358, 655390, 657922, 660142, 661874, 663032, 663681, 663798, 663625, 663994, 665631, 668382]
59453F68382L441M459O056P218P149O469O099N939N526N043M743M184K938J318
59439G38964l60k461n068p100p466o478n256m239l199k171j439q64o4R60K021
59424F95780L272M987P021Q959J0587J1912J3086J4505J6525J8957K1367K3874
59412H50832K6848K9762L1456L1687L1116K9314K4247J4889L367o567j2596j4603
59400A039752j3371r754m785N09N387Q971R892O989L13q743j7913k4737k7676
59387I64834k7156k5002k2614k0211j7807j5773j4146j2397j0358q422o559m308
59375G80081k150j457k344k976j891J80J744K508K909K869K391K329L283M477
59361G91953M982N181N874O722O984O988P528Q383Q883R322J0373J1539J1787
$$ y = [668382, 671823, 676282, 682338, 689556, 696705, 703174, 709273, 715212, 720738, 725781, 730524, 734708, 737646, 738964, 738604, 736143, 731075, 723975, 716509, 710031, 704775, 700536, 697337, 695166, 693727, 692863, 692799, 693759, 695780, 699052, 704039, 711060, 720019, 730606, 742518, 755604, 770109, 786634, 805591, 826958, 850832, 877680, 907442, 938898, 970585, 1001701, 1031015, 1055262, 1070151, 1073518, 1066951, 1054355, 1039752, 1026381, 1016627, 1011842, 1012351, 1017738, 1026709, 1036601, 1043590, 1043903, 1035160, 1017247, 992510, 964834, 937678, 912676, 890062, 869851, 852044, 836271, 822125, 809728, 799370, 790948, 784389, 780081, 777931, 776474, 774130, 771154, 769263, 769443, 771187, 773695, 776604, 779473, 781864, 784193, 787476, 791953, 796935, 802116, 807990, 814712, 821696, 828684, 836212, 844595, 853478, 862800, 873173, 884712, 896499]
59348H96499J1397J1696J2992J4217J4691J4883J5159J4949J3564J1122Q350O017
59336A045536M518L467J803j108m581p494r731j2035j4596j6670j7662j7908j8116
59323I35423j8536j8780j8227j6624j4439j2425j0879r588q540q007p790p141
59311G84447n790m418l744l799m293m899m877l484j168O42J519K673M978P640
59297G65427R691J1507J3688J5464J5586J3851J0504N081k463j0176j5371j7279
59285H15510j7147j6021j3949j1175q512o272l908j049J942M558O562P929Q988
59272G67456J0495J2852J5405J7158J7952J8349J8655J8754J8511J7718J5982
59261I49287J3349J0601Q292N982L099jk564m440n809o556o733o933p308o994
$$ y = [896499, 907896, 919592, 932584, 946801, 961492, 976375, 991534, 1006483, 1020047, 1031169, 1039519, 1045536, 1050054, 1053521, 1055324, 1054216, 1049635, 1042141, 1032410, 1020375, 1005779, 989109, 971447, 953539, 935423, 916887, 898107, 879880, 863256, 848817, 836392, 825513, 815925, 807385, 799378, 791588, 784447, 778657, 774239, 770495, 766696, 762403, 757504, 752627, 749143, 747975, 748617, 750136, 752809, 757787, 765427, 775118, 786625, 800313, 815777, 831363, 845214, 855718, 860799, 858336, 848160, 832789, 815510, 798363, 782342, 768393, 757218, 748706, 742434, 738526, 737477, 739419, 743977, 750539, 758468, 767456, 777951, 790803, 806208, 823366, 841318, 859667, 878322, 897076, 915587, 933305, 949287, 962636, 973237, 981529, 987511, 990610, 990609, 988045, 983605, 977796, 971240, 964507, 957574, 950266, 943272]
59247I43272n506l947l579l892l442k179j462k027l235m345n243n972o443o713
59233H85287o784o350n419m785n081n796o109o152o502p021p279p621q567r524
59219G92297r444q449p643p483p424p021o287n233m002l171k966k597j421k58
59205G18898l39j369j937j493o45J89J055J645J492R04N32K09o18j639k091k109
59189G12684k366k680k338j557j164j012k05J234K360K858L193L303K691J757
59175G18758J563K133K452K155J790J434N53o15j107q34o67p48l14O40J123Q76
59159G29192P59J035Q05l04j464k234l270m801n833n802n686o495p785q565q775
59144F70777q856q659p689n987m122k723k316l027m146m613m229l627l016j836
$$ y = [943272, 937766, 933819, 930240, 926348, 922906, 920727, 919265, 917238, 914003, 909658, 904415, 898443, 892000, 885287, 878503, 872153, 866734, 861949, 856868, 851072, 844963, 838811, 832309, 825288, 818009, 810388, 801821, 792297, 782853, 774404, 766761, 759278, 751854, 744833, 738546, 733313, 729311, 726140, 723174, 720577, 719156, 718898, 718559, 717190, 715253, 713760, 713115, 713304, 714359, 716004, 717496, 718400, 718932, 719141, 718523, 716884, 714793, 712684, 710318, 707638, 705300, 703743, 702579, 701567, 701362, 702596, 704956, 707814, 711007, 714310, 717001, 718758, 720321, 722454, 724906, 727061, 728851, 730285, 730838, 730223, 729116, 728282, 727615, 726867, 726553, 727193, 728316, 729192, 729951, 730986, 731791, 731487, 730023, 727789, 724519, 719718, 713885, 708083, 702397, 695902, 688117, 679552, 670777, 661921, 653262, 645573, 639586, 635464, 632741, 630425, 627398, 623252, 618639, 614410, 610783, 607767, 605931]
59130F05931M7J788K685L049L516M204M923N614O206O602O944P475P997Q169Q215
59115F83365Q666R421R901J0020J0174J0241R622Q310P038O210N451M356K950
59102G85725J501M38K70Q58J173N94j52k83m67j646l096l391k870l191m517n155
59086G65791m161k497j224l09L15J26r50k271l659n512p525q748r180r682j0076
59071G00438r076o617m428l588l288k765k694l619m527m248l065j924j138p80
59057F48681j240k404l320l433l255l139k587j434n08k81J6J014K030K179J659
59042F33978J116O51K42K20O01P80O22Q91J951K985L217K940K781K896L504N108
59026F64483P509R710J1422J3576J6653J9706K1833K3432K5048K6013K5247K2583
$$ y = [605931, 605978, 607766, 610451, 613500, 617016, 621220, 626143, 631757, 637963, 644565, 651509, 658984, 666981, 675150, 683365, 692031, 701452, 711353, 721373, 731547, 741788, 751410, 759720, 766758, 772968, 778419, 782775, 785725, 787226, 787664, 787934, 788792, 789965, 790559, 790407, 790124, 789657, 788011, 784915, 781524, 778654, 775463, 770946, 765791, 761630, 759133, 757909, 757600, 757915, 758041, 757091, 754820, 751161, 745649, 738124, 729376, 720196, 710514, 700438, 691362, 684745, 680317, 676729, 673441, 670676, 667982, 664363, 659836, 655588, 652523, 650599, 649461, 648681, 647441, 645037, 641717, 638284, 635029, 631890, 629303, 627869, 627361, 627080, 627096, 628110, 630140, 632319, 633978, 635094, 635745, 635987, 636207, 636808, 637588, 638210, 639101, 641052, 644037, 647254, 650194, 652975, 655871, 659375, 664483, 671992, 681702, 693124, 706700, 723353, 743059, 764892, 788324, 813372, 839385, 864632, 887215]
59014H87215J8445J3072O869P67m583r240j3090j5412j5914j5336j4496j3529
59002H24768j2401j1184r492o803l659j279K78J986L611L509J387o83j124q74
58988G88040j312j921j608q13o05q69r96j267j970k169r37R85K322L215M601O433
58972G91129Q058R611J1553J3333J4048J3963J4042J4304J4004J3023J1989J1221
58960I40278J0596J0060R320P554M393P48k240m577o899r327j1718j4289j6939
58947I16960j8622j8578j7589j6979j6827j6248j4859j2926j0564p875n484l913
58935G56496k734j210N82K069L098L853M346M750N605O958P837P344N703L665
58921H08362J560m50k057l418n118o875p344o118m756m691n279n068m024l042
$$ y = [887215, 905660, 918732, 925601, 926368, 921785, 912545, 899455, 884043, 868129, 852793, 838297, 824768, 812367, 801183, 791691, 784888, 781229, 779950, 780228, 782214, 785825, 789334, 790721, 790038, 788914, 788040, 786728, 784807, 783199, 782386, 781781, 780912, 779916, 778649, 776679, 774510, 773573, 774558, 776880, 780095, 784696, 791129, 799187, 808798, 820351, 833684, 847732, 861695, 875737, 890041, 904045, 917068, 929057, 940278, 950874, 960934, 970254, 977808, 982201, 982949, 980709, 976132, 969233, 959906, 948188, 933899, 916960, 898338, 879760, 862171, 845192, 828365, 812117, 797258, 784332, 773768, 765893, 760409, 756496, 753762, 752552, 753134, 755203, 758301, 762154, 766500, 771250, 776855, 783813, 791650, 798994, 804697, 808362, 809922, 809472, 807415, 803997, 798879, 792004, 784660, 778542, 773786, 769095, 763816, 758748, 754724, 751682]
58907G51682k150o91J229K907M298N939P922R882J1671J3196J4065J4155J3970
58894H48075J3825J3407J2703J2417J2754J2884J2545J2928J4904J7439J8984
58883A002865J9355J9052J7903J5775J3550J1846R736O302K525k7j597l576o051
58870A107658p873q710r343j0015j0091r254p906o421n059m331m453m802m839
58857A014561n062o085p438q341q926r608r871r035p555o402n588m492l117k009
58843I21032j500j939l864o993r942j1951j3851j6232j7934j7847j6884j6477
58831G85618j6185j4696j2364j0644r687q450o749n315m177k724j111K1R04K150
58817F96591L350L686L492L658L891L293K202J760J938J731J033O79P74N49k59
$$ y = [751682, 749532, 748841, 750070, 752977, 757275, 763214, 771136, 781018, 792689, 805885, 819950, 834105, 848075, 861900, 875307, 888010, 900427, 913181, 926065, 938610, 951538, 966442, 983881, 1002865, 1022220, 1041272, 1059175, 1074950, 1088500, 1100346, 1110082, 1116384, 1118909, 1118882, 1117285, 1113709, 1107658, 1099785, 1091075, 1081732, 1071717, 1061626, 1052372, 1044466, 1038045, 1032986, 1028655, 1024202, 1019400, 1014561, 1009499, 1003414, 995976, 987635, 978709, 969101, 959230, 950195, 942640, 936238, 930650, 926158, 923041, 921032, 919532, 917593, 913729, 906736, 896794, 884843, 870992, 854760, 836826, 818979, 802095, 785618, 769433, 754737, 742373, 731729, 722042, 713592, 706843, 701528, 697351, 694627, 693516, 693537, 694441, 696591, 699941, 703627, 707119, 710777, 714668, 717961, 720163, 721923, 723861, 725592, 726625, 727304, 728078, 728627, 728368]
58802G28368j268k459l957n109n215m853n081n794o216o441o977p341o736n647
58788F55274n113m896m023k664j701r52M11K090L185M007N502P179P629O891O348
58773F79167O369N877M307K147l32l204n751p011p343p811q148p156m986l129
58759F42996k049p34J184K699L186L313L874M846N842O373N787M018K108Q66l89
58744F83920k355l930l593j913p10k54N87J874K554K665L286M326M524L853L683
58729F98517M371M704M148L769M340N250N731N744N400M838M804N942P591Q573
58715G73722R031R997J1401J2109J1683J0584Q961O767M601K864O61k732o138
58702H53511q140r571j2125j5302j7290j8210j9653k1419k1625k0063j8569j7876
$$ y = [728368, 727100, 724641, 720684, 715575, 710360, 705507, 700426, 694632, 688416, 681975, 674998, 667657, 660921, 655274, 650161, 645265, 641242, 638578, 636877, 635925, 636336, 638426, 641611, 645618, 651120, 658299, 665928, 672819, 679167, 685536, 691413, 695720, 697867, 697535, 694331, 688580, 681569, 674226, 666415, 658267, 651111, 646125, 642996, 640947, 640213, 641397, 644096, 647282, 650595, 654469, 659315, 665157, 671530, 677317, 681335, 683443, 684309, 683920, 681565, 677635, 674042, 672129, 671419, 671165, 671752, 673626, 676180, 678845, 682131, 686457, 690981, 694834, 698517, 702888, 707592, 711740, 715509, 719849, 725099, 730830, 736574, 741974, 746812, 751616, 757558, 765149, 773722, 782753, 792750, 804151, 816260, 827943, 838527, 847488, 854255, 858856, 861720, 862381, 859649, 853511, 845371, 835800, 823675, 808373, 791083, 772873, 753220, 731801, 710176, 690113, 671544, 653668]
58690F53668j6821j4927j3175j1858j0165q169o898o218n105m008m349n614n742
58677E40619m621m236m968m789k857q98j12M85J702K802L570N184P908J0325J1823
58662E61937J3469J5416J5893J3873J0477O663J865l936r103j2508j4748j6138
58650E83160j5653j3081j0171q449p595o961o789o972o533n255m202l875l551
58637D84073k918k470j907l49J540J973J064Q76J912K290J091k15o47j195k299
58622D82819k528j138M71J157J614K478L134L521M696O634P864Q221R282J1091
58608E39316J1382R301P013O139N483L979K877L105L192J933O83Q41J290N10q60
58593E96184j537j757k058j772n57M64O64J185K782M413N412O811Q983J0252R577
$$ y = [653668, 636847, 621920, 608745, 596887, 586722, 578553, 571655, 565437, 560332, 556324, 551975, 546361, 540619, 535998, 531762, 526794, 522005, 519148, 518250, 518138, 518623, 520325, 523127, 526697, 531881, 539789, 550114, 561937, 575406, 590822, 606715, 620588, 631065, 637728, 639593, 635657, 626554, 614046, 599298, 583160, 567507, 554426, 544255, 535806, 528211, 521250, 514461, 507489, 500956, 495701, 491499, 487624, 484073, 481155, 478685, 476778, 476429, 477969, 479942, 481006, 481882, 483794, 486084, 487175, 486960, 486313, 485118, 482819, 480291, 479153, 479624, 480781, 482395, 484873, 488007, 491528, 496224, 502858, 510722, 518943, 528225, 539316, 550698, 559999, 567012, 573151, 578634, 582613, 585490, 588595, 591787, 593720, 594403, 595244, 596534, 597044, 596184, 594647, 592890, 590832, 589060, 588503, 588967, 589631, 590816, 593598, 598011, 603423, 610234, 619217, 629469, 639046]
58578F39046Q430Q253Q222P346O547O815P307P193P391Q741J0422J1860J4095
58565G51668J7579K0776K2697K4648K7678L0487L1732L2202L2767L2357K9949
58554A054540K6469K2789J7936J1216M146j664o546j0894j3437j3282j1716j0153
58542A069404q435o752o861r452j2659j5083j7858k1848k5362k6878k7517k8457
58530H62242k8333k5777k2221j9648j7551j4652j1637r801q727p542o733o730
58518F82890o587n772n245n196m234k375j919l491m380k959j465j826k182n90
58504F34669J065L60j387j636r22j018j206K6J560J455L28j47k34o61k58J842
58488F33836L765L742L294M550O568P466P976R637J1660J2830J4299J7245J9956
$$ y = [639046, 647476, 655729, 663951, 671297, 677844, 684659, 691966, 699159, 706550, 715291, 725713, 737573, 751668, 769247, 790023, 812720, 837368, 865046, 895533, 927265, 959467, 992234, 1024591, 1054540, 1081009, 1103798, 1121734, 1132950, 1137096, 1135432, 1128886, 1117992, 1104555, 1091273, 1079557, 1069404, 1060969, 1054217, 1047356, 1037904, 1025245, 1010162, 992304, 970456, 945094, 918216, 890699, 862242, 833909, 808132, 785911, 766263, 748712, 734060, 722423, 712622, 703895, 696353, 689620, 682890, 676303, 670531, 665286, 660090, 655856, 653481, 651562, 648071, 643691, 640732, 639267, 637441, 635259, 634669, 635734, 636094, 634707, 633071, 632149, 631131, 629925, 629951, 631511, 632966, 633294, 633147, 632913, 632252, 631994, 633836, 637601, 641343, 644637, 649187, 655755, 663221, 671197, 680834, 692494, 705324, 719623, 736868, 756824]
58475G56824K0565K0349K0975K0849J7840J3239R371N547K24n098q077r581j1610
58462H51417j3183j2268r798p852n727j790K638N257O836R403J2223J3557J4390
58449H65103J6259J7256J4498Q995L828p26o147j1442j4408j5642j7121j8255
58437H42198j7300j5183j3844j2457r365n905m178k900R9L251L699K614L376O030
58423G80135Q136R440J1162J2211J0817Q336O954N351J329l321n458o166q499
58410H30427j1573j2198j0759j0064j0000q728p467q497r979q441n081l762m264
58397G19614l280p86O19J398L887O609O077L358K582L849L835K544K912M389L604
58382G61211J063O11K426K967J705J510K583K367J415K777N664O257M776N153
$$ y = [756824, 777389, 797738, 818713, 839562, 857402, 870641, 880012, 885559, 885783, 880685, 872608, 863027, 851417, 838234, 825966, 816168, 808316, 802589, 800799, 803437, 808694, 815530, 824933, 837156, 850713, 865103, 881362, 898618, 913116, 922111, 925939, 925213, 919066, 907624, 893216, 877574, 860453, 842198, 824898, 809715, 795871, 783414, 774049, 768144, 763966, 761066, 761165, 764416, 768115, 770729, 774105, 780135, 788271, 797711, 808873, 821084, 831901, 840237, 847191, 852542, 853871, 850550, 845092, 838926, 830427, 818854, 806656, 795897, 785833, 775833, 767105, 759638, 751141, 741162, 732721, 727640, 723878, 719614, 716334, 715548, 716167, 717565, 721452, 728061, 734138, 737496, 740078, 743927, 747762, 750306, 753218, 757607, 761211, 762274, 762885, 765311, 768278, 769983, 771493, 774076, 776443, 777858, 780635, 786299, 792556, 797332, 802485]
58368H02485P599Q317O824O786R052J0509J0441J1487J3670J4011J2692J3210
58356I27083J5703J6458J4646J3228J2686J0305O203L631K818R46j566j381R68
58343A021728J495K39J239M725O589O142P039R786J0831R970J1158J4916J7272
58330A123129J7273J8176K0284K0099J7549J6437J6718J4185Q876N774N918M936
58318A289354J749M72K061K393M58L05K919M291L460M364P783R550Q687R236J2181
58303A359263J3657J2867J3542J5991J6123J3865J3892J6557J7045J4868J4881
58292A522551J7533J7869J5672J6472K0763K2593K0847K1269K5100K6656K4615
58281A751940K4543K7583K7981K4713K4102K7843K9985K8922L0376L5246L6878
$$ y = [802485, 810084, 818401, 825225, 832011, 841063, 851572, 862013, 873500, 887170, 901181, 913873, 927083, 942786, 959244, 973890, 987118, 999804, 1010109, 1016312, 1019943, 1022761, 1023707, 1022141, 1020760, 1021728, 1023223, 1023462, 1024701, 1029426, 1036015, 1042157, 1049196, 1058982, 1069813, 1079783, 1090941, 1105857, 1123129, 1140402, 1158578, 1178862, 1198961, 1216510, 1232947, 1249665, 1263850, 1272726, 1278500, 1284418, 1289354, 1291103, 1291575, 1293636, 1296029, 1296487, 1296792, 1299711, 1304002, 1307462, 1311826, 1319609, 1329159, 1337846, 1347082, 1359263, 1372920, 1385787, 1399329, 1415320, 1431443, 1445308, 1459200, 1475757, 1492802, 1507670, 1522551, 1540084, 1557953, 1573625, 1590097, 1610860, 1633453, 1654300, 1675569, 1700669, 1727325, 1751940, 1776483, 1804066, 1832047, 1856760, 1880862, 1908705, 1938690, 1967612, 1997988, 2033234, 2070112]
58270B070112L4064L4186L9548M3206M2485M3650M8832N1665N0522N2552N9615
58259B570437O3867O2473O2828O7816P0155O7072O6020O9839P1024O6947O5772
58248C304250P0818P4306P3180P5424Q3948R0378R1951R7752J10917J21780J26282
58237D320986J33521J47242J58294J63503J72795J89132K01462K06466K16297
58228E909698K35378K51643K60732K75567L01075L23888L38947L60846L96000
58219H653774M30280M57944M94805N47850O01237O48456P07458P86832Q69751
58210A4198387R50093J049501J178721J319607J467414J650811J886228K156479
58202B5857241K461334K842059L327529L910202M608945N495978O624620Q000655
$$ y = [2070112, 2104176, 2138362, 2177910, 2221116, 2263601, 2307251, 2356083, 2407748, 2458270, 2510822, 2570437, 2634304, 2696777, 2759605, 2827421, 2897576, 2964648, 3030668, 3100507, 3171531, 3238478, 3304250, 3375068, 3449374, 3522554, 3597978, 3681926, 3772304, 3864255, 3962007, 4072924, 4194704, 4320986, 4454507, 4601749, 4760043, 4923546, 5096341, 5285473, 5486935, 5693401, 5909698, 6145076, 6396719, 6657451, 6933018, 7234093, 7557981, 7896928, 8257774, 8653774, 9084054, 9541998, 10036803, 10584653, 11185890, 11834346, 12541804, 13328636, 14198387, 15148480, 16197981, 17376702, 18696309, 20163723, 21814534, 23700762, 25857241, 28318575, 31160634, 34488163, 38398365, 43007310, 48503288, 55127908, 63128563]
58194F3128563R672697J1774802J4428306J7691624K1646729K6349042L1500250
58187A96192013L6248105L9468162M0153866L7401142L0341260J8762484M083669
58180D02650701j0672363k2381674k9484009l2301762l2123415l0279312k7818310
58173B17589856k5424279k3299827k1257313j9090014j6828243j4635210j2608560
58166H4446410j0773228r162003p797044o642663n650387m815088m138500l580768
58158C1886729l096399k681663k344632k062726j808939j588875j415120j272056
58150A5616319j138809j021361r31293q56229p79658p08179o52657o03074n46856
58141H378203m92453m51304m15048l72750l32776l06101k85065k59222k35923
$$ y = [63128563, 72801260, 84576062, 99004368, 116695992, 138342721, 164691763, 196192013, 232440118, 271908280, 312062146, 349463288, 379804548, 398567032, 402650701, 391978338, 369596664, 340112655, 307810893, 275687478, 245408166, 217589856, 192165577, 168865750, 147608437, 128518423, 111690180, 97054970, 84446410, 73673182, 64511179, 56714135, 50071472, 44421085, 39605997, 35467497, 31886729, 28790330, 26108667, 23764035, 21701309, 19892370, 18303495, 16888375, 15616319, 14477510, 13456149, 12524856, 11668627, 10888969, 10180790, 9528133, 8925059, 8378203, 7885750, 7434446, 7019398, 6646648, 6313872, 6007771, 5722706, 5463484, 5227561]
58132E227561k25043k18752k05738j91051j83300j76398j62074j47173j40816
58123C577216j36937j26476j14837j10652j08870j01060r1698q8549q7276q0633
58113B530228p3061p1558p1638o6398o0313o0182o1515n7280n1485n0941n1972
58102A853885m8217m3453m3975m6076m3457l9403l9623m0513l6490l1602l2017
58091A409059l4003l1047k6112k5303k5949k2410j7502j6935j8272j6350j3813
58080A161363j5612j8758j8070j6475j9112k2707k1412j7902j8190k0375j8992
58069I53758j5833j6111j8133j6895j3904j3685j4514j2134q760q999j0686r069
58057G95035o302p464j0752j0884q910r489j1634j1100q957r078j0040q077n059
$$ y = [5227561, 5002518, 4783766, 4578028, 4386977, 4203677, 4027279, 3865205, 3718032, 3577216, 3440279, 3313803, 3198966, 3088314, 2979444, 2878384, 2786686, 2698137, 2610861, 2530228, 2457167, 2385609, 2313971, 2247573, 2187260, 2127078, 2065563, 2008283, 1956798, 1905857, 1853885, 1805668, 1762215, 1718240, 1672164, 1628707, 1589304, 1549681, 1509168, 1472678, 1441076, 1409059, 1375056, 1344009, 1317897, 1292594, 1266645, 1244235, 1226733, 1209798, 1191526, 1175176, 1161363, 1145751, 1126993, 1108923, 1092448, 1073336, 1050629, 1029217, 1011315, 993125, 972750, 953758, 937925, 921814, 903681, 886786, 872882, 859197, 844683, 832549, 823789, 814790, 804104, 795035, 788733, 781269, 770517, 759633, 750723, 741234, 729600, 718500, 709543, 700465, 690425, 682348, 677289]
58044F77289n122o406m649j923l075o353o383l977m163o701p216n914o612q646
58030F00149q071n627n634q077r199q736r339j0214q489n555n063o107n195l262
58016E01581l736n417m491j984j943l670l133q08o96k548k418k71J47j496j914
58001D67203p92q76j909j029J138J167o30p04J027J183o68j694j602k708m475
57986D54631m023j931j580k912k712j030j256l730n130m536m426n309m896l101
57972D08059k467l123k427j54R50K75J55J199J457O45O60J635J780J196J517J959
57956D13316K57k732l880l101l161m436m555l199k567k974k592j499j522k108
57942C75247r30J553K636K337L194N304O338O357P702J0030J0404Q591P405P387
$$ y = [677289, 672167, 665761, 661112, 659189, 656114, 649761, 643378, 639401, 635238, 628537, 621321, 615407, 608795, 600149, 592078, 586451, 580817, 572740, 563541, 554805, 545466, 535252, 526763, 521208, 516145, 510038, 504843, 501581, 497845, 492428, 487937, 485953, 484010, 480340, 477207, 476399, 475703, 473155, 470737, 470466, 470613, 469117, 467203, 466411, 465535, 463626, 462597, 463735, 464902, 464272, 463568, 464595, 465778, 465110, 463416, 461814, 459106, 454631, 450608, 448677, 447097, 444185, 441473, 440443, 439187, 435457, 430327, 425791, 421365, 416056, 411160, 408059, 405592, 402469, 400042, 399888, 400838, 401113, 401268, 402467, 403924, 404569, 405229, 406864, 408644, 409840, 411357, 413316, 413573, 410841, 406961, 403860, 400699, 396263, 391708, 388509, 385942, 382968, 380376, 378877, 377355, 375247, 374317, 375870, 378506, 380843, 384037, 389341, 395679, 402036, 409738, 419768, 430172, 438763, 446168, 453555]
57928D53555O066K984O62j77j704m464o302o581p234q778r407q803q772r442q788
57913C82815o661n255n009m005j948q10r69o09M68M18q33j266o94j109k600k996
57897C48937k011j756k603k522j118l15m70K12J842K410J789K124L628M008K728
57882C56883J855J991J425nl07O53O16p89j275k15L39k04P8J637K525K365L117
57865C70689M864N041L070J680K300L117K941L040L872L898K945K887L793L347
57851D17484J318L81J175R01j559l486l113k409k964l249k264j984l672n284n096
57836C86179m527m980n105l683k222k167k384j614q06p59j72J866L891M559M675
57821C72751M978M513K914J774J976K189J583J373K134K296R19o02j186j751k915
$$ y = [453555, 459621, 462605, 463267, 463090, 461386, 456922, 450620, 444039, 436805, 428027, 418620, 409817, 401045, 391603, 382815, 376154, 370899, 365890, 361885, 359937, 359127, 358158, 357549, 358017, 358435, 357602, 356336, 355642, 354533, 351933, 348937, 346926, 345170, 342567, 340045, 338927, 338612, 338142, 338354, 340196, 342606, 344395, 346519, 350147, 354155, 356883, 358738, 360729, 362154, 362149, 361842, 362495, 363111, 362322, 361047, 360832, 361171, 360967, 361045, 362682, 365207, 367572, 370689, 375553, 380594, 383664, 385344, 387644, 390761, 393702, 396742, 400614, 404512, 407457, 410344, 414137, 417484, 418802, 419183, 420358, 421259, 419700, 416214, 413101, 410692, 407728, 404479, 402215, 400231, 396559, 391275, 386179, 381652, 376672, 371567, 367884, 365662, 363495, 361111, 359497, 358691, 357932, 357760, 359626, 363517, 368076, 372751, 377729, 382242, 385156, 386930, 388906, 391095, 392678, 394051, 396185, 398481, 399400, 398798, 397612, 395861, 392946]
57806C92946l761m197n599p737q206o431n009n468n918m800l580l673l896l167
57792C21504k736l458l736k458j197j330j727j348j280k045j908j28J111M08j90
57777B99482J245L164L515L241L949M710M118L210L324L279J571o83j883k934
57763C29308n215p438p549o189n482n731n853n695n502m466k064M64K011L388
57749B73987N393O832O638O070O677P785Q100Q019Q219P850O291M879M685M487
57735C65912L132J915K216K802K009P56P31J280Q44j00j45M17N02M02O82M88p32
57718C83111j486o68J3j423l946n445o205p509q461p428n406m720n261n074l968
57703C16124l499l891l802k844j761n37J321K933K899J696J095J528J930J806
$$ y = [392946, 389185, 384988, 379389, 371652, 363446, 357015, 352006, 346538, 340620, 335820, 332240, 328567, 324671, 321504, 318768, 315310, 311574, 309116, 307919, 306589, 304862, 303514, 302234, 300189, 298281, 298153, 299264, 299672, 299482, 300727, 303891, 307406, 310647, 314596, 319306, 323424, 326634, 329958, 333237, 334808, 334125, 332242, 329308, 324093, 316655, 309106, 302917, 297435, 291704, 285851, 280156, 274654, 270188, 268124, 268588, 270599, 273987, 279380, 286212, 292850, 298920, 305597, 313382, 321482, 329501, 337720, 345570, 351861, 356740, 361425, 365912, 369044, 370959, 373175, 375977, 377986, 378742, 379473, 380753, 381597, 381497, 381352, 381769, 382271, 382673, 383355, 383843, 383111, 381625, 380957, 380970, 379547, 375601, 370156, 363951, 356442, 347981, 340553, 335147, 330427, 325166, 320092, 316124, 312625, 308734, 304932, 302088, 300327, 299790, 301111, 304044, 306943, 308639, 309734, 311262, 313192, 314998]
57689C14998J563J286R43J125K042K506J633N52P31J713K316K971M697O891Q274
57674C54241R275J1387J4928J9397K5113L2599M1029M9130N6650O3104O6087O2757
57662H05697N2184L4841J1508j5014l8733n4099o0417o0792n7712n2029m5070
57651E20364l8739l3594k8975k4818k1492j8471j5040j1740r417p605n609m106
57639C00758l834l727k441p21j77p20j260j790k635k825j617m23q33j826j549
57624B74380p47j494l450m353l730l141l119k724j967j983k771l167k995l041
57610B35698l078k237r41m04m38l2M88J14n41j11Q62O90l93o04J89K99p44j595
57592B27222j636j595j556p20O54J248Q41M11J81l74p33J30J576J935J243R59
$$ y = [314998, 316561, 317847, 318790, 319915, 321957, 324463, 326096, 326648, 327379, 329092, 331408, 334379, 339076, 345967, 354241, 363516, 374903, 389831, 409228, 434341, 466940, 507969, 557099, 613749, 676853, 742940, 805697, 857881, 892722, 904230, 889216, 850483, 796384, 735967, 675175, 617463, 565434, 520364, 481625, 448031, 419056, 394238, 372746, 354275, 339235, 327495, 318078, 310473, 304864, 300758, 296924, 293197, 290756, 290035, 289858, 289138, 287878, 286088, 283453, 280628, 279011, 278588, 277755, 275929, 274380, 273633, 272139, 268689, 264336, 260606, 257465, 254346, 251622, 249655, 247672, 244901, 241734, 238739, 235698, 232620, 230383, 229442, 229038, 228600, 228568, 229056, 229170, 228629, 228518, 229380, 230070, 229677, 229073, 229262, 229561, 228817, 227222, 225586, 223991, 222435, 221715, 222369, 223617, 224458, 224869, 225050, 224676, 223943, 224073, 225649, 227584, 228827, 229786]
57576B29786J150M83r51j456p20l96j232j959j669j081p78k21P51J289J059Q54
57560B24909J108J251Q69K43l84p46m6K010M021M430L796L764M207L582J752K04
57544B54970m62j114k127k875l202l543l620k906k044j951j989j072m3n29j949
57529B25544k239j199m41l21J90P24k22k087k400o21J030J175Q66R73P75L2k68
57512B21511q2p12k139k546j403n70j211k018j664p99m20k84j4N9Q2Q49K050K254
57494B12943J362R82J717K263J939J883K776L602L626L489L392K399N53m69J06
57479B42563R89J186J418K137K320J414M34n5r60k496l166k231j161j188j324
57464B39880m24P04Q41L72J58q2p48j077l33Q30J487J715J809J520R87J035J673
$$ y = [229786, 230936, 231419, 230468, 229012, 228292, 227896, 226664, 224705, 223036, 221955, 221177, 220956, 221707, 222996, 224055, 224909, 226017, 227268, 228137, 228380, 227996, 227250, 227204, 229214, 233235, 237665, 241461, 245225, 249432, 253014, 254766, 254970, 254508, 253394, 251267, 248392, 245190, 241647, 238027, 235121, 233077, 231126, 229137, 228065, 228022, 227493, 225544, 223305, 222106, 221665, 221344, 221534, 222258, 222036, 219949, 217549, 216928, 217958, 219133, 219999, 220972, 221747, 221779, 221511, 221429, 220717, 218578, 216032, 214629, 214059, 212848, 210830, 209166, 208367, 207947, 207663, 207649, 207708, 207790, 208639, 210689, 212943, 214305, 215287, 217004, 219267, 221206, 223089, 225865, 229467, 233093, 236582, 239974, 242373, 242926, 242457, 242563, 243552, 244738, 246156, 248293, 250613, 252027, 252461, 252406, 251446, 248950, 245784, 243553, 242392, 241204, 239880, 239456, 240160, 241001, 241373, 241531, 241449, 240701, 239624, 239291, 240121, 241608, 243323, 245132, 246652, 247639, 248674, 250347]
57447B50347J724P95L8J71M33L77Q25K062K906K745K639L202L297K175J081J225
57431B76042J810J624J030R03J034J050J513K662L388K866J935J640J647J357
57417C00501J178J451J415O05m2L44J157J577J922K605L121L094L127L464L297
57402C28816K350J691J915K045J336N66M66N11M41J154K831L980L715L264L766
57387C58847M394M232M161N125O216O343O186O678P034O229N009M543M376L597
57373D32970K743K672K796K269J688J788J733O29n16k63Q55J376J254J278J279
57358D54551Q11N99J365K145J731Q23Q75J719K212K361K879L481L540L630M503
57343D87225N310M727L169K080J758J580J627K292L094L524M226N603O370N387
$$ y = [250347, 252071, 252866, 252904, 253075, 253508, 253885, 254710, 256772, 259678, 262423, 265062, 268264, 271561, 273736, 274817, 276042, 277852, 279476, 280506, 281409, 282443, 283493, 285006, 287668, 291056, 293922, 295857, 297497, 299144, 300501, 301679, 303130, 304545, 305150, 305108, 305452, 306609, 308186, 310108, 312713, 315834, 318928, 322055, 325519, 328816, 331166, 332857, 334772, 336817, 338153, 338719, 339185, 339696, 340137, 341291, 344122, 348102, 351817, 355081, 358847, 363241, 367473, 371634, 376759, 382975, 389318, 395504, 402182, 409216, 415445, 420454, 424997, 429373, 432970, 435713, 438385, 441181, 443450, 445138, 446926, 448659, 449288, 448772, 448509, 449364, 450740, 451994, 453272, 454551, 455362, 455961, 457326, 459471, 461202, 462025, 462900, 464619, 466831, 469192, 472071, 475552, 479092, 482722, 487225, 492535, 497262, 500431, 502511, 504269, 505849, 507476, 509768, 512862, 516386, 520612, 526215, 532585, 537972]
57329E37972L909L849M780M864L978L562L944M175M238N053O452P112O547N491
57315F05926M540L913M145N369O426O294N779O116O719O238N121M910N623N994
57301F83113N890O238O845O590N712N683O782P757P985Q038Q118P807P439P870
57287G81867Q814R118Q761Q744R063Q640P398O573O711P007O935O966P403P917
57273H91917Q418R162R842R862R464R454R967J0680J1771J3364J4481J4165J3217
57260A035764J3174J3995J4501J4619J5238J6103J5970J4835J4049J4079J3999
57249A196326J3415J3095J3450J4005J4540J5277J5845J5607J5047J5218J5904
57238A357729J5931J5296J5203J5915J6350J6000J5566J5521J5608J5892J6721
$$ y = [537972, 541881, 545730, 550510, 555374, 559352, 562914, 566858, 571033, 575271, 580324, 586776, 593888, 600435, 605926, 610466, 614379, 618524, 623893, 630319, 636613, 642392, 648508, 655227, 661465, 666586, 671496, 677119, 683113, 689003, 695241, 702086, 708676, 714388, 720071, 726853, 734610, 742595, 750633, 758751, 766558, 773997, 781867, 790681, 799799, 808560, 817304, 826367, 835007, 842405, 848978, 855689, 862696, 869631, 876597, 884000, 891917, 900335, 909497, 919339, 929201, 938665, 948119, 958086, 968766, 980537, 993901, 1008382, 1022547, 1035764, 1048938, 1062933, 1077434, 1092053, 1107291, 1123394, 1139364, 1154199, 1168248, 1182327, 1196326, 1209741, 1222836, 1236286, 1250291, 1264831, 1280108, 1295953, 1311560, 1326607, 1341825, 1357729, 1373660, 1388956, 1404159, 1420074, 1436424, 1452424, 1467990, 1483511, 1499119, 1515011, 1531732]
57227A531732J7591J7568J6925J6732J6986J6843J6549J7151J8279J8345J7210
57216A721911J6596J7408J8555J8955J8889J8780J8351J7647J7354J7502J7281
57205A919229J6536J6027J5948J5656J5116J5069J5444J5274J4456J4050J4494
57194B087299J5093J5558J6332J7184J7190J6491J6331J6961J7343J7200J7540
57183B270522J8630J9423J9579K0076K1110K1355K0155J8741J8228J8154J7866
57172B483839J7817J8466J9368K0291K1850K4095K5886K6555K6895K7599K8020
57161B740681K7443K6344K5597K5370K5461K5676K5404K4046K2329K1800K2571
57150C012722K3026K2215K1042K0452K0067J9352J8561J7719J6065J3369J0514
$$ y = [1531732, 1549323, 1566891, 1583816, 1600548, 1617534, 1634377, 1650926, 1668077, 1686356, 1704701, 1721911, 1738507, 1755915, 1774470, 1793425, 1812314, 1831094, 1849445, 1867092, 1884446, 1901948, 1919229, 1935765, 1951792, 1967740, 1983396, 1998512, 2013581, 2029025, 2044299, 2058755, 2072805, 2087299, 2102392, 2117950, 2134282, 2151466, 2168656, 2185147, 2201478, 2218439, 2235782, 2252982, 2270522, 2289152, 2308575, 2328154, 2348230, 2369340, 2390695, 2410850, 2429591, 2447819, 2465973, 2483839, 2501656, 2520122, 2539490, 2559781, 2581631, 2605726, 2631612, 2658167, 2685062, 2712661, 2740681, 2768124, 2794468, 2820065, 2845435, 2870896, 2896572, 2921976, 2946022, 2968351, 2990151, 3012722, 3035748, 3057963, 3079005, 3099457, 3119524, 3138876, 3157437, 3175156, 3191221, 3204590, 3215104]
57139C215104Q122N925M051L449M372N881P460R678J2680J5690J8561K2184K6639
57126C359796L0684L3776L6791L9978M2095M2461M2005M1461M0437L9247L9624
57115C788355M2481M6989N2915O1687P3825Q7644J02029J18232J37350J58360
57105D669867J80653K06412K38394K77577L25163L84698M59820N51979O63179
57096G957742P98969R65721J166573J402655J675863J986393K328761K693581
57088B0976258L071288L449978L811406M134351M401269M597758M709011M724579
57080E3875898M642001M447889M087122L468278K528019J304795n3236j358879
57072G2941887k471707l333524l948713m348238m566578m633212m571807m404320
$$ y = [3215104, 3223226, 3229151, 3233202, 3236651, 3241023, 3246904, 3254364, 3264042, 3276722, 3292412, 3310973, 3333157, 3359796, 3390480, 3424256, 3461047, 3501025, 3543120, 3585581, 3627586, 3669047, 3709484, 3748731, 3788355, 3830836, 3877825, 3930740, 3992427, 4066252, 4153896, 4255925, 4374157, 4511507, 4669867, 4850520, 5056932, 5295326, 5572903, 5898066, 6282764, 6742584, 7294563, 7957742, 8756711, 9722432, 10889005, 12291660, 13967523, 15953916, 18282677, 20976258, 24047546, 27497524, 31308930, 35443281, 39844550, 44442308, 49151319, 53875898, 58517899, 62965788, 67052910, 70521188, 73049207, 74354002, 74300766, 72941887, 70470180, 67136656, 63187943, 58839705, 54273127, 49639915, 45068108, 40663788]
57064D0663788m155981l854675l524987l184584k846530k522306k221001j947438
57056A6406286j703154j488440j302318j141867j003472q84498p82808o95602
57048G404127o20216n55381n00212m52480m09423l69934l34479l03119k75080
57039C583803k49975k27867k08078j89419j71566j54910j39192j23755j08931
57030B010110r5546q3040o9811n5267l9793k2793l015J8725L9047N4400O1723
57019A814740N6631L4752k583m5723q2347j05522j15643j16460j11403j02845
57009A223597r2520q1728p1627o3096n6118m9949m4300l9614l5963l2666k9460
56998F26556k6882k5091k3402k1456j9676j8117j6194j3989j2377j1220r000n036
$$ y = [40663788, 36507807, 32653132, 29128145, 25943561, 23097031, 20574725, 18353724, 16406286, 14703132, 13214692, 11912374, 10770507, 9767035, 8882537, 8099729, 7404127, 6783911, 6228530, 5728318, 5275838, 4866415, 4496481, 4162002, 3858883, 3583803, 3333828, 3105961, 2897883, 2708464, 2536898, 2381988, 2242796, 2119041, 2010110, 1914564, 1831524, 1761713, 1706446, 1666653, 1643860, 1640845, 1659570, 1698617, 1753017, 1814740, 1871371, 1906123, 1903540, 1857817, 1775470, 1669948, 1554305, 1437845, 1326442, 1223597, 1131077, 1049349, 977722, 914626, 858508, 808559, 764259, 724645, 688682, 656016, 626556, 599674, 574583, 551181, 529725, 510049, 491932, 475738, 461749, 449372, 438152, 429152, 424116]
56986D24116n29L399P172J1210J4447J5523J4163J0422M090l977j1334j6141j8757
56973D53804k0120j9990j8019j5156j2520j0023p389n196l585j315K372O207Q810
56960C57880J0972J4364J8980K3443K6775K8192K6198J9808J0177m26j0542j9166
56948E06655k4726k6275k5051k3073k0854j7825j4235j0878p624l852K04M029
56936C36495Q056J2876J7886K2295K6596L1435L5664L7200L5094K9175J8720L811
56924F15303j2447k5378l2684l5401l5400l3733l1286k8935k6588k3507j9786
56913C10158j6384j3700j1409r578q643q240p331n609l775k481j816j632j526
56900B18034q90K83J214J701K730M759O504O892P097Q992J2381J5605J8157K0814
$$ y = [424116, 423587, 426986, 434158, 445368, 459815, 475338, 489501, 499923, 504013, 500036, 488702, 472561, 453804, 433684, 413694, 395675, 380519, 367999, 357976, 350587, 345391, 341806, 340491, 342863, 349070, 357880, 368852, 383216, 402196, 425639, 452414, 480606, 506804, 526612, 536789, 536363, 525821, 506655, 481929, 455654, 430603, 407530, 386676, 368851, 354616, 343738, 336114, 332262, 332466, 336495, 344551, 357427, 375313, 397608, 424204, 455639, 491303, 528503, 563597, 592772, 611492, 615303, 602856, 577478, 544794, 509393, 473993, 440260, 408974, 380039, 353451, 329944, 310158, 293774, 280074, 268665, 259087, 250444, 242204, 234873, 229264, 225489, 223008, 221192, 219560, 218034, 217144, 217427, 218641, 220342, 223072, 227831, 234335, 241227, 248324, 257316, 269697, 285302, 303459, 324273]
56886C24273K3577K5481K6113K5486K2600J6079O366m201j3439k0153k3365k2670
56874C86147j9417j5864j2839r503n303p95L519P822J2346J7263K3214L0851L9837
56861D57278M9112N7851O5142O9180O7799N9603M4113K2096l070k5663m1202m9330
56849G72909n2047n0406m4801l7059k9494k2267j3990m606M565J3387K3182L4564
56837E93937M7105O0950P6427R1904J04140J10772J10307R9953P6582M1119J20
56826A413316l8120o7894q6890r5188r4833q8911p9896o9145n7817m6853l6138
56815F51631k5016j3751l191O929J7867L0086M2914N5646O7428P6078P8556P2612
56803A057789N7190L2368R60l0669n5875p2024q0126q1426p6804o8713o0312n2366
$$ y = [324273, 347850, 373331, 399444, 424930, 447530, 463609, 469975, 465774, 452335, 432182, 408817, 386147, 366730, 350866, 338027, 328524, 323221, 322426, 325945, 333767, 346113, 363376, 386590, 417441, 457278, 506390, 564241, 629383, 698563, 766362, 825965, 870078, 892174, 889104, 863441, 822239, 772909, 720862, 670456, 625655, 588596, 559102, 536835, 522845, 518239, 522804, 536191, 559373, 593937, 641042, 701992, 778419, 870323, 974463, 1085235, 1195542, 1295495, 1372077, 1413196, 1413316, 1375196, 1307302, 1220412, 1125224, 1030391, 941480, 861584, 792439, 734622, 687769, 651631, 626615, 612864, 609673, 616602, 634469, 664555, 707469, 763115, 830543, 906621, 985177, 1057789, 1114979, 1147347, 1148307, 1117638, 1061763, 989739, 909613, 828187, 751383, 682670, 622358, 569992]
56791E69992m3598l4097k5635j8547j1312l677K846Q265J4875K3586L2120L7948
56779E52766M0478L9224L2542J9860L369j3805k9341m0965m6525m6289m3328m0262
56767D27724l7213l3670l0196k7135k3732j9796j6457j4154j1829r144p372o987
56755A90039o512n057l792l504l004j552o94j720l266l498k951l131l731l401
56741A44226k163j140q00j024j904l049l144j669pM15j4k70l36l96J38J325J848
56724A32036J001K09Q81K104K180J340J005J330J312O72km42o35k27P99J550J462
56707A46575J237J478J480O49L1R18K782M059M180L589K537J221L19J77Q9n39
56691A70782j095q17J5Q43J769K632K466J059j38L2P47Q04O43J222K009J900J184
$$ y = [569992, 526394, 492297, 466662, 448115, 436803, 433126, 435972, 444237, 459112, 482698, 514818, 552766, 593244, 632468, 665010, 684870, 688239, 674434, 645093, 604128, 557603, 511314, 467986, 427724, 390511, 356841, 326645, 299510, 275778, 255982, 239525, 225371, 213542, 204398, 197026, 190039, 183527, 178470, 174678, 171174, 168170, 166618, 165924, 164204, 160938, 157440, 154489, 151358, 147627, 144226, 142063, 140923, 140123, 139099, 137195, 134146, 131002, 129333, 129326, 129741, 129727, 129457, 129121, 128725, 128863, 130188, 132036, 133037, 133246, 134127, 136231, 138411, 139751, 140756, 142086, 143398, 144070, 144068, 143626, 142991, 142764, 143563, 145113, 146575, 147812, 149290, 150770, 151419, 151450, 152368, 155150, 159209, 163389, 166978, 169515, 170736, 171055, 171232, 171321, 170782, 169687, 168870, 168885, 169728, 171497, 174129, 176595, 177654, 177516, 177548, 178295, 179099, 179742, 180964, 182973, 184873, 186057]
56674A86057Q65P75N3j038j366o31N17J521K005J450M6r05n80K5m20j643k521
56657A84210k978l677m501m787m627m698n154n661o023n943m906l188k049k046
56643A23972k087j200o8L41N65J610L108L999M290M624M832M314L379K845K747
56628A57271K556K205J957J748J456J250R98J84r80j412p57kJ92L88Q32O81k45
56611A68322n95L12J084M96m71l76L56N51L47M60O11L00J1J41kp62j124o24m81
56592A68556j276j357L40J851J009r56j324q1O24J38l44l55m33l22O02J553J292
56575A69517M09M47J303J710J690K247L121L222K862L317M469N134N384O436Q498
56560B19766J0741J3069J5798J8006J8267J6681J4247J0818N818M20l339n324
$$ y = [186057, 186922, 187697, 187750, 186712, 185346, 184715, 185232, 186753, 188758, 190208, 190254, 189349, 188769, 188794, 188374, 186731, 184210, 181232, 177555, 173054, 168267, 163640, 158942, 153788, 148127, 142104, 136161, 131255, 128067, 126018, 123972, 121885, 120685, 120617, 120958, 121523, 123133, 126241, 130240, 134530, 139154, 143986, 148300, 151679, 154524, 157271, 159827, 162032, 163989, 165737, 167193, 168443, 169441, 169625, 168645, 167233, 166476, 166474, 166666, 167054, 167886, 168567, 168322, 167727, 168039, 169123, 169619, 169148, 168772, 169128, 169679, 170026, 170486, 171097, 171397, 171408, 171549, 171547, 170785, 169661, 169037, 168556, 167280, 165923, 166263, 168114, 169123, 168167, 166843, 166762, 167386, 167524, 167180, 166825, 166392, 166070, 166672, 168225, 169517, 169926, 170373, 171676, 173386, 175076, 177323, 180444, 183666, 186528, 189845, 194314, 199448, 204832, 211268, 219766, 230507, 243576, 259374, 277380, 295647, 312328, 326575, 337393, 343211, 343631, 340292, 334968]
56548C34968o923q316q406p221o067n398m633l853l708l803l258k543k715l291
56534B64833l042k411k816l924l982k669j298m67J98L57n95j637j212N7J83r03
56518B40672j465j157j312k126k317j792j900k775l064k600k699l411l219j904
56504B08931j115j421j420n29o1p15j315j042p50j122j456j218r34q87n60N0L00
56487A94736L82J149K186K077Q78K84R25J488R93j3q54j425j293k1J382J343J54
56470B04371m80k24k15n17j7J040J133K87J96J135J524R26P40J366J465P46O35
56453B14111J445J646Q25N51J281J310j8q18K47J918K733L052L353K883J445L24
56437B36288N6n31j908k656j935r54o96m13L72N93k59q94m57N2j43k27L08N23
$$ y = [334968, 328045, 319729, 311323, 304102, 298035, 292637, 288004, 284151, 280443, 276640, 273382, 270839, 268124, 264833, 261791, 259380, 256564, 252640, 248658, 245989, 244691, 244224, 244422, 244779, 244184, 242547, 241335, 241392, 241575, 240672, 239207, 238050, 236738, 234612, 232295, 230503, 228603, 225828, 222764, 220164, 217465, 214054, 210835, 208931, 207816, 206395, 204975, 204446, 204385, 203670, 202355, 201313, 200563, 199441, 197985, 196767, 195833, 194946, 194386, 194436, 194736, 195118, 196267, 198453, 200530, 201408, 201692, 202617, 204105, 205098, 205085, 204231, 202806, 201513, 201492, 202874, 204217, 204371, 203891, 203667, 203452, 202935, 202918, 203958, 205091, 205378, 205574, 206709, 208233, 209159, 209899, 211265, 212730, 213476, 214111, 215556, 217202, 218027, 218578, 219859, 221169, 221151, 220333, 220580, 222498, 225231, 228283, 231636, 234519, 235964, 236288, 236344, 235813, 233905, 231249, 229314, 228360, 227664, 227251, 227623, 228216, 227957, 227063, 226606, 226658, 226515, 226288, 226596, 227119]
56419B27119P6K08J356J944Q92p84k151l851n969o750n197k888j618j105m49R9
56403B00932L32J005K067K047O01l52L70J250P37k53k58L56P14J184J977J872
56387B14581K50j299j232l25J5L6N73J368K020L053M508N184M724M655N875O947
56371B50933O471N229M352L385J885Q99J063J078m5j108r20m39p74r89L3J330
56355B72383J594J528K321L299L211K418J914J477O52P5J58o1j088j695j109o41
56339B86436j312j808p73P11J100J011J696K615K774K889L914M979M980M739N400
56324C19351O144N751M883M614M120K247l5j026r40r40q54k3Q39Q03N65J043J454
56307C47996Q33R3M86J404J844K510M222N675N275L966L800M787N494N690O068
$$ y = [227119, 227195, 227403, 228759, 230703, 231595, 230811, 228660, 224809, 218840, 212090, 206893, 204005, 202387, 201282, 200833, 200932, 201264, 202269, 204336, 206383, 206984, 206632, 207002, 208252, 208989, 208736, 208478, 208834, 209548, 210732, 212709, 214581, 214831, 213532, 212300, 211975, 211990, 212026, 212599, 213967, 215987, 219040, 223548, 228732, 233456, 238111, 243986, 250933, 257404, 262633, 266985, 270370, 272255, 273154, 274217, 275295, 275250, 274142, 273222, 272783, 272009, 271020, 271053, 272383, 273977, 275505, 277826, 281125, 284336, 286754, 288668, 290145, 290797, 290872, 291030, 290969, 289881, 288186, 287077, 286436, 285124, 283316, 282543, 283254, 284354, 285365, 287061, 289676, 292450, 295339, 299253, 304232, 309212, 313951, 319351, 325495, 331246, 336129, 340743, 344863, 347110, 347075, 346049, 345109, 344169, 343315, 343292, 344131, 344934, 345499, 346542, 347996, 348829, 348922, 349408, 350812, 352656, 355166, 359388, 365063, 370338, 374304, 378104, 382891, 388385, 394075, 400143]
56292D00143O393O096N817O311O819O443N994O510P235P056O678P335Q618R490
56278D96938J0184J1120J1429J0559R921J0861J2418J3198J3894J5763J8114J9694
56266F54093K1113K3614K6629K8836L0416L2243L4167L6028L8940M3675M9299
56255A019053N5153O2377P1621Q1330R0368J00130J11880J24209J35537J46699
56245A998357J58539J69288J77137J82936J87479J88579J84036J75116J63684
56236C585151J48233J26409R9468P0562M0559R206k1468m8886p3447r6504j16478
56225C722805j30916j40879j49260j55963j58687j57405j54202j49682j43167
56216B382644j35547j28347j21002j12418j03938r7388r1661q4858p8146p3575
$$ y = [400143, 406536, 412632, 418449, 424760, 431579, 438022, 444016, 450526, 457761, 464817, 471495, 478830, 487448, 496938, 507122, 518242, 529671, 540230, 550151, 561012, 573430, 586628, 600522, 616285, 634399, 654093, 675206, 698820, 725449, 754285, 784701, 816944, 851111, 887139, 926079, 969754, 1019053, 1074206, 1136583, 1208204, 1289534, 1379902, 1480032, 1591912, 1716121, 1851658, 1998357, 2156896, 2326184, 2503321, 2686257, 2873736, 3062315, 3246351, 3421467, 3585151, 3733384, 3859793, 3959261, 4029823, 4070382, 4079588, 4058120, 4009234, 3935787, 3839283, 3722805, 3591889, 3451010, 3301750, 3145787, 2987100, 2829695, 2675493, 2525811, 2382644, 2247097, 2118750, 1997748, 1885330, 1781392, 1684004, 1592343, 1507485, 1429339, 1355764]
56206A355764o9763o4006n7329n2932n0710m7680m3110l8885l5486l1796k8291
56195H35776k6361k5010k2157j8557j6563j5794j3919j1002r092q289p115n955
56183F55962o170o686n453l448l149m039l685k289j898k095q87J105J671J330
56169F20269K202L717L863L665N609Q689R830R259R598J0683J0450R873J1647
56156G19354J4723J5710J4995J5850J8054J8329J6915J7691K1537K5396K8323
56145I26877L2852L9844M7378N5314O5704P8091Q9378R8624J06979J13002J13367
56134A767410J08343J01186R2322P9865O5863N5788N1168M8358M4989M1717L7343
56123B494352K8637J6249M892l351j0571j7532k2720k7657l6917n1475o7479q2424
$$ y = [1355764, 1286001, 1221995, 1164666, 1111734, 1061024, 1013344, 970234, 931349, 895863, 864067, 835776, 809415, 784405, 762248, 743691, 727128, 711334, 697415, 686413, 677321, 669032, 661917, 655962, 649792, 643106, 637653, 634205, 631056, 627017, 623332, 621043, 619145, 617050, 616163, 617268, 618939, 620269, 622471, 626188, 630051, 633716, 639325, 648014, 657844, 667103, 676701, 687384, 697834, 707707, 719354, 734077, 749787, 764782, 780632, 798686, 817015, 833930, 851621, 873158, 898554, 926877, 959729, 999573, 1046951, 1102265, 1167969, 1246060, 1335438, 1434062, 1541041, 1654043, 1767410, 1875753, 1976939, 2069261, 2149126, 2214989, 2270777, 2321945, 2370303, 2415292, 2457009, 2494352, 2522989, 2539238, 2544130, 2540779, 2530208, 2512676, 2489956, 2462299, 2425382, 2373907, 2306428, 2224004]
56111B224004r6826j09217j15666j15523j11989j06147r6177q3026p0782o0692
56101A257959n0681m1173l5002l1270k5970j9226j5069j3630j0834o460m781o209
56089I97654o033k941r57j286p6L794O357O137O561Q751R426P945P956J0071J0512
56074A063871Q857R231J1943J2227R416Q922J2616J5746J5883J6401J8471J8403
56062A221987J5848J5704J8906K0162J7894J7286K0218K1544J8872J6691J7122
56051A422234J6107J2585J1715J4985J6852J5309J5787K0267K2866K0917K0049
56040A609673K3226K5270K3490K3207K7124K9867K8717K9071L3447L6064L4364
56029A923520L4694M0036M3639M1609M0285M3916M6673M4574M3577M7809N1360
$$ y = [2224004, 2127178, 2017961, 1902295, 1786772, 1674783, 1568636, 1472459, 1389433, 1318651, 1257959, 1207278, 1166105, 1131103, 1099833, 1073863, 1054637, 1039568, 1025938, 1015104, 1008644, 1003863, 997654, 991621, 988680, 987723, 986437, 986361, 990155, 996512, 1002649, 1009210, 1017961, 1027387, 1035332, 1043288, 1053359, 1063871, 1072728, 1081959, 1093902, 1106129, 1115545, 1124467, 1137083, 1152829, 1168712, 1185113, 1203584, 1221987, 1237835, 1253539, 1272445, 1292607, 1310501, 1327787, 1348005, 1369549, 1388421, 1405112, 1422234, 1438341, 1450926, 1462641, 1477626, 1494478, 1509787, 1525574, 1545841, 1568707, 1589624, 1609673, 1632899, 1658169, 1681659, 1704866, 1731990, 1761857, 1790574, 1819645, 1853092, 1889156, 1923520, 1958214, 1998250, 2041889, 2083498, 2123783, 2167699, 2214372, 2258946, 2302523, 2350332, 2401692]
56018B401692N0097N0033N5478O0537O0928O2481O9151P4536P4402P5407Q2220
56007C116962Q8310Q8892R0363R7341J03386J04368J07662J17918J27550J31629
55997D174381J37848J51051J62974J68432J76026J91107K04576K10823K19638
55988E796856K37413K54479K64727K78915L03949L28677L45823L67372M01636
55979H579847M36785M65038N00298N52469O08097O57305P14957P92811Q77178
55970A4184785R58394J054554J180043J320445J467093J644664J873960K142364
55962B5826302K445555K820928L302879L888620M591775N482035O622417Q023380
55954F3003891R721038J1841470J4518930J7821581K1826107K6614227L1973157
$$ y = [2401692, 2451789, 2501822, 2557300, 2617837, 2678765, 2741246, 2810397, 2884933, 2959335, 3034742, 3116962, 3205272, 3294164, 3384527, 3481868, 3585254, 3689622, 3797284, 3915202, 4042752, 4174381, 4312229, 4463280, 4626254, 4794686, 4970712, 5161819, 5366395, 5577218, 5796856, 6034269, 6288748, 6553475, 6832390, 7136339, 7465016, 7810839, 8178211, 8579847, 9016632, 9481670, 9981968, 10534437, 11142534, 11799839, 12514796, 13307607, 14184785, 15143179, 16197733, 17377776, 18698221, 20165314, 21809978, 23683938, 25826302, 28271857, 31092785, 34395664, 38284284, 42876059, 48358094, 54980511, 63003891, 72724929, 84566399, 99085329, 116906910, 138733017, 165347244, 197320401]
55947A97320401L7119322M0890661M2178556M0008660L3414601K1898410O471650
55940D19302261r990842k3979058l3232910l7552447l8087357l6207157l2974337
55933B07278153k9153675k5263796k1581484j8236328j5319369j2870718j0837435
55926G4015348r132405p712667o556534n609539m810012m137705l589717l135713
55918B9331056k738740k394721k112018j874198j658041j466858j312383j182783
55910A4591314j059345r46787q57785p84105p10586o42057n90122n47641n01272
55901G951614m55826m22442l95236l62432l28883l05589k87799k64429k39047
55892D889931k21536k08492j90992j72743j62136j54867j42098j27716j20425
$$ y = [197320401, 234439723, 275330384, 317508940, 357517600, 390932201, 412830611, 419302261, 409311419, 385332361, 352099451, 314547004, 276459647, 240252490, 207278153, 178124478, 152860682, 131279198, 113042870, 97723501, 84852783, 74015348, 64882943, 57170276, 50613742, 45004203, 40194191, 36056486, 32466769, 29331056, 26592316, 24197595, 22085577, 20211379, 18553338, 17086480, 15774097, 14591314, 13531969, 12585182, 11727397, 10943292, 10232706, 9590649, 9000527, 8452886, 7951614, 7495788, 7073346, 6678110, 6315678, 5986795, 5681206, 5393407, 5128978, 4889931, 4668395, 4459903, 4268911, 4096168, 3934032, 3779165, 3637067, 3509351, 3388926]
55883C388926j16540j07129r4802q7557q3167p5145o7316o7243p1537p2203p1265
55872B475022p5094q0376p9816p5970p5824p7079p3098o6177o2905o1368n5651
55861A691664m8225m5421m5211m1532l6282l5131l5876l2743k8014k7760k9987
55850A285482k8524k4886k4975k7494k6886k4351k4970k6995k4934k0498j9781
55839A011188k2035k1652j8974j8911k0900k0224j7423j6855j7690j5650j1940
55828H08934j1316j2996j2322r804r667j1096r758o596o527r533j1232j1065j1983
55815F75039j3332j1988r350r404j1033r792o123m253m219k469P52K004J598K824
55801F00254N309O093O009Q054J0815J0478Q048P425P860N500J104j255j971m853
$$ y = [3388926, 3272386, 3165257, 3070455, 2982898, 2899731, 2824586, 2757270, 2690027, 2618490, 2546287, 2475022, 2399928, 2319552, 2239736, 2163766, 2087942, 2010863, 1937765, 1871588, 1808683, 1747315, 1691664, 1643439, 1598018, 1552807, 1511275, 1474993, 1439862, 1403986, 1371243, 1343229, 1315469, 1285482, 1256958, 1232072, 1207097, 1179603, 1152717, 1128366, 1103396, 1076401, 1051467, 1030969, 1011188, 989153, 967501, 948527, 929616, 908716, 888492, 871069, 854214, 836524, 820874, 808934, 797618, 784622, 772300, 762496, 752829, 741733, 731975, 725379, 718852, 709319, 698087, 687022, 675039, 661707, 649719, 640369, 630965, 619932, 610140, 604017, 599764, 595545, 593076, 593828, 595832, 597430, 600254, 605563, 611656, 617665, 625719, 636534, 647012, 655060, 662485, 670345, 675845, 676949, 675694, 673723, 668870]
55787F68870r259j0797r333q884r981r410p345p485j0094j1734j1955j3514j5928
55774E33151j5515j2101r292p878n210j132J628L048N477P830O359J364k962n440
55760D99327q422j1546j1549q722p141p826p738o187o022p719q334p319p475r281
55746C84046r910q828q638r552q711o020m837n836n817l869k918l846l664j314
55732C00286K28n54j280n61l74j704k551k207k844n033o173n177m372m909m652
55717B58123k542q39r50j003L87J627J446J289K479M075N068N822O144M971K829
55702B88926J570J022q08l783n539n748o527p976p633n211l607l973l998k448
55688B34267j257j554j610n00M4p68r63O08K236K602K873L905M593M455M750N570
$$ y = [668870, 659611, 648814, 639481, 630597, 620616, 611206, 603861, 596376, 586282, 574548, 562593, 549079, 533151, 517636, 505535, 496243, 488365, 483155, 482023, 483651, 486699, 492176, 500006, 506365, 507729, 504767, 499327, 490905, 479359, 467810, 459088, 451947, 444121, 436383, 430196, 424174, 416455, 408121, 400802, 393327, 384046, 374136, 365308, 356670, 347118, 338407, 332387, 327550, 321714, 315897, 312028, 309110, 305264, 301600, 300286, 300514, 299960, 298680, 298119, 297745, 296041, 293490, 291283, 288439, 283406, 277233, 272056, 267684, 262775, 258123, 255581, 254742, 253792, 252789, 253176, 254803, 256249, 257538, 260017, 264092, 269160, 274982, 281126, 286097, 288926, 290496, 291518, 290710, 286927, 281388, 275640, 269113, 261137, 253504, 248293, 244686, 240713, 236715, 234267, 233010, 231456, 229846, 229346, 229390, 228622, 227659, 228267, 230503, 233105, 235978, 239883, 244476, 248931, 253681, 259251]
55672B59251M964K444K22l55n60j247j303m65m01j542j979r62l13r26j026N26
55656B56328K204K696K868L387L295K386K202L211L734K925K025J570K99j963
55642B87167l373l339l651n125o133n815n666o513p001o459o228o725o372m806
55628B09961l959m434m168k379j375k439l255j833J30K95n96n93J54L77Qn75j745
55611A83574l331l965l324k961l633l923k903j811j700j792j508j669k322j874
55597A46858L2J339P59m32j099k052l520l718j859L2K67j7N56J064M01m68m17
55580A37726j94o07p52M9O78L30J13Q06J323R94J222K960M817N372N253N200M446
55563A69736K713J457J346Q74p64j918j483j062k047l131k946k652l484m099k978
$$ y = [259251, 264215, 266659, 266881, 266526, 265966, 264719, 263416, 262951, 262550, 261008, 259029, 258067, 257754, 256828, 255802, 256328, 258532, 261228, 264096, 267483, 270778, 273164, 275366, 278577, 282311, 285236, 287261, 288831, 289130, 287167, 283794, 280455, 276804, 271679, 265546, 259731, 254065, 247552, 240551, 234092, 227864, 221139, 214767, 209961, 206002, 201568, 197400, 195021, 193646, 191207, 187952, 186119, 186249, 186544, 185948, 185355, 185509, 185886, 185894, 185319, 183574, 180243, 176278, 172954, 169993, 166360, 162437, 159534, 157723, 156023, 154231, 152723, 151054, 148732, 146858, 146890, 148229, 148988, 148556, 147457, 145405, 141885, 138167, 136308, 136340, 136607, 136590, 137146, 138210, 138611, 138143, 137726, 137532, 136925, 136173, 136222, 136900, 137230, 137343, 138149, 139472, 140466, 141688, 144648, 149465, 154837, 160090, 165290, 169736, 172449, 173906, 175252, 176126, 175362, 173444, 171961, 170899, 168852, 165721, 162775, 160123, 156639, 152540, 149562]
55548A49562j345j084j683j666j300j502j757j402j237j796j823n26O21L93P5
55533A33530J006K025J699J039J452J939R65o70j390j572k277k931k836l154m836
55518A23989o212n390l457k522k188p45J463K759L091L519L780L049K144K445
55504A25725L381L398K578K082J872J170K56j67l76o17l5J530K252R57o98r11
55488A42397p59j928l287k710q10K77N43J377K287J687J97j48N24J89j594l320
55472A34922m387n459o253n721m339l657l656l007j694r86j017q39o26j324k249
55457H9708j600N28K009J774Q88L95J71R3M89J143J466J654K158K366J381k03
55441A04420j000r10p50m21O33J689J461L20k43%Lm18m40LJ51m4oR9k58n79k6
$$ y = [149562, 148217, 147133, 145450, 143784, 142484, 140982, 139225, 137823, 136586, 134790, 132967, 132441, 133062, 133455, 133530, 134536, 136561, 138260, 139299, 140751, 142690, 143655, 142985, 141595, 140023, 137746, 134815, 131979, 128825, 123989, 117777, 112387, 108930, 106408, 104220, 103475, 104938, 107697, 110788, 114307, 118087, 121136, 123280, 125725, 129106, 132504, 135082, 137164, 139036, 140206, 140462, 140295, 139919, 139302, 139267, 140797, 143049, 144006, 143308, 142397, 141638, 139710, 136423, 133713, 132903, 133180, 133723, 135100, 137387, 139074, 139271, 139123, 139647, 139836, 138242, 134922, 130535, 125076, 118823, 113102, 108763, 105106, 101450, 98443, 96749, 95763, 94746, 93907, 93281, 91957, 89708, 88108, 88636, 90645, 92419, 93307, 93702, 93873, 93966, 94455, 95598, 97064, 98718, 100876, 103242, 104623, 104420, 103420, 102510, 101760, 101339, 101972, 103661, 105122, 105442, 105199, 105199, 105202, 104784, 104344, 104347, 104498, 104454, 104448, 104547, 104289, 103710, 103684]
55420A03684Q89J011M07n4l93j017j279m36O56P25K72M93Q54N8j254j308k74O
55402A03040p92j130m28J66O8J9L17K87j70l10l9L3K4N76J342J311N34j21n97
55383A04130j309j700j055k71p33j844j876q73l80n92k47P09Q83J6n44k75j59
55366I3880o14q44n75m51m66N9P93O01l44o43MM69L07K39M44L09K2L96J094R60
55346I5640J41j45R5k33r85q59J48O92O49J203K207K041N07o41o43o29j063p75
55328I7350N61J446J042M17L65J51o29j005m90l2j68j35L56M29j0K77J537K197
55310A03659J351J47m23j026k147k698j897q10o52r67q21l23J25O86J157O45p95
55293I5211j639j080k30j50k12L48P89J55r58j283o05M51J423J987J840J369J459
$$ y = [103684, 104573, 105584, 105991, 105937, 105544, 104527, 103248, 102812, 103468, 104193, 104465, 104958, 105812, 105870, 104616, 103308, 103034, 103040, 102248, 101118, 100690, 100856, 100924, 100943, 101260, 101547, 101377, 101067, 101028, 101061, 101085, 101661, 103003, 104314, 104848, 104727, 104130, 102821, 101121, 100066, 99795, 99062, 97218, 95342, 94469, 94089, 93497, 93250, 93959, 94842, 94858, 94314, 94039, 93880, 93266, 92422, 91847, 91396, 90930, 90989, 91782, 92383, 92039, 91396, 91400, 91869, 92176, 92415, 92859, 93168, 93190, 93586, 94680, 95640, 95781, 95636, 95731, 95498, 94513, 93654, 93802, 94494, 95143, 96346, 98553, 100594, 101101, 100460, 99817, 99188, 98125, 97350, 97911, 99357, 100399, 100816, 101181, 101332, 100703, 99698, 99208, 99176, 99008, 98873, 99229, 99658, 99648, 99925, 101462, 103659, 105010, 105157, 104734, 103708, 101561, 98863, 96966, 96156, 95504, 94537, 93716, 93393, 93518, 94204, 95361, 96006, 95211, 93572, 92492, 92262, 92112, 91900, 92248, 93037, 93192, 92234, 90951, 90346, 90797, 92220, 94207, 96047, 97416, 98875]
55276I8875K140K482K183J942J926J421M46pJ41k28j126r36Q66K417K154R36K39
55259A15871k9m82o63j20L12j94j002j211j101j144q40R3O31m0r77r47l23j79
55241A07655m86o20o93j000r51n0Q41N94m19r17n39M2L04J74l53j028j238q25
55223A00491l34j1N82J382J384K60p69n45M59J131J269J169O96j77p80o81m06
55206A05120l59j7Q96J454P97n04j271j140l30R16J906J592J18q46l35M93L16
55189A08806k72k3P13O88l0k01N77J420J605J346J178J343J683J678R65L2k22
55172A21286J21M6p15j238j154j349k231k745k090j025m35M6Q53J336J064R27
55156A12697J513J709N27r34j076k63P2k05l20n03j465k571k483j346n02k80J46
$$ y = [98875, 101015, 103497, 105680, 107622, 109548, 110969, 111415, 111408, 111549, 111321, 110195, 109259, 110125, 112542, 114696, 115632, 115871, 115842, 115360, 114697, 114577, 114889, 114695, 113693, 112482, 111381, 110237, 109397, 109490, 110121, 110081, 109104, 108157, 107834, 107655, 107169, 106549, 105856, 104856, 103905, 103855, 104696, 105290, 104871, 103954, 103415, 103457, 103761, 103935, 103582, 102554, 101316, 100491, 100157, 100146, 100728, 102110, 103494, 103754, 102985, 102440, 102899, 104030, 105299, 106468, 107164, 106987, 106207, 105526, 105120, 104761, 104744, 105640, 107094, 107891, 107387, 106116, 104976, 104646, 105562, 107468, 109060, 109178, 108332, 107997, 108490, 108806, 108534, 108511, 109224, 109912, 109882, 109681, 110258, 111678, 113283, 114629, 115807, 117150, 118833, 120511, 121476, 121508, 121286, 121407, 121453, 120738, 119500, 118346, 116997, 114766, 112021, 109931, 108906, 108471, 108517, 109370, 110706, 111770, 112697, 114210, 115919, 116446, 115512, 114436, 114173, 114245, 114040, 113720, 113217, 111752, 109181, 106698, 105352, 104850, 104570, 104716]
55139A04716Q39Q73J16l94j43K07J37J7J96M21M62N20O72O32K49k18m47l44p9
55120A08432n0m79q41k93J027J906J680J034O72K46n75j099p02k5P3n2L50R26
55102A12230Q22K23QL08N44N63O74Q16P52O93R00R95N84J04K11P35J060J073J005
55083A24300Q06M60K97L28Jp15q83q7O71N01K1J42N15M58L45O61O99k32j200r80
55063A26108k24m70j539j903j241p24q36q00l08o8l29l26L06Q61P29K73J09K73
55045A19891L69O9o24j234j179o42n08r71j016l4R71P98j88q08q02n88j48N75
55027A13931Q83L71j4O02J328Q46k94o03k13m07j034o24R14J880J424O04L63K43
55009A20200k66o61m92k47m01o19m94k28j76l56o57q66n53L27R60O41NJ97J114
$$ y = [104716, 105555, 106428, 106544, 106150, 106007, 106214, 106351, 106368, 106564, 106985, 107447, 107967, 108639, 109271, 109520, 109302, 108855, 108511, 108432, 108382, 107903, 107062, 106769, 107796, 109702, 111382, 112416, 113088, 113334, 112759, 111660, 110958, 110933, 111006, 110954, 111304, 112230, 113052, 113275, 113283, 113591, 114135, 114698, 115372, 116188, 116940, 117633, 118533, 119528, 120112, 120216, 120427, 121162, 122222, 123295, 124300, 125106, 125566, 125863, 126191, 126192, 125477, 124594, 124507, 125178, 125679, 125700, 125842, 126357, 126815, 127160, 127821, 128520, 128288, 127088, 126108, 125884, 125414, 123875, 121972, 120731, 120007, 119171, 118371, 118063, 117995, 117666, 117340, 117646, 118507, 119236, 119509, 119618, 119891, 120260, 120329, 119705, 118471, 117292, 116650, 116142, 115171, 114155, 114121, 115092, 115890, 115702, 114894, 114092, 113504, 113356, 113931, 114814, 115185, 115171, 115773, 117101, 117947, 117653, 117050, 116837, 116430, 115396, 114772, 115686, 117566, 118990, 119594, 119957, 120200, 119934, 119273, 118781, 118534, 118133, 117514, 117020, 116792, 116616, 116260, 115603, 114737, 114184, 114511, 115471, 116112, 116117, 116314, 117428]
54990A17428J642J366Q47L59k60n60J81J486J905R78k28p17n59j00N65J120J038
54973A26491M10j97o33j084j187l82R14J621J498J120N96m33j523j596n46N94
54957A25663J218J670K063J902J077J30o27j223j309o03O6m37j718k282j785j293
54941A22512j177n78P01J477J088L88K39K98Q5j25j23l00o83n25M38J445K014
54924A27174K629L597M311M420M582N357O275O750O987P294P314O631N435M054
54910B02810K481P60q33k311l911n371o136o309o428o270n176l608k912l258l332
54895A50196k590k113k568k952k374j553j326j056J60J684K258J914J613J657
54881A42950J703J909K798M158N133N369N316N475N936O494O727O256N192M058
$$ y = [117428, 119070, 120436, 121283, 121642, 121382, 120822, 121003, 122489, 124394, 125372, 125144, 124427, 123868, 123768, 124333, 125453, 126491, 126901, 126704, 126071, 124987, 123800, 123418, 124332, 125953, 127451, 128571, 129167, 128734, 127211, 125615, 125069, 125663, 126881, 128551, 130614, 132516, 133593, 133723, 133096, 131873, 130564, 129961, 130027, 129590, 127872, 125590, 123805, 122512, 121335, 120757, 121458, 122935, 124023, 124411, 124650, 124948, 125033, 124908, 124785, 124485, 123802, 123277, 123715, 125160, 127174, 129803, 133400, 137711, 142131, 146713, 152070, 158345, 165095, 172082, 179376, 186690, 193321, 198756, 202810, 205291, 206051, 205218, 202907, 198996, 193625, 187489, 181180, 174752, 168482, 163306, 159698, 156786, 153528, 150196, 147606, 145493, 142925, 139973, 137599, 136046, 134720, 133664, 133824, 135508, 137766, 139680, 141293, 142950, 144653, 146562, 149360, 153518, 158651, 164020, 169336, 174811, 180747, 187241, 193968, 200224, 205416, 209474]
54867B09474K967J409q52l187m862n800o253o248n793n213m874m803m746m296
54853A56923l095j447n60j313k866l527k981k531k935l348k857j840j140q80p67
54838A24836p42p06l58J58J97m07j068j419j610j409j75J708K665J947P29L90
54822A24736O92N94j7m73n12l88k35j24k91o73o82O8J183K038K310J789M61r13
54804A29563j264o63k95n79m69P14J976K081J234L87k00o82p34j24M77L17l24
54787A31415o77o05m30j30L58O36M15J46K91N53N33N69J084J698J852J812K149
54770A41669K726L042L159L438L754L816L864M313M991N520O027O724P149O622
54756B06814N171L314J230j134l431n149o239o904o963o167m960m281m493m948
$$ y = [209474, 212441, 213850, 212998, 209811, 204949, 199149, 192896, 186648, 180855, 175642, 170768, 165965, 161219, 156923, 153828, 152381, 151821, 150508, 147642, 144115, 141134, 138603, 135668, 132320, 129463, 127623, 126483, 125603, 124836, 124094, 123388, 123030, 123188, 123385, 122978, 121910, 120491, 118881, 117472, 117297, 119005, 121670, 123617, 124346, 124736, 125428, 126022, 126005, 125532, 125020, 124632, 124397, 124273, 123982, 123309, 122627, 122695, 123878, 125916, 128226, 130015, 130476, 129563, 128299, 127636, 127341, 126762, 126293, 127007, 128983, 131064, 132298, 132685, 132485, 131803, 131069, 130945, 131422, 131739, 131415, 130738, 130133, 129703, 129573, 129931, 130567, 130982, 131128, 131419, 131972, 132505, 133074, 134158, 135856, 137708, 139520, 141669, 144395, 147437, 150596, 154034, 157788, 161604, 165468, 169781, 174772, 180292, 186319, 193043, 200192, 206814, 211985, 215299, 216529, 215395, 211964, 206815, 200576, 193672, 186709, 180542, 175582, 171301, 166808, 161860]
54742A61860m667l333j624o42p67j203j019l95k17n82o92k53R6J0P9Q37J989L031
54724A52508L746L852L188K546L183M990O378O433O000O003O013N287L961K289
54710B16377j00l185n794o969p129o960o294n072m215m326m497l746k634k186
54696A53270k121j622r85r91j316j121o51p56j245j191n28MK02M00M47k7n67l79
54678A40823K76L60l94j261j704j759j479r26n22n31n00l6L38Mo22p44m85m03
54660A30435k64M54J289J254L62m75p70p49n75l72n83j293j595p08P13J438J358
54643A29919J173J018O62N27J083J644J239K77n9J87l9q63j332j131q88p89l54
54626A32274L12M48j7l17j29K06O17J228J417M30j091j641r39j52O3J99N38O30
$$ y = [161860, 157193, 153860, 152236, 151594, 150827, 149624, 148605, 148210, 147993, 147411, 146719, 146466, 146562, 146572, 146651, 147488, 149477, 152508, 156254, 160106, 163294, 165840, 169023, 174013, 180391, 186824, 192824, 198827, 204840, 210127, 214088, 216377, 216277, 213092, 207298, 200329, 193200, 186240, 179946, 174874, 170659, 166333, 161836, 158090, 155456, 153270, 151149, 149527, 148542, 147551, 146235, 145114, 144463, 143707, 142462, 141271, 140743, 140747, 140949, 141349, 141796, 141769, 141202, 140823, 141099, 141459, 141065, 139804, 138100, 136341, 134862, 133936, 133414, 132883, 132383, 132347, 132685, 132689, 132067, 131323, 130838, 130435, 130171, 130625, 131914, 133168, 133530, 133055, 132285, 131536, 130961, 130589, 130006, 128713, 127118, 126410, 127123, 128561, 129919, 131092, 132110, 132772, 133299, 134382, 136026, 137265, 137542, 137483, 137670, 137631, 136768, 135436, 134305, 133417, 132628, 132274, 132586, 133034, 133017, 132700, 132571, 132777, 133394, 134622, 136039, 136469, 135378, 133737, 132798, 132646, 132709, 132908, 133446, 134076]
54608A34076M05L77M90J47m45l82K49L67j66k27M89P00l21j375j092J35R44Q35
54590A35206K94j34k03M0J10m23j107j047l65j65q29j480j497j330j300q01M67
54573A25436J589J643R86N43M83M59M64O63Q27O32K35K4J38N78J311K015K128
54556A40154J502O01r8m41l38J83O15L41m95j047q05M6J150K093K159J057k10
54539A46467l07N61R64N02L09R35J288M98n92p90m13o13j476j973j449l34N38
54522A44115P33M63K51K83J20n56j158r11j11K79K11N25J258J355M70l61l77k19
54504A46370n25o90k5Q35Q63K46L4N47J190J447J260O48k72j041j201q04k37J98
54486A48843K90q0o73j009r43p37m65P3P31J020R55J124J695K118K048J760J377
$$ y = [134076, 134481, 134858, 135348, 135495, 135050, 134668, 134917, 135284, 135118, 134891, 135380, 136080, 135759, 134384, 133292, 133427, 134371, 135206, 135500, 135366, 135163, 135203, 135313, 134890, 133783, 132736, 132371, 132206, 131377, 129897, 128400, 127070, 125770, 124969, 125436, 127025, 128668, 129654, 130197, 130680, 131139, 131603, 132266, 133093, 133725, 133960, 133984, 134122, 134700, 136011, 138026, 140154, 141656, 142257, 142159, 141718, 141380, 141563, 142178, 142519, 142024, 140977, 140172, 140218, 141368, 143461, 145620, 146677, 146467, 146160, 146721, 147685, 148187, 148496, 149431, 150719, 151217, 150625, 149835, 149422, 148809, 147333, 145360, 143911, 143577, 144115, 144848, 145311, 145562, 145845, 145965, 145409, 144251, 143340, 143229, 143508, 143719, 144244, 145502, 146857, 147327, 146966, 146589, 146370, 145845, 145155, 145130, 145965, 146828, 147074, 147108, 147655, 148845, 150292, 151552, 152200, 151928, 150887, 149686, 148882, 148645, 148843, 149133, 149053, 148380, 147371, 146428, 145691, 145226, 145299, 146030, 147050, 148005, 149129, 150824, 152942, 154990, 156750, 158127]
54469A58127O12l39o29K4P88R35P26O77P77J002J632K429K344Q55j162k508k876
54452A63414k456j343n1K95o77j823j959j369r63p13j03M93K24p70j391j078l19
54435A49411J98K02k35o86n07L94J154R24K7m82j69N72J297J842K033J696R48
54418A58619P9p13j132p55L13J117Q59j20p83o35l0N06O89M89J96K74Q04J318
54400A61095J456J400J346J065M85J48N08J123J151M46l37n34n1O75J007P18L60
54383A72061N46Q53K24j320k310j692j92Q37J185J546K217K891L370L621L441
54368A87278K766K032J689J661J664J599J199j0j769k830k437j486j339j982k305
54353A85730j814j085o95o40p10p44n31o4K32m5p58j523k144k421k044j207o95
$$ y = [158127, 158739, 158400, 157771, 157795, 158583, 159518, 160244, 160921, 161698, 162700, 164332, 166761, 169105, 169960, 168798, 166290, 163414, 160958, 159615, 159564, 159859, 159182, 157359, 155400, 154031, 153068, 152355, 152252, 152745, 152969, 152199, 150808, 149730, 149411, 149609, 149811, 149576, 148890, 148383, 148777, 149931, 150855, 150882, 150400, 150231, 150803, 152100, 153942, 155975, 157671, 158619, 158698, 157985, 156853, 156098, 156411, 157528, 158387, 158267, 157484, 156849, 156819, 157325, 158014, 158503, 158699, 158973, 159777, 161095, 162551, 163951, 165297, 166362, 166847, 166995, 167503, 168626, 169777, 170223, 169886, 169352, 169301, 169976, 170983, 171701, 172061, 172607, 173460, 173684, 172364, 170054, 168362, 168170, 169007, 170192, 171738, 173955, 176846, 180216, 183837, 187278, 190044, 192076, 193765, 195426, 197090, 198689, 199888, 199878, 198109, 195279, 192842, 191356, 190017, 188035, 185730, 183916, 182831, 182136, 181496, 180786, 180042, 179511, 179447, 179679, 179634, 178876, 177353, 175209, 172788, 170744, 169537, 168842]
54336A68842q47r96n64m2j20m99m93k59l81o86n44l2J76m2j72o5r3m13p67j029
54316A60974j238j233q09j33M90J011J312R90Q1n42k48L81M50P0j05j07l81p25
54298A60238o80n94j133j922j904r42N8N79R10J185J175J087J414J846J438Q7
54282A62842j116j251m36P60J820K114J322K17L9Q38J453J339J216J544J576O80
54266A74957m41p39l15k3j00j7N07J093J221P58Q9j31M17J234J401O65k90p42
54248A79544o42k93J54N63O66L70j6k31l56m94m28N8P81J291J269O86j65p79q22
54229A81156n33m73q57j413j886k231k235j522j59J111J645J586J479J422J019
54214A78109J24p75j085q22n57o59q83q44o23n80p06o43k74J91O76J244J555R95
$$ y = [168842, 167995, 166999, 166435, 166393, 166273, 165774, 165281, 165022, 164641, 163955, 163411, 163379, 163555, 163513, 163341, 163276, 163183, 162770, 162003, 160974, 159736, 158503, 157694, 157561, 158051, 159062, 160374, 161364, 161445, 160903, 160655, 161036, 161486, 161556, 161451, 161344, 160963, 160238, 159558, 158964, 157831, 155909, 154005, 153063, 153121, 153700, 154610, 155795, 156970, 158057, 159471, 161317, 162755, 162842, 161726, 160475, 160039, 160799, 162619, 164733, 166055, 166272, 166311, 167149, 168602, 169941, 171157, 172701, 174277, 174957, 174516, 173777, 173462, 173439, 173339, 173322, 173829, 174922, 176143, 176901, 176990, 176859, 177276, 178510, 179911, 180576, 180286, 179544, 178902, 178609, 178763, 179326, 179992, 180362, 180346, 180115, 179759, 179265, 178837, 178895, 179676, 180967, 182236, 182922, 182757, 181978, 181156, 180623, 180150, 179293, 177880, 175994, 173763, 171528, 170006, 169847, 170958, 172603, 174189, 175668, 177090, 178109, 178233, 177458, 176373, 175551, 174994, 174335, 173452, 172608, 171985, 171405, 170699, 170056, 169782, 169973, 170649, 171893, 173448, 174443]
54196A74443l40j458j629j175p37l39K23P11Q01O84O78O34L11k6NK45L13K65L87
54177A73996O60R42J297J630J480P29K4j64k48o34q38m68k35q81j623j141K62
54160A74788R17J34j063j556j297o59Q9M65kq97j241q57m93m65k78J68J64n91
54142A67326j339j307o38J73R21J385J200N21J39M49R01R19P08P19Q25O02L2m39
54124A73097l37M54J494J960J528R13J002J606J862J733K107L347M748N664O212
54109B07390O528O289N456M618M021L015J055j373l296m317m604m407m099m159
54095B12117m637m907m374l215k120j567j482j393q67k6M41J49l88n24m90q49
54079A85868j284r53L2O61O02N26P33P50O45J323K849L783L068J568P20N85L54
$$ y = [174443, 174103, 172645, 171016, 169841, 169104, 168765, 168988, 169699, 170500, 171184, 171862, 172496, 172807, 172781, 172786, 173031, 173344, 173609, 173996, 174656, 175598, 176895, 178525, 180005, 180734, 180758, 180594, 180346, 179712, 178874, 178406, 178171, 177290, 175667, 174526, 174788, 175705, 175839, 174776, 173220, 171923, 171264, 171353, 171818, 171816, 170919, 169678, 168821, 168328, 167863, 167585, 167753, 167917, 167326, 165987, 164680, 164042, 164215, 165136, 166521, 167721, 168242, 168381, 168830, 169731, 170650, 171358, 172077, 172902, 173504, 173536, 173097, 172760, 173214, 174708, 176668, 178196, 179109, 180111, 181717, 183579, 185312, 187419, 190766, 195514, 201178, 207390, 213918, 220207, 225663, 230281, 234302, 237317, 238372, 236999, 233703, 229386, 224782, 220375, 216276, 212117, 207480, 202573, 198199, 194984, 192864, 191297, 189815, 188422, 187555, 187529, 187970, 188119, 187731, 187207, 186717, 185868, 184584, 183631, 183663, 184324, 184926, 185452, 186185, 186935, 187580, 188903, 191752, 195535, 198603, 200171, 200891, 201476, 201830]
54062B01830j6O9M42K01q99k033k373j925j142l14N31J382K136K545K438J999
54046B04871J649J620J842K199K602K858K925L147L799M510M694M499M534M839
54032B50588M935M902N331O095O242N428M417L794L233K500K091K214K125J294
54018C05189L60J06K10r7p95j376j858k618l536m137m292m263m244m378m789n192
54002B64290m926l880k849k506k540k350k000j863j830j574j156q42o43n09n50
53987B34272o47m32k6n3m84k76J201L120M435N279O277P229P596P759Q509R547
53971B93306R536P573L898o38m939p825q827q729q617q542p859o560n354m562
53957B41861l869l117k530k061j328k85O63J276J675J935K005K020K211K510K795
$$ y = [201830, 201814, 201883, 202325, 202526, 201627, 199594, 197221, 195296, 194154, 193840, 194371, 195753, 197889, 200434, 202872, 204871, 206520, 208140, 209982, 212181, 214783, 217641, 220566, 223713, 227512, 232022, 236716, 241215, 245749, 250588, 255523, 260425, 265756, 271851, 278093, 283521, 287938, 291732, 294965, 297465, 299556, 301770, 303895, 305189, 305549, 305655, 305865, 305768, 304973, 303597, 301739, 299121, 295585, 291448, 287156, 282893, 278649, 274271, 269482, 264290, 259364, 255484, 252635, 250129, 247589, 245239, 243239, 241376, 239546, 237972, 236816, 235974, 235331, 234822, 234272, 233625, 233193, 233167, 233114, 232630, 232354, 233555, 236675, 241110, 246389, 252666, 259895, 267491, 275250, 283759, 293306, 302842, 310415, 314313, 313675, 308736, 300911, 292084, 283355, 274738, 266196, 258337, 251777, 246423, 241861, 237992, 234875, 232345, 230284, 228956, 228671, 229334, 230610, 232285, 234220, 236225, 238245, 240456, 242966, 245761]
53942B45761L250M063M852N011M538M045L976M241M473M255L329J993J007P58
53928B95552Q10P70R75J753K586K822K812L360M361M986N060N194N610N840N771
53913C48262N951O583P069O960O710O923P349P055N490L106R94r3m12q21j640
53898D09486k275k254k122k715l927m855n074m995n097n400n774o194o618o981
53884C45205p322p548p294o435n527n181n137m606l446k405k147k549l068l327
53870B79213l314l259l356l490l371l092l145l634l910l433k531j855j514j335
53856B37974j421j821k111j994j870k058j955r61K22L86l94q95o11k95m75o10
53840B21111j08P48J258J114M50l43p51n82k96l51m50j15K60j15r70j141k51P72
$$ y = [245761, 249011, 253074, 257926, 262937, 267475, 271520, 275496, 279737, 284210, 288465, 291794, 293787, 294794, 295552, 296362, 297132, 298107, 299860, 302446, 305268, 308080, 311440, 315801, 320787, 325847, 331041, 336651, 342491, 348262, 354213, 360796, 367865, 374825, 381535, 388458, 395807, 402862, 408352, 411458, 412452, 412359, 411947, 411126, 409486, 407211, 404957, 402835, 400120, 396193, 391338, 386264, 381269, 376172, 370772, 364998, 358804, 352186, 345205, 337883, 330335, 323041, 316606, 311079, 305898, 300761, 296155, 292709, 290304, 288157, 285608, 282540, 279213, 275899, 272640, 269284, 265794, 262423, 259331, 256186, 252552, 248642, 245209, 242678, 240823, 239309, 237974, 236553, 234732, 232621, 230627, 228757, 226699, 224744, 223783, 224005, 224391, 223997, 223102, 222491, 222196, 221721, 221111, 221003, 221751, 223009, 224123, 224573, 224230, 223479, 222897, 222601, 222250, 221800, 221685, 221945, 221830, 220860, 219719, 219468, 220240]
53822B20240J129J084J098J070Q77Q49J202J653K007K414K694K211R24j54o1J023
53806B40260K274L176L631L695L693M032M543M570M100M042M901N887O052N569
53792C00425N082M414L013J322N84J242K442L255L589L623L099J708j69j744k704
53777C29181l482m540n678o274o098n665n596n862n885n342m548m008l795l538
53763B58870k872j859j026r32j595k319k338j614q35o56j039j441j396r35n22
53748B37491o27j246j839j809j037k6M33r5j115j508p39L65O64L85P77K019K637
53731B34730J644J29k84K82M77l1k71K66R41J190J294J609J996K252K375K174
53715B50773J437O56P60J847K869K956K361J864J830K206K757L047K683J935J620
$$ y = [220240, 221369, 222453, 223551, 224621, 225498, 226347, 227549, 229202, 231209, 233623, 236317, 238528, 239452, 239298, 239237, 240260, 242534, 245710, 249341, 253036, 256729, 260761, 265304, 269874, 273974, 278016, 282917, 288804, 294856, 300425, 305507, 309921, 312934, 314256, 314840, 316082, 318524, 321779, 325368, 328991, 332090, 333798, 333629, 331885, 329181, 325699, 321159, 315481, 309207, 303109, 297444, 291848, 285986, 280101, 274759, 270211, 266203, 262408, 258870, 255998, 254139, 253113, 252181, 250586, 248267, 245929, 244315, 243480, 242824, 241785, 240344, 238948, 238013, 237491, 236864, 235618, 233779, 231970, 230933, 230907, 231340, 231245, 230130, 228622, 227883, 228248, 228912, 229297, 230074, 232093, 234730, 236374, 236503, 236219, 236501, 236978, 236947, 236676, 236942, 237883, 239073, 240367, 241976, 243972, 246224, 248599, 250773, 252210, 252866, 253626, 255473, 258342, 261298, 263659, 265523, 267353, 269559, 272316, 275363, 278046, 279981, 281601]
53700B81601K121K966L506L584L374L143L298M094N082N376M661L459K366J545
53686C30176J019Q33P26L11l10p35j085j860k875l194k457j399p55m47k38l39
53670C17371q18j148r32m63j20K06O01O92K65k87o31r86j413j360n81J65J24k79
53652C10406j67M04O96N98P15J223J535J264P95P05J088J665K172K518K733K902
53636C31252L065L220L424L750M025L915L353K624J974J453J188J369J785J883
53622C68280J527J208J312J615J843K177K800L440L769L855L842L610L216L155
53608D05649L674M177L952L171K637K728L098L218K831K027J245R76J142J049
53594D41574K86o60j136j208j283j259p84k00m11j666l106l682l199k325j852
$$ y = [281601, 283722, 286688, 290194, 293778, 297152, 300295, 303593, 307687, 312769, 318145, 322806, 326265, 328631, 330176, 331195, 332028, 332754, 333065, 332755, 332020, 330935, 329075, 326200, 323006, 320549, 319150, 318395, 317948, 317710, 317371, 316553, 315405, 314473, 314010, 313890, 314096, 314697, 315389, 315654, 315367, 314736, 313750, 312337, 310977, 310396, 310561, 310685, 310406, 310239, 310643, 311339, 311937, 312652, 313875, 315410, 316674, 317469, 318174, 319262, 320927, 323099, 325617, 328350, 331252, 334317, 337537, 340961, 344711, 348736, 352651, 356004, 358628, 360602, 362055, 363243, 364612, 366397, 368280, 369807, 371015, 372327, 373942, 375785, 377962, 380762, 384202, 387971, 391826, 395668, 399278, 402494, 405649, 409323, 413500, 417452, 420623, 423260, 425988, 429086, 432304, 435135, 437162, 438407, 439383, 440525, 441574, 441860, 441200, 440064, 438856, 437573, 436314, 435530, 435330, 434919, 433253, 430147, 426465, 423266, 420941, 419089]
53579D19089k071k649l061l146l190l334l179k272q23L82P66M62L6j19q4j82m95
53562C96130o55l27K91O77O98P07R63J285J362J046L35n78j190j019j40R55J998
53545D02538K953L559L491K988K702K827L051L364M084M996N441N464N850O672
53531D59980O985O580O767Q473J0563J1243J0500R908J0483J1862J3332J4499
53519E81175J4994J4596J3856J3865J5179J7327J9358K0602K1100K1569K2626
53508G76247K3852K4233K3822K4006K5504K7066K7148K6066K5184K4604K3264
53497A050996K1028J9131J8364J8220J8071J8039J8273J8444J8390J8411J8561
53486A255928J8394J7800J7313J7277J7382J7343J7323J7348J7020J6129J4921
$$ y = [419089, 417018, 414369, 411308, 408162, 404972, 401638, 398459, 396187, 395364, 395746, 396512, 396974, 397010, 396891, 396807, 396625, 396130, 395475, 395148, 395439, 396116, 396814, 397521, 398484, 399769, 401131, 402177, 402512, 401934, 400744, 399725, 399585, 400540, 402538, 405491, 409050, 412541, 415529, 418231, 421058, 424109, 427473, 431557, 436553, 441994, 447458, 453308, 459980, 466965, 473545, 480312, 488785, 499348, 510591, 521091, 530999, 541482, 553344, 566676, 581175, 596169, 610765, 624621, 638486, 653665, 670992, 690350, 710952, 732052, 753621, 776247, 800099, 824332, 848154, 872160, 897664, 924730, 951878, 977944, 1003128, 1027732, 1050996, 1072024, 1091155, 1109519, 1127739, 1145810, 1163849, 1182122, 1200566, 1218956, 1237367, 1255928, 1274322, 1292122, 1309435, 1326712, 1344094, 1361437, 1378760, 1396108, 1413128, 1429257, 1444178]
53475A444178J3409J1205Q417N926M294K950J084j306l794o373r105j1437j2718
53462A446730j3226j3883j4938j5653j5400j4562j4150j4838j6478j8255j9295
53451A276052j9341j9006j9112j9775k0295k0026j9043j7862j6693j5297j3386
53440A076216j0980q343n829l771k330j413q73p42j002j155n24Q90K345L429M684
53425A050602O615Q648R840J0327J1117J2578J4130J5466J7039J9013K0704K1589
53413A217668K2135K3055K4442K6059K7844K9641L1086L2265L3779L5707L7271
53402A540952L8065L8851M0367M2267M4070M6205M8996N1452N2480N2721N3649
53391B050075N5224N6029N5623N5065N4910N4278N2515N0452M9184M8529M7464
$$ y = [1444178, 1457587, 1468792, 1477209, 1483135, 1487429, 1490379, 1491463, 1490157, 1486363, 1479990, 1470885, 1459448, 1446730, 1433504, 1419621, 1404683, 1389030, 1373630, 1359068, 1344918, 1330080, 1313602, 1295347, 1276052, 1256711, 1237705, 1218593, 1198818, 1178523, 1158497, 1139454, 1121592, 1104899, 1089602, 1076216, 1065236, 1056893, 1051064, 1047293, 1044963, 1043550, 1042677, 1041935, 1040933, 1039778, 1039254, 1040144, 1042489, 1045918, 1050602, 1057217, 1065865, 1075705, 1086032, 1097149, 1109727, 1123857, 1139323, 1156362, 1175375, 1196079, 1217668, 1239803, 1262858, 1287300, 1313359, 1341203, 1370844, 1401930, 1434195, 1467974, 1503681, 1540952, 1579017, 1617868, 1658235, 1700502, 1744572, 1790777, 1839773, 1891225, 1943705, 1996426, 2050075, 2105299, 2161328, 2216951, 2272016, 2326926, 2381204, 2433719, 2484171, 2533355, 2581884, 2629348]
53380B629348M5312M1934L7402L2128K6872K2069J7530J3031Q661M310n63o186
53368B871848j2038j7617k3134k9008l5085m0781m5719m9740n2647n4342n5079
53357B456658n5198n4812n3933n2697n1213m9389m7141m4605m2052l9792l8194
53346A927632l7476l7328l7061l6270l5141l3994l2873l1666l0299k8637k6493
53335A560394k3946k1376j9049j6832j4485j2051r885q505q315r246j0658j1926
53323A394120j3065j4427j5780j6268j5459j3967j2767j2165j1728j0966r832
53312A247696q611p500o376m955l198j443k6J061K019K959L998N364P094Q826
53298A246908J0244J1567J3242J5415J7998K0926K3881K6038K6777K6454K5913
$$ y = [2629348, 2674660, 2716594, 2753996, 2786124, 2812996, 2835065, 2852595, 2865626, 2874287, 2878597, 2878034, 2871848, 2859810, 2842193, 2819059, 2790051, 2754966, 2714185, 2668466, 2618726, 2566079, 2511737, 2456658, 2401460, 2346648, 2292715, 2240018, 2188805, 2139416, 2092275, 2047670, 2005618, 1965826, 1927632, 1890156, 1852828, 1815767, 1779497, 1744356, 1710362, 1677489, 1645823, 1615524, 1586887, 1560394, 1536448, 1515072, 1496023, 1479191, 1464706, 1452655, 1442770, 1434265, 1425950, 1416704, 1406046, 1394120, 1381055, 1366628, 1350848, 1334580, 1319121, 1305154, 1292387, 1280222, 1268494, 1257528, 1247696, 1239085, 1231585, 1225209, 1220254, 1217056, 1215613, 1215587, 1216648, 1218667, 1221626, 1225624, 1230988, 1238082, 1246908, 1257152, 1268719, 1281961, 1297376, 1315374, 1336300, 1360181, 1386219, 1412996, 1439450, 1465363]
53287A465363K5401K4613K3569K2591K1511J9761J7340J4934J2800J0346P054
53276A665283L209o14m165p347r958j2045j4044j6236j8380k0159k1668k3197
53264A520679k4786k6212k7224k7726k7865k7989k8232k8319k8038k7729k7851
53253A218708k8185k8041k7177k6022k5057k4461k4237k4122k3530k2237k0962
53242I44677k0500k0458j9735j8178j6755j5987j5294j4157j2958j2201j1682
53231G66772j0930r826q442o892n620n198n601o303p160q423r807j0595j0953
53218F61022j1946j3838j5410j5655j5072j4578j4136j3346j2465j1875j1246
53207E11455j0208r222q811q524p687o745o728p715q819r473r842j0107j0199
$$ y = [1465363, 1490764, 1515377, 1538946, 1561537, 1583048, 1602809, 1620149, 1635083, 1647883, 1658229, 1665283, 1668492, 1667878, 1663713, 1656366, 1646408, 1634363, 1620319, 1604083, 1585703, 1565544, 1543876, 1520679, 1495893, 1469681, 1442457, 1414731, 1386866, 1358877, 1330645, 1302326, 1274288, 1246559, 1218708, 1190523, 1162482, 1135305, 1109283, 1084226, 1059765, 1035528, 1011406, 987876, 965639, 944677, 924177, 903719, 883984, 865806, 849051, 833064, 817770, 803613, 790655, 778454, 766772, 755842, 746016, 737574, 730682, 725062, 719864, 714263, 707960, 700800, 692377, 682570, 671975, 661022, 649076, 635238, 619828, 604173, 589101, 574523, 560387, 547041, 534576, 522701, 511455, 501247, 492025, 483214, 474690, 467003, 460258, 453530, 445815, 436996, 427523, 417681, 407574, 397375]
53194C97375j0148r992r462q404p255o508n937n137m412m299m483m156l340k826
53180C11016k894k963k675k432k567k743k559k138j784j495j154q75q64j076j191
53165B81606q88j42O19Q33M05k03o05r00j242j428j307j156j225j297j255j551
53149B70264k444l161k685j220K1L40J30p2j74j51J29M10K38j96j19O30J150P66
53131B63856R4K05J132J828J549P02K08L73O29L29l60o01R0J226K034K371K608
53114B78273K831K806K619K678K952K785J822N78k55o89j246k085k768k771j978
53099B85552p42K37K31r01k370l012k448j512j308j967k570k334j465o95l61k93
53083B64042l70n99p71n74k18k91q22j058n69K0j13p45r73n54j95m80j112j440
$$ y = [397375, 387227, 377235, 367773, 359369, 352114, 345606, 339669, 334532, 330120, 325821, 321338, 317182, 313842, 311016, 308122, 305159, 302484, 300052, 297485, 294742, 292183, 290045, 288261, 286766, 285612, 284737, 283873, 282797, 281606, 280718, 280576, 281195, 282028, 282433, 282230, 281625, 280725, 279483, 278055, 276748, 275592, 274367, 273070, 271815, 270264, 267820, 264659, 261974, 260754, 260775, 261115, 261245, 261173, 260999, 260848, 260977, 261387, 261625, 261429, 261310, 261940, 263090, 263856, 263950, 264155, 265287, 267115, 268664, 269366, 269574, 269947, 270576, 270905, 270545, 269944, 270034, 271260, 273294, 275665, 278273, 281104, 283910, 286529, 289207, 292159, 294944, 296766, 297344, 297089, 296400, 295154, 293069, 290301, 287530, 285552, 284810, 285047, 285278, 284377, 282007, 278995, 276547, 275035, 273727, 271760, 269190, 266856, 265391, 264696, 264335, 264042, 263672, 263073, 262302, 261728, 261510, 261219, 260397, 259339, 258770, 258790, 258677, 257932, 256959, 256405, 256210, 255730, 254618, 253178]
53065B53178j261q93o68o32o00l53J60P38J019P44J1o44n80L01J365J907J920
53048B55712J834J681J126L10m1L79R64J050O86K33k43o95p83m17j24k78m05P7
53030B61066Q53J149Q69N11K16k46p09o68j37K98M10N53R26J177J007N87J96j09
53012B67949l36m80n98n98q7J055K071K004J012K68M10Q20P47L33R2jl23q39j108
52993B72391q60r4J075K310K936K492J407P30J066J958K477K235J642J252J096
52978B94113Q31M07J45J78J85n9k28L5M52M69J52J08N65J036J106J014J181J491
52960C03181J454R16L60L81R91J523J314M13n67j239j764k287k538k333j989j850
52944B95966j721j347j053j295j777j799j379j211j424j244k17R24J140L28p38
$$ y = [253178, 251917, 251024, 250356, 249724, 249124, 248771, 248931, 249669, 250688, 251432, 251443, 250799, 250219, 250520, 251885, 253792, 255712, 257546, 259227, 260353, 260663, 260622, 261001, 261965, 263015, 263701, 263934, 263691, 262996, 262213, 261796, 261672, 261394, 260989, 261066, 261919, 263068, 263937, 264448, 264664, 264418, 263709, 263041, 262904, 263202, 263612, 264165, 265091, 266268, 267275, 267862, 268058, 267949, 267613, 267133, 266535, 265937, 265850, 266905, 268976, 270980, 271992, 272260, 272670, 273490, 274237, 274570, 274662, 274661, 274338, 273499, 272391, 271531, 271437, 272512, 274822, 277758, 280250, 281657, 282387, 283453, 285411, 287888, 290123, 291765, 293017, 294113, 294944, 295351, 295496, 295674, 295859, 295800, 295572, 295607, 296059, 296528, 296680, 296788, 297353, 298389, 299495, 300509, 301690, 303181, 304635, 305551, 305911, 306292, 307283, 308806, 310120, 310533, 309966, 308727, 306963, 304676, 302138, 299805, 297816, 295966, 294245, 292898, 291845, 290550, 288773, 286974, 285595, 284384, 282960, 281716, 281499, 282423, 283563, 283891, 283153]
52929B83153j359j411j105o92l70k21k43l94n14k95L68J055J183P82M50N20O64
52912B81571N38L29L74N69N27J33l70p37q98q59o35k87O2K66K50J23J21K83K62
52893B81622k43r22j090n38J97M97L54K05L46O97R67Q79L51l56p75o80l10l3J54
52874B81322O49J695K905L486L016J923J021P16Q73J348K106K765K643J647O11
52859C08726K76K89j82j165j979k360k784l516m102m057l589l283l406l705l725
52844B71438l167k180j318j036j209j374j324j140q38l85n3k14p69j156r87l76
52828B53912L77J043J419J472J519J783J855J103k73j193r22R7Q37O96j79j143
52812B62403j438p73K27N53jn68l52L53O65K58m00p87q69r23j079j178j081r63
$$ y = [283153, 281794, 280383, 279278, 278586, 278216, 277995, 277752, 277358, 276844, 276549, 276917, 277972, 279155, 279937, 280387, 280907, 281571, 282109, 282438, 282812, 283381, 283908, 284041, 283671, 282934, 282036, 281177, 280542, 280255, 280317, 280583, 280833, 280956, 281077, 281360, 281622, 281379, 280457, 279367, 278829, 279026, 279523, 279877, 280082, 280428, 281125, 282092, 282971, 283322, 282966, 282191, 281511, 281201, 281168, 281322, 281971, 283666, 286571, 290057, 293073, 294996, 296017, 296733, 297606, 298954, 301060, 303825, 306468, 308115, 308726, 309002, 309291, 309109, 307944, 305965, 303605, 300821, 297305, 293203, 289146, 285557, 282274, 278868, 275163, 271438, 268271, 266091, 264773, 263737, 262528, 261154, 259830, 258690, 257852, 257467, 257414, 257200, 256431, 255275, 254288, 253912, 254289, 255332, 256751, 258223, 259742, 261525, 263380, 264483, 264210, 263017, 262095, 262192, 263029, 263725, 263546, 262403, 260965, 260192, 260419, 260972, 260971, 260403, 260051, 260404, 261069, 261327, 260927, 260140, 259271, 258348, 257269, 256091, 255010, 254047]
52794B54047j122j450j424q76m30p08j338j344m63N74J097J209J295J432J577
52779B52076J788J974J765J011J11m41n93n97o14o85q29r48q76n91k52R7N48J002
52761B53946J086O27m5m46l92q6J44J34L9J66N44Q45R08J052J477J749J420Q70
52743B64038Q02J127J211J117J638K883L830L666K759J867J109K84m02o23n01
52728B84805l77k36O9L49K70j53o23r40j029q59n91n67q60j124j073q81q37q97
52710B74446q17n41k13RK1j21j35K08O98R05P52M83J53l25o78m68J45M86L79L66
52690B75753P18R85Q39N74L94r6j062j808j640q50k37j1J54L17J44n21j405k046
52672B70202k070j463p20l74k60K37J090J455R10J12j96j66k10j18M50J144J410
$$ y = [254047, 252925, 251475, 250051, 249175, 248745, 248037, 246699, 245355, 244892, 245466, 246563, 247772, 249067, 250499, 252076, 253864, 255838, 257603, 258614, 258725, 258284, 257691, 257094, 256480, 255795, 254966, 254018, 253142, 252551, 252299, 252396, 252944, 253946, 255032, 255659, 255614, 255168, 254776, 254690, 254834, 254968, 255007, 255173, 255717, 256562, 257470, 258522, 259999, 261748, 263168, 264038, 264840, 265967, 267178, 268295, 269933, 272816, 276646, 280312, 283071, 284938, 286047, 286331, 285929, 285306, 284805, 284428, 284192, 284261, 284610, 284880, 284727, 284104, 283164, 282135, 281276, 280685, 280118, 279258, 278134, 277061, 276180, 275343, 274446, 273629, 273088, 272875, 272884, 272905, 272784, 272649, 272857, 273555, 274460, 275212, 275695, 275848, 275523, 274845, 274377, 274522, 275008, 275387, 275753, 276471, 277456, 278295, 278869, 279263, 279167, 278105, 276297, 274657, 273807, 273570, 273559, 273713, 274030, 274174, 273653, 272248, 270202, 268132, 266669, 265949, 265575, 265315, 265552, 266642, 268097, 269007, 269119, 268923, 268757, 268547, 268429, 268879, 270023, 271433]
52655B71433J409J740K483L224L713L892L558K659J674J086O63j30j197j858j807
52640B92542j430j277j484j655j182J01J401J626P45o4M7O97J296K048L230M325
52624C00966M749M785M741L924J632j288l232l844m036m187l783k820k155k101
52610B93351j908j122m01m06p51p26l79k59n12p63p07l98j01k2o2J17N44P21K95
52591B86511l05m57k42j14M7P18J625J924J506J131J067O66k76p65K4J336J680
52574B96076P27l85n14L01J089R91M8r28j222r71q12r29q86m66j42m47j240j872
52556B88418j847j176l00J48j78r78j571j576j164o53j98J01K23L54O50Q32M58
52539B81543l51r17p93j88N03J065J281R41L32K08R44K016K624K463J703N89n54
$$ y = [271433, 272842, 274582, 277065, 280289, 284002, 287894, 291452, 294111, 295785, 296871, 297534, 297404, 296207, 294349, 292542, 291112, 289835, 288351, 286696, 285514, 285615, 287016, 288642, 289387, 289323, 289370, 290067, 291363, 293411, 296641, 300966, 305715, 310500, 315241, 319165, 320797, 319509, 316277, 312433, 308397, 304210, 300427, 297607, 295452, 293351, 291443, 290321, 289920, 289514, 288763, 288037, 287658, 287399, 286887, 286124, 285417, 285019, 284918, 284896, 284834, 284951, 285495, 286216, 286511, 286206, 285749, 285507, 285393, 285440, 286158, 287783, 289707, 291213, 292344, 293411, 294077, 293801, 293036, 293060, 294396, 296076, 296803, 296418, 295904, 296205, 297294, 298285, 298333, 297405, 296183, 295212, 294400, 293471, 292585, 292119, 291977, 291530, 290290, 288418, 286571, 285395, 285095, 285243, 285065, 284087, 282516, 280940, 279776, 279123, 278925, 279026, 279249, 279603, 280253, 281085, 281543, 281192, 280275, 279482, 279294, 279797, 280862, 282143, 283084, 283416, 283624, 284568, 286584, 289208, 291671, 293374, 293963, 293409]
52522B93409j303j541j618j778j646p17Q07K078K563K548K678L190L771L999L834
52507C10274L660L890M473M790M088K123n04k670l597l442l008k864l003l197
52493C11013l402l611l708l608l338k849k044j126n26l49l12l56p44j257j065
52478B82718J14J385J870J884K121K275J582L68j36M88J361J669J539J463J659
52463C02360K281L413M645N275N159M721M090K883J040q87k505l877m906n165
52449C18527m594l696k818j904j164j139j819k473k699k888l242l211k434j478
52435B82968r47n66J61R11R82M11q6m5M13R64J294J152O61L36M52O81O74O53R63
52416B92032J461J774J850J834J727J630J928K740L528L852M148N114O591P768
$$ y = [293409, 292106, 290565, 288947, 287169, 285523, 284806, 285613, 287691, 290254, 292802, 295480, 298670, 302441, 306440, 310274, 313934, 317824, 322297, 327087, 331175, 333298, 332794, 330124, 326527, 323085, 320077, 317213, 314210, 311013, 307611, 304000, 300292, 296684, 293346, 290497, 288453, 287327, 286801, 286452, 286140, 285784, 285040, 283783, 282718, 282832, 284217, 286087, 287971, 290092, 292367, 293949, 294317, 294181, 294669, 296030, 297699, 299238, 300701, 302360, 304641, 308054, 312699, 317974, 323133, 327854, 331944, 334827, 335867, 334980, 332475, 328598, 323692, 318527, 313933, 310237, 307419, 305515, 304351, 303212, 301393, 298920, 296221, 293333, 290091, 286880, 284446, 282968, 282021, 281455, 281616, 282527, 283509, 283920, 283834, 283789, 284202, 285166, 286460, 287612, 288273, 288609, 289061, 289742, 290416, 291069, 292032, 293493, 295267, 297117, 298951, 300678, 302308, 304236, 306976, 310504, 314356, 318504, 323618, 330209, 337977]
52402C37977Q360Q820R295R086P401M300O20k751n333p019p840p836p181o243
52388C41656n320m298k878j324m99q75j793k087j303M4J257K087K553K576K095
52373C31891J428J341K398M214N628N861N308M840M641M261L619L132K786J962
52359C83310N01q46j449j616j828j814j120j32L41K54L55J011J721J934J815J930
52343C84367K458L002L134K969L028L531M065M211M268M911O205P543Q536R333
52329D51561J0004J0393J0803J2026J4215J6437J7939J9139K0767K2544K3582
52318F29410K3668K3357K2997K2499K1951K1759K2063K2543K2823K2720K2217
52307H78007K1577K1410K2079K3151K3684K3112K1595J9759J8268J7404J6771
$$ y = [337977, 346337, 355157, 364452, 373538, 380939, 385239, 385859, 383108, 377775, 370756, 362916, 355080, 347899, 341656, 336336, 332038, 329160, 327836, 327337, 326462, 324669, 322582, 321279, 321323, 322580, 324667, 327220, 329796, 331891, 333319, 334660, 337058, 341272, 346900, 352761, 358069, 362909, 367550, 371811, 375430, 378562, 381348, 383310, 383811, 382965, 381516, 379900, 378072, 376258, 375138, 375006, 375347, 375601, 375956, 376967, 378688, 380622, 382437, 384367, 386825, 389827, 392961, 395930, 398958, 402489, 406554, 410765, 415033, 419944, 426149, 433692, 442228, 451561, 461565, 471958, 482761, 494787, 509002, 525439, 543378, 562517, 583284, 605828, 629410, 653078, 676435, 699432, 721931, 743882, 765641, 787704, 810247, 833070, 855790, 878007, 899584, 920994, 943073, 966224, 989908, 1013020, 1034615, 1054374, 1072642, 1090046, 1106817]
52296A106817J5671J3938J2035J0146P785M686J397j571m507p669j0330j1634
52284A136764j1907j2099j2281j1805j0763r983r589q701o913m964l544k333p15
52271A031167J355L628O050Q415J0177J1109J1725J2570J3468J3955J4078J4320
52259A152017J4979J5974J7061J7906J8212J8013J7686J7464J7145J6450J5313
52248A338220J3710J1504Q684N418J740k404o570r884j1990j3553j5333j7220
52236A302322j8616j9420j9958k0275k0207k0060k0369k0919k0758j9546j8202
52225A083992j7646j7492j6595j4744j2926j1913j1329j0448r268q240p374o252
52213I39765m841l559k509j324J01J235J686J798K095K461K465K177K086K313
$$ y = [1106817, 1122488, 1136426, 1148461, 1158607, 1166392, 1171078, 1172475, 1170904, 1166397, 1158728, 1148398, 1136764, 1124857, 1112758, 1100477, 1088672, 1077909, 1067926, 1058337, 1049636, 1042723, 1037759, 1034215, 1031882, 1031167, 1032522, 1036150, 1042200, 1050615, 1060792, 1071901, 1083626, 1096196, 1109664, 1123619, 1137697, 1152017, 1166996, 1182970, 1200031, 1217937, 1236149, 1254162, 1271848, 1289312, 1306457, 1322907, 1338220, 1351930, 1363434, 1372118, 1377536, 1379276, 1376872, 1370302, 1360418, 1348428, 1334875, 1319542, 1302322, 1283706, 1264286, 1244328, 1224053, 1203846, 1183786, 1163417, 1142498, 1121740, 1102194, 1083992, 1066346, 1048854, 1032259, 1017515, 1004589, 992676, 981347, 970899, 961631, 953391, 946017, 939765, 934924, 931365, 928856, 927532, 927633, 928868, 930554, 932352, 934447, 936908, 939373, 941550, 943636, 945949]
52199I45949K454K240J946J999K531L394M348N133N604N857O035O059N773N309
52185A004631M989M808M322L169J462m24k277m103n910p563q826r510r625r362
52171I65781q869q121p061n787m508l365k421j591n59J034L065M851N853O250
52157I44552O531O726O484N697M561L118J350k73r73o27j2K46N03J414K812L863
52141I85972M219M375M789N147M844L857K783K171K204K923M303O007P538Q953
52127A050085J1040J4310J8068K1101K3207K5365K8273L1332L3501L4613L5301
52116A326196L5942L6245L5834L4728L3227L1583K9847K7869K5440K2549J9410
52105A658870J6232J3103J0211P883O168M698L246K130J700J622J001q26l828
$$ y = [945949, 948403, 950643, 952589, 954588, 957119, 960513, 964861, 969994, 975598, 981455, 987490, 993549, 999322, 1004631, 1009620, 1014428, 1018750, 1021919, 1023381, 1022957, 1020680, 1016577, 1010667, 1003104, 994278, 984768, 975143, 965781, 956912, 948791, 941730, 935943, 931435, 928070, 925649, 924058, 923499, 924533, 927598, 932449, 938302, 944552, 951083, 957809, 964293, 969990, 974551, 977669, 979019, 978746, 977773, 977146, 977134, 977380, 977883, 979297, 982109, 985972, 990191, 994566, 999355, 1004502, 1009346, 1013203, 1015986, 1018157, 1020361, 1023284, 1027587, 1033594, 1041132, 1050085, 1061125, 1075435, 1093503, 1114604, 1137811, 1163176, 1191449, 1222781, 1256282, 1290895, 1326196, 1362138, 1398383, 1434217, 1468945, 1502172, 1533755, 1563602, 1591471, 1616911, 1639460, 1658870, 1675102, 1688205, 1698416, 1706299, 1712467, 1717165, 1720411, 1722541, 1724241, 1725863, 1726864, 1726038, 1722210]
52092A722210p424j0855j3585j5700j7794k0282k2939k5306k7118k8095k7725
52081A505387k5825k3073k0434j8093j5477j2250q809n822l677k314j175O91L874
52068A373003P867J1407J3660J4789J5413J5901J6332J6727J7131J7540J7875
52057A537645J8009J7906J7747J7694J7443J6370J4363J2081J0069Q083N726L214
52045A696350P72k262o683j1915j6298j8978k0717k2548k4475k5845k6266k5768
52033A495367k4606k3359k2742k2857k2947k2257k0816j9174j7787j6972j6949
52022A264901j7486j7744j7057j5713j4612j4261j4393j4439j4055j3227j2178
52011A099736j1171j0316r564q986q896r557j0832j2246j3450j4557j5908j7428
$$ y = [1722210, 1714786, 1703931, 1690346, 1674646, 1656852, 1636570, 1613631, 1588325, 1561207, 1533112, 1505387, 1479562, 1456489, 1436055, 1417962, 1402485, 1390235, 1381426, 1375604, 1371927, 1369613, 1368438, 1369129, 1373003, 1380870, 1392277, 1405937, 1420726, 1436139, 1452040, 1468372, 1485099, 1502230, 1519770, 1537645, 1555654, 1573560, 1591307, 1609001, 1626444, 1642814, 1657177, 1669258, 1679327, 1687410, 1693136, 1696350, 1697122, 1694860, 1688177, 1676262, 1659964, 1640986, 1620269, 1597721, 1573246, 1547401, 1521135, 1495367, 1470761, 1447402, 1424660, 1401803, 1378856, 1356599, 1335783, 1316609, 1298822, 1281850, 1264901, 1247415, 1229671, 1212614, 1196901, 1182289, 1168028, 1153635, 1139196, 1125141, 1111914, 1099736, 1088565, 1078249, 1068685, 1059699, 1050803, 1041246, 1030414, 1018168, 1004718, 990161, 974253, 956825]
51999I56825j8357j7974j6642j5668j5728j5904j4822j2458j0142q916q623q621
51987G92970q583q376p896p419p569q573r927j1092j2064j2982j3652j3913j4063
51974F56861j4369j4467j3790j2419j0933r511p700n201k440j31J519K936M607
51961E74962O570Q439R754J0166R450P716N594L876K696J412m43k353l382l314
51947F31143k685j817m44J724M597Q033J1920J5775J8750K0370K0876K0542J9010
51934G67794J5749J1011N970J873q85k893n040p656j0358j2699j4708j6576j8141
51921G13441j9151j9770k0295k0549k0113j9133j8200j7414j6303j4696j3046
51910E14771j1618j0102q292o503m959l343j343Q67L014N054O761P584P451P104
$$ y = [956825, 938468, 920494, 903852, 888184, 872456, 856552, 841730, 829272, 819130, 810214, 801591, 792970, 784387, 776011, 768115, 760696, 753127, 744554, 734627, 723535, 711471, 698489, 684837, 670924, 656861, 642492, 628025, 614235, 601816, 590883, 581372, 573672, 568471, 566031, 565900, 567419, 570355, 574962, 581532, 589971, 599725, 609891, 619341, 627057, 632651, 636527, 639223, 640635, 640192, 637839, 634457, 631143, 628458, 626641, 626197, 627921, 632518, 640551, 652471, 668246, 686996, 707366, 728242, 748784, 767794, 783543, 794554, 800524, 802397, 801512, 798619, 793579, 785923, 775565, 762866, 748158, 731582, 713441, 694290, 674520, 654225, 633676, 613563, 594430, 576230, 558816, 542513, 527817, 514771, 503153, 493051, 484759, 478256, 473297, 469954, 468611, 469478, 472492, 477546, 484307, 491891, 499342, 506446]
51896E06446P089O862N593L425J217p48l051o131r526j2159j3092j2087r809p390
51882D56639n525m005k367o74O81J710K846M316N869P143P999Q502Q776Q840Q434
51867E09184P216N252L120J252n12k407m122n122n371n226m712l515j684J63J533
51852D95049K568L591M475M755M241L187J845J17k167m718o776p748p737p324
51838D83358o957o701o415n937n194m355l750l435k987k075r96k06M20J223J846
51823D37839J460N7j348k007k182k311k246j821j456j449j321n41M50P93M87K98
51807D24702O50J286J969K666L037K512J160j11n93n48o01p74n63K13J025J224
51791D37254O94j57r47j593k125k450k457k143j523n78M80J151J160Q36O22L87
$$ y = [506446, 513535, 520397, 525990, 529415, 530632, 529884, 526833, 520702, 511176, 499017, 485925, 473838, 464029, 456639, 451114, 447109, 444742, 444068, 444749, 446459, 449305, 453621, 459490, 466633, 474632, 483134, 491910, 500750, 509184, 516400, 521652, 524772, 526024, 525512, 523105, 518983, 513861, 508490, 503264, 498552, 495037, 493353, 493516, 495049, 497617, 501208, 505683, 510438, 514679, 517866, 519711, 519828, 517661, 512943, 506167, 498419, 490682, 483358, 476401, 469700, 463285, 457348, 452154, 447799, 444049, 440614, 437627, 435552, 434556, 434350, 434770, 435993, 437839, 439299, 439356, 438008, 436001, 433819, 431508, 429262, 427441, 425985, 424536, 423215, 422674, 423124, 423917, 424404, 424702, 425352, 426638, 428607, 431273, 434310, 436822, 437982, 437871, 437278, 436730, 436129, 435355, 434792, 435005, 436030, 437254, 437948, 437791, 436844, 435251, 433126, 430676, 428219, 426076, 424553, 423975, 424455, 425606, 426766, 427602, 428224, 428611]
51775D28611k33r93j193o79nN28J342K826M717O481P832Q699R188R752J0669J1239
51759D98781J0257P623M605K096m54l717p013r126r974j0407j0765j0666r927
51746D51313q812p514o148n080m442l593j912L5J151J483K243M005N873O810O965
51731D42377P215P880Q312P533N208K244L50M93J894L024L394L610L747K816K13
51716E00310l127n655o700o577n719m406l036k075j692j853k538l563m263l851
51702D45255k215j43J436K242K643K906K788J905M21r44j619j622j269p34j29
51687D50921K55J26n36j609l001m404n084m474k933j538r28o76O6J471K796L218
51671D33670K837K627L276M304M743M560M839O377Q705J0736J1802J1584R705
$$ y = [428611, 428378, 427385, 426192, 425513, 425508, 426036, 427378, 430204, 434921, 441402, 449234, 457933, 467121, 476873, 487542, 498781, 509038, 516661, 521266, 523362, 522908, 519191, 512178, 503052, 493078, 482671, 471906, 461240, 451313, 442501, 434987, 428839, 423759, 419317, 415724, 413812, 413847, 414998, 416481, 418724, 422729, 428602, 435412, 442377, 449592, 457472, 465784, 473317, 478525, 480769, 481119, 481612, 483506, 486530, 489924, 493534, 497281, 500097, 500310, 497183, 491528, 484828, 478251, 472532, 468126, 465090, 463015, 461323, 459470, 456932, 453369, 449106, 445255, 443040, 442897, 444333, 446575, 449218, 452124, 454912, 456817, 457238, 456294, 454675, 453053, 451784, 451050, 450921, 451176, 451302, 450766, 449157, 446156, 441752, 436668, 432194, 429261, 427723, 426795, 426119, 426185, 427656, 430452, 433670, 436507, 439134, 442410, 446714, 451457, 456017, 460856, 467233, 475938, 486674, 498476, 510060, 519765]
51658E19765O124J646k627o184q934j0456j0248q524o085l316m5L562O591Q145
51644D89414Q021O443L678K44k916m907n601n622n741o295p100p723p855p470
51630D46570o831o348o280o335n816m472l007k265k149j986j801k252l181l406
51616C90441k366j032m93n87o60q02j346j858j697j094o72l75J63O25M88J05K50
51599C79090R10J586K462M112O281Q137R521J0785J1588J1187R768Q094N882K163
51585D71566k551o033o882n948m729l646k501j292K03K519N320P245P793Q332
51571D69396J0194J2690J4198J4481J4669J5414J6248J6626J6517J5989J5138
51560F31560J4580J5364J8110K2470K7398L1783L4945L6731L6970L4966K9997
$$ y = [519765, 525889, 527535, 524908, 518724, 509790, 499334, 489086, 480562, 474477, 471161, 471116, 474678, 481269, 489414, 497435, 503878, 507556, 507800, 504884, 499977, 494376, 488754, 483013, 476718, 469618, 461895, 454040, 446570, 439739, 433391, 427111, 420776, 414960, 410488, 407481, 405216, 403067, 401081, 399280, 397028, 393847, 390441, 388075, 387043, 386550, 385963, 385303, 384501, 383155, 381297, 379600, 378506, 377834, 377459, 377622, 378247, 378735, 378840, 379090, 380000, 381586, 384048, 388160, 394441, 402578, 412099, 422884, 434472, 445659, 455427, 463521, 469403, 471566, 469015, 462982, 456100, 450152, 445423, 441777, 439276, 437984, 438187, 440706, 446026, 453271, 461064, 469396, 479590, 492280, 506478, 520959, 535628, 551042, 567290, 583916, 600433, 616422, 631560, 646140, 661504, 679614, 702084, 729482, 761265, 796210, 832941, 869911, 904877, 934874]
51549I34874K2461J3959N908j411q228j4351j9319k2969k5367k6631k7106k7278
51537H04542k7134k6193k4532k3077k2419k1957k0901j9537j8676j8300j7625
51526E64191j6324j4862j3616j2361j0809r182p993p453p234o837o206n795n795
51513D39724n612m617l242k567k770k910k412j823j665j544j021m77l36j48O15
51498D09195J453J515R94Q85J545K325K538K094J318P18Q17J606K327K345J996
51483D33671J957K042J393k44k137l547m440n121n651n837n550m885m216l956
51469C93479m116m224l864l128k431k114k360l089l747l591k456r33L54J187J420
51454C60387R28J45m2N52J165J359J783K967M356N281O170P766R841J1724J3517
$$ y = [934874, 957335, 971294, 977202, 975791, 967563, 953212, 933893, 910924, 885557, 858926, 831820, 804542, 777408, 751215, 726683, 703606, 681187, 659230, 638329, 618792, 600116, 581816, 564191, 547867, 533005, 519389, 507028, 496219, 487037, 479044, 471591, 464357, 457520, 451314, 445519, 439724, 434112, 429495, 426253, 423686, 420916, 418006, 415594, 413771, 412106, 410562, 409541, 409064, 408728, 408580, 409195, 410648, 412163, 413157, 414042, 415587, 417912, 420450, 422544, 423862, 424580, 425397, 427003, 429330, 431675, 433671, 435628, 437670, 439063, 438819, 436682, 433135, 428695, 423574, 417923, 412086, 406536, 401651, 397435, 393479, 389363, 385139, 381275, 378147, 375716, 373602, 371242, 368153, 364406, 360815, 358359, 357426, 357780, 358967, 360387, 361315, 361460, 361418, 361970, 363135, 364494, 366277, 369244, 373600, 378881, 385051, 392817, 402658, 414382, 427899]
51439D27899J5602J7372J7662J6162J3303R192L907j297m577n476n261n252n829
51426D93407p020q804j0509j1127j0603r784q924p312m850k752k059k369k644
51413D04650k457j789n09J148K199J915Q33R5J46O57J299J960K450K613K614K687
51397D20511K870L212L933M911N453N140M555M634N513O653P853R405J1264J2838
51383E08745J3950J5439J8248K2160K6070K9448L3033L7735M3234M8180N1567
51372H47809N3298N3229N0477M4201L4723K3315J1214o41j1329k0331k8072l5282
51360A022611m1698m6165m8123m8315m7733m6552m4412m1184l7038l2261k7396
51349E61734k3125j9683j6665j3703j0964q709o843n283m308m139m472m853n234
$$ y = [427899, 443501, 460873, 478535, 494697, 508000, 517192, 521099, 519802, 515225, 509749, 504488, 499236, 493407, 486387, 477583, 467074, 455947, 445344, 435560, 426636, 419324, 414474, 411722, 409663, 407294, 404650, 402193, 400404, 399895, 401043, 403242, 405157, 405990, 406085, 406231, 406888, 408187, 410147, 412597, 415210, 417824, 420511, 423381, 426593, 430526, 435437, 440890, 446030, 450585, 455219, 460732, 467385, 475238, 484643, 495907, 508745, 522695, 538134, 556382, 578542, 604612, 634060, 667093, 704828, 748062, 796242, 847809, 901107, 954336, 1004813, 1049014, 1083737, 1107052, 1118266, 1117625, 1106296, 1085965, 1057893, 1022611, 980913, 934748, 886625, 838310, 790577, 744025, 699613, 658429, 621391, 589130, 561734, 538609, 518926, 502261, 488558, 477594, 468885, 462042, 456759, 452451, 448312, 443840, 438987, 433753]
51336D33753n694n900n392m274l205k691k754l147l589l844l855l743l534l011
51322C79120k069j041l91k10k87m66o31n93k79M2J24J94O38J406K129K677L093
51305C83456L043K106P18O8N76J182P89j20k78K89J73j282k906l336k773k257
51289C79448j900j046K25J010J097J351K225K988L010K892L556M862N948O418
51275D12084O321N406L416R67q37j650k012k185j704l57J160J937J823J401J291
51260D27061J646K089J948Q88p79k425l660m218l762k351r60p35j722k888l407
51245D06725l248k616j603o09j85k09L9O63P89j51j509k320k496k461k294j920
51229C86595j670j849k023j512m04N40Q58O47kj089k207k606j940n60R71K260
$$ y = [433753, 428059, 422159, 416767, 412493, 409288, 406597, 403843, 400696, 397107, 393263, 389408, 385665, 382131, 379120, 377051, 376010, 375619, 375409, 375122, 374656, 374025, 373432, 373153, 373195, 373319, 373513, 374151, 375557, 377686, 380363, 383456, 386499, 388605, 389323, 389391, 389967, 391149, 391938, 391818, 391540, 391829, 392002, 390720, 387814, 384478, 381705, 379448, 377548, 376502, 376727, 377737, 378834, 380185, 382410, 385398, 388408, 391300, 394856, 399718, 405666, 412084, 418405, 423811, 427227, 428194, 427357, 425707, 423695, 421510, 419806, 419449, 420609, 422546, 424369, 425770, 427061, 428707, 430796, 432744, 433632, 432853, 430428, 426768, 422550, 418788, 416437, 415477, 414742, 413020, 410132, 406725, 403477, 400861, 399258, 398649, 398464, 398255, 398294, 398957, 399746, 399595, 398086, 395766, 393270, 390809, 388515, 386595, 384925, 383076, 381053, 379541, 379137, 379677, 380535, 381182, 381180, 380091, 377884, 375278, 373338, 372778, 373749, 376009]
51213C76009L000K979K360J626J177J148J575K381L207L665L828M157M788N227
51199D17127M904L800K391J228N59K49j53r97k092k834k851k403k008j808j471
51184D13641o77M28J301J502J124O76M79L03k34r94j366j088o89q90j622k048
51168D09846j584o51k03o08j234j162j80J073J904K265K583L043L319L062K426
51153D23899J870J519J075L56l48o69p20r38j435j751j353k48Q55J015j50j937
51137D21040k926k305p83J77Pm70l57J13O4o64j233q61K80J359J879K085K446
51120D19851K937L070K676K274K426K913L067K713K294K045J720J209Q74R34J095
51105D52098J070J004J110J309J511J736J761J298Q42J474L220M437L699J671
$$ y = [376009, 379009, 381988, 384348, 385974, 387151, 388299, 389874, 392255, 395462, 399127, 402955, 407112, 411900, 417127, 422031, 425831, 428222, 429450, 430009, 430258, 430105, 429108, 427016, 424182, 421331, 418928, 416920, 415112, 413641, 412964, 413392, 414693, 416195, 417319, 417995, 418474, 418777, 418543, 417549, 416183, 415095, 414406, 413516, 411894, 409846, 408262, 407611, 407408, 406800, 405566, 404404, 404224, 405297, 407201, 409466, 412049, 415092, 418411, 421473, 423899, 425769, 427288, 428363, 428719, 428371, 427702, 426982, 426044, 424609, 422858, 421505, 421257, 422112, 423127, 422977, 421040, 418114, 415809, 415026, 415203, 415210, 414740, 414383, 414496, 414560, 413896, 412663, 411802, 412082, 413441, 415320, 417405, 419851, 422788, 425858, 428534, 430808, 433234, 436147, 439214, 441927, 444221, 446266, 447986, 449195, 450069, 451003, 452098, 453168, 454172, 455282, 456591, 458102, 459838, 461599, 462897, 463739, 465213, 468433, 472870, 476569, 478240]
51091D78240J82p1J71K60K90L50K46O1J9k02j027j886j640l30O18L41k85jJ181
51072D76517K266K668K567K327K170K255K693L562M944O765Q651J0426J2638J5944
51058E56393J9931K3235K4983K5327K4381K1618J6931J1563P349N294N310O760
51046G49075Q649R659Q784O028K295j367m416p049r843j2814j4861j4689j2365
51033G07086r372p103n963o035p624j0562j3711j5751j6087j4747j2011q572n354
51020E74194k670j01K466M439N606O704Q220R469R731R559R906J0602J0726J0084
51006F68935R168P967O088L896K348J592P80m90j545j776j580j678k104k322j931
50991F87348r51L09J416K093K498L071M042N335O940R065J1810J4988J8272K1346
$$ y = [478240, 478422, 478351, 478522, 478782, 479072, 479422, 479668, 479729, 479748, 479546, 478519, 476633, 474993, 474663, 475281, 475622, 475337, 475336, 476517, 478783, 481451, 484018, 486345, 488515, 490770, 493463, 497025, 501969, 508734, 517385, 527811, 540449, 556393, 576324, 599559, 624542, 649869, 674250, 695868, 712799, 724362, 731711, 737005, 742315, 749075, 757724, 767383, 776167, 782195, 784490, 783123, 778707, 771658, 761815, 749001, 734140, 719451, 707086, 697714, 690611, 684648, 678613, 670989, 660427, 646716, 630965, 614878, 600131, 588120, 579548, 574194, 571524, 571423, 573889, 578328, 583934, 590638, 598858, 608327, 618058, 627617, 637523, 648125, 658851, 668935, 678103, 686070, 692158, 696054, 698402, 699994, 700774, 700284, 698739, 696963, 695383, 693705, 691601, 689279, 687348, 686397, 686706, 688122, 690215, 692713, 695784, 699826, 705161, 712101, 721166, 732976, 747964, 766236, 787582]
50977G87582K3951K5947K7299K7883K7561K6672K6224K7206K9856L3757L8427
50966A102365M3524M8805N4253O0019O5917P1384P6242Q0938Q5489Q8806Q9807
50955A867549Q8756Q6530Q2995P7263O9349O0385N1006M0749K9391J7771O779
50944B478523l455j2731k0085k4815k7620k9736l1465l2395l2778l3528l4856
50933B195059l5870l5919l5523l5526l5875l5903l5520l5449l6272l7801l9584
50922A795817m1532m3747m6038m8046m9610n0629n0699m9497m7420m5258m3117
50911A280224m0361l6804l3261l0446k8020k5351k2682k0644j9023j7036j4797
50900I91799j3429j3415j3737j3131j1630j0186r205q179o591m603k740j351n32
$$ y = [787582, 811533, 837480, 864779, 892662, 920223, 946895, 973119, 1000325, 1030181, 1063938, 1102365, 1145889, 1194694, 1248947, 1308966, 1374883, 1446267, 1522509, 1603447, 1688936, 1777742, 1867549, 1956305, 2042835, 2125830, 2203093, 2272442, 2332827, 2383833, 2424582, 2453973, 2471744, 2478523, 2475068, 2462337, 2442252, 2417437, 2389817, 2360081, 2328616, 2296221, 2263443, 2229915, 2195059, 2159189, 2123270, 2087747, 2052221, 2016346, 1980443, 1944923, 1909474, 1873202, 1835401, 1795817, 1754285, 1710538, 1664500, 1616454, 1566844, 1516215, 1465516, 1416019, 1368599, 1323341, 1280224, 1239863, 1203059, 1169798, 1139352, 1111332, 1085981, 1063299, 1042655, 1023632, 1006596, 991799, 978370, 964955, 951218, 938087, 926457, 916271, 907066, 898887, 892296, 887693, 884953, 883602, 883070]
50887H83070k54l28l69l4O99J601K465L153L512L510L587M469O408Q851J1142
50872I31482J3229J5240J6797J7458J7661J8421J9932K1379K2348K3555K5718
50861A143220K8503L1279L4239L7904M2071M6213N0730N6793O4860P4101Q3542
50850A693455R3232J04003J16330J29624J42574J54244J64896J75455J86024J95335
50840C155172K01935K05387K05803K02656J94844J81681J63182J39665J11781
50831D762106Q0960M9076J7592j2586m0599o5561q6849j03760j15030j19597j17934
50820D247818j11969j03423r2935q0982o8956n8846n2187m9547n0632n4588o0455
50809C463298o7633p5884q4941r4378j03730j12368j19326j23733j25428j24819
$$ y = [883070, 882816, 882488, 882119, 882085, 882784, 884385, 886850, 890003, 893515, 897025, 900612, 905081, 911489, 920340, 931482, 944711, 959951, 976748, 994206, 1011867, 1030288, 1050220, 1071599, 1093947, 1117502, 1143220, 1171723, 1203002, 1237241, 1275145, 1317216, 1363429, 1414159, 1470952, 1535812, 1609913, 1693455, 1786687, 1890690, 2007020, 2136644, 2279218, 2433462, 2598358, 2773813, 2959837, 3155172, 3357107, 3562494, 3768297, 3970953, 4165797, 4347478, 4510660, 4650325, 4762106, 4843066, 4892142, 4909734, 4897148, 4856549, 4790988, 4704139, 4600379, 4485349, 4365752, 4247818, 4135849, 4032426, 3939491, 3858509, 3789553, 3730707, 3678520, 3628973, 3578341, 3523753, 3463298, 3395665, 3319781, 3234840, 3140462, 3036732, 2924364, 2805038, 2681305, 2555877, 2431058]
50799B431058j22132j17325j10685j02969r4810q6384p7784o9322o1321n3923
50789A534403m7137m0807l4590k8365k2588j7856j4154j1028q394o591n650n086
50777A292157m536m077l834l777l999m698n712o586p247q118r411j0689j1381
50764A208092j1417j1255j1463j2269j3271j3664j3124j2168j1293j0141q223
50753A079804o094m719l825j947J604N812R375J2156J4797J7664K0768K4139K7734
50740A197268L1328L4930L8863M3206M7652N2163N7222O3119O9575P6271Q3133
50729A794730Q9736R5186R9050J01808J03934J05168J05168J04147J02287R9016
50719B800230R3597Q5921P6018O3274M6893K7006M810j8019l9576n7950p2098
$$ y = [2431058, 2308926, 2191601, 2080916, 1977947, 1883137, 1796753, 1718969, 1649647, 1588326, 1534403, 1487266, 1446459, 1411869, 1383504, 1360916, 1343060, 1328906, 1317878, 1309484, 1302893, 1297243, 1292157, 1287621, 1283544, 1279710, 1275933, 1271934, 1267236, 1261524, 1254938, 1247691, 1239573, 1230162, 1219473, 1208092, 1196675, 1185420, 1173957, 1161688, 1148417, 1134753, 1121629, 1109461, 1098168, 1088027, 1079804, 1073710, 1068991, 1065166, 1063219, 1064823, 1070635, 1080010, 1092166, 1106963, 1124627, 1145395, 1169534, 1197268, 1228596, 1263526, 1302389, 1345595, 1393247, 1445410, 1502632, 1565751, 1635326, 1711597, 1794730, 1884466, 1979652, 2078702, 2180510, 2284444, 2389612, 2494780, 2598927, 2701214, 2800230, 2893827, 2979748, 3055766, 3119040, 3165933, 3192939, 3197749, 3179730, 3140154, 3082204, 3010106]
50708C010106q2222q8716r1041q8458q1610p2419o2461n2273m2323l3690k7281
50697B287612k3011k0275j8992j9780k3236k9332l7387m6267n4699o1606o6470
50686A886557o9400p0709p0341o7932o3559n8121n2563m6945m0723l3889k7165
50675A285210k0991j5062r074l351J729O335J0732J4613J7376J8839J9306J9156
50663A344818J8677J8097J7409J6413J5220J4393J4365J4989J5917J7106J8659
50652A526063K0437K2156K3643K4847K5932K7409K9688L2395L4731L6678L9106
50641A843085M2356M5621M8246N0752N3769N6693N8364N8529N7662N5845N2925
50630B423847M9444M6308M3598M0755L7791L5256L2921K9460K3540J4492K134
$$ y = [3010106, 2927884, 2839168, 2748127, 2659669, 2578059, 2505640, 2443179, 2390906, 2348583, 2314893, 2287612, 2264601, 2244326, 2225334, 2205554, 2182318, 2152986, 2115599, 2069332, 2014633, 1953027, 1886557, 1817157, 1746448, 1676107, 1608175, 1544616, 1486495, 1433932, 1386987, 1346264, 1312375, 1285210, 1264219, 1249157, 1240083, 1236732, 1238461, 1244796, 1255528, 1270141, 1287517, 1306356, 1325662, 1344818, 1363495, 1381592, 1399001, 1415414, 1430634, 1445027, 1459392, 1474381, 1490298, 1507404, 1526063, 1546500, 1568656, 1592299, 1617146, 1643078, 1670487, 1700175, 1732570, 1767301, 1803979, 1843085, 1885441, 1931062, 1979308, 2030060, 2083829, 2140522, 2198886, 2257415, 2315077, 2370922, 2423847, 2473291, 2519599, 2563197, 2603952, 2641743, 2676999, 2709920, 2739380, 2762920, 2777412, 2779546]
50619B779546j2703k7223l7618m1818m0791l6738l0862k3451j5128o929M77O788
50607B513550J1453J3708J3225J0167M743k886j2315k2881l3922m4759n4681o3237
50595B332165p0458p6373q0520q2320q1884p9937p7030p3291o9003o4728o0637
50584A515984n6185n0950m5416m0469l6318l2470k8616k4948k1569j8229j4875
50573A145939j1888r420o975m104j070J684M340P319J0336J2616J4007J5151J6535
50560A194470J8004J9370K0774K2246K3486K4411K5296K6125K6399K6001K5602
50549A452184K5811K6383K6770K6932K7083K7091K6788K6542K6955K8190L0135
50538A750864L3002L7133M2401M8289N4510O1055O7851P4798Q2021Q9537R6834
$$ y = [2779546, 2766843, 2739620, 2702002, 2660184, 2619393, 2582655, 2551793, 2528342, 2513214, 2506285, 2506762, 2513550, 2525003, 2538711, 2551936, 2562103, 2566846, 2563960, 2551645, 2528764, 2494842, 2450083, 2395402, 2332165, 2261707, 2185334, 2104814, 2022494, 1940610, 1860673, 1783643, 1710352, 1641349, 1576621, 1515984, 1459799, 1408849, 1363433, 1322964, 1286646, 1254176, 1225560, 1200612, 1179043, 1160814, 1145939, 1134051, 1124631, 1117656, 1113552, 1112482, 1114166, 1118506, 1125825, 1136161, 1148777, 1162784, 1177935, 1194470, 1212474, 1231844, 1252618, 1274864, 1298350, 1322761, 1348057, 1374182, 1400581, 1426582, 1452184, 1477995, 1504378, 1531148, 1558080, 1585163, 1612254, 1639042, 1665584, 1692539, 1720729, 1750864, 1783866, 1820999, 1863400, 1911689, 1966199, 2027254, 2095105, 2169903, 2251924, 2341461, 2438295]
50527B438295J03272J08939J14588J20725J27107J33009J37626J40269J40611
50518C564441J38688J34359J27014J16236J02511Q6691O8961M9057K7417N243
50508D420618j6721l8626o0271q0127r6206j07656j14892j18372j17813j12648
50498C557286j02775q8709p1302n1624l0951j0542Q681K6047M0670N1234N6416
50487C384431N5425M7999L4132J4309r952l6168o1812q5086j04917j20579j31531
50476B986251j37544j38937j36783j32634j27592j21754j14850j07176r9267r0959
50466A778755q1713p1940o2993n5634m9389m3703l8695l4242k9433k3783j8100
50455A269130j3373r439n636j978J247M347P678J0859J3625J6786K1025K5378
$$ y = [2438295, 2541567, 2650506, 2765094, 2885819, 3012926, 3145935, 3283561, 3423830, 3564441, 3703129, 3837488, 3964502, 4080738, 4183249, 4269940, 4338901, 4387958, 4415375, 4420618, 4403897, 4365271, 4305000, 4224873, 4128667, 4021011, 3906119, 3787747, 3669934, 3557286, 3454511, 3365802, 3294500, 3242876, 3211925, 3201383, 3210064, 3236111, 3276781, 3328015, 3384431, 3439856, 3487855, 3521987, 3536296, 3526344, 3490176, 3428364, 3343278, 3238361, 3117782, 2986251, 2848707, 2709770, 2572987, 2440353, 2312761, 2191007, 2076157, 1968981, 1869714, 1778755, 1697042, 1625102, 1562109, 1506475, 1457086, 1413383, 1374688, 1340446, 1311013, 1287230, 1269130, 1255757, 1246318, 1240682, 1238704, 1239951, 1244298, 1251976, 1262835, 1276460, 1293246, 1314271, 1339649]
50443A339649K8392L0402L2916L5808L6927L4812L0097K3772J5821O640j677o959
50431A606600r208j0024j0332r792q158o017m023k244n41J081K787N181Q719J3004
50417A577033J7047K0462K4116K9184L5647M2176M7656N2244N6649O0931O4660
50406B027805O7767P0451P2345P2554P0587O6745O1706N6091N0255M3880L5988
50395B696174K5963J4331J930j1258k5581m0274n3639o4642p3290p9448q2424
50384B307842q1976p8722p3220o5584n6289m6355l6310k5787j4672l823N778J3776
50372A844658J9892K3420K3809K1161J5698P490k856j3973k4716l4641m3153m9135
50360A787654n2073n2659n1568m8562m3783l8926l5976l5299l6169l8479m2412
$$ y = [1339649, 1368041, 1398443, 1431359, 1467167, 1504094, 1538906, 1569003, 1592775, 1608596, 1615236, 1613559, 1606600, 1597392, 1587368, 1577036, 1567244, 1559086, 1553069, 1549046, 1546802, 1546261, 1547342, 1550129, 1555310, 1564029, 1577033, 1594080, 1614542, 1638658, 1667842, 1703489, 1745665, 1793321, 1845565, 1902214, 1963145, 2027805, 2095572, 2166023, 2238368, 2310922, 2381509, 2448254, 2509960, 2566051, 2616306, 2660186, 2696174, 2722137, 2736468, 2738398, 2727140, 2701559, 2661285, 2607646, 2543004, 2469714, 2390266, 2307842, 2225866, 2147144, 2073924, 2008340, 1952051, 1905696, 1869386, 1843599, 1828927, 1825104, 1830882, 1844658, 1864550, 1887970, 1911779, 1932940, 1948638, 1956128, 1953272, 1939299, 1914583, 1879942, 1836789, 1787654, 1735581, 1682922, 1631354, 1582792, 1539009, 1500083, 1464107, 1428808, 1392639, 1354160, 1311748]
50349A311748m6726m8988m7984m4766m0972l7046l2595k7646k2747j8235j4030
50338I30013j0071o610l968k071l64J705M002N795O656O934P073O837N797M289
50324I56017L309L432M349N538O824Q153R251R851R957R624Q644O807M468K571
50310A048795J837K007K222K160K391L406M837O208Q040J1284J5718J9938K3216
50297A152059K6507L1261L7961M6261N5576O4821P2109P5484P3399O4034M5342
50286A744814J7510j4697m3508o2881p1599p2187o7977o1369n3680m5486l7135
50275A231805k9264k2727j7911j4361j1267q152m992k018M70K286L596M843O322
50262A138630P890R160R921J0305J0545J0635J0328R674R402J0405J2628J4757
$$ y = [1311748, 1265022, 1216034, 1168050, 1123284, 1082312, 1045266, 1012671, 985025, 962278, 944043, 930013, 919942, 913332, 909364, 907293, 906929, 908634, 912636, 918431, 925087, 932021, 939094, 945931, 951728, 956017, 959326, 962758, 967107, 972645, 979469, 987622, 996873, 1006724, 1016681, 1026305, 1034949, 1041756, 1046224, 1048795, 1050632, 1052639, 1054861, 1057021, 1059412, 1062818, 1067655, 1073863, 1081903, 1093187, 1108905, 1128843, 1152059, 1178566, 1209827, 1247788, 1294049, 1349625, 1414446, 1486555, 1562039, 1635438, 1699472, 1744814, 1762324, 1747627, 1704119, 1641238, 1569639, 1497452, 1429475, 1368106, 1314426, 1268940, 1231805, 1202541, 1179814, 1161903, 1147542, 1136275, 1128123, 1123131, 1121113, 1121583, 1123869, 1127465, 1132308, 1138630, 1146520, 1155680, 1165601, 1175906, 1186451, 1197086, 1207414, 1217088, 1226490, 1236895, 1249523, 1264280]
50250A264280J5207J3437J0173O540L116l74m525r247j3395j5693j5967j4992
50238A238560j3229j0481o976l857k065j484j918m118q811j5135k1049k5191k7472
50225A096774k8131k7316k5672k4183k3039k1438j8972j6448j4906j4357j4015
50214H68297j3298j2173j0839r592q717q153p438o277m975m011l455l091k901
50201G73377k965l083k873k300j778j648j821k031k229k534k868k884k398j768
50187G40197j664k392l547m473m877m914m721m229l376k408j728j483j372r75
50173F98038k96J10k29j022j422r86j35M57P18J078J808K776L769M725N585O244
50157G21218O732P297Q225R679J1670J4093J6799J9706K2823K6068K9164L1797
$$ y = [1264280, 1279487, 1292924, 1303097, 1309637, 1312753, 1312379, 1307854, 1298607, 1285212, 1269519, 1253552, 1238560, 1225331, 1214850, 1207874, 1204017, 1201952, 1200468, 1198550, 1194432, 1185621, 1170486, 1149437, 1124246, 1096774, 1068643, 1041327, 1015655, 991472, 968433, 946995, 928023, 911575, 896669, 882312, 868297, 854999, 842826, 831987, 822395, 813678, 805525, 798087, 791810, 786835, 782824, 779369, 776278, 773377, 770412, 767329, 764456, 762156, 760378, 758730, 756909, 754878, 752649, 750115, 747247, 744363, 741965, 740197, 738533, 736141, 732594, 728121, 723244, 718330, 713609, 709380, 706004, 703596, 701868, 700385, 699013, 698038, 697742, 697852, 697623, 696601, 695179, 694193, 694058, 694515, 695233, 696311, 698119, 700895, 704664, 709389, 714974, 721218, 727950, 735247, 743472, 753151, 764821, 778914, 795713, 815419, 838242, 864310, 893474, 925271]
50145I25271L3794L5058L5480L5043L3866L2056K9763K7545K6342K6676K7980
50134A268874K9008K8944K7689K5208K1086J4954P020k006j1318k0097k7485l2887
50122A328990l6304l8173l8758l7947l5674l2384k8839k5583k2729k0269j8258
50111I94072j6695j5446j4440j3709j3128j2318j1042r470p888o408n184m583
50099H63761m644m669l930k756k396l626n938q029q789p832n618l229j612r06
50085G99787o35l91L0Q78K188L425M069M472N312O275O249M993L652L218L364
50070H46886L306K966K659K359J901J399R13J69q82j804k368k942l688m113l932
50055H42829l670l769l781l185k378k024j981j620p27O14K400M273N411N721O440
$$ y = [925271, 959065, 994123, 1029603, 1064646, 1098512, 1130568, 1160331, 1187876, 1214218, 1240894, 1268874, 1297882, 1326826, 1354515, 1379723, 1400809, 1415763, 1422783, 1420777, 1409459, 1389362, 1361877, 1328990, 1292686, 1254513, 1215755, 1177808, 1142134, 1109750, 1080911, 1055328, 1032599, 1012330, 994072, 977377, 961931, 947491, 933782, 920654, 908336, 897294, 887824, 879936, 873528, 868344, 863761, 859117, 854448, 850518, 847762, 845366, 841740, 835802, 827773, 818984, 811152, 805534, 802305, 800693, 799787, 799152, 798761, 798791, 799669, 801857, 805282, 809351, 813823, 819135, 825410, 831659, 836652, 840304, 843522, 846886, 850192, 853158, 855817, 858176, 860077, 861476, 862389, 862558, 861676, 859872, 857504, 854562, 850874, 846761, 842829, 839159, 835390, 831609, 828424, 826046, 824022, 822041, 820421, 819694, 820308, 822708, 826981, 832392, 838113, 844553]
50040H44553Q509J0994J2290J2309J2267J2809J3700J4989J6985J9180K0612K1325
50028A020522K2228K3534K4557K5051K5375K5342K4270K2394K0790J9621J7916
50017A271600J5454J3425J2614J2264J1365R713O829J338p285j7222k5845l2129
50005A272121l6658l9913m1778m2253m1530l9446l5781l0923k5563j9944j4080
49994I04252q500m072j226J64L33l96j405k190k850l766m970o246p621r269j1103
49979H41135j2860j4349j5285j5229j4177j2861j1985j1376j0418r040p661o459
49967F99435n339m526m433m918n295n172m800m475m118l526k666j548j98J132
49953F49553K129K934M139O000Q047R709J0982J2082J2720J2303J0886R299Q124
$$ y = [844553, 853062, 864056, 876346, 888655, 900922, 913731, 927431, 942420, 959405, 978585, 999197, 1020522, 1042750, 1066284, 1090841, 1115892, 1141267, 1166609, 1190879, 1213273, 1234063, 1253684, 1271600, 1287054, 1300479, 1313093, 1325357, 1336722, 1346435, 1353264, 1354602, 1347317, 1330095, 1304250, 1272121, 1235463, 1195550, 1153772, 1111519, 1069989, 1030543, 994762, 963839, 938276, 918332, 904252, 895752, 891680, 890454, 890618, 890951, 890555, 889150, 886960, 884110, 880344, 875374, 869128, 861507, 852238, 841135, 828275, 813926, 798641, 783412, 769235, 756374, 744389, 733013, 722595, 713555, 705894, 699435, 694096, 689570, 685137, 680219, 674924, 669752, 664952, 660477, 656359, 652833, 650167, 648619, 648421, 649553, 651682, 654616, 658755, 664755, 672802, 682511, 693493, 705575, 718295, 730598, 741484, 750783, 758907]
49940G58907O996N390L666K708K538K119P10j271l150n135p828j0933j3303j4206
49926G27208j4007j3455j2841j1926j0356q098n697m023l392l158k543j613r28
49913F35171n14J27J118K098K867L476L722L474L396M365O109P437Q001Q735J0089
49898F99671J1150J1153J0797J1101J1723J1533J0200Q262N984L295N79j480k890
$$ y = [758907, 765903, 771293, 774959, 777667, 780205, 782324, 783034, 781763, 778613, 773478, 765650, 754717, 741414, 727208, 713201, 699746, 686905, 674979, 664623, 656525, 650828, 646805, 643413, 640255, 637712, 636099, 635171, 634657, 634784, 635902, 638000, 640867, 644343, 648065, 651539, 654935, 659300, 665409, 672846, 680847, 689582, 699671, 710821, 721974, 732771, 743872, 755595, 767128, 777328, 785590, 791574, 794869, 795448, 793968, 791078]
$$ [...]
##END NTUPLES=NMR SPECTRUM
##END=
