
##TITLE=AC1323_SBUAH12152_6535549_3MPLV89FiF
##JCAMPDX= 6.0         $$ Bruker NMR JCAMP-DX V2.0
##DATA TYPE= NMR SPECTRUM
##DATA CLASS= NTUPLES
##ORIGIN= BRUKER
##OWNER= Administrator
$$ 1.72 TOPSPIN		Version 2.1
$$ 2012-07-18 01:14:29.828 -0500  Administrator@TOPSPIN
$$ Compression mode = diff/dup
##.OBSERVE FREQUENCY= 400.02188249412
##.OBSERVE NUCLEUS= ^1H
##.ACQUISITION MODE= SIMULTANEOUS (DQD)
##.ACQUISITION SCHEME= undefined
##.AVERAGES= 64
##.DIGITISER RES= 22
##SPECTROMETER/DATA SYSTEM= spect
##.PULSE SEQUENCE= noesygpps1d.comp
##.SOLVENT NAME= COFFEE_meoh
##.SHIFT REFERENCE= INTERNAL, COFFEE_meoh, 1, 14.96077
##AUDIT TRAIL= $$ (NUMBER, WHEN, WHO, WHERE, PROCESS, VERSION, WHAT)
$$ ##TITLE= Audit trail, TOPSPIN		Version 2.1
$$ ##JCAMPDX= 5.01
$$ ##ORIGIN= Bruker BioSpin GmbH
$$ ##OWNER= Administrator
$$ $$ C:\Bruker\TOPSPIN/data/COFFEE/nmr/AC1323_SBUAH12152_6535549_3MPLV89FiF/12/pdata/1/auditp.txt
$$ ##AUDIT TRAIL=  $$ (NUMBER, WHEN, WHO, WHERE, PROCESS, VERSION, WHAT)
(   1,<2012-07-18 01:14:25.296 -0500>,<Administrator>,<TOPSPIN>,<go>,<TOPSPIN 2.1>,
      <created by zg
	started at 2012-07-18 01:02:55.062 -0500,
	POWCHK enabled, PULCHK disabled,
       configuration hash MD5:
       6B 1B 68 BB D9 2E 58 E2 7F 35 AD 54 07 DF 0E 41
       data hash MD5: 64K
       2C F2 9F 50 5D 37 60 F9 B9 64 F2 8F 88 C9 1F 44>)
(   2,<2012-07-18 01:14:28.078 -0500>,<Administrator>,<TOPSPIN>,<proc1d>,<TOPSPIN 2.1>,
      <Start of raw data processing
       efp LB = 0.3 FT_mod = 6 PKNL = 1 PHC0 = 0 PHC1 = 0 SI = 128K 
       data hash MD5: 128K
       13 CF F6 F5 D2 83 50 F9 35 36 3B 36 66 64 00 BD>)
(   3,<2012-07-18 01:14:29.171 -0500>,<Administrator>,<TOPSPIN>,<proc1d>,<TOPSPIN 2.1>,
      <pk PHC0 = 1.170044 PHC1 = 0 
       data hash MD5: 128K
       9D F8 5C 6B FF C9 A1 93 4A 39 1B 79 72 C3 D4 9B>)
(   4,<2012-07-18 01:14:29.421 -0500>,<Administrator>,<TOPSPIN>,<proc1d>,<TOPSPIN 2.1>,
      <abs ABSG = 1 
       data hash MD5: 128K
       B0 22 0A A8 B8 2C C8 B7 7D DC FC B9 CC F0 01 1E>)
(   5,<2012-07-18 01:14:29.500 -0500>,<Administrator>,<TOPSPIN>,<proc1d>,<TOPSPIN 2.1>,
      <abs ABSG = 2 
       data hash MD5: 128K
       43 71 CF 3B 99 91 A5 D4 1A 46 0E 9E 64 82 8A 20>)
(   6,<2012-07-18 01:14:29.546 -0500>,<Administrator>,<TOPSPIN>,<proc1d>,<TOPSPIN 2.1>,
      <abs ABSG = 3 
       data hash MD5: 128K
       46 C2 33 8D 68 4D 4A 83 57 5D BD E1 C7 CC 30 62>)
(   7,<2012-07-18 01:14:29.609 -0500>,<Administrator>,<TOPSPIN>,<proc1d>,<TOPSPIN 2.1>,
      <abs ABSG = 4 
       data hash MD5: 128K
       0C C2 6F CA 05 94 99 F8 65 F2 3D 0C 40 F1 9C 38>)
(   8,<2012-07-18 01:14:29.656 -0500>,<Administrator>,<TOPSPIN>,<proc1d>,<TOPSPIN 2.1>,
      <abs ABSG = 5 
       data hash MD5: 128K
       E7 C2 5B CD C2 48 C4 33 31 40 1F C7 B6 9C CE 9D>)
$$ ##END=
$$ 
$$ $$ hash MD5
$$ $$ E4 FF 04 9B 22 F7 03 89 B4 4D 12 6D A2 BF E1 C7
##$RELAX= 
##$RELAX= 
##$RELAX= 
##$RELAX= 
##$RELAX= 
##$RELAX= 
##$RELAX= 
##$RELAX= 
$$ Bruker specific parameters
$$ [...]
##$TP07= 0
##$TPNAME0= <>
##$TPNAME1= <>
##$TPNAME2= <>
##$TPNAME3= <>
##$TPNAME4= <>
##$TPNAME5= <>
##$TPNAME6= <>
##$TPNAME7= <>
##$TPOAL= (0..7)
0.5 0.5 0.5 0.5 0.5 0.5 0.5 0.5
##$TPOFFS= (0..7)
0 0 0 0 0 0 0 0
##$TUNHIN= 0
##$TUNHOUT= 0
##$TUNXOUT= 0
##$USERA1= <user>
##$USERA2= <user>
##$USERA3= <user>
##$USERA4= <user>
##$USERA5= <user>
##$V9= 5
##$VALIST= <valist>
##$VCLIST= <CCCCCCCCCCCCCCC>
##$VD= 0
##$VDLIST= <DDDDDDDDDDDDDDD>
##$VPLIST= <PPPPPPPPPPPPPPP>
##$VTLIST= <TTTTTTTTTTTTTTT>
##$WBST= 2048
##$WBSW= 25
##$XGAIN= (0..3)
0 0 0 0
##$XL= 0
##$YL= 0
##$YMAX_a= 11843823
##$YMIN_a= -9083641
##$ZGOPTNS= <>
##$ZL1= 120
##$ZL2= 120
##$ZL3= 120
##$ZL4= 120
##$ABSF1= 14.96077
##$ABSF2= -5.597412
##$ABSG= 5
##$ABSL= 3
##$ALPHA= 0
##$AQORDER= 0
##$ASSFAC= 0
##$ASSFACI= 0
##$ASSFACX= 0
##$ASSWID= 0
##$AUNMP= <proc_prof1d_extract.lims>
##$AXLEFT= 0
##$AXNAME= <>
##$AXNUC= <1H>
##$AXRIGHT= 0
##$AXTYPE= 0
##$AXUNIT= <>
##$AZFE= 0.1
##$AZFW= 0.1
##$BCFW= 0
##$BC_mod= 0
##$BYTORDP= 0
##$COROFFS= 0
##$CY= 15
##$DATMOD= 1
##$DC= 0
##$DFILT= <>
##$DTYPP= 0
##$F1P= 0
##$F2P= 0
##$FCOR= 0.5
##$FTSIZE= 131072
##$FT_mod= 6
##$GAMMA= 0
##$GB= 0
##$INTBC= 1
##$INTSCL= 1
##$ISEN= 128
##$LB= 0.3
##$LEV0= 0
##$LPBIN= 0
##$MAXI= 10000
##$MC2= 0
##$MEAN= 0
##$ME_mod= 0
##$MI= 0
##$NCOEF= 0
##$NC_proc= -2
##$NLEV= 6
##$NOISF1= 0
##$NOISF2= 0
##$NSP= 0
##$NTH_PI= 0
##$NZP= 0
##$OFFSET= 14.96077
##$PC= 1
##$PHC0= 1.170044
##$PHC1= 0
##$PH_mod= 1
##$PKNL= yes
##$PPARMOD= 0
##$PPDIAG= 0
##$PPIPTYP= 0
##$PPMPNUM= 2147483647
##$PPRESOL= 1
##$PSCAL= 4
##$PSIGN= 0
##$PYNMP= <proc.py>
##$REVERSE= no
##$SF= 400.020009728396
##$SI= 131072
##$SIGF1= 0
##$SIGF2= 0
##$SINO= 400
##$SIOLD= 131072
##$SPECTYP= <>
##$SREGLST= <1H.CDCl3>
##$SSB= 0
##$STSI= 131072
##$STSR= 0
##$SW_p= 8223.68421052631
##$SYMM= 0
##$S_DEV= 0
##$TDeff= 65536
##$TDoff= 0
##$TI= <>
##$TILT= no
##$TM1= 0
##$TM2= 0
##$TOPLEV= 0
##$USERP1= <user>
##$USERP2= <user>
##$USERP3= <user>
##$USERP4= <user>
##$USERP5= <user>
##$WDW= 1
##$XDIM= 131072
##$YMAX_p= 443284487
##$YMIN_p= -11483
##$CURPLOT= <Network HP LaserJet P1505>
##$CURPRIN= <$Network HP LaserJet P1505>
##$DFORMAT= <normdp>
##$LAYOUT= <+/1D_H.xwp>
##$LFORMAT= <normlp>
##$PFORMAT= <normpl>
##$SURQMSG= 1
$$ End of Bruker specific parameters
$$ ---------------------------------
##NTUPLES= NMR SPECTRUM
##VAR_NAME=  FREQUENCY,     SPECTRUM/REAL,   SPECTRUM/IMAG
##SYMBOL=    X,             R,               I
##VAR_TYPE=  INDEPENDENT,   DEPENDENT,       DEPENDENT
##VAR_FORM=  AFFN,          ASDF,            ASDF
##VAR_DIM=   131072,        131072,          131072
##UNITS=     HZ,            ARBITRARY UNITS, ARBITRARY UNITS
##FACTOR=    0.0627417313425164, 1,          1
##FIRST=     8223.62146879497, -2744,        -55407
##LAST=      0,             -1407,           -55909
##MIN=       0,             -11483,          0
##MAX=       8223.62146879497, 443284487,    0
$$ Real data points
##PAGE= N=1
##DATA TABLE= (X++(R..R)), XYDATA
$$ [...]
61643D19948J689J241Q96J015J419J702J677J389R28M00j34p12j264j444j017
61628D27733l89k54o66r40p01m90j025k205l306l886m104m242m273l968l222k277
61612C91785j604j528j923k452l046l843m626m850m348l724l626l966m139l785
61598C44325l009k094j407j374k038k750k767k194j868k200k686k691k280j928
61584C13039j758j527j173r18q38p49o00o55j093j655j868j489o96L6J98l81j233
61567B96640j583j169n37k48q7N18J489K092J985J672J661J701J314P42P32J426
61551C08348J991J597M71k73Q5J026J341N59m68o28K2M09rm31J56J544K586K627
61533C20953K083J626J364J074P37N66N99N61J70m97r83r10m53k30n94j208j536
$$ plain form
61643 419948 421637 422878 423774 424789 426208 427910 429587 430976 431904 432304 432170 431458 430194 428750 427733
61628 427733 427344 427090 426424 425484 424783 424293 423268 421063 417757 413871 409767 405525 401252 397284 394062 391785
61612 391785 390181 388653 386730 384278 381232 377389 372763 367913 363565 359841 356215 352249 348110 344325
61598 344325 341316 339222 337815 336441 334403 331653 328886 326692 324824 322624 319938 317247 314967 313039
61584 313039 311281 309754 308581 307663 306825 306076 305476 304821 303728 302073 300205 298716 298020 298056 298254 297873 296640
61567 296640 295057 293888 293351 293103 293016 293534 295023 297115 299100 300772 302433 304134 305448 306190 306922 308348
61551 308348 310339 311936 312407 312134 312219 313245 314586 315145 314677 314049 314071 314480 314471 314040 314196 315740 318326 320953
61533 320953 323036 324662 326026 327100 327837 328403 329002 329563 329733 329236 328253 327343 326890 326660 326066 324858 323322
61516C23322j548j618j841j861j442q15l12N7M93R86J294J238Q80M34J02m8j54
61499C19167m70j040j441j057K16J587K019J374N93N82J147J440J187Q82P55L01
61483C27242p38j524r06J032K733K710J098m42l37J336K942L057J994J196J294
61468C42687J451P78l46r80r73q30o05J01J105J501Q36k55q42o34P5R22J561J680
61450C47232J301Q62O84O13L75Q9O0L12O25R56J443J967K092J545O54N3M0L84
61432C61287P51J090J505J825J636P91k54p89n07K33P42O48K35J18M58P19L70
61415C70858l29o62m40j21M5L34Q13R16K78m90n37LJ61n73j618k071j725j159
61397C63683j022j290j272m90N73R57N06R9L77Q38O66m8m95k22N88J526K120J930
$$ plain form
61516 323322 321774 320156 318315 316454 315012 314197 313885 313942 314435 315421 316715 317953 318833 319267 319369 319321 319167
61499 319167 318697 317657 316216 315159 315375 316962 318981 320355 320948 321530 322677 324117 325304 326186 326941 327242
61483 327242 326504 324980 324074 325106 327839 330549 331647 331205 330868 332204 335146 338203 340197 341393 342687
61468 342687 344138 344916 344570 343590 342617 341787 341182 341283 342388 343889 344725 344470 343628 342994 343069 343991 345552 347232
61450 347232 348533 349395 350079 350692 351067 351156 351216 351528 352153 353109 354552 356519 358611 360156 360810 360863 360903 361287
61432 361287 362038 363128 364633 366458 368094 368885 368631 367842 367335 367568 368310 368958 369193 369311 369769 370488 370858
61415 370858 370529 369867 369427 369306 369351 369685 370498 371414 371692 371202 370665 370668 370829 370256 368638 366567 364842 363683
61397 363683 362661 361371 360099 359609 360182 361139 361645 361744 362121 362959 363625 363577 363082 362860 363448 364974 367094 369024
61379C69024J140P44J430K532K845K252J728J889K371K679K727K502J955J381
61365C97199J151R70K80n28l06J101K285K037R23M36J204K689M161N211N576N245
61349D29634M709M579N013N704O264O343N653M326L038K382K274K219K059K025
61335D86222K221K409K388K228K054J769J177K82o71j465k142k751l061k776k188
61320D85696k065k595k824j776J77J653J999J977K647M149N803O966P509P834
61306E17150Q584J0080J1970J3614J4750J5443J5485J4520J2683J0556Q325N670
61294F58830K652M6j571k554l588m840o059p193q383r554j0339j0413r811r017
61280E78206q633q668q371p074n127l460k421j629q26j09O83J816K810K653J258
$$ plain form
61379 369024 370164 370908 372338 374870 377715 379967 381695 383584 385955 388634 391361 393863 395818 397199
61365 397199 398350 399320 399600 399072 398766 399867 402152 404189 405112 405548 406752 409441 413602 418813 424389 429634
61349 429634 434343 438922 443935 449639 455903 462246 467899 472225 475263 477645 479919 482138 484197 486222
61335 486222 488443 490852 493240 495468 497522 499291 500468 500750 500079 498614 496472 493721 490660 487884 485696
61320 485696 483631 481036 478212 476436 476613 478266 480265 482242 484889 489038 494841 501807 509316 517150
61306 517150 525734 535814 547784 561398 576148 591591 607076 621596 634279 644835 653160 658830
61294 658830 661482 661528 659957 657403 653815 648975 642916 635723 627340 617786 607447 597034 587223 578206
61280 578206 569573 560905 552534 545460 540333 536873 534452 532823 531997 531888 532571 534387 537197 539850 541108
61265E41108j90p12n52k19N43K091L933N211N772N994O011N692N080M281L306
61250E87349K415K138K444K398J367K7n52m13m90j131j726j771j569j699k306
61235E86481l019l210k452r86L01O83L16m7J89J155K625M093N045N495N956O717
61219F09342P517Q106Q552Q730Q246P308O951P633Q357P967O763N848N347M456
61205G11123L042K023J957K282K311K233K714L961N613P204Q531R641J0691J1771
61191G85097J2897J4051J4946J4781J2839R533O335M210K712J005q43k221l025
61178H72317l557l828l785l926m829o233p369q070q770r566j0036j0005r753r497
61164G73093r274r345j0087j1430j2905j4100j4707j4428j3380j2317j1747j1157
$$ plain form
61265 541108 540918 540206 539654 539435 539978 542069 546002 551213 556985 562979 568990 574682 579762 584043 587349
61250 587349 589764 591902 594346 596744 598111 598138 597586 597173 596683 595552 593826 592055 590486 588787 586481
61235 586481 583462 580252 577800 576814 577115 577798 578114 578067 578256 579411 582036 586129 591174 596669 602625 609342
61219 609342 616859 624965 633517 642247 650493 657801 664752 672385 680742 688709 695472 701320 706667 711123
61205 711123 714165 716188 718145 720427 722738 724971 727685 731646 737259 744463 752994 762635 773326 785097
61191 785097 797994 812045 826991 841772 854611 864144 870479 874689 877401 878406 877563 875342 872317
61178 872317 868760 864932 861147 857221 852392 846159 838790 830720 821950 812384 802348 792343 782590 773093
61164 773093 763819 754474 744387 732957 720052 705952 691245 676817 663437 651120 639373 628216
61152F28216r803p962o474n382l936j950q5J112J579J082p35l441n822p051p185
61137E72163o529n307m089l540l432k741j056Q56K172K956L614M182M615N235
61123E69099O373P979R904J2121J4381J6183J7406J8588K0245K2249K4063K5348
61111G63939K6056K6282K6148K5699K4868K3737K2642K1751K0771J9434J7952
61100A019279J6431J4309J1094P295L761L58l639q021j1726j4397j6750j9142
61088I98852k1016k2025k2659k3283k3532k3082k2206k1105j9559j7711j6287
61077G66387j5555j4826j3485j1812j0295q887p445o195n183l939k249o15N16
61064F66417J416K512L729M816N730O354O494O540P356R105J0919J2137J3124
$$ plain form
61152 628216 618413 610451 603977 598595 594659 592709 592624 593736 595315 596397 595662 592221 586399 579348 572163
61137 572163 565634 560327 556238 552698 549266 546525 545469 546325 548497 551453 555067 559249 563864 569099
61123 569099 575472 583451 593355 605476 619857 636040 653446 672034 692279 714528 738591 763939
61111 763939 789995 816277 842425 868124 892992 916729 939371 961122 981893 1001327 1019279
61100 1019279 1035710 1050019 1061113 1068408 1072169 1072527 1068888 1060867 1049141 1034744 1017994 998852
61088 998852 977836 955811 933152 909869 886337 863255 841049 819944 800385 782674 766387
61077 766387 750832 736006 722521 710709 700414 691527 684082 677887 672704 668765 666516 665901 666417
61064 666417 667833 670345 674074 678890 684620 690974 697468 704008 711364 720469 731388 743525 756649
61051G56649J4340J5500J6269J6997J8109J9453K0891K2786K5245K7525K9005
61040I82769L0089L1483L3068L4336L5298L6327L7546L9003M0937M3277M5449
61029A389582M7224M9139N1489N3615N4825N5327N5618N5749N5982N7396O0902
61018A986848O6247P2681P9970Q7944R5908J03420J11154J20308J32065J48368
61008C004913J72107K05513K49508L05719L77831M69597N83190P21305Q89458
60999F979141J093995J338121J617637J908930K148145K226882K036770J551173
60991B0900794Q76357K12899k51170m28043l38381o6701K70177N26009N46889
60982B2248830K42080l44042j038135j633772j999502k116855k042823j853473
$$ plain form
61051 756649 770989 786489 802758 819755 837864 857317 878208 900994 926239 953764 982769
61040 982769 1012858 1044341 1077409 1111745 1147043 1183370 1220916 1259919 1300856 1344133 1389582
61029 1389582 1436806 1485945 1537434 1591049 1645874 1701201 1756819 1812568 1868550 1925946 1986848
61018 1986848 2053095 2125776 2205746 2293690 2389598 2493018 2604172 2724480 2856545 3004913
61008 3004913 3177020 3382533 3632041 3937760 4315591 4785188 5368378 6089683 6979141
60999 6979141 8073136 9411257 11028894 12937824 15085969 17312851 19349621 20900794
60991 20900794 21777151 21990050 21738880 21310837 20972456 20905755 21175932 21701941 22248830
60982 22248830 22490910 22146868 21108733 19474961 17475459 15358604 13315781 11462308
60974A1462308j613173j367957j144919r53541p92609o58429n47545m55794l79195
60965C549146l15938k65653k27004j97313j73932j54821j38418j24072j11981
60956A840014j01815r2156q2033p1981o2694n3817m5296l8704l5552l5023l4897
60945A186046l4187l3314l2263l0342k7678k5373k3937k2811k1658k0921k0822
60934H92740k0850k0620k0402k0463k0482j9969j8816j7287j5813j4802j4207
60923F89029j3416j2010j0390r188q345p436o586o196n979n205l910k903k495
60910E94970k120j396o77k27K89J111J870K230K429K703K731K199J429R36P21
60895F09198M92K67J56j03q62j871k498k622k838l644m882o115p210q281r307
$$ plain form
60974 11462308 9849135 8481178 7336259 6382718 5590109 4931680 4384135 3928341 3549146
60965 3549146 3233208 2967555 2740551 2543238 2369306 2214485 2076067 1951995 1840014
60956 1840014 1738199 1646043 1564010 1492029 1429335 1375518 1330222 1291518 1255966 1220943 1186046
60945 1186046 1151859 1118545 1086282 1055940 1028262 1002889 978952 956141 934483 913562 892740
60934 892740 871890 851270 830868 810405 789923 769954 751138 733851 718038 703236 689029
60923 689029 675613 663603 653213 644025 635680 628244 621658 615462 609483 604278 600368 597465 594970
60910 594970 592850 591454 590777 590550 590839 591950 593820 596050 598479 601182 603913 606112 607541 608477 609198
60895 609198 609690 609957 610113 610010 609148 607277 604779 602157 599319 595675 590793 584678 577468 569187 559880
60880E59880j0051j0321j0079r397q501p817p646p783p648o933n929n049m314
60867D58412l544k848k487k297j767p40L40J101J707K395K937K938K446J907J615
60852D62115J479J359J353J777K839M226N016M388K541O82j12K30J009J475J125
60837D91502j13j567k249k025j911k676l667l791l164k826l051l016k254j395
60823D57797j186j536j928k156k282k357k482k729k840k529k174k508l477m177
60809D23436m252m460n285n914n380m054l042k663k479k438k817l240k929j991
60795C72492j423j628j910j723j486j686j988j829j241n88J3N14P02O76R85J714
60779C61594K025J338M38M82J295J694J375J278J935K630K664K488K818L377L367
$$ plain form
60880 559880 549829 539508 529429 520032 511531 503714 496068 488285 480637 473704 467775 462726 458412
60867 458412 454868 452020 449533 447236 445469 444729 445069 446170 447877 450272 453209 456147 458593 460500 462115
60852 462115 463594 464953 466306 468083 470922 475148 480164 484552 487093 487775 487663 487893 488902 490377 491502
60837 491502 491389 489822 487573 485548 483637 480961 477294 473503 470339 467513 464462 461446 459192 457797
60823 457797 456611 455075 453147 450991 448709 446352 443870 441141 438301 435772 433598 431090 427613 423436
60809 423436 419184 414724 409439 403525 398145 394091 391049 388386 385907 383469 380652 377412 374483 372492
60795 372492 371069 369441 367531 365808 364322 362636 360648 358819 357578 356990 357003 357517 358219 358895 359880 361594
60779 361594 363619 364957 365395 365877 367172 368866 370241 371519 373454 376084 378748 381236 384054 387431 390798
60764C90798K764K300K312K358K034J451Q27R2q15j714k383k765k833k573k232
60749C89621k190k329j925n85J024J799J472P26J03n83j554k437k820l017l645
60734C73660m608n187n097m709m199l250k028j534k311l333l156j814o44l52l62
60719C31076k04l39j084j662j204q9N81N09L42M75N82M32M14R71J971K901L360
60702C39032L256K800K420K431K691K762K484K094J811J634J587J769K043K005
60688C70819J533J106J281J956K431K166J374P98R85J742K345K226J471O69L67
60673C93269O71J198J316O77k95p67n40m57j338k807l733l684l310l229l274l041
60657C70656k553k000j363o61j86l9K06R39J861K395K521K697L019L046K503J704
$$ plain form
60764 390798 393562 395862 398174 400532 402566 404017 404844 404936 404121 402407 400024 397259 394426 391853 389621
60749 389621 387431 385102 383177 382592 383616 385415 386887 387613 387716 387133 385579 383142 380322 377305 373660
60734 373660 369052 363865 358768 354059 349860 346610 344582 343048 340737 337404 334248 332434 331790 331438 331076
60719 331076 330872 330533 329449 327787 326583 326494 327075 327584 327926 328401 328983 329415 329829 330800 332771 335672 339032
60702 339032 342288 345088 347508 349939 352630 355392 357876 359970 361781 363415 365002 366771 368814 370819
60688 370819 372352 373458 374739 376695 379126 381292 382666 383464 384449 386191 388536 390762 392233 392902 393269
60673 393269 393940 395138 396454 397131 396836 396069 395529 395072 393734 390927 387194 383510 380200 376971 373697 370656
60657 370656 368103 366103 364740 364079 363893 363854 364060 364999 366860 369255 371776 374473 377492 380538 383041 384745
60641C84745J072N81j32j279k709m037m915n169m798l865k527j137j29L82P19
60626C56802J225J788K029J734R94L6p30p25K43J499J980J369L66k68n03o80q13
60609C66346o84l44q6j4J7M9o3l61o93r04r10n86J27R85J646K091K555K969K893
60590C75033K226J491J124Q79M03J8L39J177J554R12k08r05q73m21Q0M95R51J807
60572C86082L285M983O128O603P292Q969J1211J2906J3628J3823J3715J2763J0403
60559E11791O938L324L36j889l671n304o693p418p246o381n136l503j439O02K007
60544D76318K800L683N100O837Q657J0788J3346J5779J7454J8541J9713K1002
60532F20018K1492K0261J7243J3093Q501L851p06n054q886j1647j2898j2815j2108
$$ plain form
60641 384745 385817 386398 386266 384987 382278 378241 373326 368157 363359 359494 356967 355830 355701 356083 356802
60626 356802 358027 359815 361844 363578 364572 364608 363878 363153 363396 364895 366875 368244 368610 368342 367839 367159 366346
60609 366346 365662 365318 365232 365218 365235 365284 365221 364860 364167 363263 362353 361767 361894 362879 364525 366616 369171 372140 375033
60590 375033 377259 378750 379874 380753 381156 381174 381513 382690 384244 385156 384948 384043 383170 382749 382829 383324 384275 386082
60572 386082 389367 394350 400478 407081 414373 423342 434553 447459 461087 474910 488625 501388 511791
60559 511791 518729 522053 522389 520500 516829 511525 504832 497414 490168 483787 478651 475148 473709 474311 476318
60544 476318 479118 482801 487901 494738 503395 514183 527529 543308 560762 579303 599016 620018
60532 620018 641510 661771 679014 692107 700608 704459 703753 698699 689813 678166 665268 652453 640345
60519F40345j1282j0213q715p243o496o414o060m792l047j646p10J90J158J960
60505E77035K869M698P657J0942J3893J7102K1601K7311L3046L7982M2356M6575
60493H43067N0268N2623N3250N2290M9975M6380M1476L5154K7229J7682O876m637
60481A271633j6414k8053l8811m7610n3619n6798n7721n6909n4553n0886m6474
60470G63785m1896l7329l2837k8852k5832k3450k0771j7489j4443j2484j1337
60459D97065j0135q684p517o836o170n107l905l151l156l722m227m024l039j969
60445D25423j558j787k088k185k204k184j985j679j494j418j279j211j439j735
60431D01177j650j292j191j340j144m77k1k67q60j225j191o66N09J876K318J373
$$ plain form
60519 640345 629063 618850 610135 602892 596396 589982 583922 579130 576083 574437 573727 573917 575075 577035
60505 577035 579904 584602 592259 603201 617094 634196 655797 683108 716154 754136 796492 843067
60493 843067 893335 945958 999208 1051498 1101473 1147853 1189329 1224483 1251712 1269394 1276270 1271633
60481 1271633 1255219 1227166 1188355 1140745 1087126 1030328 972607 915698 861145 810259 763785
60470 763785 721889 684560 651723 622871 597039 573589 552818 535329 520886 508402 497065
60459 497065 486930 478246 470729 463893 457723 452616 448711 445560 442404 438682 434455 430431 427392 425423
60445 425423 423865 422078 419990 417805 415601 413417 411432 409753 408259 406841 405562 404351 402912 401177
60431 401177 399527 398235 397044 395704 394560 394083 394062 393795 392935 391710 390519 389853 390362 392238 394556 395929
60415C95929N7l46J77P23R49J262J801K098J826J224P03N43R43J786K468K466
60399D14609K152K416L350M005L652K736K172K173K325K478K899L529L802L409
60385D55707K878K905L426L756L556L128K718K143J428J208J964L258M240M682
60371D96997M837M634L778K621K000K051J982J266L79KK62J064K465M141N173
60356E33652N040M406M358N239O709Q486J0386J2010J2997J3375J3146J1867R228
60343F50899N667J882j922n602q410r595r530r344r524r557q931p711o194m713
60329E67415l808l808m200m186l966m569o205p642p685o536n186m072k981j812
60315E00759p29L70J884L960O244Q298J0094J2085J4705J7743K0300K1597K1831
$$ plain form
60415 395929 395986 395640 395817 396540 397489 398751 400552 402650 404476 405700 406403 406946 407889 409675 412143 414609
60399 414609 416761 419177 422527 426532 430184 432920 435092 437265 439590 442068 444967 448496 452298 455707
60385 455707 458585 461490 464916 468672 472228 475356 478074 480217 481645 482853 484817 488075 492315 496997
60371 496997 501834 506468 510246 512867 514867 516918 518900 520166 520545 520547 520809 521873 524338 528479 533652
60356 533652 538692 543098 547456 552695 559404 567890 578276 590286 603283 616658 629804 641671 650899
60343 650899 656566 658448 656526 650924 642514 632919 623389 614045 604521 594964 586033 578322 572128 567415
60329 567415 563607 559799 555599 551413 547447 542878 536673 529031 521346 514810 509624 505552 502571 500759
60315 500759 500030 500400 502284 506244 512488 520786 530880 542965 557670 575413 595713 617310 639141
60302F39141K1870K1958K1190J8428J3513P305Q26n415j1345j6880k1572k4680
60290F64339k5679k4708k2400j9324j5806j2261r231p014n461m300l421k743k107
60277E09884j491j122j170j485j791j948j975k014k344l150m107m502m075l457
60263D75253l399l774l758k931j773j003q73j211j795k332k430j890r77j01P40
60248D47746J780K837L317L035K569K502K630K382J747J194Q24K72m89q86n68
60233D70892J8K46Q8p7q9QK95Q66J544K087K492K780K698K064J320J283K246L661
60215D94422M761N241N372N615O154O718O945O964P361Q326R146Q972P931P076
60201E91004P156P853Q278P979P267O722O519O299N707M794L790K678J457O17
$$ plain form
60302 639141 661011 682969 704159 722587 736100 743405 744231 738816 727471 710591 689019 664339
60290 664339 638660 613952 591552 572228 556422 544161 534930 527916 522455 518155 514734 511991 509884
60277 509884 508393 507271 506101 504616 502825 500877 498902 496888 494544 491394 487287 482785 478710 475253
60263 475253 471854 468080 464322 461391 459618 458615 457742 456531 454736 452404 449974 448084 447107 447006 447746
60248 447746 449526 452363 455680 458715 461284 463786 466416 468798 470545 471739 472563 472835 472346 471460 470892
60233 470892 470910 471156 471244 471167 471078 471086 471381 472247 473791 475878 478370 481150 483848 485912 487232 488515 490761 494422
60215 494422 499183 504424 509796 515411 521565 528283 535228 542192 549553 557879 567025 575997 583928 591004
60201 591004 598160 606013 614291 622270 629537 636259 642778 649077 654784 659578 663368 666046 667503 668120
60187F68120O53J075P43o34k124l161m381o167p390o889n560n361o529p291o583
60172F08521n410m994m939m265l181k619k575k182j295r01j718l147l999l802
60158E63494k998k177j527r49l40L37J063J644J722J138K18n00q27r48r74q30
60142E57546n75l39J34J290K845L762L644L496M454O235P603Q018P939P730P227
60127F21009O372N453M530L415K318J873K214K667K594K083J684J884K887M425
60113F65408N672N889N259M566M089L402K345J428J003P05K9r96k055k930l438
60098F90376l399k971k636k622k695k618k495k504k672k924l052k692j818j066
60084F54212r76j104o85j2j52j282k394k807k881k913k549j909k078l685n829
$$ plain form
60187 668120 668773 669848 670591 669957 667833 664672 660291 654124 646734 639845 634285 628924 622395 615104 608521
60172 608521 603111 598117 593178 588913 585732 583113 580538 578356 577061 576160 574442 571295 567296 563494
60158 563494 560496 558319 556792 555843 555503 555840 556903 558547 560269 561407 561625 561125 560298 559350 558376 557546
60142 557546 556971 556632 556766 558056 560901 564663 568307 571803 576257 582492 590095 598113 606052 613782 621009
60127 621009 627381 632834 637364 640779 643097 644970 647184 649851 652445 654528 656212 658096 660983 665408
60113 665408 671080 676969 682228 686794 690883 694285 696630 698058 699061 699766 699795 698799 696744 693814 690376
60098 690376 686977 684006 681370 678748 676053 673435 670940 668436 665764 662840 659788 657096 655278 654212
60084 654212 653236 652132 651447 651435 651283 650001 647607 644800 641919 639006 636457 634548 632470 628785 622956
60069F22956p282p965q375q342p513o474o213o675o882o298n315m484m064m181
60055E32893m679m846m054k681j745j625j674j209k65P54J737K854M095N013N113
60040E29681M547M236M880N990O431N966N431N294M954L849K405J230K16q32j461
60025E82817j420j476k426l828m745n269o108p131p641p864q663r802r877q330
60011D98237o308n058m589m402m472m829m969m485l678k931k041q08J95K48m44
59996D49666r64q44m40k36k89l66k24L35J395K784M086M871N007M865N045N667
59980D80358N985N111L156J182j01j100k431l774m245l677k893k628k756k756
59966D69431k518k306k177j876j290o58j89K19P37J271J568J596J595J778K140
$$ plain form
60069 622956 615674 607709 599334 590992 583479 577005 570792 564117 557235 550937 545622 541138 537074 532893
60055 532893 528214 523368 519314 516633 514888 513263 511589 510380 510115 510869 512606 515460 519555 524568 529681
60040 529681 534228 538464 543344 549334 555765 561731 567162 572456 577410 581259 583664 584894 585110 584278 582817
60025 582817 581397 579921 577495 573667 568922 563653 557545 550414 542773 534909 526246 516444 506567 498237
60011 498237 491929 486871 482282 477880 473408 468579 463610 459125 455447 452516 450475 449667 449862 450110 449666
59996 449666 448702 447858 447418 447182 446893 446527 446303 446638 448033 450817 454903 459774 464781 469646 474691 480358
59980 480358 486343 491454 494610 495792 495691 494591 492160 488386 484141 480464 477571 474943 472187 469431
59966 469431 466913 464607 462430 460554 459264 458606 458417 458636 459373 460644 462212 463808 465403 467181 469321
59951D69321K453K356J638O29J17M95J196J355R13N30N41O41O33P00P45J63j280
59934D83146k883l741l613k730j297L53J691K589L524M638N188M677L956M273
59920D99771N504O337O073N207M190K704N83j415k345k120j342m48N50J711K898
59905E27858L790M025L465K434J503R33N38J17k05j78K06P64J392K135K969L632
59889E55378L871L854M212N350O847P810P844P289O606O071O055O867Q020Q389
59875F44463P581O494N891N151L277O18j479k513l302m534n799o339o061n432
59861F38016m823m257l612k900k433k570l115l306k646j427n1J647L815N846P048
59846F25232P660Q288Q547P344M558J416r52k373k918k302n89J308K381K382J556
$$ plain form
59951 469321 471774 474130 475768 476397 476514 477009 478205 479560 480473 481003 481544 482185 482818 483518 484263 484426 483146
59934 483146 480263 476522 472909 470179 468882 469235 470926 473515 477039 481677 486865 491542 495498 499771
59920 499771 505275 511612 517685 522892 527082 529786 530369 528954 526609 524489 523147 522699 523249 524960 527858
59905 527858 531648 535673 539138 541572 543075 544008 544546 544663 544458 544280 544486 545250 546642 548777 551746 555378
59889 555378 559249 563103 567315 572665 579512 587322 595166 602455 609061 615132 621187 628054 636074 644463
59875 644463 652044 658538 664429 669580 672857 673475 671996 669483 666181 661647 655848 649509 643448 638016
59861 638016 633193 628936 625324 622424 619991 617421 614306 611000 608354 606927 606876 608523 612338 618184 625232
59846 625232 632892 641180 649727 657071 661629 663045 662093 659720 656802 654500 653911 655219 657600 659982 661538
59831F61538N3k006m204n976o892o760n760m545l707l159k470j765j723k594l835
59816F06195m860n523n802n627n251n162n347n193m367l239k319j850k030k893
59802E46732l766l679k644j787j741j769j017N9L35l69j135j138m66J71J04p22
59786E27168j555j532p37j24j57j86L96J059R07P1m59j74N02R83J086R22P69J046
59768E29985J871K685K735J994J194R35J113J338J546K028K953M056M861N184
59754E64478N322N568N863O136O783Q157R662J0156R435Q591Q490Q602P908O445
59740F71596N176M695M748M856M724M136L055J914J332J413J605J294L73p67j533
59725G08617j556j014n16n06q75j237j390j399j459j809k516l254l642l846m383
$$ plain form
59831 661538 661591 659585 655381 649405 642513 635753 629993 625448 621741 618582 616112 614347 612624 610030 606195
59816 606195 601335 595812 590010 584383 579132 573970 568623 563430 559063 555824 553505 551655 549625 546732
59802 546732 542966 539287 536643 534856 533115 531346 530329 530388 530723 530354 529219 528081 527615 527786 527890 527168
59786 527168 525613 524081 523344 523220 523063 522877 523273 524332 525239 525310 524851 524677 525179 526162 527248 528170 528939 529985
59768 529985 531856 534541 537276 539270 540464 541399 542512 543850 545396 547424 550377 554433 559294 564478
59754 564478 569800 575368 581231 587367 594150 602307 611969 622125 631560 640151 648641 657243 665151 671596
59740 671596 676772 681467 686215 691071 695795 699931 702986 704900 706232 707645 709250 710544 710917 710150 708617
59725 708617 707061 706047 705531 705025 704150 702913 701523 700124 698665 696856 694340 691086 687444 683598 679215
59710F79215n127n180m069k525j499r69l53L50O44N25N41R93J686K550L739N074
59694F75595O028O449O732P080P086O294M763K844P84j117k341k578k209k014
59680G13396k343k814k890k640k715l672n349p045q159q536q279p556o617n746
59666F39035n097m719m672m835m631l454j536Q7P58R19J320J966K397K657L305
59651F23500M511N754O489O670O448N792M604K952J050r14k812m590o260p814
59637F45380r067r656r272p946o214m881m400m424m167l285k236j689j868k527
59623E73748l258l748l954m155m609n107n250n157n410o099o477n930m738l541
59609E06315k495j456n12J91Q36J547J971J794J428J459J659J340N98L77J139
$$ plain form
59710 679215 674088 668908 664839 662314 660815 659846 659493 659843 660487 661012 661553 662546 664232 666782 670521 675595
59694 675595 681623 688072 694804 701884 708970 715264 720027 722871 723655 722538 720197 717619 715410 713396
59680 713396 711053 708239 705349 702709 699994 696322 690973 683928 675769 667233 658954 651398 644781 639035
59666 639035 633938 629219 624547 619712 615081 611627 610091 610178 610936 611855 613175 615141 617538 620195 623500
59651 623500 628011 633765 640254 646924 653372 659164 663768 666720 667770 666856 664044 659454 653194 645380
59637 645380 636313 626657 617385 609439 603225 598344 593944 589520 585353 582068 579832 578143 576275 573748
59623 573748 570490 566742 562788 558633 554024 548917 543667 538510 533100 527001 520524 514594 509856 506315
59609 506315 503820 502364 501852 502043 502879 504426 506397 508191 509619 511078 512737 514077 514675 515052 516191
59594E16191K176K522K050J397J162J459J893J840J017j29q11q47q35j297k026
59579E25762k431k293j902j662j759k114k482k637k481k027j376q07p10j118j489
59564D98474j251n80k25m91q25n88P5M33L0q83j620j619q37J86P99Q99J005J490
59546D94472J985J924J538J786L116M858O204P367R191J1929J5146J8622K2234
59533F00372K4581K2921J5717M943n047j1050j2809j1797r408o590m110k274p47
59520F04702Q44K310L189L324K865J977P68o80k344m112n571o336o692p357q415
59505E78472r080q759p829o982o302n484m564l865l475l167k778k276j676j128
59491E11107q77q85p32r9Q41J703K229K328K159K276L155M387M976M717M553N197
$$ plain form
59594 516191 518367 520889 522939 524336 525498 526957 528850 530690 531707 531578 530767 529920 529085 527788 525762
59579 525762 523331 521038 519136 517474 515715 513601 511119 508482 506001 503974 502598 501791 501081 499963 498474
59564 498474 497223 496643 496418 495927 495102 494514 494589 495022 495052 494169 492549 490930 490093 490279 491078 491977 492982 494472
59546 494472 496457 498381 499919 501705 504821 509679 515883 523250 532441 544370 559516 578138 600372
59533 600372 624953 647874 663591 668534 663487 652437 639628 627831 618423 611833 607723 605449 604702
59520 604702 605546 607856 611045 614369 617234 619211 619979 619299 616955 612843 607272 600936 594244 586887 578472
59505 578472 569392 560633 552804 545822 539520 534036 529472 525607 522132 518965 516187 513911 512235 511107
59491 511107 510230 509345 508613 508514 509355 511058 513287 515615 517774 520050 523205 527592 532568 537285 541838 547035
59475E47035O166O724P065P716Q315P900O180L769J358o71j973k313j945j422
59461E93904j009n66J06J103K323L341L784L996M810O350P767Q490R007R774J0332
59446F63512J0146R492Q571O702L582M84j306k582n111q724j1228j1278r781q163
59432F44316o818n694n073n071n268n282n001m080k196P3J724K885M750P616J0319
59417F27200J2169J4046J6816J9842K2169K4312K7614L2221L6378L7326L2508
59406I02601K1029N104j0380k0893k4960k3814j9288j2714m997L369J1832J8326
59394H45215J9071J1502k447j7094k7315l1506l0852k7351k2878j8804j5385j1992
59382F70164q432n491l682k282l05K001L522L926L984M283M452M033L447L498
$$ plain form
59475 547035 553201 559925 566990 574706 583021 590921 597101 600870 602228 601557 599584 597271 595326 593904
59461 593904 592895 592329 592435 593538 595861 599202 602986 606982 611792 618142 625909 634399 643406 653180 663512
59446 663512 673658 683150 691721 698423 702005 702489 701183 698601 693490 684766 673538 662260 652479 644316
59432 644316 637498 631804 626731 621660 616392 611110 606109 602029 599833 599906 601630 604515 609265 616881 627200
59417 627200 639369 653415 670231 690073 712242 736554 764168 796389 832767 870093 902601
59406 902601 923630 928734 918354 897461 872501 848687 829399 816685 811688 815057 826889 845215
59394 845215 864286 875788 873341 856247 828932 797426 766574 739223 716345 697541 682156 670164
59382 670164 661732 656241 652559 650277 649972 651973 655495 659421 663405 667688 672140 676173 679620 683118
59368F83118M229M843M630L576K139Q29J02J67P88J502K161K961L873M462M509
59353G23889M456M966O259Q090R988J1339J1729J1612J2108J3642J5221J5680
59341H48979J5196J4796J4736J4337J3268J1887J0228P730M360J032j586l887
59329I51076o370q608r920j0543j1378j2770j4180j4948j4822j3835j2237j0620
59317H10845r626r342r214q728q048p826q405r330r732r205q111o991n933m712
59303F95642l204j298J319M787Q553J1677J3464J3249R958K991o148j4198j8771
59290G18021k0193k0174j9398j7263j3634r642o563m620l279k229j540j121n49
59277E97816M67J810L289M969O888Q654R794J0409J1111J2167J3205J3923J4508
$$ plain form
59368 683118 687347 692190 696820 700396 702535 703364 703466 703633 704421 705923 708084 711045 714918 719380 723889
59353 723889 728345 733311 739570 747660 757648 768987 780716 792328 804436 818078 833299 848979
59341 848979 864175 878971 893707 908044 921312 933199 943427 951157 955517 956549 954963 951076
59329 951076 944706 936098 926178 915635 904257 891487 877307 862359 847537 833702 821465 810845
59317 810845 801219 791877 782663 773935 765887 758061 749656 740326 730594 721389 713278 706287 700354 695642
59303 695642 692438 691140 692459 697246 705799 717476 730940 744189 754147 757138 750990 736792 718021
59290 718021 697828 677654 658256 640993 627359 617717 611154 606534 603255 601026 599486 598365 597816
59277 597816 598283 600093 603382 608351 615239 623893 633687 644096 655207 667374 680579 694502 709010
59264G09010J4975J4697J3174J0884Q676O590L992P80k387m987p134r013j0491
59251G48766j1383j1611j0989r370p176n225l921l012k208j485o89M85J906K926
59237F87014L224L263L631M349N074N569N702N321M469L449K455J306k44k106
59223G32476l830m877m975m515m426n263o503p147o936o411n929n371m864m962
59209F56467n778o521o360n386m311l615l269l062k866k650k422k145j763j350
59195F04969j047p36q8Q10J360J394J636K584L542L664L481M215N781O757O396
59180F44718N507N044N008N074N303N658N719N323M881M677M501M216L981L744
59166G13354L289K956L398M401M913M483L677K807J390o64k448l396m219n795
$$ plain form
59264 709010 723985 738682 751856 762740 771416 778006 781998 782778 780391 775404 768270 759257 748766
59251 748766 737383 725772 714783 705413 698237 693012 689091 686079 683871 682386 681697 682182 684088 687014
59237 687014 690238 693501 697132 701481 706555 712124 717826 723147 727616 731065 733520 734826 734582 732476
59223 732476 728646 723769 718794 714279 709853 704590 698087 690940 684004 677593 671664 666293 661429 656467
59209 656467 650689 644168 637808 632422 628111 624496 621227 618165 615299 612649 610227 608082 606319 604969
59195 604969 603922 603186 603098 603908 605268 606662 608298 610882 614424 618088 621569 625784 631565 638322 644718
59180 644718 650225 655269 660277 665351 670654 676312 682031 687354 692235 696912 701413 705629 709610 713354
59166 713354 716643 719599 722997 727398 732311 736794 740471 743278 744668 744004 741556 738160 733941 728146
59152G28146p959j0026j1716j2850j2997j2160j1102j0333r514q447p821q164
59140F05057q845q895q195p223o291n646n531n555m843l473k706l061l252k116
59126E29425m44L50M71J172K634L924M683N399O234O909P621Q920J0584J1698
59112E99580J1828J1310J0472R407Q355P512O711N896N563N886N997N037L456
59099F97010K217J209k78j885k456j939j642k411l688m497m359l130j021J002
59085F74132J794J284M12k62r86j926k798l645m908o477p493p494o987o599o364
59070F21683o145o005n826n253m319l585l331l191k896k786l201l834m070l675
59056E63566k874k044j531j477j670j800j852k020k231k132j592q75k15M18J059
$$ plain form
59152 728146 720187 710161 698445 685595 672598 660438 649336 639003 629489 621042 613221 605057
59140 605057 596212 587317 579122 571899 565608 559962 554431 548876 544033 540560 537854 534793 531541 529425
59126 529425 528981 529331 529802 530974 533608 537532 542215 547614 553848 560757 568378 577298 587882 599580
59112 599580 611408 622718 633190 642597 650952 658464 665175 671071 676634 682520 688517 693554 697010
59099 697010 699227 700436 700158 698273 695817 693878 692236 689825 686137 681640 677281 674151 673130 674132
59085 674132 675926 677210 677622 677360 676374 674448 671650 668005 663097 656620 649127 641633 634646 628047 621683
59070 621683 615538 609533 603707 598454 594135 590550 587219 584028 581132 578346 575145 571311 567241 563566
59056 563566 560692 558648 557117 555640 553970 552170 550318 548298 546067 543935 542343 541468 541253 541671 542730
59041E42730J531J585J193O38L01K45P0n49j216j196n01J00L12P31J713K674L169
59024E53530L846N459P645R542J1073J2619J3910J4326J3976J3452J2695J1073
59012F83146Q449N293J954j301l798m962n238n512n773n279l947k515j277K42
58998F59482K197L903M772N019N134N249N178M662L564K190J277J132J095M12
58984G05266o83j448j794k054k036j287j51N70R48J850L523N278O679Q087R830
58969G32578J1655J3207J4359J4918J4747J4177J3714J3352J2752J1894J0929
58958H78282R668P957O197M655K693l62l997p210r970j2741j5059j6105j6372
58945H27636j7032j7832j7340j5469j3776j2989j2038j0242q616p990p435n795
$$ plain form
59041 542730 544261 545846 547039 547677 547978 548223 548293 547744 546528 545332 544831 544931 545243 545974 547687 550361 553530
59024 553530 557376 562835 570480 580022 591095 603714 617624 631950 645926 659378 672073 683146
59012 683146 691595 696888 698842 697541 693743 688781 683543 678031 672258 666979 663032 660517 659240 659482
58998 659482 661679 665582 670354 675373 680507 685756 690934 695596 699160 701350 702627 703759 704854 705266
58984 705266 704583 703135 701341 699287 697251 695964 695813 696383 697331 699181 702704 707982 714661 722748 732578
58969 732578 744233 757440 771799 786717 801464 815641 829355 842707 855459 867353 878282
58958 878282 887950 895907 902104 906759 909452 909090 905093 897883 887913 875172 860113 844008 827636
58945 827636 810604 792772 775432 759963 746187 733198 721160 710918 702302 694312 686877 681082
58933F81082l606k214j777j351l67R07J985K477K164J289M55q6n59j021j262j481
58917F76635k114k745k298p80K86j95j371j632n69J042K493L646M580N443O473
58902F88894P767R251J0982J2965J4667J5390J5214J4831J4409J3498J2191J1371
58890H41430J1495J2144J3078J4682J6876J8630J9161J8830J8272J7462J6185
58879A018245J4602J2764J0299P176M027J265j422m204o617q418j0096j1859j2927
58866A012835j2561j1171r687q407p108n816m855m561n253o980r063j0534j1363
58853I05476j2448j4081j5299j5237j4275j3213j2199j1053j0007r314q766q185
58841G61399p954q494r645j0895j1766j1806j0868r599q946q913q603p600o374
$$ plain form
58933 681082 677476 675262 673485 672134 671767 672674 674659 677136 679300 680589 681044 680958 680399 679378 678116 676635
58917 676635 674521 671776 669478 668698 668984 668789 667418 665786 665217 666259 668752 672398 676978 682421 688894
58902 688894 696661 705912 716894 729859 744526 759916 775130 789961 804370 817868 830059 841430
58890 841430 852925 865069 878147 892829 909705 928335 947496 966326 984598 1002060 1018245
58879 1018245 1032847 1045611 1055910 1063086 1067113 1068378 1066956 1062752 1056135 1047717 1037621 1025762 1012835
58866 1012835 1000274 989103 979416 971009 963901 958085 953230 948669 943416 936436 927373 916839 905476
58853 905476 893028 878947 863648 848411 834136 820923 808724 797671 787664 778350 769584 761399
58841 761399 753445 744951 735306 724411 712645 700839 689971 680372 671426 662513 653910 646310 639936
58828F39936n192l766k333j777k078j871l08J751L121L807M365M793M965N233
58814F50646N729N888N437M994M873M316K858J464J214J606J342J14j402k758
58800F86321l905m621m790m880n360o026o584p280q247q785q231p016o056n523
58786E99017m902l863k399n55J411K979L997M856N740O326O549O768O840O024
58772F38788M300K663J562J49k147m510o047p037q000q578q471q304q480q199
58758E77689o797n113m191l609k440r72j40J01M32Q34R45J073J581J862J265N25
58742E63045Q99K336L709M481M914N167N328N772O467O463N354M424M987O325
58728F29671O750O123N649N706N599N172M984M938M396L674L935N469P383R046
$$ plain form
58828 639936 634744 630978 628645 626868 624790 622919 622611 624362 627483 631290 635655 640448 645413 650646
58814 650646 656375 662263 667700 672694 677567 681883 684741 686205 687419 689025 690367 690481 689079 686321
58800 686321 682416 677795 673005 668125 662765 656739 650155 642875 634628 625843 617612 610596 604540 599017
58786 599017 594115 590252 587853 587298 588709 591688 595685 600541 606281 612607 619156 625924 632764 638788
58772 638788 643088 645751 647313 647462 645315 640805 634758 627721 619721 611143 602672 594368 585888 577689
58758 577689 570892 565779 561588 557979 555539 554567 554427 554528 554960 555794 556739 557812 559393 561255 562520 563045
58742 563045 563944 566280 569989 574470 579384 584551 589879 595651 602118 608581 613935 618359 623346 629671
58728 629671 636421 642544 648193 653899 659498 664670 669654 674592 678988 682662 686597 692066 699449 708495
58714G08495J0548J1699J1888J1186J0444J0108R779Q992P521N079J649j988m983
58701H00417p528j0354j3422j6116j8355k0408k1853k2008k1175k0324j9636j8472
58689E90766j6646j4601j2493j0224q290p366p166o794o137n759n616n072m177
58676D80425l666l585l098j840m00O45J266J507J438J639K738M474O078P543R447
58661E04611J1473J2267J1073Q596N959L503R79j618l761m787m596m000m033m704
58647E30962n058m684m301m412m450m015l823m419m892m179k782j863j412o40
58633D80032M73J380K120K913L212K556J784J899K334J823N34l09m45o33r82q83
58617D97808l43J02O16J724L000L548L548L888M563M905M959N161N010L750K054
$$ plain form
58714 708495 719043 730742 742630 753816 764260 774368 784147 793139 800660 805739 807388 805400 800417
58701 800417 792889 782535 769113 752997 734642 714234 692381 670373 649198 628874 609238 590766
58689 590766 574120 559519 547026 536802 528512 521146 513980 507186 501049 495290 489674 484602 480425
58676 480425 476759 473174 470076 468236 467836 468481 469747 471254 472692 474331 477069 481543 487621 495164 504611
58661 504611 516084 528351 539424 548020 553979 557482 558461 556843 553082 548295 543699 539699 535666 530962
58647 530962 525904 521220 516919 512507 508057 504042 500219 495800 490908 486729 483947 482084 480672 480032
58633 480032 480505 481885 484005 486918 490130 492686 494470 496369 498703 500526 501060 500751 500306 499673 498691 497808
58617 497808 497465 497567 498183 499907 502907 506455 510003 513891 518454 523359 528318 533479 538489 542239 544293
58602E44293J311J506J431P58K25k8n23j091j134j045j689k673k841k206j521
58587E34773l77K223N541P590Q017Q374R375J0086J0115J0432J1447J2119J1651
58574F41366J0445R034P584O701P063Q085Q609R015J0802J3983J6925J8925K0958
58561G89495K3531K5882K7698K9499L0908L0516K8109K4967K1403J6181R104K136
58549A059429l007o604r416j1266j1980j2045j1539r946p835p009q239j0484j2944
58536I37115j6111k0011k3270k4863k5278k5086k4009k2079k0041j7887j4704
58525G03776j0746p775o556n819m615l763l893l992l208k440k774l725m343m714
58511F35413n124m992l866k400j367o90k05k62q28j148r25o50m14K64J051Q67
$$ plain form
58602 544293 545604 547110 548541 549299 549524 549496 548973 547882 546748 545703 544014 541341 538500 536294 534773
58587 534773 534396 536619 542160 549750 557767 566141 575516 585602 595717 606149 617596 629715 641366
58574 641366 651811 660845 668429 675130 682193 690278 698887 707902 718704 732687 749612 768537 789495
58561 789495 813026 838908 866606 896105 927013 957529 985638 1010605 1032008 1048189 1057293 1059429
58549 1059429 1056422 1049818 1040402 1029136 1017156 1005111 993572 983626 975791 968782 960543 950059 937115
58536 937115 921004 900993 877723 852860 827582 802496 778487 756408 736367 718480 703776
58525 703776 693030 685255 678699 672880 668265 664502 660609 656617 653409 650969 648195 644470 640127 635413
58511 635413 630289 625297 621431 619031 617664 616974 616769 616507 615679 614531 613606 612956 612542 612806 613857 614724
58495F14724j91o78j30K67j24l45K24Q86J395K694M916O515O576O233O754P895
58479F57611R226J1279J4187J6790J8308J9373K0369K0340J8557J5568J1747O541
58467H39896K33n328q883j1091j2706j3164j2061j0232q238n485j923J137L021
58454G55176M718O952R060J0757J2886J5248J5862J3726J0236O612K150l414q173
58441H51796j0583j1771j3298j4510j4009j2180j0298q601o911n641m634k629
58429G36731N51L045L727M065N484O971P276P482R031J0849J0894R233P307N295
58415H27941K462q36l619n903q144r830j0320j0159j0152j0023r306q511q091
58402G35509p444o127m819l980k938j341o3M34J002K018K550K366K734M027M616
$$ plain form
58495 614724 614533 613855 613725 613992 613868 613523 613747 614633 616028 618722 623638 630153 636729 642962 649716 657611
58479 657611 666837 678116 692303 709093 727401 746774 767143 787483 806040 821608 833355 839896
58467 839896 840129 834801 825918 814827 802121 788957 776896 766664 758426 752941 751018 752155 755176
58454 755176 759894 766846 775906 786663 799549 814797 830659 844385 854621 861233 863383 859969 851796
58441 851796 841213 829442 816144 801634 787625 775445 765147 756546 749635 743994 739360 736731
58429 736731 737282 740327 744054 748119 753603 760574 767850 775332 784363 795212 806106 815339 822646 827941
58415 827941 830403 829567 825948 820045 811901 802071 791751 781592 771440 761417 752111 743600 735509
58402 735509 728065 721938 717119 713139 710201 708860 708797 709231 710233 712251 714801 717167 719901 723928 728544
58387G28544L577K375K340K622K172J712K067K620K989M119O149P427P185O972
58373G82870P845Q543Q042P375P276O739N642N893Q004R556R245R269J1352J3544
58359I01195J3790J3505J4579J5727J5072J3642J2990J1865Q631M705K350J206
58347A029257L9m51M67J265Q91J183L460N440M919L801M830P020Q122Q977J1415
58332A090635J4248J5392J5782J7239J8722J8579J8126J8914J8928J5770J1314
58321A273649Q780P431M785J883J500K982L606L533M720O488O748O229P085Q764
58307A348183R448R958J2009J4315J4734J4399J5475J6879J6599J6082J7637J9766
58295A525484J9792J8894J9623K0803K0053J9048K0755K3689K4402K3632K4398
$$ plain form
58387 728544 732121 734496 736836 739458 741630 743342 745409 748029 751018 755137 761286 768713 775898 782870
58373 782870 790715 799258 807300 814675 821951 828690 834332 840225 848229 857785 867030 876299 887651 901195
58359 901195 914985 928490 943069 958796 973868 987510 1000500 1012365 1020996 1025701 1028051 1029257
58347 1029257 1029296 1028845 1029312 1030577 1031468 1032651 1036111 1041551 1046470 1050271 1055101 1062121 1070243 1079220 1090635
58332 1090635 1104883 1120275 1136057 1153296 1172018 1190597 1208723 1227637 1246565 1262335 1273649
58321 1273649 1282429 1289860 1294645 1296528 1298028 1301010 1304616 1308149 1312869 1319357 1326105 1332334 1339419 1348183
58307 1348183 1357631 1367589 1379598 1393913 1408647 1423046 1438521 1455400 1471999 1488081 1505718 1525484
58295 1525484 1545276 1564170 1583793 1604596 1624649 1643697 1664452 1688141 1712543 1736175 1760573
58284A760573K6108K6250K5878K7598L0092L0413K9764L1081L3139L3125L2760
58273B086781L5461L9553M0936M0422M1852M4894M6457M7190M9759N2786N3413
58262B579504N3630N7032O1759O3967O5509P0211P5405P5709P2860P2841P5538
58251C323965P6328P5836P8563Q3642Q6580Q8607R4500J02821J08165J11575J18491
58240D349073J27921J34160J37808J44333J53283J59907J65890J76936J91308
58231E740619K02580K12303K27502K47196K64273K79252K98755L21885L42163
58222H136528L61571L88047M20465M51351M82874N24024N73537O22817O74289
58213A2635503P38618Q15265Q95220R81672J087240J212276J348492J503122J695241
$$ plain form
58284 1760573 1786681 1812931 1838809 1866407 1896499 1926912 1956676 1987757 2020896 2054021 2086781
58273 2086781 2122242 2161795 2202731 2243153 2285005 2329899 2376356 2423546 2473305 2526091 2579504
58262 2579504 2633134 2690166 2751925 2815892 2881401 2951612 3027017 3102726 3175586 3248427 3323965
58251 3323965 3400293 3476129 3554692 3638334 3724914 3813521 3908021 4010842 4119007 4230582 4349073
58240 4349073 4476994 4611154 4748962 4893295 5046578 5206485 5372375 5549311 5740619
58231 5740619 5943199 6155502 6383004 6630200 6894473 7173725 7472480 7794365 8136528
58222 8136528 8498099 8886146 9306611 9757962 10240836 10764860 11338397 11961214 12635503
58213 12635503 13374121 14189386 15084606 16066278 17153518 18365794 19714286 21217408 22912649
58204B2912649J928881K196104K507064K889794L361836L934806M648883N569165
58196D9949182O747054Q224521J0079637J2422013J5330799J8836489K2966266
58189A44555961K7743037L3080512L8617301M3495988M6147997M4457250L6705792
58182D14803838K2938185N542464j1753794k5764716l5049677l9741404m0697133
58175B90277763l8927031l5447234l1182550k6804226k2688362j9023819j5895665
58168A00308876j3290337j1127588r336093p875147o693636n721399m909469m239504
58160C7115703l688257l218257k808473k461224k172259j921678j698875j509937
58152A7636743j354799j220081j098757r95367r07945q25040p44180o74313o16665
$$ plain form
58204 22912649 24841530 27037634 29544698 32434492 35796328 39731134 44380017 49949182
58196 49949182 56696236 64920757 75000394 87422407 102753206 121589695 144555961
58189 144555961 172298998 205379510 243996811 287492799 333640796 378098046 414803838
58182 414803838 437742023 443284487 431530693 405765977 370716300 330974896 290277763
58175 290277763 251350732 215903498 184720948 157916722 135228360 116204541 100308876
58168 100308876 87018539 75890951 66554858 58679711 51986075 46264676 41355207 37115703
58160 37115703 33427446 30209189 27400716 24939492 22767233 20845555 19146680 17636743
58152 17636743 16281944 15061863 13963106 12967739 12059794 11234754 10490574 9816261 9199596
58143I199596n61088n04293m54307m13928l76359l40361l13644k97568k83262
58134E654786k66330k51642k40552k26954k09359j94095j83304j71651j57663
58125C753236j46644j39758j31491j20475j11905j06911j00316r1231q5123q3053
58115B636329p9436p2881o8823o8794o7325o2385n8879n8680n6986n1944m8525
58104A941671m9100m9016m5459m2412m2852m3655m2114m0428m0131l8730l5246
58093A472528l2771l2504l1319k7939k5406k5035k4004k1254j9726k0441k0424
58082A191705j8699j8274k0032k0647j8859j7803j8883j9224j7522j6613j7867
58071I87282j8668j7684j7162j7868j7245j4731j3349j3946j3408j0713r047r699
$$ plain form
58143 9199596 8638508 8134215 7679908 7265980 6889621 6549260 6235616 5938048 5654786
58134 5654786 5388456 5136814 4896262 4669308 4459949 4265854 4082550 3910899 3753236
58125 3753236 3606592 3466834 3335343 3214868 3102963 2996052 2895736 2804505 2719382 2636329
58115 2636329 2556893 2484012 2415189 2346395 2279070 2216685 2157806 2099126 2042140 1990196 1941671
58104 1941671 1892571 1843555 1798096 1755684 1712832 1669177 1627063 1586635 1546504 1507774 1472528
58093 1472528 1439757 1407253 1375934 1347995 1322589 1297554 1273550 1252296 1232570 1212129 1191705
58082 1191705 1173006 1154732 1134700 1114053 1095194 1077391 1058508 1039284 1021762 1005149 987282
58071 987282 968614 950930 933768 915900 898655 883924 870575 856629 843221 832508 823461 813762
58059H13762r589p322o032p562r273r340r892j2027j2981j1272r700j0162j0299
58046F88311q318o480o693p001n599m216m537n129m725m694n701n793m294l721
58032F11410n399p023o956o962q386r608r607j0007j1278j1111q936p775q994
58019D99368r592p554n480n798o576n493m054m208m490l157j829k396l315k518
58005D32908j220j432k305k170j753k247k600j678p58j124j538p51o8p90j594
57990D10880j024j71k87k62R27J788R27l30n13p34k234l649l417k591k637k750
57974C93923j904j259j907k532j836j015j312j494l65O43O6p39j11Q83O78J92
57958C81911P10J047j84j620j511r53j746k990k909k250k724l647l264j965j234
$$ plain form
58059 813762 804173 796851 790819 783257 773984 764644 754752 742725 729744 718472 708772 698610 688311
58046 688311 679993 673513 666820 659819 654220 650004 645467 640338 635613 630919 625218 619425 615131 611410
58032 611410 606011 598988 592032 585070 576684 567076 557469 547462 536184 525073 516137 508362 499368
58019 499368 489776 482222 476742 470944 464368 458875 454821 450613 446123 442966 441137 438741 435426 432908
58005 432908 431688 430256 427951 425781 424028 421781 419181 417503 416745 415621 414083 413332 413264 412474 410880
57990 410880 409856 409685 409398 409136 410063 411851 412778 412448 411935 411201 408967 405318 401901 399310 396673 393923
57974 393923 392019 390760 388853 386321 384485 383470 382158 380664 380299 380942 381008 380269 380158 381041 381719 381911
57958 381911 382621 383668 383484 381864 380353 379400 377654 374664 371755 369505 366781 363134 359870 357905 356671
57943C56671p66M42J560J329P24J455L079M122M811O069P257P450P541Q426Q602
57928D18772O398L106J077M1j687l704m351m076m766o420p374p298p281p424o966
57913C68047o338o609p244o689m776k625p00J097K157J969J414J432J326K42p79
57898C41924k95J077J748J627J497J143K53j9J325L096L721L780M484M976L843
57883C74180K047J518J846J269L7j71M42P8j489k789l413m236n112m978m144m016
57867C51069m581m565l858l532l549k845j550q98r72o38L59J303K323M124O064
57852C38254O688O101N800O133N988M958L879L198K545J954J790J636Q61k4j93
57837C89568k24j193k588l040k681k765l340l315k543j930j744j582j599k010
$$ plain form
57943 356671 355905 356347 357907 359236 359960 361415 364494 368616 373427 379496 386753 394203 401744 410170 418772
57928 418772 425170 428276 429353 429394 427707 424003 419652 415576 410810 404390 397016 389718 382437 375013 368047
57913 368047 361709 355100 347856 341167 336391 333766 333066 334163 336320 338289 339703 341135 342461 342703 341924
57898 341924 341629 342706 344454 346081 347578 348721 348974 348955 350280 353376 357097 360877 365361 370337 374180
57883 374180 376227 377745 379591 380860 380897 380726 381168 381246 379757 376968 373555 369319 364207 359229 355085 351069
57867 351069 346488 341923 338065 334533 330984 328139 326589 325691 324719 324081 324440 325743 328066 332190 338254
57852 338254 344942 351043 356843 362976 368964 373922 377801 380999 383544 385498 387288 388924 389785 389761 389568
57837 389568 389344 388151 385563 382523 379842 377077 373737 370422 367879 365949 364205 362623 361024 359014
57823C59014j965q31J78l07j354j213l73n28j297r52Q3m20k696m564n073n590
57807C32112o865p813p920q114q536p933o133m778m679m581l492k219j637j302
57793B56110o66j8M59J064J475R15j65l24N90J211J074J264K220K996L313M302
57777B75820O312P943Q171P654P089O105M702L984M283M145K427R5j225j293r04
57762C35308n98o42j273k125k348j839j477j697j912j713j462j328r69m77l59
57747C15089l04N79J941K240J103j7r8J52M3K13J122J752J100k03r14r30r50j154
57729C20764j238j127q29j90O64J149R43L30l70r79j004j0J397K069J970K240
57713C25779L298M160M023L324K684J954Q67l29j446k682l987m877n186n156m684
$$ plain form
57823 359014 357049 356218 356396 356089 354735 353522 353149 352621 351324 350372 350455 350035 347339 342775 337702 332112
57807 332112 325247 317434 309514 301400 292864 284931 278798 274020 269341 264760 261268 259049 257412 256110
57793 256110 255444 255426 255885 256949 258424 259339 259174 258850 259440 260651 261725 262989 265209 268205 271518 275820
57777 275820 282132 290075 298246 305900 312989 319094 323796 327780 332063 336208 338635 338730 337505 336212 335308
57762 335308 334710 334068 332795 330670 328322 326483 325006 323309 321397 319684 318222 316894 315925 315448 315089
57747 315089 314785 315364 317305 319545 320648 320631 320533 320685 320728 320941 322063 323815 324915 324712 323798 322868 321918 320764
57729 320764 319526 318399 317570 317380 318044 319193 320136 320466 320096 319117 318113 318103 319500 321569 323539 325779
57713 325779 329077 333237 337260 340584 343268 345222 346089 345760 344314 341632 337645 332768 327582 322426 317742
57698C17742l492k058j238q69j19P73N25j105k821l726m291m868m851l978l078
57683B82546k713k297j283p0R39K059L486M882O369Q777J2373J6522K1177K7347
57669C80114L5457M4478N3390O2033O9398P2193O6440N0327K5389l982l1742n2415
57657G71080o3599o6341o3162n6447m8405m0794l3991k7474k1551j7225j4273
57646C17818j1237p933n997o076o370n176l254k159j739q78L80J105J104Q54M58
57631B70900j17l83J4M67K56l88q68j224j711k073k048j928j923j686j161j047
57615B55080j708k467k680k607k566k206j457j055j277j211l14L89j53j300j776
57600B32692j548j381j317r18m28l61m60k36q9o84j650k064j932k023k475k609
$$ plain form
57698 317742 314250 312192 310954 310085 309966 310739 311264 310159 307338 303612 299321 294453 289602 285624 282546
57683 282546 279833 277536 276253 276183 277122 279181 282667 287549 293918 302695 315068 331590 352767 380114
57669 380114 415571 460049 513439 575472 644870 717063 783503 833830 859219 855237 823495 771080
57657 771080 707481 641140 577978 521531 473126 432332 398341 370867 349316 332091 317818
57646 317818 306581 298648 292651 286575 280205 275029 271775 269616 267877 266999 267379 268484 269588 270442 270900
57631 270900 270783 270400 270414 270881 271137 270749 269881 268657 266946 264873 262825 260897 258974 257288 256127 255080
57615 255080 253372 250905 248225 245618 243052 240846 239389 238334 237057 235846 235532 235921 235768 234468 232692
57600 232692 231144 229763 228446 227528 227100 226739 226279 226043 225954 225270 223620 221556 219624 217601 215126 212517
57584B12517k065j176l13M28R01R13N49M0n28j129j696k251k763k814k054j042
57568A97517p17r62q32l63p60k195k992j908M5J133J154R37O66R7l84k29K22L94
57550A90823O57J751L359M342M084K820J042o53j556j502j155j055r05l12M16
57535B02156Q73J220J600J641J208Q56Q90Q04L78K99R53J592J643J736K453L153
57519B23455L082K703K657K515J820J339J799K349J880J059J337K503L006K306
57505B53810J302N64j79r08j104q08o81r19j164j369j809k349k553k392k020j198
57489B36223J55J347J700J513J316Q23l05j332j302n42N5O05J716K811K605J093
57473B48481m44j287j797k152k001j436j081j005o21K34J114J756K162K045J244
$$ plain form
57584 212517 210452 209276 208963 209391 210292 211205 211754 211794 211266 210137 208441 206190 203427 200613 198559 197517
57568 197517 196800 195838 195006 194643 193883 191688 188696 186788 186833 187966 189120 190057 190723 190820 190436 190207 190429 190823
57550 190823 191480 193231 196590 200932 205016 207836 208878 208225 206669 205167 204012 202957 202052 201740 202156
57535 202156 203029 204249 205849 207490 208698 209554 210444 211248 211626 211925 212878 214470 216113 217849 220302 223455
57519 223455 226537 229240 231897 234412 236232 237571 239370 241719 243599 244658 245995 248498 251504 253810
57505 253810 255112 255676 255497 254589 253485 252677 251996 251077 249913 248544 246735 244386 241833 239441 237421 236223
57489 236223 236378 237725 239425 240938 242254 243077 242772 241440 240138 239596 239651 240256 241972 244783 247388 248481
57473 248481 248037 246750 244953 242801 240800 239364 238283 237278 236657 236891 238005 239761 241923 243968 245212
57458B45212M21L20N95M80K58P82J824K337K208K293K724K677K020J705K196K744
57442B70796K646K148J696J307J009J031J246J217R38Q41J057J463K240L479M371
57427B97485L934K559J672J832K284K416K489K717K813K738K892L286L415L186
57413C35718L091L278L355L245L310L487L239K515J856J437R67O15R49J756K030
57398C70848J487J054J441K165K446K246K034K154K829M113N493O152N905N380
57384D15747N146N218N464N806N949N517M664L998L876M170M574M669L993K691
57370D81482J729J756K156K095J905K422L400L902L895M090M441M228L593L505
57356E24599M190M937N506O253O849O435N293M796N328N764N447N158N516N920
$$ plain form
57458 245212 245633 245953 246548 247028 247286 248068 249892 252229 254437 256730 259454 262131 264151 265856 268052 270796
57442 270796 273442 275590 277286 278593 279602 280633 281879 283096 284034 284875 285932 287395 289635 293114 297485
57427 297485 301419 303978 305650 307482 309766 312182 314671 317388 320201 322939 325831 329117 332532 335718
57413 335718 338809 342087 345442 348687 351997 355484 358723 361238 363094 364531 365498 366113 367062 368818 370848
57398 370848 372335 373389 374830 376995 379441 381687 383721 385875 388704 392817 398310 404462 410367 415747
57384 415747 420893 426111 431575 437381 443330 448847 453511 457509 461385 465555 470129 474798 478791 481482
57370 481482 483211 484967 487123 489218 491123 493545 496945 500847 504742 508832 513273 517501 521094 524599
57356 524599 528789 533726 539232 545485 552334 558769 564062 568858 574186 579950 585397 590555 596071 601991
57342F01991N821N694N962O144N915N841O254O532O288O234O933P620P356O512
57328F91097O188O647P280P640P724P596P353P215P204P097O930P048P463P782
57314G92264P932Q248Q617Q416P614P148P717Q960J0080J0644J0579J0089R905
57301I08213J0658J1813J2127J1419J0863J1185J1736J1830J1853J2338J2945
57290A036980J3187J3314J3708J4076J4001J3671J3431J3203J2899J2828J3150
57279A184448J3488J3524J3425J3406J3543J4162J5528J6871J6851J5468J4399
57268A345113J4826J5989J6620J6784J7274J8080J8554J8604J8701J8983J9094
57257A538622J8815J8352J8230J9025K0767K2483K2992K2302K1483K1092K0773
$$ plain form
57342 601991 607812 613506 619468 625612 631527 637368 643622 650154 656442 662676 669609 677229 684585 691097
57328 691097 697285 703932 711212 718852 726576 734172 741525 748740 755944 763041 769971 777019 784482 792264
57314 792264 800196 808444 817061 825477 833091 840239 847956 856916 866996 877640 888219 898308 908213
57301 908213 918871 930684 942811 954230 965093 976278 988014 999844 1011697 1024035 1036980
57290 1036980 1050167 1063481 1077189 1091265 1105266 1118937 1132368 1145571 1158470 1171298 1184448
57279 1184448 1197936 1211460 1224885 1238291 1251834 1265996 1281524 1298395 1315246 1330714 1345113
57268 1345113 1359939 1375928 1392548 1409332 1426606 1444686 1463240 1481844 1500545 1519528 1538622
57257 1538622 1557437 1575789 1594019 1613044 1633811 1656294 1679286 1701588 1723071 1744163 1764936
57246A764936K0477K0826K1814K2424K2211K2052K2604K3215K3214K3164K3851
57235B010788K4998K5982K6871K7823K8320K8087K7956K8703K9779L0215L0098
57224B319620L0092L0141K9779K9234K9101K9322K9431K9462K9772L0345L1033
57213B647332L2039L3468L4846L5762L6461L7158L7465L7155L6714L6433L5756
57202C040589L4334L2808L1618L0004K7374K4730K3452K3349K3266K2986K3107
57191C337617K3582K3790K3808K4215K4923K5421K5902K6839K7586K6838K4487
57180C615008K1869K0067J9029J8416J8176J8154J7962J7505J6953J6313J5590
57169C815042J5205J5436J5779J5591J5135J5080J5302J5144J4600J4255J4303
$$ plain form
57246 1764936 1785413 1806239 1828053 1850477 1872688 1894740 1917344 1940559 1963773 1986937 2010788
57235 2010788 2035786 2061768 2088639 2116462 2144782 2172869 2200825 2229528 2259307 2289522 2319620
57224 2319620 2349712 2379853 2409632 2438866 2467967 2497289 2526720 2556182 2585954 2616299 2647332
57213 2647332 2679371 2712839 2747685 2783447 2819908 2857066 2894531 2931686 2968400 3004833 3040589
57202 3040589 3074923 3107731 3139349 3169353 3196727 3221457 3244909 3268258 3291524 3314510 3337617
57191 3337617 3361199 3384989 3408797 3433012 3457935 3483356 3509258 3536097 3563683 3590521 3615008
57180 3615008 3636877 3656944 3675973 3694389 3712565 3730719 3748681 3766186 3783139 3799452 3815042
57169 3815042 3830247 3845683 3861462 3877053 3892188 3907268 3922570 3937714 3952314 3966569 3980872
57158C980872J4544J5148J6250J7127J6856J5794J5189J5411J5664J5541J5555
57147D153951J5932J6030J5408J4505J3777J2884J1226Q661N407J731j992n373
57135D262147q358j1172j3944j6753j9856k3196k5824k6555k5280k3037k0705
57124D047467j8225j5184j1675q415o319n885o747p974r006r952j0707j0346p898
57111C919134l174L605J2313K2359L2418M1698N1074O2195P6058R3379J15719
57100D426778J45060J82778K30117K89292L63070M53685N63147O93625Q45951
57091H193503J017995J205877J405938J613875J822664K023285K206778K363797
57083B1853712K484831K566317K615219K636809K608152K466507K137163J586023
$$ plain form
57158 3980872 3995416 4010564 4026814 4043941 4060797 4076591 4091780 4107191 4122855 4138396 4153951
57147 4153951 4169883 4185913 4201321 4215826 4229603 4242487 4253713 4262374 4267781 4269512 4267520 4262147
57135 4262147 4253789 4242617 4228673 4211920 4192064 4168868 4143044 4116489 4091209 4068172 4047467
57124 4047467 4029242 4014058 4002383 3993968 3987649 3981764 3975017 3967043 3958037 3948085 3937378 3927032 3919134
57111 3919134 3915960 3919565 3931878 3954237 3986655 4028353 4079427 4141622 4217680 4311059 4426778
57100 4426778 4571838 4754616 4984733 5274025 5637095 6090780 6653927 7347552 8193503
57091 8193503 9211498 10417375 11823313 13437188 15259852 17283137 19489915 21853712
57083 21853712 24338543 26904860 29520079 32156888 34765040 37231547 39368710 40954733
57075D0954733Q52799L6708p50561j426875j953491k325542k556375k666518k677998
57066B7486880k611741k486909k321258k130793j928603j724505j526261j340628
57058A1416182j172707j024947q97459p89001o97196o18673n50359m90659m38777
57049D736404l93297l52529l15979k84197k57044k33167k11415j91788j74633
57040B322355j59707j46386j34085j22153j10021r7724q5796p4450o3372n2278
57030A276383m1035k9245j6361k330J2263K6132L6270L7481K5247L25l0125n6940
57018A238065p4338q1496q0578p4579o6291n7763n0083m3632l8437l4174l0328
57007F06366k6725k3624k1182j9170j7334j5671j4154j2651j1217j0101r369q904
$$ plain form
57075 40954733 41807532 41844240 41093679 39666804 37713313 35387771 32831396 30164878 27486880
57066 27486880 24875139 22388230 20066972 17936179 16007576 14283071 12756810 11416182
57058 11416182 10243475 9218528 8321069 7532068 6834872 6216199 5665840 5175181 4736404
57049 4736404 4343107 3990578 3674599 3390402 3133358 2900191 2688776 2496988 2322355
57040 2322355 2162648 2016262 1882177 1760024 1650003 1552279 1466483 1392033 1328661 1276383
57030 1276383 1235348 1206103 1189742 1187412 1199675 1225807 1262077 1299558 1324805 1325130 1295005 1238065
57018 1238065 1163727 1082231 1001653 927074 860783 803020 752937 709305 670868 636694 606366
57007 606366 579641 556017 534835 515665 498331 482660 468506 455855 444638 434537 425168 416264
56995D16264q763q993r122q420o793m823k860p34J566L643N423P407R836J2018
56981D05649J2841J1560P916K139m798j1208j5527j7167j6618j4980j3218j1627
56969C34962r933q074o465n255l819j613J007L501O165R480J2900J5482J7459
56956C65797J9764K1903K1613J7159R049o63r806j6639k0286k1306k1076k0151
56944C45358j8004j4588j1089q513o441l901p34K562N812R253J2991J6961K1161
56931C50828K5524K9491L1825L0734K4674J3769M30j2063k1650k7843l0674l0460
56919C84585k8362k5825k3198j9920j6158j3078j1233r926q525p241o244n142
56907B09733l850k891k351j614n93l9o8L73J824L282L713L578L922M861N975P312
$$ plain form
56995 416264 407501 398508 389386 380966 374173 369350 366490 365756 367322 370965 376388 383795 393631 405649
56981 405649 418490 430050 437966 440105 435307 424099 408572 391405 374787 359807 346589 334962
56969 334962 325029 316955 310490 305235 301416 299803 300810 304311 310476 319956 332856 348338 365797
56956 365797 385561 407464 429077 446236 455285 454622 444816 428177 407891 386585 365509 345358
56944 345358 327354 312766 301677 293164 286723 282822 282088 284650 290462 299715 312706 329667 350828
56931 350828 376352 405843 437668 468402 493076 506845 507275 495212 473562 445719 415045 384585
56919 384585 356223 330398 307200 287280 271122 258044 246811 236885 228360 221119 214875 209733
56907 209733 205883 202992 200641 199027 198434 198395 198327 198700 200524 203806 207519 211097 215019 219880 225855 233167
56891B33167R057J0857J2448J4341J7043K0112K2617K3872K3129J9394J2501L837
56879D22375m763j2197j7684k0135j9119j5869j2293r260o518l725p84K453O043
56866C08524R892J4316K0088K7323L5004M2260M9313N6258O1485O2154N5958M2098
56854G84673K1718j620k2738l7600m5395m7560m5541m0335l3229k5581j7997j0497
56842D78298l154M183J2220K1364L1098M1028N1879O4391P7747Q9913R8643J00900
56830A068510R2384P0042L5755l540l9753o7279q3785q9584q7021p9397o9439
56819G46893n8648m7755l7158k6998j7485q982j225P086J7072K8262L9244M9472
56807F89778N9223O7611P1514O7053N2042K7605j824l0207n2655o7115p3706p3264
$$ plain form
56891 233167 242224 253081 265529 279870 296913 317025 339642 363514 386643 406037 418538 422375
56879 422375 417612 405415 387731 367596 348477 332608 320315 311055 304537 300812 300028 302481 308524
56866 308524 318416 332732 352820 380143 415147 457407 506720 562978 624463 686617 742575 784673
56854 784673 806391 804771 782033 744433 699038 651478 605937 565602 532373 506792 488795 478298
56842 478298 475144 479327 491547 512911 544009 585037 636916 701307 779054 868967 967610 1068510
56830 1068510 1160894 1230936 1266691 1263151 1223398 1156119 1072334 982750 895729 816332 746893
56819 746893 688245 640490 603332 576334 558849 549867 548642 555728 572800 601062 640306 689778
56807 689778 749001 816612 888126 955179 1007221 1034826 1033002 1002795 950140 883025 809319 736055
56795G36055o7285n8401m9435m1662l4675k7812k1015j4404p973j815L976R695
56783D25249J5780K2252K8722L4527L8223L7406L0186J6999N47j5860k9493l8576
56771E65962m2725m3106m1316l8146l3924k9549k6049k3310k0271j6579j3160
56760B37827j0998j0113r844r472q522p028n562m626m073l571l274l413l584l216
56746A50531k448j822j386q84n36p04j024p77k1N19N43L39Q0k04j84L25O96K69
56728A43312m43l23O10J193P67j58r47j404j309m51O48J005M37k53m10r3N09J279
56710A43969J740J429P97Q14J560K182K285K397K822L077K769K161J544Q92L94
56695A70832M65R29J009M01l73q31j053j138r66o63m91j78P84K088K765K574K261
$$ plain form
56795 736055 668770 610369 560934 519272 484597 456785 435770 421366 413393 411578 415554 425249
56783 425249 441029 463281 492003 526530 564753 602159 632345 649344 649891 634031 604538 565962
56771 565962 523237 480131 438815 400669 366745 337196 311147 287837 267566 250987 237827
56760 237827 226829 216716 206872 197400 188878 181850 176288 171662 167589 164018 160744 157331 153747 150531
56746 150531 148083 146261 144875 143991 143455 142751 141727 140950 140929 141448 141991 142330 142410 142206 142022 142347 143043 143312
56728 143312 142869 142546 143156 144349 145116 144958 144011 142607 141298 140847 141495 142500 142937 142684 142274 142181 142690 143969
56710 143969 145709 147138 147935 148749 150309 152491 154776 157173 159995 163072 165841 168002 169546 170438 170832
56695 170832 171297 172226 173235 173636 173263 172432 171379 170241 169275 168612 168121 167943 168727 170815 173580 176154 178415
56678A78415K279K202J765J373J202P68j41r41j190j255j490j490p68L78J160
56663A82267J165N83l3j42K17L51j27m81J85J411J858J217M30K3m75j224j543
56646A85682j207r42j113j068m53rk52m16L13J423J882J674J565J879K262K306
56630A93526J800Q42R2L08J157J279O9j364j708j138o73n43k46K93O00N42M99
56613A95335O11N77J05p17j538j961j859j652j885k387k367j570o95l75l20m7
56597A79255K49J49j75k43p7q7l33m64k66J03M05N79P99J289K001K459K215J440
56579A89298O64Q9m19p34n11K07J048J897K796L317K890J822J186J526K445L567
56563B11088M988O623Q067R378J1105J3227J4915J5532J5000J3049R257M255k05
$$ plain form
56678 178415 180694 182896 184661 186034 187236 188004 187863 186922 185732 184477 182987 181497 180729 181107 182267
56663 182267 183432 184015 183982 183840 184057 184408 184281 183800 183985 185396 187254 188471 188901 188924 188449 187225 185682
56646 185682 184475 183533 182420 181352 180899 180890 180638 180222 180535 181958 183840 185514 187079 188958 191220 193526
56630 193526 195326 196168 196260 196568 197725 199004 199073 197709 196001 194863 194190 193647 193401 193694 194294 194836 195335
56613 195335 195946 196523 196628 195911 194373 192412 190553 188901 187016 184629 182262 180692 179997 179622 179302 179255
56597 179255 179504 179653 179478 179235 179158 179071 178738 178274 178008 178111 178516 179095 179894 181183 183184 185643 187858 189298
56579 189298 189962 190051 189632 188898 188387 188594 189642 191539 194335 197652 200542 202364 203550 205076 207521 211088
56563 211088 216076 222699 230766 240144 251249 264476 279391 294923 309923 322972 332229 336484 336279
56550C36279k898m064m340l845k826k032j858j903j969k454l333l796l532l296
56536B94133l541l612l042k521k757l380l858m364m873m569l258k258k621l445
56522B46034l289k335j723j536j095o54j145k390l140k909k502k635l092l335
56508B14254l065k189r40J2K70K59M93O42J80n07o16j51K00J89J1m40j324k072
56490B05206j884r19q3K37L51L34m0m96l80K95P72O36K76J44K48N30J048J606
56472B07881J764J385Q05M13L41N68R45J216J299J382J501J324O78j04p17j303
56456B19378j891j906q88O13J505J327M82l82q08n97oM42O59J166K152K882K571
56439B26699J367O6p63r38m99J01J73l70q70r33r12r89p03J6L48p5l00M51J313
$$ plain form
56550 336279 333381 329317 324977 321132 318306 316274 314416 312513 310544 308090 304757 300961 297429 294133
56536 294133 290592 286980 283938 281417 278660 275280 271422 267058 262185 257616 254358 252100 249479 246034
56522 246034 242745 240410 238687 237151 236056 235402 234257 231867 228727 225818 223316 220681 217589 214254
56508 214254 211189 209000 208060 208072 208342 208601 209094 209736 209916 209409 208793 208642 208842 209031 209042 208602 207278 205206
56490 205206 203322 202403 202320 202557 202908 203242 203202 202706 202326 202621 203393 204029 204305 204449 204697 205227 206275 207881
56472 207881 209645 211030 211835 212248 212589 213157 214102 215318 216617 217999 219500 220824 221502 221398 220681 219378
56456 219378 217487 215581 214693 215306 216811 218138 218620 218238 217430 216833 216827 217269 217928 219094 221246 224128 226699
56439 226699 228066 228132 227369 226431 225932 226033 226206 225836 224966 224033 223121 222132 221429 221445 221793 221718 221418 221869 223182
56420B23182J002j82q68n66J50J010K202L346L653L154K687K577K254J323J73
56405B45097o24r33r47r03r26q55m52N4Q2m29q59r27j049j314j049l0R83J566
56387B36485K378L701M471L896K965K869K987K027L63m80j45M01O37Q48R18M04
56371B64725l07k98M56J120J338J361J153N54J00L87R58R17L94J39J74J13L00
56354B73584J176J961J616P06O33J310J449Q76O47R25P42Q2J32J142J877J823
56338B90681K051L199M254M189L440K852K438K040K088K818L589L728L387L052
56324C33806K934L192L980M866M899L668J669l84j997k684k234j216m23O8N10
56309C50654N68l8l77P06K618L591L320L344M590O134O899P081P210P093O470
$$ plain form
56420 223182 224184 224002 223134 222568 222718 223728 225930 229276 232929 236083 238770 241347 243601 244924 245097
56405 245097 244473 243540 242593 241690 240764 239909 239457 239511 239593 239164 238305 237378 236329 235015 233966 233936 234919 236485
56387 236485 238863 242564 247035 250931 253896 256765 259752 261779 262142 261662 261517 261918 262555 263403 264321 264725
56371 264725 264418 264120 264576 265696 267034 268395 269548 270102 270202 270589 271547 272464 272858 272997 273171 273284 273584
56354 273584 274760 276721 278337 279043 279676 280986 282435 283311 283958 284883 285625 285707 285839 286981 288858 290681
56338 290681 292732 295931 300185 304374 307814 310666 313104 315144 317232 320050 323639 327367 330754 333806
56324 333806 336740 339932 343912 348778 353677 357345 359014 358630 356633 353949 351715 350499 350076 350144 350654
56309 350654 351222 351184 350807 351513 354131 357722 361042 364386 368976 375110 382009 389090 396300 403393 409863
56294D09863N656M945M158L336K966L171L506L761M212M906N580O389P693R118
56280D79260R821R754R677R950J0370J1054J2241J3359J3605J3436J4041J5447
56268F22015J6608J7349J8579K0532K2438K4141K6328K8933L1146L3318L7026
56257H98413M2618M8519N3688N9166O6331P5149Q4959R5684J07310J19337J31499
56246A782673J44007J56544J68106J78141J86589J92576J94452J91585J84612
56237C379285J73509J57064J34873J08322P8996M7503J4599j8033m8820p6910
56227C950388j01384j21304j37019j49787j59593j65043j65890j63830j60168
56218B626370j54556j46972j38943j31692j24698j17169j09365j01457r2812q3626
$$ plain form
56294 409863 415519 420464 424622 427958 430924 434095 437601 441362 445574 450480 456060 462449 470142 479260
56280 479260 489081 498835 508512 518462 528832 539886 552127 565486 579091 592527 606568 622015
56268 622015 638623 655972 674551 695083 717521 741662 767990 796923 828069 861387 898413
56257 898413 941031 989550 1043238 1102404 1168735 1243884 1328843 1424527 1531837 1651174 1782673
56246 1782673 1926680 2083224 2251330 2429471 2616060 2808636 3003088 3194673 3379285
56237 3379285 3552794 3709858 3844731 3953053 4032049 4079552 4094151 4076118 4027298 3950388
56227 3950388 3849004 3727700 3590681 3440894 3281301 3116258 2950368 2786538 2626370
56218 2626370 2471814 2324842 2185899 2054207 1929509 1812340 1702975 1601518 1508706 1425080
56208A425080p5670p0033o5550o0654n5403n0520m5871m1210l7169l4153l1392
56197H57455k8190k4996k2252j9428j6351j4122j3536j3682j3194j1912j0306
56186F69486q509o853o140o375o344n344m155l525l036k316j886j900j558o46
56172F10899j30l07o2J021J654J151Q82K016L491L867L614L994M988N936O887
56157F49901P844P974P084O681Q008J0180J1757J2948J4811J7356J9922K2525
56145G96991K5577K9170L3695M0033M8192N6901O5445P4337Q3178Q9530R1337
56134A434386Q8970Q3716P5819O5507N4525M5128L8500L4973L4278L4484L2430
56123B022716K6526J7974Q625n55q409j3492j6386j9996k6209l4384m3982n5753
$$ plain form
56208 1425080 1349410 1279377 1213827 1153173 1097770 1047250 1001379 960169 923000 888847 857455
56197 857455 829265 804269 782017 762589 746238 732116 718580 704898 691704 679792 669486
56186 669486 660977 654124 647984 641609 635265 629921 625766 622241 619205 616889 615003 613103 611545 610899
56172 610899 610769 610462 610400 611421 613075 614226 615108 617124 620615 624482 628096 632090 637078 643014 649901
56157 649901 657745 665719 672803 679484 687492 697672 709429 722377 737188 754544 774466 796991
56145 796991 822568 851738 885433 925466 973658 1030559 1096004 1170341 1253519 1343049 1434386
56134 1434386 1523356 1607072 1682891 1748398 1802923 1848051 1886551 1921524 1955802 1990286 2022716
56123 2022716 2049242 2067216 2075841 2075286 2066877 2053385 2036999 2017003 1990794 1956410 1912428 1856675
56111A856675o8760p9154q4089q4564q2456p7440o9067n9353n0620m2799l5178
56100A123195k8718k4233k0375j5884j1829r366p376m691k423j677j144M92K052
56087I98023K311K648M516O586P198P367Q540R649R392R041R970J0764R980R363
56073A105348J0873J2895J2992J2228J3034J4842J5614J5754J6749J7781J7430
56062A265540J6917J7971J9348J9139J8552J9633K1253K1224K0408K0741K1264
56051A481990K0187J8771J9032J9712J8833J7994J9544K1785K1843K1160K2983
56040A703834K6316K7661K7150K7663K9372L0389L1336L4113L7478L8972L9747
56029B054031M2402M5680M6611M6130M7102M8646M8133M6983M8521N1777N3503
$$ plain form
56111 1856675 1787915 1708761 1624672 1540108 1457652 1380212 1311145 1251792 1201172 1158373 1123195
56100 1123195 1094477 1070244 1049869 1033985 1022156 1012790 1005414 1000723 998300 996623 995479 995971 998023
56087 998023 1000334 1002982 1007498 1014084 1021282 1028649 1037189 1046838 1056230 1065271 1075241 1086005 1095985 1105348
56073 1105348 1116221 1129116 1142108 1154336 1167370 1182212 1197826 1213580 1230329 1248110 1265540
56062 1265540 1282457 1300428 1319776 1338915 1357467 1377100 1398353 1419577 1439985 1460726 1481990
56051 1481990 1502177 1520948 1539980 1559692 1578525 1596519 1616063 1637848 1659691 1680851 1703834
56040 1703834 1730150 1757811 1784961 1812624 1841996 1872385 1903721 1937834 1975312 2014284 2054031
56029 2054031 2096433 2142113 2188724 2234854 2281956 2330602 2378735 2425718 2474239 2526016 2579519
56018B579519N4481N7595O1499O2916O3450O7218P3210P7087P9137Q3218Q9129
56007C348459R3462R6743J02180J08533J11869J13356J17562J24220J29575J34424
55997D480383J42588J52722J60374J66754J76494J88291J97299K05324K18522
55988F088751K36180K52240K66859K85509L07688L27960L47464L72506M02496
55979H887653M31584M61446M99439N44892N91025O39745O99766P70602Q44324
55970A4370476R23105J018323J132197J258407J401576J577045J790559K038972
55962B5510660K333038K697962L150542L701117M382093N249184O352150P735062
55954F1111808R471171J1662548J4390815J7693931K1594461K6104997L1158425
$$ plain form
56018 2579519 2634000 2691595 2753094 2816010 2879460 2946678 3019888 3096975 3176112 3259330 3348459
56007 3348459 3441921 3538664 3640844 3749377 3861246 3974602 4092164 4216384 4345959 4480383
55997 4480383 4622971 4775693 4936067 5102821 5279315 5467606 5664905 5870229 6088751
55988 6088751 6324931 6577171 6844030 7129539 7437227 7765187 8112651 8485157 8887653
55979 8887653 9319237 9780683 10280122 10825014 11416039 12055784 12755550 13526152 14370476
55970 14370476 15293581 16311904 17444101 18702508 20104084 21681129 23471688 25510660
55962 25510660 27843698 30541660 33692202 37393319 41775412 47024596 53376746 61111808
55954 61111808 70582979 82245527 96636342 114330273 135924734 162029731 193188156
55947A93188156L6468022M1294869M4183018M3036985L5976142K2712999N344096
55940D22204287j2370350k6830694l6103176m0147358m0073800l7319202l3187286
55933A96172421k8656935k4317108k0431578j7085327j4282722j1968566j0053960
55926F9376225q467188p166287o107142n233944m505741l903539l405918k982096
55918B7604370k613147k297177k028726j792694j581781j400532j248031j113545
55910A3528737r92456q90064q06213p31400o61408o01408n52365n06959m62221
55901G324243m23359l91819l61610l30587l03907k83146k62873k41053k22429
55892D503460k08643j94933j79494j66522j57157j46597j33135j21115j12209
$$ plain form
55947 193188156 229656178 270951047 315134065 358171050 394147192 416860191 422204287
55940 422204287 409833937 383003243 346900067 306752709 266678909 229359707 196172421
55933 196172421 167515486 143198378 122766800 105681473 91398751 79430185 69376225
55926 69376225 60909037 53742750 47635608 42401664 37895923 33992384 30586466 27604370
55918 27604370 24991223 22694046 20665320 18872626 17290845 15890313 14642282 13528737
55910 13528737 12536281 11646217 10840004 10108604 9447196 8845788 8293423 7786464 7324243
55901 7324243 6900884 6509065 6147455 5816868 5512961 5229815 4966942 4725889 4503460
55892 4503460 4294817 4099884 3920390 3753868 3596711 3450114 3316979 3195864 3083655
55883C083655j02425r0791q2500q0342q0695q0853q2605q5711q5542q0599p5405
55872B156187p2869p0312o5944o2596o1860o0721n7177n3550n1404m8660m4342
55861A506752m0848l9094l6685l3172l1675l2982l3438l1105k8643k7773k6291
55850A145046k3182k1413k2706k4453k4601k4894k6465k6910k4714k2271k1551
55839H81886k0918j8965j7493j7776j7798j6060j4448j4529j4560j2943j1288
55828G05108j1165j1085r392p349o711o933p008p475q538q921q439q921j0815
55815E92356j1880j0910r674r334q345n880m040m267m702l491j738q92j3J888
55801E19078L573M070M808O826Q461Q243P577P973Q053O021K967R73j69j765l477
$$ plain form
55883 3083655 2981230 2890439 2807939 2727597 2646902 2566049 2483444 2397733 2312191 2231592 2156187
55872 2156187 2083318 2013006 1947062 1884466 1822606 1761885 1704708 1651158 1599754 1551094 1506752
55861 1506752 1465904 1426810 1390125 1356953 1325278 1292296 1258858 1227753 1199110 1171337 1145046
55850 1145046 1121864 1100451 1077745 1053292 1028691 1003797 977332 950422 925708 903437 881886
55839 881886 860968 842003 824510 806734 788936 772876 758428 743899 729339 716396 705108
55828 705108 693943 682858 673466 666117 659406 652473 645465 637990 629452 620531 612092 603171 592356
55815 592356 580476 569566 559892 550558 542213 536333 532293 528026 523324 519833 518095 517203 517190 519078
55801 519078 522651 526721 531529 538355 546816 555059 562636 570609 578662 584683 587650 588623 588454 586689 583212
55786E83212m323m872o033o989o709o254p468j0292j3122j4888j5216j3687j0426
55773D62933o428k153L132R697J6280K1320K3676K1639J3598R29j1757k0528k4826
55760E07512k5695k3788k0280j7245j5484j3827j1752j0525j0538j0014p974o104
55748C34286n910o257n637m705m623m791m259l556l276k535p63P65R16N21M60
55733B90636j67k087l910m269m090m700n332m785l970m454n709o112n574n073
55719B30404m593l539k343j715j162Q1J610K850M369O582Q359Q587P970P557O705
55704B71722M336J069j709l850n856p330p813q021q502q253o447m439l990m562
55690B06355m398l384k709k506j925j001m40L1J247K892L926M302M731N163M995
$$ plain form
55786 583212 578889 574017 567984 560995 554286 548032 540564 530272 517150 502262 487046 473359 462933
55773 462933 456505 454352 457484 467181 483461 504781 528457 550096 563694 564623 552866 532338 507512
55760 507512 481817 458029 437749 420504 405020 391193 379441 368916 358378 348364 340390 334286
55748 334286 328376 322119 316482 311777 307154 302363 298104 294548 291272 288737 287974 288739 289655 290176 290636
55733 290636 290469 288382 284472 280203 276113 271413 266081 261296 257326 252872 247163 241051 235477 230404
55719 230404 225811 222272 219929 218214 217052 217133 218743 221593 225962 232544 240903 249490 257460 265017 271722
55704 271722 276058 277127 275418 271568 265712 258382 250569 242548 234046 225793 219346 214907 210917 206355
55690 206355 201957 198573 195864 193358 191433 190432 189992 190023 191270 194162 198088 202390 207121 212284 217279
55675B17279M304L553K588J266K81M7m66k142l892m042k875k033j978j765r16
55660B09209J55J207K201K599K067J440J693K433K714K714L190L805L592K606
55646B41625J690J015J92n64p67p68j252k054k686l484n008o804p940q309q211
55631A96675p406n774m244l701l658l260k784k788k582j304K10L73p07j449j158
55616A56443o76q38j681k969m218m570l779k957l172l816l561k352j169m81k26
55601A19978o39j651k091j003P25J508J223Q79O89J40o47j098j290j443r76L83
55585A14687J345O57p45j072m15j94m47J8J076J307N94M88J669L101M040N053
55569A31162O412P264P002O079N001L723K375J371N50o88k242l459m321n301o086
$$ plain form
55675 217279 221583 225136 227724 228990 229271 229318 228852 226710 222818 218776 215901 213868 211890 210125 209209
55660 209209 209364 210571 212772 215371 217438 218878 220571 223004 225718 228432 231622 235427 239019 241625
55646 241625 243315 244330 244522 243958 243191 242423 241171 239117 236431 232947 227939 221135 213195 204886 196675
55631 196675 189269 183495 179251 175550 171892 168632 165848 163060 160478 159174 159384 159757 159050 157601 156443
55616 156443 155767 154929 153248 150279 146061 141491 137712 134755 131583 127767 124206 121854 120685 120204 119978
55601 119978 119339 117688 115597 114594 115319 116827 118050 118929 119618 119758 119111 118013 116723 115280 114304 114687
55585 114687 116032 116689 115944 114872 114457 114263 113816 113834 114910 116217 116811 117299 118968 122069 126109 131162
55569 131162 137574 144838 151840 157919 162920 166643 169018 170389 170939 170251 168009 164550 160229 154928 148842
55554A48842n807m546l339k654k169j924k262k732k437j535r47o69J30J338J795
55539A21084J195N70O45J078J526K131K732K845K602K476K141R01p75j645j621
55524A37885j849k726l364l220k805k516k223k160k804l613l390k163j312j538
55510A02202k114k379k554k686k277j327n41j59J79L75L8k96K90J250J059k49
55494I0811q70o8O82J48q81j113n97n9L00M55J59m22o50n35p13j061o63M29J018
55475H6370P99R57J973K579J869Q08N22N64J19l61j23L30O2p40j211j172r84p22
55457I1639l67k45m40m31M6M74N01N61R08R36K38n44p23n83o50p11l60J48L39
55438I0736K49P1k89p90j086j160j345j452q75J20M49QN8J138K014J659Q86Q26
$$ plain form
55554 148842 143035 138489 135150 132496 130327 128403 126141 123409 120972 119437 118490 117821 117951 119289 121084
55539 121084 122279 122849 123494 124572 126098 128229 130961 133806 136408 138884 141025 141926 141151 139506 137885
55524 137885 136036 133310 129946 126726 123921 121405 119182 117022 114218 110605 107215 105052 103740 102202
55510 102202 100088 97709 95155 92469 90192 88865 88324 88165 88344 88719 88757 88461 88751 90001 91060 90811
55494 90811 89941 89873 90555 90703 89822 88709 88112 88053 88353 88808 88967 88545 87895 87360 86647 85586 84923 85352 86370
55475 86370 87169 88126 90099 92678 94547 95355 95877 96441 96560 96199 96076 96406 96468 95728 94517 93345 92361 91639
55457 91639 91272 91027 90587 90156 90202 90676 91177 91738 92646 93582 93820 93276 92553 91970 91320 90609 90249 90397 90736
55438 90736 90985 91056 90767 89977 88891 87731 86386 84934 84059 84179 84628 84636 84694 85832 87846 89505 90391 91217
55420I1217J017M65l77k33R63K031K176J517L65q98j496q86L47J002O17k14p13
55403I6900o20k94m06j235k145k267j718j345j296r08j78j2n54p12J6O20K73k63
55385H3856j5O44R03Q44P94L31p64j535j111j64J70O6M12J085J167M61m27j097
55367H5620j525j620j506j657j945j391J59J160M08r74j096J1Q20Q11P91J060
55351G9126R96M25j50o14j136j149L1J597J823M77p52n40O16J581J928J702R23
55334H6884m9m70r7M79O40L55k32j115k068k585k395j656n97N83J491J718J261
55317H2147L90o80j568j584n49O63J180J319J790K168J361m49j735j641r32n29
55301H1351l14J46N96N84K68Q4O5J9RJ52K26p9o61j052r08l25K28K95j10m80l72
$$ plain form
55420 91217 92234 92699 92322 92089 93052 95083 97259 98776 99141 98243 96747 95861 96208 97210 97827 97613 96900
55403 96900 96280 95986 95580 94345 92200 89933 88215 86870 85574 84666 84488 84476 83922 83210 83226 83846 84119 83856
55385 83856 83841 84485 85388 86232 87026 87357 86593 85058 83947 83783 83953 84019 84431 85516 86683 87144 86717 85620
55367 85620 84095 82475 80969 79312 77367 75976 76135 77295 77703 76729 75633 75644 76464 77275 78066 79126
55351 79126 80122 80547 80397 79783 78647 77498 77529 79126 80949 81426 80674 80134 80750 82331 84259 85961 86884
55334 86884 86835 86365 86268 86747 87387 87742 87510 86395 84327 81742 79347 77691 77094 77677 79168 80886 82147
55317 82147 82537 81857 80289 78705 78156 78819 79999 81318 83108 85276 86637 86188 84453 82812 81880 81351
55301 81351 81037 81183 81779 82363 82631 82715 82780 82799 82808 82960 83186 83107 82446 81394 80486 80161 80389 80684 80574 80094 79722
55280G9722J51P42J179J289Q02k43j183j333p66j10L49Q38J494K007J954J212
55264H8104J10o83o52m9K88j4l88k04L08N23L93L76O56R72J035P28R4n30p01n27
55244H9839o09j022j010k19N27M52Q5L36R29Q83J02o06q62r41q46l22K60J31o43
55225H6464j185j105q50o30o3Q90J566J537J197J000Q13L09m75j289j804j558
55209H4817l04J388K441K396J749J112N34k16j170k115k620k161p71N32O17l81
55193H5848j133p69J85O84M32K1Q3O83J304J402J002O24N05K79k71o18j88P15
55175I0788J295J308J083Q21N57N52R71J342J062L04k89n81q19q59l88K46M06
55158I7799K14K62M60K02l38l03L86Q56P83P98J094Q47l15j384j352n83r3r3r2
$$ plain form
55280 79722 79873 80615 81794 83083 83885 83642 82459 81126 80360 80250 80599 81437 82931 84938 86892 88104
55264 88104 88214 87531 86879 86830 87118 87104 86716 86512 86820 87343 87736 88112 88768 89740 90775 91503 91597 91067 90366 89839
55244 89839 89230 88208 87198 86979 87506 87958 88043 88379 89308 90191 90293 89687 88825 87884 87038 86716 86976 87107 86464
55225 86464 85279 84174 83324 82694 82631 83521 85087 86624 87821 88821 89634 89943 89468 88179 86375 84817
55209 84817 84513 85901 88342 90738 92487 93599 94133 93917 92747 90632 88012 85851 85080 85612 86229 85848
55193 85848 84715 83946 84131 84815 85247 85268 85351 86034 87338 88740 89742 90366 90871 91150 90879 90261 90073 90788
55175 90788 92083 93391 94474 95295 95852 96404 97375 98717 99779 100083 99794 99213 98394 97535 97147 97393 97799
55158 97799 98013 98275 98735 98937 98599 98296 98682 99538 100321 101119 102213 103060 102745 101361 100009 99426 99333 99240 99148
55139I9148L7k1l42o15n84k53K02M56J98m88j154j475j455j151n60J35O20P98
55121I3496P02K19n82j022n13L33K57q57j590q37Q11J977K110J680J274J072R53
55104I9483O99L21K02N96J028P64q8o16l81J23M35O83Q90O06k08o64lJ328K214
55085A07412K097J228J56n72o08j69J03k7j45K5J13j69m47l24q3j45k61Q0P02
55066A08966R06M79j6k2L78O50M17k07p76r36p00k74J87M69K31n28j161j103p14
55047A06246p62j210j332r90q84j314j637j297o01m4L82Q23J144J337J613J786
55031A03260J257J41m84p8M77K45l01j42N75Q75N67L88N88N29k13j131j560j474
55013A03519j220r35m72K74J183J881J911J131l6r10j088o76j44L0k02l02K20
$$ plain form
55139 99148 99185 99164 98822 98207 97623 97370 97572 98028 98226 97738 96584 95109 93654 92503 91943 92078 92698 93496
55121 93496 94198 94417 93835 92813 92300 92633 92890 92033 90443 89606 90417 92394 94504 96184 97458 98530 99483
55104 99483 100182 100503 100705 101301 102329 103093 103005 102389 102008 102131 102566 103249 104139 104745 104537 103873 103870 105198 107412
55085 107412 109509 110737 110893 110321 109713 109544 109647 109620 109475 109500 109613 109444 108997 108673 108590 108445 108184 108264 108966
55066 108966 109872 110351 110335 110313 110691 111341 111758 111551 110775 109839 109139 108865 109052 109521 109752 109224 108063 106960 106246
55047 106246 105484 104274 102942 101952 101068 99754 98117 96820 96219 96175 96557 97380 98524 99861 101474 103260
55031 103260 104517 104658 104174 104096 104573 104818 104517 104375 104950 105825 106392 106780 107368 107897 107684 106553 104993 103519
55013 103519 102299 101364 100892 101166 102349 104230 106141 107272 107236 106326 105238 104562 104418 104448 104246 103944 104164
54996A04164J016J193N31j08Q6Q47J363J364J195J099R74P12L48p0m37n63l97
54979A13317j13J35L81N96O20N30O72J052J124N27l14o71l88Q7L02J36k02k77
54961A17514K25R79J185M56o92j440j452q93j09M88N75L16J64J69j26p92j199
54944A15368q63j19M54O89N51j67j263j896j540p52l02j04K80N98L27j80RJ008
54926A12098J917K089J868J892K288K839L451M210N122N968O334N944N105M502
54912A65627M354M098L198J883O76m00j637l035m442n883p121p305n933l921k790
54897A37369k797k799k034j124q93j064p64R8O96M23l74q62o97k93j76k71m0P04
54879A25102J556K119K567L288M279N210N833O020N714N101M630M427L961K709
$$ plain form
54996 104164 105180 106373 106904 106796 106882 107729 109092 110456 111651 112750 113724 114436 114784 114714 114277 113714 113317
54979 113317 113204 113339 113720 114316 114936 115466 116138 117190 118314 118841 118527 117856 117468 117555 117857 117993 117791 117514
54961 117514 117739 118718 119903 120359 119667 118227 116775 115882 115773 116261 116836 117152 117316 117485 117359 116567 115368
54944 115368 114505 114386 114840 115529 116080 115913 114650 112754 111214 110462 110160 110056 110336 110934 111261 111081 111090 112098
54926 112098 114015 116104 117972 119864 122152 124991 128442 132652 137774 143742 150076 156020 161125 165627
54912 165627 169981 174079 177277 179160 179836 179436 177799 174764 170322 164439 157318 150013 144080 140159 137369
54897 137369 134572 131773 129739 128615 127722 126658 125894 125992 126688 127111 126737 125875 125178 124885 124709 124438 124398 125102
54879 125102 126658 128777 131344 134632 138911 144121 149954 155974 161688 166789 171419 175846 179807 182516
54865A82516R20o86j841k842l931m983n768o119n858m982l868l007k575k475k623
54850A31878k878k923k563k072j845j839j703j233m96K98P20L06p41j387q71K45
54834A12896P79M39jP5M47O25M06j81r32j338r74j53K69n3n94p43m94j50J95N50
54814A11068P40N57R0l17l55N1O77J115J121Q58O72O89Q00R38J080J014M28n91
54796A20635j424j422n70M54Q87O49L69N22P03J64r71j616j076J02R59J270J386
54779A21021J395J136P83P53J061J308J225Q70M21K11P02J927L151L668L749M232
54763A47613N234N984N973N624N612N994O261N872M552K416p5k400m296n663o398
54748A82303o555o548o740o924o564n514m111k710j521p90o40p61p40p02j075
$$ plain form
54865 182516 183436 182750 180909 178067 174136 169153 163385 157266 151408 146426 142558 139551 136976 134501 131878
54850 131878 129000 126077 123514 121442 119597 117758 116055 114822 114326 114624 115344 115650 114909 113522 112651 112896
54834 112896 113675 114114 114113 114188 114635 115260 115666 115485 114553 113215 112241 112088 112357 112304 111710 110967 110473 110323 110518 111068
54814 111068 111808 112365 112455 112138 111783 111834 112511 113626 114747 115605 116277 116966 117766 118704 119784 120798 121226 120635
54796 120635 119211 117789 117219 117673 118560 119209 119578 120100 120803 120967 119996 118380 117304 117406 118365 119635 121021
54779 121021 122416 123552 124335 125088 126149 127457 128682 129552 129973 130184 130886 132813 135964 139632 143381 147613
54763 147613 152847 158831 164804 170428 176040 182034 188295 194167 198719 201135 201060 198660 194364 188701 182303
54748 182303 175748 169200 162460 155536 148972 143458 139347 136637 135116 134326 133686 132925 132185 131483 130408
54733A30408j696j726p77M28Q92N95M49J127K227K827K627K323K718L745M664
54718A50831N092N397N981O623O709N780L823J374o18j615k260l610n498o550
54704A71459o170n499n640n985n319l814k698k386k164j559q22j86L37L88m04
54689A29538j496j834j304q60r89j050m53L30M16l77j393j775j110J54R91R11
54673A19699N08M42L07n63j582j449j78O96K24q23j342j278j072p08r2L93L64
54656A13546M5j97l48m12o8P49J517J756J639J481J225P43J77l93j152j939k053
54639A16316j180%O16O62O36N92K05m43q12o52k91j30j10J27O75J094Q20om87
54620A17632m6O93P04%m34j42K32P2k99k65J87O80J025J167R68M43l2j20J25M00
$$ plain form
54733 130408 128712 126986 126209 126637 127529 128124 128573 129700 131927 134754 137381 139704 142422 146167 150831
54718 150831 155923 161320 167301 173924 180633 186413 190236 191610 190992 189377 187117 183507 178009 171459
54704 171459 165289 159790 154150 148165 142846 139032 136334 133948 131784 130225 129403 129217 129554 129942 129538
54689 129538 128042 126208 124904 124044 123055 122005 121552 121882 122298 121921 120528 118753 117643 117797 118788 119699
54673 119699 120207 120649 120956 120393 118811 117362 117184 117880 118104 117281 115939 114661 113589 112881 112789 113182 113546
54656 113546 113591 113394 113046 112634 112566 113315 114832 116588 118227 119708 120933 121676 121853 121460 120308 118369 116316
54639 116316 115136 115136 115752 116414 117050 117642 117847 117404 116592 115940 115649 115519 115409 115536 116211 117305 118125 118119 117632
54620 117632 117586 118279 118983 118983 118549 118407 118639 118711 118412 118147 118334 119014 120039 121206 122174 122617 122585 122465 122590 122990
54600A22990L75j88j093j493p17O26J104L08o12n69P0K50l16j023j254q24O6Q36
54582A18536Q99L80R3M30P78M40l53q46p77m49j64n4k46p49j312j608j417o27
54564A12954N37J327J120L61J27O31R76O91M99R74J406Q40m10j169q74N4R16J164
54546A22124N57m31p71o6R30J473J914K804L567L128J539m1q16r50p36j05Q45
54529A34965J540J360J88j427k424j991n38M50J27o68o30J85O12O1r14j536j467
54512A27893p08L60Q84L15p21j048l76N30J058J253J143M83o00j416j408o45N18
54495A27515J628J999J144l94j273p73L92R58M20p08j533j481o39L60R31J082
54479A29628J157J197R31L85K4J64N80P57L62m67j082p44N13J648J735J151J015
$$ plain form
54600 122990 123365 123177 122084 120591 119874 120500 121604 121912 121300 120731 120801 121051 120735 119712 118458 117634 117700 118536
54582 118536 119435 119815 119908 120338 121116 121556 121203 120357 119580 119131 118967 118913 118667 117918 116606 114998 113581 112954
54564 112954 113491 114818 115938 116299 116426 117057 118033 118724 119223 120197 121603 122443 122033 120864 119990 120044 120960 122124
54546 122124 122681 122250 121479 121413 122343 123816 125730 128534 132101 135229 136768 136727 135911 134961 134225 134120 134965
54529 134965 136505 137865 138053 136626 134202 132211 131673 132123 132250 131582 130952 131137 131749 131810 130896 129360 127893
54512 127893 127185 127545 128429 128744 128023 126975 126599 127129 128187 129440 130583 131066 130466 129050 127642 126997 127515
54495 127515 129143 131142 132286 131892 130619 129846 130238 131196 131616 130908 129375 127894 127255 127615 128546 129628
54479 129628 130785 131982 132913 133298 133322 133486 134066 134823 135185 134718 133636 132892 133405 135053 136788 137939 138954
54462A38954J600J981J447N11J41M81P89M30m97j307j375o50K50N58N0p69j148
54445A41446p69l2K79j97q89q73r5L99j79j220j466o27L41N26mo05q61p65m12
54426A33997J69R39J680J958J466N21l8K86J102J602J408P33Ql76k54Q0J09k43
54408A45147n00m78o01j042j202o39J02L47M34J018J768J795J139P01P74Q07O16
54391A50186O81J013R29L07M9P03J497J421N42m05j132j765k148j987j433r19
54375A47539m97J01Q76J421J521J485J764K374K868K864K587K635L205L752L752
54360A78247L411L264L244K750J611L94l44p07j167k021l214m339m819m451l754
54345A68105l378l182k460j111Q8N12L80J63j54p99j650k298k403j784n04Q77
$$ plain form
54462 138954 140554 142535 143982 144493 144634 145115 145904 146334 145837 144530 143155 142505 142755 143313 143363 142594 141446
54445 141446 140677 140645 140924 140727 139838 138965 138870 139269 139090 137870 136404 135777 136118 136644 136640 136035 135174 134409 133997
54426 133997 134166 135105 136785 138743 140209 140730 140692 140978 142080 143682 145090 145823 145831 145455 145201 145281 145390 145147
54408 145147 144647 144169 143568 142526 141324 140685 140787 141134 141568 142586 144354 146149 147288 147989 148763 149570 150186
54391 150186 150867 151880 152809 153116 153165 153868 155365 156786 157328 156923 155791 154026 151878 149891 148458 147539
54375 147539 147042 147143 148019 149440 150961 152446 154210 156584 159452 162316 164903 167538 170743 174495 178247
54360 178247 181658 184922 188166 190916 192527 192921 192577 191870 190703 188682 185468 181129 176310 171859 168105
54345 168105 164727 161545 159085 157974 158062 158574 158954 159117 158963 158164 156514 154216 151813 150029 149525 150402
54329A50402J545J309Q57Q69J103Q27j09j060j366r96m67l32p65j398j617j136
54313A47666l07K36K17p2k11k27n48j320j915j528k70P90Q60L17J0J01O4l74r19
54294A42570j193j105p04j40L18N14O13P83R01Q54Q09P93M17m11q99k73R79J644
54276A46470J392R68Q19N32j77q14q60m72p8J86L53M63O61J070J441J369R07M38
54258A54668O5k80k47N36J521J719J183R99J482J588N99o49j000n28j09j14l54
54241A61079p16j099j142p54n13r21j595j826j499r71m35o4j98p36p96J75J352
54224A49341J414L25o76p43k37J86M50P77J083J111Q42N21L26K01j0k67k79J01
54206A54466N12M00k86j083j654j976j844r17N18J446J282N62R8qn5n3L3j53q18
$$ plain form
54329 150402 151947 153256 154113 154982 156085 156912 156803 155743 154377 153381 152914 152582 151817 150419 148802 147666
54313 147666 147359 147595 147812 147740 147529 147302 146754 145434 143519 141991 141721 142511 143371 143688 143698 143799 143863 143489 142570
54294 142570 141377 140272 139568 139428 139746 140260 140873 141656 142557 143411 144220 145013 145430 145019 144120 143847 144826 146470
54276 146470 147862 148830 149649 150181 150004 149190 148330 147858 147780 147966 148319 148782 149443 150513 151954 153323 154230 154668
54258 154668 154733 154453 154206 154742 156263 157982 159165 160164 161646 163234 163833 163184 162184 161656 161547 161433 161079
54241 161079 160363 159264 158122 157368 156855 155934 154339 152513 151014 150043 149608 149544 149346 148610 147814 147989 149341
54224 149341 150755 151080 150404 149661 149424 149610 150060 150837 151920 153031 153873 154394 154720 154921 154911 154644 154365 154466
54206 154466 154978 155378 155092 154009 152355 150379 148535 147618 148136 149582 150864 151426 151524 151516 151461 151408 151441 151288 150470
54187A50470j413j245m55K36N46P35Q75P24K90j9J32P21J492K005J809R59J17
54170A57979j82j11l8J54O33R67O36l2k66JJ40m6k3M63Q87O95j8q19j448j714
54150A57858j359l67P76J436J325O51o5k93O7N46N96K15j35j68p2j19k88l00M6
54131A60350O24R45N81l10j051j199r65o80k79L47Q31P21J93j86k55l10m38l29
54113A58590K08R84J742K301K408J903J093N41L98L06O2n0K50P70J136J295J542
54096A75479K116K927L604L820L613L304L051K569J483j24j750k947l585l748
54082A89812l544l044k250j265m50k26n38q10o18j36K38M21N35O14P10R95J505
54065A81949J964K162K210K162J870J468J515K103K399J733P07M28Q86J014K44
$$ plain form
54187 150470 149057 147812 147357 147593 148139 148874 149749 150473 150763 150744 150876 151597 153089 155094 156903 157862 157979
54170 157979 157797 157686 157648 157802 158435 159402 160038 160006 159740 159741 159881 159835 159812 160275 161162 161857 161839 161020 159572 157858
54150 157858 156499 156132 156908 158344 159669 160320 160255 159962 160029 160575 161171 161386 161251 161083 161011 160892 160604 160304 160350
54131 160350 160974 161919 162500 162190 161139 159940 158975 158295 158016 158363 159194 159915 160108 159922 159667 159357 158919 158590
54113 158590 158798 159782 161524 163825 166233 168136 169229 169770 170168 170474 170536 170486 170736 171506 172642 173937 175479
54096 175479 177595 180522 184126 187946 191559 194863 197914 200483 201966 201842 200092 197145 193560 189812
54082 189812 186268 183224 180974 179709 179259 179033 178495 177685 177067 176931 177169 177590 178125 178739 179449 180444 181949
54065 181949 183913 186075 188285 190447 192317 193785 195300 197403 199802 201535 202242 202670 203556 204570 204814
54050B04814q25j336j058k77N87J078J050R56J371K215K962L486M057M579M627
54035B28286M354M512N309N980N876N328M983M870M604M090L522K904K118J269
54021B88005O56L82L05K49R1k64q44j550k212k697l005l337l917m617n007m945
54005B57293m863n076n173m570l502k788k675k648k373k154k249k375k168j722
53991B12957j371j325j596j971j991j429p69p01j057r75k33K97n7p56q26j61N11
53974A98547N89Q6n41o95k2J128J967K199K348K801L132K774J944J305J107J255
53958B19924J907L267M963O340P338Q543J0241J1952J2845J2170R447M917l2l618
53944C10204n200n692o143o377n492l351r67O29J383J884K404K638K251J455Q32
$$ plain form
54050 204814 203989 202653 201595 201318 201905 202983 204033 204989 206360 208575 211537 215023 219080 223659 228286
54035 228286 232640 237152 242461 248441 254317 259645 264628 269498 274102 278192 281714 284618 286736 288005
54021 288005 288661 289043 289348 289597 289688 289424 288580 287030 284818 282121 279116 275779 271862 267245 262238 257293
54005 257293 252430 247354 242181 237611 234109 231321 228646 225998 223625 221471 219222 216847 214679 212957
53991 212957 211586 210261 208665 206694 204703 203274 202505 201804 200747 199772 199539 199836 199779 199023 198197 198036 198547
53974 198547 199136 199222 198681 197986 197964 199092 201059 203258 205606 208407 211539 214313 216257 217562 218669 219924
53958 219924 221831 225098 230061 236401 243739 252282 262523 274475 287320 299490 308937 313854 313822 310204
53944 310204 305004 299312 293169 286792 281300 277949 276982 277611 278994 280878 283282 285920 288171 289626 290458
53929B90458P73J129J447J443J285J434K224L473M552M919M595M134M115M683
53915C30664N543O313O871P352P816Q036P720O868N710M359K756R95o25j964l026
53900C95388l572l250k422k207l121m164m037l058k866m228o076p034p075p122
53886C35156p580q005p971p627p333p152o836o149n105l981l079k555k453k764
53872B56566l270l552l442l285l397l498l136k536k325k507k445k005j792k023
53858B17353j979j239n49p03j190r93k60q8p34j272j157j006j331j501p86L09
53842B02874P23L92K10N41P57M47J42L94Q42P82J54o29j431k277k705k068n00
53825A98648J112K128K539K393J650P96O63J253J565J074N66Q43J421J404R64
$$ plain form
53929 290458 291231 292360 293807 295250 296535 297969 300193 303666 308218 313137 317732 321866 325981 330664
53915 330664 336207 342520 349391 356743 364559 372595 380315 387183 392893 397252 400008 401003 400378 398414 395388
53900 395388 391816 388566 386144 383937 380816 376652 372615 369557 366691 362463 356387 349353 342278 335156
53886 335156 327576 319571 311600 303973 296640 289488 282652 276503 271398 267417 264338 261783 259330 256566
53872 256566 253296 249744 246302 243017 239620 236122 232986 230450 228125 225618 223173 221168 219376 217353
53858 217353 215374 214135 213586 212883 211693 210700 210440 210352 209618 208346 207189 206183 204852 203351 202565 202874
53842 202874 203597 203989 204199 204740 205497 205944 206086 206480 207322 208104 208258 207629 206198 203921 201216 199148 198648
53825 198648 199760 201888 204427 206820 208470 209266 209929 211182 212747 213821 214387 215230 216651 218055 219019
53810B19019R16J304J620K046L195M664N223M660M192M607N142M822L964L534
53796B68908L721M021M228M490M600M014K651J220N69R04J625J934J643J285J201
53781C07014Q61m27k296l682m278m792n550n867n251m340l930l843l507l075l112
53766B53925l563l859l802l585l178k443j728j640k205k820l022k806k243j373
53752B15658n81m67j169k094k481k062j107j01O25J059J308J315R83O09O70J044
53736B13209R74K23l42R7J006J126K00p39p56O2J090J866K144J892J447J279J374
53719B26152J290R42Q30J255J782J840J486J201J238J458J690J849J854J737J806
53704B48410K354L186L660L401K795K534K780L023K883K727L203M241N003M863
$$ plain form
53810 219019 219935 221239 222859 224905 228100 232764 237987 242647 246839 251446 256588 261410 265374 268908
53796 268908 272629 276650 280878 285368 289968 293982 296633 297853 298422 299326 300951 302885 304528 305813 307014
53781 307014 307875 307448 305152 301470 297192 292400 286850 280983 275732 271392 267462 263619 260112 257037 253925
53766 253925 250362 246503 242701 239116 235938 233495 231767 230127 227922 225102 222080 219274 217031 215658
53752 215658 215077 214610 213441 211347 208866 206804 205697 205596 206221 207280 208588 209903 210886 211495 212165 213209
53736 213209 214183 214406 214064 214161 215167 216293 216493 215754 214998 215060 216150 218016 220160 222052 223499 224778 226152
53719 226152 227442 228384 229214 230469 232251 234091 235577 236778 238016 239474 241164 243013 244867 246604 248410
53704 248410 250764 253950 257610 261011 263806 266340 269120 272143 275026 277753 280956 285197 290200 295063
53690B95063M092L342K766J969P15p03j801k381k589k642k536k099j313n26j91
53675B91166l79p73j099j309j356j116o44j79K58Q76J567J756J105J24l79k13
53659B89405J53L09K31m2n83j279j683j367m28N32R62Q69P46R24J215J286J210
53642B92460J313J600J764J695J579J492J386J404J743K176K282K161K281K517
53628C17853K224J489J400K509L933M638M858N325N736N149L619K370K255K830
53614C66188L177K950K503K413K952L765M098L657L027K897L181L306L077K731
53600D09922K460K381K622K870K333Q73k83N1J209J402J43j264j727j599j622
53585D19771j818k006k431l146l511l046k236j809j719j555j446j759k224k191
$$ plain form
53690 295063 299155 302497 305263 307232 307947 307244 305443 303062 300473 297831 295295 293196 291883 291357 291166
53675 291166 290787 290014 288915 287606 286250 285134 284490 284311 284569 285445 287012 288768 289873 289997 289618 289405
53659 289405 289558 289867 290098 290056 289473 288194 286511 285144 284716 285248 286210 287079 287825 288749 289964 291250 292460
53642 292460 293773 295373 297137 298832 300411 301903 303289 304693 306436 308612 310894 313055 315336 317853
53628 317853 320077 321566 322966 325475 329408 334046 338904 344229 349965 355114 358733 361103 363358 366188
53614 366188 369365 372315 374818 377231 380183 383948 388046 391703 394730 397627 400808 404114 407191 409922
53600 409922 412382 414763 417385 420255 422588 423461 423178 423229 424438 425840 425983 424719 422992 421393 419771
53585 419771 417953 415947 413516 410370 406859 403813 401577 399768 398049 396494 395048 393289 391065 388874
53571C88874j696j473j828k145j788r93n00n64p63o56k80J54O71J353J869J675
53555C81910P49k15o11m87j32M89J370K001J883J370J281J741K083J960J911K587
53539C99890L916N283O146O256N715N019M790N224O026O943P985R077R912J0374
53525D92556J0715J1190J1813J2603J3644J4758J5467J5573J5445J5548J5989
53514F45301J6716J7800J9223K0695K1942K2978K3945K4838K5613K6313K6827
53503H92191K6796K6047K5005K4405K4533K4896K4637K3248K0980J8585J6693
53492A148016J5524J5178J5809J7227J8610J9103J8711J8221J8290J8886J9568
53481A343143J9865J9479J8546J7652J7058J6024J3569R945O583M386K739O38
$$ plain form
53571 388874 387178 385705 383877 381732 379944 378951 378451 377887 377124 376468 376188 376342 377013 378366 380235 381910
53555 381910 382659 382444 381833 381346 381214 381703 383073 385074 386957 388327 389608 391349 393432 395392 397303 399890
53539 399890 403806 409089 415235 421491 427206 432225 437015 442239 448265 455208 463193 472270 482182 492556
53525 492556 503271 514461 526274 538877 552521 567279 582746 598319 613764 629312 645301
53514 645301 662017 679817 699040 719735 741677 764655 788600 813438 839051 865364 892191
53503 892191 918987 945034 970039 994444 1018977 1043873 1068510 1091758 1112738 1131323 1148016
53492 1148016 1163540 1178718 1194527 1211754 1230364 1249467 1268178 1286399 1304689 1323575 1343143
53481 1343143 1363008 1382487 1401033 1418685 1435743 1451767 1465336 1475281 1481864 1486250 1488989 1489627
53469A489627j936m258o055p754r745j1926j3879j5169j5521j5060j4296j3768
53457A360260j3740j4302j5500j7179j8926k0434k1637k2395k2296k1144j9488
53446A153219j8297j8063j8356j8263j7137j4965j2180r273o637m630l418k692
53434A009308j847p29J53M93Q33J835L218M156M589N286O580P883Q726R581J1152
53419A071217J3377J5557J7187J8324J9389K0767K2483K4197K5742K7473K9712
53408A305425L2010L3620L4556L5483L6635L7689L8790M0650M3375M6127M8350
53397A732710N0441N2707N4580N5564N6151N7025N7972N8378N8211N7786N7017
53386B348542N5730N4188N2585N0483M7535M4399M1967M0035L7508L3743K8894
$$ plain form
53469 1489627 1487691 1483433 1477378 1469624 1459879 1447953 1434074 1418905 1403384 1388324 1374028 1360260
53457 1360260 1346520 1332218 1316718 1299539 1280613 1260179 1238542 1216147 1193851 1172707 1153219
53446 1153219 1134922 1116859 1098503 1080240 1063103 1048138 1035958 1026685 1020048 1015418 1012000 1009308
53434 1009308 1007461 1006732 1006885 1007378 1008211 1010046 1013264 1017420 1022009 1027295 1033875 1041758 1050484 1060065 1071217
53419 1071217 1084594 1100151 1117338 1135662 1155051 1175818 1198301 1222498 1248240 1275713 1305425
53408 1305425 1337435 1371055 1405611 1441094 1477729 1515418 1554208 1594858 1638233 1684360 1732710
53397 1732710 1783151 1835858 1890438 1946002 2002153 2059178 2117150 2175528 2233739 2291525 2348542
53386 2348542 2404272 2458460 2511045 2561528 2609063 2653462 2695429 2735464 2772972 2806715 2835609
53375B835609K3307J7432J2073P699L529j741q235j4803k0672k6321l2402l8605
53363B756870m4058m8276n1329n3426n4700n5251n5162n4579n3703n2585n0983
53352B182818m8630m5611m2268l9096l6904l6603l8238m0458m1623m1269m0047
53341A732071l8498l6569l4197l1552k8733k5840k3322k1527k0033j8148j6062
53330A437590j4668j4160j3724j2919j2486j3271j5012j6695j7545j7298j6078
53319A273734j4552j3651j3562j3366j2217j0460q971p786o182l974j903o09J55
53306A166656J024K205L544N012O712Q534J0220J1842J3826J6350J8960K1056
53294A285941K2597K3977K5358K6511K7377K8200K8869K8643K6992K4435K2028
$$ plain form
53375 2835609 2858916 2876348 2888421 2896120 2899649 2897908 2889673 2874870 2854198 2827877 2795475 2756870
53363 2756870 2712812 2664536 2613207 2559781 2505081 2449830 2394668 2340089 2286386 2233801 2182818
53352 2182818 2134188 2088577 2046309 2007213 1970309 1933706 1895468 1855010 1813387 1772118 1732071
53341 1732071 1693573 1657004 1622807 1591255 1562522 1536682 1513360 1491833 1471800 1453652 1437590
53330 1437590 1422922 1408762 1395038 1382119 1369633 1356362 1341350 1324655 1307110 1289812 1273734
53319 1273734 1259182 1245531 1231969 1218603 1206386 1195926 1186955 1179169 1172987 1169013 1167110 1166501 1166656
53306 1166656 1167680 1169885 1173429 1178441 1185153 1193687 1203907 1215749 1229575 1245925 1264885 1285941
53294 1285941 1308538 1332515 1357873 1384384 1411761 1439961 1468830 1497473 1524465 1548900 1570928
53283A570928K0275J8914J7529J5831J3437J0043N892J632k389o245r901j2991
53271A642955j5216j6655j7552j8234j9144k0601k2434k4202k5712k6922k7494
53260A408789k7103k6241k6007k6832k7993k8604k8579k8309k7933k7328k6442
53249A107418k5304k4034k3062k2921k3527k4104k4088k3680k3203k2504k1459
53238H49532k0449j9758j8980j7670j6171j4995j3771j1753r218p396o923p214
53226F85234p562q007q778r633j0346j1224j2542j3828j4383j4317j4437j5153
53214E45024j5915j5880j4809j3203j1735j0654r714q637p612p125p291p640p745
53201D07064p705p802p954p924p811p909q106p922p136o022m975m281m123m326
$$ plain form
53283 1570928 1591203 1610117 1627646 1643477 1656914 1666957 1672849 1674481 1672092 1665847 1655946 1642955
53271 1642955 1627739 1611084 1593532 1575298 1556154 1535553 1513119 1488917 1463205 1436283 1408789
53260 1408789 1381686 1355445 1329438 1302606 1274613 1246009 1217430 1189121 1161188 1133860 1107418
53249 1107418 1082114 1058080 1035018 1012097 988570 964466 940378 916698 893495 870991 849532
53238 849532 829083 809325 790345 772675 756504 741509 727738 715985 706767 699371 692448 685234
53226 685234 677672 669665 660887 651254 640908 629684 617142 603314 588931 574614 560177 545024
53214 545024 529109 513229 498420 485217 473482 462828 453114 444477 436865 429740 422449 414809 407064
53201 407064 399359 391557 383603 375679 367868 359959 351853 343931 336795 330773 325798 321517 317394 313068
53187C13068m203l290k230k155l084l771l526l199l698m391m064k858k017j981
53173B68601k012j699j571j866j881j110j50J93l3l14n17o89n35J29Q01P73lj049
53155B57068j999k569k338j232jM61J23l39n40o26o71n99n87r57j509j554p17
53138B41414N84J626J977J700J211R39Q62N46j29o01l92J24K85J38K55P27J134
53121B52400J349J622J885J792J469J466J784J784J237P42P77J070J257J402J462
53106B73498R42l33j624k156k183k519l251l574k893j576n35k98n78o77k83K15
53090B52175L48K74M53P46M91m11j228j446j380j437j425j074o34l74p1L74M13
53073B45794k92r86p12K13N80k6q63j324j630k043k284k111j735j337q05k39n1
$$ plain form
53187 313068 308865 305575 303345 301190 298106 294335 290809 287610 283912 279521 275457 272599 270582 268601
53173 268601 266589 264890 263319 261453 259572 258462 258312 258505 258472 258158 257641 256952 256417 256546 257347 258120 258117 257068
53155 257068 255069 252500 250162 248930 248929 249390 249513 249174 248634 248008 247337 246738 246151 245194 243685 242131 241414
53138 241414 241998 243624 245601 247301 248512 249451 250313 250859 250730 250129 249737 249861 250146 250284 250539 251266 252400
53121 252400 253749 255371 257256 259048 260517 261983 263767 265551 266788 267530 268307 269377 270634 272036 273498
53106 273498 274440 274107 272483 270327 268144 265625 262374 258800 255907 254331 253796 253498 252920 252243 251960 252175
53090 252175 252523 252797 253250 253996 254487 254076 252848 251402 250022 248585 247160 246086 245452 245078 245007 245381 245794
53073 245794 245502 244516 243804 244017 244597 244571 243708 242384 240754 238711 236427 234316 232581 231244 230439 230200 230149
53056B30149j70J39J148J995J832J125J013J680K212J955J197M31k08o60p75p50
53040B42313j073j653j677p86J75J70n88j013n99J88Q52J291J309N74n50r85k76
53023B37672O34N82k43n89J82J362J929J718J345J231J117O46J40L46J230J572
53007B50874M28j318j765m17J228J780J509J233P85k59j204j020o0L85J16J27
52991B52422O88P08m21j686j877j148l78K78J267K487L146K739J680R54J258K358
52975B64475L195L015K279J997K217J971Q65k12m04n3M8q2P6N85J081J413J563
52958B84029J262L72o54j330j812k388k710k344j775j925k690k904j918n03J19
52943B62829m40j597k480k482j590m68J21O7q6K2J28j61p39j145j068n87kL80
$$ plain form
53056 230149 229979 230118 231266 233261 235093 236218 237231 238911 241123 243078 244275 244706 244498 243838 243063 242313
53040 242313 241240 239587 237910 237124 237299 237469 236881 235868 235269 235457 236309 237600 238909 239483 238933 237948 237672
53023 237672 238306 238888 238645 238056 238238 239600 241529 243247 244592 245823 246940 247586 247726 248072 249302 250874
53007 250874 251302 249984 248219 247802 249030 250810 252319 253552 254337 254078 252874 251854 251794 252179 252295 252422
52991 252422 253110 253818 253397 251711 249834 248686 248308 248586 249853 252340 255486 258225 259905 260859 262117 264475
52975 264475 267670 270685 272964 274961 277178 279149 280014 279802 279398 279345 279393 279311 279387 279972 281053 282466 284029
52958 284029 285291 285663 285009 283679 281867 279479 276769 274425 272650 270725 268035 265131 263213 262710 262829
52943 262829 262389 260792 258312 255830 254240 253772 253893 253960 253874 253896 254024 253863 253124 251979 250911 250324 250322 250702
52925B50702L98Q3l64o42m70Q1M21n6j091j614j031n4K23j69k44M28J139J151
52907B48891O47K74J74K8l12o70q88r24o75j09M52N09Rm70m09k7N4k89m92j41
52887B45632L87M93K53K38N63O96K77l37n99l98J01P67J366J465R56L97M37J032
52869B53726J604J846J919J988J993J882J713J483J157Q59P95R10R07O19J99j84
52853B73416o19j360k465l566m112l908l376l046k892k501j895j658k087k660
52839B37271k712k261j798j569j463j418j394j175n62K38P74Q93Q10P45P45Q70
52823B27994J181J582J721J173j87j752k314j197O88J579R04q4r9N39P73N54P23
52806B33778J446J931J655R74L61j72o86j015j066j014r45q29q65j419k371k981
$$ plain form
52925 250702 251100 251183 250819 250177 249707 249788 250209 250153 249062 247448 246417 246363 246586 246417 246173 246601 247740 248891
52907 248891 249538 249812 249986 250014 249702 249032 248144 247220 246545 246436 246888 247397 247406 246936 246527 246500 246554 246265 245773 245632
52887 245632 246019 246512 246765 247003 247566 248262 248539 248202 247603 247205 247306 248073 249439 250904 251860 252257 252694 253726
52869 253726 255330 257176 259095 261083 263076 264958 266671 268154 269311 270170 270965 271875 272782 273401 273600 273416
52853 273416 272797 271437 268972 265406 261294 257386 254010 250964 248072 245571 243676 242018 239931 237271
52839 237271 234559 232298 230500 228931 227468 226050 224656 223481 222919 223157 223931 224824 225634 226379 227124 227994
52823 227994 229175 230757 232478 233651 233464 231712 229398 228201 228889 230468 231372 231288 231189 231728 232501 233055 233778
52806 233778 235224 237155 238810 239784 240145 239973 239287 238272 237206 236192 235247 234418 233553 232134 229763 226782
52790B26782k537r91J025K533K774J856P29J33j51n65p70j74Q37J237R14P66J087
52773B35485R98m2j216j507j126r89j322j596j494j236j048q84o77m68k93j42
52757B22443M0M45J245K184K629K227J300M02j79l58j0Q65J960K854L225K953
52741B44225K239J698J902K709L357L316K630J528K34p17p21Q5P74P73M69L64
52725B64865K84j26o75r66j045j179j364j538j863k260k133j177j08J20m58j003
52709B49374j080r32p15k06O01J237J288P95J46j77J98J074J608J140Lr12j241
52692B52201j240j013m10K97M60j6m49l68j33j39p1M61J031Q43m4o57m10J40J08
52673B50591n36j062j061r07j004j096p10j1L74L11L22O89R99R10P96J099J539
$$ plain form
52790 226782 224245 223254 224279 226812 229586 231442 232171 232304 232153 231588 230818 230644 231481 232718 233632 234398 235485
52773 235485 236483 236441 235225 233718 232592 231603 230281 228685 227191 225955 224907 224023 223346 222878 222585 222443
52757 222443 222483 222928 224173 226357 228986 231213 232513 232915 232736 232378 232368 233233 235193 238047 241272 244225
52741 244225 246464 248162 250064 252773 256130 259446 262076 263604 263838 263121 262400 262485 263259 264032 264501 264865
52725 264865 265149 265023 264348 263382 262337 261158 259794 258256 256393 254133 252000 250823 250715 250835 250377 249374
52709 249374 248294 247362 246647 246441 247042 248279 249567 250362 250508 250331 250529 251603 253211 254351 254354 253442 252201
52692 252201 250961 249948 249538 249835 250295 250279 249830 249462 249329 249190 249119 249580 250611 251454 251410 250753 250343 250483 250591
52673 250591 250055 248993 247932 247025 246021 244925 244215 244204 244578 244889 245211 245900 246899 247809 248605 249704 251243
52656B51243J659J759K511L693M249L706K796K328K089J335r0j630k715l161l026
52641B66746k531k055j909k045k133j861j127p7Q81J271J039P37J004J863K751
52626B62554L187L202L085K925K529J663K76j446l076m038l886k688j132r0R9
52611B63164j75l50l48n23r83j323j149o26k59k24j94J42O09P95O42N08O57Q64
52593B61227O94Q4n59p99n67r0L60N93N48L77L74O29Q76Q69P78R66J357J363N79
52574B69659n92j283j076m31j62n62j127j075j59J031J563R57m20j723k298k025
52558B60277j195k17N63R07P80L85J8j66k34l18m15l85r1L86O67L30n93j444j530
52539B57725r06k99j85k81q0L88O92O29L95K44L09O41J116J390J244R07P38P43
$$ plain form
52656 251243 252902 254661 257172 260865 265114 268820 271616 273944 276033 277368 277278 275648 272933 269772 266746
52641 266746 264215 262160 260251 258206 256073 254212 253085 253008 253889 255160 256199 256936 257940 259803 262554
52626 262554 265741 268943 272028 274953 277482 279145 279421 277975 274899 270861 266975 264287 263155 263065 263164
52611 263164 262989 262639 262291 261768 260785 259462 258313 257687 257428 257204 257010 257152 257761 258556 259198 259706 260363 261227
52593 261227 261921 262005 261446 260647 260080 259990 260350 260943 261491 261868 262242 262871 263747 264616 265394 266360 267717 269080 269659
52574 269659 269067 267784 266708 266277 266115 265553 264426 263351 263192 264223 265786 266743 266323 264600 262302 260277
52558 260277 259082 258865 259428 260335 261115 261500 261518 261352 261118 260800 260385 260000 259909 260295 260962 261292 260699 259255 257725
52539 257725 256819 256520 256335 256054 255974 256362 257054 257683 258078 258322 258631 259272 260388 261778 263022 263929 264667 265410
52521B65410P58Q97J255J357O21n36q77P1J331J826J733J904K479K881K874K779
52505B86763K695K309J605J028P42K63p93k021k712k713k477k436k658l058l542
52490B72995l840l544k511j169k50r4l40l73mM09N28N03P59J380J965K077J775
52473B70266J529J651J868J661J014N86R78J920K502K184J364Q51J079J874K750
52458B94077L237L095K412J452L40r17k138k942l169l063k927k788k588k448k454
52443B79179k444k217j841j454r79l26K68M70L68L55N23M82m4p66j149j030o90
52426B68705l89o4L92P39O41K50K67J077K119K479J965J191O61M42O78J701L265
52409B86119M408M659M886O232Q531J0480J1230J1043J0323Q755N845J875k113
$$ plain form
52521 265410 266168 267065 268320 269677 270298 269762 268885 268956 270287 272113 273846 275750 278229 281110 283984 286763
52505 286763 289458 291767 293372 294400 295142 295405 294612 292591 289879 287166 284689 282253 279595 276537 272995
52490 272995 269155 265611 263100 261931 261681 261587 261247 260874 260870 261279 261807 262310 263069 264449 266414 268491 270266
52473 270266 271795 273446 275314 276975 277989 278575 279553 281473 283975 286159 287523 288374 289453 291327 294077
52458 294077 297314 300409 302821 304273 304613 303696 301558 298616 295447 292384 289457 286669 284081 281633 279179
52443 279179 276735 274518 272677 271223 270244 269918 270186 270656 271024 271379 271902 272384 272340 271574 270425 269395 268705
52426 268705 268316 268252 268644 269383 270024 270274 270541 271618 273737 276216 278181 279372 280033 280475 281153 282854 286119
52409 286119 290527 295186 300072 306304 314835 325315 336545 347588 357911 366666 372511 374386 372273
52396C72273n183p179q476r284r298q192o267m354l009k093j243l61M32R40Q38
52381C09544l6j041j032K89J830K507K575K905L524L904M244N242O616P075O051
52366C54197M478L457L097K977K939K743J831J28j413j783j103l23o2k38n16n68
52350C69841j53N84J114J188J191J472J768J827K119L236M796N811N996O006O333
52335D13129O783P176P803Q838R894J0612J1329J2624J4485J6306J7670J8745
52323E55394J9902K1240K2542K3534K4092K4301K4272K3986K3353K2436K1503
52312H06555K0801K0368K0163K0202K0428K0488J9916J8650J7188J6075J5302
52301A016136J4380J3001J1376R885Q579P249N784M205K365k9k924n666p544q577
$$ plain form
52396 372273 367090 359911 351435 342151 332853 324661 318394 314040 311031 308938 307695 307334 307766 308706 309544
52381 309544 309508 308467 307435 307724 309554 312061 314636 317541 321065 324969 329213 334455 341071 348146 354197
52366 354197 358675 362132 365229 368206 371145 373888 375719 375847 374434 372651 371548 371225 371163 370925 370409 369841
52350 369841 369688 370272 371386 372574 373765 375237 377005 378832 380951 384187 388983 394794 400790 406796 413129
52335 413129 419912 427088 434891 443729 453623 464235 475564 488188 502673 518979 536649 555394
52323 555394 575296 596536 619078 642612 666704 691005 715277 739263 762616 785052 806555
52312 806555 827356 847724 867887 888089 908517 929005 948921 967571 984759 1000834 1016136
52301 1016136 1030516 1043517 1054893 1064778 1073357 1080606 1086390 1090595 1092960 1092931 1090007 1084341 1076797 1068220
52287A068220r501j0757j1763j1495r905q244p598p466o409m081j669r8J323L722
52273I84279O809R222J0490J1491J2942J4488J5595J6356J6833J6539J5337J4192
52261A144573J4076J4559J4479J3764J3542J4322J5081J4587J2977J1403J0512
52250A293875R818Q473O222L480P05k089n131q273j0884j2522j3490j4429j5472
52237A240283j6199j6355j6155j5854j5479j5127j5053j5157j4761j3357j1323
52226A075463r540q406p621o780n751m566l356k460k130k026j407n2J388K254
52212A025010K723L394M311M976N218N491O062O451O050N047M276M197M444M461
52198A092111M225M073M046L798L278L106L894N273O016N432M259L823M431N065
$$ plain form
52287 1068220 1058719 1047962 1036199 1024704 1014799 1006555 998957 991491 985082 981001 979332 979234 980557 984279
52273 984279 991088 1000310 1010800 1022291 1035233 1049721 1065316 1081672 1098505 1115044 1130381 1144573
52261 1144573 1158649 1173208 1187687 1201451 1214993 1229315 1244396 1258983 1271960 1283363 1293875
52250 1293875 1303693 1312166 1318388 1321868 1322573 1320484 1315353 1307080 1296196 1283674 1270184 1255755 1240283
52237 1240283 1224084 1207729 1191574 1175720 1160241 1145114 1130061 1114904 1100143 1086786 1075463
52226 1075463 1065923 1057517 1049896 1043116 1037365 1032799 1029443 1026983 1024853 1022827 1021420 1021368 1022756 1025010
52212 1025010 1027733 1031127 1035438 1040414 1045632 1051123 1057185 1063636 1069686 1074733 1079009 1083206 1087650 1092111
52198 1092111 1096336 1100409 1104455 1108253 1111531 1114637 1118531 1123804 1129820 1135252 1139511 1143334 1147765 1152830
52184A152830M645L075R41j289l364n047o316p506q816r805r917r394r071r210
52170A081756r076p941o028m164k869k078j506r13j24Q93J953K855L594M245M741
52155A065338M886M550L683K293O04q37j470j199m53K41O89J038J517K136K593
52140A085609K470J725R39R21J886L149L860L971M249N334P085R077J1364J4256
52126A155895J7530K0500K3036K5816K9162L2184L3732L3949L4138L5072L6065
52115A477079L5900L4168L1474K8725K6448K4506K2220J9009J5060J1157P820
52104A733566M912K263J36j223k142l139m223m988n394o001p312r180j1024j2519
52090A673732j3933j5744j8009k0178k1621k2206k2150k1434j9696j6826j3332
$$ plain form
52184 1152830 1157475 1160550 1161491 1160202 1156838 1151791 1145475 1137969 1129153 1119348 1109431 1100037 1090966 1081756
52170 1081756 1072680 1064739 1058711 1054547 1051678 1049600 1048094 1047181 1047057 1047950 1049903 1052758 1056352 1060597 1065338
52155 1065338 1070224 1074774 1078457 1080750 1081354 1080517 1079047 1077848 1077395 1077636 1078325 1079363 1080880 1083016 1085609
52140 1085609 1088079 1089804 1090743 1091664 1093550 1096699 1100559 1104530 1108779 1114113 1121198 1130275 1141639 1155895
52126 1155895 1173425 1193925 1216961 1242777 1271939 1304123 1337855 1371804 1405942 1441014 1477079
52115 1477079 1512979 1547147 1578621 1607346 1633794 1658300 1680520 1699529 1714589 1725746 1733566
52104 1733566 1738478 1740741 1740877 1739654 1737512 1734373 1730150 1725162 1719768 1713767 1706455 1697275 1686251 1673732
52090 1673732 1659799 1644055 1626046 1605868 1584247 1562041 1539891 1518457 1498761 1481935 1468603
52079A468603r937o992m384j842P92L385N557P128Q594J0766J3751J6672J8658
52066A530751J9746K0467K0887K0608J9532J8085J6677J5307J3789J2041J0040
52055A717930P845N663L800K436J519P47m83k781o146r757j2784j5314j8046k1185
52041A653444k4107k6190k7463k8285k8727k8588k7771k6357k4493k2426k0515
52030A368522j8941j7502j5855j3961j2238j1230j1130j1552j1813j1605j1380
52019A221315j1784j2735j3346j2989j2076j1467j1350j1179j0692j0381j0749
52008A092567j1504j2023j2368j3340j5310j7472j8636j8610j8451j9199k0624
51997I15030k1453k0796j9073j7379j6107j4617j2342r846q300q125q622r000
$$ plain form
52079 1468603 1458666 1451674 1447290 1445448 1446240 1449625 1455182 1462310 1470904 1481670 1495421 1512093 1530751
52066 1530751 1550497 1570964 1591851 1612459 1631991 1650076 1666753 1682060 1695849 1707890 1717930
52055 1717930 1725775 1731438 1735238 1737674 1739193 1739940 1739457 1736676 1730530 1720773 1707989 1692675 1674629 1653444
52041 1653444 1629337 1603147 1575684 1547399 1518672 1490084 1462313 1435956 1411463 1389037 1368522
52030 1368522 1349581 1332079 1316224 1302263 1290025 1278795 1267665 1256113 1244300 1232695 1221315
52019 1221315 1209531 1196796 1183450 1170461 1158385 1146918 1135568 1124389 1113697 1103316 1092567
52008 1092567 1081063 1069040 1056672 1043332 1028022 1010550 991914 973304 954853 935654 915030
51997 915030 893577 872781 853708 836329 820222 805605 793263 783417 775117 766992 758370 749370
51985G49370r148r231r120q745q587r194j0403j1619j2644j3614j4259j4011j2919
51972F05876j1783j1126j0627r792q600p146n281k958m56K033M548O810Q147Q423
51958E68068Q382Q499Q184O782M722K760O31k289n373p132p289p106p280o827
51944E64732m791j979J06J394L171O106R438J2230J4485J6614J8388J9131J8791
51931F77816J8235J8216J8324J7322J4528J0508O241J932k941q591j4507j9980
51919G37103k4581k7912k9452k9024k7155k4650k1908j8981j6067j3582j1749
51908D92042j0350r013p563o041m397k345K99L125N255O218O525P060P923Q296
51894D97034P396N154J900k026o075r363j1275j2025j2204j1945j0873q857o366
$$ plain form
51985 749370 740222 730991 721871 713126 704539 695345 684942 673323 660679 647065 632806 618795 605876
51972 605876 594093 582967 572340 562548 553948 546802 541521 538563 538107 540140 544688 551498 559645 568068
51958 568068 576450 584949 593133 599915 604637 607397 608028 605739 600366 593234 585945 578839 571559 564732
51944 564732 559941 557962 558068 559462 562633 568739 578177 590407 604892 621506 639894 659025 677816
51931 677816 696051 714267 732591 749913 764441 774949 781190 783122 780181 771590 757083 737103
51919 737103 712522 684610 655158 626134 598979 574329 552421 533440 517373 503791 492042
51908 492042 481692 472679 465116 459075 454678 452333 452632 455757 461012 467230 473755 480815 488738 497034
51894 497034 504430 509584 511484 509458 503383 494020 482745 470720 458516 446571 435698 426841 420475
51881D20475m049k159m95J229L022M530N414N793O188O936P791Q256Q094P371
51867D78396O164M533K642O84j198k766l677l975m324n239o122n709l591p76J541
51852D56583L195M630N777O057N351M186K847R53j755m665o759p599p503o968
51838D54330o331n857n621n312m611l764l319l161k386n32J575K699K634K157
51824D22501J772J204J93r74j977k989m154m955m687l409j935q64j49L90O21M82
51808D01070M40J052K159K939K791J925R29J45l78o01n73o02r00j126p17J74N61
51791D09288k81j925l355m094m336m177l326j765j64O79O47L35L93R96J843K441
51775C93199K442J870J165R39J571K885M228N007N195N359O093P493R155J0466
$$ plain form
51881 420475 416426 414267 413772 415001 418023 422553 427967 433760 439948 446884 454675 462931 471025 478396
51867 478396 484560 489093 491735 492419 491221 488455 484778 480803 476479 471240 465118 459409 455818 455042 456583
51852 456583 459778 464408 470185 476242 481593 485779 488626 489579 487824 483159 476400 468801 461298 454330
51838 454330 447999 442142 436521 431209 426598 422834 419515 416354 413968 413436 415011 417710 420344 422501
51824 422501 424273 425477 425670 424696 422719 419730 415576 410621 405934 402525 400590 399726 399577 399967 400588 401070
51808 401070 401510 402562 404721 407660 410451 412376 413305 413450 413072 412471 411898 411296 410396 409270 408553 408727 409288
51791 409288 409007 407082 403727 399633 395297 391120 387794 386029 385865 386544 387191 387526 387919 388915 390758 393199
51775 393199 395641 397511 398676 399615 401186 404071 408299 413306 418501 423860 429953 437446 446601 457067
51761D57067J0931J0367Q964P061M804K156p60l643o419r199j1653j2917j2567
51748D44192j1353j0355r716q807p427o046m870l531j883l35R41K407M297O002
51734C93516O927P473Q407R512R670Q261N845L346J191m77j260p81O24J857J907
51719D56018O37j258k978m117m643m653m333l895l422k856k396k636l871n367
51705D10230n797m521k144L11K361M048N346N953N481L789J241j306l025l646
51691D18321l263j893K30K031K213P35r91j796j990k465l320m000m201l905l044
51676C92662j810q56m29J70J478K799L284L504M578O156O887O929Q054J0762J2931
51661D57099J2396R527O135K901o86m553p722r484r763q508n768k291R53L713
$$ plain form
51761 457067 467998 478365 487329 494390 499194 501350 500590 496947 490528 481329 469676 456759 444192
51748 444192 432839 422484 412768 403961 396534 390488 385618 382087 380204 379869 380810 383217 387514 393516
51734 393516 400443 407916 416323 425835 435505 443766 449611 452957 454148 453671 452411 451630 452254 454111 456018
51719 456018 456655 455397 452419 448302 443659 439006 434673 430778 427356 424500 422104 419468 415597 410230
51705 410230 404433 399912 397768 398079 400440 404488 409834 415787 421268 425057 426298 424992 421967 418321
51691 418321 415058 413165 413395 415426 417639 418374 417383 415587 413597 411132 407812 403812 399611 395706 392662
51676 392662 390852 389996 389567 389737 391215 394014 397298 400802 405380 411536 418423 425352 433406 444168 457099
51661 457099 469495 479022 485157 488058 487372 482819 475097 465613 455850 447342 441574 439283 440236 443949
51647D43949O106P451O628L627j93l565o213q153r155r242q892q348p356n925
51633D00719m590l564k418j024L9N15J140K524L973M253L061J035j181l080m068
51618C97334m008l727m025m408l900k758k276k786l180k666j855j535j458j052
51604C57700n27l99n42m46K3Q58K437M913P441Q950R586J0500J2064J3097J2068
51589D37723Q629L741j198n090p431q296q085p187n943m711l578k077L37L439
51575D00273O223P975R043J0303J2075J3854J4997J5404J5547J5943J6670J7242
51563E55549J6994J5733J4166J3651J5284J9069K3977K8891L3303L6915L8931
51552H12463L8288L4561K8220J9980J0478O90q162j5550k1917k7618l2197l5168
$$ plain form
51647 443949 450055 457506 464134 467761 467568 464003 457790 449637 440482 431240 422348 414000 406644 400719
51633 400719 396129 392565 390147 389123 389162 389677 390817 393341 397314 401567 404628 405663 404482 401402 397334
51618 397334 393326 389599 385574 381166 377266 374508 372232 369446 366266 363600 361745 360210 358752 357700
51604 357700 357173 356774 356232 355786 355809 356667 359104 364017 371458 380408 389994 400494 412558 425655 437723
51589 437723 446352 450093 448895 443805 436374 428078 419993 412806 406863 402152 398574 396497 396834 400273
51575 400273 406496 414471 423514 433817 445892 459746 474743 490147 505694 521637 538307 555549
51563 555549 572543 588276 602442 616093 631377 650446 674423 703314 736617 773532 812463
51552 812463 850751 885312 913532 933512 943990 944680 936518 920968 899051 871433 839236 804068
51540H04068l6836l7548l6752l3848k9594k5505k2023j8433j4571j1292q928o606
51528E22132l796j454o93j107j475j603k427m421o800q436q909q581q078p856
51514D56496p933p927p564o994o475n924n110m097l149k406j910j887k464l270
51500C89386l607l139k112r89o9N49R26J218J476J651J821K198K705K807K223
51485C97044J456J186J230P73m44j661k104j900j742j990k431k742k857k949l202
51470C77667l639m047m127l723k900j879j008p11j142j862k160j815j393j528
51456C45733k051k119j302k04K25o8j32P61K114K849K765K807L804N535P318R072
51440C77107J1178J3428J4709J3903J0893O602K347p92k272k150r48N55J561J522
$$ plain form
51540 804068 767232 729684 692932 659084 629490 603985 581962 563529 548958 537666 528738 522132
51528 522132 518336 516882 516189 515082 513607 512004 509577 505156 498356 489920 481011 472430 464352 456496
51514 456496 448563 440636 433072 426078 419603 413679 408569 404472 401323 398917 397007 395120 392656 389386
51500 389386 385779 382640 380528 379539 379470 380019 380945 382163 383639 385290 387111 389309 392014 394821 397044
51485 397044 398500 399686 400916 401689 401245 399584 397480 395580 393838 391848 389417 386675 383818 380869 377667
51470 377667 374028 369981 365854 362131 359231 357352 356344 355633 354491 352629 350469 348654 347261 345733
51456 345733 343682 341563 340261 340057 340282 340214 340082 340843 342957 345806 348571 351378 355182 360717 368035 377107
51440 377107 388285 401713 416422 430325 441218 447820 450167 449375 447103 444953 444005 444560 446121 447643
51426D47643L90j377l146m433n021m954m562m313m406m519m180l324k431k063
51412C99304k308k698k641j996j160n25L2Q27J657J880J317O26M91P84Q99O37
51396C97126L24K70M94R69J714K688L786M918N912O616P337Q856J1546J4676J7274
51381D84506J9531K2702K7451L2974L8069M2548M7130N2103N6585N8915N7544
51370I40058N1735M1916K9573J6573M393o299j5522k3626l0887l7189m2070m5126
51358H83529m6436m6552m6054m5107m3440m0718l6969l2670k8367k4275k0274
51347D72667j6387j3118j1109j0291r637q107n889m272m076m617m624l820l023
51334C73697k847k958k750k103j284n47p9J09M05J231K213K357J396L54K35P39
$$ plain form
51426 447643 448033 446656 443510 439077 434056 429102 424540 420227 415821 411302 407122 403798 401367 399304
51412 399304 396996 394298 391657 389661 388501 387976 388008 388835 390492 392372 393689 394315 394806 395590 396489 397126
51396 397126 397450 397720 398214 399183 400897 403585 407371 412289 418201 424817 432154 441010 452556 467232 484506
51381 484506 504037 526739 554190 587164 625233 667781 714911 767014 823599 882514 940058
51370 940058 991793 1033709 1063282 1079855 1084248 1077949 1062427 1038801 1007914 970725 928655 883529
51358 883529 837093 790541 744487 699380 655940 615222 578253 545583 517216 492941 472667
51347 472667 456280 443162 432053 421762 412125 404018 398129 393857 389781 385164 380540 376720 373697
51334 373697 370850 367892 365142 363039 361755 361208 361129 361238 361643 362874 365087 367444 368840 369194 369429 370168
51318C70168Q90M31j68p69j653k616k850j989o30L51O34M42P1l09o92j104j424
51301C58783j399j059p82o96l86L03O43j70j780l046l483l491l239k342q11N82
51285C37627J331J846K620L423L844M073M594N422O144O385N892M518K541P28
51271C90988l30o83n50J42J283K068J767Q28N93J769L605M693M185K224l51k552
51255D09679l760m073m069m202m465m613m529m242l777l178k614k323k267k092
51241C59475j589j106j170j679j865j254l51J6k52n30l76J9K96L49K91L37P90
51224C51401J699K531K519J536K69m87m95qN62Q03M87k20q76j136q51j1J068J732
51206C60523J693J610K350L701M558M463M147M259M353L674K370J233O22K42k21
$$ plain form
51318 370168 371058 371489 371321 370552 368899 366283 363433 361444 360814 361165 361799 362241 362312 362003 361311 360207 358783
51301 358783 357384 356325 355543 354847 354461 354764 355407 355237 353457 350411 346928 343437 340198 337856 337045 337627
51285 337627 338958 340804 343424 346847 350691 354764 359358 364780 370924 377309 383201 387719 390260 390988
51271 390988 390658 389975 389425 389567 390850 392918 394685 395513 396106 397875 401480 406173 410358 412582 412231 409679
51255 409679 405919 401846 397777 393575 389110 384497 379968 375726 371949 368771 366157 363834 361567 359475
51241 359475 357886 356780 355610 353931 352066 350812 350461 350477 350225 349695 349319 349338 349634 349983 350274 350611 351401
51224 351401 353100 355631 358150 359686 359955 359468 358973 358965 359527 360330 360817 360597 359721 358585 357734 357723 358791 360523
51206 360523 362216 363826 366176 369877 374435 378898 383045 387304 391657 395331 397701 398934 399556 399798 399577
51191C99577p03j016j156j328j696k003j616l71P71N69q76k105k162j591j286
51176C83008j169p97m24n00o68k50M78N93N7m9R82K491L334L192K674K430K478
51159C97860K332J660P55K48K58J63n47j511j964j777j584j978k954l997m436
51144C82528l841k452j097l92k02r6p2l45p88r99q12l11M57J314J769J536J057
51127C77254R80J331J716K104K733L383L505L013K266J347J27r39r79N7J137J450
51111D00485J309J414J874K386K803K996K682J842J033Q14J129J604K060K388
51097D26819K276J592P92M12L75K25p3j45P4J91k0k47j09L57P74Q68O04P2n94
51078D34243j167j357r95k15O02J159J467J685J814J753J668K036L172M849O510
$$ plain form
51191 399577 398874 397858 396702 395374 393678 391675 390059 389688 390459 391028 390152 388047 385885 384294 383008
51176 383008 381839 381042 380618 380118 379450 379200 379678 380271 380328 380279 381261 383752 387086 390278 392952 395382 397860
51159 397860 400192 401852 402607 402855 403113 403276 402729 401218 399254 397477 395893 393915 390961 386964 382528
51144 382528 378687 376235 375138 374746 374544 374448 374376 374031 373243 372244 371432 371121 371578 372892 374661 376197 377254
51127 377254 378234 379565 381281 383385 386118 389501 393006 396019 398285 399632 399759 398820 397841 397898 399035 400485
51111 400485 401794 403208 405082 407468 410271 413267 415949 417791 418824 419638 420767 422371 424431 426819
51097 426819 429095 430687 431479 431891 432266 432491 432418 432273 432347 432538 432518 432271 432162 432519 433293 434161 434765 434837 434243
51078 434243 433076 431719 430724 430509 431111 432270 433737 435422 437236 438989 440657 442693 445865 450714 457224
51063D57224P839Q953J0202J1868J4050J6649J9286K1144K1038J8163J3141Q163
51051F27720N565O089Q638J1589J3778J4342J2591Q788M568J603k65k776o952
51038G05278j1612j4547j4647j2370q749m825k025j874m683q947j2668j4955j5952
51025E77424j5704j4013j1320q754o940n426l527j228J129L424N498O868P329
51012E34760P628Q719J0513J1969J2433J2264J2068J1890J1401J0501R390Q320
51000F61856P432O749O132N359M293K932J394j01j252j817j730j064q9O66Q09
50985F91569P55J531L626O349Q854J1281J4255J7562K0171K1478K1764K1386K0396
50972H60977J9250J9087K0800K4269K8840L4068L9688M5316N0756N6274O2086
$$ plain form
51063 457224 465063 474016 484218 496086 510136 526785 546071 567215 588253 606416 619557 627720
51051 627720 633285 639374 648012 659601 673379 687721 700312 709100 713668 715271 715006 712230 705278
51038 705278 693666 679119 664472 652102 643353 638528 636503 634629 629946 620999 608331 593376 577424
51025 577424 561720 547707 536387 527633 520693 515267 511740 510512 511641 515065 520563 527431 534760
51012 534760 542388 551107 561620 573589 586022 598286 610354 622244 633645 644146 653536 661856
51000 661856 669288 676037 682169 687528 691821 694753 696147 696046 694794 692977 691247 690183 690094 690760 691569
50985 691569 692324 693855 697481 703830 712684 723965 738220 755782 775953 797431 819195 840581 860977
50972 860977 880227 899314 920114 944383 973223 1007291 1046979 1092295 1143051 1199325 1261411
50961A261411O7768P2553P6158P8922Q1191Q2775Q3062Q1477P7843P2402O5536
50950B101098N7537M8718L9547L0469K1650J3257N875K63l355n378o233o220o013
50937B291215o713q883j1869j4451j5998j6787j7446j8426j9942k2123k5145k9202
50925B084230l4149l9378m4358m9288n4621n9897o3751o5479o5876o5947o5322
50914A476164o2819n8362n3319m8762m4355l9492l4789l1562k9919k8325k5403
50903A019057k1603j8514j6894j6064j5193j4289j3567j2633j1061r331q268p720
50891H53920o598m387j854r2N64M16r0l89N0J171K274K898L375M169N190O121
50875H66738P055Q255R549J0517J1115J1691J2501J3580J4931J6552J8304K0082
$$ plain form
50961 1261411 1329179 1401732 1477890 1556812 1638003 1720778 1803840 1885317 1963160 2035562 2101098
50950 2101098 2158635 2207353 2246900 2277369 2299019 2312276 2318151 2318414 2315059 2309681 2303448 2297228 2291215
50937 2291215 2284502 2275619 2263750 2249299 2233301 2216514 2199068 2180642 2160700 2138577 2113432 2084230
50925 2084230 2050081 2010703 1966345 1917057 1862436 1802539 1738788 1673309 1607433 1541486 1476164
50914 1476164 1413345 1354983 1301664 1252902 1208547 1169055 1134266 1102704 1072785 1044460 1019057
50903 1019057 997454 978940 962046 945982 930789 916500 902933 890300 879239 869908 861640 853920
50891 853920 847322 842935 841081 840989 841553 841969 841879 841490 841540 842711 844985 847883 851258 855427 860617 866738
50875 866738 873793 882048 891597 902114 913229 924920 937421 951001 965932 982484 1000788 1020870
50863A020870K2071K4582K7716L1239L4705L7717M0393M3607M8292N4421O1138
50852A446751O8124P6112Q5701R6369J07286J18455J30212J42039J52796J62050
50842B585895J70266J77650J83617J87413J88512J86094J78880J66008J47821
50833D172156J25602J00766P4528M7985K2162j965k3387m1094n4266o2433o5558
50822D294496o4042n8563m9762l8357k5718j3980n183m50k18m812j4231k7570
50810C991610m3397o0677p8873r7241j14662j30234j43402j53478j59690j61906
50800B848050j60766j56815j50035j40509j29063j16920j04945r3552q2869p2725
50790A639851o2758n2925m3768l5915k9484k4178j9751j6112j3132j0635q578
$$ plain form
50863 1020870 1042941 1067523 1095239 1126478 1161183 1198900 1239293 1282900 1331192 1385613 1446751
50852 1446751 1514875 1590987 1676688 1773057 1880343 1998798 2129010 2271049 2423845 2585895
50842 2585895 2756161 2933811 3117428 3304841 3493353 3679447 3858327 4024335 4172156
50833 4172156 4297758 4398524 4473052 4521037 4543199 4541234 4517847 4476753 4422487 4360054 4294496
50822 4294496 4230454 4171891 4122129 4083772 4058054 4044074 4038891 4038441 4038223 4033411 4019180 3991610
50810 3991610 3948213 3887536 3808663 3711422 3596760 3466526 3323124 3169646 3009956 2848050
50800 2848050 2687284 2530469 2380434 2239925 2110862 1993942 1888997 1795445 1712576 1639851
50790 1639851 1577093 1524168 1480400 1444485 1415001 1390823 1371072 1354960 1341828 1331193 1322615
50779A322615p086o327o340o888p488p804p970q314q835r305r852j0888j2358
50766A213160j3508j3748j3395j3243j3658j4363j4894j4936j4401j3482j2485
50755A061047j1425r941p776n181k634l87J571L382N404Q120J1649J5603J9613
50742A089045K3778K8207L2510L6284L9919M4328M9885N6034O1987O7300P1819
50731A601096P5618P9084Q2558Q5736Q7861Q8759Q9165Q9702Q9980Q9228Q7371
50720B546158Q4794Q1128P5111O5807N3395L8510K1414K470j6882l4386m8320
50709B869199n8090o3510o4218o0289n2950m3983l4426k4443j4374n274J786O349
50697B455777Q172O697J472p186j8442l1626m6066o0422p2870q2225q8373r1574
$$ plain form
50779 1322615 1315529 1309202 1302862 1295974 1288486 1280682 1272712 1264398 1255563 1246258 1236406 1225518 1213160
50766 1213160 1199652 1185904 1172509 1159266 1145608 1131245 1116351 1101415 1087014 1073532 1061047
50755 1061047 1049622 1039681 1031905 1026724 1024090 1023703 1025274 1028656 1034060 1042180 1053829 1069432 1089045
50742 1089045 1112823 1141030 1173540 1209824 1249743 1294071 1343956 1399990 1461977 1529277 1601096
50731 1601096 1676714 1755798 1838356 1924092 2011953 2100712 2189877 2279579 2369559 2458787 2546158
50720 2546158 2630952 2712080 2787191 2852998 2906393 2944903 2966317 2968787 2951905 2917519 2869199
50709 2869199 2811109 2747599 2683381 2623092 2570142 2526159 2491733 2467290 2452916 2447642 2449428 2455777
50697 2455777 2463949 2470646 2472118 2464932 2446490 2414864 2368798 2308376 2235506 2153281 2064908 1973334
50685A973334r1901q9558q5173p9322p2216o4176n5995m8269m0757l3054k5543
50674A287370j8965j3159p093l50O154J1227J4633J6876J8264J8675J8051J6693
50662A368376J5161J4014J3466J3178J2688J2116J2109J2967J4315J5812J7550
50651A521752J9457K0999K2083K3611K6337K9694L2666L5391L8868M3195M7262
50640A861315N0279N2577N4654N6365N7405N7704N7039N4977N1730M8225M4997
50629B447267M1697L8245L5620L4816L5424L5667L3163K5405J0877q905k8954
50618B700322m3749n0836n1135m6549l8486k8447j8336r503k142L960Q602J1335
50606B435036J1906J0223O207k20r158k0552l3596m6564n7857o7067p4403p9415
$$ plain form
50685 1973334 1881433 1791875 1706702 1627380 1555164 1490988 1434993 1386724 1345967 1312913 1287370
50674 1287370 1268405 1255246 1248153 1247803 1253957 1265184 1279817 1296693 1314957 1333632 1351683 1368376
50662 1368376 1383537 1397551 1411017 1424195 1436883 1448999 1461108 1474075 1488390 1504202 1521752
50651 1521752 1541209 1562208 1584291 1607902 1634239 1663933 1696599 1731990 1770858 1814053 1861315
50640 1861315 1911594 1964171 2018825 2075190 2132595 2190299 2247338 2302315 2354045 2402270 2447267
50629 2447267 2488964 2527209 2562829 2597645 2633069 2668736 2701899 2727304 2738181 2729276 2700322
50618 2700322 2656573 2605737 2554602 2508053 2469567 2441120 2422784 2413281 2411139 2415099 2423701 2435036
50606 2435036 2446942 2457165 2463372 2463152 2453994 2433442 2399846 2353282 2295425 2228358 2153955 2074540
50594B074540q1268q0276p8063p5801p3093o9079o3861n8405n3529m9542m6377
50583A345246m3600m0537l6913l3061k9364k5793k2269j9007j6096j3107r588
50572A055911n705j973J440M679P587R605J0396J0421J0707J1989J4047J6033
50560A145137J7587J9265K1567K3964K5465K6005K6371K6796K6569K5366K4056
50549A408148K3561K3567K3026K1533J9688J8460J8628K0455K3390K6463K9404
50538A656323L3017L7996M3924N0013N6353O3598P1735P9993Q7856R5373J02509
50527B378690J08977J14811J20475J26208J31636J36091J38911J39440J37247
50518C532486J32317J24698J14084J00260Q3790O5650M6233K5324L111j9419m1242
$$ plain form
50594 2074540 1993272 1912996 1834933 1759132 1686039 1616960 1553099 1494694 1441165 1391623 1345246
50583 1345246 1301646 1261109 1224196 1191135 1161771 1135978 1113709 1094702 1078606 1065499 1055911
50572 1055911 1050206 1048233 1049673 1054352 1061939 1071544 1081940 1092361 1103068 1115057 1129104 1145137
50560 1145137 1162724 1181989 1203556 1227520 1252985 1278990 1305361 1332157 1358726 1384092 1408148
50549 1408148 1431709 1455276 1478302 1499835 1519523 1537983 1556611 1577066 1600456 1626919 1656323
50538 1656323 1689340 1727336 1771260 1821273 1877626 1941224 2012959 2092952 2180808 2276181 2378690
50527 2378690 2487667 2602478 2722953 2849161 2980797 3116888 3255799 3395239 3532486
50518 3532486 3664803 3789501 3903585 4003845 4087635 4153285 4199518 4224842 4227953 4208534 4167292
50507D167292o1712q0120r5517j07346j15695j20452j20711j15487j04822q9879
50497C155551p2202n3084l3312j3212O873K5927M2373N4977O3193O6333O2921
50486C306338N1551L2247O711k2531n2763q1235j05560j24340j37280j44657j46885
50475B581596j44536j38423j29569j19216j08633r8590q8979p9352o9817o1181
50465A543300n4176m8884m4871m1577l8464l5171l1635k7853k3508j8260j2560
50454A166341p586m019j304J498M485P164R543J2165J5106J7787K0039K2551K5765
50441A289535K8922L0746L0692K8886K5309J9912J3441P400K918J57j155j219
50429A475544n07R4j3n38p57l54N14J698L218N074P221R779J2987J7026K2000
$$ plain form
50507 4167292 4105580 4025460 3929943 3822597 3706902 3586450 3465739 3350252 3245430 3155551
50497 3155551 3083349 3030265 2996953 2983741 2990614 3016541 3058914 3113891 3177084 3243417 3306338
50486 3306338 3357889 3390136 3396847 3374316 3321553 3240318 3134758 3010418 2873138 2728481 2581596
50475 2581596 2437060 2298637 2169068 2049852 1941219 1842629 1753650 1674298 1604481 1543300
50465 1543300 1489124 1440240 1395369 1353792 1315328 1280157 1248522 1220669 1197161 1178901 1166341
50454 1166341 1158755 1154736 1153432 1154930 1159415 1166579 1176122 1188287 1203393 1221180 1241219 1263770 1289535
50441 1289535 1318457 1349203 1379895 1408781 1434090 1454002 1467443 1474843 1477761 1477918 1476763 1475544
50429 1475544 1475037 1475131 1475118 1474580 1473823 1473469 1473983 1475681 1478899 1483973 1491194 1500973 1513960 1530986 1552986
50414A552986K7946L4645M1618M8450N5021O1105O6038O9155P0469P0561O9838
50403B167832O8190O5355O1257N5953M9573M2358L4435K5487J4924K556j1032
50392B576888k4874l8270n1021o3073p3879q2093q6192q5670q1509p5102o7007
50381A848198n7133m5938l4500k3355j2127p00R961J8726K5384L0050L1915K9695
50369A820176K3197J3609K093j0899k4673l7540m7862n5334o0540o3560o3872
50358A494795o1529n7655n3467m9299m4840l9877l4574k9348k4703k0848j7307
50347A061348j3301q980n865n582q214j2307j6237j9069k0313j9640j7236j3791
50335I00813r901n738j605J657L291L461L161L349M354N945P642R015R954J0624
$$ plain form
50414 1552986 1580932 1615577 1657195 1705645 1760666 1821771 1887809 1956964 2027433 2097994 2167832
50403 2167832 2236022 2301377 2362634 2418587 2468160 2510518 2544953 2570440 2585364 2587920 2576888
50392 2576888 2552014 2513744 2462723 2399650 2325771 2243678 2157486 2071816 1990307 1915205 1848198
50381 1848198 1791065 1745127 1710627 1687272 1675145 1674445 1684406 1703132 1728516 1758566 1790481 1820176
50369 1820176 1843373 1856982 1859075 1848176 1823503 1785963 1738101 1682767 1622227 1558667 1494795
50358 1494795 1433266 1375611 1322144 1272845 1228005 1188128 1153554 1124206 1099503 1078655 1061348
50347 1061348 1048047 1039067 1033202 1027620 1019406 1007099 990862 971793 951480 931840 914604 900813
50335 900813 890912 885174 883569 885226 888517 891978 895139 898488 902842 908787 916429 925444 935398 946022
50321I46022J1136J1389J1313J0980J0254Q719O262L526J423K86l23j078k342
50308A017567l830m595l691j299J114K262K450K955M316N899P115Q149R443J1180
50294A059035J3545J6758K0523K4072K7131L0289L4233L9122M4894N0897N4380
50283A414879N0497L5838J2366j3001l3209m5096m9319m7940m2994l6442l0007
50272A215572k4617k0337j6887j4061j1711r764q285p365o866o445n811m851l512
50259A075060j675P68L744O994J0173J3006J5356J7157J8280J8561J8031J7119
50247A212574J6528J6767J7738J8769J9194J8908J8209J7099J4892J0802M858
50236A386338j924q300j3528j7424j9997k1253k1283k0286j8432j5887j3071j0859
$$ plain form
50321 946022 957158 968547 979860 990840 1001094 1009813 1016075 1019601 1021024 1021310 1020987 1019909 1017567
50308 1017567 1013737 1009142 1005451 1004152 1005266 1007528 1009978 1012933 1017249 1023148 1030263 1038412 1047855 1059035
50294 1059035 1072580 1089338 1109861 1133933 1161064 1191353 1225586 1264708 1309602 1360499 1414879
50283 1414879 1465376 1501214 1513580 1500579 1467370 1422274 1372955 1325015 1282021 1245579 1215572
50272 1215572 1190955 1170618 1153731 1139670 1127959 1118195 1109910 1102545 1095679 1089234 1083423 1078572 1075060
50259 1075060 1073385 1074153 1077897 1084891 1095064 1108070 1123426 1140583 1158863 1177424 1195455 1212574
50247 1212574 1229102 1245869 1263607 1282376 1301570 1320478 1338687 1355786 1370678 1381480 1386338
50236 1386338 1384414 1376114 1362586 1345162 1325165 1303912 1282629 1262343 1243911 1228024 1214953 1204094
50224A204094j0364j2329j6660k2509k8638l3726l6583l6696l4667l1804k8985
50213I11133k6151k3035j9935j7351j5114j2637r908p622o273n640n317n132m816
50200G52202l986k762j912j835j997j810j595j922k565k915l117l742m545m665
50186G12834m140m083n006o034o350o361o646o688n766m451l957m295m282l451
50172F41324k643k524k528j870p43J55P08J294J978K476K706K833K901K938L271
50157F52276M241N628O858P827Q967J0388J1491J1799J1752J2182J3113J3668
50145G70190J3297J2675J3010J4694J7088J9586K2392K5917K9786L2949L4713
50134A006297L5318L5435L5508L5738L6279L7057L7690L7881L7762L7406L6152
$$ plain form
50224 1204094 1193730 1181401 1164741 1142232 1113594 1079868 1043285 1006589 971922 940118 911133
50213 911133 884982 861947 842012 824661 809547 796910 787002 779380 773107 767467 762150 757018 752202
50200 752202 748216 745454 743542 741707 739710 737900 736305 734383 731818 728903 725786 722044 717499 712834
50186 712834 708694 704611 699605 693571 687221 680860 674214 667526 661760 657309 653352 649057 644775 641324
50172 641324 638681 636157 633629 631759 631016 631171 631879 633173 635151 637627 640333 643166 646067 649005 652276
50157 652276 656517 662145 669003 676830 685797 696185 707676 719475 731227 743409 756522 770190
50145 770190 783487 796162 809172 823866 840954 860540 882932 908849 938635 971584 1006297
50134 1006297 1041615 1077050 1112558 1148296 1184575 1221632 1259322 1297203 1334965 1372371 1408523
50123A408523L2852K6886J8680R091j198j1512k0851k8297l3697l7533m0083m1106
50111A281755m0415l8370l5576l2416k9114k5980k3216k0695j8307j6435j5636
50100I85595j5797j6076j5765j4918j3996j3215j2449j1435r940p956n852m022
50088H44174k261N5K938N453O768P151P412P771P935P907P991Q019P406O061M601
50073I29381L494K604J725R48K17q85k488l986m708m799n036n900p147q152q479
50058H86789q109p294o201m824l333k233j825j676j073R6J419K764M337N927O929
50043H71693P337P970R291J0679J1366J1529J1874J2576J3181J3208J2395J0744
50031A003843Q774P335O766O584O369O439P114P923Q205Q067Q080Q408Q939R863
$$ plain form
50123 1408523 1441375 1468261 1486941 1496032 1494834 1483322 1462471 1434174 1400477 1362944 1322861 1281755
50111 1281755 1241340 1202970 1167394 1134978 1105864 1079884 1056668 1035973 1017666 1001231 985595
50100 985595 969798 953722 937957 923039 909043 895828 883379 871944 862004 854048 848196 844174
50088 844174 841913 841968 844906 850359 857127 864278 871690 879461 887396 895303 903294 911313 918719 924780 929381
50073 929381 932875 935479 937204 938152 938369 937484 934996 931010 926302 921503 916467 910567 903420 895268 886789
50058 886789 878680 871386 865185 860361 857028 854795 852970 851294 850221 850317 851736 854500 858837 864764 871693
50043 871693 879030 887000 896291 906970 918336 929865 941739 954315 967496 980704 993099 1003843
50031 1003843 1012617 1019952 1026718 1033302 1039671 1046110 1053224 1061147 1069352 1077419 1085499 1093907 1102846 1112709
50017A112709J1357J3024J4383J5507J6344J5916J3319R310N815L855L016K819
50005A237374L307M061L805J575k532q034j4537k1144k6360k9217k9848k8656
49993A089794k5824k2175j9436j8676j9055j8974j7997j6836j5920j4998j3993
49982H85910j3336j3418j4216j5491j6838j7622j7392j6391j5281j4427j3721
49971G17777j2919j1805j0236q446p102o596o433n810m719l915l865m208m359
49958F27364m188l830l194j966j06J887L367M324N595P953J1007J3428J4385J4247
49944F90273J3633J2431J0268P526N162L704L020K799K684K017J98k633n804q900
49930G36378j1889j4490j6146j6672j6366j5368j3527j1069q783p131n766m232
$$ plain form
50017 1112709 1124066 1137090 1151473 1166980 1183324 1199240 1212559 1221869 1227684 1231539 1234555 1237374
50005 1237374 1240681 1244742 1248547 1250122 1247590 1239556 1225019 1203875 1177515 1148298 1118450 1089794
49993 1089794 1063970 1041795 1022359 1003683 984628 965654 947657 930821 914901 899903 885910
49982 885910 872574 859156 844940 829449 812611 794989 777597 761206 745925 731498 717777
49971 717777 704858 693053 682817 674371 667269 660673 654240 648430 643711 639796 635931 631723 627364
49958 627364 623176 619346 616152 614186 614080 615967 619334 623658 629253 637206 648213 661641 676026 690273
49944 690273 703906 716337 726605 734131 739293 742997 746017 748816 751500 753517 753715 751082 745278 736378
49930 736378 724489 709999 693853 677181 660815 645447 631920 620851 612068 604937 599171 594939
49918E94939k679j463n31L08R13J091J115J368J710J715J507J736K733M114N379
49903F13955O443P479Q503R417J0220J1000J1785J2505J2964J2813J1791J0003
49891G38878P801N352K643k7k036l181m137n689p772r686j1034j1920j2368j2291
$$ plain form
49918 594939 592260 590797 590266 590574 591487 592578 593693 595061 596771 598486 599993 601729 604462 608576 613955
49903 613955 620398 627877 636380 645797 656017 667017 678802 691307 704271 717084 728875 738878
49891 738878 746679 752031 754674 754647 752611 749430 745293 739604 731832 722146 711112 699192 686824 674533
$$ [...]
##END NTUPLES=NMR SPECTRUM
##END=
