
##TITLE=AC1323_SBUAH12152_6535549_3MPLV89FiF
##JCAMPDX= 6.0         $$ Bruker NMR JCAMP-DX V2.0
##DATA TYPE= NMR SPECTRUM
##DATA CLASS= NTUPLES
##ORIGIN= BRUKER
##OWNER= Administrator
$$ 1.72 TOPSPIN		Version 2.1
$$ 2012-12-14 03:48:30.513 -0500  Administrator@X
$$ Compression mode = diff/dup
##.OBSERVE FREQUENCY= 400.02188249412
##.OBSERVE NUCLEUS= ^1H
##.ACQUISITION MODE= SIMULTANEOUS (DQD)
##.ACQUISITION SCHEME= undefined
##.AVERAGES= 8
##.DIGITISER RES= 22
##SPECTROMETER/DATA SYSTEM= spect
##.PULSE SEQUENCE= zg30
##.SOLVENT NAME= COFFEE_meoh
##.SHIFT REFERENCE= INTERNAL, COFFEE_meoh, 1, 14.98509
##AUDIT TRAIL= $$ (NUMBER, WHEN, WHO, WHERE, PROCESS, VERSION, WHAT)
$$ ##TITLE= Audit trail, TOPSPIN		Version 2.1
$$ ##JCAMPDX= 5.01
$$ ##ORIGIN= Bruker BioSpin GmbH
$$ ##OWNER= Administrator
$$ $$ E:\/data/COFFEE/nmr/AC1323_SBUAH12152_6535549_3MPLV89FiF/20/pdata/1/auditp.txt
$$ ##AUDIT TRAIL=  $$ (NUMBER, WHEN, WHO, WHERE, PROCESS, VERSION, WHAT)
(   1,<2012-12-14 03:48:22.263 -0500>,<Administrator>,<X>,<go>,<TOPSPIN 2.1>,
      <created by zg
	started at 2012-12-14 03:47:15.356 -0500,
	POWCHK enabled, PULCHK disabled,
       configuration hash MD5:
       86 BA 57 50 F2 9D 5C 9B 26 00 A9 28 5F 66 2E 89
       data hash MD5: 64K
       B0 5B CA 08 92 D9 7B 73 9C E3 BC D1 03 BD DB 55>)
(   2,<2012-12-14 03:48:25.372 -0500>,<Administrator>,<X>,<proc1d>,<TOPSPIN 2.1>,
      <Start of raw data processing
       efp LB = 0 FT_mod = 6 PKNL = 1 PHC0 = 0 PHC1 = 0 SI = 32K 
       data hash MD5: 32K
       38 89 95 6C F5 EA 19 29 50 F3 7D 31 02 F3 46 AE>)
(   3,<2012-12-14 03:48:25.856 -0500>,<Administrator>,<X>,<proc1d>,<TOPSPIN 2.1>,
      <pk PHC0 = 98.97583 PHC1 = 0 
       data hash MD5: 32K
       77 4D B2 34 BB 7B 9E 5B 91 1A 17 48 B9 73 A5 F0>)
(   4,<2012-12-14 03:48:26.091 -0500>,<Administrator>,<X>,<proc1d>,<TOPSPIN 2.1>,
      <abs ABSG = 1 
       data hash MD5: 32K
       06 11 8A 0C AD 07 E7 DB 9E C2 C3 5A 43 0C 57 C5>)
(   5,<2012-12-14 03:48:26.231 -0500>,<Administrator>,<X>,<proc1d>,<TOPSPIN 2.1>,
      <abs ABSG = 2 
       data hash MD5: 32K
       DB BF 30 FE 28 4E A1 97 58 81 A0 57 0D A8 9E A3>)
(   6,<2012-12-14 03:48:26.372 -0500>,<Administrator>,<X>,<proc1d>,<TOPSPIN 2.1>,
      <abs ABSG = 3 
       data hash MD5: 32K
       26 57 C0 93 92 B3 02 BD 5E 78 05 26 7C 3E CF 8E>)
(   7,<2012-12-14 03:48:26.513 -0500>,<Administrator>,<X>,<proc1d>,<TOPSPIN 2.1>,
      <abs ABSG = 4 
       data hash MD5: 32K
       63 AE 80 76 95 E4 B3 2E 65 02 D5 DA FE 15 8C CE>)
(   8,<2012-12-14 03:48:26.669 -0500>,<Administrator>,<X>,<proc1d>,<TOPSPIN 2.1>,
      <abs ABSG = 5 
       data hash MD5: 32K
       28 9E 70 4C 23 1F 37 1A 86 6D 9D 6C F2 53 8F 4C>)
$$ ##END=
$$ 
$$ $$ hash MD5
$$ $$ 26 E8 EF 8D 58 4A C0 0D 82 C8 5B 3C F3 6B 8C 24
##$RELAX= 
##$RELAX= 
##$RELAX= 
##$RELAX= 
##$RELAX= 
##$RELAX= 
##$RELAX= 
$$ Bruker specific parameters
$$ --------------------------
##$DU= <E:\>
##$EXPNO= 20
##$NAME= <AC1323_SBUAH12152_6535549_3MPLV89FiF>
$$ [...]
150 150 150 150 150 150 150 150
##$TP07= 0
##$TPNAME0= <>
##$TPNAME1= <>
##$TPNAME2= <>
##$TPNAME3= <>
##$TPNAME4= <>
##$TPNAME5= <>
##$TPNAME6= <>
##$TPNAME7= <>
##$TPOAL= (0..7)
0.5 0.5 0.5 0.5 0.5 0.5 0.5 0.5
##$TPOFFS= (0..7)
0 0 0 0 0 0 0 0
##$TUNHIN= 0
##$TUNHOUT= 0
##$TUNXOUT= 0
##$USERA1= <user>
##$USERA2= <user>
##$USERA3= <user>
##$USERA4= <user>
##$USERA5= <user>
##$V9= 5
##$VALIST= <valist>
##$VCLIST= <CCCCCCCCCCCCCCC>
##$VD= 0
##$VDLIST= <DDDDDDDDDDDDDDD>
##$VPLIST= <PPPPPPPPPPPPPPP>
##$VTLIST= <TTTTTTTTTTTTTTT>
##$WBST= 1024
##$WBSW= 4
##$XGAIN= (0..3)
0 0 0 0
##$XL= 0
##$YL= 0
##$YMAX_a= 622338
##$YMIN_a= -531617
##$ZGOPTNS= <>
##$ZL1= 120
##$ZL2= 120
##$ZL3= 120
##$ZL4= 120
##$ABSF1= 14.98509
##$ABSF2= -5.573092
##$ABSG= 5
##$ABSL= 3
##$ALPHA= 0
##$AQORDER= 0
##$ASSFAC= 0
##$ASSFACI= 0
##$ASSFACX= 0
##$ASSWID= 0
##$AUNMP= <proc_prof1d_extract_pilot.lims>
##$AXLEFT= 0
##$AXNAME= <>
##$AXNUC= <1H>
##$AXRIGHT= 0
##$AXTYPE= 0
##$AXUNIT= <>
##$AZFE= 0.1
##$AZFW= 0.1
##$BCFW= 0
##$BC_mod= 0
##$BYTORDP= 0
##$COROFFS= 0
##$CY= 15
##$DATMOD= 1
##$DC= 0
##$DFILT= <>
##$DTYPP= 0
##$F1P= 0
##$F2P= 0
##$FCOR= 0.5
##$FTSIZE= 32768
##$FT_mod= 6
##$GAMMA= 0
##$GB= 0
##$INTBC= 1
##$INTSCL= 1
##$ISEN= 128
##$LB= 0
##$LEV0= 0
##$LPBIN= 0
##$MAXI= 10000
##$MC2= 0
##$MEAN= 0
##$ME_mod= 0
##$MI= 0
##$NCOEF= 0
##$NC_proc= -8
##$NLEV= 6
##$NOISF1= 0
##$NOISF2= 0
##$NSP= 0
##$NTH_PI= 0
##$NZP= 0
##$OFFSET= 14.98509
##$PC= 1
##$PHC0= 98.97583
##$PHC1= 0
##$PH_mod= 1
##$PKNL= yes
##$PPARMOD= 0
##$PPDIAG= 0
##$PPIPTYP= 0
##$PPMPNUM= 2147483647
##$PPRESOL= 1
##$PSCAL= 4
##$PSIGN= 0
##$PYNMP= <proc.py>
##$REVERSE= no
##$SF= 400.02
##$SI= 32768
##$SIGF1= 0
##$SIGF2= 0
##$SINO= 400
##$SIOLD= 32768
##$SPECTYP= <>
##$SREGLST= <1H.CDCl3>
##$SSB= 0
##$STSI= 32768
##$STSR= 0
##$SW_p= 8223.68421052631
##$SYMM= 0
##$S_DEV= 0
##$TDeff= 65536
##$TDoff= 0
##$TI= <>
##$TILT= no
##$TM1= 0
##$TM2= 0
##$TOPLEV= 0
##$USERP1= <user>
##$USERP2= <user>
##$USERP3= <user>
##$USERP4= <user>
##$USERP5= <user>
##$WDW= 1
##$XDIM= 32768
##$YMAX_p= 473877709
##$YMIN_p= -728742
##$CURPLOT= <Network HP LaserJet P1505>
##$CURPRIN= <$Network HP LaserJet P1505>
##$DFORMAT= <normdp>
##$LAYOUT= <+/1D_H.xwp>
##$LFORMAT= <normlp>
##$PFORMAT= <normpl>
##$SURQMSG= 1
$$ End of Bruker specific parameters
$$ ---------------------------------
##NTUPLES= NMR SPECTRUM
##VAR_NAME=  FREQUENCY,     SPECTRUM/REAL,   SPECTRUM/IMAG
##SYMBOL=    X,             R,               I
##VAR_TYPE=  INDEPENDENT,   DEPENDENT,       DEPENDENT
##VAR_FORM=  AFFN,          ASDF,            ASDF
##VAR_DIM=   32768,         32768,           32768
##UNITS=     HZ,            ARBITRARY UNITS, ARBITRARY UNITS
##FACTOR=    0.250966925370066, 1,           1
##FIRST=     8223.43324360094, -136173,      -139948
##LAST=      0,             88137,           -41851
##MIN=       0,             -728742,         0
##MAX=       8223.43324360094, 473877709,    0
$$ Real data points
##PAGE= N=1
##DATA TABLE= (X++(R..R)), XYDATA
$$ [...]
19569A1051c8052H576d23150b08130g4787C8538h1491A9693i5062c9354l4863
19558g4217b4945j51473b068j2635j66825j05019g4814l41169A81274a72604E3756
19546B79787b44694a01627l70466C5732a76032j02901B40455b01584B13001B3465
19535G3493L6447a27146b4929n054q3994A19159L1246g6380F5247a82010l722
19524a85732L0495C18007A18991a36886I8242a55622B0472a18345A97593a91595
19513b30209J5764E6295J82817f9525e077k75439b0546A65142b82711A60690n8145
19502A02545a46298f2490o5539D6854l168c19350i4943d6477q1845o143A26364
19490i0151q5687A89468G879e86171b16627A20657K54053b21668b0985A00891
$$ y = [11051, -38052, 8576, -423150, -208130, -74787, 38538, -81491, 19693, -95062, -39354, -74217, -24945, -176418, -2068, -14703, -181528, -286547, -74814, -415983, 181274, -172604, 53756, 279787, -244694, -101627, -472093, 35732, -176032, -278933, 240455, -201584, 213001, 23465, 73493, 109940, -127146, -24929, -29983, -113977, 119159, 150405, -76380, 65247, -182010, -185732, -155237, 318007, 118991, -136886, 98242, -155622, 20472, -118345, 197593, -191595, -230209, -214445, 56295, 239112, -69525, -5077, -280516, -20546, 165142, -282711, 160690, 102545, -146298, -62490, -128029, 46854, 43686, -319350, -94943, -46477, -128322, -134465, 126364, -90151, -175838, 189468, 7879, -586171, -216627, 120657, 374710, -221668, -20985, 100891]
19479f3734b2026c031l26463g446K910k28145B09821F1796B545e591C18694j15339
19467B03355e6254A4693a65457A72723J58854E3424a4025o9225d1409C87186b57503
19455B9969c4805A50447a93630C8334a27789j822C03883a04341A74349a23560
19444a39760A25211b9127q8979M0931k5253A46103l3779M9233a37545q4681M4356
19433a77870J8285f8650j06732L5046K8268n4372e3950B25309h3782o1676O7176
19422g8282F5757b80190A16235a47216e0999k29478j79361C2695b81428h8283
19411b48793i7546I5498b9023A30744b71572D1156a45364j41169a00958a1526
19400a62235d5985j9918A70148J04641I1150J22820n7714b32046L6945D654b17356
$$ y = [-63734, -22026, -3031, -329494, -7446, -4536, -232681, 209821, 61796, 2545, -5591, 318694, 203355, -56254, 14693, -165457, 172723, 331577, 53424, -14025, -83250, -41409, 387186, -257503, 29969, -34805, 150447, -193630, 38334, -127789, -129611, 303883, -104341, 174349, -123560, -139760, 125211, -29127, -118106, -77175, -102428, 146103, 112324, 161557, -137545, -222226, -177870, -159585, -68650, -175382, -140336, -112068, -166440, -53950, 225309, -83782, -145458, -78282, 65757, -280190, 116235, -147216, -50999, -280477, -459838, 32695, -281428, -88283, -248793, -97546, 95498, -29023, 130744, -271572, 41156, -145364, -286533, -100958, -11526, -162235, -45985, -65903, 170148, 274789, 91150, 213970, 156256, -232046, -195101, 4654, -217356]
19388a4076m32735A67093c51556k5204d2343k48010h0974G5153K44567H8529b0384
19376d5862I054R1297a42203l5761K9264j2459k29012b5527l06660e0467r4016
19365a44483C48173d2527D2193A4683b69890A33201k8705b87560k897J05755c6814
19353A28788g91l30389E9250J63594B9136b35143h7562A11478c5578j23367D9204
19341a36900c5714j01211n201E9954a78911l8224A59082d2849B49608b76900B6041
19329a99925d3343j49845k30394J60269L2309J04797F3946l1422P5115g9278E9079
19317g4097K4393j32320G7997a3011p4541D1392J8985a23414j9289j13029i6417
19305a99781B9062c75222A51233c26644j9480F540d9987k55660B06243a24024
$$ y = [-14076, -446811, 167093, -351556, -376760, -42343, -290353, -80974, 75153, 319720, 88529, -20384, -45862, 9054, 100351, -142203, -177964, -148700, -161159, -390171, -25527, -332187, -50467, -144483, 348173, -42527, 42193, 14683, -269890, 133201, 104496, -287560, -290457, -184702, -36814, 128788, -791, -331180, 59250, 222844, 29136, -235143, -87562, 111478, -35578, -158945, 49204, -136900, -35714, -136925, -142126, 59954, -178911, -217135, 159082, -42849, 249608, -276900, 26041, -199925, -43343, -193188, -423582, -263313, -231004, -126207, 63946, 32524, 107639, -79278, 59079, -74097, -49704, -182024, 77997, -13011, -87552, 41392, 60377, -123414, -142703, -255732, -96417, -199781, 29062, -375222, 151233, -326644, -346124, 6540, -49987, -305647, 206243, -124024]
19294h8300j93062A62485a88631J0330g7485A28579b00613Q0600M7145j27467
19284b00335A82153c15358C8395c1592n6462b4556j08345j88744D7341J51496
19274A98837c26956i5382j60842D0360J8396B2784a75494l9949k49448K30490
19264b34401P7197M6233M7255F5547P7725i4682k3553K1646l0826l1882g2677
19252E8925K5807a80054Q0066j31190B45456A13616b2171l77753J75662B080K25714
19241B27794C6153P4119b65019B22595b58902l4350A66933A7398c5858l1405A0837
19229b54886A51768A6247c31388F5887K3752d5457m5265A10816B2117h5595j27458
19218b13053E2958g072j51847l96494A4504i2366B5147i0121j78736K3761B4767
$$ y = [-88300, -281362, 162485, -188631, -178301, -77485, 128579, -200613, -120013, -72868, -200335, 182153, -315358, 38395, -31592, -88054, -24556, -132901, -321645, 47341, 198837, -326956, -95382, -256224, 40360, 58756, 22784, -175494, -215443, -464891, -234401, -157204, -110971, -63716, 65547, 143272, -94682, -118235, -96589, -127415, -159297, -72677, 58925, 84732, -180054, -99988, -231178, 245456, 113616, -22171, -399924, -224262, 2080, 227794, 36153, 110272, -265019, 222595, -258902, -293252, 166933, 17398, -35858, -67263, 10837, -254886, 151768, 16247, -331388, 65887, 89639, -45457, -90722, 110816, 22117, -85595, -213053, 52958, -7072, -158919, -555413, 14504, -92366, 25147, -90121, -268857, -245096, 24767]
19206d14474A90727f9843k9388c9701o9257a5874j5082k9213c0053q9569K6591
19195i3031D80646d5941k91506d7900B56914a36912G3609i5557j0677p9722B07620
19183b7720o6716d1961k14396j3662f9341m7972C2820L36246c4627A46002G0790
19171A43943G504b31879C40632A04381m826J53650C7557b26254A9766c04407f7519
19159a66175J7996C9686A326J63891b08481n1299P7702F0968f8202C9500a34230
19147a13096C1347a00924A20761B4260M0177d23251a28279J1158A71912i294m8699
19136e7993j02433G0490i1247j8026F8220K6345J208a06586B4880a87956I4482
19124b91497J25420K3079j73143B3888a38851a5845o6059F3236k8576M4190b49444
$$ y = [-414474, 190727, -69843, -99231, -39701, -108958, -15874, -30956, -60169, -30053, -119622, -93031, 480646, -45941, -337447, -47900, 256914, -136912, 73609, -95557, -106234, -185956, 207620, -27720, -94436, -41961, -256357, -270019, -69341, -117313, 32820, 369066, -34627, 146002, 70790, 143943, 7504, -231879, 340632, 104381, 99555, 253205, 37557, -226254, 19766, -304407, -67519, -166175, -148179, 39686, 1326, 165217, -208481, -259780, -182078, 60968, -68202, 39500, -134230, -113096, 31347, -100924, 120761, 24260, 64437, -423251, -128279, -117121, 171912, -9294, -57993, -160426, 70490, -91247, -109273, 68220, 94565, 95773, -106586, 24880, -187956, 94482, -291497, -166077, -142998, -316141, 23888, -138851, -15845, -81904, 63236, 34660, 78850, -249444]
19112B9559f3716o880m2651D8881O1319g5469m758o7971M2327e363A16374K26011
19100C42385a24106l8707H0922j5545a37601M7879A37679A9747J02387A2890a49657
19088F2612k7055J42612d470A41345i0630B13376c6890p7651j51575f4235A49314
19076B10156h5504D66443A1630a13752B83510b04807e8079k45392A61604a57985
19065A06810i356k09937k1853K0112k55524b04449j80925c3346l4227l273F9173
19053B43829j15347J45769a33172j12181f0075A4733c16173C1045L79100a58415
19042H7153C8968f372l50315e0296A41211h7166A57249d6088j45837A30290b8744
19030A83163K45371A49023h0119A18296p171i657m15886A30475b82183b3607A33583
$$ y = [29559, -63716, -70596, -113247, 48881, 110200, -75469, -80227, -148198, -105871, -5363, 116374, 342385, -124106, -162813, 80922, 65377, -137601, -89722, 137679, 19747, 122134, 12890, -149657, 62612, 35557, 178169, -4470, 141345, -90630, 213376, -36890, -114541, -266116, -64235, 149314, 210156, -85504, 466443, 11630, -113752, 283510, -204807, -58079, -303471, 161604, -157985, 106810, -9356, -219293, -241146, -221034, -476558, -204449, -385374, -33346, -67573, -70846, 69173, 243829, 128482, 274251, -133172, -245353, -60075, 14733, -316173, 31045, 410145, -158415, 87153, 38968, -6372, -356687, -50296, 141211, -87166, 157249, -46088, -191925, 130290, -28744, 183163, 428534, 149023, -80119, 118296, 111125, -9657, -425543, 130475, -282183, -23607, 133583]
19018A30854O5492h2101B51578a14784C866e4148Q530l87446d1675B76445c02686
19006h6017L2838j19388j2319m7436e9176B8592i828r486j91741A18092a56099
18994A08472E0750a47794B0253J28468a3238j16139C026c6261F2566A2549a04770
18982b44542A37992a84793g163l96994a9133l40657R1592c9572B27758j13328
18972A14430c74754J77046i1613B00769b25786A34953c9772F1897L3859a4178
18961c65857c1172j38416d7983m57739a48868j23750B31917a2734m4155r5908
18951a52797E1881j2990f5385j52569h9898B05250h2580J7366j0805G8121b16664
18939f6769a6456A80487d94307c2318o3046j7249C2140J12361b8458q5660j10280
$$ y = [130854, 196346, -82101, 251578, -114784, 3866, -54148, -45618, -433064, -41675, 276445, -302686, -86017, -53179, -172567, -184886, -232322, -59176, 28592, -9828, -19314, -211055, 118092, -156099, 108472, 50750, -147794, 20253, 148721, -13238, -129377, 3026, -36261, 62566, 12549, -104770, -244542, 137992, -184793, -7163, -404157, -19133, -359790, -268198, -39572, 227758, 114430, -374754, -197708, -91613, 200769, -225786, 134953, -39772, 61897, 95756, -14178, -365857, -31172, -169588, -47983, -505722, -148868, -272618, 231917, -12734, -56889, -152797, 51881, 38891, -65385, -217954, -89898, 205250, -82580, -65214, -76019, 78121, -216664, -66769, -16456, 180487, -494307, -32318, -95364, -112613, 32140, 144501, -28458, -114118, -224398]
18928b24398E5192b22694r8268R5919I1137g1244K5295m11850E7299c8965h265
18916A67372o8197a37385A8671G523c6978A15503a20307j50520A57162c11970
18905A22953b2161G7826b9784B86543E8895m347J28984b43520C9396d5413A57670
18893a41939C00950D9688N409A7234g5344j02625j77284B20770h8756n5904j37146
18882b81806B0018J19013M836a10739d7722k02043d7772k84133M026b0715E6836
18870e4713E0743i4916D5664b57235j2185a12279j74712A55048c30453C39523
18859I4234j0060j2087K09228D7975Q9027g3405j15789I4089K1614a19829E8769
18847C5588D232b40072A50685J57908C8770A4066b19686A62751E5910L0944g8333
$$ y = [-224398, 55192, -222694, -320962, -225043, 91137, -71244, -45949, -457799, 57299, -38965, -8265, 167372, 99175, -137385, 18671, 7523, -36978, 115503, -120307, -270827, 157162, -311970, 122953, -22161, 77826, -29784, 286543, 58895, 54548, 183532, -243520, 39396, -45413, 157670, -141939, 300950, 49688, 55097, 17234, -75344, -177969, -355253, 220770, -88756, -144660, -281806, 20018, 139031, 143867, -110739, -47722, -249765, -47772, -331905, -327879, -20715, 56836, -54713, 50743, -94916, 45664, -257235, -269420, -112279, -286991, 155048, -330453, 339523, 94234, 84174, 72087, 281315, 47975, 137002, -73405, -189194, 94089, 115703, -119829, 58769, 35588, 4232, -240072, 150685, 308593, 38770, 14066, -219686, 162751, 55910, 86854, -78333]
18835A11909I350b63720m0445J25989r9414A28412j7079i6143n5383A52081K6003
18824A78084J2732a29874a8524E6359c32164C5336f8189A17087f3745G043J42932
18813A49975a32316G1450a40932A61529L51020k02675B5791M9597O819b53889
18802H5896a18441C273J81837a3535j31946g809H4761O1064q643a76894f6420
18790d04171E870f7487A11870E0570b75444a14190j8930B9455a42944A50598a89251
18778a03131q9903B142e1247a3940j67045e7382p9654E5269M9088n1278c10961
18766b25217B30878F4043a8928l18257a35796B16381D4711i7946j22575H498b017
18754a13352H4618e0311l5486B92894A43111b44565l2607e7981l572m03393d3951
$$ y = [111909, 9350, -263720, -304165, -178176, -277590, 128412, 111333, -96143, -151526, 152081, 178084, 190816, -129874, -18524, 56359, -332164, 35336, -68189, 117087, -63745, 7043, 149975, -132316, 71450, -140932, 161529, 512549, 309874, 25791, 75388, 82207, -253889, 85896, -118441, 3273, 185110, -13535, -145481, -7809, 84761, 145825, 137182, -176894, -66420, -404171, 5870, -67487, 111870, 50570, -275444, -114190, -133120, 29455, -142944, 150598, -189251, -103131, -193034, 2142, -51247, -13940, -180985, -57382, -137036, 55269, 104357, 53079, -310961, -225217, 230878, 64043, -18928, -337185, -135796, 216381, 44711, -97946, -220521, 8498, -2017, -113352, 84618, -50311, -85797, 292894, 143111, -244565, -277172, -57981, -61553, -464946, -43951]
18742I0269b46753r9200A22422m5876k0082I451L78716i0830A17798J14053b8211
18730h7410D4056P9528c5009j57250A66677A9487g7809m7814e2271G6449c03421
18718a41476r0263A77254b86601c2125C25188K3187G6391b73325P3994Q9118c3976
18706A138a05496B2007a35665k44549J72599Q0882I8678a84523d3928j55603b3080
18694c05631B144h1238G2232c40762A70331K12963i0957j3933I7094N7479m0969
18683A13604c0836l66656b4140j71132f1867K6549D015h6759j69134f7501D468
18671c20911l6515a59103A86613b27383P4571q5924N8742A7330g2513I1708a10017
18659a43347A8991h3464J591J8468j65793A4569c5156k10458A1286h6191l7721
$$ y = [90269, -246753, -345953, 122422, 76546, 56464, 9451, 388167, -90830, 117798, 231851, -28211, -87410, 44056, 123584, -35009, -192259, 166677, 19487, -77809, -125623, -52271, 76449, -303421, -141476, -231739, 177254, -286601, -32125, 325188, 348375, 76391, -273325, -199331, -110213, -33976, 1138, -105496, 22007, -135665, -380214, -207615, -126733, 98678, -184523, -43928, -199531, -23080, -305631, 2144, -81238, 72232, -340762, 170331, 383294, -90957, -104890, 97094, 154573, 113604, -30836, -397492, -24140, -195272, -61867, -35318, 4015, -86759, -255893, -67501, 4468, -320911, -357426, -159103, 186613, -227383, -152812, -238736, -179994, 17330, -72513, 91708, -110017, -143347, 18991, -83464, -81873, -63405, -229198, 14569, -35156, -245614, 11286, -86191, -123912]
18648a23912B96109i137A72085b56652L9504f1885r0386B67864b15646A4052e2360
18636G0243a19293L9471k64178a2941A09231a99222m2002a11873A96552N8425
18626B54977b17901p5271a43523A1814a49194o4352C5528J00324a2112C41827
18615F0784e72603G8122B5721a88532A15793c90826A60388a00226j92649B21374
18604a87254g6209j87225B26820a59900k39406g5820F2848f4023A3654N833d39252
18592b73969A14696a0149m11372B7066J7042c0228H956L4872j0793a31326j16053
18581b47379J23371B1798J17848b10983B610b27584J06593p6870G7135c40237
18570I1736L87972A23302B2796J41267a90524m138D1724e9636j46597e1436b981
$$ y = [-123912, 296109, -9137, 172085, -256652, -217148, -61885, -152271, 267864, -215646, 14052, -52360, 70243, -119293, -79822, -344000, -12941, 109231, -199222, -241224, -111873, 196552, 254977, -217901, -293172, -143523, 11814, -149194, -213546, 35528, 135852, -12112, 341827, 60784, -572603, 78122, 25721, -188532, 115793, -390826, 160388, -100226, -292875, 221374, -187254, -76209, -263434, 226820, -159900, -399306, -75820, 62848, -64023, 13654, 19487, -439252, -273969, 114696, -10149, -421521, 27066, 44108, -30228, 8956, 43828, 33035, -131326, -247379, -124008, 21798, 139646, -210983, 2610, -227584, -120991, -197861, 77135, -340237, 91736, 479708, 123302, 22796, 164063, -190524, -194662, 41724, -59636, -206233, -51436, -2981]
18558E1938a19433A86716C018a22056A39506a21130l4990g4357A4526J8418a07375
18546C38936c04099B32788a99975G7514a18212e7910r214r1174A6494J90109a3132
18534a12476D4143b31068b7976A26984a21766c2274j62991A95762a51124c9074
18523e9479j79171A17987b35998P8066j2610B93931c59425A44679k2758b15089
18512A63660a53782M9756B61190d4707H4023b08748f9320j66484d1289j55142
18502a96431b5359m25171a7924n9145A47222a55068f6454H1571a7405j34748A86083
18490b4504k03479A5546K02426m6188a82355C6841a12608A93523b02449A40884
18479b59388A33860a69608O2395C00724b30386A66366a31046o2949D6241g4087
$$ y = [51938, -119433, 186716, 3018, -122056, 139506, -121130, -156120, -74357, 14526, 32944, -107375, 338936, -304099, 232788, -199975, 77514, -118212, -57910, -67124, -158298, 16494, 206603, -13132, -112476, 44143, -231068, -27976, 126984, -121766, -32274, -195265, 195762, -151124, -39074, -59479, -238650, 117987, -235998, -157932, -170542, 293931, -359425, 144679, 121921, -215089, 163660, -153782, -104026, 261190, -44707, 84023, -208748, -69320, -235804, -41289, -196431, -25359, -450530, -17924, -77069, 147222, -155068, -66454, 81571, -17405, -152153, 186083, -24504, -227983, 15546, 217972, 171784, -182355, 36841, -112608, 193523, -202449, 140884, -259388, 133860, -169608, -107213, 300724, -230386, 166366, -131046, -193995, 46241, -74087]
18468i6424K0766j17686A66485a6729j59244h3284A161J30152J46343a23736E91
18456e7328p1819L2672A03837c03313a41301A1967b04552f1369q6947E1247a53488
18444a82429P502b0291P31l06241a3288q1862K0037B6513e7973q8034j61504J39367
18432a68144j12981F6380g8263q1034e0118J0837E6834K28648j05224F0531o901
18421E3630c5320M58j52179i1783m9671k3704e8533j39555i4717H2503l5821a09625
18408a85580L2002B13766a09716N2405A47615C7768j0335a75486D42530B0404
18397h7045C74J38585a33593E0079N6409d52726i9588o6154A46601C3427J08250
18386A41677i4329i431B9753L0505L4467a51015H7428b248j95603d3031A40443
$$ y = [-96424, -75658, -193344, 166485, -16729, -175973, -83284, 1161, 131313, 277656, -123736, 591, -57328, -129147, -96475, 103837, -303313, -141301, 11967, -204552, -61369, -148316, 51247, -153488, -182429, -174927, -20291, -19560, -325801, -13288, -95150, -75113, 26513, -57973, -146007, -307511, -168144, -281125, 66380, -78263, -159297, -50118, -39281, 56834, 285482, 180258, 60531, 53630, -35320, -34862, -187041, -91783, -141454, -165158, -58533, -198088, -94717, 82503, 46682, -109625, -185580, -153578, 213766, -109716, -57311, 147615, 37768, 27433, -175486, 442530, 20404, -87045, 374, 138959, -133593, 50079, 106488, -452726, -99588, -165742, 146601, 33427, 141677, -94329, -9431, 29753, 60258, 94725, -151015, 87428, -2248, -197851, -43031, 140443]
18374H0913J83121A27957c785l39189b4269j28920l6689F6110J60059q8378C2819
18362a16275G0853h0036G7805K1967k9955D472a54095N1886j21854H1656g9324
18350I0247c30429A16908e9267k2546k77112A15776K70995d25292J25134c7788
18339a31659B54230d5193F6421P7222B2312e33710b03304k2253H8329a73611M8704
18328a24907j32277J7850H7417c19044a31652D77821h2880k06172j29680D8529
18317a7131j60853r660j16516G9626a41144J0553C4767K89011l0693g3924G4698
18305a37477o4614Q0494A68687c1127B12823b97257a29842r1210I1216a77099
18294b43285a05855l39534C73414b60374i5594K5386K7925j75233C60697A20402
$$ y = [80913, 264034, 127957, -3785, -342974, -24269, -153189, -189878, 66110, 226169, 137791, 32819, -116275, 70853, -80036, 77805, 99772, 69817, 4472, -154095, -102209, -224063, 81656, -79324, 90247, -330429, 116908, -59267, -81813, -358925, 115776, 386771, -425292, -300158, -37788, -131659, 254230, -45193, 66421, 143643, 22312, -533710, -203304, -225557, 88329, -173611, -124907, -257184, -239334, 87417, -319044, -131652, 477821, -82880, -289052, -418732, 48529, -17131, -177984, -187644, -304160, 79626, -141144, -130591, 34767, 323778, 293085, -73924, 74698, -137477, -202091, -121597, 168687, -31127, 212823, -297257, -129842, -221052, 91216, -177099, -243285, -105855, -445389, 373414, -260374, -95594, -70208, -42283, -217516, 360697, 120402]
18283b06231p7365C9067c18077J8043B43764d18348A92661b15643Q5153B11174
18272i9879c0466A98477c26115a6198r0733q2449L7077I5940a59555B34638n8240
18261A76398C2802A1239J54303e886j27798j69234a3424l12695F5573c9256A95383
18249A23068a09612q4758B2119F763f6238B30825L7320a53370N4683j23810c734
18237b97541C18950d4362A64390a99824A63762n1000a3243d761m0806a1325A40685
18225c44115B2901F899M3058K008a53157H1377f6728j07211j47008N5026I5550
18213a5036q4160k66555A10187b09812j49437R7550d8601j27702j86409B78912
18202a24968A66631R8375e9592A029J17763J88671a47810B71496K6615a91845
$$ y = [-206231, -283596, 39067, -318077, -300034, 243764, -418348, 192661, -215643, -130490, 211174, -99879, -30466, 198477, -326115, -16198, -106931, -189380, -152303, 95940, -159555, 234638, 176398, 32802, 11239, 165542, -5886, -133684, -302918, -13424, -326119, 65573, -39256, 195383, 123068, -109612, -194370, 22119, 6763, -66238, 230825, 268145, -153370, -98687, -222497, -3734, -297541, 318950, -44362, 164390, -199824, 163762, 112762, -13243, -4761, -45567, -11325, 140685, -344115, 22901, 6899, 49957, 51965, -153157, 81377, -66728, -173939, -320947, -265921, 95550, -15036, -99196, -365751, 110187, -209812, -359249, -261699, -48601, -176303, -362712, 278912, -124968, 166631, 265006, -59592, 1029, 118792, 307463, -147810, 271496, 298111, -191845]
18191E20952h9237l09141a62477B04731a09589A697b17312N1532j0669m1409B6148
18179a12502G1915c53518H2936a38684M9775B06916e163F3381a53755B30550b02068
18167C22967C5337O6329a88464G1918a32193Q112q3116A83849b70533A94682o5396
18156A29286l6732J10311b38058A34784f6724F2076P7577c75222B11022a95500
18145g3443I6794a08770A78321c12368B04207b0100A54505e8314G3432d7349B18124
18133a32756A85031b95446q2635A43904g2265K7378B07717c53484B71470i8460
18122h0537A08048J60344a07287G57a25223J4437k29104A00986d1726H0503m086
18111G6417L9728b1037A32470O3327E4356K1771b63876M708m0400A67915b10841
$$ y = [520952, -89237, -398378, -162477, 204731, -109589, 1697, -217312, -165780, -176449, -217858, 26148, -112502, 71915, -353518, 82936, -138684, -88909, 206916, -5163, 63381, -153755, 230550, -202068, 322967, 35337, 101666, -188464, 71918, -132193, -124081, -207197, 183849, -270533, 194682, 129286, 92554, 202865, -238058, 134784, -66724, 62076, 139653, -375222, 211022, -195500, -73443, 96794, -108770, 178321, -312368, 204207, -20100, 154505, -58314, 73432, -47349, 218124, -132756, 185031, -295446, -378081, 143904, -72265, -44887, 207717, -353484, 271470, -98460, -80537, 108048, 268392, -107287, 757, -125223, -110786, -339890, 100986, -41726, 80503, 76417, 116145, -21037, 132470, 195797, 54356, 76127, -263876, -259168, -299568, 167915, -210841]
18099B3725f0118k93704B52836a23297l7584b5531F3330J2764c54527C1581a24212
18087d9153l28718D7083A9623f4268d538A18464b43085J15673h162j91963O1386
18076a38739A29564a0319A66766b78490J8630j73926a7593H0987J7193L7813b24401
18064b7389N874j62704E7780c51133a20001n1939h0157E6176a23970j9557n9298
18053b02825A03694a3281n3495m58806A35047a00032j54778h2775B38472d8346
18042B21362j10429a30464B29856B109b30801A4037E312R3243J45097a09189B58248
18030H904b37318e6606P726j58288A89318a47401f684F0530a43664A21187e8833
18018C583f6805A748R7551a04085g5A68195p0467g7659j11684D7114c58004A1427
$$ y = [23725, -60118, -353822, 252836, -123297, -160881, -25531, 63330, 76094, -354527, 31581, -124212, -49153, -377871, 47083, 19623, -64268, -4538, 118464, -243085, -127412, -8162, -200125, -138739, 129564, -10319, 166766, -278490, -259860, -433786, -17593, 80987, 98180, 135993, -224401, -27389, -21515, -184219, 57780, -351133, -120001, -171940, -80157, 56176, -123970, -143527, -202825, 103694, -13281, -66776, -525582, 135047, -100032, -254810, -82775, 238472, -48346, 221362, 110933, -130464, 229856, 2109, -230801, 14037, 5312, 98555, 243652, -109189, 258248, 8904, -237318, -56606, -48880, -207168, 189318, -147401, -6684, 60530, -143664, 121187, -58833, 3583, -66805, 1748, 99299, -104085, -75, 168195, 97728, -77659, -189343, 47114, -358004, 11427]
18005a73630L8542L6116B95152a215D7303J21694b85910J29181e1573j45362M4048
17994a52887O64N6593B50705A4631a40000E9087h4429j08862l3025A10470c134
17982I9390b14308P8331B19017g8552F5754b15142p2704B61865b65059D43742
17971b46965C25872f379D3167b25610l4865h8150M0484l8669I4831K04985b71801
17959a47385l34065J86553B13962b55833j17828J80821D6145L5804R0859E3831
17948a48123N9988j05029L666C4238J76144Q4040b5555m3823D2334b63508J13780
17937a49728F531a31539B24357g6937l1046a8773j45490n3247B2428a58115k32462
17926c90577A28354a75576j97664h3110A51710g5190q0442o948B2976a56895p9199
$$ y = [-173630, -135088, -98972, 295152, -1215, 47303, 168997, -285910, -156729, -51573, -196935, -152887, -152223, -95630, 250705, 14631, -140000, 59087, -84429, -193291, -226316, 110470, -3134, 99390, -214308, -135977, 219017, -78552, 65754, -215142, -287846, 261865, -265059, 443742, -246965, 325872, -6379, 43167, -225610, -260475, -88150, -47666, -86335, 94831, 299816, -271801, -147385, -481450, -294897, 213962, -255833, -373661, -192840, 46145, 81949, 172808, 53831, -148123, -88135, -193164, -189498, 34238, 210382, 294422, -25555, -69378, 42334, -263508, -149728, 6531, -131539, 224357, -76937, -107983, -18773, -164263, -217510, 22428, -158115, -390577, 128354, -175576, -373240, -83110, 151710, -75190, -155632, -162580, 22976, -156895, -236094]
17915b36094f6061C25082j12621a61838a0045o9328A47422b9877I4228e3730A99807
17903f9577C6813A6036N6587c01076a25879B08883c40535J36733C3119K27415
17893B60534c57136b5223k97569i281A21654a14106B07108a54824A21380b17962
17882I8K7023a1456E74210g8602j41941h776n42960a7341j64315l9101C54086
17870B2049L3330K0566N3314I886d4198a6185m3349B03517d4314r5276c9952k02429
17858b42381o2824c5313n5207r018j08873P9126C15752a8773A7229b49921P0106
17847a79815O7016B25930a38814A44825a29813A32092J8736J62183j40901b3997
17836b52262f8190C4084b65838Q827C00578A08687b2776A21630e8575C51336D2054
$$ y = [-236094, -66061, 325082, 212461, -161838, -10045, -79373, 147422, -29877, 94228, -53730, 199807, -69577, 36813, 16036, 72623, -301076, -125879, 208883, -340535, -203802, 33119, 260534, -357136, -25223, -322792, -9281, 121654, -114106, 207108, -154824, 121380, -217962, 98, 27121, -11456, 574210, -78602, -220543, -8776, -551736, -17341, -181656, -220757, 354086, 22049, 55379, 75945, 129259, 9886, -44198, -16185, -59534, 203517, -44314, -139590, -39952, -242381, -305205, -35313, -90520, -99538, -208411, -129285, 315752, -18773, 17229, -249921, -179815, -112799, 225930, -138814, 144825, -129813, 132092, 150828, 313011, 172110, -23997, -252262, -68190, 34084, -265838, -257011, 300578, 108687, -22776, 121630, -58575, 351336, 42054]
17824A51479L6058a39245L4356p9290O1475J4027D14763h962j59775D2113a82158
17812e0353j50222G6446I267a8875q2849A30107n5036J16715c1453k81216A58601
17800e5816n8398q6103P296B51643M0377j31652A541J0811J47454l3095a80805
17788A59367i8081k28605D9763J00361J74230a39494n6888P0586j0404K8953A55629
17776A85574j7993d17295e9821A1595K40066b87611B53507d1322C75029c7797
17765B09935f6338B58940i7766j24938A05763K91346B8724a04309A80825b9894
17754a6468j53459G1005j7723P1550a67682B0882b140I1731O1032a83391A44563
17742B74175C6743a31882B29145l0503c95047a18735k4725N3394L8625D660a05321
$$ y = [151479, 187537, -139245, -104889, -184179, -122704, -108677, 414763, -8962, -168737, 42113, -182158, -50353, -200575, 76446, 9267, -18875, -101724, 130107, 75071, 191786, -31453, -312669, 158601, -55816, -114214, -200317, -193021, 251643, 292020, 160368, 1541, 12352, 159806, 126711, -180805, 159367, -98081, -326686, 49763, 150124, 324354, -139494, -196382, -125796, -136200, -107247, 155629, 185574, 167581, -417295, -59821, 11595, 251661, -287611, 253507, -41322, 375029, -37797, 209935, -66338, 258940, -97766, -222704, 105763, 397109, 28724, -104309, 180825, -29894, -16468, -169927, 71005, 53282, 124832, -167682, 20882, -2140, 91731, 152763, -183391, 144563, 274175, 36743, -131882, 229145, 198642, -395047, -118735, -143460, -90066, -51441, 4660, -105321]
17730E579J16197i1681D51047j85398a88315a7892B9807a45715E0388Q2845a29283
17718A70101p8398l9512a062k26811A73731b32661A5127f7915k90433Q6756a24848
17706D07040b06351J1585B84370a68419G4717N1922m1783a92529B06074i8424
17695b73512A14864k5148c29303b9133A23138a8503j58115B82282c9935k22356
17685b62291A50444i6928C00582e6011j86373E3574K82319a09309R297d9172J6405
17674c2767k7504I8235a71250A96184b47217h1665j90051B20650a07774C47353
17663b85254B18513a11675B86801a60635a6766H5294J60563E458i0125B3038D895
17651F6567h7214B64K20141p2641K5360b40554A22967d791j87322g1771r8343
$$ y = [5579, 121776, -91681, 451047, 265649, -188315, -17892, 29807, -145715, 50388, 133233, -129283, 170101, 91703, 52191, -1062, -227873, 173731, -232661, 15127, -67915, -358348, -271592, -124848, 407040, -206351, -194766, 284370, -168419, 74717, 126639, 84856, -192529, 206074, -98424, -273512, 114864, 89716, -329303, -29133, 123138, -18503, -176618, 282282, -39935, -262291, 150444, -96928, 300582, -56011, -242384, 53574, 335893, -109309, -100012, -49172, -32767, -60271, 98235, -171250, 196184, -247217, -81665, -271716, 220650, -107774, 347353, -285254, 218513, -111675, 286801, -160635, -16766, 85294, 245857, 5458, -90125, 23038, 4895, 66567, -87214, 264, 220405, 147764, 173124, -240554, 122967, -4791, -192113, -71771, -170114]
17640a70114A06831m4884D358J20011h4183D8379b21029R7539B75692m2224D5229
17628i7372a0158j6087B48915j7765C3778h0663B07766a084k62753p928b4827
17616H1223a41536j96802j06958R2181B16770r1286F345J48714J6341I249K248
17605A1497J57234p0247g6726F4303J7743J5451b66162B22865I9817a3870r2681
17594a06551k02826c5141C80124C9071O284a10669k5738K2350C7590a25971H8213
17582c88618c5066j3578H8329l1886j7631O0372A9363L2650J14660G8927e5404
17570a3413B5045R9698J27475o7633K33400b1864q4594A09379a6117C7101J9759
17559E6860a3205r4591A87264M14414k57221a84626A72618M452o6449J05799i1344
$$ y = [-170114, 106831, 61947, 4358, 124369, -84183, 48379, -221029, -123490, 275692, 233468, 45229, -97372, -10158, -26245, 248915, 231150, 33778, -80663, 207766, -1084, -263837, -271765, -24827, 81223, -141536, -338338, -445296, -353115, 216770, 125484, 6345, 155059, 171400, 9249, 11497, 168731, 98484, -76726, 64303, 82046, 97497, -266162, 222865, 99817, -13870, -106551, -309377, -35141, 380124, 39071, 45355, -110669, -136407, -114057, 37590, -125971, 88213, -388618, -35066, -48644, 88329, 56443, 38812, 99184, 19363, 52013, 166673, 78927, -55404, -13413, 25045, 124743, 252218, 184585, 417985, -21864, -106458, 109379, -16117, 37101, 56860, -13205, -107796, 187264, 601678, 344457, -184626, 172618, 177070, 110621, 216420, -91344]
17547H0369J76077I0116a04358B19073a69960E1229K87197A01257C399M7608i8654
17535A63997c90176d2517C1412J16417a06981B84256a15488B8762N5946C3958
17524H6608a32072p7703k4031F9615L5849f380G8722M0072a30443E1720J26954
17513A78674b46404F80462B029a33040A7669c12729a48920A22301e6220C27147
17502G8202Q6138c03038b6305B41071a30073f071k9797j33927H0556b7029B79796
17490c35281A28263F2521c818n0300J3001B160b80214i0126A43170O6736e0298
17478B65755G8869a92530A97733h8426H8691J55986h472j60737D54996b98434
17467E62799A48539j4807Q2081j7279q6677J03563i8775A47759d4052B579J85678
$$ y = [80369, 256446, 90116, -104358, 219073, -169960, 51229, 338426, 101257, 3399, 51007, -98654, 163997, -390176, -42517, 31412, 147829, -106981, 284256, -115488, 28762, 84708, 33958, 86608, -132072, -209775, -233806, 69615, 105464, -6380, 78722, 118794, -130443, 51720, 178674, -246404, 680462, 2029, -133040, 17669, -312729, -148920, 122301, -56220, 327147, 78202, 164340, -303038, -26305, 241071, -130073, -6071, -35868, -169795, 80556, -27029, 279796, -335281, 128263, 62521, -3818, -54118, -41117, 2160, -280214, -90126, 143170, 209906, -50298, 265755, 78869, -192530, 197733, -88426, 88691, 244677, -8472, -169209, 454996, -298434, 562799, 148539, 133732, 215813, 198534, 111857, 215420, -98775, 147759, -44052, 2579, 188257]
17456A88257c743A93706n7254K26839O219A72468K60247j15674j43617J62521
17446C35945j61436K6032G2105J72381J48403F4642J82342I8003Q8331q3944J01193
17435B03583C6730f3214A71602K33152P5381c6562A91958D4659k0272K79942n2678
17424B51651p2997C7060J99535K86768j51968j72048K58397i375B66061J46584
17414D12645A96515h474A44248C3606J20869N5268j01849M4560e5238o3419A20024
17402A85942F3524N1623L6850D3756P0923P6852k1415B9600d8058C34068i2816
17390B45230q3536c1584E6704L41948A06031K01601r3791b22345h0419A5750J52025
17379A67775a44392A4022N6271c12638A69746L2741a22488J4020B44744m7526
$$ y = [188257, -3743, 193706, 136452, 363291, 369510, 172468, 432715, 317041, 173424, 335945, 174509, 200541, 72105, 244486, 392889, 64642, 246984, 98003, 186334, 102390, 203583, 36730, -63214, 171602, 404754, 480135, -36562, 191958, 44659, 24387, 304329, 251651, 178654, 37060, 236595, 523363, 371395, 199347, 457744, -9375, 266061, 412645, 196515, -8474, 144248, 33606, 154475, 209743, 107894, 152454, -55238, -118657, 120024, 185942, 63524, 115147, 151997, 43756, 114679, 191531, 170116, 29600, -48058, 334068, -92816, 245230, 161694, -31584, 56704, 398652, 106031, 307632, 213841, -222345, -80419, 15750, 167775, -144392, 14022, 70293, -312638, 169746, 202487, -122488, -108468, 244744, 197218]
17369A97218K4345i8739I5823J8332M4041I303Q6739a12548H7211g0671b6598
17357B52613D3601L9388J91195f2440C74498m7917E1587e9460A07069L25644b7791
17345C81299A58073o1297B861J08985h1822j26440Q1218E5320J95644m4967a39348
17333A13480J3232a250G4353l1772K15563C6272a18264D6496h8482A06734L39838
17322D46572a13322A41892g915A15562L01952G7196r237l997b02679A44708N0770
17311A95478c2227l9228q9609A81008K2457J09187n2188b1489r5956G2310n661
17300F6649Q3831N9036P3339I3458a6060A41353J48819j34039J78064b475B14031
17288e5969l5411p8698M4484E33465a5900A32582a26100h866j05740D1770J12806
$$ y = [197218, 221563, -98739, 95823, 114155, 158196, 9303, 96042, -112548, 87211, -70671, -26598, 252613, 43601, 82989, 274184, -62440, 374498, 326581, 51587, -59460, 107069, 432713, -27791, 381299, 158073, 96776, 2861, 111846, -81822, -208262, -127044, 55320, 250964, 205997, -139348, 113480, 126712, -1250, 74353, 42581, 258144, 36272, -118264, 46496, -88482, 106734, 446572, -113322, 141892, -7915, 115562, 417514, 77196, 67959, 63962, -202679, 144708, 195478, -32227, -71455, -161064, 181008, 203465, 312652, 260464, -21489, -117445, 72310, 66649, 150480, 209516, 282855, 93458, -16060, 141353, 290172, 156133, 334197, -2475, 214031, -55969, -91380, -170078, -125594, 533465, -15900, 132582, -126100, -8866, -114606, 41770, 154576]
17277A54576J06678C0530J62674c2754j51452h848p1623E7744h7387D06095j54248
17266B51847b1297m5469c1556C90865j83699m8454M07106A91518Q0432j16036
17256A55914J44793I292L12487j59664K54220p939a92064C51045q0728j9266o7001
17245A84050P2125r0299K1710o0621g8313D43026j79171E531O74079A04686a41868
17233b6264C48424I1746J01077D0491a0359B79392P8945I5914j9665a06350C10316
17221B82165j39409L79627B4762a63930B00589N270q2952n9374h8012G2847N27701
17210F00548A54830L09320a02449I8570R7915b31382A25392h5493A76848K45515
17200D22363m2915m2570j54770R6015Q4547A41486o3086J75022o6692f8542C11040
$$ y = [154576, 261254, 30530, 193204, -32754, -184206, -8848, -80471, 57744, -87387, 406095, 251847, -21297, -66766, -31556, 390865, 207166, 158712, 565818, 191518, 271950, 155914, 300707, 9292, 321779, 162115, 416335, 408396, -192064, 351045, 270317, 251051, 184050, 256175, 165876, 187586, 126965, -78313, 443026, 263855, 5531, 679610, 104686, -141868, -26264, 348424, 91746, 192823, 40491, -10359, 279392, 358337, 95914, 76249, -106350, 310316, 282165, 142756, 522383, 24762, -163930, 200589, 205859, 122907, 63533, -88012, 72847, 600548, 154830, 464150, -102449, 98570, 196485, -231382, 125392, -85493, 176848, 422363, 379448, 336878, 182108, 278123, 362670, 141486, 78400, 253422, 186730, -68542, 311040]
17188B28692m8506P6067A16304P3171Q1200q171r2730J46255p3272J41726j24473
17177B60010a65107G9347M85668L1888A89385J94884r3516J12848n6720o024A30
17165A81080p6117P03041a5978o2201E54675k64002k7637O7489J035L9522Q7918
17154D59000A80268a14919C47161C7242g0118C31625K63256k29219A15391N1342
17144A66733L02803A16958K36203E2188P1679K3695L19149A42123K3117Q7335
17134B52575J10547c7833C23556J78737A80399K8239H7606R4426Q5398K7275p2974
17123B21731L80983B10559I5677J34536b965B49295L566L9788K5841m841A20450
17111D80930J643j24392k0084A52954M73432B47138N29650B7226Q7159J60391
$$ y = [228692, 180186, 256253, 116304, 189475, 270675, 262504, 169774, 316029, 242757, 384483, 260010, -165107, 79347, 565015, 596903, 189385, 384269, 290753, 403601, 346881, 340857, 130, 181080, 104963, 808004, -15978, -78179, 554675, 290673, 263036, 330525, 331560, 371082, 459000, 180268, -114919, 347161, 37242, -70118, 331625, 594881, 365662, 115391, 166733, 469536, 116958, 353161, 52188, 123867, 147562, 466711, 142123, 165240, 252575, 363122, -37833, 323556, 502293, 180399, 208638, 87606, 182032, 267430, 294705, 221731, 602714, 210559, 95677, 230213, -2965, 249295, 252861, 292649, 318490, 313649, 120450, 480930, 482573, 358181, 338097, 152954, 626386, 247138, 776788, 27226, 114385, 274776]
17101B74776A30455M1955J93077j3674J24946j11343F9737b8339B72238M8562
17091C20800j437j04180o6090L02009j24720M2804j25860K64003C99J19536N15832
17080F35767j92895L5248j32906k0171J80587k16459N9038j57933J95036J5606
17070D00918j83379J47152j61189M62677H9389K09348j02119J82709o9554M33513
17060G43286C40424r7577J82088p7807L12965B46354M16375J41553C09251J35548
17050D44799R8237m9835A78923K1604P16425l63071n3114N5227k595j69004k2766
17039C61629J38314J4252A56334O11780l12716j53103K74951J91930k08812k09808
17029C50556L08621k22733Q4774k4702K05510j80946Q0648k1829j14889K13496
$$ y = [274776, 130455, 172410, 365487, 351813, 476759, 365416, 69737, -28339, 272238, 320800, 319363, 215183, 149093, 451102, 326382, 369186, 243326, 507329, 399, 119935, 635767, 442872, 478120, 345214, 325043, 505630, 289171, 348209, 190276, 385312, 400918, 217539, 364691, 203502, 666179, 89389, 298737, 196618, 379327, 309773, 743286, 340424, 242847, 424935, 347128, 660093, 246354, 662729, 804282, 309251, 444799, 543036, 493201, 178923, 200527, 916952, 553881, 500767, 555994, 553399, 384395, 361629, 499943, 514195, 156334, 768114, 455398, 302295, 577246, 769176, 560364, 350556, 659177, 436444, 521218, 496516, 702026, 521080, 601728, 579899, 465010, 678506]
17019F78506j39421R488L08071B45471M69464B96283M45742j20514M0426K38803
17009I00740j62911j79415j40451R3069K22327l6210R3533k32447q6587K91677
16999G63325j11137Q1893o7970K19489l86864J70639o4649o1488m2945P6376k84359
16988B92310N55052m201k42252J59545m5402j95010Q6175L01618k24606J74658
16978H57887k12452K54072j2495l7244M4362j51088K41322K4650j14343J09333
16968A004004l82554N21986k82847J15131k75928R2038K62471n8959m88895M62947
16958I69394L4615R9951j58945M56319m24204K55947j64114l1794k1560O0507
16948A076116k08388q8841k3669L34335k07123J62236j98809L83620l94710p1362
$$ y = [678506, 539085, 548573, 856644, 245471, 714935, 296283, 742025, 621511, 661937, 900740, 737829, 558414, 417963, 511032, 733359, 697149, 790682, 558235, 471648, 763325, 652188, 734081, 666111, 885600, 498736, 669375, 604726, 543238, 500293, 576669, 292310, 847362, 843161, 600909, 760454, 715052, 520042, 606217, 907835, 683229, 857887, 645435, 899507, 887012, 849768, 894130, 743042, 984364, 1009014, 894671, 1004004, 621450, 1143436, 860589, 975720, 699792, 791830, 1054301, 995342, 506447, 969394, 1004009, 1103960, 945015, 1401334, 977130, 1233077, 1068963, 1037169, 1015609, 1076116, 867728, 778887, 755218, 1089553, 882430, 1044666, 845857, 1229477, 834767, 763405]
16938G63405L63812k54697L55237q3924k04845L59236j1834j22783j54233M6930
16928A056304K24811k05222J41022k1515J16238q1082M22755o95704K27127M5739
16918A230473L10001l18020J4791Q4193n2779J63125P5258j24307j8675J54755
16908A518815j47183K88777k58288J62154k75941K26264Q7761J50397j19422m3192
16898A590142j09286J20946r7276M70212j91513j56703p4041J52108p2206J86007
16888A818390K64770m43752J54069j42155J42950N21Q7482J53110q9916M0170
16878A985639r0512J94467O6089k65226N91897m65344N0756Q6231J11856M8174
16868B314027j22519K49494j19161K4131j63101K00780j15329j41009N26598j10647
$$ y = [763405, 1127217, 872520, 1227757, 1143833, 938988, 1298224, 1286390, 1163607, 1009374, 1056304, 1281115, 1075893, 1216915, 1195400, 1311638, 1230556, 1653311, 957607, 1184734, 1230473, 1540474, 1222454, 1237245, 1321438, 1268659, 1431784, 1507042, 1382735, 1364060, 1518815, 1371632, 1660409, 1402121, 1564275, 1288334, 1514598, 1602359, 1752756, 1633334, 1590142, 1480856, 1601802, 1504526, 1974738, 1783225, 1626522, 1552481, 1704589, 1632383, 1818390, 2083160, 1639408, 1793477, 1651322, 1794272, 1794793, 1882275, 2035385, 1945469, 1985639, 1895127, 2089594, 2155683, 1890457, 2482354, 2017010, 2067766, 2153997, 2265853, 2314027, 2191508, 2441002, 2321841, 2345972, 2182871, 2383651, 2268322, 2127313, 2653911, 2543264]
16858B543264j47038J55676q6079J74343j73229J78237L28689l94402L82801J01261
16848C063523j62074j76238Q8174L24566k06101J81374j96434K77766q1923K81168
16838C393801M76511j75841j95517J45779J14121M4789j38961K68915L0911l5576
16828C928932m1834M43749L37391l37089q890J24312J06881j55451L56092n4972
16818D699121L40790r8590J67891P4591J33979l83186M94734K55331j96875J41017
16808E628803K46565j73688P36391j44314Q8847l587M69232Q5993M33596j56841
16798G210997m1621N09446j66336O02929l8095J24642K56535M60809O2722L48034
16788I330062J88319J45720L82055M14206k27498N19029n128P26138K66414K79426
$$ y = [2543264, 2396226, 2551902, 2465823, 2640166, 2466937, 2645174, 2973863, 2579461, 2962262, 3063523, 2901449, 2725211, 2813385, 3137951, 2931850, 3113224, 2916790, 3194556, 3112633, 3393801, 3870312, 3694471, 3498954, 3644733, 3758854, 3803643, 3664682, 3933597, 3964508, 3928932, 3887098, 4330847, 4668238, 4331149, 4322259, 4446571, 4553452, 4398001, 4754093, 4699121, 5039911, 4941321, 5109212, 5183803, 5317782, 4934596, 5429330, 5684661, 5487786, 5628803, 5875368, 5701680, 6438071, 6293757, 6382604, 6379017, 6848249, 6934242, 7367838, 7210997, 7169376, 7678822, 7512486, 8115415, 8077320, 8201962, 8458497, 8919306, 8982028, 9330062, 9518381, 9664101, 10046156, 10460362, 10232864, 10751893, 10746765, 11472903, 11739317, 12018743]
16778A2018743L73854L27405L35762M85162K89953O31583L82331O64309M42119
16769A5951221L30343P89960M18550Q85001N52660Q12033N99191M34789Q08101
16760B1581849J176147Q29846R19396O11858J517546J192386J128294J218361
16752C0175683J670087J406063J422364J881004J652936J760692K542229J871791
16744D4382849K259968K815056K564866K914914L344509L353633L301608L914272
16736F8851675M823061M111672M799408N401069N711212N812750O544173O728510
16728A12783530P129248P176073P570664P771023P685466P869693P365079P084490
16720A72435266O460432N636197M430541L127289K215880L60752o99025k515543
$$ y = [12018743, 12392597, 12720002, 13055764, 13540926, 13830879, 14462462, 14844793, 15509102, 15951221, 16281564, 17071524, 17490074, 18375075, 18927735, 19739768, 20338959, 20773748, 21581849, 22757996, 23587842, 24507238, 25119096, 26636642, 27829028, 28957322, 30175683, 31845770, 33251833, 34674197, 36555201, 38208137, 39968829, 42511058, 44382849, 46642817, 49457873, 52022739, 54937653, 58282162, 61635795, 64937403, 68851675, 73674736, 77786408, 82585816, 87986885, 93698097, 99510847, 106055020, 112783530, 119912778, 127088851, 134659515, 142430538, 150116004, 157985697, 165350776, 172435266, 178895698, 184531895, 188962436, 192089725, 194305605, 194666357, 193967332, 191451789]
16712A91451789l405834n049353n519114o842099p091229p537213q058128q083074
16704A39865745p792785p474700p288054o888523o883508o762556n541713n646967
16696H5586939n308693m778695m293761m203648l671559m047799l272022k935995
16688E3074767l190178k734457k111092k313947k619029k072419j456657k060565
16680C4516423j553142j267944j607839j392615j527369q18327j687987p67278
16672B3893922j000670p41535q76753q46396p81363p73521o91818p97810q30716
16663A6553340m50079n06973l77050q25373k15904p78781l84741j50165o56914
16654A2207360k25260l88687m63500o04008J39298r05979O04081n66227n34931
$$ y = [191451789, 188045955, 182996602, 177477488, 170635389, 163544160, 156006947, 147948819, 139865745, 132072960, 124598260, 117310206, 110421683, 103538175, 96775619, 91233906, 85586939, 80278246, 75499551, 71205790, 67002142, 63330583, 59282784, 56010762, 53074767, 49884589, 47150132, 45039040, 42725093, 40106064, 38033645, 36576988, 34516423, 32963281, 31695337, 30087498, 28694883, 27167514, 26349187, 24661200, 23893922, 22893252, 22151717, 21274964, 20428568, 19647205, 18873684, 18181866, 17384056, 16553340, 16103261, 15596288, 15219238, 14393865, 14177961, 13399180, 13014439, 12864274, 12207360, 11982100, 11593413, 11129913, 10525905, 10665203, 9759224, 10363305, 9797078, 9262147]
16645I262147R0964j10395n94800k00202l52827L178m24356j48513k22771j83953
16635G118472K03938l56302R5365m58329l02604k10961k7433J00332n02792R0060
16625E749746o9328n46076k4635k45851L39745n5393k23463k23099K24266m89846
16615D436066J08908k35333L4921j79440O561k13233M52505p70000K18062m16348
16605C442669K12423l97061j04982J97395P3645O1846l36982J78026j02883j24733
16595C099363j05326j11215J29436j12613O4181J75600n74370k9150R1628m6397
16585B581137k04518J3271K10820k56286k14251P8580J48022J48881j48813j70834
16575B186009J6737k03039J88209O0994m37384K63896m08718M99320k20621m26036
$$ y = [9262147, 9353111, 9242716, 8647916, 8447714, 8094887, 8098065, 7673709, 7525196, 7302425, 7118472, 7322410, 6966108, 7061473, 6603144, 6300540, 6089579, 6062146, 6162478, 5659686, 5749746, 5680418, 5134342, 5109707, 4863856, 5203601, 5148208, 4924745, 4701646, 4925912, 4436066, 4544974, 4309641, 4344562, 4165122, 4171683, 3958450, 4410955, 3640955, 3859017, 3442669, 3655092, 3258031, 3153049, 3350444, 3424089, 3485935, 3148953, 3326979, 3224096, 3099363, 2994037, 2882822, 3012258, 2899645, 2963826, 3139426, 2565056, 2535906, 2627534, 2581137, 2376619, 2389890, 2600710, 2344424, 2130173, 2208753, 2356775, 2505656, 2356843, 2186009, 2202746, 1999707, 2187916, 2248910, 1811526, 2075422, 1666704, 2166024, 1945403, 1519367]
16565A519367L99819k04187j5423R4432J76622n19502K61131M78731m42330l51666
16555A396994L63296q9468k19300K60587m99009K28455J89191l05353K35258l4094
16545A526557k79061K85467l10641J82176j21222P758M8429j17621j52614Q5713
16535A154941j7873R4623j77822K53453k93596J1841O2444K1306o8180L57734
16525A398871j52216k67995l7864J54334M4311l79444K96721j11515k49613M58908
16515A154498n05049L07544K34321k12133n5306j64702R3158j4303k8328M5248
16505H54948K40681k50743j12073j41844J77604L11077j16875k46519K71827k80019
16495G08064L0567J93504q6626J4225J05248l07590r133K12228l9280Q4584l72315
$$ y = [1519367, 1919186, 1714999, 1699576, 1794008, 1970630, 1451128, 1712259, 2190990, 1748660, 1396994, 1760290, 1670822, 1451522, 1712109, 1213100, 1441555, 1630746, 1325393, 1560651, 1526557, 1247496, 1532963, 1222322, 1404498, 1283276, 1291034, 1339463, 1221842, 1069228, 1154941, 1137068, 1231691, 1053869, 1307322, 1013726, 1025567, 1088011, 1109317, 1041137, 1398871, 1246655, 978660, 940796, 1095130, 1139441, 759997, 1056718, 945203, 695590, 1154498, 649449, 956993, 1191314, 979181, 923875, 759173, 852331, 838028, 809700, 854948, 1095629, 844886, 732813, 590969, 768573, 1079650, 962775, 716256, 988083, 708064, 738631, 932135, 845509, 859734, 964982, 657392, 648259, 860487, 821207, 905791, 533476]
16484E33476K56880N6944l05060L0099J47077K9819k17539K60503l26584K76914
16474G42529j44901K09096j03524j30927K77814m01511l1777N9944j13439L77165
16464G40469k27444q3865R5206K78778C12568M41011l50016R3839P0611P6732
16454F44745j53013J59126L24011C75434l6337L57918r5469r9166L2973k04433
16444C30920K56081B23853K26622N2199p6607J17775k48046K73232k4568B23871
16433I47281k11177B80166J49435r426N3446l7335K3034K1883A23876N639K34448
16422C63963j41633N6596K85740K4049R3312H1001L44402h4039C62960k6631L38532
16411F74861B42053M01113B99141j22299E3373L28173J08186J09635B73556A23556
$$ y = [533476, 790356, 847300, 542240, 572339, 719416, 749235, 531696, 792199, 465615, 742529, 597628, 806724, 703200, 572273, 850087, 448576, 416799, 476743, 363304, 740469, 513025, 429160, 524366, 803144, 312568, 753579, 403563, 497402, 568013, 644745, 491732, 650858, 974869, 375434, 339097, 697015, 601546, 502380, 535353, 330920, 587001, 223853, 450475, 502674, 426067, 543842, 295796, 569028, 544460, 223871, 947281, 736104, 280166, 429601, 420175, 473621, 436286, 459320, 481203, 123876, 129515, 363963, 222330, 278926, 564666, 588715, 682027, 81001, 425403, -84039, 362960, 336329, 674861, 242053, 643166, 299141, 176842, 53373, 381546, 489732, 599367, 273556, 123556]
16400A13703K09612A31459N2455g9688F04164A76975m3825K36228A37060L983
16390A41043J71136J54057j19107H9276M57245A71978p717a8550A23878N24167
16380F48045k50181B4014L09493C7582L05801q616j13780q1077J54608A22149
16369B34702K61790q5060A53045J83760M1338p7089A25125K2914A8506L37234
16359C55740A62264K16155j16016g0133C74246r0701j22888F7096b8583B88523
16348A53787K17682a46575a9576D16987b60121J18086E40J09406K69463j69206
16338B10203i192A71762K37532f3003C11442a90895B53102H2095k0179R4807G2827
16326C02979r7559N2675A6250J93933a57712j39808C73567J20628k2025B5255
$$ y = [113703, 323315, 131459, 183914, -79688, 604164, 176975, 133150, 369378, 137060, 141043, 312179, 466236, 347129, 89276, 546521, 171978, 164261, -18550, 123878, 648045, 397864, 24014, 333507, 37582, 343383, 334767, 220987, 139910, 294518, 122149, 234702, 496492, 411432, 153045, 336805, 378143, 301054, 125125, 148039, 18506, 355740, 162264, 378419, 262403, -70133, 374246, 283545, 160657, 67096, -28583, 288523, 153787, 371469, -146575, -19576, 416987, -260121, -142035, 540, 109946, 379409, 210203, -9192, 171762, 409294, -63003, 311442, -190895, 253102, 82095, 61916, 156723, 72827, 302979, 205420, 258095, 16250, 210183, -157712, -297520, 373567, 494195, 472170, 25255]
16315B4872R2536K28438A18777K5080q497C3674J85275l6453J8681q0437a42176
16303C41815A19088Q927J83485E6562Q9704J09501N4292F8069K7354N2635c43535
16291h150A76436Q5638A08056b5539C5693J70541L8866e5317j9332A14017M45231
16280E59248A01175K83589B8017K88595a2401B8539J03711N8329e5614A90840
16269b01389B6786M61372F9453J38266f8243L2181j12007D2942O4001L32409E3264
16257A18696n8205J75153G5591K69672j28486I3702J8346K26853h760A99888L63939
16246E63827C4043J13108K60003j53002q6324q3530O9961d145B9187J55867J8701
16235B03755M3261g5729B02748i3759L2623A8838J99953f1048B21946A10747M9051
$$ y = [24872, 117408, 345846, 118777, 143857, 135360, 33674, 218949, 182496, 201177, 120740, -142176, 341815, 119088, 128015, 311500, 56562, 146266, 255767, 310059, 68069, 95423, 148058, -343535, -8150, 176436, 262074, 108056, -25539, 35693, 206234, 245100, -55317, -74649, 114017, 559248, 101175, 384764, 28017, 316612, -12401, 28539, 132250, 190579, -55614, 190840, -201389, 26786, 488158, 69453, 207719, -68243, -36062, -148069, 42942, 106943, 439352, 53264, 118696, 60491, 235644, 75591, 345263, 216777, 93702, 112048, 338901, -8760, 199888, 563827, 34043, 147151, 407154, 254152, 167828, 84298, 154259, -4145, 29187, 185054, 203755, 247016, -75729, 202748, -93759, -61136, 18838, 218791, -61048, 221946, 110747, 159798]
16224A59798f9688C30699e6725a0171A37551b55710C40348j13971a49494C7006
16213D02779A08606b911j0563j85799B54935f5283j28644B34477c13536A53342
16202A66795R4457a24085J990G077a71450A8145c7278B31073a46980G5867a73180
16190c8854j0092A18325E3799m887b34135A15450d90526A35519a9330A94939b5149
16178A6074M50681D7286j3836J31021a6163j88569f074j29649C4757h6076A6645
16166C1120a34761A5888c27898A39374a17777j57975P4365j04721E9041J53380
16156B12421E907L15391a20029C6554a8293l1668E8826L31580A02413Q986J6422
16145A27821a30090F120M4984c3906k85156J1201J15076a2815j86578G9777a54338
$$ y = [159798, -69688, 330699, -56725, -10171, 137551, -255710, 340348, 226377, -149494, 37006, 402779, 108606, -2911, -13474, -199273, 254935, -65283, -193927, 234477, -313536, 153342, 166795, 261252, -124085, -122095, 7077, -171450, 18145, -37278, 231073, -146980, 75867, -173180, -38854, -48946, 118325, 53799, 48912, -234135, 115450, -490526, 135519, -19330, 194939, -25149, 16074, 466755, 47286, 33450, 164471, -16163, -204732, -6074, -135723, 34757, -86076, 16645, 31120, -134761, 15888, -327898, 139374, -117777, -275752, -201387, -306108, 59041, 212421, 5907, 321298, -120029, 36554, -18293, -49961, 58826, 390406, 102413, 111399, 127821, -130090, 6120, 51104, -33906, -319062, -307861, -192785, -12815, -199393, 79777, -154338]
16133A83210b99645N8122A48823n2726a26669B00368D9875J0511R0878M4714a69771
16121B34880C3703i5892G4106e7557b0143j49474H4236M2578h9706j51316e2410
16109a24943B31631b05793A4541Q4818J05360a56967E4081a06321q6306A23142
16098A35044F6278a74673A75972G1395b38171A41877A4422N7837N466K72585a53269
16086A73679b71718C8270b62606C5706a97915c5009p1622A65863J15400g5995
16075b56425J2236h727c355I6691b07083i8865C27177j6090d9953A73359a08565
16063I1981J78091H7370k8500J3478a64832C45066A34448e25949A19125a56403
16052a02960B9008a93159B43923f8228D3814a16080K0548D60231a24504C27451
$$ y = [183210, -299645, -241523, 148823, 96097, -126669, 200368, 49875, 60386, 151264, 195978, -169771, 234880, 33703, -95892, 74106, -57557, -20143, -169617, 84236, 126814, -89706, -241022, -52410, -124943, 231631, -205793, 14541, 99359, 204719, -156967, 54081, -106321, -192627, 123142, 135044, 66278, -174673, 175972, 71395, -238171, 141877, 14422, 72259, 77725, 350310, -153269, 173679, -271718, 38270, -262606, 35706, -197915, -35009, -106631, 165863, 281263, -75995, -256425, -244189, -8727, -3355, 96691, -207083, -98865, 327177, 311087, -49953, 173359, -108565, 91981, 270072, 87370, 58870, 72348, -164832, 345066, 134448, -525949, 119125, -156403, -102960, 29008, -193159, 243923, -68228, 43814, -116080, -95532, 460231, -124504, 327451]
16041b8251l17314B71036a05513K3822H5511a43820A96754n9915b54377d272A4509
16029a04594B11623a74897P2058k4037B92832E5793Q1374P0672h449G8668J97396
16018B76064a95164A13576J75467A13633J65664c8646l7470A4309L12007G1281
16007d6665C09024a8534A32128d14020a62328A75428b32337Q4059A68579a22899
15996a66042f1445a789A23166c51467F4118k1689M4429d503j13868k9664M5948
15985a02087B8913a14323F96308C40913i3421A82047G6163e5823A13140a41125
15974F4961R9274a8229k36119g288B43838c59356J78556j38988C14468d0217j1805
15963e2022r815b6352C00c01713a28137N8690l948j71631B26525b65065J04095
$$ y = [-28251, -345565, 271036, -105513, -81691, 85511, -143820, 196754, 136839, -254377, -4272, 14509, -104594, 211623, -174897, -102839, -126876, 292832, 55793, 137167, 207839, -8449, 78668, 276064, -195164, 113576, 289043, 113633, 279297, -38646, -76116, 14309, 326316, 71281, -46665, 309024, -18534, 132128, -414020, -162328, 175428, -232337, -148278, 168579, -122899, -166042, -61445, -1789, 123166, -351467, 64118, 42429, 86858, -4503, -118371, -148035, -102087, 28913, -114323, 696308, 340913, -93421, 182047, 76163, -55823, 113140, -141125, 64961, 164235, -18229, -254348, -7288, 243838, -359356, -180800, -319788, 314468, -40217, -52022, -61837, -26352, 300, -301713, -128137, -69447, -73395, -245026, 226525, -265065, -160970]
15952a60970A30619a31432A16537B9809d45578A62104d5133A05082A7378b81684
15941a05280E88K15603b57884L0320B5657M6812g2552j3320l4707B68992c22805
15929D9995B1214d26555A8157K32490a25414l6628A18643a91934d1020j31082
15919a72102l3155l6318f716B458M3450K44132b71406A2163a29007K8115j23379
15908b24271A36224h5050A18078D6217b59772a00884j5058I6268j9989b77427
15897C87985g9484k39858D41555i2163H0685K14388Q683c17131a55028f4302A75522
15885a16578j16147A50979b3763k10662H5654l3358O6007E4271R1670d8532A74139
15873a67382k96254g3936o875j63118i393q0459m6330K3646k66335J11381j20118
$$ y = [-160970, 130619, -131432, 116537, 29809, -445578, 162104, -45133, 105082, 17378, -281684, -105280, 588, 216191, -257884, -227564, 25657, 72469, -72552, -85872, -120579, 268992, -322805, 49995, 21214, -426555, 18157, 250647, -125414, -162042, 118643, -191934, -41020, -172102, -205257, -241575, -6716, 2458, 45908, 290040, -271406, 12163, -129007, -100892, -224271, 136224, -85050, 118078, 46217, -259772, -100884, -115942, 96268, 76279, -277427, 387985, -79484, -319342, 441555, -92163, 80685, 295073, 303756, -317131, -155028, -64302, 175522, -116578, -232725, 150979, -23763, -234425, 85654, 52296, 118303, 54271, 145941, -48532, 174139, -167382, -463636, -73936, -80811, -243929, -9393, -89852, -136182, -112536, -378871, -267490, -387608]
15862c87608F7334O9720h752l7101j77078i005q4110A49524b39315J16980B14511
15850A33390b35982Q9897A1749J65976a56744j07890F1964d9814a0436j46995
15840a57431D1175N9498C6759J10470K115a28533K6056B49061k6203a21742C30145
15828a54818a2479m07218J27456G4704f5919n9502D69481d2447j19412D9852F965
15816B70429c17169a17304A99918a82520B56317C0467J36708k0944c18924g2510
15805A39621a18608j89606d8996k23645F9445a03434B76033A29388A1533b6185
15794b00273O3284b2403A61839o5138a2607A22908I477f2925n0914j62959d6034
15782c20819M2322A26881g0929o6252A94587I0914K01007D6533d1170I3461a26501
$$ y = [-387608, 67334, 137054, -8752, -45853, -222931, -9005, -93115, 149524, -239315, -122335, 214511, 133390, -235982, -146085, 11749, 177725, -156744, -264634, 61964, -49814, -10436, -157431, 41175, 100673, 36759, 147229, 149344, -128533, -102477, 249061, 222858, -121742, 330145, -154818, -12479, -419697, -292241, 74704, -65919, -125421, 469481, -42447, -161859, 49852, 6965, 270429, -317169, -117304, 199918, -182520, 256317, 30467, 167175, 146231, -318924, -72510, 139621, -118608, -308214, -48996, -272641, 69445, -103434, 276033, 129388, 11533, -26185, -200273, -136989, -22403, 161839, 96701, -12607, 122908, 9477, -62925, -113839, -276798, -46034, -320819, -278497, 126881, -70929, -137181, 194587, 90914, 291921, 46533, -41170, 93461, -126501]
15770C9434j1901a34053d3925J3874j73736A39132a15762G4406a86395g1779J358
15759g0421E362i9297D1425Q590e3433j55632d976j5087j31735M4401b32k56582
15747b56814A11506a9658o9982B11738h1629B12561A7831g3035k00876J12705
15737a61206O8290A23395c04095i3646A51398D0043J08915b7426l9236B0709J90121
15726B10830a8213D7012g3742j99339c8388l18697B74754a3757o5664c3926k0475
15715e4401b6633j20223A6324N291C024N8496b17045r463j79034c0019F1208a04725
15702e1043k07895A994e47879a94260E5403J79436d61233H1300K55628a60576
15691b5515F1556L55713h3374D1608j6K98100I2904M32928b3477k30020G4376
$$ y = [39434, 27533, -134053, -43925, -30051, -203787, 139132, -115762, 74406, -186395, -71779, -70421, 5362, -99297, 41425, 50015, -53433, -209065, -4976, -20063, -151798, -107397, -232, -256814, 111506, -19658, -89640, 211738, -81629, 212561, 17831, -73035, -273911, -161206, -92916, 123395, -304095, -93646, 151398, 40043, 148958, -27426, -66662, 20709, 210830, -18213, 47012, -73742, -273081, -38388, -357085, 274754, -13757, -79421, -33926, -54401, -26633, -146856, 16324, 21615, 3024, 61520, -217045, -226508, -405542, -30019, 61208, -104725, -51043, -258938, 1994, -547879, -194260, 55403, 234839, -461233, 81300, 336928, -160576, -25515, 61556, 417269, -83374, 41608, 41592, 339692, 92904, 525832, -23477, -253497, 74376]
15679b27268c24k67682g1161A57744o1239g2738D02566b22016b6029l9737A91971
15667a15146A04823k7944a52876A80766a01419j24288p5208h4513A63768G7333
15656b39902J18975C0181a00545k4864B31645c73930O4118A06751c38301c0409
15645H9737a67221d4105k14712n0992J09927i9455K6893j44213M9996A01157b96479
15633c03926D5526j4979b28417I3091J01213h2914j28785R9446r6087k9660A365
15621d8829B89171P2580A41656n4520h2499A08645N0046b75862H0599a20675e286
15609B69543D9884e9649E9642K755J57637i6619E6734a13692J0663D1220J3724
15598E4944f2246B30592B7492L5276a0484G856J00588C6708J1099L19217E8359
$$ y = [-227268, -324, -268006, -71161, 157744, 96505, -72738, 402566, -222016, -26029, -65766, 191971, -115146, 104823, 76879, -152876, 180766, -101419, -225707, -300915, -84513, 163768, 77333, -239902, -120927, 30181, -100545, -125409, 231645, -373930, -309812, 106751, -338301, -30409, 89737, -167221, -44105, -258817, -309809, -199882, -99455, -72562, -216775, -166779, 101157, -296479, -303926, 45526, 30547, -228417, 93091, 194304, -82914, -211699, -112253, -208340, -238000, 1365, -48829, 289171, 361751, 141656, 87136, -82499, 108645, 158691, -275862, 80599, -120675, -5286, 269543, 49884, -59649, 59642, 62397, 220034, -96619, 56734, -113692, -103029, 41220, 54944, -62246, 230592, 27492, 62768, -10484, 7856, 108444, 36708, 47807, 367024, 58359]
15586B63115l7491g7486m2944R495A82356J63838r2942a78816k28382D1789b25043
15574a33778d4604C226Q1833i3383D7957a70638B66108F7358K07359b59334b3471
15562A70165J7995a65297A19223J9726b47530B24298a84653c7791p9078M7559
15552f9310B45289e3054O922D9249b04909B5983J71967e8943A73084a93548E02724
15540a69677a6051l74192A2924P0632J61374j04336K4723a06506l18775d6259
15529a50149j20723J4617B06955g0580q3587P1061j0608n8560J721B29640O1651
15518B91291c21897C987c0211j45499g5208j26251h5232A81194b49107i2045C4473
15506A51806G3267a85628d9382F6532c05488i0549A52064o5233K6145B615e4484
$$ y = [263115, 225624, -77486, -120430, -110935, 182356, 346194, 253252, -178816, -407198, 41789, -225043, -133778, -44604, 3226, 85059, -93383, 47957, -170638, 266108, 67358, 274717, -259334, -23471, 170165, 188160, -165297, 119223, 138949, -247530, 224298, -184653, -37791, -116869, -69310, 245289, -53054, -46132, 49249, -204909, 25983, 197950, -58943, 173084, -193548, 502724, -169677, -16051, -390243, 12924, 83556, 244930, 140594, 165317, -106506, -425281, -46259, -150149, -270872, -256255, 206955, -70580, -154167, -83106, -93714, -152274, -150553, 229640, 291291, -321897, 3987, -30211, -175710, -75208, -201459, -85232, 181194, -249107, -92045, 34473, 151806, 73267, -185628, -49382, 66532, -305488, -90549, 152064, 86831, 112976, 2615, -54484]
15494H3410f9042k54142A78171a29253p860N7400j50879D5656j4528b4161o7334
15483i1495d2041A07628c4750B14510c83460C22588d56329J57651A84905R6608
15473B81513a6064l83325B81962a10033N4904A58353a61865B5118a08624r6935
15463b05559f5261k50916d8066A6226P3284d7716C8972J6825d0899l257k75028
15452c19184B84840j10902d0754B0606i399A4303Q3888k6707a55246c8454E6397
15440a99722g2937A16649a54813D6676K21856a23057j44984i0818n9176k36483
15430c86477b3718m968A82387a40749F3976b13974K9377g4108A01731a07288M6972
15419f0316D16394G547K39202b05237H2540K9786g191j04680q4842M1625B49385
$$ y = [83410, -69042, -323184, 178171, -129253, -137113, -79713, -230592, 45656, 31128, -24161, -91495, -42041, 107628, -34750, 214510, -383460, 322588, -456329, -298678, 184905, 281513, -16064, -399389, 281962, -110033, -55129, 158353, -161865, 25118, -108624, -205559, -65261, -316177, -48066, 16226, 89510, -47716, 38972, 55797, -40899, -44156, -319184, 284840, 173938, -40754, 20606, -9399, 14303, 98191, 71484, -155246, -38454, 56397, -199722, -72937, 116649, -154813, 46676, 268532, -123057, -268041, -90818, -149994, -386477, -23718, -28686, 182387, -140749, 63976, -213974, -184597, -74108, 101731, -107288, -60316, 416394, 7547, 246749, -205237, 82540, 112326, -7191, -111871, -196713, -155088, 249385]
15407d2523R280k2220k18451A898b01660j40617a69388B18745A02108d6112m2693
15396h8805k70708A5096d42733J31473A01278b42826D764N0744a57044C503a63647
15384C07433I8871Q2529b07644p1593A14055a5633B38488A8311e0791j27287c3058
15372C07620m2304A15802j4538a10499B44856m187g0606B05475b05858D3471J78972
15361B22443b60571I8347a0462o4100o2450A92051a97162A84724a55179o6528
15351b21707B2705a39239C10218b91085D3864d03038A95054a3229k32231a4402
15340a43471B94068A31115f5713K0850j20902E2299K05835c47521H4337P0203
15330A54540G0633b3583A76409a78883B10372E9360k5014J28061g6711A11082
$$ y = [-42523, -33243, -55463, -273914, 1898, -201660, -342277, -169388, 218745, 102108, -46112, -88805, -359513, 15096, -442733, -311260, 101278, -242826, 4764, 55508, -157044, 3503, -163647, 307433, 98871, 181400, -207644, -279237, 114055, -15633, 238488, 18311, -50791, -178078, -33058, 307620, 265316, 115802, 101264, -110499, 244856, 240669, -70606, 205475, -205858, 43471, 222443, -260571, 98347, -10462, -74562, -137012, 192051, -197162, 184724, -155179, -221707, 22705, -139239, 310218, -291085, 43864, -403038, 195054, -13229, -245460, -14402, -143471, 294068, 131115, -65713, -44863, -165765, 52299, 258134, -347521, 84337, 154540, 70633, -23583, 176409, -178883, 210372, 59360, 34346, 162407, -76711, 111082]
15319B03415q8513a8294k74988j11558f6465k279B56687A4031d9823A05965k7999
15308G7966J59090A17007A7348d0480h251j17782C30810j10475c97020A61296
15297B1456M3021R8407m12a11639K664A91505f6904C7942g3313I8407D2770d23821
15284b94960b3087j38235A3678J47531M040b51975A55563Q8870c36928A41865
15273F7687l2968f7711H2450K95741A52241J17130j30151K625m2507K9783a88091
15261E6457B6803J6316R9216b43508C23730a7888A49177M807f126G7118M3817
15250A20935K91237L65755N26470J8898n13247Q53021q00537C83624k6172j25860
15240B31592a69845H6088J36495A07779k5315K48004g3975A00741c34232b8181
$$ y = [203415, 114902, -18294, -293282, -404840, -66465, -68744, 256687, 14031, -49823, 105965, 77966, 237056, 117007, 17348, -40480, -8251, -126033, 330810, 220335, -397020, 161296, 21456, 64477, 162884, 162472, -111639, -108975, 191505, -66904, 37942, -73313, 98407, 42770, -423821, -294960, -23087, -161322, 13678, 161209, 165249, -251975, 155563, 244433, -336928, 141865, 67687, 34719, -67711, 82450, 378191, 152241, 269371, 139220, 141845, 99338, 129121, -188091, 56457, 26803, 43119, 142335, -243508, 323730, -17888, 149177, 153984, -6126, 77118, 120935, 412172, 777927, 1304397, 1323295, 810048, 1663069, 862532, 383624, 357452, 231592, -169845, 86088, 222583, 107779, 82464, 330468, -73975, 100741, -334232, -28181]
15229A51630P2947D0610d7043R813k79759E1156b220m95E3205b42244A36470a04661
15216C9736J35293n7833K20981f6188B68005m6556h9030A09006a08034R402G7866
15204D3774L09424a64918r3028g6740C02656b57499E2709L6151R6971P3223a05455
15192C44429b95646A11109E1773L4582M006h0850B45450d4117B88818j02051M6854
15181B33621E0062d4962q1434k20232E6101i5073C65148j39956G4647B3779K80376
15170C04155j39183L005d0378d931k951G0288J51683r8087D5994J74456F1328
15158A2946R0770A3502a84150b6764A43144b38843c016F2824q08a5975F8481n402
15146F3079A528K0631L06328b9235A4392K98577b11764e6716p1870B8538a28163
$$ y = [151630, 224577, 40610, -47043, -37230, -316989, 51156, -2220, -2715, 53205, -242244, 136470, -104661, 39736, 175029, 117196, 338177, -66188, 268005, 221449, -89030, 109006, -108034, -98632, 77866, 43774, 353198, -164918, -257946, -76740, 302656, -257499, 52709, 88860, 185831, 259054, -105455, 344429, -295646, 111109, 51773, 86355, 90361, -80850, 245450, -44117, 288818, 186767, 233621, 50062, -44962, -126396, -346628, 56101, -95073, 365148, 225192, 74647, 23779, 304155, 164972, 167977, -40378, -4931, -7882, 70288, 221971, 123884, 45994, 220450, 61328, 12946, 103716, 13502, -184150, -26764, 143144, -238843, -3016, 62824, 62016, -15975, 68481, 63079, 1528, 22159, 328487, -29235, 14392, 312969, -211764, -56716, -128586, 28538, -128163]
15134a20951B41801F8321j7092O6355O6195N2039a46092D19100E2664a60451D538
15122d9553B10456m0302j3811E1393N9209a51019L5097E6342k5176c2876k12333
15111b45209e8789B17502o275G1029r01b5879C0291K26989B152O9615J5999I326
15098C3523K5608c96261C2440K27357N1680j52074C7568J4075J73448a17416C63542
15086H1847A7893J77181K60655p7506f8681B45690j9500J09901a04974L791C29860
15074A94292a58140B1616O0610j1868M5711P9848J6383J97906j39191c7661k1576
15063e9237o4083r6898A05486a94311K9735P5947j468o9044b7042D21812D8886
15051B79983M22r257b82761B63141O9357A5899b34014D07861A51048F7560J62380
$$ y = [-120951, 241801, 68321, 51229, 117584, 183779, 235818, -146092, 419100, 52664, -160451, 4538, -49553, 210456, 170154, 156343, 51393, 110602, -151019, -115922, 56342, 31166, -32876, -245209, -58789, 217502, 211227, 71029, 70128, -25879, 30291, 257280, 2152, 71767, 87766, 9326, 33523, 59131, -396261, 32440, 259797, 311477, 159403, 37568, 51643, 225091, -117416, 363542, 81847, 17893, 195074, 455729, 378223, -68681, 245690, 226190, 336091, -104974, -101183, 329860, 194292, -158140, 21616, 82226, 70358, 116069, 195917, 212300, 410206, 271015, -37661, -59237, -123320, -220218, 105486, -194311, -164576, -88629, -90097, -159141, -27042, 421812, 48886, 279983, 280405, 271148, -282761, 263141, 332498, 15899, -234014, 407861, 151048, 67560, 229940]
15040B29940J6203M6727A26102J42938m2124K70621n7247A23640h3240C90025
15029A17602A4798K76571F7844B5924J60497n0031K68560A90553A7760L3309J7951
15018F9020K96K47599M4135j56387L17998A89419J47442B6035b91051B61642A07318
15006e3710G2282E921J41265E3840N7117K05361L6223A9870g3776B22573K75174
14995D97747B33949f6665A03066i9695b1241B29937J71892b07917B96805M6914
14985C43719N9741m6335j0453j59850d6467d460A85928R5917p9006J13644j8318
14974B98165A17140l1174J36104E6611j7854J55893l0097a35636A33040f9966
14963A02665f7035C90298j94510a4484A12406C2625J57607K71767A33691O0406
$$ y = [229940, 246143, 292870, 126102, 269040, 226916, 497537, 440290, 123640, -83240, 390025, 117602, 14798, 291369, 67844, 25924, 186421, 136390, 404950, 190553, 17760, 51069, 69020, 69316, 316915, 361050, 204663, 522661, 189419, 336861, 26035, -291051, 261642, 107318, -53710, 72282, 5921, 147186, 53840, 110957, 316318, 352541, 19870, -73776, 222573, 497747, 233949, -66665, 103066, -99695, -21241, 229937, 401829, -207917, 296805, 343719, 403460, 357125, 346672, 186822, -46467, -4460, 185928, 281845, 202839, 316483, 298165, 117140, 85966, 222070, 56611, 38757, 194650, 164553, -135636, 133040, -69966, 102665, -67035, 390298, 195788, -14484, 112406, 32625, 190232, 461999, 133691, 194097]
14953A94097J40956H9159J19180I2292J85173j27386R117l1973L19010j48042
14943B98191B1551J44434m0512n8226F372Q1342K83781k5552J3641k6809J74894
14932E07669F7336J85885n2798M06721G206B996J29983a48422C45441J24875H6032
14920A49338B304d1364C56780N4737A16961d6662E2955J27988J88382O0581j20715
14909C09191K41484e284C44512A62224l3366K03479a61621C70207C4318K99157
14899C33475o7912M7680O1538j12016A11845J20407O0482K0228J71106j47946
14889C36122A2961J14230d2144F4112K85150D3925J27275R6057A00113J52620
14879B52733K47093L93k41420K8245l0941J57334j29531J43504Q2343j60520n4285
$$ y = [194097, 335053, 89159, 208339, 92292, 277465, 150079, 159196, 127223, 446233, 298191, 21551, 165985, 125473, 67247, 6372, 87714, 371495, 345943, 359584, 332775, 507669, 67336, 253221, 200423, 607144, 7206, 2996, 132979, -148422, 345441, 470316, 86032, 149338, 2304, -41364, 356780, 411517, 116961, -46662, 52955, 180943, 369325, 429906, 309191, 550675, -5284, 344512, 162224, 128858, 332337, -161621, 370207, 34318, 333475, 265563, 313243, 374781, 262765, 111845, 232252, 292734, 312962, 484068, 336122, 12961, 127191, -42144, 64112, 349262, 43925, 171200, 267257, 100113, 252733, 499826, 500219, 258799, 287044, 256103, 413437, 283906, 427410, 509753, 349233, 294948]
14868B94948J56396k08419j3505J98729A66316M71830l14966j41710J80915j5112
14858C47273L3763q6013E4688J33596J66057j29489j6024J85274j81317J61411
14848C74196j36114M4732j24812J06455G7824M99757j85096j93579P6820B2043
14837C42343L65610k41727k13332K81937J66600A57113J18546L3464L38318k53320
14827C94121J05254B15380J74876J27935j78773j2108r4646I1953N61287k40966
14817D12274G3188L72648B21746m581J15003J84822J86826A78659M07476m4386
14807E41749O4659J15347j54202j80308K39497r5473r5523J96164B69944L40966
14797F10910k00874P6049O9950j60676k2293N549J36810r3879O1037K7168m4312
$$ y = [294948, 451344, 242925, 229420, 428149, 166316, 638146, 323180, 181470, 362385, 347273, 381036, 295023, 54688, 188284, 354341, 224852, 208828, 394102, 212785, 374196, 238082, 282814, 158002, 264457, 77824, 577581, 392485, 198906, 275726, 22043, 342343, 707953, 466226, 252894, 534831, 701431, 157113, 275659, 309123, 647441, 394121, 499375, 215380, 390256, 518191, 339418, 327310, 232664, 91953, 653240, 412274, 73188, 445836, 221746, 217165, 332168, 516990, 703816, 178659, 586135, 541749, 606408, 721755, 567553, 387245, 626742, 531269, 435746, 631910, 269944, 610910, 410036, 486085, 556035, 395359, 373066, 378615, 515425, 421546, 482583, 509751, 465439]
14786D65439j23585A32235J85585K28271J35280k72864A71741K56570l0220K85262
14776F83353C04925R1854M3824J52484k0481K0649j16812J4288k0151K42665j7468
14765F95777l6668j43031J59450J27181k73537k41918Q0156J34175K9168p8215
14755D52538J70514K851C06889L20754k71033J14353Q7216M7562J12589k73657
14745D44673J10035K3089k34354j38342K39039L95996C15290K25599J2726J48467
14735G02082j9037j60517l2610K07558B30644L44834J00649o6075M5869B84364
14724F84992l416B84246N46930l30940P6066K68940k12939n0250J9830B73012
14713F30366j24867K16081J64815j94115A13556J93010M32186K9991q1216L5489
$$ y = [465439, 341854, 132235, 317820, 546091, 681371, 408507, 171741, 428311, 398091, 683353, 304925, 396779, 440603, 593087, 572606, 593255, 476443, 490731, 470580, 713245, 695777, 659109, 516078, 675528, 802709, 529172, 287254, 367410, 501585, 530753, 452538, 623052, 625903, 306889, 627643, 356610, 470963, 558179, 605741, 718330, 444673, 554708, 577797, 343443, 205101, 444140, 840136, 315290, 540889, 553615, 702082, 683045, 522528, 489918, 697476, 230644, 575478, 676127, 610052, 655921, 284364, 684992, 681576, 284246, 831176, 500236, 576302, 845242, 632303, 582053, 601883, 273012, 630366, 505499, 721580, 886395, 692280, 113556, 306566, 738752, 768743, 687527, 723016]
14703G23016j5822o8717K49465M5423m09567R1149L45279k69301l9616p4510K57875
14692H34674O3895n6266j64170O2902k71268L06735J98288k63797o3810J44244
14682G91427J89615N6497j19767j1015K64837k57392j06339K17342j46683n8614
14672H19908j87669J86461R7186k42339K12153j3101K75843k51676N8658j85731
14662G69693M39611k31242Q6516j59793K71491j93117k65258P6910M28201J1087
14652A234099m52286J32564N2568J47765J39361k26725j92181J29788J20425j72696
14642I12682M503J3899L79333j80835J71635k23836M493L45542m22205K3217q8390
14631I40038J02021K3421j44658R9377M33544j64752R882r9609j61172J03747
$$ y = [723016, 707194, 638477, 887942, 933365, 523798, 614947, 960226, 690925, 651309, 576799, 834674, 898569, 842303, 678133, 741035, 469767, 776502, 974790, 710993, 647183, 791427, 981042, 1037539, 917772, 906757, 1171594, 914202, 807863, 1025205, 878522, 819908, 632239, 818700, 915886, 673547, 885700, 872599, 1148442, 896766, 955424, 769693, 1209304, 978062, 1064578, 904785, 1176276, 983159, 717901, 794811, 1223012, 1234099, 781813, 914377, 966945, 1114710, 1254071, 1027346, 835165, 964953, 1085378, 912682, 917185, 931084, 1310417, 1129582, 1301217, 1077381, 1081874, 1427416, 1005211, 1028428, 940038, 1042059, 1065480, 920822, 1020199, 1453743, 1288991, 1298873, 1199264, 1038092, 1141839]
14621A141839M41771o82591N66714k96470N46292m12962L3432k85183P1985R6419
14611A221246k49161M47559l48899R7113n6267K83141j95764J93393o0529J56189
14601A488021m93206L15249j4968L41386l67784M07462k91676J17733j87287J05453
14591A420383r7058R2050J78239K52061k25824J49460r3938j61786J28120K1904
14581A663611k12013L61821k411N8099j76368J93377M10639o81351L01794N4420
14571A971618j45979R5402J01318n555l90424O92466k44399M4309N7099L15459
14561B491314l82051K55597J08482j98232J57630P2007K71198m9117L11296L57033
14551C395157K45967Q55055J716305L258800P253023J7341157K0231438B3927240
$$ y = [1141839, 1583610, 901019, 1467733, 1171263, 1717555, 1304593, 1338025, 1052842, 1124827, 1221246, 972085, 1419644, 1070745, 1167858, 1111591, 1394732, 1198968, 1392361, 1331832, 1488021, 994815, 1310064, 1295096, 1636482, 1268698, 1676160, 1384484, 1502217, 1314930, 1420383, 1323325, 1415375, 1593614, 1845675, 1619851, 1769311, 1675373, 1513587, 1641707, 1663611, 1451598, 1813419, 1811008, 1869107, 1692739, 1886116, 2296755, 1615404, 1917198, 1971618, 1825639, 1921041, 2022359, 2016804, 1626380, 2318846, 2074447, 2118756, 2175855, 2491314, 2109263, 2364860, 2473342, 2275110, 2432740, 2504747, 2775945, 2726828, 3038124, 3395157, 3641124, 4496179, 6212484, 9471284, 16724307, 34065464, 54296902, 23927240]
14542H846974D398939j640813o97192k92909l2483K9651r8544M032K40023j84208
14532A726496J69023l68000L70214m260J37592l17664Q2387J71014j88113R8700
14522A877389K39527J50747p3161K02930j07887j47506L51086J0545l57806J38416
14512B284280j43394j4015K67226k53595L28561M724J11451k96191K49675r4853
14502B443869N42166l49469l367R0366O2194j75361j16260L55459M7734N7900
14492B955231L63324l19570j4949K12276j96726P5625J34167J48871k14109j13133
14482C031007J38637M3217L89567l35971M73999j52287J326P7517j27175Q7573
14472C627410o7687p2759J54942m1235K90322k24187M30842J5691L59195l23362
$$ y = [8846974, 4398939, 2758126, 2060934, 1768025, 1735542, 1765193, 1666649, 1670681, 1910704, 1726496, 1895519, 1527519, 1897733, 1893473, 2031065, 1713401, 1795788, 1966802, 1778689, 1877389, 2116916, 2267663, 2194502, 2397432, 2289545, 2142039, 2493125, 2503670, 2145864, 2284280, 2140886, 2126871, 2394097, 2140502, 2469063, 2473787, 2585238, 2289047, 2538722, 2443869, 2986035, 2636566, 2633199, 2723565, 2785759, 2610398, 2494138, 2849597, 2897331, 2955231, 3318555, 2998985, 2984036, 3196312, 2999586, 3075211, 3209378, 3358249, 3144140, 3031007, 3169644, 3212861, 3602428, 3266457, 3740456, 3588169, 3589495, 3667012, 3539837, 3627410, 3559723, 3486964, 3641906, 3600671, 3890993, 3666806, 4097648, 4113339, 4472534, 4149172]
14462D149172M2242j07721P5790K22603M09978l75326J13474j81435K81276m2048
14452D588005N4264K99015M2892o8744K87613l32890L25250k88568N7680K26163
14442E190680J72877K05783k5676l02434K65515K64329j91216J78978L0951j6363
14432E773424J6002J53322L50087j0223j84745P06132j97317j2794J22714k44021
14422F472581M72782M2482q0352M94989j52084J38689L82881j11929j70264R3554
14412G583329J91963J45413L49254K21502Q0359l37821K30467L41778l24693N37864
14402I019415q9204K38995K24923k33677K51260L45659j20659M70872r0723M57306
14392A0474167L05520p1109J02518N32609J62768K5349K81796J65613J2932L91121
$$ y = [4149172, 4191414, 4083693, 4159483, 4382086, 4792064, 4416738, 4530212, 4348777, 4630053, 4588005, 4642269, 4941284, 4984176, 4915432, 5203045, 4870155, 5195405, 4906837, 4964517, 5190680, 5363557, 5569340, 5543664, 5241230, 5506745, 5771074, 5579858, 5758836, 5789787, 5773424, 5789426, 5942748, 6292835, 6282612, 6097867, 6803999, 6606682, 6593888, 6716602, 6472581, 6945363, 6987845, 6907493, 7402482, 7250398, 7389087, 7771968, 7660039, 7489775, 7583329, 7775292, 7920705, 8269959, 8491461, 8571820, 8233999, 8464466, 8806244, 8481551, 9019415, 8930211, 9169206, 9394129, 9160452, 9411712, 9757371, 9636712, 10107584, 10016861, 10474167, 10779687, 10708578, 10811096, 11343705, 11506473, 11531822, 11813618, 11979231, 11992163, 12383284]
14382A2383284J15965K24801J06612M37003M06869J35046M31180K1447N43996
14373A4806203L0057L71439K96496R5606M85972N48928k3188O19457J65841K83376
14363A7680187M13515P59109K96547J55769N46653L63695J86062P73435Q65600
14354B2040572N85047L379J023407K05354M23196Q43283M88865N87848J200989
14345B7401940L89659O47402O55717O17313Q00137J241014N46158J217952O74605
14336C4191897J102508J183529J011687P96386J026010J423522J427723J008610
14328D3171872J526448J863915J335900J312228J996610J458709J489908K260830
14320E6416420K026785K068493K190905J967797L037239K891692K325509K932801
$$ y = [12383284, 12499249, 12724050, 12830662, 13267665, 13674534, 13809580, 14240760, 14262207, 14806203, 14836260, 15207699, 15504195, 15599801, 16085773, 16634701, 16611513, 17230970, 17396811, 17680187, 18093702, 18852811, 19149358, 19305127, 19851780, 20215475, 20401537, 21174972, 22040572, 22625619, 22628998, 23652405, 23857759, 24280955, 25124238, 25613103, 26200951, 27401940, 27791599, 28439001, 29094718, 29712031, 30512168, 31753182, 32299340, 33517292, 34191897, 35294405, 36477934, 37489621, 38286007, 39312017, 40735539, 42163262, 43171872, 44698320, 46562235, 47898135, 49210363, 51206973, 52665682, 54155590, 56416420, 58443205, 60511698, 62702603, 64670400, 67707639, 70599331, 72924840, 75857641]
14312G5857641L294924K781189L886678L513497L753291M373200M507030M562035
14304A06529485N066056M913373N801471N802592O754470O361654P267976P771465
14296A56268542Q222752Q529299R318023R912511J0410226J1022079J2241664
14289B25925096J2340505J3165661J3978401J4768718J5230026J5919209J6326113
14282C27653729J6881856J6975205J6855898J6604962J6455112J4996853J3970571
14275D40394186J2469159J0522531P711464K780369l59453L18900l14444k661631
14267D70861081m825158q408000r800273j1593775j3453859j5564046j6379585
14260C90836385j7170351j6985757j7269545j6384081j6559665j5630832j3996695
$$ y = [75857641, 79152565, 81933754, 85820432, 89333929, 93087220, 97460420, 101967450, 106529485, 111595541, 116508914, 122310385, 128112977, 134867447, 141229101, 148497077, 156268542, 164491294, 173020593, 182338616, 192251127, 202661353, 213683432, 225925096, 238265601, 251431262, 265409663, 280178381, 295408407, 311327616, 327653729, 344535585, 361510790, 378366688, 394971650, 411426762, 426423615, 440394186, 452863345, 463385876, 471097340, 473877709, 473518256, 473837156, 473522712, 470861081, 466035923, 457627923, 447827650, 436233875, 422780016, 407215970, 390836385, 373666034, 356680277, 339410732, 323026651, 306466986, 290836154, 276839459]
14253B76839459j4810478j3785810j3303958j2351773j1627798j0907440j0430217
14246A89621985j0314843q813655p945212q351644p092808p419721o937565o237060
14238A26509477n098638n731002n161297m914239m807788m401059l963867l273694
14230H9157893l617517l249167l869654k773238l192514k857206k565902k340333
14222F4692362k600148k082701j865775j796594k131805j727404j661289j942282
14214D8884364j595331q75035j873294j149166j472064j490318r64386p38629
14206C8726141o29733j724088j378713j102076p87486m23148m03765j248840r64456
14197C0063836j203762n34731o70513k59618o84674q96745o62592q26166l16089
$$ y = [276839459, 262028981, 248243171, 234939213, 222587440, 210959642, 200052202, 189621985, 179307142, 170493487, 162548275, 154196631, 147103823, 139684102, 132746537, 126509477, 121410839, 115679837, 110518540, 105604301, 100796513, 96395454, 92431587, 89157893, 85540376, 82291209, 78421555, 75648317, 72455803, 69598597, 67032695, 64692362, 62092214, 60009513, 58143738, 56347144, 54215339, 52487935, 50826646, 48884364, 47289033, 46413998, 44540704, 43391538, 41919474, 40429156, 39464770, 38726141, 38096408, 36372320, 34993607, 33891531, 33104045, 32680897, 32277132, 31028292, 30063836, 28860074, 28325343, 27654830, 27395212, 26710538, 25813793, 25151201, 24325035, 24008946]
14188B4008946p27083l35094n15789n03729o09884m22350n91901n16309j28442
14179A9658365n78186o60273j25389n30486k78763l81145j08680l34550l86438
14170A6274455n91855j93762l32034J58804m77774j37404l58731n10309l24769
14161A3506621M9825j76077l79751n53616R0611l37329J64948n34431l22232J62949
14151A1671518n44047K01645l06724m26685k60370J18385l21739j26506j2516
14142I992961k26465j34455k2605l36983O7826j02759m91211J64841l9749l20802
14132H550599j54615k14584j06005J61377n21342m5705j7481J52766k39986j96594
14122G368430L5626l44467M3110l32837K45933k66707j15098L2447N3791k13696
$$ y = [24008946, 23281863, 22946769, 22430980, 21927251, 21317367, 20895017, 20303116, 19786807, 19658365, 19080179, 18419906, 18294517, 17764031, 17485268, 17104123, 16995443, 16660893, 16274455, 15682600, 15488838, 15156804, 15315608, 14837834, 14700430, 14341699, 13831390, 13506621, 13556446, 13380369, 13000618, 12447002, 12537613, 12200284, 12365232, 11830801, 11508569, 11671518, 11127471, 11329116, 11022392, 10595707, 10335337, 10453722, 10131983, 10005477, 9992961, 9766496, 9632041, 9609436, 9272453, 9340279, 9237520, 8746309, 8911150, 8871401, 8550599, 8395984, 8181400, 8075395, 8236772, 7715430, 7669725, 7652244, 7805010, 7565024, 7368430, 7404056, 7059589, 7102699, 6769862, 7015795, 6749088, 6633990, 6666437, 6720228, 6506532]
14112F506532k03943l9107O497L37100n10093k10671k15438K1644K17452k86538
14102E623435O5253n7365j0709R5853k64011n2508k92949l61420M43701K47886
14092E437166q8606K3887m86330J45176j18091J17615l55056k20212M33228l38511
14082D550266o9032P6565l09138K57262l12248O7215R6080l4367R6941k25695
14072D193849k28181K60190k39253k51376M90050o05556M94726m80781j36838
14063C496830m8714L11909j22104M81j0464J1528J83744k66455j2667j96276J32862
14052C480674L89717n32470L5350J42111l44440j41730J62181J51800m5323l11949
14042B985921k2509P2378Q2213n38588Q8671K35194J01761J944j52728L31101
$$ y = [6506532, 6302589, 6263482, 6269979, 6607079, 6096986, 5886315, 5670877, 5692521, 5909973, 5623435, 5688688, 5631323, 5620614, 5716467, 5452456, 5399948, 5106999, 4745579, 5189280, 5437166, 5348560, 5372447, 4886117, 5031293, 4913202, 5030817, 4675761, 4455549, 4888777, 4550266, 4481234, 4557799, 4248661, 4505923, 4193675, 4260890, 4356970, 4322603, 4419544, 4193849, 3965668, 4225858, 3986605, 3735229, 4225279, 3619723, 4114449, 3633668, 3496830, 3448116, 3760025, 3637921, 3638402, 3627938, 3639466, 3823210, 3556755, 3544088, 3347812, 3480674, 3870391, 3337921, 3373271, 3515382, 3170942, 3029212, 3191393, 3343193, 3297870, 2985921, 2963412, 3035790, 3118003, 2579415, 2668086, 2903280, 3005041, 3006985, 2854257, 3185358]
14032C185358k62506L16324p10267M58390m2635m82092J30598j69561N5427Q3011
14022B562047K14694j89842n7049J76825k61796J10950m08672L31804J5544l69064
14012B125441K02117J46490k55635q8878q3412M0713J4676j36146O8004j27410
14002A905960k91117K72908J05741p4740j08068K50648l02386J44000l1355m8678
13992A822913K8771K00106n2680N05846K340891N550416J5787683K7937322k5885579
13983B8235689A2827329m970133k207248j135272o74478n18644q6277m21046J23894
13974B938125p7348n13877j13209L27036k66582p6872l5003j68376J89097J16136
13964B319127o18474N65848m32356J35299O8015j42328k02141K76210R1556j66325
$$ y = [3185358, 2922852, 3239176, 2528909, 2987299, 2944664, 2462572, 2593170, 2423609, 2479036, 2562047, 2776741, 2586899, 2529850, 2706675, 2444879, 2555829, 2147157, 2478961, 2494505, 2125441, 2327558, 2474048, 2218413, 2129535, 2046123, 2086836, 2101512, 1965366, 2033370, 1905960, 1614843, 1887751, 1993492, 1918752, 1810684, 2061332, 1758946, 1902946, 1871591, 1822913, 1851684, 2051790, 1999110, 2504956, 4845847, 10396263, 26183946, 54121268, 28235689, 12827329, 7857196, 5649948, 4514676, 3840198, 3321554, 3235277, 2814231, 2938125, 2860777, 2346900, 2233691, 2560727, 2294145, 2217273, 2182270, 2013894, 2202991, 2319127, 1700653, 2266501, 1834145, 1969444, 2037459, 1895131, 1692990, 1969200, 2060756, 1894431]
13954A894431j28476K1419N7943J8006L4364Q8717j17389l54034j13858M0219
13944A441342N90295o12537P71148o85414j58428j74287K83386R2659j61150M74948
13934A861962l47354L30233n8748j56362o6310j96316J62868r3849J42830J38878
13924A717832l29831J25030m29061K64615J69021J3193r6427J19172O8155q5974
13914A535725k20023L95031k68514k63646J55601L50208l56481j88093k9410J91293
13904A301691o0504j4443j05167o7391J69773k6663K62378k99769L38827l57114
13894A141618R5217O09J0895k08560J52773m46812M46879J92628l49450Q0876
13884A116673J57386j55516P8172l7003j03985J15613N5763k14848K37806j98
$$ y = [1894431, 1765955, 1787374, 1845317, 1863323, 1897687, 1986404, 1869015, 1514981, 1401123, 1441342, 2031637, 1419100, 2190248, 1504834, 1346406, 1172119, 1455505, 1548164, 1387014, 1861962, 1514608, 1844841, 1786093, 1629731, 1563421, 1367105, 1529973, 1436124, 1578954, 1717832, 1388001, 1513031, 1083970, 1348585, 1517606, 1530799, 1434372, 1553544, 1621699, 1535725, 1315702, 1710733, 1442219, 1178573, 1334174, 1684382, 1327901, 1139808, 1110398, 1301691, 1241187, 1226744, 1121577, 1054186, 1223959, 1197296, 1459674, 1159905, 1498732, 1141618, 1236835, 1237444, 1248339, 1039779, 1192552, 745740, 1192619, 1385247, 1035797, 1116673, 1274059, 1118543, 1196715, 1159712, 1055727, 1171340, 1227103, 1012255, 1250061, 1249863]
13874A249863j82949k70019M35362j80512J54518q2455P5806k41996K76166J01378
13864A335162l72496o6645O5339O4557j02446n808J90568q5293L61079k66599
13854A117418j65348J99556k23771j87904L98570j57446N4475k24936J09309M42365
13844A362288E08322M59786j57411K90706l92306M56313m74162J11194K88172
13835A090614l79708K1959K52192J8806o1322j49391p9547J47015j72358J75515
13825H63775l20576K01833K82683l46805K04273K70184l35195n6586l37026L55239
13815G81799K25318q4110j67606j80297J05371L80279k86583m3913J98123l34170
13805E94211J0840L01685l40083J07024J50621k2490m3455o2333n8889p37K29274
$$ y = [1249863, 1066914, 796895, 1232257, 1051745, 1206263, 1123808, 1199614, 957618, 1233784, 1335162, 962666, 896021, 961360, 1025917, 923471, 917663, 1108231, 1022938, 1384017, 1117418, 952070, 1151626, 927855, 739951, 1138521, 981075, 1035550, 810614, 919923, 1362288, 508322, 968108, 810697, 1101403, 709097, 1165410, 691248, 802442, 1090614, 710906, 732865, 985057, 1003863, 942541, 793150, 713603, 860618, 688260, 863775, 543199, 745032, 1027715, 680910, 885183, 1155367, 820172, 763586, 426560, 781799, 1007117, 923007, 755401, 575104, 680475, 1060754, 774171, 730258, 928381, 594211, 605051, 906736, 566653, 673677, 824298, 801808, 758353, 696020, 637131, 636394, 865668]
13794H65668l1879l94228N29744k23759r3975J07156k89749m9551K90375j38299
13784E71503J33553J99226k43955r6088q9623J49182k0219m3317j30349K16771
13774F46684J01687m3422L02767k73797B57496M62228j66733K13897k11998K82752
13764H37642j69831k25856K28786j64766K33459o3070N3415J7253J97720k13105
13754G31647M7435M4216k59129j50092K90105k05456N2724J05236M883j44815
13744E16754l2629Q5395K7972j0727l2942K22508D6057R06021k92167P2311A81666
13732B72430K03490K93435j44327p3132J81894o6945l18429L11373k69625J48483
13722E38647n5647O7135N8179j34001O3844k14843L78187M4864l05652J76035
$$ y = [865668, 833789, 439561, 969305, 745546, 651571, 758727, 468978, 419427, 709802, 571503, 705056, 904282, 660327, 564239, 474616, 623798, 603579, 560262, 429913, 646684, 748371, 704949, 1007716, 733919, 257496, 719724, 552991, 766888, 554890, 837642, 667811, 441955, 670741, 505975, 739434, 676364, 729779, 747032, 944752, 731647, 779082, 823298, 564169, 414077, 704182, 498726, 551450, 656686, 661569, 516754, 484125, 569520, 597492, 586765, 553823, 776331, 46057, 952078, 659911, 732222, 181666, 272430, 475920, 769355, 625028, 551896, 733790, 666845, 348416, 659789, 390164, 538647, 483000, 550135, 608314, 474313, 538157, 323314, 701501, 746365, 440713, 616748]
13712F16748O4319j473l01398L52506j22047j36166k01632j13382J25477K87932
13702E70884R0053j78974G5646O81794n0740k24479j54595M7538L24679A71133
13691G61467J24920B55315l5338q306L25023j27945J44515B10406K68354R0652
13681E69412B14668N69086B17387O27867m10834J86076k54353J21890J9006r0696
13671D16343M457J96836B45790K44379j84824l7407M8227G7010J30043p3608J90704
13660C24149n589M7086J96189K9310A98588L72240j57082r7096m7266n3615J25159
13649C40928j31506N41706l18766K1309j16333R2727m2647K58893C01357Q6263
13639C87620J32191n8503o6859J48821A41306K60011k8351L18172l36567K35078
$$ y = [616748, 681067, 679594, 378196, 730702, 608655, 472489, 270857, 157475, 282952, 570884, 660937, 481963, 75646, 757440, 706700, 482221, 327626, 375164, 699843, 171133, 761467, 886387, 255315, 219977, 211671, 536694, 408749, 553264, 210406, 478760, 569412, 214668, 783754, 217387, 845254, 434420, 620496, 366143, 488033, 507039, 416343, 420800, 617636, 245790, 490169, 305345, 267938, 316165, 77010, 207053, 133445, 324149, 318560, 365646, 561835, 591145, 198588, 570828, 413746, 316650, 269384, 215769, 340928, 209422, 751128, 432362, 453671, 337338, 430065, 387418, 646311, 301357, 387620, 519811, 461308, 394449, 543270, 141306, 401317, 372966, 691138, 354571, 589649]
13629E89649j32079a9866D17049K33210l1524I3963M6302J70147j21191K11823
13619D01044R5248A89152N28480J15637A39681L45472k12254R3228K83499E4303
13608B54525O8679p4648J71151A55665K02475J47120E2659K64042n6624d1229
13597D19087j5510j18063K42831L2742j56800r0611J86657k08995K6953j5313
13587C02978J36128F1083K69752K11520k27672J1933j61951L01407j70742j1963
13577B83367k9195f701C41804F5749K85136A38741e1388A67544J68772f5322C11442
13565A36165q624M4240N51039C57613b9303C60869K80498k18575m4854h415E56646
13553e1330C25661k5351n8043q0385J63923J90163B25607J11945K29037A94732
$$ y = [589649, 457570, -19866, 417049, 650259, 618735, 93963, 140265, 310412, 189221, 401044, 496292, 189152, 717632, 833269, 139681, 485153, 272899, 366127, 649626, 54303, 254525, 323204, 248556, 419707, 155665, 358140, 505260, 52659, 316701, 260077, -41229, 419087, 403577, 285514, 528345, 561087, 404287, 313676, 500333, 291338, 318291, 302978, 439106, 61083, 330835, 542355, 314683, 326616, 164665, 466072, 295330, 283367, 254172, -6701, 341804, 65749, 350885, 138741, -51388, 167544, 336316, -65322, 311442, 136165, 127541, 171781, 722820, 357613, -29303, 360869, 641367, 422792, 377938, -8415, 556646, -51330, 325661, 300310, 242267, 161882, 325805, 515968, 225607, 337552, 566589, 194732]
13542D21699N6289j80382L8011n4409O9003j54464o2389J55416Q3017A28348J70035
13531B98383c2361C29652c059o1591A34538R9463L48025B12096j04680K03102
13521C10518P3778a2857B81880K0353P3739m4637j41711J73683j13180P7914j22947
13510B05094L8982r2339E8217K00391a5641F7657M21463A32624K53654K4767j08718
13499C02327O5836J44941k51166K5160k2519Q3172C4632J27732Q8835M0855G6098
13487D05880q8972Q0140J4098J24534A00706L7321J83646J9980J83575k54604
13477B70624l087j2657K01519K2031j93779j37519J6000l8386J17210K9361g4
13465B06847J2027J37378c6137B39058D5529a00265C50096q5983J52980c6195
$$ y = [421699, 477988, 297606, 335617, 281208, 350211, 195747, 133358, 288774, 371791, 128348, 298383, -32361, 329652, -3059, -64650, 134538, 234001, 582026, 212096, 107416, 310518, 384296, -12857, 281880, 302233, 375972, 331335, 189624, 363307, 250127, 328041, 205094, 244076, 151737, 58217, 258608, -15641, 67657, 489120, 132624, 386278, 411045, 302327, 368163, 513104, 261938, 287098, 264579, 347751, 34632, 162364, 251199, 292054, 76098, 405880, 316908, 397048, 411146, 535680, 100706, 138027, 321673, 341653, 525228, 270624, 267537, 254880, 456399, 478430, 284651, 147132, 163132, 124746, 241956, 271317, -74, 206847, 218874, 356252, -36137, 239058, 45529, -100265, 350096, 264113, 417093, -36195]
13454C27631A5972L17149k2012A01754M74232A96445K71539A28450O107K29764
13444C64321k9237B6770g4616F3835b6578g151B41943q8885K51305m0174H4217
13432c709C36493a24343e9571F0326b3665k75458a941C04359q6131E7474L47678
13421D05152A40835O2063q1722J04582J25882n3550B9987J97738K80189j24182
13411C83732j30480j20774R8738h6702B28194J12054a36103j16371I6386M6494
13401A42880P9636N7379o2442G3793d1686A23719m0750K25736D289g9297A40673
13389A57588A0199L27789a89892C16866l0368j06846F6705K69014E6939J51641
13379B08580D3M42775A07129m8147d8587I2352K9240L75800j2971p4114m5488
$$ y = [327631, 15972, 333121, 311109, 101754, 575986, 196445, 467984, 128450, 134557, 364321, 335084, 26770, -74616, 63835, -26578, -7151, 241943, 153058, 404363, 364189, 84217, -3709, 336493, -124343, -59571, 60326, -23665, -299123, -1941, 304359, 218228, 57474, 405152, 140835, 202898, 121176, 225758, 351640, 298090, 29987, 227725, 507914, 383732, 253252, 132478, 231216, -86702, 228194, 340248, -136103, -252474, 96386, 142880, 222516, 279895, 217453, 73793, -41686, 123719, 82969, 308705, 4289, -79297, 140673, 157588, 10199, 337988, -189892, 316866, 286498, 179652, 66705, 335719, 56939, 208580, 43, 442818, 107129, 58982, -48587, 92352, 121592, 497392, 484421, 410307, 364819]
13368C64819F3127A3315M59183l4215j86981K36812G8242J48783j8655J78509
13358C86879b3151C02467B5086J91779q250C5672L19976D6532M72219B46430J04423
13347C50853D5409P4947O6803L01811e1949F12436k27544p3420h8012D01791j29752
13336B72039O7649q2759e8944b3685A19872K6554B4758K83879a30141I7434P5026
13325A72460p8815k532k2434J70211k026k6498r7744K52356J07869D4643o611
13314C8032N5609J7034L64923j80802q583k6133c7068p8634N6466A9004K0748
13303C9752J70875J05193e9438A50898j3246N70535j28800g5721a211E12223a3953
13291a9926k6101q1129B24874J50510C4302J90642h6458B47097H2834L6898B7340
$$ y = [364819, 63127, 13315, 472498, 438283, 251302, 488114, 78242, 227025, 208370, 386879, -23151, 302467, 25086, 216865, 208615, 35672, 355648, 46532, 518751, 246430, 350853, 45409, 120356, 187159, 488970, -51949, 612436, 384892, 311472, -88012, 401791, 272039, 339688, 256929, -58944, -23685, 119872, 146426, 24758, 308637, -130141, 97434, 172460, 93645, 91113, 68679, 238890, 236864, 210366, 112622, 364978, 472847, 44643, 38032, 93641, 110675, 475598, 294796, 286213, 260080, -37068, -115702, -59236, 19004, 39752, 210627, 315820, -59438, 150898, 137652, 708187, 579387, -75721, -1211, 512223, -13953, -19926, -46027, -127156, 224874, 375384, 34302, 224944, -86458, 247097, 82834, 119732, 27340]
13279D99893C8552Q9263J21476b7647C46153i6958I6242L01137p5139a083D07049
13267F1627J99134a97448c653C46000K8979b1930A30812J86828f138B2790f2494
13255H9214Q5261R6903i0777A16238J97723h2842A82822J51588M642r8333a3442
13243b6602C57877A00913D7076K53065E4131K91563r4842Q2389j9812J2395A27758
13231A17160a4147a682p5704C17229a9789H7053J15729f4006A70572a38937f8251
13219C52660A12635g8236A25648M6192G770P198i0893B87990f0597A97106E9789
13207c13799A92734d1286G9376K03661E7557a06099A38744f333E9809R4209E2007
13195A33887J53769A24671O115e091A12928O0200k0241a3812p7636B71125b4981
$$ y = [499893, 38552, 127815, 249291, -27647, 346153, -96958, 96242, 397379, 322240, -1083, 407049, 61627, 260761, -197448, -3653, 346000, 374979, -21930, 130812, 317640, -6138, 22790, -62494, 89214, 174475, 271378, -90777, 116238, 313961, -82842, 182822, 334410, 339052, 240719, -13442, -26602, 357877, 100913, 47076, 300141, 54131, 345694, 250852, 333241, 313429, 325824, 127758, 117160, -14147, -1682, -77386, 317229, -19789, 87053, 202782, -64006, 170572, -138937, -68251, 352660, 112635, -78236, 125648, 171840, 7770, 14968, -90893, 287990, -60597, 197106, 59789, -313799, 192734, -41286, 79376, 283037, 57557, -106099, 138744, -6333, 59809, 154018, 52007, 133887, 287656, 124671, 130786, -5091, 112928, 173128, 152887, -13812, -91448, 271125, -24981]
13183A24982J59053D9879j3216a21264d2707B76325a70416G1879J36578H4734
13172A99921c9340I9291a35135C26269n5216A32405N3574f6745H7983a75291F0601
13160c18588a3174B34446G8298M8253a97719E7636a14454p6444n514Q5776A10503
13148A71907O4564a57598G4491K98751B0963K25629N0222j27757f8784a3071j48946
13137a62017O5580I258b2068A34624L3940b90847D29196k13604G8460j0309e8207
13125a24082n1098i574p3671C28448L2554a43122a0211A47258k7934J27803d2930
13113A11291R6942M1715a18647C0163a71010e355A51898a64755D4499a54755C35802
13101d7483A66125D7039j55K08134q7255K12072j56049a86464B58663K8286c60309
$$ y = [124982, 284035, 49879, 36663, -121264, -42707, 276325, -170416, 71879, 208457, 84734, 199921, -39340, 99291, -135135, 326269, 271053, 132405, 185979, -66745, 87983, -175291, 60601, -318588, -13174, 234446, 78298, 126551, -197719, 57636, -114454, -190898, -196412, -110636, 110503, 171907, 236471, -157598, 74491, 373242, 20963, 246592, 296814, 169057, -68784, -13071, -162017, -96437, 9258, -22068, 134624, 168564, -290847, 429196, 215592, 78460, 68151, -58207, -124082, -175180, -9574, -83245, 328448, 361002, -143122, -10211, 147258, 119324, 247127, -42930, 111291, 208233, 249948, -118647, 30163, -171010, -5355, 151898, -164755, 44499, -154755, 335802, -47483, 166125, 47039, 46884, 255018, 167763, 379835, 223786, -186464, 258663, 286949, -360309]
13089B05516C6796e0829A76873l3020J0061J55498j6173C4902N4281l7655J6241
13078F7769g4606A81323c4394j65131A97220g1313B71491j12647k8162J53259
13068B83941A4268J06217K6402d82490A84257O1736H2487C1006J06969O6298k7373
13057A76900G5424L50098n2740m7239h5702l8962C03557A30646A8066J96188O3925
13046B78179p2001q9519a84523L9577F1885M071J81442F8333a5288C32840k8678
13035C04162N2470b0164D6225j0182J46287o721D7378j088A3320c8590H2516a32936
13022B77237R2817A66915O8065k5309A03237P3878G0727J65556K9167j10891i0983
13010B38977b39283C12603l8678i1887A67297l5584a3868A48363a26530F5286
$$ y = [205516, 36796, -50829, 176873, 143853, 153914, 309412, 293239, 34902, 89183, 51528, 67769, -74606, 181323, -34394, -199525, 197220, -71313, 271491, 158844, 130682, 283941, 14268, 120485, 146887, -482490, 184257, 245993, 82487, 31006, 137975, 204273, 176900, 75424, 425522, 372782, 325543, -85702, -124664, 303557, 130646, 18066, 214254, 278179, 206178, 116659, -184523, -144946, 61885, 65956, 247398, 68333, -15288, 332840, 304162, 356632, -20164, 46225, 36043, 182330, 175609, 47378, 46290, 13320, -38590, 82516, -132936, 277237, 370054, 166915, 234980, 209671, 103237, 177115, 70727, 236283, 265450, 154559, -90983, 238977, -239283, 312603, 273925, -91887, 167297, 131713, -13868, 148363, -126530, 65286]
12999e5567B34849h7819I5897O0113J51352D9576N7491O2876o2269e1080F3427
12987B44685O2700h2946B432a37699A62925e5942H0781j0290f7975l46854A062
12975G1513J3475a41074A28354e3204A44763j3342K41816i1267I4855J81777g9168
12963A52695b30561b729j53055m823m2857A41424J06799a09286B04991a18942
12952c1797B60435C6198J01128j8227i8640A6730D070b14104B23940r9463E3194
12940C36056j50842B6915J7163m740J69860m3559D1036K0597d5119I144a398m3986
12928d5384A39382Q1042b70039B99490A11233b60400e8167D5923h0598q0400N0968
12917a10030n0521A94155J43831a58704B55822a62715l7635h5593L9080G8016
$$ y = [-55567, 234849, -87819, 95897, 156010, 307362, 49576, 107067, 169943, 107674, -51080, 63427, 244685, 307385, -82946, 2432, -137699, 162925, -55942, 80781, 70491, -67975, -414829, 1062, 71513, 84988, -141074, 128354, -53204, 144763, 131421, 373237, -91267, 94855, 276632, -79168, 152695, -230561, -2729, -155784, -160607, -203464, 141424, 248223, -109286, 204991, -118942, -31797, 260435, 36198, 137326, 119099, -98640, 16730, 4070, -214104, 223940, 124477, 53194, 336056, 185214, 26915, 44078, 39338, 209198, 165639, 41036, 61633, -45119, 9144, -1398, -45384, 139382, 220424, -270039, 299490, 111233, -260400, -58167, 45923, -80598, -160998, -110030, -160551, 194155, 337986, -158704, 255822, -162715, -200350, -85593, -46513, 78016]
12906d4853A36049E2045l784P5343a36758M9762q1157B4489e7494I8729R9497
12895A98226F1631M0809J773b49985A41598a86120F2937a2672A002a32672A7459
12883b57450A90751k6010n3382N614e7427k45291C11191i6971A96280D318P8940
12872H3258a01935D45181G6674J20040J46106b95438F1590b51173c6412j79927
12862b16339K0657A20385J1236b5333B75130q1240c54l252B3094J46159m7784
12851A21469a93293A72298C0647g2187G4679p469f8720A61658b37806B10247G9770
12839G7514P3465b93841A34147a04353l9464G8026B9980J0218g9043m2174c2343
12827B41939E6282Q0911J50944Q586g0779j46680H1148K94974B5213f7093A90699
$$ y = [-44853, 136049, 52045, 48261, 123604, -136758, -86996, -168153, 24489, -57494, 98729, 198226, 61631, 102440, 104213, -249985, 141598, -186120, 62937, -12672, 1002, -132672, 17459, -257450, 190751, 164741, 111359, 116973, -57427, -302718, 311191, -96971, 196280, 4318, 83258, -101935, 445181, 76674, 196714, 342820, -295438, 61590, -251173, -36412, -216339, -195682, 120385, 131621, -25333, 275130, 193890, -354, -3606, 23094, 169253, 121469, -193293, 172298, 30647, -72187, 74679, 67210, -68720, 161658, -237806, 210247, 79770, 77514, 150979, -293841, 134147, -104353, -143817, 78026, 29980, 40198, -79043, -121217, -32343, 241939, 56282, 137193, 288137, 296723, -70779, -217459, 81148, 376122, 25213, -67093, 190699]
12815H8561a99460B80005a86848b8873k5285A77380e3605M927A75600a09746F6036
12803f394b165a07A40109N536A78J18930d1840C34973a60709C5737a98191H5422
12790G0887b2357D216K44982C4863a34839j36167J34043l301A00012L7988A1107
12778e1426A44380J83724A11748b19616l822A84081F3673d0249E8813a02051p549
12767a09600A10283b30463B51407a25454o623R624l4719A2385J19959b94208D88617
12755A90937a34378B37802a11410A07453a7843k34891b2565A34710a1536D26103
12744C4421j3001p07a07658B04506P5381c5602B27378j02570J21035a62494B9585
12732B09159a14974I650f5830l071E762R7193M635C5809N1518e9053k2169p1186
$$ y = [88561, -199460, 280005, -186848, -28873, -54158, 177380, -53605, -48678, 175600, -109746, 66036, -6394, -2165, -107, 140109, 145645, 178, 119108, -41840, 334973, -160709, 35737, -198191, 85422, 70887, -22357, 4216, 249198, 34863, -134839, -271006, -136963, -140264, 100012, 138000, 11107, -51426, 144380, 328104, 111748, -219616, -223438, 184081, 63673, -40249, 58813, -102051, -109600, 110283, -230463, 251407, -125454, -132077, -122453, -157172, 12385, 132344, -294208, 488617, 190937, -134378, 237802, -111410, 107453, -17843, -252734, -22565, 134710, -11536, 426103, 34421, 21420, 20713, -107658, 204506, 279887, -35602, 227378, 124808, 245843, -162494, 29585, 209159, -114974, 9650, -65830, -68901, 5762, 102955, 107590, 35809, 87327, -59053, -81222, -152408]
12720a52408H0879M8620J49442a60913C46214H6781r211c0953A25681n9991a10570
12708E48603C6562J18136f8081B60775p8929b6429D21858J47113j65823A41937
12697A28333J08934Q5297g9296j26349G5958b73086I8976K12878a93853A96343
12686A85629J46332g0272b849j06686A56262L6410b1882C4133P253K76985g5158
12674C99942o5904F9140O7751J92153b71051R7368C22403a44980I9322M56507
12664E55829B14923r3600a3522A94213c23837H0990c9046G7172B4628H650K63425
12653B72075D5472K22913a31754C87688H7322N5154c07297a14269l1380M0204
12643a05445A78944n3691b4701B31180o2511b72120e8073C17097I1730J07479
$$ y = [-152408, 80879, 129499, 278941, -160913, 346214, 86781, 77570, -30953, 125681, 65690, -110570, 548603, 36562, 154698, -68081, 260775, 181846, -26429, 421858, 568971, 403148, 141937, 128333, 237267, 322564, -79296, -205645, 75958, -273086, 98976, 311854, -193853, 196343, 185629, 331961, -70272, -2849, -109535, 156262, 192672, -21882, 34133, 41386, 318371, -75158, 399942, 334038, 69140, 136891, 329044, -271051, -173683, 322403, -144980, 99322, 555829, 214923, 121323, -13522, 194213, -323837, 80990, -39046, 77172, 24628, 8650, 272075, 45472, 268385, -131754, 387688, 87322, 142476, -307297, -114269, -145649, -105445, 178944, 125253, -24701, 231180, 168669, -272120, -58073, 317097, 91730, 199209]
12633A99209E7136J35616g9106D82680c4481B80944L0378A15578Q1003j4642b15689
12621D3157K29383A10334K24629A50373a52372B09972c7037D3902Q8208K3527
12611A55637j4159i0764B18526Q5741Q4533B1297K15040f1984A44246J66703m3050
12600B67899a59588A72550J97497A73582J41115H2872K63376b6524j41632A62253
12589c6696l71385I6668A8796b3591B10611C9098K28628i1908j2796C1992d4793
12577B43351D3541J50433a14559G7874B0850c7307B32047B0901J09723a45385
12566A40845L2043a06206r0108G7693K53790m5631b40964A41903C6566B941L7712
12555D0653D416c36255B4542m943a53921j82676B76971b29850j33981J76810I7973
$$ y = [199209, 57136, 192752, -79106, 482680, -34481, 280944, 311322, 115578, 196581, 181939, -215689, 43157, 272540, 110334, 334963, 150373, -152372, 209972, -37037, 43902, 132110, 155637, 141478, -90764, 218526, 304267, 388800, 21297, 236337, -61984, 144246, 310949, 267899, -159588, 172550, 370047, 173582, 314697, 82872, 346248, -26524, -168156, 162253, -36696, -408081, 96668, 18796, -23591, 210611, 39098, 267726, -91908, -104704, 31992, -44793, 243351, 43541, 193974, -114559, 77874, 20850, -37307, 232047, 20901, 130624, -145385, 140845, 172888, -106206, -196314, 77693, 331483, 285852, -240964, 141903, 36566, 2941, 40653, 4416, -336255, 24542, 19599, -153921, -336597, 276971, -229850, -363831, -187021, 97973]
12543A03117b24119d4246n4195F0325K28548b25545K2796C40332e0536p7224F1924
12531b8493O518B46161r7280b17588E9836e4597A20903K7656N0636I0790h2899
12519B19677J4729C5450J55848M1514g3446c8A21737B4584Q6463K54970h864B37412
12506b74400G5700a73050m0903C44450b22611g7070A21913a1965C62185D6695
12495G6849B7117d3555H8020h8752I7817J42953a6806I8626N4689a97078B16621
12483d2038j0699B9514d8729A53830m1042a79888e8874j83956D4461c952m9473
12472e3425a8853C29231F1201K7567a62230O3511d7618A54448J25267G8541a85436
12460A7160R841J72302h6952D5895c46506j14531D1226L14204D99J60975C5044
$$ y = [103117, -224119, -44246, -98441, 60325, 288873, -225545, -202749, 340332, -50536, -127760, 61924, -28493, -21975, 246161, 148881, -217588, 59836, -54597, 120903, 148559, 199195, 90790, -82899, 219677, 234406, 35450, 191298, 232812, -73446, -38, 121737, 24584, 111047, 366017, -8864, 237412, -274400, 75700, -173050, -213953, 344450, -222611, -77070, 121913, -11965, 362185, 46695, 76849, 27117, -43555, 88020, -88752, 97817, 240770, -16806, 98626, 153315, -197078, 216621, -42038, -52737, 29514, -48729, 153830, 112788, -179888, -58874, -242830, 44461, -3952, -53425, -18853, 329231, 61201, 88768, -162230, -98719, -47618, 154448, 279715, 78541, -185436, 17160, 27001, 199303, -86952, 45895, -346506, -461037, 41226, 355430, 499, 161474, 35044]
12448E9902L65671a22732O1332J649A7836e7200A05530a93645g2642o1506A92503
12436d9513j24183e9450C13500A14032C6386R8317D0551f3680j49502Q6197N4144
12425g2841D7236e3182J8566j28753j56039A54319b22176D8398b6725A10452J94068
12414C04520a24935D8239a32131b7878E7980a49656d3117k34637h4056A26024
12403A39951a70845A90344A1641h9634A20646j3762c2667j85707D4877K6360c0400
12391B2716f9981j57268B6354a64035g2782A1046K8296h6416a9929E7137K7536
12380H4673j9582C965K14919c11458a45382b0969B37948e1814l544q8770A57431
12368i4988j07266H3115A2530a83317G5191l2451b14464j9444c1212B28257a74405
$$ y = [59902, 425573, -122732, -61400, -59751, 17836, -57200, 105530, -193645, -72642, -134148, 192503, -49513, -173696, -59450, 313500, 114032, 36386, 134703, 40551, -63680, -213182, -126985, -72841, 47236, -53182, -34616, -163369, -319408, 154319, -222176, 48398, -26725, 110452, 304520, -124935, 48239, -132131, -27878, 57980, -149656, -43117, -277754, -84056, 126024, 139951, -170845, 190344, 11641, -89634, 120646, 106884, -32667, -218374, 44877, 71237, -30400, 22716, -69981, -227249, 26354, -164035, -72782, 11046, 39342, -86416, -19929, 57137, 84673, 65091, 3965, 218884, -311458, -145382, -20969, 237948, -51814, -55358, -144128, 157431, -94988, -202254, 83115, 12530, -183317, 75191, 42740, -214464, -233908, -31212, 228257, -174405]
12356A65740b77501A40571L7927A4695a34008r3624D10368A98503a54620G2084
12345a22562b3976A5138Q5840M23517c8514J4221F5547i1440A72047M3455a15662
12333B81542n1300R0348F2567b8292E1250a44933J9689I2899e7198k5095j22282
12322b04575g4529j30277P1493A23867I043a74034A61406b01726E4441J7005J11308
12311A82754d4112A0335a22203A3531a10745M9032n9765o7292A65517J6288h6046
12299c3157a2892B70916q2639k5641a8363C85540a67032o387I0585K33228j51541
12288A72272F5280Q2612b06895C1664R4550J41063D57J96567J13018A00574G922
12276b56515B48361K67376f4488A22775A5403J3584j1202K10490d7541A80684
$$ y = [165740, -277501, 140571, 178498, 14695, -134008, -227632, 410368, 198503, -154620, 72084, -122562, -23976, 15138, 100978, 524495, -38514, -24293, 65547, -91440, 172047, 215502, -115662, 281542, 230242, 320590, 62567, -28292, 51250, -144933, -125244, 92899, -57198, -82293, -204575, -74529, -204806, -133313, 123867, 9043, -174034, 161406, -201726, 54441, 71446, 182754, -44112, 10335, -122203, 13531, -110745, -61713, -121478, -188770, 165517, 181805, -86046, -33157, -12892, 270916, 188277, 162636, -18363, 385540, -167032, -173419, 90585, 323813, 172272, 65280, 147892, -206895, 31664, 126214, 267277, 457, 197024, 310042, 100574, 7922, -256515, 248361, 515737, -64488, 122775, 15403, 28987, 17785, 228275, -47541, 180684]
12265a7941B64189A6643J48254B6347A0279K26245A12561J68667f5897j4659I7845
12253A27823b59874A55347G1288g9640D44641k04916o6476p9461i6934l8464K611
12242a32787A62006C391a99732A89754l4511b66312e6020A7864J88777J27889
12232C34530g0450E4648J04542D8470j0006j7219f8896E65351A86628J48964j09534
12221B26058j0426j0052a19120A29961Q0114G2692J80945J7138f1971E44584D9802
12209C42256H1919P0299c03545F6390J34822C0982K75320B8055K30908b62209
12198a80255A62920a5778B16118K86656k29815r7103K30437e8110A19923K24070
12188C43993i725A31748a4643B14692D5963L4709b60067C22430j53929G4512k8056
$$ y = [-17941, 264189, 16643, 164897, 26347, 10279, 236524, 112561, 281228, -65897, -80556, 97845, 127823, -259874, 155347, 71288, -79640, 444641, 239725, 173249, 93788, -96934, -135398, -132787, 162006, 3391, -199732, 189754, 155243, -266312, -56020, 17864, 206641, 334530, -70450, 54648, 159190, 48470, 38464, 21245, -68896, 565351, 186628, 335592, 226058, 215632, 205580, -119120, 129961, 210075, 72692, 253637, 270775, -61971, 544584, 49802, 342256, 81919, 152218, -303545, 66390, 201212, 30982, 306302, 28055, 258963, -262209, -180255, 162920, -15778, 216118, 502774, 272959, 175856, 406293, -58110, 119923, 343993, -9725, 131748, -14643, 214692, 45963, 80672, -260067, 322430, 168501, 74512, 46456]
12177D6456h9295B97257G7328K86451j18018J754A6486L56251F719M02031A04018
12165A43515K19584A01942B7928J56656c76641C20821A09231l1988K32221A18372
12154G8416Q8320k9324K19207a50069B75564b7617B62053j06569c9448B71851
12143I4438g6622L5605J2944C42992A34133g1715F0436o648R8203L02886a13887
12131a55310j260r725C4735b45337a3750j55008B75634h491j27997M6914A92401
12119c9000j8095c358C33628C1068J51196J22415b68957k46013h3022l59583D94972
12107a56452k5370A86960K4046p0783H928K03192e0238p2877A8942c9933r9075
12096a39008P506b6190j88276P0372B808R9158H791b29263B20552a5702r710A68425
$$ y = [46456, -89295, 297257, 77328, 363779, 245761, 247515, 16486, 372737, 6719, 408750, 104018, 143515, 363099, 101942, 27928, 184584, -376641, 320821, 109231, 77243, 309464, 118372, 78416, 166736, 137412, 356619, -150069, 275564, -27617, 262053, 155484, -39448, 271851, 94438, -76622, -41017, -28073, 342992, 134133, -71715, 60436, 53788, 151991, 454877, -113887, -155310, -156570, -166295, 34735, -245337, -13750, -168758, 275634, -8491, -136488, -89574, 192401, -39000, -57095, -3358, 333628, 31068, 182264, 304679, -268957, -514970, -83022, -442605, 494972, -156452, -181822, 186960, 211006, 140223, 8928, 212120, -50238, -123115, 18942, -39933, -139008, -131502, -26190, -214466, -144094, 2808, 101966, 8791, -229263, 220552, -15702, -25412, 168425]
12083F1696a3196E1449M6795l9152i7213A20615K61852J597043n53659D62751
12072C12619h4631A98055a75944h900I2017M39647e60539A46089h37k68376m9768
12061c18981B36840a61098A24302A4391J9432e3532I4881P0870o566c1420l24415
12050c55835g4209B32055J1164b3268n2363r7212A45966P9322r5228K57288a51962
12038b11529a6811k20892J4933g0605A38845C662d6270j12148A09504a76033k2016
12027a98049e9515L644g90k0609H8493c9441j32921c1291B13520i4073A67679
12015a71422O6967B86686A06817m4768a15405L7800j23608D3854L31898e4013
12004B89558b87823F9623c08743J33910N9284e2581D525K84414a3000A12896c65148
$$ y = [61696, -13196, 51449, 98244, 59092, -97213, 120615, 382467, 1979510, 1425851, 462751, 312619, -84631, 198055, -175944, -8900, 92017, 531664, -560539, 146089, -837, -269213, -318981, 236840, -161098, 124302, 14391, 33823, -53532, 94881, 165751, 159185, -31420, -355835, -74209, 232055, 243219, -23268, -75631, -172843, 145966, 225288, 130060, 387348, -151962, -211529, -16811, -237703, -222770, -70605, 138845, 3662, -46270, -158418, 109504, -176033, -198049, -59515, -55871, -790, -21399, 88493, -39441, -172362, -31291, 213520, -94073, 167679, -171422, -104455, 286686, 106817, 62049, -115405, -77605, -201213, 43854, 375752, -54013, 289558, -287823, 69623, -308743, -174833, -115549, -52581, 4525, 288939, -13000, 112896, -365148]
11992f1932o788A14578d8946A93266j2858p963e2001k87572J50142O0541B34232
11980C3447a69434d3152A82431E1735a63642C3739c48651A30438h7258j39057
11970b26315G4876O858L02741j34007I7977B1623e14178b48338K2148G8863L0954
11959A09817K0776J01114J11208A6498d810A40992d8870K095G1528c59538A15325
11947C24982D6111K52069H5703b88174a38603A60454k1296J9207C4930Q9208f1650
11935F5163c29044B19959e5071D4349A6670i5472A02294A6863L34835C7469J86581
11924B24050P3543D6394b50216d6773R835A42305R375c33299f3751k26482J43821
11913a46412B08091c52518h2881D34825f909k60139A83641n5742d8446B08362
$$ y = [-61932, -68720, 114578, -48946, 193266, 180408, 172445, -52001, -339573, -189431, -128890, 234232, 33447, -169434, -43152, 182431, 51735, -163642, 33739, -348651, 130438, -87258, -226315, 74876, 81734, 384475, 250468, 97977, 21623, -514178, -248338, -226190, 78863, 109817, 130593, 231707, 342915, 16498, -4810, 140992, -48870, -46775, 71528, -359538, 115325, 324982, 46111, 298180, 85703, -288174, -138603, 160454, 139158, 158365, 34930, 124138, -61650, 65163, -329044, 219959, -55071, 44349, 16670, -95472, 102294, 16863, 351698, 37469, 224050, 297593, 46394, -250216, -46773, -36938, 142305, 151680, -333299, -63751, -290233, -146412, 208091, -352518, -82881, 434825, -6909, -267048, 183641, 127899, -48446, 208362]
11902b58648M5179B37288a30323j01074B708c07906E2236c01164A02628a44636
11891C65001j6600d1379l40469J63743B2210b66301A71218J8149e8707l305D73988
11879C29b00474l9303A09624a56760B88630c52632f2298B2405a31050j00193A28542
11867B22250c23005J15337i6538q2831A27442m8660c45731H9791Q1559c94486
11856a75761D7568b0462E4906a06512L1127a1369j17309A64426h337j444p0597
11845h0378o7611B05339G8190a13519C3580f7661b803j63595C88090g8484b9779
11833h3890A20206K26448a37891L7030a7547E440O3395b21577A11460J60683A14147
11821b8459j11718j71218a08583j35126J04121f5389n0085A01216m5557b22010
$$ y = [-258648, -213469, 237288, -130323, -231397, 2708, -307906, 52236, -301164, 102628, -144636, 365001, 348401, -41379, -381848, -218105, 22210, -266301, 171218, 189367, -58707, -62012, 473988, 329, -200474, -239777, 109624, -156760, 288630, -352632, -62298, 22405, -131050, -231243, 128542, 222250, -323005, -207668, -96538, -179369, 127442, 78782, -345731, 89791, 171350, -394486, -175761, 47568, -20462, 54906, -106512, -75385, -11369, -128678, 164426, -8337, -9781, -80378, -147989, 205339, 78190, -113519, 33580, -67661, -2803, -166398, 388090, -78484, -29779, -83890, 120206, 346654, -137891, -100861, -17547, 5440, 68835, -221577, 111460, 272143, 114147, -28459, -140177, -311395, -108583, -243709, -139588, -65389, -115474, 101216, 55659, -222010]
11810i706G0477N2908a51557o4701A1990M26810j42012e362D6249h0486F5682
11798b0296j43757B41630a9278j83760m5751b5593j33379O965G023b50009f3658
11786E3431c31499G7740b0517A65063c23218F7554C605b47239B97153b68894a0340
11774B80961g1561G2427a0691j45359D50076B03801a61004m1214B51180j05047
11764A46133a45940B02669g3638C81301H6052b38306d4279A23668a7088o1730
11754g8818l5755G1833L8045N7011b3602b402p5305A68439e2366j41033d4162
11742i4161d3863A75313o5966M5602h9116r4955f5379A70034r820d11801J55866
11731b55935A09198E2358M4461a11331G8045e0682H6760L76280b24068G446a14677
$$ y = [-9706, 70477, 123385, -151557, -216258, 11990, 438800, 296788, -5362, 46249, -80486, 65682, -20296, -164053, 241630, -19278, -203038, -248789, -25593, -158972, -152007, 7023, -250009, -63658, 53431, -331499, 77740, -20517, 165063, -323218, 67554, 3605, -247239, 297153, -268894, -10340, 280961, -71561, 72427, -10691, -156050, 450076, 203801, -161004, -202218, 251180, 146133, -145940, 202669, -73638, 381301, 86052, -238306, -44279, 123668, -17088, -78818, -114573, 71833, 109878, 166889, -23602, -2402, -77707, 168439, -52366, -193399, -44162, -94161, -43863, 175313, 109347, 154949, -89116, -184071, -65379, 170034, 160214, -411801, -255935, 109198, 52358, 96819, -111331, 78045, -50682, 86760, 463040, -224068, 7446, -114677]
11719A17041O2831J84448B5672K86496j18241H2110j9095J08605m3077c70680
11708C31436a35867D1428J13425J1960k2472a44361J7094j52448a1087k3451j32812
11697a67350F9890M1242a44288f9017A44134D4113h9718k2861B83103K10718p4472
11686D19349f626G0749J57935q7692J321L59695I0078L6488n1963L7542c11405
11674A96235F7366k7950O9448N0491a55404B74860e0271m1393A03867J17989A2734
11662a65980L5708m3578F3159a24623E4502R393i7714D1965c8223A79601a23906
11650H9306b89482h1430H9957k62a11203B1311L08265a5855M256j98651e3709
11638A19322Q5495i6066k35244c0616B76008c13180a12787B30372H6187g9156
$$ y = [117041, 179872, 364320, 25672, 312168, 193927, 82110, 63015, 171620, 128543, -370680, 331436, -135867, 41428, 154853, 166813, 144341, -144361, -127267, -279715, -11087, -34538, -167350, 69890, 111132, -144288, -69017, 144134, 44113, -89718, -112579, 283103, 493821, 419349, -6626, 70749, 228684, 140992, 142313, 502008, 90078, 126566, 74603, 112145, -311405, 196235, 67366, 39416, 108864, 159355, -155404, 274860, -50271, -91664, 103867, 221856, 12734, -165980, -130272, -173850, 63159, -124623, 54502, 63895, -97714, 41965, -38223, 179601, -123906, 89306, -289482, -81430, 89957, 89695, -111203, 21311, 329576, -15855, -11599, -210250, -53709, 119322, 204817, -96066, -331310, -30616, 276008, -313180, -112787, 230372, 86187, -79156]
11627a81282B55827A15040h6559F34778A61597J00187a00835A26812L43898E9784
11616b68568A12128c10048I6605J72990I0668J97330j34759B5748J24670a7267
11605A31264B0964b03353j13175g3987m2592h323A18253K55250H1116A8906L7301
11594E6207j4320J96075a30669C81085a69957A1874J54373D487a64990A98033
11583A30523i9390D07295r9164r7159c56100B9643d9997B67565c8182C95884C6742
11571c860o714J699A1625K42486a32507b1575A67232l1371m7453d4204H8381b4323
11558a01151I6255a33524A52079D9113N6520J27494d6871A67457a17428B2383
11547H7672M0744o4156a72300A6756M6695K87977M9540G484a75108B55072m4436
$$ y = [-181282, 255827, 115040, -86559, 634778, 161597, 261784, -100835, 126812, 470710, 59784, -268568, 112128, -310048, 96605, 269595, 90668, 287998, 153239, 25748, 150418, -17267, 131264, 20964, -203353, -316528, -73987, -116579, -8323, 118253, 373503, 81116, 18906, 56207, 41887, 237962, -130669, 381085, -169957, 11874, 166247, 4487, -164990, 198033, 130523, -99390, 407295, 308131, 210972, -356100, 29643, -49997, 267565, -38182, 395884, 36742, -3860, -10574, -8875, 11625, 254111, -132507, -21575, 167232, 135861, 88408, -44204, 88381, -24323, -101151, 96255, -133524, 152079, 49113, 105633, 233127, -46871, 167457, -117428, 22383, 87672, 128416, 64260, -172300, 16756, 63451, 351428, 400968, 7484, -175108, 255072, 210636]
11536B10636b71455H9401J7374b10788A51672g5501m7092j00218J06382B01452
11525D74745E3101L5198R5201L5886l9472q9750h2261C13087o5367j16423L06240
11514D37537A12735M805e9764l7527A64933J00458G17Q2552L4880L1137O5549
11503B14835D0885a72076E25197i6014B62034j04865J74723A1039J62000K29602
11493D02641F2936J25245O1484E7869K21420C8711R9166J19416e3617A63634J53484
11482C17118c0733o0557A86526J1256P0194A22823K81216G9412j133L4695f5363
11470A11013J10769J97276j50904I5945C9128i2189A78987A9663J62159L0340
11460B12162l8851Q2618r1831p2334g8831B79555l6358n9238i4894B56587j18705
$$ y = [210636, -271455, 89401, 106775, -210788, 151672, -75501, -122593, -222811, -116429, 201452, 474745, 53101, 88299, 183500, 219386, 179914, 90164, -82261, 313087, 247720, 131297, 437537, 112735, 117540, -59764, -97291, 164933, 265391, 717, 83269, 118149, 149286, 214835, 40885, -172076, 525197, -96014, 262034, 157169, 331892, 11039, 173039, 402641, 62936, 188181, 249665, 57869, 279289, 38711, 137877, 257293, -53617, 163634, 317118, -30733, -91290, 186526, 197782, 267976, 122823, 404039, 79412, 78279, 112974, -65363, 111013, 221782, 419058, 268154, 95945, 39128, -92189, 178987, 19663, 181822, 212162, 173311, 255929, 164098, 91764, -78831, 279555, 243197, 183959, -94894, 256587, 137882]
11449A37882o7887a95922F30N70589b7783j33586B40623K77485a04674j32021
11439b36695A73753q2273O0122F3319K15984a09635c6998C8183R6493m0905J86539
11428B80310a86147B64884I7983c6457A75358F9673L2660K8258D4750N6527J15956
11417B17233D4998J37875C0908L25480a16975B52499D0317J08369f1808l1264
11407i3072a2444G8750k1086a82762B6347c9369B85949I2801k8321b65512A81485
11395a08237l7971e976m7500j47575h5182F5559a50961E06092C3029a97411K7191
11384a70220B18274a0299A01709e08959K01255g6256a7315P002B53918f2348A61529
11372b45240F4582J65656a31381H4063a39780d4947j82581c039C9834M5669h7332
$$ y = [137882, 69995, -195922, 630, 571219, -27783, -161369, 240623, 518108, -104674, -236695, 173753, 91480, 151602, 63319, 279303, -109635, -36998, 38183, 134676, 93771, 280310, -186147, 264884, 97983, -36457, 175358, 69673, 102333, 130591, 44750, 101277, 217233, 44998, 182873, 30908, 356388, -116975, 252499, 40317, 148686, -61808, -93072, -12444, 78750, 57664, -182762, 26347, -39369, 285949, 92801, 64480, -265512, 181485, -108237, -146208, -5976, -53476, -201051, -85182, 65559, -150961, 506092, 33029, -197411, -170220, 218274, -10299, 101709, -508959, -307704, -76256, -17315, -10313, 253918, -62348, 161529, -245240, 64582, 230238, -131381, 84063, -139780, -44947, -227528, -3039, 39834, 85503, -87332]
11360d29228J83160a0349m4912A7792h5635F8953J06777M9407n310d678j38091
11349a42769A22756k8728J80040b6744j14574c2226A76316a78621k40665B31440
11338C5858f6562A44233k3035c35446f9278A11812j2326i8558H8853a57663A8799
11326a28952A76970b26309K5777q0539a6702j09002M5988B41883a4771A54558
11315c17288A89010a73019G8292b74596I9987c4720A87747n9445R4058C2733b22701
11303b02200M5182L9362A73445K57290b14495e0025A23660k6648f2512k24360
11293b86872M2848D8305J18242a95577p0278i8633r1396I1606j5332f3360C1268
11281b76977A02373a14653j14072e7357A20050j8191e6297H045i207H7495a06943
$$ y = [-429228, -246068, -10349, -55261, 17792, -85635, 68953, 175730, 225137, 219827, -4678, -142769, 122756, 94028, 274068, -26744, -141318, -32226, 176316, -178621, -419286, 231440, 35858, -66562, 144233, 121198, -335446, -69278, 111812, 99486, -98558, 88853, -157663, 18799, -128952, 176970, -226309, -200532, -281071, -16702, -125704, -79716, 241883, -14771, 154558, -317288, 189010, -173019, 78292, -274596, 99987, -34720, 187747, 128302, 222360, 32733, -222701, -202200, -157018, -117656, 173445, 430735, -214495, -50025, 123660, 97012, -62512, -286872, -244024, 48305, 166547, -195577, -265855, -98633, -190029, 91606, 76274, -63360, 31268, -276977, 102373, -114653, -228725, -57357, 120050, 101859, -56297, 8045, -9207, 87495, -106943]
11269a72689k5387Q5164o2272C46330A0617A785J17730k5321a30640H9330a6532
11257A71610p5756h5210D9363g6050D3848b28802B70656p8641l0538J79494a9162
11245A54079P9141l7869E1195N1046c25040A49860C4314b83525C2095J04930d9670
11233b28488A02811h8802b1271j47498q0929E0472P6087J0787d35031c6530j252
11222c7782j81536c6347C87757a14434C4224J91111c35772a3668D4424a27446
11211F8707J24197e7163o6395j78206J37148A4858J1866b33928j21541i3946d6498
11199a25267p6198j1407p939B76301b03647F1379K181a6094l27002a19503A21696
11187b63641B9733L49151B790e0671k56973D7853b709j96945A52887J39920a66689
$$ y = [-172689, -198076, -112912, -175184, 346330, 10617, 1785, 119515, 94194, -130640, 89330, -16532, 171610, 95854, -85210, 49363, -76050, 43848, -228802, 270656, 192015, 161477, 340971, -19162, 154079, 233220, 195351, 51195, 102241, -325040, 149860, 34314, -283525, 32095, 137025, -49670, -228488, 102811, -88802, -21271, -168769, -249698, 50472, 126559, 137346, -435031, -36530, -37782, -219318, -36347, 387757, -114434, 34224, 225335, -335772, -13668, 44424, -127446, 68707, 192904, -57163, -123558, -301764, -164616, 14858, 26724, -233928, -355469, -93946, -46498, -125267, -201465, -212872, -220811, 276301, -203647, 61379, 63560, -16094, -343096, -119503, 121696, -263641, 29733, 378884, 2790, -50671, -307644, 47853, -2709, -199654, 152887, 292807, -166689]
11175A25342b09615IK01537A4774M23382p3699d39302a20056A92669b12094G0494
11163h3684I908M6843c0672k59693C06359b25022B9774a1181D47J51426f195G1084
11150e83469b80l40134F4131i4358B99768c7978l2234D615J99174G0210c2561
11138b21729C77353B505a43806H9451J74645J99843f0289A49220a26774k04585
11128c31359c9828B72139A323c13453d9392P25j89042F4463L90471D6629F1i5563
11115A81297a29988m1919A67873c0541A17211M7759m2057l6453J51648a07061
11104C51832A34561R9817c04400B36158l5412L0923H8286P0887J05700D5051a68096
11092A88781q7224m659h9728b1602q9153F93561h7639F46363d17015I6819G757
$$ y = [125342, -209615, 9, 201546, 14774, 438156, 364457, -439302, -120056, 192669, -212094, 70494, -83684, 9908, 56751, -30672, -290365, 306359, -225022, 29774, -11181, 447, 151873, -6195, 71084, -583469, -280, -340414, 64131, -94358, 299768, -37978, -70212, 4615, 203789, 70210, -32561, -221729, 377353, 2505, -143806, 89451, 264096, 463939, -60289, 149220, -126774, -331359, -39828, 272139, 1323, -313453, -49392, -48667, -237709, 64463, 454934, 46629, 61, -95563, 181297, -129988, -171907, 167873, -30541, 117211, 164970, 122913, 86460, 238108, -107061, 351832, 134561, 234378, -304400, 236158, 200746, 231669, 88286, 159173, 264873, 45051, -168096, 188781, 101557, 96898, -89728, -21602, -110755, 693561, -87639, 646363, -417015, 96819, 7757]
11080b612B02852L5950R7413J25949M5732j92264J1740o7008G5189K300J87821
11069B65310K61370A38280K90538K24106k32074I5385J88844L64360k73274K27804
11059F03119K37364j93497M856l17286L26923j18682L38055j90565P5484L0558
11049G96329J83887k52642J12255k16315K36591k57135B84834N36249C95917L93018
11039G88935k00238l8475r73L01453C11568J14595K20972l2039J63246q7092n0674
11028F40576k7963l0126q9992N45537k14900j72848P2356k08985L41925j34277
11018G21303j5131J16014l50906j01534L0049j01997J24950J24448J15789j68369
11008D94616C4648K24521J35293J46733K42409R5310l08519K61020p8469M6377
$$ y = [-2612, 202852, 238802, 336215, 462164, 507896, 315632, 327372, 260364, 75189, 77489, 265310, 526680, 138280, 428818, 652924, 420850, 95385, 284229, 648589, 375315, 603119, 840483, 646986, 651842, 334556, 661479, 542797, 880852, 690287, 765771, 796329, 980216, 727574, 839829, 623514, 860105, 602970, 284834, 821083, 395917, 788935, 588697, 550222, 549249, 850702, 311568, 426163, 647135, 615096, 778342, 691250, 640576, 612613, 582487, 492495, 1038032, 823132, 650284, 722640, 513655, 855580, 721303, 706172, 822186, 471280, 369746, 399795, 297798, 422748, 547196, 662985, 494616, 34648, 259169, 394462, 541195, 783604, 878914, 570395, 831415, 752946, 799323]
10998G99323j59244k63448M15066N993m8089N3642k46681J89269j79920q9887
10988D76024L76797k05184O0213K40332Q6400J26994r0487P6400p4578J33737
10978A206648L53869j04015K97487J75857L28543M68845N716j75569R3676n1835
10968B599222k46567l60271p0137p6642j92647K06227l370j36469K61036j85318
10958A795064O4469l4556K45347m60963J52708l29355J06649o03844j50677l42757
10948D42085L17293L30985C52167J94584A55364J01757H5815P8146l3141b9800
10937B60796A1709M09287B2620L09273h0469C00311c65874e2323D5292J5247K50707
10926C11246h0421j4612o5811A08103b56651C04049A7565a68623A37234F0431
$$ y = [799323, 640079, 376631, 791697, 797690, 749601, 803243, 556562, 745831, 565911, 476024, 852821, 647637, 707850, 948182, 1034582, 1161576, 1071089, 1147489, 1072911, 1206648, 1560517, 1456502, 1753989, 1929846, 2258389, 2727234, 2732950, 2557381, 2651057, 2599222, 2352655, 1992384, 1922247, 1845605, 1652958, 1859185, 1855815, 1719346, 1980382, 1795064, 1859533, 1824977, 2070324, 1609361, 1762069, 1432714, 1539363, 935519, 784842, 442085, 759378, 1090363, 352167, 546751, 155364, 257121, 85815, 163961, 130820, -29800, 260796, 11709, 420996, 22620, 331893, -80469, 300311, -365874, -52323, 45292, 60539, 311246, -80421, -95033, -160844, 108103, -256651, 304049, 17565, -168623, 137234, 60431]
10915a25619A35005r339e6095l9801A62252b03741F6205J7221b32690K3542g0057
10903F1188a1438k8896l02596B38784c73224L7994B5944a40213A70057a73313
10892I601a95039C2726g4024I4190P4126N1694A2068Q3272J68813j9178a31656
10880C06306A9670i416m56281H4859C5712b06577C85683b21008i750E4118O9329
10869A23447j9735a56707A46878L1426c48773i8288c6994D1852g8091D16585j49784
10858B66801c36258f3460k89632J36900H0029K8830A3348a21285D36970A28588
10847a09121k18184J45588C87004B5079c4370A03462a59160f8773C552a45404
10836A04649a14873B12998e9613n5435j79617j42947B76486a72221d0677A8606
$$ y = [-125619, 135005, 125666, -56095, -95896, 162252, -203741, 66205, 83426, -232690, -209148, -70057, 61188, -11438, -40334, -342930, 238784, -373224, -335230, 25944, -140213, 170057, -173313, 9601, -195039, 32726, -74024, 94190, 168316, 220010, 12068, 95340, 264153, 244975, -131656, 306306, 19670, -9416, -465697, 84859, 35712, -206577, 385683, -221008, -9750, 54118, 123447, 103712, -156707, 146878, 178304, -348773, -98288, -36994, 41852, -78091, 416585, 266801, -336258, -63460, -353092, -216192, 80029, 108859, 13348, -121285, 436970, 128588, -109121, -327305, -181717, 387004, 25079, -34370, 103462, -159160, -68773, 3552, -145404, 104649, -114873, 212998, -59613, -115048, -294665, -437612, 276486, -172221, -40677, 18606]
10825a9l76993j21284D4778a04932G6341J58989a68984d486o5799B62913I9622
10813b2251r6077L0458H6550b14231g8195m4103G616J07230j9263a71012G987
10801A7733J61783c2954A63408B1059a47106A06135C1811a75623C53583b2506
10790a18955B38043b82888A1631M842d50A6054O1160M1121B4868a13758j44000
10779b57758H2523h3592c1657A02447a66716P7660A77875n7720b30079A5574c5838
10767a12484A9643K5775L73502A70225a97658n98J888A43430J01777c9976C29310
10755C19968H301J66561a76812I4711K5822l4566d52475A53386h6610n6425D543
10743E1019a55915L6294H2332l0015b23391M124B01682I4211k2097J80449a16917
$$ y = [-19, -377012, -498296, 44778, -104932, 76341, 235330, -168984, -4486, -70285, 262913, 99622, -22251, -118328, -87870, 86550, -214231, -78195, -122298, 7616, 114846, 95583, -171012, 7987, 17733, 179516, -32954, 163408, 21059, -147106, 106135, 31811, -175623, 353583, -22506, -118955, 238043, -282888, 11631, 16473, -450, 16054, 77214, 118335, 24868, -113758, -257758, 82523, -83592, -31657, 102447, -166716, -89056, 177875, 120155, -230079, 15574, -35838, -112484, 19643, 45418, 418920, 170225, -197658, -198256, -196368, 143430, 245207, -39976, 329310, 319968, 8301, 174862, -176812, 94711, 120533, 85967, -452475, 153386, -86610, -143035, 4543, 51019, -155915, -119621, 82332, 52317, -223391, -219267, 201682, 94211, 72114, 252563, -116917]
10731c47950A75632a12157c6671E8502a4076F2198a58020k96844D5904M9661a91708
10719A7561J71417i5503k05909a43398A03978b39808A89826C848b73959E9324
10708b42563C0514K28588b2430n8364c1916p3060A7233K64962A19859a77222P1000
10697a06222n7349k5235P5993k42490J54414A17995b40925R0207j62231l4198
10687c47147J43382A09497i2159j37670a5483m8336I8393a43203m01020A09674
10676B83798B3136c23819a18537C17321g9650J017k37103B21240B6864N6507B4888
10664G9835d06738I7116d13686G4369O2018o3925K13875b71576o4062b6759j51801
10653a78560L6680l47955C818h1047j44231i6943A69192B0877a57513j61882A03275
$$ y = [-347950, 175632, -112157, -36671, 58502, -14076, 62198, -158020, -454864, 45904, 95565, -191708, 17561, 188978, -95503, -301412, -143398, 103978, -239808, 189826, 3848, -273959, 59324, -242563, 30514, 259102, -22430, -80794, -31916, -104976, 17233, 282195, 119859, -177222, -106222, -163571, -188806, -112813, -355303, -200889, 117995, -240925, -150718, -312949, -347147, -203765, 109497, -92159, -229829, -15483, -63819, 98393, -143203, -544223, 109674, 283798, 23136, -323819, -118537, 317321, -79650, -78633, -315736, 221240, 26864, 83371, 24888, 79835, -406738, 97116, -413686, 74369, 136387, 72462, 286337, -271576, -335638, -26759, -178560, -141880, -489835, 3818, -81047, -225278, -96943, 169192, 20877, -157513, -319395, 103275]
10641B5431K22025j15605c7731E6953P2114k584a5775A55532B7008M7437L5974
10630A10419d18731g506k74737A9971e78233b70230D10146a88962C7020b17180
10619b15311c027n0256k06921c2174P0A46064K26869F8010J6668a85286E4528
10607a34873K4442l5508d6971j08980B39827I1248K45900r9619a53101F081R8387
10596A04468b24239A6807J50870k9627c26881A8083J49149H3266a4056C02280
10585a70530p4797a9878A06301g1417J9136j81150e4015C4892b32857k1557O3711
10574a90703C8840b4285q1918N0565o2270K1529A85353a4498r2719N2375C7233
10562A7244a5856j20711A90337Q4323d1437A23711c24541c7128D2105K5897O9675
$$ y = [25431, 247456, 131851, -37731, 56953, 129067, 126483, -15775, 155532, 27008, 74445, 110419, -418731, -7506, -282243, 19971, -578233, -270230, 410146, -188962, 37020, -217180, -215311, -3027, -53283, -260204, -32174, -32104, 146064, 372933, 68010, 84678, -185286, 54528, -134873, -110431, -145939, -46971, -155951, 239827, 91248, 337148, 237529, -153101, 6081, 104468, -224239, 16807, 167677, 138050, -326881, 18083, 167232, 83266, -14056, 302280, -170530, -245327, -19878, 106301, -71417, -52281, -233431, -54015, 34892, -232857, -254414, -190703, 38840, -24285, -106203, -55638, -117908, -96379, 185353, -14498, -107217, -54842, 37233, 17244, -15856, -136567, 190337, 274660, -41437, 123711, -324541, -37128, 42105, 68002, 137677]
10551A37677C7665a65038F5068a98451O7310I3898h8j70595a8387J668A67092
10539D7507J65653a06616j40892f0875A61427A32O5601a82604k0190A60971d46883
10527g5805k49505a22385k08940B7665d81500J08511a53455j05245A06301g8830
10516C9447K38404a64029A70360J06624b58571m9776c2637j63375e6992G8507
10505a03456k7956L6892a7724G0297C1979a24428n9281A74441F1436c0195J2124
10494a8071A34677f5700K5348A04034a90443B87237c04413I2982G694J63782l2720
10483A38756J6563K89591J34581J30150k51270A01251b11443M6252I7664D0681
10472A20349n2028N7813J72221f9053a4427B39561h0095E3085K28034a39404c7973
$$ y = [137677, 37665, -165038, 65068, -198451, -131141, 93898, -88, -170683, -18387, -16719, 167092, 47507, 213160, -106616, -247508, -60875, 161427, 132, 65733, -182604, -202794, 160971, -446883, -75805, -325310, -122385, -331325, 27665, -481500, -372989, -153455, -258700, 106301, -78830, 39447, 277851, -164029, 170360, 276984, -258571, -308347, -32637, -196012, -56992, 78507, -103456, -131412, -94520, -17724, 70297, 31979, -124428, -183709, 174441, 61436, -30195, -18071, 134677, -65700, -40352, 104034, -190443, 287237, -304413, 92982, 7694, 171476, 138756, 155319, 444910, 579491, 709641, 458371, 101251, -211443, -165191, 97664, 40681, 120349, 68321, 126134, 298355, -69053, -14427, 239561, -80095, 53085, 281119, -139404, -37973]
10460A2564R6629e9045p7128B4741b06420h6458I0625g2450q4519A02464j5754
10449H6710K24955a43593o4904J6983A34159b29960B18310a28506B02377I7808
10438H4105F897c85936B8410J29876J6259a64531J2945k1735C800a5869A5854
10426d97k29793l2434A14341a34883C60397A13435Q5634A464i9535M5313r770
10415f3992C4966a02501c7259B13476f4580I6871a16713E4079M5716A2156J89170
10404B01326J38796b22301B7888J16247k3107E7608K06721I4039J73479D1551
10393B94522A12367d8387K1444k10273P8708A17576j2536L9286h3975j09451A41122
10381C07668d863A56335F9585N0400J67874Q9998j64825p9614a42255A76114C2907
$$ y = [12564, 109193, -59045, -136173, 24741, -206420, -86458, 90625, -72450, -156969, 102464, 86710, 311665, -143593, -208497, -191514, 134159, -229960, 218310, -128506, 202377, 97808, 84105, 6897, -385936, 28410, 158286, 174545, -164531, -151586, -173321, 3800, -15869, 15854, -497, -230290, -262724, 114341, -134883, 360397, 113435, 199069, 1464, -99535, -54222, -63992, 34966, -102501, -37259, 213476, -64580, 96871, -116713, 54079, 99795, 12156, 201326, 340122, -222301, 27888, 144135, 121028, 57608, 264329, 94039, 267518, 41551, 294522, 112367, -48387, -26943, -237216, -158508, 117576, 105040, 144326, -83975, -193426, 141122, 307668, -4863, 156335, 69585, 119985, 287859, 377857, 213032, 133418, -142255, 176114, 32907]
10369A29673J35897J7605M4868j05028J23913J30968j84630K28889j44199j02492
10359B75464J5528b1195B97710G9424J71256M4355j9312A15602L92226L88634
10349H96462l89291M7413k55511K50231k27001r8344M8124O4265A11312J2220
10339A23532K1910m806J76919K51924A53625b88027A79188l620P1414c03263A16482
10327F3011A4065a27667d2746j31518A4090J10833Q4963l1232A1934J32823l4263
10316A10494c3672B19880J4103b2289G3191e88k99412C3305J08064D0606J55081
10305A95687a0143k84510e8782A17663b1042j47940A99149f3442C60351a29233
10294A76809O4069j10964k5496m1944a30685m10629B03043a07633A19242a51375
$$ y = [129673, 265570, 283175, 328043, 223015, 346928, 477896, 293266, 522155, 377956, 275464, 290992, -21195, 297710, 79424, 250680, 295035, 275723, 115602, 507828, 896462, 507171, 554584, 299073, 549304, 322303, 223959, 272083, 336348, 111312, 123532, 145442, 140636, 317555, 569479, 153625, -288027, 179188, 175568, 246982, -303263, 116482, 63011, 14065, -127667, -42746, -174264, 14090, 124923, 209886, 178654, 11934, 144757, 110494, -33672, 219880, 233983, -22289, 73191, -588, -300000, 33305, 141369, 40606, 195687, -10143, -294653, -58782, 117663, -21042, -168982, 199149, -63442, 360351, -129233, 176809, 240878, 129914, 104418, 62474, -130685, -541314, 203043, -107633, 119242, -151375]
10283D9908L9101f9805j25014A15393b0216j96158G749M627a28198p7202j30357
10272c35757J25786C17171L1692a49858d0385k02616R6196C8436Q4070a84228
10261A24434K67544j67079J69170r0345J111j39266n3896K17188r8764g0517j70376
10250b40893c4943k1232j46189e5230A32003a9734B02363H1618c2458A09557a38780
10238B00742b54038f9229j50275k84888C3435N2060d3302j01232n260I8930N4279
10227A53209E5975c8915A78493a38148A12370b30031B10492i1238A115g6383n6238
10216a32621o0017k83009A49318a45031d4976J9533A87661a84603B65044G3699
10205D1037c26469D559a4370k41600j92425H0910a3460l05831A30019a68534M7608
$$ y = [49908, 89009, -69805, -194819, 115393, -20216, -216374, 7749, 12376, -128198, -205400, -335757, -209971, 317171, 348863, -149858, -40385, -243001, -146805, 38436, 122506, -184228, 124434, 391978, 224899, 394069, 303724, 304835, 165569, 111673, 328861, 230097, -70517, -240893, -34943, -56175, -202364, -55230, 132003, -19734, 202363, 81618, -32458, 109557, -138780, 200742, -254038, -69229, -219504, -504392, 33435, 85495, -43302, -144534, -149794, 98930, 153209, 55975, -38915, 178493, -138148, 112370, -230031, 210492, -91238, 1115, -76383, -132621, -192638, -475647, 149318, -145031, -44976, -25443, 187661, -184603, 265044, 73699, 41037, -326469, 4559, -14370, -255970, -448395, 80910, -13460, -319291, 130019, -168534, -120926]
10194a20926p3413b9058K768l35508B91768h7970Q418n4715C62418A38204D7624
10182b35986g4756a1063r5753C6090a05068D1993a48718c450A37705A7140a7033
10170a42259K0322j20951o5336a2548q5132l968j59067F5246c8339j60643M4675
10159a54307j19232A68366C5224a69956H3662q977c47996A84677o452B0291f14
10147a06063B06439a87059O3221k01341B1414d8968m79774c2771m097j970C30355
10135d11098a38476m0728A07094a33270B99177j00324c09891g7689C723a85231
10124B81583A08971a2950j14283c4422A483K58391a13545a3953k49959L7333J6171
10113b10408C25577a61088g0632B02676d6881A26764a53880k17828g1482j3015
$$ y = [-120926, -194339, -29058, -26290, -361798, 291768, -87970, -79552, -134267, 362418, 138204, 47624, -235986, -74756, -11063, -106816, 36090, -105068, 41993, -148718, -3450, 137705, 17140, -17033, -142259, -121937, -242888, -308224, -12548, -97680, -101648, -260715, 65246, -38339, -198982, -154307, -273539, 168366, 35224, -169956, 83662, 74685, -347996, 184677, 178225, 20291, -614, -106063, 206439, -187059, -123838, -325179, 21414, -48968, -528742, -32771, -36868, -38838, 330355, -411098, -138476, -179204, 107094, -133270, 299177, 198853, -309891, -77689, 3723, -185231, 281583, 108971, -12950, -127233, -34422, 1483, 259874, -113545, -13953, -263912, -226579, -210408, 325577, -161088, -70632, 202676, -46881, 126764, -153880, -371708, -71482, -84497]
10103h4497p5035H5511L33001c72751K7464J72519d4579l3554B772a64114F9997
10091B81189a67177m6701i3131A30182h7129j33697B7458J52745a79617A27137
10080c36659B6526a26480l9149O1868k10443m8201a28802A22832k5580b9261j77615
10069b06876j28740J5709R8975A93550p3595a9843B31225p6728a33822k38144
10059c71966b2940k28429N9380A19208c7074C2850a80423n1462L2375P8233k05957
10048c27234R0653K7160B8570b03258I9448a21993b7227j33229G4486M2532f0488
10036a21699A2979a84285o4847D021d5323r1789H1686C1709a6893A16568b52386
10024B0239K12g0207B46999n8811K45916B14783a04221E6687k191a18245B00370
$$ y = [-84497, -159532, 85511, 418512, -372751, -345287, -172768, -44579, -78133, 2772, -164114, 69997, 281189, -167177, -213878, -93131, 130182, -87129, -220826, 27458, 180203, -179617, 127137, -336659, 26526, -126480, -165629, -103761, -314204, -362405, -128802, 122832, 97252, -29261, -206876, -335616, -319907, -220932, 193550, 119955, -19843, 231225, 154497, -133822, -371966, -22940, -251369, -191989, 119208, -37074, 32850, -180423, -231885, -199510, -121277, -327234, -236581, -209421, 28570, -203258, 99448, -121993, -27227, -160456, 74486, 117018, -60488, -121699, 12979, -184285, -249132, 4021, -45323, -137112, 81686, 31709, -16893, 116568, -252386, 20239, 20451, -70207, 246999, 188188, 434104, 214783, -104221, 56687, 54496, -118245, 200370]
10012B20111g0656J1715l9001b2135B01978a44287j27265d6384l32614C2715M2135
10001G4850O6673m0667a64465N5259c7758n2739k78973i7329j65774G7156c12995
9989b5865j534E21199A55381d1396A11490D9260c84136I1952a04515k22507F8314
9977B7993b26380o7495J9853K0488b8310j2330B44785b47621H060e2377k20029
9966b72406H7420o669g5682l90143b05319I4856c85054B66313c53156J17406G8888
9954A02190J5466d34930J31607D8343J05631b6340J789j3245j26984A44570c13589
9942d6881k20608R9765E2479c40739k4571a76602K9757j08242D540Q5114b89317
9930g1842A8542M9039d8607j34016B7179R7471O6537m9896b23749H9911e3231
$$ y = [220111, -70656, -58941, -97942, -22135, 201978, -144287, -271552, -46384, -378998, 32715, 74850, 141523, 100856, -164465, -109206, -37758, -90497, -369470, -97329, -263103, 77156, -312995, -25865, -27399, 521199, 155381, -41396, 111490, 49260, -384136, 91952, -104515, -327022, 68314, 27993, -226380, -293875, -274022, -253534, -28310, -40640, 244785, -247621, 8060, -52377, -272406, 87420, 80751, -75682, -465825, -205319, 94856, -385054, 266313, -353156, -235750, 78888, 102190, 117656, -434930, -303323, 48343, 153974, -26340, -24551, -37796, -164780, 144570, -313589, -46881, -267489, -167724, 52479, -340739, -365310, -176602, -146845, -255087, 4540, 89654, -289317, -71842, 18542, 67581, -48607, -182623, 27179, 124650, 191187, 141291, -223749, 89911, -53231]
9918c43785F0450A6522c58340C13223F8898P9461b31246H4722a57000j661C5643
9906E2913k1350M6733c39952C2615J72963b98164K9482a24267L6293O836A84546
9894A33084e2459C93171g1699F5264J13300a41752c5395l64024C6714c14431A62713
9882g7603f565k52002L4924H7633a81692d3450j05607a7254k85631j45864a07645
9870a9548B1749e05877B10344a60860a3783j0540B68401E9445a02985c7455r3245
9859a30700A02289l2751b5061j23010A60830a08667p4692M1261j4843B8618r563
9848A9055a97979D2888f4221B7740L7976K9592A8160d74246a20298Q426e1088
9836A0268b50736N6588k33780c2417I5576f3696H5932A725c48217a56118j10013
$$ y = [-343785, 60450, 16522, -358340, 313223, 68898, 148359, -231246, 84722, -157000, -158661, 35643, 52913, 31563, 78296, -339952, 32615, 205578, -298164, -268682, -124267, -87974, -81138, 184546, 133084, -52459, 393171, -71699, 65264, 178564, -141752, -35395, -399419, 36714, -314431, 162713, -77603, -6565, -258567, -223643, 87633, -181692, -43450, -149057, -17254, -302885, -448749, -107645, -19548, 21749, -505877, 210344, -160860, -13783, -24323, 268401, 59445, -102985, -37455, -130700, 102289, 69538, -25061, -148071, 160830, -108667, -183359, -142098, -156941, 28618, 19055, -197979, 42888, -64221, 27740, 65716, 95308, 18160, -474246, -120298, -111872, -51088, 10268, -250736, -194148, -427928, -32417, 95576, -63696, 85932, 1725, -348217, -156118, -266131]
9825b66131a8990M347B813b10321g9191j10094a1838j88547A3594E877c55298
9813b8519A86396b8288p45J0595j75730p6346n6942b664E7446a01757D52056A39021
9800a36038A89486a20439B2182b7177k48490p8762a01261c41A16954a03725j8018
9789a21743p7949i8626l39916J60693F9793b00902K3051B54303h3822l9774I8196
9777A46085J00023j12615P746l6159a52427q7960c0946D647f6830C76253A17209
9765a29355K007J4819j97811A85556b24317j9285A55031a6162o587j1496D27224
9753f6182k53414k4766h1565j40140k12361e8730j8977A32325l9883c9692A48565
9741A7811b80249A31958c27248F5906b85231A09180J51366a51515G8627b44016
$$ y = [-266131, -18990, -14643, 2813, -210321, -79191, -189285, -11838, -200385, 13594, 5877, -355298, -28519, 186396, -28288, -29033, -18438, -194168, -270514, -327456, -2664, 57446, -101757, 452056, 139021, -136038, 189486, -120439, 22182, -27177, -275667, -354429, -101261, -341, 116954, -103725, -121743, -199692, -98626, -438542, -277849, 69793, -200902, -177851, 254303, -83822, -123596, 98196, 146085, 246108, 133493, 141239, 105080, -152427, -240387, -30946, 4647, -66830, 376253, 117209, -129355, -127348, -112529, -310340, 185556, -224317, -243602, 155031, -16162, -22749, -34245, 427224, -66182, -319596, -344362, -81565, -221705, -434066, -58730, -77707, 132325, 92442, -39692, 148565, 17811, -280249, 131958, -327248, 65906, -285231, 109180, 260546, -151515, 78627, -244016]
9730A22866a64133F6877K07372a98300B419K55994b47496B37194G8527B050b02293
9718b56554B4738b08848B4728a19868l5187O3696c1428C37218b44953c6813A04952
9706i0453l31315J59653B97721C768J64299C3952D492c7069A1515Q1531C2992
9694a69886f2530M168K6823A64093a41543j12083a02417f058r1637A90516a4819
9682B71708l5682q5860a18858B13411b86719j2680a15042c4075l5143k70099B39271
9670a22636B09049l3180G2526a72686P7565r3855l8234A20774g6828l24540A91792
9658D4923c28829d6686j53355f7606G5653J18620L6045j10417n4840J76336c10391
9646H233b9888k84839D4181b97523c3538l95695A60489d20001Q6961J53761A4039
$$ y = [122866, -164133, 66877, 274249, -198300, 2419, 258413, -247496, 237194, 78527, 2050, -202293, -256554, 24738, -208848, 24728, -119868, -155055, -91359, -31428, 337218, -244953, -36813, 104952, -90453, -421768, -262115, 297721, 3768, 168067, 33952, 4492, -37069, 11515, 93046, 32992, -169886, -62530, -58362, -31539, 164093, -141543, -253626, -102417, -6058, -97695, 190516, -14819, 271708, 236026, 150166, -118858, 213411, -286719, -299399, -115042, -34075, -69218, -339317, 239271, -122636, 209049, 175869, 72526, -172686, -95121, -188976, -227210, 120774, -76828, -401368, 191792, 44923, -328829, -46686, -200041, -67606, 75653, 194273, 230318, 119901, 65061, 241397, -310391, 8233, -29888, -314727, 44181, -297523, -33538, -429233, 160489, -420001, -333040, -179279, 14039]
9634d1981A28764b2722j71456B5586A0258N5371a2651j28595j463p0980P8296
9623a35393l60235c8312k5919C2797J79673c8840m2118k16833f2458Q949d696
9611c26073b7490D72893b63724j1380o9056P517a3332j76904l9732A20157a31545
9599c5098j50472h5580c1656l43255b4536l9027A3511b56051l24294A758e7019
9587a04244a9211m09899A58120O6036a85953A33723a1259E4966a06322q2933n7283
9576b46538a05234r6280k18965A91223k0467c16110a3713j20296O1308m9293j75410
9565b97404i6859j30670B31143a98316G5682b72638b5795n9117D2095c355m11530
9554d14885K03821h529j96539h5380b0569C3180g9533j18311A79258F477f4537
$$ y = [-41981, 128764, -22722, -194178, 25586, 10258, 65629, -12651, -141246, -142709, -213689, -135393, -495628, -38312, -64231, 32797, 212470, -38840, -80958, -297791, -62458, -53509, -4696, -326073, -27490, 472893, -263724, -275104, -344160, -336643, -13332, -190236, -229968, 120157, -131545, -35098, -185570, -85580, -31656, -374911, -24536, -63563, 13511, -256051, -580345, 1758, -57019, -104244, -19211, -429110, 158120, 224156, -185953, 133723, -11259, 54966, -106322, -189255, -246538, -105234, -201514, -420479, 191223, 170756, -316110, -13713, -134009, -72701, -121994, -297404, -96859, -227529, 231143, -198316, 75682, -272638, -25795, -84912, 42095, -3355, -414885, -211064, -8529, -205068, -85380, -20569, 33180, -79533, -197844, 179258, 6477, -64537]
9542e6573D7685d7393j51416P1708k06315d1510k09161F3252b37774d2491k02476
9531b44967A48099b62256O2666g5322C05093d15503h031B4606b90130A91178l2524
9520A58654c1366C31159a37656n0358j18904J43164g1162q3716f9046H5999P2954
9509A58953a05899C03041d03980A53722f1762p5590A09983a13364F6167c5809
9498E132b10464l190R3943p8409l3390Q9155f6994n4727m7061q3882A7888a85371
9485a22929d3366l26435J49054f4486q7929k00661a61047j3585b7621k14618B1388
9473A17572b30421D7560d09055H2448d6302A24516a09953H3905b09936e060k50079
9462b55139A9548g4952F5834B5468A0859h4096C5873M2857a57332L8091A55631
$$ y = [-56573, 47685, -47393, -198809, -127101, -333416, -41510, -250671, 63252, -237774, -42491, -244967, 148099, -262256, -199590, -75322, 305093, -415503, -8031, 24606, -290130, 191178, 158654, -31366, 331159, -137656, -188014, -306918, -163754, -71162, -154878, -69046, 85999, 158953, -105899, 303041, -403980, 153722, -61762, -137352, 109983, -113364, 66167, -35809, 5132, -210464, -213654, -119711, -198120, -231510, -142355, -66994, -121721, -168782, -252664, 17888, -185371, -122929, -43366, -369801, -220747, -64486, -152415, -353076, -161047, -174632, -27621, -242239, 21388, 117572, -230421, 47560, -409055, 82448, -46302, 124516, -109953, 83905, -209936, -5060, -255139, 19548, -74952, 65834, 25468, 10859, -84096, 35873, 78730, -157332, -119241, 155631]
9450D30807a17064A90556F758b87148B45579a5830l03011C7141g8117A52915a0435
9438c2940k03400P4215j45099h5936a0468B59267D4432J67732h3726I7103b61363
9426d05524A95245b50201n8978A16413d5317j31963D516e6923n8819c9119J0945
9415b8174F465g9989B35841b8213E65000D6810K3246a24900b0982j3389A59592
9403b8531n7648I4036A1180J78391b52287D1913a7000J325B1180e6142j12777
9392a68919I5804a42223M2420k38510B59981c06987d3929B87074a82402l52841
9382e35243D512J83601p6970a12290A19424a75316j63828a37396r5585d5527C00962
9370F4818G602f6203k07557R4701L6591j96109a44204b7070j5687l0619B40160
$$ y = [430807, -117064, 190556, 6758, -287148, 245579, -15830, -318841, 37141, -78117, 152915, -10435, -32940, -236340, -162125, -307224, -85936, -10468, 259267, 44432, 212164, -83726, 97103, -261363, -405524, 195245, -250201, -309179, 116413, -45317, -177280, 4516, -56923, -115742, -39119, -28174, 6465, -79989, 235841, -28213, 565000, 46810, 70056, -124900, -20982, -34371, 159592, -28531, -86179, 94036, 11180, 189571, -252287, 41913, -17000, -15675, 21180, -56142, -168919, 95804, -142223, -99803, -338313, 259981, -306987, -43929, 287074, -182402, -535243, 4512, 188113, 111143, -112290, 119424, -175316, -339144, -137396, -232981, -45527, 300962, 64818, 7602, -66203, -273760, -179059, -142468, -338577, -144204, -27070, -42757, -73376, 240160]
9358a61186r958A08534A4843b8945j32475G5508d83694H4009c12397B17524a25565
9346B16057A06971D957P3912K04823a72091B20820L0868e2638j09444P8469k59615
9335c43228C4385i6111j31812j37100A23591B3204a06001A49451J4072l4709f5427
9323b62771i9579b4093k4441p5156j13834e2145r0511k05659H8067a26179f0355
9311b650j8368j1125l25171I5734m0801k979M2988b07599d2046J5477d814r5189
9299a00003d622k15095F5381N9921a79794P3018C0875O0421b12591A34822E5206
9287D2315a74601p0064p3988g6778m41057a60855a9986A02031Q4705A4806a9111
9275a62277O4539o8870E4083a41582j5070N836A4619b2960l2358j1260B08516
$$ y = [-161186, -171144, 108534, 14843, -28945, -161420, 75508, -483694, 84009, -312397, 217524, -125565, 216057, 106971, 4957, 78869, 283692, -172091, 220820, 251688, -52638, -162082, -83613, -343228, 34385, -96111, -227923, -365023, 123591, 23204, -106001, 149451, 163523, 128814, -65427, -262771, -99579, -24093, -48534, -123690, -237524, -52145, -142656, -348315, 88067, -126179, -60355, -2650, -21018, -32143, -357314, 95734, 54933, 51954, 94942, -207599, -42046, -26569, -4814, -100003, -4622, -219717, 65381, 125302, -179794, -106776, 30875, 91296, -212591, 134822, 55206, 42315, -174601, -244665, -318653, -76778, -517835, -160855, -19986, 102031, 186736, 14806, -19111, -162277, -97738, -166608, 54083, -141582, -156652, -150816, 14619, -22960, -55318, -66578, 208516]
9263A1179J35702e3153B54767d01059J72220a01421G4656O1953O4825b3312A9277
9251E6207b70603a28580q5860E25895h5366r7304l1642c8063A38471c17099E9865
9239h9958k9013A7002b07769I285M9236d19335J99002L5269g2009A05282i448
9227A25588P5385m4761b50225J19177F7082h3746A10597M8155e01569F2342c71229
9215b58016I4452a35932C2890Q5997a21945f976l80775J62228j7458c0989A5715
9203c88123A51978c06681N4221P3668j4256i3031n8847A07613a66356a038A41375
9191G224M8317e8856I2706A8211a72761h5952A1966K1137L62766H1610e9855q0989
9179a40844J7247I5936b8447H3969K109a46159c2962c880j39400j89309J28432
$$ y = [11179, 146881, -53153, 254767, -401059, -228839, -101421, 74656, 136609, 201434, -23312, 19277, 56207, -270603, -128580, -214440, 525895, -85366, -182670, -214312, -38063, 138471, -317099, 59865, -89958, -118971, 17002, -207769, 9285, 58521, -419335, -220333, -185064, -72009, 105282, -9448, 125588, 200973, 156212, -250225, -131048, 67082, -83746, 110597, 158752, -501569, 62342, -371229, -258016, 94452, -135932, 32890, 118887, -121945, -6976, -387751, -225523, -242981, -30989, 15715, -388123, 151978, -306681, -252460, -178792, -193048, -93031, -151878, 107613, -166356, -1038, 141375, 7224, 55541, -58856, 92706, 18211, -172761, -85952, 11966, 33103, 395869, 81610, -59855, -140844, -123597, 95936, -28447, 83969, 86078, -146159, -32962, -3880, -143280, -332589, -204157]
9168b04157h4740c078D2323a94432I5276A4236a30933M099C65838a15689M9280
9157f6409a4223r4623j77287H5695B0492l78K06835H2243b44619J20202B95925
9145b15682D88679b9293k01024N6774A9034a35970m7519b0871B03464g8341C0360
9133g1458l3192p6884A38340a14958A14569l1969l5666b6062M038A90528C044
9121f766D73051b04815A90101C0374b42886i8744m9952j09786B51716a19768L4536
9110h5232A79290J5782f3833m4143b748H8564b56582b8182A04835C1445a72254
9098c90969d6312k84396A4424c9104j8938A09552a34095m4734o5018k5246d4673
9086B5951c72333E1423b27902D7577J1929a66682c0444A2293N2794c3878j5953
$$ y = [-204157, -84740, -3078, 42323, -194432, 95276, 14236, -130933, -126834, 365838, -115689, -66409, -14223, -108846, -286133, 85695, 20492, 20114, 226949, 82243, -244619, -124417, 295925, -215682, 488679, -29293, -230317, -173543, 19034, -135970, -183489, -20871, 203464, -78341, 30360, -71458, -104650, -181534, 138340, -114958, 114569, 82600, 46934, -26062, -22024, 190528, 3044, -6766, 473051, -204815, 190101, 30374, -242886, -98744, -148696, -258482, 251716, -119768, -85232, 179290, 195072, -63833, -107976, -2748, 88564, -256582, -28182, 104835, 31445, -172254, -390969, -46312, -330708, 14424, -39104, -58042, 109552, -134095, -178829, -243847, -269093, -44673, 25951, -372333, 51423, -227902, 47577, 59506, -166682, -30444, 12293, 65087, -33878, -49831]
9075d9831j32879G0869J5023R1202b69195B91304f1221k4262d850j81452d821
9063D7554R8293K7542F5782a37236j1821A60139c37904a25810A16107n7647c3318
9051a70369a4381A39892a74089b1800A5920a32028j12900d0845j48029P7851A01012
9039b66689O0582I3208J29713B314J41488e0718A18863g5533F5611d8122A2625
9027c5602q2987C9082a31189G3306p571b43498g6224E2806l760b0146j0816o4582
9015i5544k33104f5956B31419c07463g6296j06793j81850J40285M9571K8192J6106
9004a30785p019C7249L9671a6581k28736L8421N3024A83852H2536a87561I8859
8992B16550D3421b01819K2800Q1287J6893k97350B96286i9808O246B14895J55978
$$ y = [-49831, -182710, 70869, 85892, 177094, -269195, 291304, -61221, -85483, -4850, -186302, -4821, 47554, 145847, 173389, 65782, -137236, -149057, 160139, -337904, -125810, 116107, 58460, -33318, -170369, -14381, 139892, -174089, -21800, 15920, -132028, -244928, -40845, -188874, -111023, 101012, -266689, -206107, 93208, 222921, 2314, 143802, -50718, 118863, -75533, 65611, -48122, 12625, -35602, -118589, 39082, -131189, 73306, 65735, -243498, -76224, 52806, 49046, -20146, -30962, -95544, -328648, -65956, 231419, -307463, -76296, -183089, -364939, -224654, -175083, -146891, -130785, -137804, 37249, 76920, -16581, -245317, -206896, -153872, 183852, 82536, -187561, 98859, 216550, 43421, -201819, -179019, -97732, -80839, -378189, 296286, -99808, -93562, 214895, 370873]
8981C70873e1384r4610H3938a19671e2190o1466H3815l0304L78392a63570a2829
8969a76534j04825a33764O2474p7147e2322o8696F6596J03753b62462f7005A55806
8957F4255J0765a78681D5231G462a00812D1165c98205A05875a49055A55935B7555
8945a40648O9584o3622d6147l3295j4250m9508j08591A00654h1220j14232A64772
8933A07428c652k45548A14092b1275j8168A38429a4571l18828C83648J1173J127817
8922A522638N088228q04729A135730A06772J10278O796a17292B66377b69362k10083
8912d79445C0133I557a5819j11100m2490k6998c5846k11577P7474A10748b40119
8900B7635a47793B98427B5678M345O4154K6258c80456A30884c3869E5672C600
$$ y = [370873, -51384, -145994, 83938, -119671, -52190, -113656, 83815, 53511, 431903, -163570, -12829, -176534, -281359, -133764, -71290, -148437, -52322, -121018, 66596, 170349, -262462, -67005, 155806, 64255, 75020, -178681, 45231, 7462, -100812, 41165, -398205, 105875, -149055, 155935, 27555, -140648, -71064, -134686, -46147, -79442, -93692, -143200, -251791, 100654, -81220, -195452, 164772, 107428, -3652, -249200, 114092, -21275, -39443, 138429, -14571, -333399, 383648, 394821, 1522638, 6610866, 5806137, 1135730, 106772, 217050, 223846, -117292, 266377, -269362, -479445, 30133, 9557, -15819, -126919, -169409, -196407, -35846, -247423, -169949, 110748, -240119, 27635, -147793, 298427, 25678, 30023, 94177, 120435, -380456, 130884, -33869, 55672, 3600]
8888B6281m137a80957C49959b83937A90635L2083A5183a21453j02579g3670c2734
8876b55304D3716a91460G0127c43579J55880A93179p8514b15159A58726a25794
8865I7159i3721G1175a52753I062a39970c8841m8488C67704d84813F7640h946
8853F2520a52996k16547a05103j17951A8786a43658c0146A17202J83906a40043
8842F1770k6901j4270a47490j02218h5363A13869g7046j94646B95699B0607e097
8830a9939A59720g7582A09476N4119n0437a51359B19110c1898J3896j1702I7132
$$ y = [26281, 22144, -180957, 349959, -283937, 190635, 222718, 15183, -121453, -224032, -73670, -32734, -255304, 43716, -191460, 70127, -343579, -187699, 193179, 114665, -215159, 158726, -125794, 97159, -93721, 71175, -152753, 9062, -139970, -38841, -87329, 367704, -484813, 67640, -8946, 62520, -152996, -369543, -105103, -223054, 18786, -143658, -30146, 117202, 301108, -140043, 61770, 34869, 20599, -147490, -249708, -85363, 113869, -77046, -271692, 295699, 20607, -5097, -19939, 159720, -77582, 109476, 163595, 113158, -151359, 219110, -31898, -18002, -29704, 97132]
$$ [...]
##END NTUPLES=NMR SPECTRUM
##END=
