
##TITLE=AC1323_SBUAH12152_6535549_3MPLV89FiF
##JCAMPDX= 6.0         $$ Bruker NMR JCAMP-DX V2.0
##DATA TYPE= NMR SPECTRUM
##DATA CLASS= NTUPLES
##ORIGIN= BRUKER
##OWNER= Administrator
$$ 1.72 TOPSPIN		Version 2.1
$$ 2012-12-14 04:01:33.249 -0500  Administrator@X
$$ Compression mode = diff/dup
##.OBSERVE FREQUENCY= 400.02188249412
##.OBSERVE NUCLEUS= ^1H
##.ACQUISITION MODE= SIMULTANEOUS (DQD)
##.ACQUISITION SCHEME= undefined
##.AVERAGES= 64
##.DIGITISER RES= 22
##SPECTROMETER/DATA SYSTEM= spect
##.PULSE SEQUENCE= noesygpps1d.comp
##.SOLVENT NAME= COFFEE_meoh
##.SHIFT REFERENCE= INTERNAL, COFFEE_meoh, 1, 14.96085
##AUDIT TRAIL= $$ (NUMBER, WHEN, WHO, WHERE, PROCESS, VERSION, WHAT)
$$ ##TITLE= Audit trail, TOPSPIN		Version 2.1
$$ ##JCAMPDX= 5.01
$$ ##ORIGIN= Bruker BioSpin GmbH
$$ ##OWNER= Administrator
$$ $$ E:\/data/COFFEE/nmr/AC1323_SBUAH12152_6535549_3MPLV89FiF/22/pdata/1/auditp.txt
$$ ##AUDIT TRAIL=  $$ (NUMBER, WHEN, WHO, WHERE, PROCESS, VERSION, WHAT)
(   1,<2012-12-14 04:01:27.421 -0500>,<Administrator>,<X>,<go>,<TOPSPIN 2.1>,
      <created by zg
	started at 2012-12-14 03:49:57.388 -0500,
	POWCHK enabled, PULCHK disabled,
       configuration hash MD5:
       86 BA 57 50 F2 9D 5C 9B 26 00 A9 28 5F 66 2E 89
       data hash MD5: 64K
       9B 09 69 6F F3 9B 75 0D E8 84 56 75 D2 63 B8 25>)
(   2,<2012-12-14 04:01:30.483 -0500>,<Administrator>,<X>,<proc1d>,<TOPSPIN 2.1>,
      <Start of raw data processing
       efp LB = 0.3 FT_mod = 6 PKNL = 1 PHC0 = 0 PHC1 = 0 SI = 128K 
       data hash MD5: 128K
       9F 85 FD CC 3E F3 5B 7E D2 47 D3 CB 67 75 87 CF>)
(   3,<2012-12-14 04:01:31.561 -0500>,<Administrator>,<X>,<proc1d>,<TOPSPIN 2.1>,
      <pk PHC0 = -79.16199 PHC1 = 0 
       data hash MD5: 128K
       F0 7A 83 4D 67 3A E0 26 38 16 E5 14 2A 5A BF 66>)
(   4,<2012-12-14 04:01:32.217 -0500>,<Administrator>,<X>,<proc1d>,<TOPSPIN 2.1>,
      <abs ABSG = 1 
       data hash MD5: 128K
       0E CC 45 DA 7C F0 63 A5 6D 7A B4 5B 0F 41 84 B4>)
(   5,<2012-12-14 04:01:32.421 -0500>,<Administrator>,<X>,<proc1d>,<TOPSPIN 2.1>,
      <abs ABSG = 2 
       data hash MD5: 128K
       9C 57 5D CB 39 C2 FF 1A 3E D0 F4 68 88 F5 AD 28>)
(   6,<2012-12-14 04:01:32.577 -0500>,<Administrator>,<X>,<proc1d>,<TOPSPIN 2.1>,
      <abs ABSG = 3 
       data hash MD5: 128K
       CF E8 7D 8F DF D9 B7 F8 88 9D 51 50 9E 16 61 D2>)
(   7,<2012-12-14 04:01:32.764 -0500>,<Administrator>,<X>,<proc1d>,<TOPSPIN 2.1>,
      <abs ABSG = 4 
       data hash MD5: 128K
       9C 75 6A 27 3A 8D AF 07 0F CB 05 F5 1F 42 3D 63>)
(   8,<2012-12-14 04:01:32.936 -0500>,<Administrator>,<X>,<proc1d>,<TOPSPIN 2.1>,
      <abs ABSG = 5 
       data hash MD5: 128K
       6B 48 17 69 C0 BF CD 3C DF FD 8A 58 C4 4E 5D 47>)
$$ ##END=
$$ 
$$ $$ hash MD5
$$ $$ 62 D4 3E EF AB 5F 1F 0C DF 5B 90 C5 FD E8 16 44
##$RELAX= 
##$RELAX= 
##$RELAX= 
##$RELAX= 
##$RELAX= 
##$RELAX= 
##$RELAX= 
##$RELAX= 
$$ Bruker specific parameters
$$ --------------------------
##$DU= <E:\>
##$EXPNO= 22
$$ [...]
##$TP07= 0
##$TPNAME0= <>
##$TPNAME1= <>
##$TPNAME2= <>
##$TPNAME3= <>
##$TPNAME4= <>
##$TPNAME5= <>
##$TPNAME6= <>
##$TPNAME7= <>
##$TPOAL= (0..7)
0.5 0.5 0.5 0.5 0.5 0.5 0.5 0.5
##$TPOFFS= (0..7)
0 0 0 0 0 0 0 0
##$TUNHIN= 0
##$TUNHOUT= 0
##$TUNXOUT= 0
##$USERA1= <user>
##$USERA2= <user>
##$USERA3= <user>
##$USERA4= <user>
##$USERA5= <user>
##$V9= 5
##$VALIST= <valist>
##$VCLIST= <CCCCCCCCCCCCCCC>
##$VD= 0
##$VDLIST= <DDDDDDDDDDDDDDD>
##$VPLIST= <PPPPPPPPPPPPPPP>
##$VTLIST= <TTTTTTTTTTTTTTT>
##$WBST= 1024
##$WBSW= 4
##$XGAIN= (0..3)
0 0 0 0
##$XL= 0
##$YL= 0
##$YMAX_a= 5650066
##$YMIN_a= -12216384
##$ZGOPTNS= <>
##$ZL1= 120
##$ZL2= 120
##$ZL3= 120
##$ZL4= 120
##$ABSF1= 14.96085
##$ABSF2= -5.597332
##$ABSG= 5
##$ABSL= 3
##$ALPHA= 0
##$AQORDER= 0
##$ASSFAC= 0
##$ASSFACI= 0
##$ASSFACX= 0
##$ASSWID= 0
##$AUNMP= <proc_prof1d_extract.lims>
##$AXLEFT= 0
##$AXNAME= <>
##$AXNUC= <1H>
##$AXRIGHT= 0
##$AXTYPE= 0
##$AXUNIT= <>
##$AZFE= 0.1
##$AZFW= 0.1
##$BCFW= 0
##$BC_mod= 0
##$BYTORDP= 0
##$COROFFS= 0
##$CY= 15
##$DATMOD= 1
##$DC= 0
##$DFILT= <>
##$DTYPP= 0
##$F1P= 0
##$F2P= 0
##$FCOR= 0.5
##$FTSIZE= 131072
##$FT_mod= 6
##$GAMMA= 0
##$GB= 0
##$INTBC= 1
##$INTSCL= 1
##$ISEN= 128
##$LB= 0.3
##$LEV0= 0
##$LPBIN= 0
##$MAXI= 10000
##$MC2= 0
##$MEAN= 0
##$ME_mod= 0
##$MI= 0
##$NCOEF= 0
##$NC_proc= -2
##$NLEV= 6
##$NOISF1= 0
##$NOISF2= 0
##$NSP= 0
##$NTH_PI= 0
##$NZP= 0
##$OFFSET= 14.96085
##$PC= 1
##$PHC0= -79.16199
##$PHC1= 0
##$PH_mod= 1
##$PKNL= yes
##$PPARMOD= 0
##$PPDIAG= 0
##$PPIPTYP= 0
##$PPMPNUM= 2147483647
##$PPRESOL= 1
##$PSCAL= 4
##$PSIGN= 0
##$PYNMP= <proc.py>
##$REVERSE= no
##$SF= 400.020009698495
##$SI= 131072
##$SIGF1= 0
##$SIGF2= 0
##$SINO= 400
##$SIOLD= 131072
##$SPECTYP= <>
##$SREGLST= <1H.CDCl3>
##$SSB= 0
##$STSI= 131072
##$STSR= 0
##$SW_p= 8223.68421052631
##$SYMM= 0
##$S_DEV= 0
##$TDeff= 65536
##$TDoff= 0
##$TI= <>
##$TILT= no
##$TM1= 0
##$TM2= 0
##$TOPLEV= 0
##$USERP1= <user>
##$USERP2= <user>
##$USERP3= <user>
##$USERP4= <user>
##$USERP5= <user>
##$WDW= 1
##$XDIM= 131072
##$YMAX_p= 427192047
##$YMIN_p= -13394
##$CURPLOT= <Network HP LaserJet P1505>
##$CURPRIN= <$Network HP LaserJet P1505>
##$DFORMAT= <normdp>
##$LAYOUT= <+/1D_H.xwp>
##$LFORMAT= <normlp>
##$PFORMAT= <normpl>
##$SURQMSG= 1
$$ End of Bruker specific parameters
$$ ---------------------------------
##NTUPLES= NMR SPECTRUM
##VAR_NAME=  FREQUENCY,     SPECTRUM/REAL,   SPECTRUM/IMAG
##SYMBOL=    X,             R,               I
##VAR_TYPE=  INDEPENDENT,   DEPENDENT,       DEPENDENT
##VAR_FORM=  AFFN,          ASDF,            ASDF
##VAR_DIM=   131072,        131072,          131072
##UNITS=     HZ,            ARBITRARY UNITS, ARBITRARY UNITS
##FACTOR=    0.0627417313425164, 1,          1
##FIRST=     8223.62146879497, -763,         -55321
##LAST=      0,             1019,            -55789
##MIN=       0,             -13394,          0
##MAX=       8223.62146879497, 427192047,    0
$$ Real data points
##PAGE= N=1
##DATA TABLE= (X++(R..R)), XYDATA
$$ [...]
$$ plain form
63896 971529 938572 908778 881209 855387 831298 808784 787053 765119 742725 720482 699075
63885 699075 678655 659167 640905 624450 610193 598284 589004 582788 579684 579106 580402 583583 589179
63872 589179 597367 607530 618831 631030 644598 660138 677882 697539 718265 738814 758140 776081
63860 776081 793245 810082 826248 840978 853736 864248 872214 877447 880105 880393 878119 873089 865780
63847 865780 856962 846513 833330 816792 797682 777226 755689 732558 707745 681902 655708 629519
63835 629519 603676 578509 553993 529985 506944 485766 466697 448909 431461 414267 397846
63824 397846 382542 368415 355508 343771 332908 322696 313357 305299 298629 293161 288729 285186 282240
63811 282240 279653 277511 275961 274785 273484 271766 269694 267430 265101 262882 260943 259330 258063 257211
$$ packed form
63896I71529l2957k9794k7569k5822k4089k2514k1731k1934k2394k2243k1407
63885F99075k0420j9488j8262j6455j4257j1909r280o216l104n78J296L181N596
63872E89179Q188J0163J1301J2199J3568J5540J7744J9657K0726K0549J9326J7941
63860G76081J7164J6837J6166J4730J2758J0512P966N233K658K88k274n030p309
63847H65780q818j0449j3183j6538j9110k0456k1537k3131k4813k5843k6194k6189
63835F29519k5843k5167k4516k4008k3041k1178j9069j7788j7448j7194j6421
63824C97846j5304j4127j2907j1737j0863j0212r339q058o670n468m432l543k946
63811B82240k587k142j550j176j301j718k072k264k329k219j939j613j267q52
$$ plain form
63797 257211 256626 255787 254233 252109 249951 247996 246045 243950 241821 239749 237714 235878 234571 233891 233556
63782 233556 233214 232578 231240 228857 225776 223020 221358 220599 220062 219430 218839 218405 218084 217866 217741 217535 217002
63765 217002 216021 214508 212375 209941 208167 207983 209293 211028 212295 213123 213935 214636 214655 213791 212650 212069
63749 212069 212218 212489 212374 212285 213211 215488 218207 220103 220946 221725 223548 226623 230362 234081 237361 239927
63733 239927 241585 242464 243168 244455 246576 249033 251132 252823 254737 257409 260769 264578 268935 273881 278758
63718 278758 282576 285063 286822 288386 289683 290589 291348 292015 292014 290857 288942 287025 285146 282800 280123 278136
63702 278136 277612 278310 279517 280799 281906 282535 282740 283236 284781 287406 290694 294521 298945 303520 307432
63687 307432 310458 313196 316034 318373 319272 318596 317133 315697 314488 313250 311765 310163 308921 308495 308799
$$ packed form
63797B57211n85q39j554k124k158j955j951k095k129k072k035j836j307o80l35
63782B33556l42o36j338k383l081k756j662p59n37o32n91m34l21k18j25k06n33
63765B17002r81j513k133k434j774j84J310J735J267Q28Q12P01J9q64j141n81
63749B12069J49K71j15q9R26K277K719J896Q43P79J823L075L739L719L280K566
63733B39927J658Q79P04J287K121K457K099J691J914K672L360L809M357M946M877
63718B78758L818K487J759J564J297R06P59O67jj157j915j917j879k346k677j987
63702B78136n24O98J207J282J107O29K05M96J545K625L288L827M424M575L912
63687C07432L026K738K838K339Q99o76j463j436j209j238j485j602j242m26L04
$$ plain form
63672 308799 309148 309002 308682 309009 310224 311613 312361 312477 312589 312996 313232 312569 310731 308026 304954 301797 298598
63655 298598 295401 292348 289438 286340 282722 278871 275703 273895 273120 272347 270888 268939 267221 266370 266639
63640 266639 267825 269316 270505 271372 272482 274249 276404 278458 280473 283066 286684 291248 296552 302674
63626 302674 309700 317231 324492 331062 337423 344669 353598 364145 375733 388057 401270 415474 430471
63613 430471 446386 464204 485157 509545 536536 565191 595351 627332 661060 695685 729737
63602 729737 761383 788682 810013 824487 832124 833773 830833 824768 816697 807552 798479 790656 784455
63589 784455 778983 772574 763610 750905 733920 713056 689479 664261 637819 610436 583041 557086
63577 557086 533846 514077 497970 484914 473671 463479 454977 449405 446999 446763 447806 450053 453516
$$ packed form
63672C08799L49j46l20L27J215J389P48J16J12M07K36o63j838k705l072l157l199
63655B98598l197l053k910l098l618l851l168j808p75p73j459j949j718q51K69
63640B66639J186J491J189Q67J110J767K155K054K015K593L618M564N304O122
63626C02674P026P531P261O570O361P246Q929J0547J1588J2324J3213J4204J4997
63613D30471J5915J7818K0953K4388K6991K8655L0160L1981L3728L4625L4052
63602G29737L1646K7299K1331J4474P637J649k940o065q071r145r073p823o201
63589G84455n472o409q964j2705j6985k0864k3577k5218k6442k7383k7395k5955
63577E57086k3240j9769j6107j3056j1243j0192q502n572k406k36J043K247L463
$$ plain form
63564 453516 457723 462356 467799 474484 482078 489888 497767 506151 515384 525472 536347 548062 560835
63551 560835 575226 592144 612415 636456 664528 697045 734311 776014 820983 866919 910040
63540 910040 945569 969474 980148 978531 967228 949899 930770 913420 899573 889317 882283 877945
63528 877945 874904 870780 863269 850941 832956 808792 778760 744376 707719 670584 634347 600128
63516 600128 568497 539252 511992 486899 464615 445476 429171 415109 402751 391601 381273
63505 381273 371757 363403 356482 350787 345770 341019 336545 332609 329380 326802 324796 323447 322820 322674 322524
63490 322524 322087 321539 321256 321443 322011 322716 323356 323910 324632 325929 328093 331103 334667 338419 342106 345687
63474 345687 349201 352504 355203 356921 357518 356914 354936 351645 347678 343857 340369 336689 332390 327735 323315
$$ packed form
63564D53516M207M633N443O685P594P810P879Q384R233J0088J0875J1715J2773
63551E60835J4391J6918K0271K4041K8072L2517L7266M1703M4969M5936M3121
63540I10040L5529K3905J0674j617j1303j7329j9129j7350j3847j0256p034m338
63528H77945l041m124p511j2328j7985k4164l0032l4384l6657l7135l6237l4219
63516F00128l1631k9245k7260k5093k2284j9139j6305j4062j2358j1150j0328
63505C81273r516q354o921n695n017m751m474l936l229k578k006j349o27j46j50
63490C22524m37n48k83J87N68P05O40N54P22J297K164L010L564L752L687L581
63474C45687L514L303K699J718N97o04j978l291l967l821l488l680m299m655m420
$$ plain form
63459 323315 319438 316083 313241 311055 309710 309409 310347 312596 315975 320077 324390 328533 332653 337506 343789
63444 343789 351314 359136 366594 373918 381749 390488 400369 411811 425413 441838 461861 486145 514542
63431 514542 545730 577729 608460 635694 657162 671608 679853 684361 687746 691877 698060 707365 720628
63418 720628 738484 761507 790008 823669 861531 902240 943966 984163 1019866 1048437 1068081
63407 1068081 1078128 1079388 1074130 1065023 1053862 1041503 1028810 1016957 1006602 997124 986797 973431
63395 973431 955040 930670 900894 867169 830637 792014 752534 714132 678338 645602 615987
63384 615987 589730 566645 545806 526701 510200 497520 488525 481914 476865 473635 472555 473351 475655
63371 475655 479496 484980 492055 500800 511464 523968 537804 552665 568814 586560 605850 626656
$$ packed form
63459C23315l877l355k842k186j345l01R38K249L379M102M313M143M120M853O283
63444C43789P525P822P458P324P831Q739R881J1442J3602J6425K0023K4284K8397
63431E14542L1188L1999L0731K7234K1468J4446Q245M508L385M131O183R305J3263
63418G20628J7856K3023K8501L3661L7862M0709M1726M0197L5703K8571J9644
63407A068081J0047J260n258r107j1161j2359j2693j1853j0355r478j0327j3366
63395I73431j8391k4370k9776l3725l6532l8623l9480l8402l5794l2736k9615
63384F15987k6257k3085k0839j9105j6501j2680q995o611n049l230j080P96K304
63371D75655L841N484P075Q745J0664J2504J3836J4861J6149J7746J9290K0806
$$ plain form
63359 626656 649445 674887 703273 734520 768535 805161 843791 883260 922082 958600 990833
63348 990833 1016452 1033277 1040287 1038408 1030223 1018671 1005927 993413 982190 972668 964016 954580 943048
63335 943048 928772 910984 888511 860758 828541 793554 757386 721383 686961 655358 627190
63324 627190 602626 581804 564717 551015 540531 533840 531591 533093 535847 536581 532569 522363 506146
63311 506146 485848 464514 444920 428392 414659 402610 391314 380697 371417 364052 358548 354496
63299 354496 351653 349845 348668 347775 347281 347340 347378 346395 344091 341132 338163 335176 332120 329444 327504 325846
63283 325846 323653 320749 317678 314933 312536 310412 308840 308362 309312 311392 313721 315468 316477 317106 317493
63268 317493 317329 316463 315331 314561 314483 315249 317012 319636 322519 325098 327305 329307 331180 333251 336326 340925
$$ packed form
63359F26656K2789K5442K8386L1247L4015L6626L8630L9469L8822L6518L2233
63348I90833K5619J6825P010j879q185j1552j2744j2514j1223r522q652r436j1532
63335I43048j4276j7788k2473k7753l2217l4987l6168l6003l4422l1603k8168
63324F27190k4564k0822j7087j3702j0484o691k249J502K754P34m012j0206j6217
63311E06146k0298k1334j9594j6528j3733j2049j1296j0617r280p365n504m052
63299C54496k843j808j177q93m94N9L8r83k304k959k969k987l056k676j940j658
63283C25846k193k904l071k745k397k124j572m78R50K080K329J747J009O29L87
63268C17493j64q66j132p70p8P66J763K624K883K579K207K002J873K071L075M599
$$ plain form
63252 340925 346471 351836 356595 361206 366156 371642 378087 386140 395811 406164 416229 425850 435461 445559
63238 445559 456804 470175 486422 505428 526450 548931 572809 598161 624868 652607 680910
63227 680910 709224 737096 764355 790944 816641 841142 864554 887667 911560 936898 963588
63216 963588 991079 1018788 1046122 1072206 1095945 1116460 1133227 1145628 1152639 1153227 1146916 1133732
63204 1133732 1113891 1087963 1057223 1023376 987843 951642 915843 881594 849597 819983 792925
63193 792925 769038 749001 733122 721412 713760 709808 709010 711099 716243 724507 735430 748342 762862
63180 762862 778889 796379 815350 835765 857096 878339 898912 919363 940740 963338 986352
63169 986352 1008559 1028914 1046667 1061437 1073273 1082220 1087655 1088387 1083520 1073052 1057571 1037574
$$ packed form
63252C40925N546N365M759M611M950N486O445Q053R671J0353J0065R621R611J0098
63238D45559J1245J3371J6247J9006K1022K2481K3878K5352K6707K7739K8303
63227F80910K8314K7872K7259K6589K5697K4501K3412K3113K3893K5338K6690
63216I63588K7491K7709K7334K6084K3739K0515J6767J2401P011N88o311j3184
63204A133732j9841k5928l0740l3847l5533l6201l5799l4249l1997k9614k7058
63193G92925k3887k0037j5879j1710p652l952p98K089N144Q264J0923J2912J4520
63180G62862J6027J7490J8971K0415K1331K1243K0573K0451K1377K2598K3014
63169I86352K2207K0355J7753J4770J1836Q947N435P32m867j0468j5481j9997
$$ plain form
63157 1037574 1013179 984326 951214 914736 876466 838095 800858 765583 733062 703895 677990
63146 677990 654644 633363 614330 597892 583845 571463 560093 549545 540041 531937 525414 520221
63134 520221 515741 511488 507550 504461 502694 502390 503497 505988 509776 514521 519653 524722 529699 534896
63120 534896 540558 546581 552619 558383 563761 568729 573295 577549 581608 585406 588590 590780 592028 592949
63106 592949 594291 596290 598538 600474 601942 603183 604391 605439 606007 605812 604705 602735 600215 597583 595157
63091 595157 593078 591492 590580 590348 590522 590813 591250 592140 593706 595761 597789 599492 601300 604075 608105 612617
63075 612617 616675 620372 624704 630361 637248 645136 654068 663880 674087 684689 696510 710187 725317
63062 725317 741222 758115 776840 797803 820992 846888 876521 910509 948685 990734 1036536
$$ packed form
63157A037574k4395k8853l3112l6478l8270l8371l7237l5275l2521k9167k5905
63146F77990k3346k1281j9033j6438j4047j2382j1370j0548r504q104o523n193
63134E20221m480m253l938l089j767l04J107K491L788M745N132N069M977N197
63120E34896N662O023O038N764N378M968M566M254M059L798L184K190J248R21
63106E92949J342J999K248J936J468J241J208J048N68j95j107j970k520k632k426
63091E95157k079j586r12k32J74K91M37Q90J566K055K028J703J808K775M030M512
63075F12617M058L697M332N657O887P888Q932R812J0207J0602J1821J3677J5130
63062G25317J5905J6893J8725K0963K3189K5896K9633L3988L8176M2049M5802
$$ plain form
63051 1036536 1085786 1137930 1192769 1250547 1311192 1373945 1438003 1503051 1568793 1634404 1698895
63040 1698895 1761794 1823202 1883456 1943070 2002712 2062818 2123291 2183741 2243760 2302577 2358595
63029 2358595 2409597 2453392 2488011 2511430 2521587 2516924 2496893 2461949 2413188 2352017 2280109
63018 2280109 2199564 2113036 2023568 1934242 1847931 1767072 1693276 1627045 1568211 1516831 1473518
63007 1473518 1438861 1412801 1394753 1384126 1380519 1383566 1392892 1408158 1428936 1454471 1483659 1515321
62995 1515321 1548593 1583202 1619352 1657084 1695728 1734182 1771844 1808969 1845942 1882390 1917181
62984 1917181 1948983 1976526 1998482 2013519 2020592 2018979 2008018 1987002 1955515 1913854 1863127 1804911
62972 1804911 1740851 1672556 1601822 1530673 1460974 1393997 1330524 1271231 1216685 1166965 1121613
$$ packed form
63051A036536M9250N2144N4839N7778O0645O2753O4058O5048O5742O5611O4491
63040A698895O2899O1408O0254N9614N9642O0106O0473O0450O0019N8817N6018
63029B358595N1002M3795L4619K3419J0157m663k0031l4944m8761o1171p1908
63018B280109q0545q6528q9468q9326q6311q0859p3796o6231n8834n1380m3313
63007A473518l4657k6060j8048j0627l607L047R326J5266K0778K5535K9188L1662
62995A515321L3272L4609L6150L7732L8644L8454L7662L7125L6973L6448L4791
62984A917181L1802K7543K1956J5037P073j613j0961k1016l1487m1661n0727n8216
62972A804911o4060o8295p0734p1149o9699o6977o3473n9293n4546m9720m5352
$$ plain form
62961 1121613 1080029 1041774 1006526 974030 944105 916404 890224 864958 840778 818371 797845
62950 797845 778367 759144 740299 722412 705605 689515 673859 658604 643764 629497 616240
62939 616240 604347 593709 584057 575457 568155 562052 556746 552000 547834 544254 541204 538716 536770 535126
62925 535126 533606 532387 531656 531123 530252 528839 526978 524677 522006 519479 517651 516297 514516 511713 508032
62910 508032 503823 499305 494834 490897 487565 484386 481075 477884 475135 472839 471003 469787 469077 468369 467472
62895 467472 466930 467306 468312 469080 469058 468354 467421 466803 466895 467524 467910 467419 466330 465558 465755 466899 468500 469884
62877 469884 470498 470386 470265 470723 471485 471853 471703 471475 471280 470638 469262 467531 465956 464607 463393 462495 462097
62860 462097 461925 461488 460752 460250 460507 461528 462849 463948 464681 465452 466937 469451 472509 475127 476636 477172
$$ packed form
62961A121613m1584l8255l5248l2496k9925k7701k6180k5266k4180k2407k0526
62950G97845j9478j9223j8845j7887j6807j6090j5656j5255j4840j4267j3257
62939F16240j1893j0638r652q600p302o103n306m746m166l580l050k488j946j644
62925E35126j520j219p31n33q71j413j861k301k671k527j828j354j781k803l681
62910E08032m209m518m471l937l332l179l311l191k749k296j836j216p10p08q97
62895D67472n42L76J006P68k2p04r33o18R2O29L86m91j089p72J97J144J601J384
62877D69884O14j12j21M58P62L68j50k28j95o42j376j731j575j349j214q98l98
62860D62097j72m37p36n02K57J021J321J099P33P71J485K514L058K618J509N36
$$ plain form
62844 477172 477350 477508 477362 476423 474659 472602 470785 469200 467386 464995 462180 459554 457845 457417 457910 458472
62828 458472 458591 458697 459595 461337 463059 464093 464856 466284 468635 471269 473584 475712 478162 481103 484284
62813 484284 487510 490893 494662 498947 503829 509342 515233 520904 525993 531058 537288 545275 554311 563266
62799 563266 571960 581186 591508 602699 614549 627532 642115 657829 673814 690282 708864 731335
62787 731335 758400 789798 825213 864817 909247 959326 1015692 1078579 1148063 1224486 1308309
62776 1308309 1399392 1496721 1598965 1704945 1813156 1921125 2025634 2123565 2212275 2289322
62766 2289322 2352288 2398987 2427727 2437448 2427885 2399650 2353949 2292330 2216891 2130588 2036817 1938502
62754 1938502 1837719 1736159 1635566 1537560 1443353 1353831 1269736 1191582 1119519 1053441 993157
$$ packed form
62844D77172J78J58j46r39j764k057j817j585j814k391k815k626j709m28M93N62
62828D58472J19J06Q98J742J722J034P63J428K351K634K315K128K450K941L181
62813D84284L226L383L769M285M882N513N891N671N089N065O230P987R036Q955
62799E63266Q694R226J0322J1191J1850J2983J4583J5714J5985J6468J8582K2471
62787G31335K7065L1398L5415L9604M4430N0079N6366O2887O9484P6423Q3823
62776A308309R1083R7329J02244J05980J08211J07969J04509R7931Q8710P7047
62766B289322O2966M6699K8740R721r563k8235m5701o1619p5439q6303r3771r8315
62754A938502j00783j01560j00593r8006r4207q9522q4095p8154p2063o6078o0284
$$ plain form
62743 993157 938391 888794 844067 804000 768377 736921 709314 685061 663367 643479 625254
62732 625254 609166 595647 584599 575577 568150 561973 556863 553034 550895 550324 550369 550029 549223 548750 549498
62717 549498 551911 555990 561402 567708 574889 583657 594931 608981 625355 643611 663883 686718 712626
62704 712626 741870 774551 810886 851469 897154 948521 1005516 1067648 1134303 1204778 1278375
62693 1278375 1354848 1434409 1516759 1600166 1681872 1759148 1829485 1890091 1938099 1971599 1989962
62682 1989962 1993069 1980740 1953088 1910874 1855319 1788131 1712018 1630533 1546826 1462709 1379190
62671 1379190 1297494 1219108 1145157 1076202 1012501 954092 900782 852388 808887 770076 735300
62660 735300 703864 675565 650520 628633 609468 592465 577010 562543 548903 536339 524833
$$ packed form
62743I93157n4766m9597m4727m0067l5623l1456k7607k4253k1694j9888j8225
62732F25254j6088j3519j1048r022p427o177n110l829k139n71M5l40q06m73P48
62717E49498K413M079N412O306P181Q768J1274J4050J6374J8256K0272K2835K5908
62704G12626K9244L2681L6335M0583M5685N1367N6995O2132O6655P0475P3597
62693A278375P6473P9561Q2350Q3407Q1706P7276P0337O0606M8008L3500J8363
62682A989962L107j2329k7652m2214n5555o7188p6113q1485q3707q4117q3519
62671A379190q1696p8386p3951o8955o3701n8409n3310m8394m3501l8811l4776
62660G35300l1436k8299k5045k1887j9165j7003j5455j4467j3640j2564j1506
$$ plain form
62649 524833 513699 502268 490763 480069 470824 463159 457052 452280 448182 444137 440301 437324 435364
62636 435364 434087 433586 434471 436749 439335 441098 441817 441742 440840 439128 437257 436042 435523 435052 434200 433099
62620 433099 432029 431141 430597 430559 431108 432509 435372 440048 445910 451832 457465 463581 470961 479415 488191
62605 488191 496965 506119 516261 527818 540974 555763 572359 591383 613762 640136 670578 705082
62593 705082 743958 787383 834785 885140 937756 992209 1047361 1100935 1150322 1193522 1229172
62582 1229172 1256149 1273619 1281285 1279132 1267022 1245001 1214103 1176498 1134619 1090220 1044191 996966
62570 996966 948971 900993 854335 810405 769919 732571 697696 665235 635917 610509 589033
62559 589033 570693 554496 539937 527096 516027 506243 497072 488483 481098 475211 470260 465637 461590
$$ packed form
62649E24833j1134j1431j1505j0694r245p665o107m772m098m045l836k977j960
62636D35364j277n01Q85K278K586J763P19p5r02j712j871j215n19m71q52j101
62620D33099j070q88n44l8N49J401K863M676N862N922N633O116P380Q454Q776
62605D88191Q774R154J0142J1557J3156J4789J6596J9024K2379K6374L0442L4504
62593G05082L8876M3425M7402N0355N2616N4453N5152N3574M9387M3200L5650
62582A229172K6977J7470P666k153j2110k2021l0898l7605m1879m4399m6029m7225
62570I96966m7995m7978m6658m3930m0486l7348l4875l2461k9318k5408k1476
62559E89033j8340j6197j4559j2841j1069r784r171q589p385n887m951m623m047
$$ plain form
62546 461590 458753 457034 455655 454222 453042 452313 451755 451333 451611 452890 454524 455651 456210 456594 456692 456119
62530 456119 455296 455430 457243 460371 464314 469333 476011 484425 494299 505759 519383 535574 554328 575677
62516 575677 600038 627943 659579 694744 733163 774721 819248 866076 914025 962075 1009939
62505 1009939 1057482 1103459 1145350 1180812 1209019 1230131 1243855 1249318 1246406 1236430 1221120 1201510
62493 1201510 1178372 1153313 1128809 1107099 1089507 1076814 1069728 1068787 1074207 1086150 1104898 1130406
62481 1130406 1161829 1197887 1237772 1281411 1328711 1378595 1428674 1475495 1515133 1544241 1561369
62470 1561369 1567531 1564964 1554829 1535954 1505899 1463253 1409059 1346377 1278845 1209563 1140703 1073583
62458 1073583 1008882 947008 888492 834142 784872 741432 704241 673229 647644 626166 607624
$$ packed form
62546D61590k837j719j379j433j180p29n58m22K78J279J634J127N59L84R8n73
62530D56119q23J34J813L128L943N019O678Q414R874J1460J3624J6191J8754K1349
62516E75677K4361K7905L1636L5165L8419M1558M4527M6828M7949M8050M7864
62505A009939M7543M5977M1891L5462K8207K1112J3724N463k912r976j5310j9610
62493A201510k3138k5059k4504k1710j7592j2693p086r41N420J1943J8748K5508
62481A130406L1423L6058L9885M3639M7300M9884N0079M6821L9638K9108J7128
62470A561369O162k567j0135j8875l0055m2646n4194o2682o7532o9282o8860o7120
62458A073583o4701o1874n8516n4350m9270m3440l7191l1012k5585k1478j8542
$$ plain form
62447 607624 591768 579124 569966 563691 559478 557272 557595 560430 564820 569770 575084 581015 587472 594033
62433 594033 600402 606321 611072 613661 613591 611098 606507 599769 590853 580291 569020 557799 546936 536406
62419 536406 526046 515784 505853 496689 488538 481285 474770 469076 464284 460093 455891 451182 445886 440382
62405 440382 435378 431481 428647 426194 423563 420946 418945 417864 417667 418416 420195 422614 424972 427070 429451
62390 429451 432524 435821 438447 440103 441347 442966 445315 448194 451129 453840 456573 459959 464403 469773
62376 469773 475785 482488 490099 498511 507366 516555 526336 536875 548026 559726 572286 586159 601628
62363 601628 619028 639051 662492 689703 720569 755099 793788 837294 885898 939350 996945
62352 996945 1057445 1119004 1179445 1236797 1289354 1335182 1371873 1397360 1411216 1414971 1410918 1400577
$$ packed form
62447F07624j5856j2644r158o275m213k206L23K835M390M950N314N931O457O561
62433E94033O369N919M751K589p0k493m591o738q916j0562j1271j1221j0863j0530
62419E36406j0360j0262r931r164q151p253o515n694m792m191m202m709n296n504
62405D40382n004l897k834k453k631k617k001j081j97P49J779K419K358K098K381
62390D29451L073L297K626J656J244J619K349K879K935K711K733L386M444N370
62376D69773O012O703P611Q412Q855R189R781J0539J1151J1700J2560J3873J5469
62363F01628J7400K0023K3441K7211L0866L4530L8689M3506M8604N3452N7595
62352I96945O0500O1559O0441N7352N2557M5828L6691K5487J3856L755m053j0341
$$ plain form
62340 1400577 1384347 1362316 1334953 1302929 1266746 1226940 1184513 1140888 1097553 1055938 1017450
62329 1017450 983073 952822 925915 901643 879838 860420 842936 826815 811721 797204 782230
62318 782230 765585 746766 726145 704315 681763 659148 637302 616697 597310 579289 563328
62307 563328 549960 538799 528948 520039 512421 506407 501818 498342 495886 494378 493535 493128 493295 494371
62293 494371 496525 499725 503926 509065 514913 521223 528075 535916 545082 555334 566045 576748 587356
62280 587356 597811 607815 617047 625499 633317 640431 646601 651795 656211 659937 662923 665404 667902 670644
62266 670644 673392 676292 680626 688207 700061 716059 735728 758974 785987 817024 852619 893704
62254 893704 941084 994730 1053551 1115714 1179099 1241577 1301016 1355078 1401225 1437407 1462960
$$ packed form
62340A400577j6230k2031k7363l2024l6183l9806m2427m3625m3335m1615l8488
62329A017450l4377l0251k6907k4272k1805j9418j7484j6121j5094j4517j4974
62318G82230j6645j8819k0621k1830k2552k2615k1846k0605j9387j8021j5961
62307E63328j3368j1161r851q909p618o014m589l476k456j508q43m07J67J076
62293D94371K154L200M201N139N848O310O852P841R166J0252J0711J0703J0608
62280E87356J0455J0004R232Q452P818P114O170N194M416L726K986K481K498K742
62266F70644K748K900M334P581J1854J5998J9669K3246K7013L1037L5595M1085
62254H93704M7380N3646N8821O2163O3385O2478N9439N4062M6147L6182K5553
$$ plain form
62243 1462960 1478633 1485522 1484061 1474153 1455888 1429635 1395435 1352908 1302248 1245183 1184607 1123158
62231 1123158 1062371 1003195 946907 895096 848820 808115 772344 740771 712825 688213 666996
62220 666996 649283 634652 622109 610788 600494 591375 583390 576358 570242 564982 560303 556010 552282
62207 552282 549188 546183 542694 539122 536620 535807 536272 537480 539546 542805 547116 552032 557374 563259 569707
62192 569707 576476 583190 589518 595473 601589 608567 616597 625308 634448 644236 654824 665777 676408
62179 676408 686396 695777 704545 712597 719956 726793 733323 739838 746763 754742 764879 778808 797934
62166 797934 822350 850995 883222 919716 961381 1007669 1056495 1105456 1152533 1195833 1233433
62155 1233433 1263712 1285570 1298529 1303132 1301122 1294536 1284315 1270025 1250890 1226651 1197520 1164031
$$ packed form
62243A462960J5673O889j461r908j8265k6253l4200m2527n0660n7065o0576o1449
62231A123158o0787n9176n6288n1811m6276m0705l5771l1573k7946k4612k1217
62220F66996j7713j4631j2543j1321j0294r119p985p032o116n260m679m293l728
62207E52282l094l005l489l572k502q13M65J208K066L259M311M916N342N885O448
62192E69707O769O714O328N955O116O978Q030Q711R140R788J0588J0953J0631
62179F76408R988R381Q768Q052P359O837O530O515O925P979J0137J3929J9126
62166G97934K4416K8645L2227L6494M1665M6288M8826M8961M7077M3300L7600
62155A233433L0279K1858J2959M603k010o586j0221j4290j9135k4239k9131l3489
$$ plain form
62143 1164031 1127269 1088832 1050217 1012470 976592 943840 915222 890873 870299 853177 839616
62132 839616 829614 822531 817244 812792 808806 805259 801798 797527 791662 784442 777250 771738 768863 768664
62118 768664 770749 774845 780979 789126 798613 807834 814743 817796 816634 812078 805642 798931 793105 788552
62104 788552 784898 781319 776948 771157 763584 754067 742812 730824 719906 711704 706565 703650 702230
62091 702230 702484 704806 708816 713556 718399 723326 728487 733987 740017 746701 753801 760989 768511 777234
62077 777234 787907 800571 814716 829801 845635 862475 880708 900276 920461 940529 960500
62066 960500 981057 1002850 1026160 1051136 1077949 1106710 1137398 1169578 1201749 1231261 1255510
62055 1255510 1273316 1284707 1289699 1288079 1280443 1268479 1253745 1236586 1216442 1192570 1164147 1130434
$$ packed form
62143A164031l6762l8437l8615l7747l5878l2752k8618k4349k0574j7122j3561
62132H39616j0002p083n287m452l986l547l461m271n865p220p192n512k875j99
62118G68664K085M096O134Q147R487R221O909L053j162m556o436o711n826m553
62104G88552l654l579m371n791p573r517j1255j1988j0918q202n139k915j420
62091G02230K54K322M010M740M843M927N161N500O030O684P100P188P522Q723
62077G77234J0673J2664J4145J5085J5834J6840J8233J9568K0185K0068J9971
62066I60500K0557K1793K3310K4976K6813K8761L0688L2180L2171K9512K4249
62055A255510J7806J1391M992j620p636j1964j4734j7159k0144k3872k8423l3713
$$ plain form
62043 1130434 1091613 1049281 1005595 962035 919239 877641 837733 799793 763852 729998 698514
62032 698514 669742 643973 621351 601724 584684 569869 557106 546223 536942 529009 522188 516129
62020 516129 510546 505536 501247 497132 492080 485556 478185 470943 464284 458383 453615 450180 447632 445423
62006 445423 443645 442729 442747 443604 445639 449217 453782 458047 461248 463729 466251 469266 472862 476820 480483
61991 480483 483063 484330 484667 484289 482748 479372 473926 466772 458677 450506 442693 434957 426899 418951 412201
61976 412201 407105 402902 398697 394619 391415 389202 387274 385039 382593 380254 378047 375882 373965 372722
61962 372722 372368 372713 373257 373370 372513 370651 368523 367274 367555 369034 370883 372655 374443 376347 378229 380178
61946 380178 382804 386765 392194 398846 406567 415225 424411 433756 443634 455024 468408 483037 497491
$$ packed form
62043A130434l8821m2332m3686m3560m2796m1598l9908l7940l5941l3854l1484
62032F98514k8772k5769k2622j9627j7040j4815j2763j0883r281p933o821o059
62020E16129n583n010m289m115n052o524p371p242o659n901m768l435k548k209
62006D45423j778r16J8Q57K035L578M565M265L201K481K522L015L596L958L663
61991D80483K580J267L37l78j541l376n446p154q095q171p813p736q058p948o750
61976D12201n096m203m205m078l204k213j928k235k446k339k207k165j917j243
61962C72722l54L45N44J13q57j862k128j249K81J479J849J772J788J904J882J949
61946C80178K626L961N429O652P721Q658R186R345R878J1390J3384J4629J4454
$$ plain form
61933 497491 510821 523042 534729 546369 558030 569349 579749 588678 595753 600808 603897 605163
61921 605163 604629 602226 598111 592737 586417 579032 570609 562070 554949 550252 547972 547793 549773 554093 560536
61906 560536 568664 578297 589372 601352 613196 623979 633332 641092 646683 649054 647406 642082 634671
61893 634671 626947 619546 611776 602781 592648 582240 572263 562924 554436 547364 542175 538621 535749 532464
61879 532464 528016 522097 514747 506273 497193 488121 479592 471886 465027 458959 453779 449761 447189 446153
61865 446153 446464 447731 449552 451700 454189 457157 460736 465026 470149 476277 483661 492703 503853 517247
61851 517247 532481 548962 566541 585608 606433 628628 651392 674080 696203 717028 735572
61840 735572 751080 763197 771639 776104 776706 774141 769101 761844 752682 742595 732868 724246 716974 711609
$$ packed form
61933D97491J3330J2221J1687J1640J1661J1319J0400Q929P075N055L089J266
61921F05163n34k403m115n374o320p385q423q539p121m697k280j79J980M320O443
61906E60536Q128R633J1075J1980J1844J0783R353P760N591K371j648n324p411
61893F34671p724p401p770q995j0133j0408r977r339q488p072n189l554k872l285
61879E32464m448n919p350q474r080r072q529p706o859o068n180m018k572j036
61865D46153L11J267J821K148K489K968L579M290N123O128P384R042J1150J3394
61851E17247J5234J6481J7579J9067K0825K2195K2764K2688K2123K0825J8544
61840G35572J5508J2117Q442M465O02k565n040p257r162j0087r727q622p272n365
$$ plain form
61826 711609 709178 710307 714672 721548 730514 741314 753288 765270 775928 784013 788552 789076 785547
61813 785547 777893 765867 749687 730640 710686 691385 673309 656322 640118 624576 609833 596088
61801 596088 583298 571211 559804 549505 540763 533512 527239 521424 515779 510288 505259 501117 497864
61788 497864 494920 491788 488630 485873 483480 481083 478698 476793 475644 475032 474527 473748 472417 470606 468901
61773 468901 467812 467063 465978 464563 463610 463629 464290 465127 466164 467528 469019 470570 472721 476085 480554 485417
61757 485417 490087 494401 498421 502299 506168 509872 512917 514928 515982 516282 515805 514505 512514 509821 506109
61742 506109 501398 496547 492566 489539 486734 483601 480171 476625 473163 470317 468709 468258 468177 467957 467890 468351
61726 468351 469107 469755 470463 471788 473912 476450 478914 481024 482703 484072 485473 487196 489215 491421 493996
$$ packed form
61826G11609k431J129M365O876Q966J0800J1974J1982J0658Q085M539N24l529
61813G85547p654j2026j6180j9047j9954j9301j8076j6987j6204j5542j4743j3745
61801E96088j2790j2087j1407j0299q742p251o273n815n645n491n029m142l253
61788D97864k944l132l158k757k393k397k385j905j149o12n05p79j331j811j705
61773D68901j089p49j085j415r53J9O61Q37J037J364J491J551K151L364M469M863
61757D85417M670M314M020L878L869L704L045K011J054L00m77j300j991k693l712
61742E06109m711m851l981l027k805l133l430l546l462k846j608m51q1k20o7M61
61726D68351P56O48P08J325K124K538K464K110J679J369J401J723K019K206K575
$$ plain form
61711 493996 497196 500624 503038 503190 500877 497076 493054 489429 486036 482560 479102 476085 473732 471811
61697 471811 469903 467735 465223 462339 459125 455726 452260 448679 444867 440876 436962 433396 430340 427777
61683 427777 425423 422765 419497 415978 412978 410761 408665 405907 402659 399941 398382 397422 395964 393579
61669 393579 390805 388448 386901 386074 385673 385408 385171 385106 385332 385607 385583 385588 386768 389983 394604 398906 401781
61652 401781 403775 406220 409621 413191 415820 417086 417319 417060 416763 416853 417697 419360 421502 423621 425349 426522
61636 426522 427048 426917 426299 425467 424484 423102 421152 418980 417285 416437 416110 415650 414641 412936 410393 406938
61620 406938 402944 399221 396414 394487 392892 391114 388952 386416 383625 380810 378243 376019 373929 371554
61606 371554 368504 364678 360380 356157 352433 349265 346429 343645 340723 337664 334696 332070 329709 327218
$$ packed form
61711D93996L200L428K414J52k313l801m022l625l393l476l458l017k353j921
61697D71811j908k168k512k884l214l399l466l581l812l991l914l566l056k563
61683D27777k354k658l268l519l000k217k096k758l248k718j559r60j458k385
61669C93579k774k357j547q27m01k65k37o5K26K75k4NJ180L215M621M302K875
61652D01781J994K445L401L570K629J266K33k59k97R0Q44J663K142K119J728J173
61636D26522N26j31o18q32r83j382j950k172j695q48l27m60j009j705k543l455
61620D06938l994l723k807j927j595j778k162k536k791k815k567k224k090k375
61606C71554l050l826m298m223l724l168k836k784k922l059k968k626k361k491
$$ plain form
61592 327218 324395 321518 318992 316920 315248 314101 313576 313329 312779 311724 310361 308822 307124 305557 304506
61577 304506 303774 302691 301162 300029 299982 300587 300859 300422 299596 298717 297974 297680 298023 298655 299130 299709 301109 303385
61559 303385 305719 307479 308932 310567 312196 313123 313011 312283 311811 312336 314017 316294 318344 319748 320636 321219
61543 321219 321534 321720 322152 323002 323903 324349 324373 324573 325572 327574 330334 333311 335877 337641 338636 339103 339075 338276
61525 338276 336528 334203 332092 330680 329614 328146 326095 324058 322536 321280 319894 318731 318584 319560 320851
61510 320851 321709 322144 322449 322500 321843 320220 317865 315463 313871 313507 313930 314346 314618 315295 316538 317659 318060
61493 318060 318114 318543 319371 320122 320802 321959 323819 325912 327684 328992 329909 330492 330968 331837 333548 336128 339240
61476 339240 342514 345777 349006 352074 354547 355934 356252 356142 356176 356260 355981 355391 354992 354985 354969 354492 353572 352507
$$ packed form
61592C27218k823k877k526k072j672j147n25k47n50j055j363j539j698j567j051
61577C04506p32j083j529j133m7O05K72m37q26q79p43k94L43O32M75N79J400K276
61559C03385K334J760J453J635J629R27j12p28m72N25J681K277K050J404Q88N83
61543C21219L15J86M32Q50R01M46K4K00R99K002K760K977K566J764R95M67k8p99
61525C38276j748k325k111j412j066j468k051k037j522j256j386j163j47R76J291
61510C20851Q58M35L05N1o57j623k355k402j592l64M23M16K72O77J243J121M01
61493C18060N4M29Q28P51O80J157J860K093J772J308R17N83M76Q69J711K580L112
61476C39240L274L263L229L068K473J387L18j10L4Q4k79n90l99pj6m77r20j065
$$ plain form
61458 352507 351471 350503 349732 349319 349239 349288 349349 349500 349796 349959 349494 348273 346924 346324 346641 347160 347273 347281 347868
61439 347868 349040 350115 350699 351128 351819 352726 353768 355316 357713 360482 362592 363604 364163 365099 366329 367004
61423 367004 366659 365872 365649 366386 367608 368611 369148 369521 370211 371460 373084 374644 375900 377084 378616 380503
61407 380503 382203 383101 382995 382065 380519 378438 375915 373265 371078 369925 369870 370357 370797 371202 371971 373086
61391 373086 373927 373988 373430 372741 372178 371793 371692 371959 372513 373332 374628 376495 378523 380122 381159 382067 383384
61374 383384 385433 388279 391726 395356 398835 402130 405246 407878 409601 410405 410795 411372 412487 414238 416550
61359 416550 419220 422029 424815 427400 429616 431578 433850 437122 441712 447388 453525 459377 464510 469115
61345 469115 473667 478079 481536 483485 484428 485279 486202 486659 486497 486380 487020 488421 490017 491188 491484 490625
$$ packed form
61458C52507j036r68p71m13q0M9O1J51K96J63m65j221j349o00L17N19J13QN87
61439C47868J172J075N84M29O91R07J042J548K397K769K110J012N59R36J230O75
61423C67004l45p87k23P37J222J003N37L73O90J249J624J560J256J184J532J887
61407C80503J700Q98j06r30j546k081k523k650k187j153n5M87M40M05P69J115
61391C73086Q41O1n58o89n63l85j01K67N54Q19J296J867K028J599J037R08J317
61374C83384K049K846L447L630L479L295L116K632J723Q04L90N77J115J751K312
61359D16550K670K809K786K585K216J962K272L272M590N676O137N852N133M605
61345D69115M552M412L457J949R43Q51R23M57j62j17O40J401J596J171K96q59
$$ plain form
61329 490625 488531 485326 481277 476812 472459 468597 465385 463003 461693 461340 461401 461653 462701 465158 468632
61314 468632 472247 476040 481046 487858 495887 504338 513261 523217 534468 546991 560891 576286 592885
61301 592885 610030 626915 642490 655424 664712 670406 673456 674749 674388 671863 666784 659410 650563
61288 650563 641105 631549 622072 612643 603012 592854 582206 571621 561654 552463 544269 537778 533482
61275 533482 530695 528142 525648 524455 525508 528072 530476 531796 532366 533033 534423 536687 539529 542472 545301
61260 545301 548145 551188 554710 559391 565885 573715 581213 587098 591679 595964 600008 602852 603861 603336
61246 603336 601866 599780 597365 594962 592563 589745 586293 582665 579622 577507 576033 574612 572872 571004
61232 571004 569653 569323 569874 570767 571850 573702 577056 581999 587878 594071 600687 608350 617280 626776 635789
$$ packed form
61329D90625k094l205m049m465m353l862l212k382j310l53O1K52J048K457L474
61314D68632L615L793N006O812Q029Q451Q923R956J1251J2523J3900J5395J6599
61301E92885J7145J6885J5575J2934R288N694L050J293l61k525n079p374q847
61288F50563r458r556r477r429r631j0158j0648j0585r967r191q194o491m296
61275E33482k787k553k494j193J053K564K404J320N70O67J390K264K842K943K829
61260E45301K844L043L522M681O494P830P498N885M581M285M044K844J009n25
61246F03336j470k086k415k403k399k818l452l628l043k115j474j421j740j868
61232E71004j351l30N51Q93J083J852L354M943N879O193O616P663Q930R496R013
$$ plain form
61217 635789 643835 651159 658194 665261 672701 680752 689115 697064 704186 710649 716498 721141 723938 725110
61203 725110 725724 726876 729097 732378 736483 741372 747458 755325 765081 776270 788541 802036 816885
61190 816885 832595 848168 862463 874299 882687 887471 889428 889451 887958 885330 882249 878958 874708 868710
61176 868710 861320 853515 845535 836881 827470 817795 807929 797363 786051 774685 763605 752253 740152
61163 740152 727725 715586 703569 691063 677974 664818 652168 640438 629966 620860 612889 605893
61151 605893 600103 595788 592837 591048 590606 591767 594102 596438 597575 596852 594123 589619 583934 577907 572305
61136 572305 567597 564011 561646 560503 560446 561209 562587 564764 568361 573851 580874 588479 596210 604679 614819
61121 614819 626909 640710 656274 674038 694033 715577 738018 761493 786541 813111 840359
$$ packed form
61217F35789Q046P324P035P067P440Q051Q363P949P122O463N849M643K797J172
61203G25110O14J152K221L281M105M889O086P867R756J1189J2271J3495J4849
61190H16885J5710J5573J4295J1836Q388M784J957K3j493k628l081l291m250n998
61176H68710p390p805p980q654r411r675r866j0566j1312j1366j1080j1352j2101
61163G40152j2427j2139j2017j2506j3089j3156j2650j1730j0472r106p971o996
61151F05893n790m315k951j789m42J161K335K336J137p23k729m504n685o027n602
61136E72305m708l586k365j143n7P63J378K177L597N490P023P605P731Q469J0140
61121F14819J2090J3801J5564J7764J9995K1544K2441K3475K5048K6570K7248
$$ plain form
61110 840359 867500 894471 921480 948082 973149 995850 1016396 1035568 1053698 1070269 1084365
61099 1084365 1095166 1102046 1104603 1102820 1097115 1088097 1076289 1062037 1045548 1026997 1006785 985655
61087 985655 964386 943321 922381 901550 881121 861466 842882 825769 810614 797510 785907
61076 785907 775205 765504 757506 751726 748084 746271 746142 747607 750426 754414 759735 766701 775295 785063
61062 785063 795558 806701 818627 831432 845215 860165 876357 893631 911977 931932 954125
61051 954125 978420 1003931 1030000 1056734 1084480 1113333 1143434 1175264 1209012 1243999 1279243
61040 1279243 1314447 1349887 1385562 1421063 1456248 1491414 1526681 1561643 1595704 1628422 1659596
61029 1659596 1689484 1718899 1748568 1778346 1807515 1835728 1863026 1889056 1913309 1936483 1960908
$$ packed form
61110H40359K7141K6971K7009K6602K5067K2701K0546J9172J8130J6571J4096
61099A084365J0801O880K557j783n705r018j1808j4252j6489j8551k0212k1130
61087I85655k1269k1065k0940k0831k0429j9655j8584j7113j5155j3104j1603
61076G85907j0702r701p998n780l642j813j29J465K819L988N321O966Q594R768
61062G85063J0495J1143J1926J2805J3783J4950J6192J7274J8346J9955K2193
61051I54125K4295K5511K6069K6734K7746K8853L0101L1830L3748L4987L5244
61040A279243L5204L5440L5675L5501L5185L5166L5267L4962L4061L2718L1174
61029A659596K9888K9415K9669K9778K9169K8213K7298K6030K4253K3174K4425
$$ plain form
61018 1960908 1989197 2023104 2063923 2113075 2171578 2239462 2316481 2403252 2501802 2616172 2753435
61007 2753435 2923621 3137946 3407688 3745069 4163771 4677709 5301631 6056376 6973839
60998 6973839 8095211 9464328 11119473 13073633 15270395 17534907 19577394 21088413
60990 21088413 21884066 21997946 21653284 21150616 20760494 20665661 20926866 21447137 21967931
60981 21967931 22148320 21711764 20569592 18839465 16762643 14592963 12523800 10667853
60973 10667853 9069215 7726119 6613303 5698282 4949170 4336696 3834994 3422625 3082581
60964 3082581 2801122 2566576 2368795 2199096 2050742 1919481 1803104 1699937 1607884 1525020
60954 1525020 1450527 1384515 1327140 1278165 1236905 1202004 1171428 1143129 1115689 1088205 1060068
$$ packed form
61018A960908K8289L3907M0819M9152N8503O7884P7019Q6771R8550J14370J37263
61007B753435J70186K14325K69742L37381M18702N13938O23922P54745R17463
60998F973839J121372J369117J655145J954160K196762K264512K042487J511019
60990B1088413P95653J13880l44662n02668l90122r4833K61205N20271N20794
60981B1967931J80389m36556j142172j730127k076822k169680k069163j855947
60973A0667853j598638j343096j112816r15021p49112o12474n01702m12369l40044
60964C082581k81459k34546j97781j69699j48354j31261j16377j03167r2053q2864
60954A525020p4493o6012n7375m8975m1260l4901l0576k8299k7440k7484k8137
$$ plain form
60943 1060068 1031352 1003074 976440 951831 928816 906849 885484 864191 842583 820843 799489
60932 799489 778847 759108 740628 723596 707626 692347 678261 666229 656096 646646 637135 628104
60920 628104 620353 613786 607731 601872 596415 591699 588076 585812 584681 583916 582881 581565 580301 579437 579484
60905 579484 580934 583492 586052 587930 589549 591291 592389 591963 590649 589953 590045 589478 587302 584242 581210
60890 581210 577719 572628 565867 558505 551403 544493 537260 529331 520656 511606 502860 494852 487355 479880
60876 479880 472320 464918 457831 451105 444911 439419 434576 430470 427749 427089 428150 429566 430183 430019 429960
60861 429960 430858 433098 436671 441373 446939 453049 459102 464152 467471 469339 470930 473296 476690 480857
60847 480857 485469 489986 493511 495345 495645 495208 494710 494378 494230 494210 494007 493031 490635 486319 479962 472232
$$ packed form
60943A060068k8716k8278k6634k4609k3015k1967k1365k1293k1608k1740k1354
60932G99489k0642j9739j8480j7032j5970j5279j4086j2032j0133r450r511r031
60920F28104p751o567o055n859n457m716l623k264j131p65j035j316j264q64M7
60905E79484J450K558K560J878J619J742J098m26j314o96R2n67k176l060l032
60890E81210l491n091o761p362p102o910p233p929q675r050q746q008p497p475
60876D79880p560p402p087o726o194n492m843m106k721o60J061J416O17j64n9
60861D29960Q98K240L573M702N566O110O053N050L319J868J591K366L394M167
60847D80857M612M517L525J834L00m37m98l32j48k0k03r76k396m316o357p730
$$ plain form
60831 472232 464645 458636 454367 450738 446755 442562 438975 436423 434746 433761 433427 433408 432963 431493 428962
60816 428962 425549 421151 415614 409343 403324 398295 394054 389782 385023 380175 375979 372689 369873 366888
60802 366888 363420 359620 356020 353359 352166 352291 352983 353590 354024 354389 354480 354081 353564 353623 354319 354920 354923 354788
60784 354788 355350 356871 358975 361187 363101 364305 364709 364896 365698 367368 369498 371616 373520 375097 376298
60769 376298 377334 378461 379605 380637 381999 384415 387710 390492 391428 390493 388683 386894 385455 384410 383660
60754 383660 382872 381634 379758 377278 374302 371051 367899 365152 363012 361903 362491 364943 368306 371051 372188
60739 372188 371659 369805 366826 362764 357722 352146 346959 343120 340717 338689 335894 332322 328888 326255
60725 326255 324393 323163 322666 322864 323413 324117 325157 326613 328099 329149 329707 330040 330354 330747 331376 332497
$$ packed form
60831D72232p587o009m269l629l983m193l587k552j677r85l34j9m45j470k531
60816D28962l413m398n537o271o019n029m241m272m759m848m196l290k816k985
60802C66888l468l800l600k661j193J25O92O07M34L65R1l99n17N9O96O01Lj35
60784C54788N62J521K104K212J914J204M04J87Q02J670K130K118J904J577J201
60769C76298J036J127J144J032J362K416L295K782R36r35j810j789j439j045p50
60754C83660p88j238j876k480k976l251l152k747k140j109N88K452L363K745J137
60739C72188n29j854k979m062n042n576n187l839k403k028k795l572l434k633
60725C26255j862j230m97J98N49P04J040J456J486J050N58L33L14L93O29J121
$$ plain form
60709 332497 334334 336929 340029 343164 346023 348714 351390 353730 355177 355776 356403 357968 360606 363722 366552
60694 366552 368566 369633 369986 369898 369388 368476 367669 367659 368397 368962 368660 367851 367262 366872 366071 364814 364010 364626
60676 364626 366751 369711 372842 375908 378880 381606 383853 385581 386930 387761 387436 385360 381759 377583 373586
60661 373586 369810 366079 362664 360095 358534 357528 356363 354552 352257 350400 350080 351560 353959 356279
60647 356279 358569 361719 366096 370818 374501 376511 377261 377437 377205 376200 374111 371064 367438 363546 359708
60632 359708 356457 354311 353252 352756 352437 352418 352970 354023 355304 356726 358349 360051 361461 362242 362334 361997
60616 361997 361683 361649 361563 360783 359283 358128 358585 360757 363408 365151 365593 365296 365008 365140 365779 366806 367913
60599 367913 368638 368639 367985 367097 366354 365838 365602 366001 367475 369992 372995 375961 378726 381186 383053 384166 384731
$$ packed form
60709C32497J837K595L100L135K859K691K676K340J447N99O27J565K638L116K830
60694C66552K014J067L53q8n10r12q07j0P38N65l02q09n89l90q01j257q04O16
60676C64626K125K960L131L066K972K726K247J728J349Q31l25k076l601m176l997
60661C73586l776l731l415k569j561j006j165j811k295j857l20J480K399K320
60647C56279K290L150M377M722L683K010P50J76k32j005k089l047l626l892l838
60632C59708l251k146j059m96l19j9N52J053J281J422J623J702J410P81R2l37
60616C61997l14l4q6p80j500j155M57K172K651J743M42k97k88J32O39J027J107
60599C67913P25Jo54q88p43n16k36L99J474K517L003K966K765K460J867J113N65
$$ plain form
60582 384731 384933 384559 383398 381896 380973 381202 382467 384438 387010 390241 394181 398902 404499 410941 418150
60567 418150 426322 435914 447112 459481 472288 484994 497192 508217 517217 523643 527330 527955 524831
60554 524831 517764 508037 497994 489391 482425 476519 471593 468134 466378 466187 467706 471519 477942 486663
60540 486663 497300 509809 524053 539501 555905 573913 594337 616807 639609 660874 679505
60529 679505 694898 706247 712591 713514 709635 702299 692780 681813 669916 657959 647012 637475 628693
60516 628693 619740 610465 601575 593952 588180 584545 582989 582951 583585 584376 585598 588202 593329 601708 613380
60501 613380 628105 646174 668617 696384 729552 767580 810033 856549 906259 957863 1010389
60490 1010389 1063320 1115711 1165532 1210190 1247540 1276272 1295650 1305184 1304380 1292582 1269276 1234799
$$ packed form
60582C84731K02l74j161j502r23K29J265J971K572L231L940M721N597O442P209
60567D18150Q172R592J1198J2369J2807J2706J2198J1025R000O426L687O25l124
60554E24831p067r727j0043q603o966n906m926l459j756j91J519L813O423Q721
60540D86663J0637J2509J4244J5448J6404J8008K0424K2470K2802K1265J8631
60529F79505J5393J1349O344R23l879p336r519j0967j1897j1957j0947r537q782
60516F28693q953r275q890p623n772l635j556l8O34P91J222K604N127Q379J1672
60501F13380J4725J8069K2443K7767L3168L8028M2453M6516M9710N1604N2526
60490A010389N2931N2391M9821M4658L7350K8732J9378R534q04j1798k3306l4477
$$ plain form
60478 1234799 1190745 1139411 1082883 1022858 961225 900402 842778 789893 742314 700159 663422
60467 663422 631746 604271 580140 559146 541551 527249 515373 504792 494776 485052 475640 466917
60455 466917 459601 454170 450245 446822 443190 439461 436172 433550 431255 428749 425829 422739 419811 417110
60441 417110 414628 412709 411912 412303 413166 413610 413238 412034 409965 407116 404083 401740 400480 399888 399196 397950
60425 397950 396297 394806 394031 394106 394800 395897 397282 398635 399500 399949 400789 402669 405211 407479 409069 410220
60409 410220 411046 411354 411274 411440 412302 413645 414976 416068 417030 418238 420276 423518 427517 431179 433855 436037
60393 436037 438732 442358 446472 450324 453377 455464 456803 457941 459465 461621 464200 466741 468919 470872
60379 470872 473173 476367 480481 485021 489443 493489 497148 500457 503467 506252 508866 511237 513130 514285
$$ packed form
60478A234799m4054n1334n6528o0025o1633o0823n7624n2885m7579m2155l6737
60467F63422l1676k7475k4131k0994j7595j4302j1876j0581j0016r724r412q723
60455D66917p316n431l925l423l632l729l289k622k295k506k920l090k928k701
60441D17110k482j919p97L91Q63M44l72j204k069k849l033k343j260n92o92j246
60425C97950j653j491p75P5O94J097J385J353Q65M49Q40J880K542K268J590J151
60409D10220Q26L08q0J66Q62J343J331J092R62J208K038L242L999L662K676K182
60393D36037K695L626M114L852L053K087J339J138J524K156K579K541K178J953
60379D70872K301L194M114M540M422M046L659L309L010K785K614K371J893J155
$$ plain form
60365 514285 514729 514939 515452 516312 517216 518284 520217 523421 527441 531754 536711 543056 550785 559287 568600
60350 568600 579641 592919 607568 621935 634601 644583 651115 653836 652993 649129 642687 634086 623904
60337 623904 612751 601152 589762 579414 570668 563412 557119 551417 546332 542038 538436 534893 530477
60324 530477 524708 518052 511485 505710 501118 498239 497482 498363 499731 501116 503328 507435 513713 522016 532586
60309 532586 545788 561335 578381 596267 614618 632899 650487 667213 683277 698379 711273
60298 711273 720406 724855 724560 719781 710501 696408 677582 655199 631453 608623 588242 570969 556834
60285 556834 545398 536030 528427 522781 519253 517424 516442 515523 514053 511536 507848 503502 499297 495651
60271 495651 492445 489369 486171 482651 478791 474859 471134 467490 463578 459476 455885 453518 452411 451953
$$ packed form
60365E14285M44K10N13Q60R04J068J933L204M020M313M957O345P729Q502R313
60350E68600J1041J3278J4649J4367J2666R982O532K721q43l864o442q601j0182
60337F23904j1153j1599j1390j0348q746p256o293n702n085m294l602l543m416
60324E30477n769o656o567n775m592k879p57Q81J368J385K212M107O278Q303J0570
60309E32586J3202J5547J7046J7886J8351J8281J7588J6726J6064J5102J2894
60298G11273R133M449k95m779r280j4093j8826k2383k3746k2830k0381j7273j4135
60285E56834j1436r368p603n646l528j829r82r19j470k517l688m346m205l646
60271D95651l206l076l198l520l860l932l725l644l912m102l591k367j107m58
$$ plain form
60257 451953 451453 450586 449436 448265 447299 446656 446389 446585 447451 449272 452137 455585 458716 460867 462169 463195
60241 463195 464132 464618 464452 464101 464290 465249 466505 467240 466856 465438 463870 463258 464007 465577 467229 468826 470768
60224 470768 473343 476340 479207 481520 483489 485983 489796 494822 500267 505727 511627 518405 525795 533296
60210 533296 540914 548921 557116 564941 572309 579785 587832 596203 604251 611646 618688 625996 633877 641942
60196 641942 649407 655839 661422 666436 670761 674105 676474 678019 678579 677746 675434 672061 668096 663602 658290
60181 658290 651950 644787 637350 630119 623208 616559 610300 604591 599203 593748 588498 584437 582055 580426
60167 580426 578031 574395 570473 567449 565530 564003 562170 560071 558357 557517 557311 557130 556799 556733 557218 558000
60151 558000 558782 559706 561000 562458 563632 564275 564303 563638 562410 561062 559920 559021 558689 559789 562864 567435
$$ packed form
60257D51953n00q67j150j171r66o43k67J96Q66J821K865L448L131K151J302J026
60241D63195R37M86j66l51J89R59J256P35l84j418j568o12P49J570J652J597J942
60224D70768K575K997K867K313J969K494L813N026N445N460N900O778P390P501
60210E33296P618Q007Q195P825P368P476Q047Q371Q048P395P042P308P881Q065
60196F41942P465O432N583N014M325L344K369J545N60q33k312l373l965m494n312
60181F58290o340p163p437p231o911o649o259n709n388n455n250m061k382j629
60167E80426k395l636l922l024j919j527j833k099j714q40k06j81l31o6M85P82
60151E58000P82R24J294J458J174O43K8o65j228j348j142q99l32J100L075M571
$$ plain form
60135 567435 572846 579394 587726 597285 606385 614027 620771 627480 633963 639328 643180 645922 648134 650098
60121 650098 651808 653213 654487 656171 658802 662299 665952 669168 672029 674968 678093 681033 683379 685125
60107 685125 686628 688074 689021 688680 686782 683931 680881 677707 673999 669574 664605 659270 653800 648733 644598
60092 644598 641420 639030 637680 637680 638454 638773 638092 636954 635902 634798 633546 632665 632464 632247 631071 628926
60076 628926 626488 623956 620911 617166 613035 608622 603487 597250 590122 582573 574818 566965 559402 552677
60062 552677 546929 541710 536460 531063 525864 521219 517230 513905 511318 509431 507950 506566 505264 504251
60048 504251 503710 503924 505447 508727 513465 518742 523898 529017 534472 540334 546342 552083 557102 561146 564539
60033 564539 567978 571741 575330 578134 580080 581311 581543 580251 577312 573028 567585 560971 553424 545455
$$ packed form
60135E67435N411O548Q332R559R100P642O744O709O483N365L852K742K212J964
60121F50098J710J405J274J684K631L497L653L216K861K939L125K940K346J746
60107F85125J503J446R47l41j898k851l050l174l708m425m969n335n470n067m135
60092F44598l178k390j350%P74L19o81j138j052j104j252q81k01k17j176k145
60076F28926k438k532l045l745m131m413n135o237p128p549p755p853p563o725
60062E52677n748n219n250n397n199m645l989l325k587j887j481j384j302j013
60048E04251n41K14J523L280M738N277N156N119N455N862O008N741N019M044L393
60033E64539L439L763L589K804J946J231K32j292k939m284n443o614p547p969
$$ plain form
60019 545455 537258 528473 518853 508889 499441 490870 482881 475240 468316 462725 458631 455560 452772 449590
60005 449590 445566 440787 436166 432991 431783 431702 431350 430070 428262 426697 425920 426213 427557 429525 431625
59990 431625 433961 437178 441548 446426 450906 454744 458324 461946 465557 469115 472742 476295 479044 480051
59976 480051 478994 476599 474123 472271 470603 468144 464558 460525 456961 454168 451991 450493 449996 450467 451335
59961 451335 452131 453009 454344 456060 457773 459535 461837 464665 467079 468242 468591 469320 470735 471866 471935 471512
59945 471512 471660 472480 473205 473425 473392 473112 471992 469739 467022 464769 463153 461715 460276 459254 459062 459558
59929 459558 460297 461209 462844 465873 470389 475792 481383 486903 492368 497571 502019 505299 507249 507770 506786
59914 506786 504516 501644 499063 497481 497204 498085 499624 501286 502857 504531 506673 509527 512989 516525 519439
$$ packed form
60019E45455q197q785r620r964r448q571p989p641o924n591m094l071k788l182
60005D49590m024m779m621l175j208q1l52j280j808j565p77K93J344J968K100
59990D31625K336L217M370M878M480L838L580L622L611L558L627L553K749J007
59976D80051j057k395k476j852j668k459l586m033l564k793k177j498m97M71Q68
59961D51335P96Q78J335J716J713J762K302K828K414J163L49P29J415J131O9m23
59945D71512J48Q20P25K20l3k80j120k253k717k253j616j438j439j022j92M96
59929D59558P39R12J635L029M516N403N591N520N465N203M448L280J950N21r84
59914E06786k270k872k581j582k77Q81J539J662J571J674K142K854L462L536K914
$$ plain form
59899 519439 521422 522771 523912 524826 525225 525212 525414 526365 528071 530361 533423 537771 543666 550735 558249 565684
59883 565684 572822 579305 584531 588438 592211 597558 605085 613876 622801 631523 639910 647259 652891 656979
59869 656979 659930 661284 660226 657013 652948 648890 644677 640130 635690 631797 628385 625369 622885 620687
59855 620687 617996 614461 610727 607603 605214 603481 602866 604008 607021 611735 618248 626389 634817 641453
59841 641453 645057 645880 644739 642050 638208 634479 632777 634264 638325 643129 647051 649355 649740 647938 644189
59826 644189 639669 635780 633039 631039 629353 627937 626677 625130 622823 619405 614493 607917 600291 592875
59812 592875 586636 581706 577722 574240 570806 567235 563937 561431 559424 557017 553969 551078 548991 547272
59798 547272 545072 542105 538543 534560 530578 527478 525859 525243 524457 522691 519961 516885 514300 512756 511971
$$ packed form
59899E19439J983J349J141R14L99j3K02R51J706K290L062M348N895P069P514P435
59883E65684P138O483N226L907L773N347P527Q791Q925Q722Q387P349N632M088
59869F56979K951J354j058l213m065m058m213m547m440l893l412l016k484k198
59855F20687k691l535l734l124k389j733o15J142L013M714O513Q141Q428O636
59841F41453L604Q23j141k689l842l729j702J487M061M804L922K304L85j802l749
59826F44189m520l889k741k000j686j416j260j547k307l418m912o576p626p416
59812E92875o239m930l984l482l434l571l298k506k007k407l048k891k087j719
59798E47272k200k967l562l983l982l100j619o16p86j766k730l076k585j544p85
$$ plain form
59783 511971 511054 509473 507567 506014 505274 505672 507277 509380 510842 511461 512347 514363 516960 519258 521610
59768 521610 525086 529812 534796 539159 542710 545554 548049 550956 554735 558765 562143 565164 569097 574445
59754 574445 580402 586246 592292 599047 606193 613037 619497 626083 633127 640399 647367 653609 659105 664186
59740 664186 669071 673540 677341 680756 684213 687409 689415 689894 689659 689711 690172 690542 690648 690817 691246 691701 691946
59723 691946 692170 692781 693903 695268 696586 697855 699151 700237 700558 699636 697346 693967 690188 686954 684764
59708 684764 683056 680754 677612 674578 672635 671750 671241 670687 670065 669503 669432 670587 673283 676941 680851 685069
59692 685069 690033 695505 700503 704062 705590 704770 701803 697606 693149 688709 684303 680527 678145 676851
59678 676851 675301 672455 668276 663025 656608 648882 640152 631199 623105 616880 612602 608978 604520 599211
$$ packed form
59783E11971r17j581j906j553p40L98J605K103J462O19Q86K016K597K298K352
59768E21610L476M726M984M363L551K844K495K907L779M030L378L021L933N348
59754E74445N957N844O046O755P146O844O460O586P044P272O968O242N496N081
59740F64186M885M469L801L415L457L196K006M79k35N2M61L70J06J69M29M55K45
59723F91946K24O11J122J365J318J269J296J086L21r22k290l379l779l234k190
59708F84764j708k302l142l034j943q85n09n54o22n62p1J155K696L658L910M218
59692F85069M964N472M998L559J528q20k967m197m457m440m406l776k382j294
59678F76851j550k846m179n251o417p726q730q953q094o225m278l624m458n309
$$ plain form
59664 599211 594369 590856 588291 586175 584799 584515 584948 585620 586753 588759 591353 593932 596567 599903 604125
59649 604125 608599 612604 615949 618779 621112 622754 623417 622737 620246 615538 608696 600575 592420 584960 577998
59634 577998 571126 564686 559617 556418 554682 553701 553059 552473 551522 549895 547655 544995 541864 538031 533439
59619 533439 528379 523394 518978 515175 511481 507415 503195 499525 496643 493978 491019 488270 486993 488036
59605 488036 491046 494778 498089 500640 502716 504533 505925 506786 507479 508452 509668 510822 511999 513606 515598
59590 515598 517307 518279 518945 520163 522220 524483 525961 526112 525183 523806 522263 520285 517672 514884 512673
59575 512673 511224 509972 508267 505904 503066 500107 497470 495511 494225 493300 492446 491551 490602 489656 488837 488168
59559 488168 487457 486540 485523 484569 483658 482805 482317 482435 482905 483300 483707 484658 486462 488974 491949 495161 498249
$$ packed form
59664E99211m842l513k565k116j376k84M33O72J133K006K594K579K635L336M222
59649F04125M474M005L345K830K333J642O63o80k491m708o842q121q155p460o962
59634E77998o872o440n069l199j736r81o42n86r51j627k240k660l131l833m592
59619E33439n060m985m416l803l694m066m220l670k882k665k959k749j277J043
59605D88036L010L732L311K551K076J817J392Q61O93R73J216J154J177J607J992
59590E15598J709R72O66J218K057K263J478J51r29j377j543j978k613k788k211
59575E12673j449j252j705k363k838k959k637j959j286r25q54q95r49r46q19o69
59559D88168p11r17j017r54r11q53m88J18M70L95M07R51J804K512K975L212L088
$$ plain form
59542 498249 500968 503803 507966 514615 524221 536762 552322 571299 593621 617232 637391 648596
59530 648596 648350 639151 626381 614422 604960 598071 593595 591356 591079 592521 595298 598601 601588 604012
59516 604012 605959 607085 606721 604594 600836 595500 588770 581408 574150 566846 559080 551396 544762 538932
59502 538932 532681 525826 519648 514875 510639 506127 502035 499440 498203 497529 497338 498042 499476 501094 502902
59487 502902 505287 508135 510950 513736 517073 521267 525931 530449 534601 538747 543578 549417 555758 561839
59473 561839 567722 574151 581158 587528 592061 594762 596293 596861 596320 594870 592999 590992 589081 587813 587791
59458 587791 589192 591892 595759 600531 605811 611520 617984 625313 633162 641379 650202 659396 667946 675191
59444 675191 681517 687151 690976 691517 688610 683076 675258 665142 653801 643361 635150 628729 623055 617784
$$ packed form
59542D98249K719K835M163O649R606J2541J5560J8977K2322K3611K0159J1205
59530F48596k46r199j2770j1959r462o889m476k239k77J442K777L303K987K424
59516F04012J947J126l64k127l758n336o730p362p258p304p766p684o634n830
59502E38932o251o855o178m773m236m512m092k595j237o74j91P04J434J618J808
59487E02902K385K848K815K786L337M194M664M518M152M146M831N839O341O081
59473E61839N883O429P007O370M533K701J531N68n41j450j871k007j911j268k2
59458E87791J401K700L867M772N280N709O464P329P849Q217Q823R194Q550P245
59444F75191O326N634L825N41k907n534p818j0116j1341j0440q211o421n674n271
$$ plain form
59430 617784 613070 608816 604798 601168 598299 596323 595239 595456 597851 603143 611331 621886 634425 649039
59416 649039 665986 685352 707158 731492 758317 787437 818830 852117 884671 910725 924003
59405 924003 922024 907467 885522 861014 838043 820415 810833 810082 817575 831745 848908 862743
59393 862743 866708 857636 836978 809254 779846 753255 731748 715208 702626 693499 687489 683619
59381 683619 680831 678957 678248 678298 678411 678625 679394 680530 681489 682493 684225 686463 688147 688896 689465 690548
59365 690548 691982 693333 694419 695060 695085 694861 695186 696444 698407 700908 704147 708341 713764 721112 731007
59350 731007 743025 755995 769414 783795 799478 815955 832733 850036 868093 886261 903319
59339 903319 918350 931021 941421 949891 956649 961259 962750 960537 954985 946904 936708 924264 909462
$$ packed form
59430F17784m714m254m018l630k869j976j084K17K395N292Q188J0555J2539J4614
59416F49039J6947J9366K1806K4334K6825K9120L1393L3287L2554K6054J3278
59405I24003j979j4557k1945k4508k2971j7628r582p51P493J4170J7163J3835
59393H62743L965r072k0658k7724k9408k6591k1507j6540j2582r127o010l870
59381F83619k788j874p09N0J13K14P69J136R59J004J732K238J684P49N69J083
59365F90548J434J351J086O41K5k24L25J258J963K501L239M194N423P348R895
59350G31007J2018J2970J3419J4381J5683J6477J6778J7303J8057J8168J7058
59339I03319J5031J2671J0400Q470O758M610J491k213n552q081j0196j2444j4802
$$ plain form
59326 909462 892870 875832 859640 844431 829247 813538 798163 784367 772193 760645 749099
59315 749099 737671 726407 715191 704479 695066 686854 678822 670627 663327 657994 654310 651199 648343
59302 648343 646486 646604 649353 655103 663995 675900 690266 705592 718862 726124 724466 713759 696571
59289 696571 676543 656784 639164 624457 612787 603948 597568 593361 591388 591779 594010 596908 599763
59276 599763 603089 607875 614521 622983 633427 645837 659391 673225 687660 703608 720773 737514
59264 737514 752628 766188 778251 787807 793724 796060 795772 793609 789722 783973 776238 766732 756303
59251 756303 746029 736430 727535 719745 713862 710037 707419 705272 703820 703644 704830 707165 710583 714951
59237 714951 719895 725229 731119 737448 743553 748993 753968 758536 761988 763604 763528 762242 759545 754758 747709
$$ packed form
59326I09462j6592j7038j6192j5209j5184j5709j5375j3796j2174j1548j1546
59315G49099j1428j1264j1216j0712r413q212q032q195p300n333l684l111k856
59302F48343j857J18K749N750Q892J1905J4366J5326J3270P262j658j0707j7188
59289F96571k0028j9759j7620j4707j1670q839o380m207j973L91K231K898K855
59276E99763L326M786O646Q462J0444J2410J3554J3834J4435J5948J7165J6741
59264G37514J5114J3560J2063R556N917K336k88k163l887n749p735r506j0429
59251G56303j0274r599q895p790n883l825k618k147j452j76J186K335L418M368
59237G14951M944N334N890O329O105N440M975M568L452J616p6j286k697m787p049
$$ plain form
59222 747709 738968 729290 719319 709565 700120 690461 680055 669186 658853 649914 642494 636050 629780
59209 629780 623202 616622 610831 606192 602309 598743 595626 593231 591397 589832 588665 588232 588603 589746 591868
59194 591868 595035 598654 601902 604654 607536 611092 615242 619557 623682 627510 631263 635421 640305 645711
59180 645711 651160 656409 661570 666776 671977 676927 681217 684474 686817 688963 691518 694213 696185 697061
59166 697061 697443 698210 699649 701481 703484 705674 707808 709166 709158 708000 706278 703812 699475 692449 683293
59151 683293 673354 663451 653577 643592 633562 623524 613571 604166 595795 588229 580729 573088 565958 560010
59137 560010 555307 551613 548630 545681 541800 536670 531114 526352 523063 521380 521229 522190 523422 524319 525122
59122 525122 526540 528974 532390 536746 542150 548711 556501 565520 575505 585950 596522 607263 618161
$$ packed form
59222G47709q741r678r971r754r445r659j0406j0869j0333q939p420o444o270
59209F29780o578o580n791m639l883l566l117k395j834j565j167m33L71J143K122
59194E91868L167L619L248K752K882L556M150M315M125L828L753M158M884N406
59180F45711N449N249N161N206N201M950M290L257K343K146K555K695J972Q76
59166F97061L82P67J439J832K003K190K134J358qj158j722k466m337p026r156
59151F83293r939r903r874r985j0030j0038r953r405q371p566p500p641p130n948
59137E60010m703l694k983k949l881n130n556m762l289j683j51R61J232Q97Q03
59122E25122J418K434L416M356N404O561P790R019R985J0445J0572J0741J0898
$$ plain form
59109 618161 628721 638213 646233 652804 658090 662262 665623 668661 671854 675308 678454 680280 680154 678408
59095 678408 675865 672905 669393 665446 661688 658578 655983 653680 651854 650765 650197 649599 648619 647313 645884
59080 645884 644322 642204 638838 633812 627415 620406 613442 606917 601066 595817 590727 585581 580925 577434
59066 577434 574783 571780 567687 562871 558144 554064 550964 548949 547629 546367 545037 544026 543439 542854 542028
59051 542028 541174 540369 539331 538059 537067 536644 536432 535997 535279 534233 532712 531025 530010 530119 530885 531602 532005
59034 532005 532038 531597 530825 530159 529760 529506 529793 531581 535282 540311 546196 553343 562168 572253 583058 594782
59018 594782 607792 621680 635558 648757 660611 670180 676997 681559 684239 684195 680349 673256 665045
59005 665045 657513 651009 645174 640067 636360 634805 635589 638048 641197 644733 649221 655049 661662 668133
$$ packed form
59109F18161J0560R492Q020O571N286M172L361L038L193L454L146J826j26j746
59095F78408k543k960l512l947l758l110k595k303j826j089n68n98r80j306j429
59080F45884j562k118l366n026o397p009o964o525n851n249n090n146m656l491
59066E77434k651l003m093m816m727m080l100k015j320j262j330j011n87n85q26
59051E42028q54q05j038j272r92m23k12m35p18j046j521j687j015J09P66P17M03
59034E32005L3m41p72o66l99k54K87J788L701N029N885P147Q825J0085J0805J1724
59018E94782J3010J3888J3878J3199J1854R569O817M562K680m4l846p093q211
59005F65045p532o504n835n107l707j555P84K459L149L536M488N828O613O471
$$ plain form
58991 668133 673952 678842 682379 684462 685755 687003 688180 688809 688772 688290 687492 686598 686153 686502 687460 689040
58975 689040 691987 696877 703176 710127 718166 728425 741027 754881 769157 783953 799319 814513
58963 814513 828660 841609 853785 865474 876351 885466 891754 894883 895538 894480 891484 885659 876601
58950 876601 864682 850343 833781 815473 796433 777706 759892 743291 728176 714795 703257
58939 703257 693507 685309 678372 672653 668395 665668 664013 662760 661634 660964 661395 663376 666559 669622 671110
58924 671110 670658 669071 667162 665034 662647 660332 658323 656336 654131 652030 650419 649200 648202 647653 647763
58909 647763 648279 649019 650436 653123 657142 662364 669088 677715 688174 700176 713683 728547 744008
58896 744008 759091 773275 786411 798413 809555 820676 832573 845461 859446 874957 892201
$$ packed form
58991F68133N819M890L537K083J293J248J177O29l7m82p98q94m45L49R58J580
58975F89040K947M890O299O951Q039J0259J2602J3854J4276J4796J5366J5194
58963H14513J4147J2949J2176J1689J0877R115O288L129O55j058k996n825r058
58950H76601j1919j4339j6562j8308j9040j8727j7814j6601j5115j3381j1538
58939G03257r750q198o937n719m258k727j655j253j126o70M31J981L183L063J488
58924F71110m52j587j909k128k387k315k009j987k205k101j611j219r98n49J10
58909F47763N16P40J417K687M019N222O724Q627J0459J2002J3507J4864J5461
58896G44008J5083J4184J3136J2002J1142J1121J1897J2888J3985J5511J7244
$$ plain form
58885 892201 910682 929860 949745 970144 989781 1006918 1020561 1030525 1036743 1039310 1038880 1036307 1032006
58872 1032006 1026051 1018505 1009257 998129 985731 973634 963047 953869 945591 938337 932198 926334 919819
58859 919819 912812 905804 898206 888829 877398 864545 850690 836066 821535 808116 795836 784075
58847 784075 772948 763218 754954 747353 739924 732822 725933 718559 710194 700882 690809 680242 669782
58834 669782 660015 650979 642559 635138 629147 624344 620291 617135 615032 613318 611367 609918 610353 612812
58820 612812 616178 619709 623563 627815 632239 637017 642521 648322 653449 657638 661244 664016 665236 665144 664890
58805 664890 664827 664020 661766 658475 654710 650342 645117 639174 632686 625756 618904 612758 607015 600569 593011
58790 593011 585221 578270 572475 567816 564484 562644 562174 562931 564811 567504 570660 574230 578146 581955 585414
$$ packed form
58885H92201J8481J9178J9885K0399J9637J7137J3643R964O218K567m30k573m301
58872A032006n955p546r248j1128j2398j2097j0587r178q278p254o139n864o515
58859I19819p007p008p598r377j1431j2853j3855j4624j4531j3419j2280j1761
58847G84075j1127r730q264p601p429p102o889p374q365r312j0073j0567j0460
58834F69782r767r036q420p421n991m803m053l156k103j714j951j449M35K459
58820F12812L366L531L854M252M424M778N504N801N127M189L606K772J220r2k54
58805F64890o3q07k254l291l765m368n225n943o488o930o852o146n743o446p558
58790E93011p790o951n795m659l332j840m70P57J880K693L156L570L916L809L459
$$ plain form
58775 585414 589161 593901 599120 603447 606153 607352 606924 604260 599150 592124 583988 575685 568327 562400
58761 562400 557165 551683 546120 541167 536793 532786 529990 529538 531137 533486 536105 539258 542378 544371
58747 544371 545422 546806 548799 550479 551777 553975 557754 562356 567091 572167 577564 582601 587136 591871
58733 591871 597058 602190 607278 612969 619108 624699 629653 635012 641050 646791 651976 657748 664695 671811
58719 671811 678252 684623 691732 699515 708027 718031 729636 741673 753266 764726 776035 785812 792671
58706 792671 796350 796707 793080 785654 776100 765635 753564 738704 721114 701469 680048 657463 635238
58693 635238 614462 594874 576261 559604 545728 533956 523320 514121 507032 501573 496602 491574
58681 491574 486292 480303 473669 467570 463037 459729 456795 454172 452233 451023 450609 451257 452569 453564 454473
$$ packed form
58775E85414L747M740N219M327K706J199m28k664n110p026q136q303p358n927
58761E62400n235n482n563m953m374m007k796m52J599K349K619L153L120J993
58747E44371J051J384J993J680J298K198L779M602M735N076N397N037M535M735
58733E91871N187N132N088N691O139N591M954N359O038N741N185N772O947P116
58719F71811O441O371P109P783Q512J0004J1605J2037J1593J1460J1309R777O859
58706G92671L679L57l627p426r554j0465j2071j4860j7590j9645k1421k2585k2225
58693F35238k0776j9588j8613j6657j3876j1772j0636r199p089n459m971n028
58681D91574n282n989o634o099m533l308k934k623j939j210m14O48J312R95R09
$$ plain form
58666 454473 457196 463000 470971 479789 489716 501507 514512 527245 538778 548165 553572 553688 549479
58653 549479 543187 536179 528855 521795 515516 509665 503788 498427 494297 490955 487392 483379 479255 475108
58639 475108 471249 468693 467968 468158 468290 468885 470947 474170 477488 480691 484067 487027 488551 488624 488020 487026
58623 487026 485539 483989 482969 482373 481931 482125 483525 485756 488188 491111 495155 500080 505267 510803 516940
58608 516940 523013 528024 531810 534626 536224 536580 536852 538320 540735 542878 544275 545185 545362 544128 541434
58593 541434 537838 533724 529499 526145 524586 524803 526316 529069 533134 538229 544367 552320 562571 574448
58579 574448 586941 599511 611450 621661 630052 637977 646221 653763 659760 665405 672457 681175 691273
58566 691273 703612 719145 737206 756732 778316 803256 831377 861496 893089 925527 956568
$$ packed form
58666D54473K723N804P971Q818R927J1791J3005J2733J1533R387N407J16m209
58653E49479o292p008p324p060o279n851n877n361m130l342l563m013m124m147
58639D75108l859k556p25J90J32N95K062L223L318L203L376K960J524P3o04r94
58623D87026j487j550j020n96m42J94J400K231K432K923M044M925N187N536O137
58608E16940O073N011L786K816J598L56K72J468K415K143J397R10J77j234k694
58593E41434l596m114m225l354j559K17J513K753M065N095O138P953J0251J1877
58579E74448J2493J2570J1939J0211Q391P925Q244P542N997N645P052Q718J0098
58566F91273J2339J5533J8061J9526K1584K4940K8121L0119L1593L2438L1041
$$ plain form
58555 956568 983690 1006348 1024941 1038369 1044881 1044807 1040167 1031950 1020208 1006631 994449 985283 978035
58542 978035 971213 964457 957399 948793 937440 922741 904208 881810 856911 831497 806328 781129
58530 781129 756548 734449 716067 701113 688804 678635 670147 663053 657526 653398 649474 644723 639688
58517 639688 635474 631899 628081 624293 621561 619740 617689 615182 613057 611557 610001 608011 605745 603131
58503 603131 600162 597655 596391 595892 595252 594597 594358 593964 592912 592378 593770 596324 598125 599033 600474 602832
58487 602832 605311 608131 612491 618269 624071 629769 637004 646901 659156 673502 690123 708393 727051
58474 727051 745835 765127 783784 799180 809757 815894 818078 815932 809395 799328 786731 772725
58462 772725 759190 747814 738558 730578 724457 721765 722762 726469 732899 743126 757079 773098 789791
$$ packed form
58555I56568K7122K2658J8593J3428O512p4m640q217j1742j3577j2182r166p248
58542I78035o822o756p058q606j1353j4699j8533k2398k4899k5414k5169k5199
58530G81129k4581k2099j8382j4954j2309j0169q488p094n527m128l924m751n035
58517F39688m214l575l818l788k732j821k051k507k125j500j556j990k266k614
58503F03131k969k507j264m99o40o55k39l94j052n34J392K554J801R08J441K358
58487F02832K479K820M360N778N802N698P235R897J2255J4346J6621J8270J8658
58474G27051J8784J9292J8657J5396J0577O137K184k146o537j0067j2597j4006
58462G72725j3535j1376r256p980o121k692R97L707O430J0227J3953J6019J6693
$$ plain form
58449 789791 806485 821926 834393 843086 847688 846961 839933 828221 814820 800649 784652 767263
58437 767263 751136 738042 727481 718823 712488 708413 705665 704263 705368 708964 713330 717413 721973
58424 721973 727879 735062 743505 753408 763944 773572 781723 788426 792309 791263 785372 777113 768323 759014
58410 759014 749331 740313 732150 723772 714737 705803 697435 689581 682905 678151 674337 669887 665467 663288
58396 663288 663608 664599 665748 668481 672988 677326 680449 683488 687231 690791 693548 696082 698478 699979 700909
58381 700909 702707 705586 708431 711287 715504 721065 726321 730737 735291 739902 743275 745742 749458 755230
58367 755230 761870 768947 777265 786288 794367 802107 812245 825405 839164 852116 865615 880514 895354
58354 895354 908856 921206 931926 939461 943796 946537 947782 946098 942229 939388 939086 940077 942013 946335
$$ packed form
58449G89791J6694J5441J2467Q693M602p27p028j1712j3401j4171j5997j7389
58437G67263j6127j3094j0561q658o335m075k748j402J105L596M366M083M560
58424G21973N906P183Q443R903J0536R628Q151O703L883j046n891q259q790r309
58410G59014r683r018q163q378r035q934q368p854o676m754l814m450m420k179
58396F63288L20R91J149K733M507M338L123L039L743L560K757K534K396J501R30
58381G00909J798K879K845K856M217N561N256M416M554M611L373K467L716N772
58367G55230O640P077Q318R023Q079P740J0138J3160J3759J2952J3499J4899J4840
58354H95354J3502J2350J0720P535M335K741J245j684l869k841l02R91J936M322
$$ plain form
58340 946335 952715 958682 963947 971159 981127 991389 1000917 1012098 1026373 1041991 1057782 1075071 1093904
58327 1093904 1111427 1126115 1139672 1152771 1162934 1168790 1172419 1175271 1175857 1173890 1172561 1173939 1175960
58314 1175960 1176636 1177552 1180544 1184695 1189343 1196331 1206454 1217219 1226827 1236853 1248442 1259674 1269427
58301 1269427 1280077 1293486 1307886 1321437 1335229 1350184 1364833 1378756 1394266 1411998 1428987
58290 1428987 1443889 1459783 1478870 1498748 1517148 1535888 1556773 1577912 1597659 1617978 1640424
58279 1640424 1662975 1684304 1706924 1732640 1759151 1784651 1811443 1841502 1872911 1904158 1937444
58268 1937444 1974349 2012942 2052444 2095696 2143590 2192486 2240644 2291584 2347471 2405291 2463368
58257 2463368 2525015 2591220 2656522 2717214 2776998 2839373 2901290 2960034 3019439 3083229 3148941
$$ packed form
58340I46335O380N967N265P212R968J0262R528J1181J4275J5618J5791J7289J8833
58327A093904J7523J4688J3557J3099J0163N856L629K852N86j967j329J378K021
58314A175960O76R16K992M151M648O988J0123J0765R608J0026J1589J1232R753
58301A269427J0650J3409J4400J3551J3792J4955J4649J3923J5510J7732J6989
58290A428987J4902J5894J9087J9878J8400J8740K0885K1139J9747K0319K2446
58279A640424K2551K1329K2620K5716K6511K5500K6792L0059L1409L1247L3286
58268A937444L6905L8593L9502M3252M7894M8896M8158N0940N5887N7820N8077
58257B463368O1647O6205O5302O0692N9784O2375O1917N8744N9405O3790O5712
$$ plain form
58246 3148941 3214676 3284956 3363402 3446490 3531171 3621645 3721817 3828313 3938042 4055087
58236 4055087 4182720 4316389 4452527 4596420 4753198 4919287 5091353 5275178 5476485
58227 5476485 5691654 5917062 6158778 6423076 6706684 7006955 7332047 7689961 8077559
58218 8077559 8492165 8943447 9441411 9983892 10569491 11211347 11923905 12708439 13567208
58209 13567208 14519227 15585993 16776193 18103467 19605467 21326663 23299249 25564058
58201 25564058 28195713 31287336 34934857 39269698 44492417 50847744 58589240 67999747
58193 67999747 79419429 93222039 109813842 129724235 153661010 182372018 216372941
58186 216372941 255630016 299028296 343565504 383949362 413620437 427192047 422758777
$$ packed form
58246C148941O5735P0280P8446Q3088Q4681R0474J00172J06496J09729J17045
58236D055087J27633J33669J36138J43893J56778J66089J72066J83825K01307
58227E476485K15169K25408K41716K64298K83608L00271L25092L57914L87598
58218H077559M14606M51282M97964N42481N85599O41856P12558P84534Q58769
58209A3567208R52019J066766J190200J327274J502000J721196J972586K264809
58201B5564058K631655L091623L647521M334841N222719O355327P741496R410507
58193F7999747J1419682J3802610J6591803J9910393K3936775K8711008L4000923
58186B16372941L9257075M3398280M4537208M0383858K9671075J3571610m433270
$$ plain form
58179 422758777 402379285 370614119 332500324 292258721 252926403 216444258 183864389
58172 183864389 155595789 131617582 111606018 95040571 81351235 70036558 60675844
58165 60675844 52895293 46377101 40885002 36242855 32295267 28909437 25994463 23485952
58157 23485952 21317437 19425686 17770099 16323013 15048904 13911718 12892752 11982228
58149 11982228 11161473 10410595 9725181 9107991 8550893 8040453 7574121 7155192 6777704
58140 6777704 6430839 6112614 5825171 5561517 5310175 5068704 4840613 4623618 4412777
58131 4412777 4210794 4023653 3849766 3683872 3527488 3385078 3253959 3128273 3009096
58122 3009096 2900694 2800520 2702762 2608321 2521666 2441200 2362159 2285969 2217299 2154566 2092338
$$ packed form
58179D22758777k0379492l1765166l8113795m0241603l9332318l6482145l2579869
58172A83864389k8268600k3978207k0011564j6565447j3689336j1314677r360714
58165F0675844p780551o518192n492099m642147l947588l385830k914974k508511
58157B3485952k168515j891751j655587j447086j274109j137186j018966r10524
58149A1982228q20755p50878o85414o17190n57098n10440m66332m18929l77488
58140F777704l46865l18225k87443k63654k51342k41471k28091k16995k10841
58131D412777k01983j87141j73887j65894j56384j42410j31119j25686j19177
58122C009096j08402j00174r7758r4441q6655q0466p9041p6190o8670o2733o2228
$$ plain form
58111 2092338 2030695 1973608 1920527 1868046 1817462 1772320 1730614 1687548 1643965 1604203 1567682
58100 1567682 1530515 1493486 1460503 1430729 1399940 1368303 1339337 1312493 1284120 1254774 1228408
58089 1228408 1205150 1181683 1157960 1136892 1118114 1098547 1078511 1060978 1045328 1027947 1008575
58078 1008575 990264 973538 956203 938350 921993 906381 889160 871551 856921 844802 831715
58067 831715 817330 804382 793070 781046 768704 759043 752251 745410 737579 730405 723874 716128 707326
58054 707326 699133 690679 679631 666924 655827 646673 637179 627585 620599 616335 612106 607328 603947
58041 603947 601749 597934 591844 585829 580856 575301 568574 562065 556072 549450 542517 536704 531222 523765
58027 523765 514549 505999 498437 489831 479885 470532 462296 453875 445452 438691 433296 427294 420896 416336
$$ packed form
58111B092338o1643n7087n3081n2481n0584m5142m1706m3066m3583l9762l6521
58100A567682l7167l7029l2983k9774l0789l1637k8966k6844k8373k9346k6366
58089A228408k3258k3467k3723k1068j8778j9567k0036j7533j5650j7381j9372
58078A008575j8311j6726j7335j7853j6357j5612j7221j7609j4630j2119j3087
58067H31715j4385j2948j1312j2024j2342r661o792o841p831p174o531p746q802
58054G07326q193q454j1048j2707j1097r154r494r594o986m264m229m778l381
58041F03947k198l815o090o015m973n555o727o509n993o622o933n813n482p457
58027E23765r216q550p562q606r946r353q236q421q423o761n395o002o398m560
$$ plain form
58013 416336 413703 410648 406509 403038 400763 398305 395670 394458 394346 393003 390093 387873 387252 386754 385954
57998 385954 386418 388457 390326 391400 392914 394784 394954 392767 389968 387563 384615 380885 377705 375441 372988
57983 372988 370436 369361 369786 369701 368359 367216 366877 365937 363702 361391 359838 358503 357355 357146 357313 356284
57967 356284 354486 354237 356007 357580 357695 357717 358725 359631 359369 358659 358493 358857 359709 361181 362253 361280 358336
57950 358336 355020 351807 347886 343688 340887 339490 337685 335164 333921 335084 337515 340291 344049 349137
57936 349137 354843 361174 369015 377879 385867 392461 398937 405532 410775 414131 416528 417562 415108 408735
57922 408735 400792 392979 384495 374731 365119 356815 348950 340691 332943 326567 320891 315285 310420 306808
57908 306808 303887 301534 300611 301084 301537 301514 302344 304669 307075 308207 308367 308066 306932 305014 303364 302434
$$ packed form
58013D16336k633l055m139l471k275k458k635j212j12j343k910k220o21m98q00
57998C85954M64K039J869J074J514J870J70k187k799k405k948l730l180k264k453
57983C72988k552j075M25q5j342j143l39r40k235k311j553j335j148k09J67j029
57967C56284j798k49J770J573J15K2J008R06k62p10j66L64Q52J472J072r73k944
57950C58336l316l213l921m198k801j397j805k521j243J163K431K776L758N088
57936C49137N706O331P841Q864P988O594O476O595N243L356K397J034k454o373
57922D08735p943p813q484r764r612q304p865q259p748o376n676n606m865l612
57908C06808k921k353r23M73M53k3Q30K325K406J132J60l01j134j918j650r30
$$ plain form
57892 302434 301695 301475 303179 306879 310825 314141 317912 322760 327602 331791 336199 341109 345261 348129 350927
57877 350927 354080 355913 355254 353299 351478 349446 346632 343910 342194 340940 339344 337495 335272 331918
57863 331918 327811 324827 323735 323065 321678 320554 320764 321690 322697 324582 327841 331230 333670 335918 338833
57848 338833 341563 342983 343457 343728 343552 342784 342297 342431 342002 340195 337971 336405 335262 334462 335075 337338
57832 337338 339462 340095 340394 341960 344313 346214 347945 350330 352692 353759 353653 353308 352867 352163 351737 351797
57816 351797 351161 348769 345468 342895 341467 340571 339621 337662 333138 325602 316718 308285 300183 291442 282276
57801 282276 273802 266738 261438 258125 256026 253520 250209 247539 246360 245468 243774 242147 241553 241083 239678
57786 239678 238326 238558 239963 241224 242546 245069 248747 252767 257345 263229 269962 276326 282030 287479
$$ packed form
57892C02434p39k20J704L700L946L316L771M848M842M189M408M910M152K868K798
57877C50927L153J833o59j955j821k032k814k722j716j254j596j849k223l354
57863C31918m107k984j092o70j387j124K10R26J007J885L259L389K440K248K915
57848C38833K730J420M74K71j76p68m87J34m29j807k224j566j143q00O13K263
57832C37338K124O33K99J566K353J901J731K385K362J067j06l45m41p04m26O0
57816C51797o36k392l301k573j428q96r50j959m524p536q884q433q102q741r166
57801B82276q474p064n300l313k099k506l311k670j179q92j694j627n94m70j405
57786B39678j352K32J405J261J322K523L678M020M578N884O733O364N704N449
$$ plain form
57772 287479 292444 296336 299236 301380 302365 302091 301610 301784 301926 301056 299534 298157 296688 294698 292865 291908
57756 291908 291208 289991 288914 288976 289798 290549 291531 293220 294749 295126 295044 295716 296774 297150 297148 297663 298097 297135
57738 297135 295118 293638 293056 292286 290815 289235 287925 286782 286080 286157 286474 286285 285901 286031 286411 286423 286475 287345
57720 287345 288682 289633 290364 291457 292413 292388 291866 291966 292583 292839 292900 293574 294539 294734 294284 294332 295083 295625 295508
57701 295508 295065 294363 293326 292669 293228 294594 295727 296526 297367 297588 296104 293152 289726 285659 280042 273309
57685 273309 267050 261859 257168 253137 250840 250444 250981 252239 255330 261136 269695 281312 296856 316753
57671 316753 341098 370974 408284 454049 508039 569891 638596 709922 775300 824115 847346
57660 847346 840494 805334 749420 682626 613257 547154 488781 440761 402396 370675 343428 320413
$$ packed form
57772B87479M965L892K900K144R85k74m81J74J42q70j522j377j469j990j833r57
57756B91908p00j217j077O2Q22P51R82J689J529L77q2O72J058L76kN15M34r62
57738B97135k017j480n82p70j471j580j310j143p02P7L17j89l84J30L80J2N2Q70
57720B87345J337R51P31J093R56k5n22J00O17K56O1O74R65J95m50M8P51N42j17
57701B95508m43p02j037o57N59J366J133P99Q41K21j484k952l426m067n617o733
57685B73309o259n191m691m031k297l96N37J258L091N806Q559J1617J5544J9897
57671C16753K4345K9876L7310M5765N3990O1852O8705P1326O5378M8815K3231
57660H47346o852l5160n5914o6794o9369o6103n8373m8020l8365l1721k7247k3015
$$ plain form
57648 320413 301491 285616 272084 261196 252994 246516 240902 236215 232722 230247 228545 227419 226236
57635 226236 224202 221342 218429 215931 213773 211997 210694 209431 207740 206026 204946 204157 202744 200661
57621 200661 198545 196403 193822 191300 189877 189458 188902 187812 186889 186506 186284 186164 186455 186783 186365 185449 185037
57604 185037 185035 184183 182087 179859 178419 177497 176601 175601 174036 171264 167772 165072 163827 163257 162673 162255
57588 162255 161919 160861 158829 156678 155043 153532 151737 149981 148556 147279 146256 146034 146480 146486 145277 143190
57572 143190 140854 138559 136707 135803 135566 135006 133758 132433 131422 130444 129495 129070 128990 128153 125999 123282
57556 123282 120993 119447 118822 119460 121100 122745 123805 124582 125300 125628 125563 125797 126678 127639 128095 128144 128042 127840
57538 127840 127838 128619 130238 132102 133758 134967 135044 133219 129893 126470 123692 121146 118562 116412 114893 113511
$$ packed form
57648C20413j8922j5875j3532j0888q202o478n614m687l493k475j702j126j183
57635B26236k034k860k913k498k158j776j303j263j691j714j080p89j413k083
57621B00661k116k142k581k522j423m19n56j090r23l83k22j20K91L28m18r16m12
57604A85037kq52k096k228j440r22q96j000j565k772l492k700j245n70n84m18
57588A62255l36j058k032k151j635j511j795j756j425j277j023k22M46Oj209k087
57572A43190k336k295j852r04k37n60j248j325j011r78r49m25q0q37k154k717
57556A23282k289j546o25O38J640J645J060P77P18L28o5K34Q81R61M56M9j02k02
57538A27840kP81J619J864J656J209P7j825l326l423k778k546k584k150j519j382
$$ plain form
57522 113511 112121 111299 111262 111461 111640 112341 113867 115690 117228 118417 119264 119805 120656 122545 125128 127293
57506 127293 128786 130405 132522 134763 137233 140498 144053 146384 147053 147149 147171 146119 143494 140537 138480
57491 138480 136925 135017 132960 131268 129649 127778 126220 125521 125208 124610 123851 123171 122184 120783 119920 120492
57475 120492 122036 123336 123737 123248 122051 120601 119469 118597 117370 115849 114934 114892 114820 114130 113346 112766 111649
57458 111649 109638 107820 107305 107751 108269 108767 109396 109640 109148 108608 108683 108871 108482 107978 108164 108748 108852 108418
57440 108418 108013 107713 107213 106632 106306 106154 106023 106193 106793 107276 107191 106941 107072 107393 107495 107480 107453 106962 105766
57421 105766 104528 103951 103814 103603 103437 103633 103957 104053 104007 103879 103414 102840 103121 104688 106775 108741 111042 113962
57403 113962 116439 117336 117087 116870 116789 116047 114367 112155 109743 107463 105967 105524 105499 105414 105916 107765 110546
$$ packed form
57522A13511j390q22l7J99J79P01J526J823J538J189Q47N41Q51J889K583K165
57506A27293J493J619K117K241K470L265L555K331O69R6K2j052k625k957k057
57491A38480j555j908k057j692j619j871j558o99l13n98p59o80r87j401q63N72
57475A20492J544J300M01m89j197j450j132q72j227j521r15m2p2o90p84n80j117
57458A11649k011j818n15M46N18M98O29K44m92n40P5J88l89n04J86N84J04m34
57440A08418m05l00n00n81l26j52j31J70O00M83q5k50J31L21J02j5k7m91j196
57421A05766j238n77j37k11j66J96L24R6m6j28m65n74K81J567K087J966K301K920
57403A13962K477Q97k49k17q1p42j680k212k412k280j496m43k5q5N02J849K781
$$ plain form
57386 110546 113364 116135 119156 122066 124379 126464 128807 130824 131558 131184 130727 130679 130846 131112 131308 130781
57370 130781 129124 126962 125128 123519 121633 119575 117590 115300 112567 110424 109874 110319 110424 110021 109858
57355 109858 109976 109761 109298 109316 109996 111049 112666 115098 117610 119130 119757 120393 121172 121546 121678 122342 123561
57338 123561 124700 125732 127034 128030 127548 125685 123956 123349 123452 123594 123613 123319 122477 121599 121543 122025 121709 120127
57320 120127 118399 117609 117521 117385 117066 116794 116541 116177 115762 115377 115068 115029 115284 115220 114169 112478 111286 111168
57302 111168 111679 112213 112527 112368 111512 110339 109682 109912 110701 111655 112506 112751 111863 109985 107814 105835 104203
57285 104203 103102 102417 101278 98826 95337 91734 88232 84417 80526 77497 75677 74532 73682 73190 72746
57270 72746 71716 70236 69290 69441 70435 72173 74901 78114 80430 81209 81482 82734 85482 89367 93801 98038
$$ packed form
57386A10546K818K771L021K910K313K085K343K017P34l74m57m8J67K66J96n27
57370A30781j657k162j834j609j886k058j985k290k733k143n50M45J05m03j63
57355A09858J18k15m63J8O80J053J617K432K512J520O27O36P79L74J32O64J219
57338A23561J139J032J302R96m82j863j729o07J03J42J9k94q42q78n6M82l16j582
57320A20127j728p90q8j36l19k72k53l64m15l85l09l9K55o4j051j691j192j18
57302A11168N11N34L14j59q56j173o57K30P89R54Q51K45q88j878k171j979j632
57285A04203j101o85j139k452l489l603l502l815l891l029j820j145q50m92m44
57270G2746j030j480r46J51R94J738K728L213K316P79K73J252K748L885M434M237
$$ plain form
57254 98038 101395 103997 106717 109913 112852 114822 116161 117605 119177 120351 120948 121330 121936 123012 124590
57239 124590 126422 128091 129336 130141 130476 130262 129660 129058 128800 129154 130390 132366 134218 135095 135252 135802 137310
57222 137310 139237 140872 142188 143526 145023 146672 148523 150490 152169 153126 153284 153009 152895 153346 154200 154952
57206 154952 155544 156604 158610 161188 163708 166185 169055 172402 175990 179786 183789 187605 190851 193782
57192 193782 196900 200110 202906 205175 207226 209268 211464 214215 217669 221251 224370 227249 230300 233020
57178 233020 234550 235091 235791 237340 239646 242809 247308 253055 259180 265041 270829 277071 284125 292132 300905
57163 300905 309986 319397 330008 342414 355778 368711 381022 393581 406689 419747 432469 445246
57151 445246 458181 470897 483522 496862 511313 526462 541892 557551 573202 588446 603509
$$ packed form
57254I8038L357K602K720L196K939J970J339J444J572J174N97L82O06J076J578
57239A24590J832J669J245Q05L35k14o02o02k58L54J236J976J852Q77J57N50J508
57222A37310J927J635J316J338J497J649J851J967J679R57J58k75j14M51Q54P52
57206A54952N92J060K006K578K520K477K870L347L588L796M003L816L246K931
57192A93782L118L210K796K269K051K042K196K751L454L582L119K879L051K720
57178B33020J530N41P00J549K306L163M499N747O125N861N788O242P054Q007Q773
57163C00905R081R411J0611J2406J3364J2933J2311J2559J3108J3058J2722J2777
57151D45246J2935J2716J2625J3340J4451J5149J5430J5659J5651J5244J5063
$$ plain form
57140 603509 619118 635423 651867 668346 685715 704874 726068 749146 773796 799425 825576
57129 825576 852592 881220 911647 943702 977924 1015578 1057666 1104827 1158079 1218560 1286435
57118 1286435 1361042 1442237 1530573 1626088 1728044 1836149 1951069 2073507 2203775 2342604
57108 2342604 2491477 2651848 2824973 3013067 3220085 3451253 3712734 4012295 4359937
57099 4359937 4767870 5250766 5826651 6517482 7348886 8349640 9550908 10984373 12678885
57090 12678885 14656016 16925539 19482711 22308710 25372541 28631282 32028723 35495268
57082 35495268 38949561 42301729 45463331 48366371 50974045 53256388 55135970 56455729
57074 56455729 57016310 56663860 55357295 53170291 50249405 46774500 42937610 38927803
$$ packed form
57140F03509J5609J6305J6444J6479J7369J9159K1194K3078K4650K5629K6151
57129H25576K7016K8628L0427L2055L4222L7654M2088M7161N3252O0481O7875
57118A286435P4607Q1195Q8336R5515J01956J08105J14920J22438J30268J38829
57108B342604J48873J60371J73125J88094K07018K31168K61481K99561L47642
57099D359937M07933M82896N75885O90831Q31404J000754J201268J433465J694512
57090A2678885J977131K269523K557172K825999L063831L258741L397441L466545
57082C5495268L454293L352168L161602K903040K607674K282343J879582J319759
57074E6455729N60581l52450j306565k187004k920886l474905l836890m009807
$$ plain form
57066 38927803 34914702 31036705 27396942 24062668 21067045 18416008 16097755 14088904
57058 14088904 12357484 10867641 9585893 8483928 7536955 6721792 6016954 5403429 4865675
57049 4865675 4393113 3980173 3623131 3316522 3052975 2825318 2627324 2453118 2297693
57040 2297693 2158070 2032721 1920016 1818126 1725993 1643281 1569696 1505180 1450146 1404568
57030 1404568 1367584 1338992 1320403 1314041 1321529 1344763 1385634 1441376 1499840 1541954 1550784 1519276
57018 1519276 1451428 1358651 1254746 1151316 1055167 968883 893044 827326 770548 721266 678548
57007 678548 641551 608840 579169 552560 529574 509795 492012 475534 460324 446216 433027
56996 433027 421102 410666 401012 391427 382580 375870 371673 369301 368397 369262 372050 376694 383420 392372
$$ packed form
57066C8927803m013101l877997l639763l334274k995623k651037k318253k008851
57058A4088904j731420j489843j281748j101965r46973q15163p04838o13525n37754
57049D865675m72562m12940l57042l06609k63547k27657j97994j74206j55425
57040B297693j39623j25349j12705j01890r2133q2712p3585o4516n5034m5578
57030A404568l6984k8592j8589o362P488K3234M0871N5742N8464M2114Q830l1508
57018A519276o7848r2777j03905j03430r6149q6284p5839o5718n6778m9282m2718
57007F78548l6997l2711k9671k6609k2986j9779j7783j6478j5210j4108j3189
56996D33027j1925j0436r654r585q847o710m197k372r04Q65K788M644O726Q952
$$ plain form
56982 392372 402937 414212 425540 435459 440867 438889 429526 415300 398560 380475 362284 345707
56970 345707 331720 320170 310928 304376 300537 298817 298942 301288 306091 313164 322623 335132 351240
56957 351240 370997 394121 419662 445253 467255 481916 486529 480243 464586 442915 418614 393836
56945 393836 370041 348750 330922 316435 305156 297847 295036 295805 298944 304620 313615 325677 340297
56932 340297 358585 382509 412120 444837 477141 505418 525376 532822 526050 506793 478768 446101
56920 446101 412672 381221 352528 326412 303461 284804 270413 259027 249736 242301 236013 229838
56908 229838 223901 219308 216194 213343 210195 207809 207309 208590 211055 214476 218595 222956 227676 233452
56894 233452 240373 247709 255215 263689 273893 285981 300283 317512 337630 359534 382204 404939
$$ packed form
56982C92372J0565J1275J1328R919N408j978r363j4226j6740j8085j8191j6577
56970C45707j3987j1550r242o552l839j720J25K346M803P073R459J2509J6108
56957C51240J9757K3124K5541K5591K2002J4661M613o286j5657k1671k4301k4778
56945C93836k3795k1291j7828j4487j1279p309k811P69L139N676Q995J2062J4620
56932C40297J8288K3924K9611L2717L2304K8277J9958P446o772j9257k8025l2667
56920D46101l3429l1451k8693k6116k2951j8657j4391j1386r291p435o288o175
56908B29838n937m593l114k851l148k386n00J281K465L421M119M361M720N776
56894B33452O921P336P506Q474J0204J2088J4302J7229K0118K1904K2670K2735
$$ plain form
56882 404939 425741 440612 445577 439193 422881 399710 373400 347518 324477 305209 289897 278637
56870 278637 271435 268395 270194 277741 291186 309900 333608 362878 398512 441258 492101 551621
56858 551621 618248 687347 751944 803971 835733 842377 824276 786808 737582 683943 632055 586225
56846 586225 548203 517978 495736 482439 478568 483534 496739 518360 548892 588909 639600 702608
56834 702608 779013 868919 971165 1081167 1188332 1277293 1333476 1348211 1320178 1254922 1163986
56823 1163986 1061977 961399 869298 788369 719681 663557 619383 586388 564382 553009 551080
56812 551080 557728 573647 600262 638145 687057 746827 816749 893606 970367 1036657 1080947 1094298
56800 1094298 1074104 1024927 955653 875798 793727 716190 647576 589444 541376 502332 471213
$$ packed form
56882D04939K0802J4871M965o384j6312k3171k6310k5882k3041j9268j5312j1260
56870B78637p202l040J799P547J3445J8714K3708K9270L5634M2746N0843N9520
56858E51621O6627O9099O4597N2027L1762O644j8101l7468m9226n3639n1888m5830
56846E86225l8022l0225k2242j3297l871M966J3205K1621L0532M0017N0691O3008
56834G02608P6405Q9906J02246J10002J07165Q8961N6183J4735k8033o5256r0936
56823A163986j02009j00578r2101q0929o8688n6124m4174l2995k2006j1373j929
56812E51080O648J5919K6615L7883M8912N9770O9922P6857P6761O6290M4290J3351
56800A094298k0194m9177o9274p9855q2071p7537o8614n8132m8068l9044l1119
$$ plain form
56789 471213 447055 429485 418731 414854 417426 426206 441496 463428 491546 525312 563858 604218
56777 604218 640419 665433 674261 665292 639831 601426 555247 506775 460238 417894 380261 346846
56765 346846 317160 291442 270182 252924 238160 224622 212183 201329 192383 185405 180132 175685
56753 175685 170979 165785 160823 156656 153171 150285 148214 146664 144738 142231 140217 139692 140225 140521 139831
56738 139831 138303 136497 135031 134283 134069 133972 134057 134637 135339 135268 134292 133279 132785 132466 132080 132045 132538 133023 133225
56719 133225 133664 134716 136057 137590 139879 143021 145979 147767 148543 148963 149312 149797 150796 152116 152981 153356
56703 153356 154297 156308 158430 159805 161009 162785 164515 165167 164952 164759 164643 164160 163664 163980 165026 165938
56687 165938 166346 166554 166653 166392 165831 165372 165237 165525 166528 168384 170582 172349 173336 173654 173642 173883 174835 176079
$$ packed form
56789D71213k4158j7570j0754l877K572Q780J5290K1932K8118L3766L8546M0360
56777F04218L6201K5014Q828q969k5461l8405m6179m8472m6537m2344l7633l3415
56765C46846k9686k5718k1260j7258j4764j3538j2439j0854q946o978n273m447
56753A75685m706n194m962m167l485k886k071j550j926k507k014n25N33K96o90
56738A39831j528j806j466p48k14r7Q5N80P02p1r76j013m94l19l86l5M93M85K02
56719A33225M39J052J341J533K289L142K958J788P76M20L49M85R99J320Q65L75
56703A53356R41K011K122J375J204J776J730O52k15j93j16m83m96L16J046R12
56687A65938M08K08R9k61n61m59j35K88J003J856K198J767R87L18j2K41R52J244
$$ plain form
56669 176079 176585 176133 175724 176094 176686 176752 176636 177173 178547 180513 183104 186241 189234 191423 192878 193921
56653 193921 194566 195039 196057 197956 200183 202227 204194 205905 206449 205422 203693 202068 200194 197684 195266
56638 195266 193665 192339 190509 188579 187264 186122 184341 182325 181151 180948 181087 181430 182086 182377 181385 179226
56622 179226 176682 173976 171047 168556 167304 166907 166242 164979 163683 162699 161931 161401 161081 160555 159741 159428
56606 159428 160215 161490 162422 163239 164445 165581 166104 166693 168207 169962 170625 170322 170307 170945 171626 172263 173239
56589 173239 174088 173949 173270 173425 174653 175888 176613 177391 178412 179062 179123 179092 179125 178890 178576 178897 180101 182089
56571 182089 185263 189901 194904 198685 201248 203898 207050 210068 213318 218441 226145 235512 246065 258795
56557 258795 274222 290692 305415 316230 322042 322956 320718 317824 315424 312945 310083 307845 306941 306444
$$ packed form
56669A76079N06m52m09L70N92O6j16N37J374J966K591L137K993K189J455J043
56653A93921O45M73J018J899K227K044J967J711N44j027j729j625j874k510k418
56638A95266j601j326j830j930j315j142j781k016j174k03J39L43O56K91r92k159
56622A79226k544k706k929k491j252l97o65j263j296r84p68n30l20n26q14l13
56606A59428P87J275R32Q17J206J136N23N89J514J755O63l03j5O38O81O37R76
56589A73239Q49j39o79J55J228J235P25P78J021O50O1l1L3k35l14L21J204J988
56571A82089L174M638N003L781K563K650L152L018L250N123P704R367J0553J2730
56557B58795J5427J6470J4723J0815N812R14k238k894k400k479k862k238r04m97
$$ plain form
56543 306444 305014 302514 299567 296335 292663 288781 284983 281051 276631 271858 267172 262826 258858 255120
56529 255120 251226 246964 242884 239834 237839 236086 234047 231861 229572 226924 224118 221895 220492 219257
56515 219257 217539 215305 212702 209757 206741 204083 201715 199167 196499 194463 193544 193462 193687 193843 193574 192731
56499 192731 191699 190898 190051 188675 187094 186073 185630 185208 184885 185292 186366 187380 188238 189566 191319 192556
56483 192556 192890 193061 193697 194546 195271 196004 196683 196807 196273 195647 195264 194904 194595 194823 195647 196459 196952 197495 198226
56464 198226 198659 198584 198565 199118 199985 200536 200388 199589 198769 199001 200770 203146 204753 205423 205964 206618 206914 206957 207510
56445 207510 208679 209698 210178 210445 210517 210017 209267 209212 209937 210389 209877 208721 207247 205377 203533 202720 203217
56428 203217 204193 204953 205584 206172 206458 206528 206763 206954 206574 206027 206364 207672 209077 210461 212569 215150 216630
$$ packed form
56543C06444j430k500k947l232l672l882l798l932m420m773m686m346l968l738
56529B55120l894m262m080l050j995j753k039k186k289k648k806k223j403j235
56515B19257j718k234k603k945l016k658k368k548k668k036r19q2K25J56k69q43
56499A92731j032q01q47j376j581j021m43m22l23M07J074J014Q58J328J753J237
56483A92556L34J71O36Q49P25P33O79J24n34o26l83l60l09K28Q24Q12M93N43P31
56464A98226M33p5j9N53Q67N51j48p99q20K32J769K376J607O70N41O54K96M3N53
56445B07510J169J019M80K67P2n00p50n5P25M52n12j156j474j870j844q13M97
56428B03217R76P60O31N88K86P0K35J91l80n47L37J308J405J384K108K581J480
$$ plain form
56411 216630 216250 215091 214354 213992 213684 213801 214639 215813 217039 218484 219897 220580 220638 221068 222203 223321 224116
56394 224116 225171 226592 227688 228403 229518 230940 231520 231211 231620 233584 235862 237205 238058 239193 240228
56379 240228 240739 241388 242682 243878 244256 244285 244468 244303 243470 242774 242803 242914 242684 242977 244352 245736 246078 246098
56361 246098 246951 248271 249030 249365 250029 250881 251385 251922 253181 254847 256171 257314 258935 260936 262638 263790
56345 263790 264542 265006 265569 266917 269012 270808 271711 272464 273900 275774 277556 279346 281225 282822 284212
56330 284212 286125 288482 290080 290573 291352 293509 296436 299520 303552 308951 314106 317255 318831 320318 321846
56315 321846 322621 322755 322973 323268 323386 323917 325432 327319 328809 330348 332582 334956 336838 339132 343186 348846
56299 348846 355088 361772 369157 376455 382497 387307 391580 395286 398196 401090 404905 409356 413869 419115
$$ packed form
56411B16630l80j159p37l62l08J17Q38J174J226J445J413O83N8M30J135J118P95
56394B24116J055J421J096P15J115J422N80l09M09J964K278J343Q53J135J035
56379B40228N11O49J294J196L78K9J83j65q33o96K9J11k30K93J375J384L42K0
56361B46098Q53J320P59L35O64Q52N04N37J259J666J324J143J621K001J702J152
56345B63790P52M64N63J348K095J796R03P53J436J874J782J790J879J597J390
56330B84212J913K357J598M93P79K157K927L084M032N399N155L149J576J487J528
56315C21846P75J34K18K95J18N31J515J887J490J539K234K374J882K294M054N660
56299C48846O242O684P385P298O042M810M273L706K910K894L815M451M513N246
$$ plain form
56285 419115 426014 433904 441428 448721 457020 466464 475920 484778 493483 502485 511972 522427 534351 547635
56271 547635 562102 578143 595939 614748 633992 654263 676313 699942 725000 752489 783508
56260 783508 818118 856406 899507 948208 1001816 1060054 1124948 1199230 1283871 1378841 1485116
56249 1485116 1603997 1735387 1878598 2033913 2201289 2378231 2560878 2746555 2933404
56240 2933404 3118243 3296639 3464393 3617094 3749004 3854556 3930624 3975800 3988440 3967616
56230 3967616 3915291 3835458 3731629 3607051 3466493 3315330 3157093 2993977 2829255 2666955
56220 2666955 2509395 2357114 2211034 2072705 1942671 1820539 1706484 1600977 1503521 1413428
56210 1413428 1331254 1257530 1190750 1128687 1071025 1018571 970631 925695 884163 847709 816170
$$ packed form
56285D19115O899P890P524P293Q299R444R456Q858Q705R002R487J0455J1924J3284
56271E47635J4467J6041J7796J8809J9244K0271K2050K3629K5058K7489L1019
56260G83508L4610L8288M3101M8701N3608N8238O4894P4282Q4641R4970J06275
56249A485116J18881J31390J43211J55315J67376J76942J82647J85677J86849
56240B933404J84839J78396J67754J52701J31910J05552P6068M5176J2640k0824
56230C967616n2325p9833j03829j24578j40558j51163j58237j63116j64722j62300
56220B666955j57560j52281j46080j38329j30034j22132j14055j05507r7456r0093
56210A413428q2174p3724o6780o2063n7662n2454m7940m4936m1532l6454l1539
$$ plain form
56199 816170 787539 760951 737140 716026 696372 677991 661974 648447 636170 624525 613971
56188 613971 604545 595890 588600 583482 579625 575303 570571 566802 563922 560498 556456 553305 551550 550200
56174 550200 548988 548813 549772 550825 551588 552557 553655 554475 555786 558718 562705 566343 569908 574806 580968
56159 580968 587251 594012 602601 612558 622009 630773 640426 651450 663099 676035 692270 712332 735157
56146 735157 760865 791006 826112 865844 911610 966054 1029714 1100894 1178773 1263491 1352893
56135 1352893 1442204 1527280 1605382 1673067 1727222 1769127 1804308 1837390 1869600 1901171 1932293
56124 1932293 1960603 1981263 1991276 1991568 1984251 1970613 1952295 1931081 1906231 1874402 1832959 1780973
56112 1780973 1717169 1640513 1553746 1463176 1374036 1288733 1209830 1140876 1083149 1034860 994651
$$ packed form
56199H16170k8631k6588k3811k1114j9654j8381j6017j3527j2277j1645j0554
56188F13971r426q655p290n118l857m322m732l769k880l424m042l151j755j350
56174E50200j212j75R59J053P63R69J098Q20J311K932L987L638L565M898O162
56159E80968O283O761Q589R957R451Q764R653J1024J1649J2936J6235K0062K2825
56146G35157K5708L0141L5106L9732M5766N4444O3660P1180P7879Q4718Q9402
56135A352893Q9311Q5076P8102O7685N4155M1905L5181L3082L2210L1571L1122
56124A932293K8310K0660J0013K92p317j3638j8318k1214k4850l1829m1443n1986
56112A780973o3804p6656q6767r0570q9140q5303p8903o8954n7727m8289m0209
$$ plain form
56101 994651 962876 938672 919228 903011 890591 881419 873204 865408 859877 857019 854826 852652 852312
56088 852312 854360 856924 859325 863063 868100 872198 875366 880861 889990 899835 907957 915675 924799 934822
56074 934822 945237 957042 970011 981940 992330 1003418 1016031 1028167 1039156 1051290 1065685
56063 1065685 1080530 1095097 1111236 1129083 1145759 1160418 1176135 1194469 1212567 1228062 1242503
56052 1242503 1257369 1271092 1282764 1294599 1308002 1321269 1333664 1347456 1363398 1378756 1392511
56041 1392511 1407896 1426930 1447116 1466487 1487131 1510653 1535023 1559140 1585621 1615674 1646170
56030 1646170 1675306 1706200 1741232 1777912 1814083 1852047 1893526 1935692 1976328 2017877 2062296
56019 2062296 2107089 2150715 2196577 2247220 2299859 2352120 2406713 2465872 2526783 2587372 2650957
$$ packed form
56101I94651l1775k4204j9444j6217j2420r172q215p796n531k858k193k174l40
56088H52312K048K564K401L738N037M098L168N495R129R845Q122P718R124J0023
56074I34822J0415J1805J2969J1929J0390J1088J2613J2136J0989J2134J4395
56063A065685J4845J4567J6139J7847J6676J4659J5717J8334J8098J5495J4441
56052A242503J4866J3723J1672J1835J3403J3267J2395J3792J5942J5358J3755
56041A392511J5385J9034K0186J9371K0644K3522K4370K4117K6481L0053L0496
56030A646170K9136L0894L5032L6680L6171L7964M1479M2166M0636M1549M4419
56019B062296M4793M3626M5862N0643N2639N2261N4593N9159O0911O0589O3585
$$ plain form
56008 2650957 2720322 2792962 2867016 2945776 3031209 3119474 3208268 3302012 3404145 3511240 3620737
55997 3620737 3737111 3863762 3996138 4130093 4269796 4420060 4578309 4741917 4915943
55988 4915943 5105444 5307653 5520019 5748132 5997128 6263607 6545199 6849509 7183946
55979 7183946 7545777 7932538 8352884 8816217 9321434 9867723 10466423 11129945 11859778
55970 11859778 12658808 13544214 14534364 15636029 16861103 18243751 19824925 21635334
55962 21635334 23714543 26134226 28984813 32360139 36384632 41243332 47161722 54375586
55954 54375586 63148894 73798240 86670448 102139308 120690153 142986939 169770787
55947 169770787 201618616 238632011 279916653 322793249 362319417 392073498 406350442
$$ packed form
56008B650957O9365P2640P4054P8760Q5433Q8265Q8794R3744J02133J07095J09497
55997C620737J16374J26651J32376J33955J39703J50264J58249J63608J74026
55988D915943J89501K02209K12366K28113K48996K66479K81592L04310L34437
55979G183946L61831L86761M20346M63333N05217N46289N98700O63522P29833
55970A1859778P99030Q85406R90150J101665J225074J382648J581174J810409
55962B1635334K079209K419683K850587L375326M024493M858700N918390P213864
55954E4375586Q773308J0649346J2872208J5468860J8550845K2296786K6783848
55947A69770787L1847829L7013395M1284642M2876596L9526168K9754081J4276944
$$ plain form
55940 406350442 402531813 382019816 349273026 309871709 268834478 229745539 194614575
55933 194614575 164194669 138470824 117056575 99395831 84865526 72879168 62957741
55926 62957741 54717814 47832204 42031751 37119528 32947058 29381400 26309301 23652991
55918 23652991 21355487 19357978 17607300 16071940 14730561 13552875 12507363 11577867
55910 11577867 10755937 10024517 9363983 8766699 8230888 7746408 7299855 6887557 6510630
55901 6510630 6162800 5835352 5528881 5248089 4989428 4745058 4514786 4303209 4108696
55892 4108696 3925465 3753241 3595147 3449069 3310230 3179507 3060715 2952485 2850911
55883 2850911 2757216 2674757 2601064 2530373 2461230 2394354 2326112 2251909 2173693 2096989 2022889
$$ packed form
55940D06350442l818629k0511997l2746790l9401317m1037231l9088939l5130964
55933A94614575l0419906k5723845k1414249j7660744j4530305j1986358r921427
55926F2957741q239927o885610n800453m912223m172470l565658l072099k656310
55918B3652991k297504j997509j750678j535360j341379j177686j045512r29496
55910A1577867q21930p31420o60534n97284n35811m84480m46553m12298l76927
55901F510630l47830l27448l06471k80792k58661k44370k30272k11577j94513
55892D108696j83231j72224j58094j46078j38839j30723j18792j08230j01574
55883B850911r3695q2459p3693p0691o9143o6876o8242p4203p8216p6704p4100
$$ plain form
55872 2022889 1949709 1879634 1816256 1757714 1699431 1641884 1589037 1541055 1495263 1452576 1416261
55861 1416261 1385615 1357001 1329793 1305344 1281624 1255014 1226314 1199259 1174218 1148877 1123726
55850 1123726 1101111 1079873 1056649 1031664 1007872 985172 960834 934998 910565 888118 865897
55839 865897 844300 825527 809150 792701 776261 761984 749480 736155 721739 708273 696026
55828 696026 683697 672164 663697 657684 651192 643556 636487 630018 622240 612864 603259 593329 581988
55815 581988 570285 560339 551688 542372 533122 526668 523312 521018 519388 519705 521409 522560 523681 527272
55801 527272 533568 540532 548009 557957 570357 582550 592951 601897 608708 611549 610605 607915 603687 596215
55787 596215 585846 575568 567046 559254 551540 544752 538561 530849 520784 509953 499730 490159 482036
$$ packed form
55872B022889p3180p0075o3378n8542n8283n7547n2847m7982m5792m2687l6315
55861A416261l0646k8614k7208k4449k3720k6610k8700k7055k5041k5341k5151
55850A123726k2615k1238k3224k4985k3792k2700k4338k5836k4433k2447k2221
55839H65897k1597j8773j6377j6449j6440j4277j2504j3325j4416j3466j2247
55828F96026j2329j1533q467o013o492p636p069o469p778r376r605r930j1341
55815E81988j1703r946q651r316r250o454l356k294j630L17J704J151J121L591
55801E27272O296O964P477R948J2400J2193J0401Q946O811K841r44k690m228p472
55787E96215j0369j0278q522p792p714o788o191p712j0065j0831j0223r571q123
$$ plain form
55774 482036 477499 477835 482967 493575 511280 536031 565037 594151 618186 630632 626558 606837
55762 606837 577454 544519 511788 482069 457408 437324 419732 404233 392121 383123 374979 366672
55750 366672 359320 353425 347924 342458 337866 333960 329466 324764 321945 321476 321392 320555 320120 320954 322040 322308
55734 322308 321702 319691 315095 308327 301623 296221 291407 286838 283357 280694 276842 270861 264185 258209
55720 258209 252698 247580 244086 242839 242630 242327 242509 244343 248408 255219 265173 277156 288806 298720
55706 298720 306767 312026 312719 308894 303082 297266 291108 283849 275893 267530 258131 247830 238269 230590
55692 230590 224288 218857 214874 212483 210611 208726 207800 208565 210388 212728 216062 220441 224842 228895 233594
55677 233594 239300 244747 248999 252685 256159 258085 257257 254430 251127 247853 244601 241872 240088 239067
$$ packed form
55774D82036m537L36N132J0608J7705K4751K9006K9114K4035J2446m074j9721
55762F06837k9383l2935l2731k9719k4661k0084j7592j5499j2112q998q144q307
55750C66672p352n895n501n466m592l906m494m702k819m69q4q37m35Q34J086K68
55734C22308o06k011m596o768o704n402m814m569l481k663l852n981o676n976
55720B58209n511n118l494j247k09l03J82J834M065O811R954J1983J1650R914
55706B98720Q047N259O93l825n812n816o158p259p956q363r399j0301r561p679
55692B30590o302n431l983k391j872j885r26P65J823K340L334M379M401M053M699
55677B33594N706N447M252L686L474J926q28k827l303l274l252k729j784j021
$$ plain form
55663 239067 238907 240185 242492 244159 244277 243700 243349 243073 242968 244140 246987 250254 252886 255436 258580 261694
55647 261694 264000 265700 266809 266371 264116 261481 259583 257465 253721 248577 242896 236351 228270 219394
55633 219394 211177 204001 197434 191634 187122 183697 180746 178226 176425 175255 174584 174567 174840 174180 171868
55618 171868 168682 165748 163171 160584 158110 155910 153608 151119 149250 148563 148363 147639 146332 144868 143257
55603 143257 141439 139736 138234 136471 134434 132977 132549 132413 131799 130841 129738 128150 126279 125314 125789 126608
55587 126608 126745 126801 127739 129169 130148 130739 131482 132184 132534 133144 134673 136611 138202 139965 142980 147218 151856
55570 151856 156796 162684 169690 177322 185048 192175 197508 200210 200699 199951 198347 195879 192840 189430 185317
55555 185317 180449 175671 171579 167463 162429 156964 152310 148834 146113 144096 142955 142166 140923 139290
$$ packed form
55663B39067j60J278K307J667J18n77l51k76j05J172K847L267K632K550L144L114
55647B61694K306J700J109m38k255k635j898k118l744n144n681o545q081q876
55633B19394q217p176o567n800m512l425k951k520j801j170o71j7K73o60k312
55618A71868l186k934k577k587k474k200k302k489j869o87k00p24j307j464j611
55603A43257j818j703j502j763k037j457m28j36o14r58j103j588j871r65M75Q19
55587A26608J37N6R38J430R79N91P43P02L50O10J529J938J591J763L015M238M638
55570A51856M940N888P006P632P726P127N333K702M89p48j604k468l039l410m113
55555A85317m868m778m092m116n034n465m654l476k721k017j141p89j243j633
$$ plain form
55541 139290 138020 137424 137278 137557 138421 139723 141235 143052 145178 147176 148844 150598 152475 153458 152688 150700
55525 150700 148526 146259 143560 140915 139098 137767 135792 132764 129201 125531 121913 118771 116519 114875
55511 114875 113292 111874 111086 110837 110618 110207 109517 108183 106166 104363 103705 103953 104146 103847 103110 101744 99655
55494 99655 97570 96401 96090 95913 95629 95490 95495 95571 96165 97636 99394 100654 101724 103485 105760 107338 107602
55477 107602 107103 106501 105837 104979 103974 102851 101692 100910 100874 101317 101689 101949 102411 102979 103130 102577 101514 100421
55459 100421 99975 100675 102024 102639 101746 100121 98923 98226 97460 96638 96262 96428 96904 97633 98371 98392 97432 96365
55441 96365 95997 95787 94799 93328 92382 92077 91837 91801 92628 94129 95395 96171 96910 97597 97741 97494 97552 97954 98152
55422 98152 98244 98982 100476 102043 103423 105057 107055 108975 110710 112489 113956 114401 114085 114166 114982 115477 114710
$$ packed form
55541A39290j270n96j46K79Q64J302J512J817K126J998J668J754J877R83p70j988
55525A50700k174k267k699k645j817j331j975l028l563l670l618l142k252j644
55511A14875j583j418p88k49k19m11o90j334k017j803o58K48J93k99p37j366k089
55494I9655k085j169l11j77k84j39NP6N94J471J758J260J070J761K275J578K64
55477A07602m99o02o64q58j005j123j159p82l6M43L72K60M62N68J51n53j063j093
55459A00421m46P00J349O15q93j625j198o97p66q22l76J66M76P29P38K1r60j067
55441I6365l68k10r88j471r46l05k40l6Q27J501J266P76P39O87J44k47N8M02J98
55422I8152R2P38J494J567J380J634J998J920J735J779J467M45l16Q1Q16M95p67
$$ plain form
55405 114710 112972 111024 109102 107096 105011 102927 101095 100203 100816 102416 103745 104177 104048 103645 102799 101648
55389 101648 100867 100847 101347 102088 102923 103352 102760 101389 100296 100093 100435 100825 101096 100944 99912 98185 96650
55372 96650 95838 95455 95185 95204 95630 96146 96507 96829 97133 97162 96838 96385 95921 95426 95100 95109 95084 94605 94065 94210 94915
55351 94915 95424 95783 96803 98361 99058 98125 96677 96311 97246 98500 99261 99441 99337 99364 99774 100281 100265 99596
55333 99596 98831 98433 98266 98018 97566 96804 95732 94848 94738 95069 94720 93253 91512 90463 90098 89917 89797 89858
55315 89858 90041 90321 90892 91710 92317 92504 92709 93326 94042 94338 94246 94137 94050 93744 93258 92943 92922 92872 92469 91904
55295 91904 91800 92467 93348 93504 92714 91698 91092 90801 90720 91350 92966 94743 95641 95750 95832 95875 95238 94020 93144
55276 93144 93029 93289 93801 94860 96080 96306 95107 93409 92224 91597 91240 91298 92003 93175 94521 95873 96863
$$ packed form
55405A14710j738j948j922k006k085k084j832q92O13J600J329M32j29m03q46j151
55389A01648p81k0N00P41Q35M29n92j371j093k03L42L90K71j52j032j727j535
55372I6650q12l83k70J9M26N16L61L22L04K9l24m53m64m95l26Rk5m79n40J45P05
55351I4915N09L59J020J558O97r33j448l66R35J254P61J80j04K7M10N07j6o69
55333I9596p65l98j67k48m52p62j072q84j10L31l49j467j741j049l65j81j20O1
55315H9858J83K80N71Q18O07J87K05O17P16K96r2j09q7l06m86l15k1n0m03n65
55295I1904j04O67Q81J56p90j016o06k91q1O30J616J777Q98J09Q2M3o37j218q76
55276I3144j15K60N12J059J220K26j199j698j185o27l57N8P05J172J346J352R90
$$ plain form
55259 96863 97041 96552 96109 96098 96290 96598 97370 98788 100663 102827 104979 106172 105538 103677 102306 102242 102727
55242 102727 102936 102988 103104 102957 102426 101958 101628 100871 99712 99178 99821 100810 101178 101024 100751 100118 98893 97588
55224 97588 96691 95938 95112 94685 94833 94672 93488 91992 91350 91600 92007 92338 92790 93180 93276 93470 94173 94922 95008
55205 95008 94655 94747 95712 97413 99622 101773 102751 101955 100216 98797 97924 97202 96912 97607 98680 98717 97427
55188 97427 96148 96197 97513 99105 100078 100040 99186 98239 97860 98000 98153 98162 98341 98943 99938 101223 102631 103878
55170 103878 104806 105450 105564 104584 102591 100833 100560 101670 103121 104293 105186 105697 105650 105386 105467 105836 105980 105771
55152 105771 105418 104849 104055 103864 105273 107815 109636 109562 108357 107503 107464 107644 107501 107080 106672 106416 106257 106059
55134 106059 105723 105226 104593 103899 103232 102511 101410 99879 98711 98983 100664 102406 103082 102921 102666 102406 101977
$$ packed form
55259I6863J78m89m43j1J92L08P72J418J875K164K152J193o34j861j371o4M85
55242A02727K09N2J16j47n31m68l30p57j159n34O43R89L68j54k73o33j225j305
55224I7588q97p53q26m27J48j61j184j496o42K50M07L31M52L90R6J94P03P49Q6
55205I5008l53R2R65J701K209K151R78p96j739j419q73p22k90O95J073L7j290
55188I7427j279M9J316J592R73l8q54r47l79J40J53RJ79O02R95J285J408J247
55170A03878R28O44J14r80j993j758k73J110J451J172Q93N11m7k64Q1L69J44k09
55152A05771l53n69p94j91J409K542J821p4j205q54l9J80j43m21m08k56j59j98
55134A06059l36m97o33o94o67p21j101j531j168K72J681J742O76j61k55k60m29
$$ plain form
55117 101977 101833 102446 103257 103253 102388 101454 100764 99964 99132 98971 99768 101079 102551 104178 105545 105876 105259 105012
55099 105012 106213 108417 110290 111087 111122 111241 112180 114122 116495 118440 119656 120575 121584 122475 122805 122456
55083 122456 121654 120740 120031 119616 119223 118647 118296 118799 120017 121000 121166 120949 120977 121123 120860 120130 119312 118557 117761
55064 117761 117133 117218 118135 119188 119516 118967 118071 117271 116514 115605 114604 113583 112303 110612 109074 108624 109445
55047 109445 110667 111399 111614 111718 111754 111543 111287 111421 112009 112733 113415 114085 114585 114557 113859 112747 111673 111071
55029 111071 111172 111754 112294 112689 113530 115224 117135 118170 118110 117737 117601 117289 116156 114332 112700 112060 112510
55012 112510 113473 114239 114547 114684 114957 115229 115146 114683 114209 114017 113968 113653 112889 112082 112003 112986 114402 115245 115244 114927
54992 114927 114623 114071 113233 112758 113106 113756 113866 113339 112685 112204 111833 111529 111297 111107 111144 111776 112832 113463 113204
$$ packed form
55117A01977j44O13Q11mq65r34o90q00q32j61P97J311J472J627J367L31o17k47
55099A05012J201K204J873P97L5J19R39J942K373J945J216R19J009Q91L30l49
55083A22456q02r14p09m15l93n76l51N03J218R83J66k17K8J46k63p30q18p55p96
55064A17761o28Q5R17J053L28n49q96q00p57r09j001j021j280j691j538m50Q21
55047A09445J222P32K15J04L6k11k56J34N88P24O82O70N00k8o98j112j074o02
55029A11071J01N82N40L95Q41J694J911J035o0l73j36l12j133j824j632o40M50
55012A12510R63P66L08J37K73K72q3m63m74j92m9l15p64q07p9R83J416Q43jl17
54992A14927l04n52q38m75L48O50J10n27o54m81l71l04k32j90L7O32J056O31k59
$$ plain form
54973 113204 112642 112447 112390 112151 112411 114025 116429 118060 118255 117688 117039 116373 115850 115916 116499 116970 117222 117891
54955 117891 119212 120491 121106 121266 121370 121345 121092 120955 121247 121732 122029 122083 121905 121246 119963 118391 117018 116079
54937 116079 115664 115913 116770 117850 118772 119471 120005 120363 120650 121264 122663 124991 127986 131215 134437 137862
54921 137862 141929 146744 152011 157605 163776 170441 176815 182252 187002 191457 195043 196607 195655 192440
54907 192440 187179 180110 172200 164704 157991 151678 145912 141539 138888 137356 136393 135895 135451 134291 132474
54892 132474 131151 131094 131751 132291 132767 133600 134643 135501 136239 137070 137776 138164 138805 140641 143954 148185 152721
54875 152721 157526 163032 169548 176701 183518 189222 193763 197147 198589 197123 192988 187574 181891 175964
54861 175964 169836 164095 159043 154291 149722 145953 143264 140918 138247 135696 133981 132880 131654 130142
$$ packed form
54973A13204n62j95n7k39K60J614K404J631J95n67o49o66n23O6N83M71K52O69
54955A17891J321J279O15J60J04k5k53j37K92M85K97N4j78o59j283j572j373r39
54937A16079m15K49Q57J080R22O99N34L58K87O14J399K328K995L229L222L425
54921A37862M067M815N267N594O171O665O374N437M750M455L586J564r52l215
54907A92440n261p069p910p496o713o313n766m373k651j532r63m98m44j160j817
54892A32474j323n7O57N40M76Q33J043Q58P38Q31P06L88O41J836L313M231M536
54875A52721M805N506O516P153O817N704M541L384J442j466m135n414n683n927
54861A75964o128n741n052m752m569l769k689k346k671k551j715j101j226j512
$$ plain form
54847 130142 128605 126917 124786 122521 120792 119754 119040 118442 117969 117388 116329 114869 113596 113076 113436 114284
54831 114284 114900 114845 114621 115258 117030 119108 120761 122185 123640 124532 124122 122676 121121 119974 119344 119558
54815 119558 120823 122453 123333 123141 122439 121706 121072 120929 121934 124094 126472 128123 128930 129347 129692 129885 129719
54798 129719 129231 128845 129019 129670 130207 130289 130195 130219 130156 129756 129286 129058 128820 128238 127689 127854 128662 129352 129581 129809
54778 129809 130505 131588 132765 133946 135172 136504 138100 140081 142295 144576 147203 150693 155140 160181
54764 160181 165712 172182 179993 188846 197820 205890 212301 216710 219068 219286 217043 212108 204835 196196
54750 196196 187324 179104 172006 166081 161067 156634 152469 148206 143594 138865 134667 131467 129290 128087
54736 128087 127865 128211 128218 127393 126272 125724 126002 126929 128573 131070 134043 136944 139829 143202 147179 151462
$$ packed form
54847A30142j537j688k131k265j729j038p14n98m73n81j059j460j273n20L60Q48
54831A14284O16n5k24O37J772K078J653J424J455Q92m10j446j555j147o30K14
54815A19558J265J630Q80j92p02p33o34j43J005K160K378J651Q07M17L45J93j66
54798A29719m88l86J74O51N37Q2r4K4o3m00m70k28k38n82n49J65Q08O90K29K28
54778A29809O96J083J177J181J226J332J596J981K214K281K627L490M447N041
54764A60181N531O470P811Q853Q974Q070O411M409K358K18k243m935p273q639
54750A96196q872q220p098n925n014m433m165m263m612m729m198l200k177j203
54736A28087k22L46Pq25j121n48K78R27J644K497K973K901K885L373L977M283
$$ plain form
54720 151462 156098 161597 168169 175320 182273 188366 193006 195740 196509 195498 192702 188031 181839 174981
54706 174981 168276 162208 157078 153009 149816 147241 145275 143840 142299 139933 136986 134637 133688 133720 133774
54691 133774 133405 132761 132027 131281 130723 130616 130919 131157 130725 129378 127401 125308 123370 121607 120238 119770 120363
54674 120363 121356 121862 121721 121459 121454 121614 121863 122379 123163 123806 123964 123796 123701 123802 123900 123807 123536 123223 122988 122920 123091
54653 123091 123508 123962 124047 123548 122843 122603 122946 123197 122720 121734 120972 120787 120988 121379 122020 122940 123949 124825 125496
54634 125496 126051 126711 127663 128746 129423 129254 128255 126693 124859 123302 122848 123847 125551 126719 126776 126039 125048
54617 125048 124151 123669 123872 124677 125673 126457 126719 126244 125275 124725 125441 127190 128806 129377 128905 127884 126748
54600 126748 125830 125328 125060 124541 123590 122658 122433 123205 124638 126033 126906 127421 128121 129145 129976 130153 129853 129412
$$ packed form
54720A51462M636N499O572P151O953O093M640K734P69j011k796m671o192o858
54706A74981o705o068n130m069l193k575j966j435j541k366k947k349r49L2N4
54691A33774l69o44p34p46n58j07L03K38m32j347j977k093j938j763j369m68N93
54674A20363R93N06j41k62nJ60K49N16P84O43J58j68r5J01R8r3k71l13k35o8J71
54653A23091M17M54Q5m99p05k40L43K51m77r86p62j85K01L91O41R20J009Q76O71
54634A25496N55O60R52J083O77j69r99j562j834j557m54R99J704J168N7p37r91
54617A25048q97m82K03Q05R96P84K62m75r69n50P16J749J616N71m72j021j136
54600A26748r18n02k68n19r51r32k25P72J433J395Q73N15P00J024Q31J77l00m41
$$ plain form
54582 129412 128785 128033 127906 129066 130877 131870 131474 130584 130285 130744 131532 132233 132385 131520 129779 128074 127144
54565 127144 126823 126600 126531 127090 128318 129656 130623 131299 132002 132676 132868 132403 131898 132266 133582 134878 135375 135477
54547 135477 136039 136989 137487 137296 137171 137704 138615 139484 140474 141794 142964 143245 142544 141424 140411 139678 139294
54530 139294 139322 139677 140141 140526 140660 140263 139070 137171 135181 133946 133956 134921 135977 136427 136216 135630 134777 133636
54512 133636 132430 131614 131443 131757 132138 132139 131603 131016 131243 132503 133810 133946 132852 131579 130986 131053 131351 131508
54494 131508 131168 130192 129116 128800 129387 130092 130216 129876 129501 129158 128753 128449 128454 128683 128990 129528 130535 131907
54476 131907 133213 134117 134621 135021 135677 136786 138336 140233 142244 143791 144231 143701 143256 143652 144366 144470 144118
54459 144118 144269 145132 145921 146198 146380 146702 146728 146387 146570 147960 149912 151176 151261 150501 149250 147689 146078
$$ packed form
54582A29412o27p52j27J160J811R93l96q90k99M59P88P01J52q65j741j705r30
54565A27144l21k23o9N59J228J338R67O76P03O74J92m65n05L68J316J296M97J02
54547A35477N62R50M98j91j25N33R11Q69R90J320J170K81p01j120j013p33l84
54530A39294K8L55M64L85J34l97j193j899j990j235J0R65J056M50k11n86q53j141
54512A33636j206q16j71L14L81Jn36n87K27J260J307J36j094j273n93O7K98J57
54494A31508l40r76j076l16N87P05J24l40l75l43m05l04NK29L07N38J007J372
54476A31907J306R04N04M00O56J109J550J897K011J547M40n30m45L96P14J04l52
54459A44118J51Q63P89K77J82L22K6l41J83J390J952J264Q5p60j251j561j611
$$ plain form
54442 146078 144599 143070 141255 139314 137673 136632 136310 136607 137007 136845 136116 135616 135954 136796 137428 137641 137680
54425 137680 137758 138078 138961 140442 141999 143155 144134 145539 147583 150028 152581 154934 156615 157251 156907 155916
54409 155916 154573 153200 152184 151656 151440 151526 152209 153412 154347 154393 154006 154198 155313 156775 157926 158623 159146
54392 159146 159842 160851 161868 162285 161791 160655 159289 157888 156712 156279 156810 157782 158435 158541 158309 157862 157255
54375 157255 156821 157001 157914 159341 161025 162798 164680 167060 170397 174515 178576 182090 185413 188909 192152
54360 192152 194520 196080 197218 197770 197181 195299 192396 188736 184765 181397 179316 178101 176710 174681 172217
54345 172217 169392 166145 163002 160848 159837 159237 158512 157848 157441 156963 156059 154848 153650 152628 151892 151608
54329 151608 151876 152820 154735 157621 160562 162233 162209 161289 160381 159666 159054 158787 159036 159417 159429 159170 159111 159316
$$ packed form
54442A46078j479j529j815j941j641j041l22K97M00j62p29n00L38Q42O32K13L9
54425A37680P8L20Q83J481J557J156R79J405K044K445K553K353J681O36l44r91
54409A55916j343j373j016n28k16Q6O83J203R35M6l87J92J115J462J151O97N23
54392A59146O96J009J017M17m94j136j366j401j176m33N31R72O53J06k32m47o07
54375A57255m34J80R13J427J684J773J882K380L337M118M061L514L323L496L243
54360A92152K368J560J138N52n89j882k903l660l971l368k081j215j391k029k464
54345A72217k825l247l143k154j011o00p25o64m07m78r04j211j198j022p36k84
54329A51608K68R44J915K886K941J671k4r20r08p15o12k67K49L81J2k59n9K05
$$ plain form
54311 159316 159300 158602 157177 155281 153280 151640 150846 151095 152026 152844 152869 152072 151039 150393 150356 150874 151856 153045
54293 153045 153906 154038 153706 153676 154500 156089 157885 159233 159683 159227 158293 157317 156381 155447 154766 154759 155503 156581
54275 156581 157437 157729 157450 156931 156613 156635 156735 156732 156841 157270 157707 157648 157151 156903 157534 159042 160824 162115 162599
54256 162599 162804 163699 165696 168223 170424 171888 172486 172084 170932 169862 169454 169305 168752 168001 167784 168154 168402
54239 168402 168090 167362 166338 165041 163992 164020 165202 166616 167373 167330 166734 165840 165101 165040 165617 166196 166403 166497
54221 166497 166729 166868 166643 166119 165413 164500 163530 162829 162399 161895 161307 161061 161283 161626 162064 163081 164610 165529
54203 165529 164942 163448 162401 162275 162460 162433 162346 162454 162575 162337 161648 160836 160402 160568 160967 161053 160859 161012 161773
54184 161773 162564 162825 162933 163703 165221 166700 167459 167526 167311 167046 166648 165877 164642 163301 162518 162586 162966 162772
$$ packed form
54311A59316j6o98j425j896k001j640p94K49R31Q18K5p97j033o46l7N18R82J189
54293A53045Q61J32l32l0Q24J589J796J348M50m56r34r76r36r34o81pP44J078
54275A56581Q56K92k79n19l18K2J00lJ09M29M37n9m97k48O31J508J782J291M84
54256A62599K05Q95J997K527K201J464N98m02j152j070m08j49n53p51k17L70K48
54239A68402l12p28j024j297j049K8J182J414P57m3n96q94p39o1N77N79K07R4
54221A66497K32J39k25n24p06r13r70p01m30n04n88k46K22L43M38J017J529R19
54203A65529n87j494j047j26J85k7q7J08J21k38o89q12m34J66L99Q6j94J53P61
54184A61773P91K61J08P70J518J479P59O7k15k65l98p71j235j341p83O8L80j94
$$ plain form
54166 162772 161678 160159 159007 158750 159371 160315 160875 160819 160508 160253 159809 158817 157508 156545 156241 156367 156668 157140
54148 157140 157737 158239 158622 159239 160332 161558 162282 162257 161814 161353 160883 160204 159361 158679 158368 158352 158606 159387 160891
54129 160891 162793 164447 165477 165941 165988 165696 165222 164731 164160 163427 162957 163529 165331 167560 169288 170533 172135
54112 172135 174662 177669 180014 180849 180445 180041 180648 181996 183016 183402 184222 186701 190902 195980 201279 206468
54096 206468 210862 213416 213635 211996 209304 205974 202201 198429 195254 192936 191320 190273 189921 190301 190966
54081 190966 191308 191390 192164 194495 198022 201322 203242 203792 203699 203510 203353 203180 202811 201876 200037 197349 194252
54064 194252 191312 189070 187839 187344 186713 185238 183170 181438 180566 180241 180000 179936 180429 181475 182689 183878
54048 183878 185211 186758 188283 189740 191685 194795 198983 203415 207492 211477 215988 221149 226541 231846
$$ packed form
54166A62772j094j519j152k57O21R44N60n6l11k55m44r92j309r63l04J26L01M72
54148A57140N97N02L83O17J093J226P24k5m43m61m70o79q43o82l11j6K54P81J504
54129A60891J902J654J030M64M7k92m74m91n71p33m70N72J802K229J728J245J602
54112A72135K527L007K345Q35m04m04O07J348J020L86Q20K479M201N078N299N189
54096B06468M394K554K19j639k692l330l773l772l175k318j616j047l52L80O65
54081A90966L42Q2P74K331L527L300J920N50r3j89j57j73l69r35j839k688l097
54064A94252k940k242j231m95o31j475k068j732q72l25k41o4M93J046J214J189
54048A83878J333J547J525J457J945L110M188M432M077L985M511N161N392N305
$$ plain form
54034 231846 237187 242847 248899 255072 260866 265817 269862 273412 276897 280258 283003 284695 285301 285173 284890
54019 284890 284943 285359 285698 285561 284937 283873 282136 279513 276245 272734 269039 265068 261061 257355 253771 249818
54003 249818 245483 241318 237721 234622 231815 229090 226086 222668 219446 217240 215925 214524 212566 210610
53989 210610 209155 207892 206493 205394 205127 205431 205637 205538 205291 204853 204135 203417 203045 202961 203006 203432 204547 206108
53971 206108 207588 208842 210008 211020 211879 213270 216255 221253 227813 235457 244335 254891 267096 279925
53957 279925 291307 298804 300884 297794 291147 282805 274235 266504 260165 255122 250972 247621 245369 244471
53943 244471 244887 246417 248839 251971 255768 260257 265196 269949 273948 277054 279359 280884 281777 282421 283009
53928 283009 283334 283416 284000 285884 288995 292647 296475 300538 304694 308596 312268 316073 320125 324325 329003
$$ packed form
54034B31846N341N660O052O173N794M951M045L550L485L361K745J692O06j28k83
54019B84890N3M16L39j37o24j064j737k623l268l511l695l971m007l706l584l953
54003B49818m335m165l597l099k807k725l004l418l222k206j315j401j958j956
53989B10610j455j263j399j099k67L04K06r9k47m38p18p18l72q4M5M26J115J561
53971B06108J480J254J166J012Q59J391K985M998O560P644Q878J0556J2205J2829
53957B79925J1382P497K080l090o647q342q570p731o339n043m150l351k252q98
53943B44471M16J530K422L132L797M489M939M753L999L106K305J525Q93O44N88
53928B83009L25Q2N84J884L111L652L828M063M156L902L672L805M052M200M678
$$ plain form
53913 329003 334856 342101 350186 358388 366155 372788 377537 380369 382176 383823 385276 385874 385183 383351 380980
53898 380980 378788 377093 375412 372838 368968 364239 359252 354057 348220 341307 333294 324815 316992 310555
53884 310555 305052 299453 293593 288333 284071 279899 274912 269695 265614 262907 260389 257034 253061 249263
53870 249263 245931 242870 239994 237402 235043 232722 230475 228649 227489 226748 225821 224257 222134 219924 218041
53855 218041 216607 215581 214927 214523 214106 213524 212961 212644 212406 211817 210837 209971 209528 208993 207592 205411 203549
53838 203549 203017 203790 205085 206221 206922 207093 206758 206180 205671 205301 205055 205201 206061 207385 208435 208852 209054
53821 209054 209554 210274 210918 211659 212973 214895 216871 218389 219451 220389 221476 222827 224515 226646 229301
53806 229301 232396 235702 239097 242781 246995 251552 255933 259883 263585 267139 270373 273434 277092 281897
$$ packed form
53913C29003N853P245Q085Q202P767O633M749K832J807J647J453N98o91j832k371
53898C80980k192j695j681k574l870m729m987n195n837o913q013q479p823o437
53884C10555n503n599n860n260m262m172m987n217m081k707k518l355l973l798
53870B49263l332l061k876k592k359k321k247j826j160p41r27j564k123k210j883
53855B18041j434j026o54m04m17n82n63l17k38n89r80q66m43n35j401k181j862
53838B03549n32P73J295J136P01J71l35n78n09l70k46J46Q60J324J050M17K02
53821B09054N00P20O44P41J314J922J976J518J062R38J087J351J688K131K655
53806B29301L095L306L395L684M214M557M381L950L702L554L234L061L658M805
$$ plain form
53792 281897 287245 291811 294847 296670 298012 299357 300917 302732 304536 305752 305837 304559 302045 298714 295070
53777 295070 291322 287226 282509 277341 272211 267424 262994 258929 255274 251932 248756 245873 243569 241822
53763 241822 240202 238381 236470 234680 232781 230145 226376 221933 218016 215718 215209 215817 216774 217597 217853
53748 217853 217140 215609 214071 213168 212704 212121 211369 210836 210699 210850 211294 212074 212875 213227 213102 212900 212850 212891 213091
53729 213091 213709 214777 216032 217320 218654 219866 220653 221104 221823 223363 225780 228822 232218 235675 238836
53714 238836 241358 242937 243350 242687 241459 240227 239313 239096 240193 242783 245985 248648 250772 253516 257749
53699 257749 263171 268908 274324 279106 283242 287159 291332 295431 298419 299807 300312 300916 301737 302256 302268 302077
53683 302077 301992 302016 301914 301354 300152 298592 297251 296352 295526 294393 293064 291843 290800 289926 289418 289470 289950
$$ packed form
53792B81897N348M566L036J823J342J345J560J815J804J216Q5j278k514l331l644
53777B95070l748m096m717n168n130m787m430m065l655l342l176k883k304j747
53763B41822j620j821j911j790j899k636l769m443l917k298n09O08R57Q23K56
53748B17853p13j531j538r03m64n83p52n33j37J51M44P80Q01L52j25k02n0M1K00
53729B13091O18J068J255J288J334J212P87M51P19J540K417L042L396L457L161
53714B38836K522J579M13o63j228j232r14k17J097K590L202K663K124K744M233
53699B57749N422N737N416M782M136L917M173M099K988J388N05O04Q21N19J2j91
53683C02077q5K4j02n60j202j560j341q99q26j133j329j221j043q74n08N2M80
$$ plain form
53666 289950 290559 291115 291511 291642 291604 291743 292224 292718 292736 292089 290854 289188 287405 285964 285110 284723 284747 285506
53648 285506 287240 289475 291254 291976 291807 291353 291171 291538 292429 293636 294978 296470 298318 300750 303704 306627
53632 306627 308799 310122 311418 313608 316726 320135 323593 327499 332080 336967 341763 346429 350863 354618
53618 354618 357445 359669 361693 363525 365141 366936 369365 372358 375465 378389 381149 383959 387130 390749
53604 390749 394298 396982 398698 400241 402284 404597 406575 408014 408928 409203 408947 408713 408708 408224 406593 404337
53588 404337 402597 401678 400947 399987 398935 397751 396087 394067 392335 390993 389249 386543 383431 380867 379035
53573 379035 377439 375823 374453 373576 373019 372364 371326 369993 368808 368271 368507 369176 369887 370581 371417 372399 373329
53556 373329 374073 374678 375147 375297 375001 374561 374615 375548 377103 378746 380257 381784 383417 385073 386775 388697
$$ packed form
53666B89950O09N56L96J31l8J39M81M94J8o47j235j666j783j441q54l87K4P59
53648B85506J734K235J779P22j69m54j82L67Q91J207J342J492J848K432K954K923
53632C06627K172J323J296K190L118L409L458L906M581M887M796M666M434L755
53618C54618K827K224K024J832J616J795K429K993L107K924K760K810L171L619
53604C90749L549K684J716J543K043K313J978J439R14K75k56k34nm84j631k256
53588D04337j740r19p31r60j052j184j664k020j732j342j744k706l112k564j832
53573C79035j596j616j370q77n57o55j038j333j185n37K36O69P11O94Q36R82R30
53556C73329P44O05M69J50k96m40N4R33J555J643J511J527J633J656J702J922
$$ plain form
53540 388697 390872 393189 395758 398865 402445 406059 409660 413943 419579 426484 434195 442564 451593 460977
53526 460977 470428 480268 491046 502642 514428 526292 538868 552574 567017 581623 596371 611613
53514 611613 627574 644423 662572 682433 703967 726760 750589 775601 801893 829015 856039
53503 856039 882078 906728 930054 952269 973552 994115 1014227 1034037 1053435 1072183 1090174
53492 1090174 1107538 1124605 1141735 1159039 1176267 1193149 1209882 1227023 1244875 1263280 1282069
53481 1282069 1301279 1320633 1339227 1356197 1371488 1385545 1398394 1409468 1418267 1424687 1428695 1430138
53469 1430138 1429088 1426057 1421554 1415521 1407347 1396451 1382951 1367878 1352730 1338555 1325334 1312219
53457 1312219 1298357 1283469 1267767 1251467 1234457 1216396 1197136 1177001 1156545 1136178 1116146
$$ packed form
53540C88697K175K317K569L107L580L614L601M283N636O905P711Q369R029R384
53526D60977R451R840J0778J1596J1786J1864J2576J3706J4443J4606J4748J5242
53514F11613J5961J6849J8149J9861K1534K2793K3829K5012K6292K7122K7024
53503H56039K6039K4650K3326K2215K1283K0563K0112J9810J9398J8748J7991
53492A090174J7364J7067J7130J7304J7228J6882J6733J7141J7852J8405J8789
53481A282069J9210J9354J8594J6970J5291J4057J2849J1074Q799O420M008J443
53469A430138j050l031m503o033q174j0896j3500j5073j5148j4175j3221j3115
53457A312219j3862j4888j5702j6300j7010j8061j9260k0135k0456k0367k0032
$$ plain form
53446 1116146 1096737 1078165 1060267 1042776 1025984 1010726 997573 986481 977438 970872 966957 964972
53434 964972 963886 963319 963399 963971 964608 965362 966848 969486 973150 977706 983507 991097 1000664 1011907 1024303
53419 1024303 1037449 1051320 1066367 1083280 1102543 1123977 1146597 1169150 1191296 1214337 1240258
53408 1240258 1269809 1301820 1334592 1367402 1400459 1434167 1469180 1506673 1547615 1591791 1638134
53397 1638134 1685967 1735361 1786431 1838962 1892706 1947410 2002521 2057406 2112001 2166689 2221473
53386 2221473 2275705 2328731 2380252 2429877 2476839 2520515 2560940 2598563 2633621 2665793 2694307
53375 2694307 2718335 2737486 2751937 2761915 2767187 2767280 2762052 2751663 2735969 2714254 2685686 2650053
53363 2650053 2608280 2562309 2514069 2464291 2412684 2359477 2306191 2254360 2204134 2154871 2106544
$$ packed form
53446A116146j9409j8572j7898j7491j6792j5258j3153j1092r043o566l915j985
53434I64972j086n67Q0N72O37P54J486K638L664M556N801P590R567J1243J2396
53419A024303J3146J3871J5047J6913J9263K1434K2620K2553K2146K3041K5921
53408A240258K9551L2011L2772L2810L3057L3708L5013L7493M0942M4176M6343
53397A638134M7833M9394N1070N2531N3744N4704N5111N4885N4595N4688N4784
53386B221473N4232N3026N1521M9625M6962M3676M0425L7623L5058L2172K8514
53375B694307K4028J9151J4451R978N272R3n228j0389j5694k1715k8568l5633
53363B650053m1773m5971m8240m9778n1607n3207n3286n1831n0226m9263m8327
$$ plain form
53352 2106544 2059696 2014448 1970717 1929149 1890556 1854367 1818786 1782719 1746480 1710427 1674176
53341 1674176 1637713 1602130 1568412 1536341 1505341 1475717 1448257 1423243 1400661 1380919 1364440
53330 1364440 1350820 1339107 1328688 1319115 1309284 1297644 1283483 1267480 1250874 1234479 1218574 1203363
53318 1203363 1189216 1176460 1164991 1154235 1143730 1133814 1125481 1119443 1115534 1113134 1111859 1111698 1112763
53305 1112763 1115099 1118603 1123006 1128195 1134549 1142699 1152935 1165192 1179555 1196257 1215099 1235446
53293 1235446 1256961 1279818 1304038 1329209 1355122 1381978 1409529 1436550 1461753 1484875 1506440
53282 1506440 1526762 1545586 1562324 1576235 1586687 1593609 1597462 1598526 1596596 1591563 1583720 1573158
53270 1573158 1559549 1543020 1524622 1505288 1484823 1462603 1438741 1413801 1387877 1360904 1333554
$$ packed form
53352B106544m6848m5248m3731m1568l8593l6189l5581l6067l6239l6053l6251
53341A674176l6463l5583l3718l2071l1000k9624k7460k5014k2582j9742j6479
53330A364440j3620j1713j0419r573r831j1640j4161j6003j6606j6395j5905j5211
53318A203363j4147j2756j1469j0756j0505r916q333o038l909k400j275j61J065
53305A112763K336L504M403N189O354Q150J0236J2257J4363J6702J8842K0347
53293A235446K1515K2857K4220K5171K5913K6856K7551K7021K5203K3122K1565
53282A506440K0322J8824J6738J3911J0452O922L853J064j930n033p843j0562
53270A573158j3609j6529j8398j9334k0465k2220k3862k4940k5924k6973k7350
$$ plain form
53259 1333554 1306779 1280514 1253777 1226166 1198432 1171404 1145109 1119183 1093555 1068386 1043756
53248 1043756 1019658 996043 972738 949554 926459 903461 880496 857765 835978 815726 796772
53237 796772 778488 760837 744283 728837 713977 699653 686633 675519 666002 657423 649624 642774
53225 642774 636632 630425 623425 615431 606735 597660 588069 577373 565136 551534 537076 522121 507021
53212 507021 492493 479339 467790 457549 448338 439961 431964 423885 415917 408713 402417 396412 390156
53199 390156 383664 376954 369650 361531 353054 344918 337452 330664 324518 318837 313348 308136 303699 300168
53185 300168 296912 293363 289876 287167 285156 283018 280376 277785 275867 274415 272684 270310 267664 265411
53171 265411 263848 262728 261645 260533 259662 259157 258732 258063 257269 256745 256585 256401 255728 254482 253057 252084 252057
$$ packed form
53259A333554k6775k6265k6737k7611k7734k7028k6295k5926k5628k5169k4630
53248A043756k4098k3615k3305k3184k3095k2998k2965k2731k1787k0252j8954
53237G96772j8284j7651j6554j5446j4860j4324j3020j1114r517q579p799o850
53225F42774o142o207p000p994q696r075r591j0696j2237j3602j4458j4955j5100
53212E07021j4528j3154j1549j0241r211q377p997q079p968p204o296o005o256
53199C90156o492o710p304q119q477q136p466o788o146n681n489n212m437l531
53185C00168l256l549l487k709k011k138k642k591j918j452j731k374k646k253
53171B65411j563j120j083j112q71n05m25o69p94n24j60j84o73j246j425r73k7
$$ plain form
53154 252057 252913 253964 254441 254238 253937 254004 254142 253627 252201 250425 249116 248578 248441 248123 247392 246594 246391 247124
53136 247124 248310 248949 248532 247675 247492 248409 249898 251320 252555 253675 254531 255083 255791 257169 259045 260701
53120 260701 261705 262231 262662 263337 264654 266894 269721 272301 274139 275463 276523 276873 275847 273620 271327
53105 271327 269966 269390 268526 266520 263591 260786 258973 258128 257579 256774 255670 254500 253493 252865 252811 253252
53089 253252 253731 253744 253136 252099 250925 249916 249345 249248 249274 248967 248240 247406 246761 246353 246267 246800 248071 249561
53071 249561 250375 250050 248856 247209 245070 242237 239038 236319 234661 233952 233861 234375 235533 236889 237690 237678
53055 237678 237359 237340 237626 237798 237700 237726 238356 239581 240898 241795 242179 242340 242587 243033 243633 244346 245096 245683 245840
53036 245840 245507 245006 244842 245170 245528 245284 244405 243577 243407 243686 243750 243398 243050 242995 243002 242911 243170 244336 246226 248039
$$ packed form
53154B52057Q56J051M77k03l01O7J38n15j426j776j309n38j37l18p31p98k03P33
53136B47124J186O39m17q57j83R17J489J422J235J120Q56N52P08J378J876J656
53120B60701J004N26M31O75J317K240K827K580J838J324J060L50j026k227k293
53105B71327j361n76q64k006k929k805j813q45n49q05j104j170j007o28n4M41
53089B53252M79J3o08j037j174j009n71r7K6l07p27q34o45m08q6N33J271J490
53071B49561Q14l25j194j647k139k833l199k719j658p09r1N14J158J356Q01j2
53055B37678l19j9K86J72r8K6O30J225J317Q97L84J61K47M46O00P13P50N87J57
53036B45840l33n01j64L28L58k44q79q28j70K79O4l52l48n5Pr1K59J166J890J813
$$ plain form
53016 248039 249269 250138 251068 252070 252841 253198 253189 252911 252467 252088 252067 252482 253068 253456 253520 253410 253274 253034 252512
52997 252512 251727 250989 250711 251062 251812 252546 253139 253948 255321 257029 258501 259651 260993 262798 264649 266197
52981 266197 267878 270235 272874 274853 275955 276786 277655 278160 278100 277964 278141 278313 278098 277717 277589 277774 278290
52964 278290 279475 281489 283802 285727 287108 288012 288171 287335 285845 284176 282237 279807 277410 275858 274990
52949 274990 273734 271619 269399 267921 266996 265888 264416 263106 262419 262226 261994 261318 260311 259547 259502 260046
52933 260046 260606 260757 260454 259797 258915 258148 257948 258387 258925 258813 257696 255835 253884 252490 251930 252035 252417
52916 252417 252737 252758 252416 251967 251864 252282 252892 253299 253508 253733 253933 253884 253585 253289 253147 253053 252775 252109 251037
52897 251037 249881 249116 248872 248855 248886 249198 249977 251049 252282 253825 255541 256733 256969 256713 256519 256081 254899
$$ packed form
53016B48039J230Q69R30J002P71L57rk78m44l79k1M15N86L88O4j10j36k40n22
52997B52512p85p38k78L51P50P34N93Q09J373J708J472J150J342J805J851J548
52981B66197J681K357K639J979J102Q31Q69N05o0j36J77J72k15l81j28J85N16
52964B78290J185K014K313J925J381R04J59q36j490j669j939k430k397j552q68
52949B74990j256k115k220j478r25j108j472j310o87j93k32o76j007p64m5N44
52933B60046N60J51l03o57q82p67k00M39N38j12j117j861j951j394n60J05L82
52916B52417L20K1l42m49j03M18O10M07K09K25K00m9k99k96j42r4k78o66j072
52897B51037j156p65k44j7L1L12P79J072J233J543J716J192K36k56j94m38j182
$$ plain form
52880 254899 253511 253049 253684 254499 254881 255143 255671 256386 257324 258826 260785 262429 263381 264338 266261 269297 272868
52863 272868 276367 279456 282006 284089 285787 286838 286779 285522 283378 280463 276550 271665 266362 261257 256720
52848 256720 253019 250190 247667 244696 241345 238509 236695 235478 234324 233240 232298 231351 230686 231141 232869
52833 232869 234724 235652 236144 237357 239199 240358 240171 239531 239659 240618 241373 240994 239487 237626 236165 235285
52817 235285 234740 234342 234064 233812 233565 233709 234698 236343 238037 239826 242479 246101 249426 251118 251214 250597 249544
52800 249544 247643 244856 241799 238960 236323 233868 231910 230727 230189 229861 229359 228706 228472 229293 231030 232682
52784 232682 233425 233421 233315 233343 233381 233527 234053 234947 235971 236978 237705 237583 236316 234501 233110 232436 232035 231532
52766 231532 230948 230333 229691 229257 229385 230107 231144 232276 233315 233916 233912 233738 233998 234761 235755 237059 238916 241013
$$ packed form
52880B54899j388m62O35Q15L82K62N28P15R38J502J959J644R52R57J923L036L571
52863B72868L499L089K550K083J698J051n9j257k144k915l913m885n303n105m537
52848B56720l701k829k523k971l351k836j814j217j154j084r42r47o65M55J728
52833B32869J855R28M92J213J842J159j87o40J28R59P55l79j507j861j461q80
52817B35285n45l98k78k52k47J44R89J645J694J789K653L622L325J692R6o17j053
52800B49544j901k787l057k839k637k455j958j183n38l28n02o53k34Q21J737J652
52784B32682P43mj06K8L8J46N26Q94J024J007P27j22j267j815j391o74m01n03
52766B31532n84o15o42m34J28P22J037J132J039O01mj74K60P63R94J304J857K097
$$ plain form
52748 241013 242707 244050 245841 248444 251193 253232 254411 255124 255786 256748 258220 259965 261413 262332 262972
52733 262972 263404 263273 262553 262007 262324 263138 263510 263220 262997 263429 264178 264431 263788 262461 260873 259338 258046
52716 258046 257037 256143 255087 253866 252925 252841 253795 255439 257169 258431 258857 258433 257578 256757 255951 254766 253137
52699 253137 251668 251097 251639 252877 254067 254518 254149 253742 254208 255405 256196 255881 254916 253935 252825 251433 250461
52682 250461 250717 251835 252665 252717 252363 251794 250731 249187 247619 246235 244964 244186 244573 245955 247181 247469
52666 247469 247204 247048 247054 247159 247844 249572 251998 254371 256481 258671 261138 263727 266332 269057 271962 274900
52650 274900 277571 279585 280614 280623 279790 278159 275657 272599 269788 267827 266561 265475 264388 263429 262562 261575
52634 261575 260578 260161 260893 262766 265200 267582 269848 272524 276202 280906 285935 290160 292517 292474 290314
$$ packed form
52748B41013J694J343J791K603K749K039J179P13O62R62J472J745J448R19O40
52733B62972M32j31p20n46L17Q14L72k90k23M32P49K53o43j327j588j535j292
52716B58046j009q94j056j221r41q4R54J644J730J262M26m24q55q21q06j185j629
52699B53137j469n71N42J238J190M51l69m07M66J197P91l15r65r81j110j392r72
52682B50461K56J118Q30N2l54n69j063j544j568j384j271p78L87J382J226K88
52666B47469k65j56OJ05O85J728K426K373K110K190K467K589K605K725K905K938
52650B74900K671K014J029Rq33j631k502l058k811j961j266j086j087r59q67r87
52634B61575r97m17P32J873K434K382K266K676L678M704N029M225K357m3k160
$$ plain form
52619 290314 286811 282507 277528 272258 267749 264894 263467 262613 262125 262502 263732 264838 264937 264169 263314 263000
52603 263000 263516 264809 266323 267279 267522 267712 268351 269054 269092 268269 266886 265249 263665 262588 262285 262541 263013
52586 263013 263635 264387 265015 265350 265618 266069 266643 267376 268672 270604 272293 272698 271876 270802 270019 269226 268220
52569 268220 267479 267434 267656 267287 266098 264767 264120 264288 264685 264740 264478 264288 264298 264338 264435 264802 265193 264927 263978 263437
52549 263437 264163 265405 265659 264725 263956 264346 265264 265465 264645 263533 262929 263102 263743 264142 263710 262712 262146 262574
52531 262574 263464 264116 264741 265973 267615 268689 268792 268569 268672 268855 268514 267626 266677 266018 265771 266144 267342
52514 267342 269169 271121 272896 274602 276515 278979 282416 286955 291908 296031 298513 299463 299261 297857 295067
52499 295067 291278 287362 283900 280831 277906 275141 272732 270752 269138 267880 267006 266380 265605 264342 262821
$$ packed form
52619B90314l503m304m979n270m509k855j427q54m88L77J230J106R9p68q55l14
52603B63000N16J293J514R56K43J90O39P03L8q23j383j637j584j077l03K56M72
52586B63013O22P52O28L35K68M51N74P33J296J932J689M05q22j074p83p93j006
52569B68220p41m5K22l69j189j331o47J68L97N5k62j90J0M0R7L67L91k66r49n41
52549B63437P26J242K54r34p69L90R18K01q20j112o04J73O41L99m32r98n66M28
52531B62574Q90O52O25J232J642J074J03k23J03J83l41q88r49o59k47L73J198
52514B67342J827J952J775J706J913K464L437M539M953M123K482R50k02j404k790
52499B95067l789l916l462l069k925k765k409j980j614j258q74o26p75j263j521
$$ plain form
52484 262821 261896 262302 263795 265260 265783 265451 265073 265391 266720 268963 271603 273851 275187 275831 276459 277597
52468 277597 279394 281761 284387 286799 288785 290704 293091 296022 299133 302127 304917 307283 308761 308942
52454 308942 307715 305321 302327 299281 296175 292527 288346 284573 282042 280354 278495 276283 274350 272885
52440 272885 271425 269984 269285 269560 270036 270098 270132 270638 271254 271367 271082 270846 270591 270036 269449 269313 269470 269430 269412
52421 269412 270211 271948 273701 274655 275118 276038 277851 280144 282295 284179 286191 288752 291937 295737 300537
52406 300537 307024 315519 325671 336877 348630 360170 370118 376822 379051 376360 369237 359265 348695
52393 348695 339279 331415 324697 319031 314829 312234 310711 309559 308536 307823 307537 307489 307455 307610 308461 310160
52377 310160 312095 313546 314663 316295 318834 321876 325237 329593 335585 342706 349625 355300 359382 361875
$$ packed form
52484B62821r25M06J493J465N23l32l78L18J329K243K640K248J336O44O28J138
52468B77597J797K367K626K412J986J919K387K931L111K994K790K366J478J81
52454C08942j227k394k994l046l106l648m181l773k531j688j859k212j933j465
52440B72885j460j441o99K75M76O2L4N06O16J13k85k36k55n55n87j36J57m0j8
52421B69412P99J737J753R54M63R20J813K293K151J884K012K561L185L800M800
52406C00537O487Q495J0152J1206J1753J1540R948O704K229k691p123r972j0570
52393C48695r416p864o718n666m202k595j523j152j023p13k86m8l4J55Q51J699
52377C10160J935J451J117J632K539L042L361M356N992P121O919N675M082K493
$$ plain form
52363 361875 363021 363267 362856 361557 359238 356464 354099 352511 351617 351419 351927 352745 353329 353618 353929 354358 354777
52346 354777 355358 356557 358611 361468 365095 369390 373901 378178 382374 387056 392500 398638 405490 413031
52332 413031 420772 428221 435807 444628 455186 467011 479646 493297 508298 524626 542254 561387
52320 561387 581931 603186 624440 645509 666452 687194 707679 727994 748015 767379 786112
52309 786112 804877 824223 843950 863531 882745 901437 919125 935443 950792 965953 981111
52298 981111 995699 1009101 1021005 1031018 1038492 1043011 1044751 1044055 1040846 1034767 1025972 1015542 1004870
52285 1004870 994665 984723 974665 964628 955105 946448 938871 932755 928542 926358 926116 927915 931901
52272 931901 937742 944777 952807 962289 973496 985926 998759 1011558 1024323 1037193 1050407 1064207
$$ packed form
52363C61875J146K46m11j299k319k774k365j588q94j98N08Q18N84K89L11M29M19
52346C54777N81J199K054K857L627M295M511M277M196M682N444O138O852P541
52332D13031P741P449P586Q821J0558J1825J2635J3651J5001J6328J7628J9133
52320E61387K0544K1255K1254K1069K0943K0742K0485K0315K0021J9364J8733
52309G86112J8765J9346J9727J9581J9214J8692J7688J6318J5349J5161J5158
52298I81111J4588J3402J1904J0013P474M519J740o96l209o079q795j0430j0672
52285A004870j0205r942j0058j0037r523q657p577o116m213k184k42J799L986
52272I31901N841P035Q030R482J1207J2430J2833J2799J2765J2870J3214J3800
$$ plain form
52260 1064207 1078477 1092735 1106763 1120962 1135749 1150902 1165847 1180397 1194750 1208898 1222407
52249 1222407 1234700 1245150 1253029 1257783 1259383 1258016 1253428 1245144 1233581 1220484 1207682 1195498
52237 1195498 1182802 1168678 1153641 1138968 1125166 1111600 1097607 1083477 1070117 1058075 1047286
52226 1047286 1037467 1028315 1019419 1010521 1001949 994418 988273 983284 979247 976306 974505 973434 972775 972945
52212 972945 974712 978192 982610 987142 991722 996863 1002808 1009061 1014757 1019364 1022885 1025596 1027874 1030293
52198 1030293 1033403 1037136 1040786 1044052 1047755 1052986 1059670 1066680 1073346 1080023 1086945 1093375 1098439 1102159
52184 1102159 1104933 1106388 1105549 1102088 1096702 1090152 1082499 1073478 1063255 1052534 1042095 1032410 1023613
52171 1023613 1015705 1008805 1003255 999448 997490 996944 996859 996286 995093 994283 995168 998045 1001954 1005790 1009289
$$ packed form
52260A064207J4270J4258J4028J4199J4787J5153J4945J4550J4353J4148J3509
52249A222407J2293J0450P879M754J600j367m588q284j1563j3097j2802j2184
52237A195498j2696j4124j5037j4673j3802j3566j3993j4130j3360j2042j0789
52226A047286r819r152q896q898q572p531o145m989m037k941j801j071o59J70
52212I72945J767L480M418M532M580N141N945O253N696M607L521K711K278K419
52198A030293L110L733L650L266L703N231O684P010O666O677O922O430N064L720
52184A102159K774J455q39l461n386o550p653r021j0223j0721j0439r685q797
52171A023613p908o900n550l807j958n46q5n73j193q10Q85K877L909L836L499
$$ plain form
52156 1009289 1012686 1015887 1018499 1020472 1022130 1023496 1024066 1023458 1022111 1021175 1021735 1024041 1027367 1030651 1033399
52141 1033399 1035896 1038505 1040980 1042738 1043638 1044098 1044507 1044901 1045390 1046638 1049634 1055051 1062883 1072673 1084142
52126 1084142 1097653 1114090 1134139 1157673 1183871 1211961 1241750 1273392 1306737 1340976 1374962
52115 1374962 1407814 1439176 1468904 1496663 1521978 1544584 1564494 1581714 1596090 1607489 1615987
52104 1615987 1621903 1625900 1629040 1632376 1636290 1640344 1643863 1646405 1647582 1646782 1643395 1637138 1627990 1616040
52090 1616040 1601543 1584857 1566027 1544751 1521114 1496198 1471609 1448562 1427690 1409440 1394093
52079 1394093 1381477 1371158 1362953 1356931 1353040 1351292 1352236 1356635 1364409 1374444 1385732 1398298 1412680
52066 1412680 1428870 1446125 1463546 1480453 1496485 1511843 1527294 1543371 1559459 1574173 1586788
$$ packed form
52156A009289L397L201K612J973J658J366N70o08j347r36N60K306L326L284K748
52141A033399K497K609K475J758R00M60M09L94M89J248K996N417P832R790J1469
52126A084142J3511J6437K0049K3534K6198K8090K9789L1642L3345L4239L3986
52115A374962L2852L1362K9728K7759K5315K2606J9910J7220J4376J1399Q498
52104A615987N916L997L140L336L914M054L519K542J177q00l387o257r148j1950
52090A616040j4497j6686j8830k1276k3637k4916k4589k3047k0872j8250j5347
52079A394093j2616j0319q205o022l891j748R44M399P774J0035J1288J2566J4382
52066A412680J6190J7255J7421J6907J6032J5358J5451J6077J6088J4714J2615
$$ plain form
52055 1586788 1597990 1608948 1619959 1630266 1638952 1645554 1649877 1651635 1650450 1645932 1637617 1625123 1608621
52042 1608621 1588971 1567136 1543614 1518724 1493258 1468370 1444720 1422096 1400017 1378438 1357759
$$ packed form
52055A586788J1202J0958J1011J0307Q686O602M323J758j185m518q315j2494j6502
52042A608621j9650k1835k3522k4890k5466k4888k3650k2624k2079k1579k0679
$$ [...]
##END NTUPLES=NMR SPECTRUM
##END=
