
##TITLE=AC1324_UGAAH12153_7163909_z8CT513T2h
##JCAMPDX= 6.0         $$ Bruker NMR JCAMP-DX V2.0
##DATA TYPE= NMR SPECTRUM
##DATA CLASS= NTUPLES
##ORIGIN= BRUKER
##OWNER= Administrator
$$ 1.72 TOPSPIN		Version 2.1
$$ 2012-12-01 13:41:30.552 -0500  Administrator@X
$$ Compression mode = diff/dup
##.OBSERVE FREQUENCY= 400.02188249412
##.OBSERVE NUCLEUS= ^1H
##.ACQUISITION MODE= SIMULTANEOUS (DQD)
##.ACQUISITION SCHEME= undefined
##.AVERAGES= 64
##.DIGITISER RES= 22
##SPECTROMETER/DATA SYSTEM= spect
##.PULSE SEQUENCE= noesygpps1d.comp
##.SOLVENT NAME= COFFEE_meoh
##.SHIFT REFERENCE= INTERNAL, COFFEE_meoh, 1, 14.96263
##AUDIT TRAIL= $$ (NUMBER, WHEN, WHO, WHERE, PROCESS, VERSION, WHAT)
$$ ##TITLE= Audit trail, TOPSPIN		Version 2.1
$$ ##JCAMPDX= 5.01
$$ ##ORIGIN= Bruker BioSpin GmbH
$$ ##OWNER= Administrator
$$ $$ E:\/data/COFFEE/nmr/AC1324_UGAAH12153_7163909_z8CT513T2h/12/pdata/1/auditp.txt
$$ ##AUDIT TRAIL=  $$ (NUMBER, WHEN, WHO, WHERE, PROCESS, VERSION, WHAT)
(   1,<2012-12-01 13:41:25.848 -0500>,<Administrator>,<X>,<go>,<TOPSPIN 2.1>,
      <created by zg
	started at 2012-12-01 13:29:56.760 -0500,
	POWCHK enabled, PULCHK disabled,
       configuration hash MD5:
       86 BA 57 50 F2 9D 5C 9B 26 00 A9 28 5F 66 2E 89
       data hash MD5: 64K
       46 A8 0F FE 17 24 EF 61 55 F0 A0 81 44 4B B4 EB>)
(   2,<2012-12-01 13:41:28.328 -0500>,<Administrator>,<X>,<proc1d>,<TOPSPIN 2.1>,
      <Start of raw data processing
       efp LB = 0.3 FT_mod = 6 PKNL = 1 PHC0 = 0 PHC1 = 0 SI = 128K 
       data hash MD5: 128K
       D7 66 8F 1E 26 73 6E 39 36 37 51 A9 51 6E AD 13>)
(   3,<2012-12-01 13:41:29.203 -0500>,<Administrator>,<X>,<proc1d>,<TOPSPIN 2.1>,
      <pk PHC0 = -79.59595 PHC1 = 0 
       data hash MD5: 128K
       7B FF 6E B1 FE 38 57 7C 34 47 4E 15 B4 41 DE 18>)
(   4,<2012-12-01 13:41:29.737 -0500>,<Administrator>,<X>,<proc1d>,<TOPSPIN 2.1>,
      <abs ABSG = 1 
       data hash MD5: 128K
       C1 57 6E 75 24 E6 85 51 01 E9 F2 27 A1 F6 F6 D7>)
(   5,<2012-12-01 13:41:29.871 -0500>,<Administrator>,<X>,<proc1d>,<TOPSPIN 2.1>,
      <abs ABSG = 2 
       data hash MD5: 128K
       94 5A 93 51 36 5F A0 88 12 30 74 50 30 8D 4B 78>)
(   6,<2012-12-01 13:41:30.005 -0500>,<Administrator>,<X>,<proc1d>,<TOPSPIN 2.1>,
      <abs ABSG = 3 
       data hash MD5: 128K
       1E 08 24 B1 3B 36 FD BD 4E 45 99 54 32 CF 6A CB>)
(   7,<2012-12-01 13:41:30.151 -0500>,<Administrator>,<X>,<proc1d>,<TOPSPIN 2.1>,
      <abs ABSG = 4 
       data hash MD5: 128K
       90 A8 94 0A CD 7C D7 D4 70 28 17 0B AA 64 88 14>)
(   8,<2012-12-01 13:41:30.297 -0500>,<Administrator>,<X>,<proc1d>,<TOPSPIN 2.1>,
      <abs ABSG = 5 
       data hash MD5: 128K
       BC FB 6E 00 DE FB 9A 59 B6 77 BE 3A 56 8B 38 E7>)
$$ ##END=
$$ 
$$ $$ hash MD5
$$ $$ C9 BE 52 6D B6 26 17 5D 4E D5 4C 18 F9 CC 64 01
##$RELAX= 
##$RELAX= 
##$RELAX= 
##$RELAX= 
##$RELAX= 
##$RELAX= 
##$RELAX= 
##$RELAX= 
$$ Bruker specific parameters
$$ --------------------------
##$DU= <E:\>
##$EXPNO= 12
$$ [...]
##$TP07= 0
##$TPNAME0= <>
##$TPNAME1= <>
##$TPNAME2= <>
##$TPNAME3= <>
##$TPNAME4= <>
##$TPNAME5= <>
##$TPNAME6= <>
##$TPNAME7= <>
##$TPOAL= (0..7)
0.5 0.5 0.5 0.5 0.5 0.5 0.5 0.5
##$TPOFFS= (0..7)
0 0 0 0 0 0 0 0
##$TUNHIN= 0
##$TUNHOUT= 0
##$TUNXOUT= 0
##$USERA1= <user>
##$USERA2= <user>
##$USERA3= <user>
##$USERA4= <user>
##$USERA5= <user>
##$V9= 5
##$VALIST= <valist>
##$VCLIST= <CCCCCCCCCCCCCCC>
##$VD= 0
##$VDLIST= <DDDDDDDDDDDDDDD>
##$VPLIST= <PPPPPPPPPPPPPPP>
##$VTLIST= <TTTTTTTTTTTTTTT>
##$WBST= 1024
##$WBSW= 4
##$XGAIN= (0..3)
0 0 0 0
##$XL= 0
##$YL= 0
##$YMAX_a= 8012759
##$YMIN_a= -17566780
##$ZGOPTNS= <>
##$ZL1= 120
##$ZL2= 120
##$ZL3= 120
##$ZL4= 120
##$ABSF1= 14.96263
##$ABSF2= -5.595551
##$ABSG= 5
##$ABSL= 3
##$ALPHA= 0
##$AQORDER= 0
##$ASSFAC= 0
##$ASSFACI= 0
##$ASSFACX= 0
##$ASSWID= 0
##$AUNMP= <proc_prof1d_extract.lims>
##$AXLEFT= 0
##$AXNAME= <>
##$AXNUC= <1H>
##$AXRIGHT= 0
##$AXTYPE= 0
##$AXUNIT= <>
##$AZFE= 0.1
##$AZFW= 0.1
##$BCFW= 0
##$BC_mod= 0
##$BYTORDP= 0
##$COROFFS= 0
##$CY= 15
##$DATMOD= 1
##$DC= 0
##$DFILT= <>
##$DTYPP= 0
##$F1P= 0
##$F2P= 0
##$FCOR= 0.5
##$FTSIZE= 131072
##$FT_mod= 6
##$GAMMA= 0
##$GB= 0
##$INTBC= 1
##$INTSCL= 1
##$ISEN= 128
##$LB= 0.3
##$LEV0= 0
##$LPBIN= 0
##$MAXI= 10000
##$MC2= 0
##$MEAN= 0
##$ME_mod= 0
##$MI= 0
##$NCOEF= 0
##$NC_proc= -2
##$NLEV= 6
##$NOISF1= 0
##$NOISF2= 0
##$NSP= 0
##$NTH_PI= 0
##$NZP= 0
##$OFFSET= 14.96263
##$PC= 1
##$PHC0= -79.59595
##$PHC1= 0
##$PH_mod= 1
##$PKNL= yes
##$PPARMOD= 0
##$PPDIAG= 0
##$PPIPTYP= 0
##$PPMPNUM= 2147483647
##$PPRESOL= 1
##$PSCAL= 4
##$PSIGN= 0
##$PYNMP= <proc.py>
##$REVERSE= no
##$SF= 400.020008983338
##$SI= 131072
##$SIGF1= 0
##$SIGF2= 0
##$SINO= 400
##$SIOLD= 131072
##$SPECTYP= <>
##$SREGLST= <1H.CDCl3>
##$SSB= 0
##$STSI= 131072
##$STSR= 0
##$SW_p= 8223.68421052631
##$SYMM= 0
##$S_DEV= 0
##$TDeff= 65536
##$TDoff= 0
##$TI= <>
##$TILT= no
##$TM1= 0
##$TM2= 0
##$TOPLEV= 0
##$USERP1= <user>
##$USERP2= <user>
##$USERP3= <user>
##$USERP4= <user>
##$USERP5= <user>
##$WDW= 1
##$XDIM= 131072
##$YMAX_p= 467613136
##$YMIN_p= -10856
##$CURPLOT= <Network HP LaserJet P1505>
##$CURPRIN= <$Network HP LaserJet P1505>
##$DFORMAT= <normdp>
##$LAYOUT= <+/1D_H.xwp>
##$LFORMAT= <normlp>
##$PFORMAT= <normpl>
##$SURQMSG= 1
$$ End of Bruker specific parameters
$$ ---------------------------------
##NTUPLES= NMR SPECTRUM
##VAR_NAME=  FREQUENCY,     SPECTRUM/REAL,   SPECTRUM/IMAG
##SYMBOL=    X,             R,               I
##VAR_TYPE=  INDEPENDENT,   DEPENDENT,       DEPENDENT
##VAR_FORM=  AFFN,          ASDF,            ASDF
##VAR_DIM=   131072,        131072,          131072
##UNITS=     HZ,            ARBITRARY UNITS, ARBITRARY UNITS
##FACTOR=    0.0627417313425164, 1,          1
##FIRST=     8223.62146879497, 4318,         -58362
##LAST=      0,             4472,            -58054
##MIN=       0,             -10856,          0
##MAX=       8223.62146879497, 467613136,    0
$$ Real data points
##PAGE= N=1
##DATA TABLE= (X++(R..R)), XYDATA
$$ [...]
60980C246153K59159L07768L67865M42633N37866O56413P99922R76099J197292
$$ 3246153 3505312 3813080 4180945 4623578 5161444 5817857 6617779 7593878 8791170
60971H791170J471572J802019K186977K590893K895808K910146K486216J667465
$$ 8791170 10262742 12064761 14251738 16842631 19738439 22648585 25134801 26802266
60963B6802266P10402o6874m73315n01118k42759J88181O41561Q98177P42358
$$ 26802266 27512668 27445794 26972479 26471361 26228602 26416783 27058344 27956521 28698879
60954B8698879J16981p99838j696908k323708k603912k602807k428939k171386
$$ 28698879 28815860 28016022 26319114 23995406 21391494 18788687 16359748 14188362
60946A4188362j890246j622200j382007j169362r81802q20079o83849n69673m75113
$$ 14188362 12298116 10675916 9293909 8124547 7142745 6322666 5638817 5069144 4594031
60937D594031m00077l42836k98574k63188k35308k13623j95334j78481j63194
$$ 4594031 4193954 3851118 3552544 3289356 3054048 2840425 2645091 2466610 2303416
60928B303416j49599j36577j23487j10942r9186q7777p7540p0562o7295o5585
$$ 2303416 2153817 2017240 1893753 1782811 1683625 1595848 1518308 1447746 1380451 1314866
60918A314866o3481o1168n9166n6523n2145m6601m1294l6830l3070k9946k7301
$$ 1314866 1251385 1190217 1131051 1074528 1022383 975782 934488 897658 864588 834642 807341
60907H07341k4691k1978j9500j7309j5016j2655j0841r827r197q708q453q218
$$ 807341 782650 760672 741172 723863 708847 696192 685351 675524 666327 657619 649166 640948
60895F40948p645p106p206p346o168l723j788j483j779j165L52J747K559L103
$$ 640948 633303 626197 618991 611645 605477 601754 599966 598483 596704 595539 595891 597638 600197 603300
60881F03300L546L658L279K617K135K233K838L480M041N074O792Q244Q300P178
$$ 603300 606846 610504 613783 616400 618535 620768 623606 627086 631127 636201 642993 651237 659537 666715
60867F66715O006N166M146K797J547M29r07k260l101l727m962o646p636p519p041
$$ 666715 672721 677887 682033 684830 686377 686806 685899 683639 680538 676811 671849 665203 657567 650048 643007
60852F43007o698o116n178m449m081l383j973k70J515L746O293Q233R200R968
$$ 643007 636309 630193 625015 620566 616485 613102 611129 610859 612374 616120 622413 630646 639846 649814
60838F49814J1101J1998J1948J1209J0315R204P757O493O031O362P259Q785J0818
$$ 649814 660915 672913 684861 696070 706385 715589 723346 729839 735870 742232 749491 758276 769094
60825G69094J2606J3352J2915J1624R890Q313P484P382P340O873O041M938L569
$$ 769094 781700 795052 807967 819591 829481 837794 845278 852660 860000 866873 872914 877852 881421
60812H81421K358J979K381K734K626K479K490K048O48j322l301n346p740j0353
$$ 881421 883779 885758 888139 890873 893499 895978 898468 900516 901164 899842 896541 891195 883455 873102
60798H73102j2852j5027j6615j7317j7296j7089j6842j6184j4999j3619j2096
$$ 873102 860250 845223 828608 811291 793995 776906 760064 743880 728881 715262 703166
60787G03166j0152p999o317n115l629j651N6J099K168L724N145N864O419P477
$$ 703166 693014 685015 678698 673583 669954 668303 668359 669458 671626 675350 680495 686359 692778 700255
60773G00255Q663R321R657J0189J0653J0561J0271J0417J0602R822P980O000M397
$$ 700255 708918 718239 727896 738085 748738 759299 769570 779987 790589 800411 808391 814391 818788
60760H18788K772Q85o05r22k63M05N22O31J729L947O258P697Q567R808J1451J2566
$$ 818788 821560 822445 821840 820918 820655 821060 821582 822213 823942 827889 834147 841844 850411 860219 871670 884236
60744H84236J2721J2446J1957J0567P975N157L140J633j55j866k380j520m22j28
$$ 884236 896957 909403 921360 931927 939902 945059 948199 949832 949677 947811 945431 943911 943489 943361
60730I43361o12j305j899k457l243m544o359q180r341r645r368q747p766o434
$$ 943361 942749 941444 939545 937088 933845 929301 922942 914762 905421 895776 886408 877661 869895 863461
60716H63461n037m000l648m033m874n773o500p115p764q536r411j0220j0673j0691
$$ 863461 858424 854424 850776 846743 841869 836096 829596 822481 814717 806181 796770 786550 775877 765186
60702G65186j0560j0460j0059q996p556o272n006l129n97J932M129O319Q545J0134
$$ 765186 754626 744166 734107 725111 717555 711283 706277 703148 702551 704483 708612 714931 723476 733610
60688G33610J0668J0627J0549J0157Q914O960M905K968R16j453m109o941r734
$$ 733610 744278 754905 765454 775611 784525 791485 796390 799358 800274 798821 794712 787771 778037
60675G78037j2218j4279j5866j6613j6097j4611j3127j2183j1344j0079q505o877
$$ 778037 765819 751540 735674 719061 702964 688353 675226 663043 651699 641620 633115 626238
60663F26238n020k896j187n63o83n94L7O59O56j6q88j354j085m19j5j1J77Q92
$$ 626238 621218 618322 617135 616572 615889 615295 615332 615991 616647 616631 615743 614389 613304 612885 612870 612859 613036 613928
60645F13928J592J668J350J209J144O90M3p3L66N10o0n35J0J223J873J583J406
$$ 613928 615520 617188 618538 619747 620891 621581 621624 621551 621917 622427 622367 621832 621842 623065 624938 626521 627927
60628F27927K438M384O066P084Q161R829J1550J2679J3545J4843J6435J7621J8373
$$ 627927 630365 634749 640815 647899 656060 665889 677439 690118 703663 718506 734941 752562 770935
60615G70935J9304K0427K0888K0156J8756J7525J6738J6110J5130J3265J0418
$$ 770935 790239 810666 831554 851710 870466 887991 904729 920839 935969 949234 959652
60604I59652P307M799K857P35j839m500p205j0309j3522j5898j7188j8176j9144
$$ 959652 966959 971758 974615 975350 973511 969011 961806 951497 937975 922077 904889 886713 867569
60591H67569j9137j7484j5077j3223j1925j0238p808n187k993j525q93r29j124
$$ 867569 848432 830948 815871 802648 790723 780485 772677 767490 764497 762972 762079 761150 760026
60578G60026j136j163j440j869k356k952l331k904j891j372j661j542L9K343L863
$$ 760026 758890 757727 756287 754418 752062 749110 745779 742875 740984 739612 737951 736409 736448 738791 742654
60563G42654M308M422M470M207L897M119M600M464L638K992K933K932K601K353
$$ 742654 746962 751384 755854 760061 763958 768077 772677 777141 780779 783771 786704 789636 792237 794590
60549G94590K614L240M006N060O487P933R041R973J1321J3668J7290K1966K7104
$$ 794590 797204 800444 804450 809510 815997 823930 832971 842944 854265 867933 885223 907189 934293
60536I34293L2214L7173M1690M4745M5009M1780L5220K5953J4903L282p855j7988
$$ 934293 966507 1003680 1045370 1090115 1135124 1176904 1212124 1238077 1252980 1256262 1248407 1230419
60524A230419k6567l2460l4688l3676l0953k7497k3061j7316j0909m973JM259
$$ 1230419 1203852 1171392 1136704 1103028 1072075 1044578 1021517 1004201 993292 988319 988320 992579
60512I92579Q092J1436J4061J5816J6595J6288J4977J3269J2313J3144J5942K0144
$$ 992579 1000671 1012107 1026168 1041984 1058579 1074867 1089844 1103113 1115426 1128570 1144512 1164656
60500A164656K5303L1476L8693M6691N5559O6084P8942R3937J10689J29693J51792
$$ 1164656 1189959 1221435 1260128 1306819 1362378 1428462 1507404 1601341 1712030 1841723 1993515
60489A993515J76770K03408K31097K60604K92866L27536L62497L93530M13537
$$ 1993515 2170285 2373693 2604790 2865394 3158260 3485796 3848293 4241823 4655360
60480D655360M13139L84066L23181K33570J22355j377j26545k40064l29715l88606
$$ 4655360 5068499 5452565 5775746 6009316 6131671 6130294 6003749 5763685 5433970 5045364
60470E045364m16969m19796m03477l74483l39239l02945k68125k35238k04799
$$ 5045364 4628395 4208599 3805122 3430639 3091400 2788455 2520330 2285092 2080293
60461B080293j78059j55595j36441j19277j03709q9924p7835o7245n8287n1021
$$ 2080293 1902234 1746639 1610198 1490921 1387212 1297288 1219453 1152208 1093921 1042900
60451A042900m4966l9621l5088l1635k8988k6706k4874k3715k2773k1175j8820
$$ 1042900 997934 958313 923225 891590 862602 835896 811022 787307 764534 743359 724539
60440G24539j6573j5201j4528j3866j2884j1791j0857j0020r026p831o667n687
$$ 724539 707966 692765 678237 664371 651487 639696 628839 618819 609793 601962 595295 589608
60428E89608m746l705k743k058j518j011q29j156j334m60J326K921L717M149M677
$$ 589608 584862 581157 578414 576356 574838 573827 572998 571842 570508 570048 571374 574295 578012 582161 586838
60413E86838N122N333N608O000N978N301M508M049L673L245L352M345N442N561
$$ 586838 591960 597293 602901 608901 614879 620180 624688 628737 632410 635655 639007 643352 648794 654355
60399F54355M651L518K800K742L458M678N632N850N705N651N457M848M290M350
$$ 654355 659006 662524 665324 668066 671524 676202 681834 687684 693389 699040 704497 709345 713635 717985
60385G17985M656M421L559K588J689P05k76j124k156l614m898n147m432l603l060
$$ 717985 722641 727062 730621 733209 734898 735603 735327 734203 732047 728433 723535 718388 713956 710353 707293
60370G07293k448j484l94M49Q21O24J52J17R30K105K925L396L945M529M754M720
$$ 707293 704845 703361 702967 703416 704237 704861 705013 705130 706060 708165 711090 714486 718431 722960 727714 732434
60354G32434M941N529O068O308O457O846P623Q655R470R671R640J0186J1133J1080
$$ 732434 737375 742904 748972 755280 761737 768583 776206 784861 794331 804002 813642 823828 834961 846041
60340H46041R326P164O208O146N380L479J601N86K8n24o13M64K779N915R420J2839
$$ 846041 855367 862531 868739 874885 880265 883744 885345 885931 885959 885435 884822 885286 888065 893980 903400 916239
60324I16239J5831J8284K0000K0377J8820J5375J0487M562j826p718j2457j6212
$$ 916239 932070 950354 970354 990731 1009551 1024926 1035413 1039975 1038149 1030431 1017974 1001762
60312A001762j9133k0605k0127j8444j6679j4885j2576j0196q681p804o462m584
$$ 1001762 982629 962024 941897 923453 906774 891889 879313 869117 860436 852632 846170 841586
60300H41586l286k979k763k005j093k20J188L127M377M111L144K669K554J889
$$ 841586 838300 835321 832558 830553 829460 829240 830428 833555 837932 842043 845187 847856 850410 852299
60286H52299O11m09o87o78r88j683k420k916l126l075k605j491R1J487K281K846
$$ 852299 852910 852501 851814 851136 850148 848465 846045 843129 840003 836928 834323 832832 832923 834410 836691 839537
60270H39537L809N152O418P481Q597R838J1060J2268J3450J4400J5294J7047K0190
$$ 839537 843346 848498 854916 862397 870994 880832 891892 904160 917610 932010 947304 964351 984541
60257I84541K3719K6248K8070L0859L5185L9710M3197M6237N0244N5648O1824
$$ 984541 1008260 1034508 1062578 1093437 1128622 1168332 1211529 1257766 1308010 1363658 1425482
60246A425482O8209P4824Q1968Q9775R7915J05597J12191J17806J22771J26530
$$ 1425482 1493691 1568515 1650483 1740258 1838173 1943770 2055961 2173767 2296538 2423068
60236B423068J27714J25461J20099J12404J02803R1433P8538O4526M9953L5435
$$ 2423068 2550782 2676243 2796342 2908746 3011549 3102982 3181520 3246046 3295999 3331434
60226C331434K1238P125o932k0113l1371m0400m7363n2008n3917n3298n0679m5997
$$ 3331434 3352672 3359797 3352865 3332752 3301381 3260981 3213618 3161610 3107693 3054395 3003716 2957719
60214B957719l8978l0209k0703j0543R16J3536K6361L9098N2415O6502Q0581R4045
$$ 2957719 2918741 2888532 2867829 2857286 2858202 2871738 2898099 2937197 2989612 3056114 3136695 3230740
60202C230740J06844J18410J27427J33079J35519J34638J29605J20101J07001
$$ 3230740 3337584 3455994 3583421 3716500 3852019 3986657 4116262 4236363 4343364
60193D343364R1248P3069N2805L1437R725j2269l4131n4618p2699q8160j00599
$$ 4343364 4434612 4507681 4560486 4591923 4601648 4589379 4555248 4500630 4427931 4339771 4239172
60182D239172j08986j12906j13219j10683j04962r5747q3919p0559n5776l9407
$$ 4239172 4130186 4017280 3904061 3793378 3688416 3592669 3508750 3438191 3382415 3343008
60172C343008k2048m404J3615L2022M9737O5498P9134R0801R9502J03624J02692
$$ 3343008 3320960 3316556 3330171 3362193 3411930 3477428 3556562 3647363 3746865 3850489 3953181
60161C953181R7406Q8239P5202N8934M0906K2396M020j3643k9685m3300n3866
$$ 3953181 4050587 4138826 4214028 4272962 4313868 4336264 4340284 4326641 4296956 4253656 4199790
60150D199790o0681o3170o1457n6247m8062l7072k3577q181Q642K6773M6194O6808
$$ 4199790 4139109 4075939 4014482 3958235 3910173 3873101 3849524 3841343 3849985 3876758 3922952 3989760
60138C989760Q8442J10897J34018J57879J82824K09067K36482K64810K93764L22586
$$ 3989760 4078202 4189099 4323117 4480996 4663820 4872887 5109369 5374179 5667943 5990529
60128E990529L49809L73782L93327M07712M16154M17663M11331L96731L74065
$$ 5990529 6340338 6714120 7107447 7515159 7931313 8348976 8760307 9157038 9531103
60119I531103L43998L07183K64124K15634J63131J07917N0355r578p1035j32111
$$ 9531103 9875101 10182284 10446408 10662042 10825173 10933090 10983445 10973867 10902832 10770721
60109A0770721j90837k45433k93611l32621l60547l77048l82611l77725l63145
$$ 10770721 10579884 10334451 10040840 9708219 9347672 8970624 8588013 8210288 7847143
60100G847143l40369l11396k78185k42354k04903j66203j26777q7896n0708j4930
$$ 7847143 7506774 7195378 6917193 6674839 6469936 6303733 6176956 6089060 6038352 6023422
60090F023422K0421N4847Q5990J11675J31274J44611J50716J48498J37972J20190
$$ 6023422 6043843 6098690 6184680 6296355 6427629 6572240 6722956 6871454 7009426 7129616
60080G129616R6659O9391M0695J2195j5572m2214o6801q8606j07848j25150j40816
$$ 7129616 7226275 7295666 7336361 7348556 7332984 7290770 7223969 7135363 7027515 6902365 6761549
60069F761549j54937j67538j78190j86130j91110j93368j92585j87839j79051
$$ 6761549 6606612 6439074 6260884 6074754 5883644 5690276 5497691 5309852 5130801
60060E130801j67440j54036j38722j21348j02644q3237o2879m1536k0283L9K0110
$$ 5130801 4963361 4809325 4670603 4549255 4446611 4363374 4300495 4258959 4238676 4238715 4258825
60049D258825M0980O2232Q2416J00767J17269J31461J42153J48235J48934J43726
$$ 4258825 4299805 4362037 4444453 4545220 4662489 4793950 4936103 5084338 5233272 5376998
60039E376998J32776J17169R8005P5609N0199K2775n379l3591o1381q7684j11174
$$ 5376998 5509774 5626943 5724948 5800557 5850756 5873531 5868152 5834561 5773180 5685496 5574322
60028E574322j30965j46374j56661j61734j62472j59551j52571j41213j26608
$$ 5574322 5443357 5296983 5140322 4978588 4816116 4656565 4503994 4362781 4236173
60019D236173j10646r4410p8144o2100m6361l0381j3732L127J9760L6875N5430
$$ 4236173 4125527 4031117 3952973 3890873 3844512 3814131 3800399 3803526 3823286 3860161 3915591
60008C915591P5166R5144J15274J35918J56285J74495J89230K00085K06300K06307
$$ 3915591 3990757 4085901 4201175 4337093 4493378 4667873 4857103 5057188 5263488 5469795
59998E469795J98934J84322J63561J38144J09739P9727M8736J6923j5330m7307
$$ 5469795 5668729 5853051 6016612 6154756 6264495 6344222 6392958 6409881 6394551 6347244
59988F347244p8141j06705j31732j52423j68362j78526j81453j77197j68044j56202
$$ 6347244 6269103 6162398 6030666 5878243 5709881 5531355 5349902 5172705 5004661 4848459
59978D848459j41651j23580j03012q2250o2205m1949k0883L10K0876M0690N9389
$$ 4848459 4706808 4583228 4480216 4397966 4335761 4293812 4272929 4273239 4294115 4334805 4394194
59967D394194P6088R0339J02438J12554J20283J25059J26179J22672J14311J02621
$$ 4394194 4470282 4560621 4663059 4775613 4895896 5020955 5147134 5269806 5384117 5486738
59957E486738Q9793P6526O2083M6382L0747J6462L893o596j4074j7776j7485j2898
$$ 5486738 5576531 5653057 5715140 5761522 5792269 5808731 5812624 5806028 5791954 5774178 5756693 5743795
59945E743795l634R964K7075M7781P3025J02891J36082J71738K10479K52858K97619
$$ 5743795 5740161 5750125 5777200 5824981 5898006 6000897 6136979 6308717 6519196 6772054 7069673
59934G069673L42421L85570M26036M62125M90856N08466N11013M94949M57977
$$ 7069673 7412094 7797664 8223700 8685825 9176681 9685147 10196160 10691109 11149086
59925A1149086L99615L21043K24912J15728Q3j14237k19826l10899l83684m36316
$$ 11149086 11548701 11869744 12094656 12210384 12210467 12096230 11876404 11565505 11181821 10745505
59915A0745505m68652m82249m80283m66609m44185m14420l78395l38330k97103
$$ 10745505 10276853 9794604 9314321 8847712 8403527 7989107 7610712 7272382 6975279
59906F975279k56480k16530j76829j37556r9233o1964k5272J1419M8161Q4106
$$ 6975279 6718799 6502269 6325440 6187884 6088651 6026687 6001415 6012834 6060995 6145101
59896F145101J17996J49181J77720K03079K23188K35411K37986K29798K09495
$$ 6145101 6263097 6412278 6589998 6793077 7016265 7251676 7489662 7719460 7928955
59887G928955J76163J30902P6670J6433m7519j12258j73424k26592k69178l00843
$$ 7928955 8105118 8236020 8312690 8329123 8281604 8169346 7995922 7769330 7500152 7199309
59877G199309l22500l35120l39028l34207l21489l03254k82259k59872k36083
$$ 7199309 6876809 6541689 6202661 5868454 5546965 5243711 4961452 4701580 4465497
59868D465497k11140j86304j62810j40940j20505j01569q4391o9198n6433m6751
$$ 4465497 4254357 4068053 3905243 3764303 3643798 3542229 3457838 3388640 3332207 3285456
59858C285456m0399l6917l5755l6741l9581m3124m5719m6302m4861m1783l7007
$$ 3285456 3245057 3208140 3172385 3135644 3096063 3052939 3007220 2960918 2916057 2874274 2837267
59847B837267l0186k1687j2930n361O26N154P548O450J386o628j6211k6498l6578
$$ 2837267 2807081 2785394 2772464 2767103 2767729 2772883 2780431 2786881 2788267 2781639 2765428 2738930 2702352
59834B702352m5069n0954n4155n4786n2635m8037m2325l6554l0482k3526j5957
$$ 2702352 2657283 2606329 2552174 2497388 2444753 2396716 2354391 2317837 2287355 2263829 2247872
59823B247872q358p20P037J4445K1413K8786L6838M4084M8942N1933N4821N8288
$$ 2247872 2239514 2238794 2245831 2260276 2281689 2310475 2347313 2391397 2440339 2492272 2547093 2605381
59811B605381O1936O5819P0162P3757P4386P0803O3069N1387L6344K0105N556
$$ 2605381 2667317 2733136 2803298 2877055 2951441 3022244 3085313 3136700 3173044 3193149 3198705
59800C198705n958j4658k0451k2765k2226k0459j7830j3083n664L302J2843K3342
$$ 3198705 3192747 3178089 3157638 3134873 3112647 3092188 3074358 3061275 3055611 3058913 3071756 3095098
59788C095098L5261M8336O2770P9682R9562J21639J45718J73248K05545K42078
$$ 3095098 3130359 3178695 3241465 3321147 3420709 3542348 3688066 3861314 4066859 4308937
59778D308937K81591L23712L67977M11567M48713M71430M70140M35223L61028
$$ 4308937 4590528 4914240 5282217 5693784 6142497 6613927 7084067 7519290 7880318
59769G880318K50404J15771k4507j52151k54062l24364l63282l74821l65255l42073
$$ 7880318 8130722 8246493 8221986 8069835 7815773 7491409 7128127 6753306 6388051 6045978
59759F045978l12028k79166k45009k10524j77135j45987j17429r1510o8200m6926
$$ 6045978 5733950 5454784 5209775 4999251 4822116 4676129 4558700 4467190 4398990 4352064
59749D352064k6837p824R548K5340M0616N6291P2372Q8544J04689J20800J37150
$$ 4352064 4325227 4317403 4326951 4352291 4392907 4449198 4521570 4610114 4714803 4835603 4972753
59738D972753J54655J74105J95117K16851K39764K65431K94530L26275L60120
$$ 4972753 5127408 5301513 5496630 5713481 5953245 6218676 6513206 6839481 7199601
59729G199601L96608M36149M78044N21207N64614O06468O43881O73967O94341
$$ 7199601 7596209 8032358 8510402 9031609 9596223 10202691 10846572 11520539 12214880
59720A2214880P02290O94875O70871O32201N83304N29970M78802M36207M06785
$$ 12214880 12917170 13612045 14282916 14915117 15498421 16028391 16507193 16943400 17350185
59711A7350185L92911L95863M16110M52120M99945N54511O10507O61973P02370
$$ 17350185 17743096 18138959 18555069 19007189 19507134 20061645 20672152 21334125 22036495
59702B2036495P25724P27061P01899O47051N62752M53134L24521J84489M2560
$$ 22036495 22762219 23489280 24191179 24838230 25400982 25854116 26178637 26363126 26405686
59693B6405686r0504k05662k97433l62931m00941m12565m00947l69054l18725
$$ 26405686 26315182 26109520 25812087 25449156 25048215 24635650 24234703 23865649 23546924
59684B3546924k52536j74703q8825M162J04754K12853L27993M50052N78175P09754
$$ 23546924 23294388 23119685 23030860 23035022 23139776 23352629 23680622 24130674 24708849 25418603
59674B5418603Q41320R69017J086678J184448J250553J273610J242547J146651
$$ 25418603 26259923 27228940 28315618 29500066 30750619 32024229 33266776 34413427
59666C4413427R79176P42005M46708J12345k36710n73182q71510j112915j287288
$$ 34413427 35392603 36134608 36581316 36693661 36456951 35883769 35012259 33899344 32612056
59657C2612056j392158j431591j415038j354537j261728j147506j023483r02152
$$ 32612056 31219898 29788307 28373269 27018732 25757004 24609498 23586015 22683863
59649B2683863p95729p15687o72297o71615p10963p77584q52492r16908r57554
$$ 22683863 21888134 21172447 20500150 19828535 19117572 18339988 17487496 16570588 15613034
59640A5613034r69084r53278r16031q64302q04508p41731o78873o16879n56499
$$ 15613034 14643950 13690672 12774641 11910339 11105831 10364100 9685227 9068348 8511849
59631H511849m99546m47853m01619l59746l21478k86866k55869k27847k02020
$$ 8511849 8012303 7564450 7162831 6803085 6481607 6194741 5938872 5711025 5509005
59622E509005j77958j55611j35132j16493r9210q2924o8210n6112m6747l9352
$$ 5509005 5331047 5175436 5040304 4923811 4824601 4741677 4673467 4617355 4570608 4531256
59612D531256l3912l1623l3185l7753m4277n2642o2649p2961q2215r0300r7416
$$ 4531256 4497344 4465721 4432536 4394783 4350506 4297864 4235215 4162254 4080039 3989739 3892323
59601C892323j02674j04835j03887j00791r6152r0166q3413p6677p0095o3213
$$ 3892323 3789649 3684814 3580927 3480136 3383984 3293818 3210405 3133728 3063633 3000420
59591C000420n5609m7090l7842k8827k1148j4543p496M82P870J3279J7343K1306
$$ 3000420 2944811 2897721 2859879 2831052 2809904 2795361 2787865 2788347 2796217 2809496 2826839 2848145
59579B848145K4900K7051K7784K7868K7249K5397K2854K0948K0206K0279K1206
$$ 2848145 2873045 2900096 2927880 2955748 2982997 3008394 3031248 3052196 3072402 3092681 3113887
59568C113887K3517K7315L2293L8477M5965N4239O2706P1573Q1295R1555J01942
$$ 3113887 3137404 3164719 3197012 3235489 3281454 3335693 3398399 3469972 3551267 3642822 3744764
59557C744764J13188J26574J42269J59248J76695J94572K13038K32224K52345
$$ 3744764 3857952 3984526 4126795 4286043 4462738 4657310 4870348 5102572 5354917
59548E354917K73096K92984L10096L23399L32719L37748L37803L32491L22113
$$ 5354917 5628013 5920997 6231093 6554492 6887211 7224959 7562762 7895253 8217366
59539H217366L07681K90801K73086K55238K36983K17852J97259J74149J48303
$$ 8217366 8525047 8815848 9088934 9344172 9581155 9799007 9996266 10170415 10318718
59530A0318718J22546J02010R0171Q6725Q9844R8637J12064J27378J41435J52260
$$ 10318718 10441264 10543274 10633445 10720170 10810014 10908651 11020715 11148093 11289528 11441788
59520A1441788J57601J53309J35421J03198N8542L427o0223j29140j99444k68291
$$ 11441788 11599389 11752698 11888119 11991317 12049859 12053286 11993063 11863923 11664479 11396188
59510A1396188l33073l89784m34450m65877m85239m93474m91040m79624m61714
$$ 11396188 11063115 10673331 10238881 9773004 9287765 8794291 8303251 7823627 7361913
59501G361913m38523m10351l78829l46655l15041k83483k52256k23130j97201
$$ 7361913 6923390 6513039 6134210 5787555 5472514 5189031 4936775 4713645 4516444
59492D516444j73860j52308j32382j13650r5358p7733o1810m7461l3102j7797
$$ 4516444 4342584 4190276 4057894 3944244 3848886 3771153 3709343 3661882 3628780 3610983
59482C610983k292J2544K7015M1808N7063P2770Q9266J06879J25673J45638J66498
$$ 3610983 3608691 3621235 3648250 3690058 3747121 3819891 3909157 4016036 4141709 4287347 4453845
59471D453845J87616K08795K30624K53006K73938K90883L02781L09270L08623
$$ 4453845 4641461 4850256 5080880 5333886 5607824 5898707 6201488 6510758 6819381
59462F819381K98211K76697K44201K00827J46954Q4900J8522m8790j14157j73859
$$ 6819381 7117592 7394289 7638490 7839317 7986271 8071171 8089693 8040903 7926746 7752887
59452G752887k24200k63910k93823l14267l24794l26423l21765l12537k99024
$$ 7752887 7528687 7264777 6970954 6656687 6331893 6005470 5683705 5371168 5072144
59443E072144k82311k64695k47175k28687k08808j89177j71397j55282j40160
$$ 5072144 4789833 4525138 4277963 4049276 3840468 3651291 3479894 3324612 3184452
59434C184452j26134j13069j00077q7169p5882o7066n9411n1284m2738l4685k7282
$$ 3184452 3058318 2945249 2845172 2758003 2682121 2615055 2555644 2504360 2461622 2426937 2399655
59423B399655k0308j3999q428k983K527P258J0648J3492J6712K0039K2903K6002
$$ 2399655 2379347 2365348 2356920 2353937 2356464 2363722 2374370 2387862 2404574 2424613 2447516 2473518
59411B473518L0828L7716M4751M8526M6352L8736K9783K4232K3932K7875L4969
$$ 2473518 2504346 2542062 2586813 2635339 2681691 2720427 2750210 2774442 2798374 2826249 2861218
59400B861218M5047N7465P0955Q5247J00683J15658J26824J33239J38614J47958
$$ 2861218 2906265 2963730 3034685 3119932 3220615 3336273 3463097 3596336 3734950 3882908
59390C882908J63413J84513K10838K42379K78314L17462L59700M05525M54295
$$ 3882908 4046321 4230834 4441672 4684051 4962365 5279827 5639527 6045052 6499347
59381F499347N03814N51279N93687O27637O49719O57217O48373O22802N82373
$$ 6499347 7003161 7554440 8148127 8775764 9425483 10082700 10731073 11353875 11936248
59372A1936248N31254M74378M15829L58571L04821K56035K12781J74718J40251
$$ 11936248 12467502 12941880 13357709 13716280 14021101 14277136 14489917 14664635 14804886
59363A4804886J06453P0254L0015j4687o4386j19557j78990k39384k96670l46682
$$ 14804886 14911339 14981593 15011608 14996921 14932535 14812978 14633988 14394604 14097934 13751252
59353A3751252l84832m07170m12652m03625l83892l57489l29160l03988k85525
$$ 13751252 13366420 12959250 12546598 12142973 11759081 11401592 11072432 10768444 10482919
59344A0482919k75236k73869k81754k97295l16885l37146l56026l71378l80493
$$ 10482919 10207683 9933814 9652060 9354765 9037880 8700734 8344708 7973330 7592837
59335G592837l82169l77591l68098l53572l34131l11818k89066k66539k43843
$$ 7592837 7210668 6833077 6464979 6111407 5777276 5465458 5176392 4909853 4666010
59326D666010k21340j99872j79573j60200j42016j25357j09917r5301q1587o8677
$$ 4666010 4444670 4244798 4065225 3905025 3763009 3637652 3527735 3432434 3350847 3282170
59316C282170n6036m3729l2661k3067j3883m492M224J1513J8209K5427L2904L9903
$$ 3282170 3226134 3182405 3149744 3126677 3112794 3108302 3112526 3124039 3142248 3167675 3200579 3240482
59304C240482M6761N4314O2640P1511Q1168R1614J02044J12108J22702J34343
$$ 3240482 3287243 3341557 3404197 3475708 3556876 3648490 3750534 3862642 3985344 4119687
59294D119687J45705J55136J62605J68708J72685J73122J70010J64403J56354
$$ 4119687 4265392 4420528 4583133 4751841 4924526 5097648 5267658 5432061 5588415
59285E588415J44960J30346J14238R8508Q4266P2450O4047N9458N8286N9877O3526
$$ 5588415 5733375 5863721 5977959 6076467 6160733 6233183 6297230 6356688 6414974 6474851 6538377
59274F538377O8341P3389P7819Q0369P9270P3221O2065M5849K3723n295m0375
$$ 6538377 6606718 6680107 6757926 6838295 6917565 6990786 7052851 7098700 7122423 7117128 7076753
59263G076753p8143j13800j42987j63386j75202j79985j78847j72171j60825j46475
$$ 7076753 6998610 6884810 6741823 6578437 6403235 6223250 6044403 5872232 5711407 5564932
59253E564932j30243j11958r1272o8817m5758k2936q18K0434M1201O1895Q1976
$$ 5564932 5434689 5322731 5231459 5162642 5116884 5093948 5093130 5113564 5154765 5216660 5298636
59242E298636J00362J16990J32732J47477J59734J68751J75647J81725J87003
$$ 5298636 5398998 5515988 5648720 5796197 5955931 6124682 6300329 6482054 6669057
59233F669057J91466J96493K03909K14488K28440K46358K68547K93984L20592
$$ 6669057 6860523 7057016 7260925 7475413 7703853 7950211 8218758 8512742 8833334
59224H833334L45700L65529L75348L71257L51341L14675K60516J89382J04035
$$ 8833334 9179034 9544563 9919911 10291168 10642509 10957184 11217700 11407082 11511117
59215A1511117Q453r3223j96084k94140l81883m55578n12536n50437n68633n69207
$$ 11511117 11519570 11426347 11230263 10936123 10554240 10098662 9586126 9035689 8467056 7897849
59205G897849n55736n31628n00119m64483m27108l89140l51763l16675k84559
$$ 7897849 7342113 6810485 6310366 5845883 5418775 5029635 4677872 4361197 4076638
59196D076638k54539k26098k00296j78065j58770j41575j26770j14405j03088
$$ 4076638 3822099 3596001 3395705 3217640 3058870 2917295 2790525 2676120 2573032
59187B573032r1738q1351p3359o7345o1894n6733n2391m8643m4824m0976l7353
$$ 2573032 2481294 2399943 2326584 2259239 2197345 2140612 2088221 2039578 1994754 1953778 1916425
59176A916425l3615k9701k6450k4114k1435j7596j3808j1422r614o741k809J139
$$ 1916425 1882810 1853109 1826659 1802545 1781110 1763514 1749706 1738284 1728670 1721929 1719120 1720259
59164A720259N033R285J3303J6409J9443K3545K8163L2078L5559L9582M3771M7190
$$ 1720259 1725292 1734577 1747880 1764289 1783732 1807277 1835440 1867518 1903077 1942659 1986430 2033620
59152B033620N0354N4386N8812O2435O5739P0236P5890Q1444Q6966R3741J01783
$$ 2033620 2083974 2138360 2197172 2259607 2325346 2395582 2471472 2552916 2639882 2733623 2835406
59141B835406J09696J17000J24441J32019J38803J44762J50628J55678J57799
$$ 2835406 2945102 3062102 3186543 3318562 3457365 3602127 3752755 3908433 4066232
59132D066232J56124J51731J45316J36062J23451J08480R2408P5786N9402M4969
$$ 4066232 4222356 4374087 4519403 4655465 4778916 4887396 4979804 5055590 5114992 5159961
59122E159961L4131K7579K5459K7703L3883M3634N7268P5019R5873J18264J41564
$$ 5159961 5194092 5221671 5247130 5274833 5308716 5352350 5409618 5484637 5580510 5698774 5840338
59111E840338J65630J89033K09141K23874K31928K31266K18991J93158J53896
$$ 5840338 6005968 6195001 6404142 6628016 6859944 7091210 7310201 7503359 7657255
59102G657255J02906M3261k0217q1702j36209j80419k12232k30849k37245k33628
$$ 7657255 7760161 7803422 7783205 7701503 7565294 7384875 7172643 6941794 6704549 6470921
59092F470921k22242k05247j84986j63345j41104j18930r8329q0439o4627m9776
$$ 6470921 6248679 6043432 5858446 5695101 5553997 5435067 5336738 5256299 5191672 5141896
59082E141896l6504k6688k1257j9898k2538k9487m0301n4000p0116q8175j06492
$$ 5141896 5105392 5078704 5057447 5037549 5015011 4985524 4945223 4891223 4821107 4732932 4626440
59071D626440j23047j37237j49389j58938j64746j66962j66841j64904j60826
$$ 4626440 4503393 4366156 4216767 4057829 3893083 3726121 3559280 3394376 3233550
59062C233550j54911j48015j40173j30952j21053j11958j03975r6324q8919q2482
$$ 3233550 3078639 2930624 2790451 2659499 2538446 2426488 2322513 2226189 2137270 2054788
59052B054788p6952p1492o6113o1683n8259n4921n1245m7435m3217l8204l3271
$$ 2054788 1977836 1906344 1840231 1778548 1720289 1665368 1614123 1566688 1523471 1485267 1451996
59041A451996k9762k7340k4313k0160j6060j2830j0022p264m846k683j05K996
$$ 1451996 1422234 1394894 1370581 1350421 1334361 1321531 1311509 1304245 1299399 1296716 1296611 1299607
59029A299607O048Q826J1514J3883J5567J6787J7609J7037J4294J0308O387K384
$$ 1299607 1305655 1314481 1325995 1339878 1355445 1372232 1389841 1406878 1421172 1431480 1437867 1440251
59017A440251k037n416o137n278n034m999k973Q31L670M642N945Q986J2234J3978
$$ 1440251 1438214 1432798 1426661 1421383 1416349 1411350 1408377 1409208 1412878 1417520 1423465 1432451 1444685 1458663
59003A458663J4549J4527J3219J0281O861L810N78l056n920p180p442p239o141
$$ 1458663 1473212 1487739 1500958 1511239 1518100 1521910 1522488 1519432 1513512 1506332 1498890 1491651 1485510
58990A485510m260k809k195j200Q89L069M475N738P415Q736R046R093R747J0708
$$ 1485510 1481250 1478441 1476246 1475046 1475935 1479004 1483479 1489217 1496632 1505368 1514414 1523507 1533254 1543962
58976A543962J1520J2542J4027J5434J6561J8045K0044K1720K2763K4133K6428
$$ 1543962 1555482 1568024 1582051 1597485 1614046 1632091 1652135 1673855 1696618 1720751 1747179
58965A747179K8919L0963L3063L5666L8143L9744M0464M0385L9351L7823L6823
$$ 1747179 1776098 1807061 1840124 1875790 1913933 1953677 1994141 2034526 2073877 2111700 2148523
58954B148523L6569L6451L6685L8407M1742M5483M9283N4326O1055O8047P4178
$$ 2148523 2185092 2221543 2258228 2296635 2338377 2383860 2433143 2487469 2548524 2616571 2690749
58943B690749Q0329Q7779R6335J05181J14370J24406J35297J46888J59239J72096
$$ 2690749 2771078 2858857 2955192 3060373 3174743 3299149 3434446 3581334 3740573 3912669
58933C912669J85038J98658K14510K33449K55132K79371L06570L36674L69277
$$ 3912669 4097707 4296365 4510875 4744324 4999456 5278827 5585397 5922071 6291348
58924F291348M05119M45734M91106N39417N89584O42280O97673P53740Q07413
$$ 6291348 6696467 7142201 7633307 8172724 8762308 9404588 10102261 10856001 11663414
58915A1663414Q55584Q94254R18341R23162R04728Q58403P79581O66938N23816
$$ 11663414 12518998 13413252 14331593 15254755 16159483 17017886 17797467 18464405 18988221
58906A8988221L56271J71825j9433k05404l75634n23512o44768p36412p98464
$$ 18988221 19344492 19516317 19496884 19291480 18915846 18392334 17747566 17011154 16212690
58897A6212690q34525q48931q44661q24885p94211p56692p14199o68156o21151
$$ 16212690 15378165 14529234 13684573 12859688 12065477 11308785 10594586 9926430 9305279
58888I305279n75202n30039m84872m40714l99504l62106l28471k98636k72252
$$ 9305279 8730077 8200038 7715166 7274452 6874948 6512842 6184371 5885735 5613483
58879E613483k48342k26638k08086j92978j79867j67315j55455j44791j34856
$$ 5613483 5365141 5138503 4930417 4737439 4557572 4390257 4234802 4090011 3955155
58870C955155j25073j15647j06643r7462q8146p9726p2511o5547n8525n2495m7757
$$ 3955155 3830082 3714435 3607792 3510330 3422184 3342458 3269947 3204400 3145875 3093380 3045623
58859C045623m2968l7414l2258k8291k4318j9205j3694q764l836J804P440J2302
$$ 3045623 3002655 2965241 2932983 2904692 2880374 2861169 2847475 2838711 2834875 2836679 2844119 2856421
58847B856421J7104K2768K8974L5215M1913M9234N6365O3156P0863Q0026Q9347
$$ 2856421 2873525 2896293 2925267 2960482 3002395 3051629 3107994 3171150 3242013 3322039 3411386
58836C411386R7923J06798J16872J27261J37214J47835J60248J73883J88290K04727
$$ 3411386 3509309 3616107 3732979 3860240 3997454 4145289 4305537 4479420 4667710 4872437
58826D872437K24059K44974K66390K89943L17959L50427L86128M25304M68943
$$ 4872437 5096496 5341470 5607860 5897803 6215762 6566189 6952317 7377621 7846564
58817G846564N16531N66670O18882O72737P26070P75812Q19430Q53788Q73584
$$ 7846564 8363095 8929765 9548647 10221384 10947454 11723266 12542696 13396484 14270068
58808A4270068Q72802Q46921P92438P06157N87411M40341K72281R0926r5327k75913
$$ 14270068 15142870 15989791 16782229 17488386 18075797 18516138 18788419 18879345 18784018 18508105
58798A8508105m39854n79315o90469p72172q25491q53643q60480q49184q23142
$$ 18508105 18068251 17488936 16798467 16026295 15200804 14347161 13486681 12637497 11814355
58789A1814355p86764p44007o97134o47945n98860n51563n06132m62868m23337
$$ 11814355 11027591 10283584 9586450 8938505 8339645 7788082 7281950 6819082 6395745
58780F395745l88245l56063l25438k97219k72414k50027k28859k09690j93596
$$ 6395745 6007500 5651437 5325999 5028780 4756366 4506339 4277480 4067790 3874194
58771C874194j79790j67237j56737j49051j42422j34491j25377j16673j08559
$$ 3874194 3694404 3527167 3370430 3221379 3078957 2944466 2819089 2702416 2593857
58762B593857j00161r1596q3488p5494o7252n9591n2967m6123l8244l0891k5650
$$ 2593857 2493696 2402100 2318612 2243118 2175866 2116275 2063308 2017185 1978941 1948050 1922400
58751A922400k1538j7037j2978j0846r820q246o607o297o750o620o619q199j0556
$$ 1922400 1900862 1883825 1870847 1860001 1850181 1841935 1835328 1829031 1822281 1815661 1809042 1800843 1790287
58738A790287j1832j2422j4138j6831j8804j9875k1224k2651k2774k1604k0457
$$ 1790287 1778455 1766033 1751895 1735064 1716260 1696385 1675161 1652510 1629736 1608132 1587675
58727A587675j9715j8952j8731j9990k2148k4005k5794k8208l0381l1134l1244
$$ 1587675 1567960 1549008 1530277 1510287 1488139 1464134 1438340 1410132 1379751 1348617 1317373
58716A317373l2023l2706l1748k9665k7943k6201k3245k0008j8459j8332j7797
$$ 1317373 1285350 1252644 1220896 1191231 1163288 1137087 1113842 1093834 1075375 1057043 1039246
58705A039246j6595j5699j4637j2304r701q775q999q221o431n566n934o017n656
$$ 1039246 1022651 1006952 992315 980011 970310 961535 952536 944315 937884 932318 926384 920367 914711
58692I14711o239p614p888o595n341m999m721l876k696j143N78P26k245o917j0329
$$ 914711 908472 900858 892970 886375 881034 876035 871314 867438 864742 863599 864177 864903 862658 855741 845412
58677H45412j1771j2660j3269j2487j0529q904p756n969l819k798k899k769k320
$$ 845412 833641 820981 807712 795225 784696 775792 768036 762067 758248 755450 752551 749782 747462
58664G47462k443k385l44L322O319P784Q615Q617O414K521m28j035k94P61K129
$$ 747462 745019 742634 742290 745612 751931 759715 768330 776947 783361 785882 785454 784419 784125 784886 787015
58649G87015L505M365N498Q095J1344J3273J3844J4766J6530J8167J9651K1955
$$ 787015 790520 794885 800383 808478 819822 833095 846939 861705 878235 896402 916053 938008
58637I38008K4857K7319K9701L3130L7053M0050M2604M6339N1186N6129O1986
$$ 938008 962865 990184 1019885 1053015 1090068 1130118 1172722 1219061 1270247 1326376 1388362
58626A388362P0284Q0139Q9620R9553J12305J27450J42565J58060J76968J99791
$$ 1388362 1458646 1538785 1628405 1727958 1840263 1967713 2110278 2268338 2445306 2645097
58616B645097K23511K45975K67068K84835K94400K91919K76301K46577K01420
$$ 2645097 2868608 3114583 3381651 3666486 3960886 4252805 4529106 4775683 4977103
58607D977103J42535P5350N400o3153j25272j75198k10310k32111k42770k43559
$$ 4977103 5119638 5194988 5200388 5137235 5011963 4836765 4626455 4394344 4151574 3908015
58597C908015k36862k26147k13011j97250j80128j64226j49718j34521j18704
$$ 3908015 3671153 3445006 3231995 3034745 2854617 2690391 2540673 2406152 2287448
58588B287448j05029r4390q4542p4357o5462n8470n1315m2926l5161k9662k5834
$$ 2287448 2182419 2088029 2003487 1929130 1863668 1805198 1753883 1710957 1675796 1646134 1620300
58577A620300k3183k2414k3022k2908k1582k0787k0958k0354j8605j7793j8807
$$ 1620300 1597117 1574703 1551681 1528773 1507191 1486404 1465446 1445092 1426487 1408694 1389887
58566A389887j9999k0555k1799k3978k5161k4686k4447k5507k6587k7016k7814
$$ 1389887 1369888 1349333 1327534 1303556 1278395 1253709 1229262 1203755 1177168 1150152 1122338
58555A122338k8776k8018k5610k4004k3634k1820j7566j3622j2017j1234r708
$$ 1122338 1093562 1065544 1039934 1015930 992296 970476 952910 939288 927271 916037 906329
58544I06329q610r036r656r257q698q535p622n670m163l322j285K198M642M909
$$ 906329 897719 888683 879027 869770 861072 852537 844915 839245 835082 831760 830475 832673 837315 842224
58530H42224N044O379P297O618N722N377L832J13l900o664r135j2032j4053j4661
$$ 842224 847268 853647 860944 867562 873284 878661 882493 882606 878706 872042 862907 850875 836822 822161
58516H22161j5424j6905j7357j6170j5220j5203j4162j1443r433r393r189p229
$$ 822161 806737 789832 772475 756305 741085 725882 711720 700277 690844 681451 672262 665033
58504F65033n035l840k332J2J039k40j378n02Q23J027J207K149K218Q05K64J856
$$ 665033 659998 656158 653826 653838 654877 654637 653259 652757 653580 654607 655814 657963 660181 660986 661250 663106
58488F63106L150K171O19L87K53j141k372k119j767k452k657j357l85r95j309
$$ 663106 666256 668427 669046 669433 669686 668545 666173 664054 662287 659835 657178 655821 655436 654441 653132
58473F53132J94J868K191K528L987M903M148L686N035O512O677P114R029J0522
$$ 653132 653326 655194 657385 659913 663900 668803 672951 676637 681672 688184 694861 701975 711004 721526
58459G21526J0117R551J0117R667O269J624k099n549r519j2393j3132j3438j4269
$$ 721526 731643 741194 751311 760978 767247 768871 766772 761223 751704 739311 726179 712741 698472
58446F98472j3679j0888q684q821q875o742m358l734l190r57J253J735K030L361
$$ 698472 684793 673905 665221 656400 647525 640783 636425 632691 629501 628544 629797 631532 633562 636923
58432F36923L639J514n51p60j470m477o977o137l837k801j929M22K437K363K250
$$ 636923 640562 642076 641525 640765 639295 634818 627841 621704 617867 615066 613137 613559 615996 618359 620609
58417F20609M084N879N744N898Q381J0822J0899J1029J3873J7122J7661J7134
$$ 620609 624693 630572 636316 642214 650595 661417 672316 683345 697218 714340 732001 749135
58405G49135J8408K0037J9299J7291J6086J4155R544M381J356j018m941q548r424
$$ 749135 767543 787580 806879 824170 840256 854411 863955 868336 869692 868674 863733 855185 845761
58392H45761r380j0934j2396j1286r186q390p452m812k970m042n056k900L8M76
$$ 845761 836381 825447 813051 801765 792579 784189 776737 771925 768955 764913 759857 756957 756995 757471
58378G57471K65K266M322L305J243J405K151P33o80R92L494L331K389M012O265
$$ 757471 757736 760002 764324 767629 768872 770277 772428 773161 772481 773473 776967 780298 782687 786699 792964
58363G92964N704M230N347P193O173M102M791O771O464N301O598Q556P619N652
$$ 792964 798668 802898 808245 815438 821611 825713 830504 837275 843739 849040 855638 864194 871813 877465
58349H77465O489Q321O889L419K071K261P84j200n63J106M25r47N51L263L522
$$ 877465 883954 892275 899164 902583 904654 906915 907699 906499 905936 907042 907467 906520 907071 910334 913856
58334I13856K876M953Q153Q756Q140R585J1285R963P932Q954J0754R421P374Q858
$$ 913856 916732 921685 929838 938594 946734 956319 967604 977567 985499 994453 1005207 1014628 1022002 1030860
58320A030860J1468J0648Q584R944J2774J2583J1412J3498J6095J4298J0999J1919
$$ 1030860 1042328 1052976 1061560 1071504 1084278 1096861 1108273 1121771 1137866 1152164 1163163 1175082
58308A175082J4680J3203R260Q927J1052J0216P814R089J2216J1577Q935J0084
$$ 1175082 1189762 1202965 1212225 1221152 1232204 1242420 1250234 1259323 1271539 1283116 1292051 1302135
58296A302135J3461J3446J1940J4877K0201K1305J9531K1118K4555K3559J9908
$$ 1302135 1315596 1329042 1340982 1355859 1376060 1397365 1416896 1438014 1462569 1486128 1506036
58285A506036K0577K4511K5097K3227K4954K8765K8481K6246K9030L4739L5676
$$ 1506036 1526613 1551124 1576221 1599448 1624402 1653167 1681648 1707894 1736924 1771663 1807339
58274A807339L3259L5034L9608L9289L5347L5530L8716L7417L3349L4727M0098
$$ 1807339 1840598 1875632 1915240 1954529 1989876 2025406 2064122 2101539 2134888 2169615 2209713
58263B209713M0973L8419M0650M6231M6768M4152M7561N5257N7406N5236N8696
$$ 2209713 2250686 2289105 2329755 2375986 2422754 2466906 2514467 2569724 2627130 2682366 2741062
58252B741062O6906P0107O9434P4777Q4444Q7543Q5478Q9778R9499J02759J00089
$$ 2741062 2807968 2878075 2947509 3022286 3106730 3194273 3279751 3369529 3469028 3571787 3671876
58241C671876J03688J13719J18491J18166J24485J36814J42857J43459J51698
$$ 3671876 3775564 3889283 4007774 4125940 4250425 4387239 4530096 4673555 4825253
58232D825253J67203J77230J83042J97996K19593K32225K37807K53548K78961
$$ 4825253 4992456 5169686 5352728 5550724 5770317 6002542 6240349 6493897 6772858
58223F772858K96852L07738L29709L62918L89494M10453M45600M94546N36883
$$ 6772858 7069710 7377448 7707157 8070075 8459569 8870022 9315622 9810168 10347051
58214A0347051N73825O28494P01847P72098Q41394R36546J059615J187684J326080
$$ 10347051 10920876 11549370 12251217 13023315 13864709 14801255 15860870 17048554 18374634
58205A8374634J508359J739127J995140K287553K659072L115139L630556M231507
$$ 18374634 19882993 21622120 23617260 25904813 28563885 31679024 35309580 39541087
58197C9541087M993470N955036P126983Q592451J0490496J2893772J5829918J9430986
$$ 39541087 44534557 50489593 57616576 66209027 76699523 89593295 105423213 124854199
58189A24854199K3908826K9377424L5845992M3172241N0332217N4425972N1218427
$$ 124854199 148763025 178140449 213986441 257158682 307490899 361916871 413135298
58182D13135298L7995515J6482323p420979k7261287l9633785m4795828m4824833
$$ 413135298 451130813 467613136 460192157 432930870 393297085 348501257 303676424
58175C03676424m1819855l7350213l2509399k7900999k3700730j9935687j6667186
$$ 303676424 261856569 224506356 191996957 164095958 140395228 120459541 103792355
58168A03792355j3915966j1600168r641184q027623o725454n631657m669179l837744
$$ 103792355 89876389 78276221 68635037 60607414 53881960 48250303 43581124 39743380
58160C9743380l128635k477073j839981j235560o62663o0205O14456J349718K152208
$$ 39743380 36614745 34137672 32297691 31062131 30399468 30339263 30953719 32303437 34455645
58151C4455645L026396L779232L946785L099573J274248r59339k884685m078054
$$ 34455645 37482041 41261273 45208058 48307631 49581879 48622540 45737855 41659801
58143D1659801m528348m460150m114911l653798l166928k706664k299665j947616
$$ 41659801 37131453 32671303 28556392 24902594 21735666 19029002 16729337 14781721
58135A4781721j640649j376545j160075r86676q41538p16408o13326n30140m57739
$$ 14781721 13141072 11764527 10604452 9617776 8776238 8059830 7446504 6916364 6458625
58126F458625l94493l47597l16235k89060k62376k44521k37276k29246k13703
$$ 6458625 6064132 5716535 5400300 5111240 4848864 4604343 4367067 4137821 3924118
58117C924118j97227j84375j69144j48602j30246j18320j06557r1589q0483p7957
$$ 3924118 3726891 3542516 3373372 3224770 3094524 2976204 2869647 2778058 2697575 2619618
58107B619618p8618p8346q0860q6724q8349q2587p6399p3892o9654o0973n4368
$$ 2619618 2541000 2462654 2381794 2295070 2206721 2124134 2047735 1973843 1904189 1843216 1788848
58096A788848n3374n1668m5169l9692l9731m0428l7509l4790l5258l4772l1074
$$ 1788848 1735474 1683806 1638637 1598945 1559214 1518786 1481277 1446487 1411229 1376457 1345383
58085A345383k9088l1112l1457k7074k3667k5192k6759k4199k1347k1549k1133
$$ 1345383 1316295 1285183 1253726 1226652 1202985 1177793 1151034 1126835 1105488 1083939 1062806
58074A062806j7547j5106j6514j7235j4269j1944j3251j4025j1561j0312j2968
$$ 1062806 1045259 1030153 1013639 996404 982135 970191 956940 942915 931354 921042 908074
58063I08074j4473j1138p424p406p657m979l177n569q373q104q157j1542j4261
$$ 908074 893601 882463 875039 867633 859976 854997 851820 846251 837878 829774 821617 810075 795814
58050G95814j2600j0190j1128j2618j0960q610q763q898o059k961k799l328j795
$$ 795814 783214 773024 761896 749278 738318 729708 720945 712047 705988 703027 700228 696900 695105
58037F95105l31j001j001J789M065L230K562M940P042N383K491J614P22k538n314
$$ 695105 694774 693773 692772 694561 698626 701856 704418 709358 716400 721783 724274 725888 726610 724072 718758
58022G18758m716l488m917o895o485n483o152o318m136k813n092p746p048n054
$$ 718758 714042 710554 705637 698742 692257 686774 680622 674304 670168 667355 662263 654517 647469 642415
58008F42415n060n495l881k334l440m920l985k820m211n888m753k807l252m539
$$ 642415 637355 631860 627979 625645 622205 617285 613300 610480 606269 600381 595628 592821 589569 585030
57994E85030l827k711l867n507m632k652k495l208k375q77m41K64K501L854K402
$$ 585030 581203 578492 574625 569118 564486 561834 559339 556131 553756 552879 552438 552702 555203 559057 561459
57979E61459R18K227M009L119J340J665K514J001j328j483o73j651l413l716l890
$$ 561459 562377 564604 568613 571732 573072 574737 577251 578252 576924 575441 574768 573117 569704 565988 562098
57964E62098n915p698o607m814n695p582o735l989k951l734l891l571m424n247
$$ 562098 556183 548485 541878 537064 531369 523787 517052 513063 510112 506378 502487 498916 494492 489245
57950D89245l933j949j990k930j974N5N23J71J484L614L873K843L052L953L055
$$ 489245 485312 483363 481373 478443 476469 476524 477047 477218 478702 482316 486189 489032 492084 496037 499092
57935D99092Q22j71R2l49j401j658j978m124p089q648r209j0255j0737q990o484
$$ 499092 499914 499743 499835 499486 498085 496427 494449 490325 483236 474588 465379 455124 444387 435397 428913
57920D28913n493m852k347O00J115J58Q17K909L950M116N507P555Q016P522Q489
$$ 428913 423420 418568 416221 416821 417936 418094 418911 421820 425770 429886 435393 442948 450964 458486 466975
57905D66975J0292J0159Q217P065O916N612L059J347P15n21k360l264l531m660
$$ 466975 477267 487426 495643 502708 509624 515236 518295 519642 520357 519836 517476 514212 510681 506021
57891E06021n971n615m469n064p087p872o960o388o778o828o425o633o902n762
$$ 506021 500050 494435 489966 484902 477815 469943 462983 456595 449817 442989 436564 429931 423029 417267
57877D17267l935l410l868l361j933j163q51L88J927K176K046L691O455P827P764
$$ 417267 413332 409922 406054 402693 400760 399597 398746 399134 401061 403237 405283 408974 415429 423256 431020
57862D31020Q259R165Q531O634N727N855M911K821J762K053J619k15j855k700
$$ 431020 439279 448444 456975 463609 469336 475191 480102 482923 484685 486738 488357 488142 486287 483587
57848D83587l862n418o185o418p516q946q672o760n477n665o022n916n938n709
$$ 483587 479725 474307 468122 461704 454188 445242 436570 429810 424333 418668 412646 406730 400792 395083
57834C95083m210k272j758k370k237j372j454k532l141l432m895p087p992p519
$$ 395083 390873 388601 386843 384473 382236 380864 379410 376878 373737 370305 365410 358323 350331 342812
57820C42812p328p385o099l891l080m019m638m133l820m099l770k733k315k658
$$ 342812 335484 328099 322000 318109 315029 311010 306372 302239 298419 294320 290550 287817 285502 282844
57806B82844k612k210k343k228l97K071K683J782K092M087N511N705O587Q831
$$ 282844 280232 278022 275679 273451 273054 275125 277808 279590 281682 285769 291280 296985 303572 312403
57792C12403J0791J1721J2559J2889J0837O833L968L584L818L295K905K977K135
$$ 312403 323194 334915 347474 360363 371200 378033 382001 385585 389403 392698 395603 398580 400715
57779D00715J52j249j587k564m720o173n912n391n615n513m478l777m141m484
$$ 400715 400867 399618 398031 395467 390747 384574 378662 373271 367656 362143 357665 353888 349747 345263
57765C45263m152l942l895k644o2K006K674L252M582N673N902O142O716O655N849
$$ 345263 341111 337169 333274 330630 330568 332574 335248 338500 343082 348755 354657 360799 367515 374170 380019
57750C80019N509N655M578J699j440l760n669o978o465m453l033k877k388r11
$$ 380019 385528 391183 395761 397460 396020 392260 386591 379613 373148 368695 365662 362785 360397 359486
57736C59486O0r6K17J912L598M204M664N774O664O752O961P846Q681R281J0422
$$ 359486 359546 359450 359667 361579 365177 369381 374045 379819 386483 393235 400196 408042 416723 426004 436426
57721D36426J1776J1880J0992J1257J3121J4402J4027J3805J5201J7052J8088
$$ 436426 448202 460082 471074 482331 495452 509854 523881 537686 552887 569939 588027
57710E88027J9081K1004K3396K5920K9184L2764L4834L5124L5779L8098M1021
$$ 588027 607108 628112 651508 677428 706612 739376 774210 809334 845113 883211 924232
57699I24232M4055M8866N6331O4771P2877Q1883R3058J05559J18580J33244J50496
$$ 924232 968287 1017153 1073484 1138255 1211132 1293015 1386073 1491632 1610212 1743456 1893952
57688A893952J69370J89166K10919K34841K58334K78339K93390L01629K99152
$$ 1893952 2063322 2252488 2463407 2698248 2956582 3234921 3528311 3829940 4129092
57679D129092K82534K51245K06325J49413Q5143K1887l2456p3978j00848j10913
$$ 4129092 4411626 4662871 4869196 5018609 5103752 5125639 5093183 5019205 4918357 4807444
57669D807444j03557q1732n0018j3877J6327K4198l626o5825j45528k20614k74329
$$ 4807444 4703887 4622155 4572137 4558260 4574587 4598785 4595159 4529334 4383806 4163192 3888863
57658C888863k99666k99115k81391k55790k27769j99330j71722j46055j22526
$$ 3888863 3589197 3290082 3008691 2752901 2525132 2325802 2154080 2008025 1885499
57649A885499j01098q2401o6768n3356m1507l1744k4122j7011q974n30P457J5602
$$ 1885499 1784401 1702000 1635232 1581876 1540369 1508625 1484503 1467492 1458518 1457988 1465445 1481047
57637A481047K4636L3816M2521N1945O3347P5937Q8370J01155J15689J32059J49613
$$ 1481047 1505683 1539499 1582020 1633965 1697312 1773249 1861619 1962774 2078463 2210522 2360135
57626B360135J68348J87923K06487K22352K35485K45280K48055K39018K15980
$$ 2360135 2528483 2716406 2922893 3145245 3380730 3626010 3874065 4113083 4329063
57617D329063J79464J30657P1745P539n5715j13183j61873j99386k24438k38170
$$ 4329063 4508527 4639184 4710929 4718468 4662753 4549570 4387697 4188311 3963873 3725703
57607C725703k43051k40727k32213k19410k04609j88997j72973j57427j43236
$$ 3725703 3482652 3241925 3009712 2790302 2585693 2396696 2223723 2066296 1923060
57598A923060j30173j17672j06017r5654q6153p7113o9152o2676n6783n0754m5481
$$ 1923060 1792887 1675215 1569198 1473544 1387391 1310278 1241126 1178450 1121667 1070913 1025432
57587A025432m1905l9118l5616l1557k8114k5527k3328k1589k0392j8950j6725
$$ 1025432 983527 944409 908793 877236 849122 823595 800267 778678 758286 739336 722611
57576G22611j4566j3322j2327j0728r193q661q479p464n855m551l400j851l50
$$ 722611 708045 694723 682396 671668 662475 653814 645335 637871 632016 627465 624065 622214 621864
57563F21864N51J505L170M790N560O296P943R629J0162J0324J1692J4103J6306
$$ 621864 622415 623920 627090 631880 637440 643736 651679 661308 671470 681794 693486 707589 723895
57550G23895J8215K0475K2699K4239K5926K8996L2968L6645M0398M5501N1898
$$ 723895 742110 762585 785284 809523 835449 864445 897413 934058 974456 1019957 1071855
57539A071855N8703O6177P5080Q4886R4798J05782J19224J34200J48466J61686
$$ 1071855 1130558 1196735 1271815 1356701 1451499 1557281 1676505 1810705 1959171 2120857
57529B120857J75081J88153J98181K02845K00976J90631J69140J35778R2803M3630
$$ 2120857 2295938 2484091 2682272 2885117 3086093 3276724 3445864 3581642 3674445 3718075
57519C718075q317n8986j04056j40585j67382j84069j91311j91529j87473j79999
$$ 3718075 3709758 3650772 3546716 3406131 3238749 3054680 2863369 2671840 2484367 2304368
57509B304368j68835j55104j41204j28250j15593j02925r1056q0441p0607o1279
$$ 2304368 2135533 1980429 1839225 1710975 1595382 1492457 1401401 1320960 1250353 1189074
57499A189074n2559m4056l5308k7059k0549j5588j0859o056k131O37L195O262
$$ 1189074 1136515 1092459 1057151 1030092 1009543 993955 983096 977040 974909 975546 978741 985003
57487I85003R733J3478J7399K0828K3275K5680K9484L4697M0352M6548N4399O4101
$$ 985003 994736 1008214 1025613 1046441 1069716 1095396 1124880 1159577 1199929 1246477 1300876 1364977
57475A364977P4668Q5603R7289J09877J23156J37321J52391J67023J79271J88100
$$ 1364977 1439645 1525248 1622537 1732414 1855570 1992891 2145282 2312305 2491576 2679676
57465B679676J92641J90450J78325J54771J20317P6246K5016k8474p8428j21241
$$ 2679676 2872317 3062767 3241092 3395863 3516180 3592426 3617442 3588968 3510540 3389299
57455C389299j55664j80570j94896j99703j97968j91919j82252j69893j56452
$$ 3389299 3233635 3053065 2858169 2658466 2460498 2268579 2086327 1916434 1759982
57446A759982j42778j28982j15916j04693r4723q4397p3917o5297n9301n4444
$$ 1759982 1617204 1488222 1372306 1267613 1172890 1088493 1014576 949279 889978 835534
57436H35534m9469m4608m0008l5060l0013k6216k3947k1936j9637j8108j7819
$$ 835534 786065 741457 701449 666389 636376 610160 586213 564277 544640 526532 508713
57425E08713j7499j6137j4412j3159j1992j0479r207q653q206p309o510o543p228
$$ 508713 491214 475077 460665 447506 435514 425035 415828 407175 398969 391660 385150 378607 371379
57412C71379p938q273p890o660n249m552m367l762k723k113k020j683j107j070
$$ 371379 363441 355168 347278 340618 335369 330817 326450 322688 319965 317852 315832 314149 313042 311972
57398C11972j389j005o7J7r68j445o58J20j57n89p1Q41J033N87K87K57J09l09
$$ 311972 310583 309578 309511 309528 308560 307115 306457 306577 306420 305831 305760 306601 307634 308221 308508 308765 308874 308565
57380C08565j002j936k639k570k087k043k329k020j165q88j454j796j318p16n06
$$ 308565 307563 305627 302988 300418 298331 296288 293959 291939 290774 289886 288432 286636 285318 284602 284096
57365B84096l44k90j086k470k893j736l02K75N92J414K128J930J404J574K323
$$ 284096 283752 283462 282376 279906 277013 275277 274975 275250 275842 277256 279384 281314 282718 284292 286615
57350B86615K814K759K342J655R38P97J426K270K838L218L472L389L081K961K967
$$ 286615 289429 292188 294530 296185 297123 297920 299346 301616 304454 307672 311144 314533 317614 320575 323542
57335C23542K755K652L256M139M312L953M148M774M507L225K500L088L760L418
$$ 323542 326297 328949 332205 336344 340656 344609 348757 353531 358038 361263 363763 366851 370611 374029
57321C74029K687K488K645K859L525M627N224M975M858N525O220O283O271O695
$$ 374029 376716 379204 381849 384708 388233 392860 398084 403059 407917 413442 419662 425945 432216 438911
57307D38911O969O718O768P864R467J0789J1850J2663J2632J1716J0989J1210
$$ 438911 445880 452598 459366 467230 476697 487486 499336 511999 524631 536347 547336 558546
57295E58546J1899J2603J3669J5031J5794J6010J7292K0406K3719K5436K6054
$$ 558546 570445 583048 596717 611748 627542 643552 660844 681250 704969 730405 756459
57284G56459K7171K8978L0546L1675L2863L4050L4660L4475L3456L1279K7887
$$ 756459 783630 812608 843154 874829 907692 941742 976402 1010877 1044333 1075612 1103499
57273A103499K3843J9375J3881P062k16o960j3055j8616k3235k6635k9089l0598
$$ 1103499 1127342 1146717 1160598 1167660 1167444 1160484 1147429 1128813 1105578 1078943 1049854 1019256
57261A019256l0611k9163k7164k5054k2443j9537j7404j6085j4099j0833p754
$$ 1019256 988645 959482 932318 907264 884821 865284 847880 831795 817696 806863 799109
57250G99109o121n084l378j426k84K46R62J815K514L538N193O621P056P094P546
$$ 799109 792988 787904 784526 783100 782816 783062 784024 785839 788353 791891 797084 803705 810761 817855 825401
57235H25401Q062Q091Q114Q603Q890Q439Q128Q812R645R360Q309P644P375O808
$$ 825401 833463 841554 849668 858271 867161 875600 883728 892540 902185 911545 919854 927498 934873 941681
57221I41681O202O378P212P901Q331Q803R056Q776Q614R372J0667J1529J1887
$$ 941681 947883 954261 961473 969374 977705 986508 995564 1004340 1012954 1022326 1032993 1044522 1056409
57208A056409J2367J3101J3718J4118J4381J4395J4265J4418J4676J4091J2446
$$ 1056409 1068776 1081877 1095595 1109713 1124094 1138489 1152754 1167172 1181848 1195939 1208385
57197A208385J0902J0286R883Q806P493O803O713O993Q025R794J1090J1013J0308
$$ 1208385 1219287 1229573 1239456 1248262 1255755 1262558 1269271 1276264 1284289 1294083 1305173 1316186 1326494
57184A326494J0152J0595J1283J2599J4816J7172J9006K0729K2578K3509K2679
$$ 1326494 1336646 1347241 1358524 1371123 1385939 1403111 1422117 1442846 1465424 1488933 1511612
57173A511612K0883J9222J7563J5651J4387J4417J4617J3789J2801J3291J5058
$$ 1511612 1532495 1551717 1569280 1584931 1599318 1613735 1628352 1642141 1654942 1668233 1683291
57162A683291J6574J7290J7749J8025J7812J7636J8392J9896K1235K2219K3415
$$ 1683291 1699865 1717155 1734904 1752929 1770741 1788377 1806769 1826665 1847900 1870119 1893534
57151A893534K5145K7368K9984L2405L3562L3251L2671L2900L3804L5152L7524
$$ 1893534 1918679 1946047 1976031 2008436 2041998 2075249 2107920 2140820 2174624 2209776 2247300
57140B247300M1097M4784M7565M9525N0742N0577M9074M7535M6691M5864M4933
$$ 2247300 2288397 2333181 2380746 2430271 2481013 2531590 2580664 2628199 2674890 2720754 2765687
57129B765687M5293M7555N0079N1245N1470N1587N1030M9190M6855M4794M2627
$$ 2765687 2810980 2858535 2908614 2959859 3011329 3062916 3113946 3163136 3209991 3254785 3297412
57118C297412M0565M0324M2739M6334M9774N3783N9134O4918P0481P6925Q5111
$$ 3297412 3337977 3378301 3421040 3467374 3517148 3570931 3630065 3694983 3765464 3842389 3927500
57107C927500R4474J05515J20987J43078J72208K10237K61786L30384M16396N20593
$$ 3927500 4021974 4127489 4248476 4391554 4563762 4773999 5035785 5366169 5782565 6303158
57097F303158O46282P95708R68025J163243J384616J635239J916436K230705K579855
$$ 6303158 6949440 7745148 8713173 9876416 11261032 12896271 14812707 17043412 19623267
57088A9623267K956928L344936L724465M073701M359025M539153M586885M495267
$$ 19623267 22580195 25925131 29649596 33723297 38082322 42621475 47208360 51703627
57080E1703627M254539L842155L257239K552647J802573J036354K30086o29079
$$ 51703627 55958166 59800321 63057560 65610207 67412780 68449134 68679220 68050141
57072F8050141j494161k286619k953892l482874l873467m123621m237751m230791
$$ 68050141 66555980 64269361 61315469 57832595 53959128 49835507 45597756 41366965
57064D1366965m119989l922027l657993l351686l022000k683509k353221k048745
$$ 41366965 37246976 33324949 29666956 26315270 23293270 20609761 18256540 16207795
57056A6207795j779168j543672j339005j162891j011163q78456p62942o65930
$$ 16207795 14428627 12884955 11545950 10383059 9371896 8493440 7730498 7064568
57048G064568n86510n20743m65821m20673l82731l48358l16709k89435k66593
$$ 7064568 6478058 5957315 5491494 5070821 4688090 4339732 4023023 3733588 3466995
57039C466995k46212k27638k11847j98504j85890j73460j61661j49730j36573
$$ 3466995 3220783 2993145 2781298 2582794 2396904 2223444 2061783 1912053 1775480
57030A775480j23239j11586j01222r0569q0017p1087o3392n5518m8042m2517l8309
$$ 1775480 1652241 1540655 1439433 1348864 1268847 1197760 1134368 1078850 1030808 988291 949982
57019I49982l3657k9025k6124k4358k1627j8026j5443j3913j1757q836o372l897
$$ 949982 916325 887300 861176 836818 815191 797165 781722 767809 756052 747216 740844 736947
57007G36947K10N462R952J4114K0461K9733M0655N3432P0081R1457J17140J46949
$$ 736947 737157 742619 752571 766685 787146 816879 857534 910966 981047 1072504 1189644 1336593
56995A336593J76905J93156J76754J19889L6006m8508j11820j46340j56328j50699
$$ 1336593 1513498 1706654 1883408 2003297 2039303 1990795 1878975 1732635 1576307 1425608
56985A425608j37336j20585j02075q3363o6935n4859m7825m5724m7692n1355n3675
$$ 1425608 1288272 1167687 1065612 982249 915314 860455 812630 766906 719214 667859 614184
56974F14184n3286n0855m7072m1735l5074k8251k2014j6122j0500n658j642K141
$$ 614184 560898 510043 462971 421236 386162 357911 335897 319775 309275 303617 301975 304116
56962C04116N861R302J3046J8116K4232K9895L4346L7748L9086L5740K6153J1953
$$ 304116 309977 319279 332325 350441 374673 404568 438914 476662 515748 551488 577641 589594
56950E89594l200j5961k4357k7948k7797k5669k2757j9492j6299j3597j1089q063
$$ 589594 586394 570433 546076 518128 490331 464662 441905 422413 406114 392517 381428 373365
56938C73365m401n40L458P879J2682J7691K3287K9942L7252M3918M7964M6385
$$ 373365 368964 368424 371882 379761 392443 410134 433421 463363 500615 544533 592497 638882
56926F38882L6125J7368m735k3408l5289m1141m2679m0829l6692l1879k7233k2669
$$ 638882 675007 692375 687640 664232 628943 587802 545123 504294 467602 435723 408490 385821
56914C85821j8419j5164j2924j1126r707q948q390p268n820m874m332l373j958
$$ 385821 367402 352238 339314 328188 318481 309533 301143 293875 288055 283181 278849 275476 273518
56901B73518q07n7P37J538K060K689L906N228O006O787Q454J0689J2769J5173
$$ 273518 272711 272654 273391 274929 276989 279678 283584 288812 294818 301605 310059 320748 333517 348690
56887C48690J8752K2976K6749L0056L2693L2170K5585J3580K34j0927j8766k2889
$$ 348690 367442 390418 417167 447223 479916 512086 537671 551251 551485 540558 521792 498903
56875D98903k2977k0177j6844j4068j1114p502l781K3M715J0316J5943K1597K8391
$$ 498903 475926 455749 438905 424837 413723 406221 402440 402463 407178 417494 433437 455034 483425
56862D83425L6701M5892N6106O8195Q0961Q9731Q8522P3431M5025R270k4417m8449
$$ 483425 520126 566018 622124 690319 771280 861011 949533 1022964 1067989 1077259 1052842 1004393
56850A004393o1147o5032o2440n4903m5255l6698k9455k1241j1317j368P910J7965
$$ 1004393 943246 878214 815774 760871 715616 678918 649463 628222 616905 615537 623447 641412
56838F41412K9547M1625N4162O9165Q7854J08861J29515J45534J48704J29343
$$ 641412 670959 712584 766746 835911 923765 1032626 1162141 1307675 1456379 1585722
56828A585722Q4964K5221l3925q0180j08916j20979j20151j11635r9868q6877
$$ 1585722 1670686 1695907 1661982 1581802 1472886 1351907 1231756 1120121 1020253 933376
56818I33376p3183n9392m6068l3220k1042j0168l76R962K2201L6248N1666O8550
$$ 933376 860193 800801 754733 721513 700471 690303 689927 699889 722090 758338 810004 878554
56806H78554Q6063J00665J06497R7412P0001K7239k0385o0009q4509r5029r6112
$$ 878554 964617 1065282 1171779 1269191 1339192 1366431 1346046 1286037 1201528 1106499 1010387
56795A010387r0945q1814p1573o2080n2743m2548l2311k3400j5650q108o57O554
$$ 1010387 919442 837628 766055 703975 651232 608684 576373 552973 537323 529215 528558 535112
56783E35112J4152K2683L1734M0805M9486N5367N3570M0585J8123p906l1448m8582
$$ 535112 549264 571947 603681 644486 693972 749339 802909 843494 861617 853711 822263 773681
56771G73681n7690n9610n7100n2685m7187m0973l5243l0891k7147k2910j8641
$$ 773681 715991 656381 599281 546596 499409 458436 423193 392302 365155 342245 323604
56760C23604j5617j3930j2493j0528q109n708l983l452l701l598k763j946j590
$$ 323604 307987 294057 281564 271036 262927 257219 253236 249784 246083 242485 239722 237776 236186
56747B36186j151l98k3k80m15j70m45j542k271j883j481k222l405l662k960k129
$$ 236186 235035 234637 234614 234334 233919 233749 233304 231762 229491 227608 226127 223905 220500 216838 213878 211749
56731B11749j394o32k43o53j584k648l806m616m166k591j425j605k288k439k264
$$ 211749 210355 209723 209480 208827 207243 204595 200789 196173 192007 189416 187991 186386 184098 181659 179395
56716A79395k187j816r63m06n51o95m55n41j087r39K65J008K89n26J33J534K055
$$ 179395 177208 175392 174429 174023 173472 172777 172322 171781 170694 169755 170020 171028 171317 170791 170924 172458 174513
56699A74513J736J538J353O18j5M22J404J716J413J422J825K028K021K067J770
$$ 174513 176249 177787 179140 179758 179743 180165 181569 183285 184698 186120 187945 189973 191994 194061 195831
56684A95831Q00j09j32L12L64J23J11Q2m44j115j324j154q76k81O13J121J043
$$ 195831 196631 196522 196390 196702 197066 197189 197300 197382 196938 195823 194499 193345 192469 192188 192801 193922 194965
56667A94965J147J724J901J330J166K207L444L657L149K629J818M48o67r74j214
$$ 194965 196112 197836 199737 201067 202233 204440 207884 211541 214690 217319 219137 219585 218918 217944 216730
56652B16730j788j587L8J704J906J103K91q52k599l675l162k479l246m567m590
$$ 216730 214942 213355 213393 215097 217003 218106 218397 217545 214946 211271 208109 205630 202384 197817 193227
56637A93227l566k988k806j948p05k34l49o9L63J24k19M00J345J181J60l31k16
$$ 193227 189661 186673 183867 181919 181214 180980 180631 180562 180925 181049 180830 181230 182575 183756 183916 183585 183369
56620A83369l83m98M44J780J781M84k70K87R77P70o8r88j698j639m56J047J713
$$ 183369 182986 182488 182932 184712 186493 186977 186707 186994 187971 188741 188673 187685 185987 184348 183892 184939 186652
56603A86652J578J422J245N73k62n27l23j60N8L69n2j581k921k731j617r52p17
$$ 186652 188230 189652 190897 191470 191208 190681 190358 190198 190256 190625 190573 188992 186071 183340 181723 180771 180054
56586A80054k24J19m05j145j067n45l84q2J065K173K137J754K308L112K723J598
$$ 180054 179830 179949 179544 178399 177332 176787 176403 176321 177386 179559 181696 183450 185758 188870 191593 193191
56570A93191J249J619J749K019L222M377M119L468M356O137O536N525N182N953
$$ 193191 194440 196059 197808 199827 203049 207426 211545 215013 219369 225506 232042 237567 242749 248702
56556B48702O213N487N134N566N603M931M623M843M452L254K310J780O84r78k100
$$ 248702 254915 260402 265536 271102 276705 281636 286259 291102 295554 298808 301118 302898 303582 302604 300504
56541C00504k627l588m851n070m102l394l715m368m773m927m503l358k586l100
$$ 300504 297877 294289 289438 284368 280266 276872 273157 268789 264016 259089 254586 251228 248642 245542
56527B45542l736k910j427j167j797j603q80j335k472k113m36o7j739l238l189
$$ 245542 241806 238896 237469 236302 234505 232902 232022 230687 228215 226102 225666 225599 223860 220622 217433
56512B17433k753k838k737k242k284k658j956m37p2j046j196J91J110L92m03j4
$$ 217433 214680 211842 209105 206863 204579 201921 199965 199528 199456 198410 197214 197405 198515 198907 198504 198490
56496A98490M66l8o57m68n8Q6O38J684K124J731J716K259J849J62q16K50K100
$$ 198490 198956 198918 198261 197793 197735 197821 198459 200143 202267 203998 205714 207973 209822 209984 209168 209418 211518
56479B11518L099L312L274K767J977J900K539K589J798J621K687L762M104M594
$$ 211518 214617 217929 221203 223970 225947 227847 230386 232975 234773 236394 239081 242843 246947 251541
56465B51541N586N893N063M473M942N383M981M725N489O488O767O557O144N162
$$ 251541 257127 263020 268083 272556 277498 282881 287862 292587 298076 304564 311331 317888 324032 329194
56451C29194L834L121K890J886Oj380j851k427l087k415m48P32K59k39K99O11
$$ 329194 333028 336149 339039 340925 340931 339551 337700 335273 332186 329771 329323 330055 330314 330075 330374 330985
56435C30985l59j620k180k641l471l968m111n210p474r098r061q526q420p887
$$ 330985 330626 329006 326826 324185 320714 316746 312635 307425 299951 290853 281792 273266 264846 256959
56421B56959o408n043m291l039r08N83N54J63K78P2p97j016kQ27M90j00k90q67
$$ 256959 250551 245508 241217 238178 237270 237853 238407 238570 238848 238920 238123 237107 237105 237932 238422 238322 238032 237165
56403B37165j841j603K59J801J783J433J882K346K256K493L131K617P26m49l2
$$ 237165 235324 233721 233980 235781 237564 238997 240879 243225 245481 247974 251105 253722 254448 253999 253967
56388B53967J1j510k726k053r18j032j687j944k829m907o214n007k403j24K093
$$ 253967 253978 252468 249742 247689 246771 245739 244052 242108 239279 234372 228158 223151 220748 220624 222717
56373B22717M741O615O903O907P587P644O128M512M032L491J927Q39J333J687
$$ 222717 227458 234073 240976 247883 255470 263114 269242 273754 277786 281277 283204 284043 285376 287063
56359B87063K57j553j851j424j699j943j137m08q93j362o22m8r73j835p97R60
$$ 287063 287320 285767 283916 282492 280793 278850 277713 277305 276412 275050 274428 274380 273407 271572 270775 271735
56343B71735J487J505K661M265M789M798N457N946N178M448N385O936P109O269
$$ 271735 273222 274727 277388 281653 286442 291240 296697 302643 307821 312269 317654 324590 331699 337968
56329C37968N977O262O510P330R034J0039R329Q584R396J0433J0056R358R744
$$ 337968 343945 350207 356717 364047 373081 383120 392449 401033 410429 420862 430918 440276 450020
56316D50020R726P498M656L985N183N980N872N570M490J988l90r94r12j882l028
$$ 450020 459746 467244 471900 475885 481068 487048 492920 498490 502980 504968 504578 503584 502672 500790 497762
56301D97762k732j892k141k577j530O1L81K51J513L374L782L149L351M269M601
$$ 497762 495030 493138 490997 488420 486890 486951 487332 487583 489096 492470 496252 499401 502752 507021 511622
56286E11622M936O815R661J1688J2817J4035J5116J5634J6725J9164K1356K1900
$$ 511622 516558 523373 533034 544722 557539 571574 586690 602324 619049 638213 659569 681469
56274F81469K2341K4563K7558K9818L2672L7898M4040M8715N2697N8246O5216
$$ 681469 703810 728373 755931 785749 818421 856319 900359 949074 1001771 1060017 1125233
56263A125233P2360Q0527R0947J02193J12596J23723J37736J53219J67463J80843
$$ 1125233 1197593 1278120 1369067 1471260 1583856 1707579 1845315 1998534 2165997 2346840
56253B346840J94805K07568K16237K21411K25240K26401K21538K10238J94177
$$ 2346840 2541645 2749213 2965450 3186861 3412101 3638502 3860040 4070278 4264455
56244D264455J72728J44222J10399P5236M0281N401k7153n4155p5914r4891j10700
$$ 4264455 4437183 4581405 4691804 4767040 4807321 4812722 4785569 4731414 4655500 4560609 4449909
56233D449909j20854j25700j28130j29095j27629j24566j22001j19854j17017
$$ 4449909 4329055 4203355 4075225 3946130 3818501 3693935 3571934 3452080 3335063
56224C335063j14902j15732j18331j19785j20142j21220j22212j21009j18629
$$ 3335063 3220161 3104429 2986098 2866313 2746171 2624951 2502739 2381730 2263101
56215B263101j17515j16573j12856j07004j02090r7975r2026q4635p8813p4694
$$ 2263101 2145586 2029013 1916157 1809153 1707063 1609088 1517062 1432427 1353614 1278920
56205A278920o9532o2885n6926n1918m6187m0230l6191l3608l0249k6540k4635
$$ 1278920 1209388 1146503 1089577 1037659 991472 951242 915051 881443 851194 824654 800019
56194H00019k3803k1526j8369j6882j6488j4548j1587j0318j0210q423n415m188
$$ 800019 776216 754690 736321 719439 702951 688403 676816 666498 656288 647865 642450 638262
56182F38262m552l598j272m1M16K497N310N872N090O581R852J0811R015Q199R472
$$ 638262 633710 630112 628840 628799 629215 631712 637022 642894 647984 654565 664417 675228 684243 692442 701914
56167G01914R997Q845Q192Q303P086M972M608N450M349J591N91J536J246n63q96
$$ 701914 711911 720756 728948 737251 744337 749309 753917 759367 763716 765307 765898 767434 768680 768117 767221
56152G67221N46J123R87K931O406Q003P971R882J3708J5940J6720K0064K6543
$$ 767221 767767 768890 769877 772808 779214 787217 795188 805070 818778 834718 851438 871502 898045
56139H98045L2580L7531M4597N4223O3550P2897Q5557J00339J11530J17087J19715
$$ 898045 930625 968156 1012753 1066976 1130526 1203423 1288980 1389319 1500849 1617936 1737651
56128A737651J19229J11677R7400Q2462P0486O0231N2185M9459N0373M7901L8792
$$ 1737651 1856880 1968557 2065957 2148419 2218905 2279136 2331321 2380780 2431153 2479054 2517846
56117B517846K6470J3651l26j3429k0406k0899k1003k4786l1223m0546n5386p3622
$$ 2517846 2544316 2557967 2557641 2544212 2523806 2502907 2481904 2457118 2425895 2385349 2329963 2256341
56105B256341q8058r5558r9276j00502r6389q7534p9221p3006o5235n5763m9433
$$ 2256341 2168283 2072725 1973449 1872947 1776558 1689024 1609803 1536797 1471562 1415799 1366366
56094A366366m6906m3065l6822l3196l3127l0780k4170j8893j7839j6541j2531
$$ 1366366 1319460 1276395 1239573 1206377 1173250 1142470 1118300 1099407 1081568 1065027 1052496
56083A052496r939j0708j0370o754m068m243l080R63L093J378O92L430N313M453
$$ 1052496 1042557 1031849 1021479 1014725 1010657 1006414 1003334 1004297 1007390 1008768 1009460 1012890 1018203 1022656
56069A022656N329R512J1722R571P960R547J0256Q406Q618J2145J3370J0422R309
$$ 1022656 1027985 1037497 1049219 1058790 1066750 1076297 1086553 1094959 1103577 1115722 1129092 1139514 1148823
56056A148823J2738J5141J3620J3315J6803J8844J6888J6210J9264K0760J8663
$$ 1148823 1161561 1176702 1190322 1203637 1220440 1239284 1256172 1272382 1291646 1312406 1331069
56045A331069J8855K3403K5655K2755K1287K4530K6232K3355K2566K7363L1136
$$ 1331069 1349924 1373327 1398982 1421737 1443024 1467554 1493786 1517141 1539707 1567070 1598206
56034A598206L0031L0083L4497L6772L3954L3478L9045M3082M1377M1427M7716
$$ 1598206 1628237 1658320 1692817 1729589 1763543 1797021 1836066 1879148 1920525 1961952 2009668
56023B009668N2559N0628M8617N1334N2434M8405M7217N3151N7682N5500N4605
$$ 2009668 2062227 2112855 2161472 2212806 2265240 2313645 2360862 2414013 2471695 2527195 2581800
56012B581800O0337O4899O3414O4238P2238P8255P6914P7797Q6895R4478R4149
$$ 2581800 2642137 2707036 2770450 2834688 2906926 2985181 3062095 3139892 3226787 3321265 3415414
56001C415414R5743J05836J14177J13825J15590J27230J37945J39521J42999J57448
$$ 3415414 3511157 3616993 3731170 3844995 3960585 4087815 4225760 4365281 4508280 4665728
55991D665728J72408J78816J86627K03624K18219K22211K28515K46800K64533
$$ 4665728 4838136 5016952 5203579 5407203 5625422 5847633 6076148 6322948 6587481
55982F587481K72534K84991L12593L41354L60846L86629M30458M76489N12851
$$ 6587481 6860015 7145006 7457599 7798953 8159799 8546428 8976886 9453375 9966226
55973I966226N57090O22938O93466P56657Q34127R43044J065511J189705J342921
$$ 9966226 10523316 11146254 11839720 12596377 13430504 14373548 15439059 16628764 17971685
55964A7971685J547197J784061K043288K360736K764201L233272L762994M412902
$$ 17971685 19518882 21302943 23346231 25706967 28471168 31704440 35467434 39880336
55956C9880336N241272O257792P503955R104387J1165740J3713646J6814955K0654742
$$ 39880336 45121608 51379400 58883355 67987742 79153482 92867128 109682083 130336825
55948A30336825K5393876L1075572L7682929M4774166N0474329N1115262M3056339
$$ 130336825 155730701 186806273 224489202 269263368 319737697 370852959 413909298
55941D13909298K5827992L474812j7679088l2863355m0833711m2963273m1326393
$$ 413909298 439737290 443212102 425533014 392669659 351835948 308872675 267546282
55934B67546282l7653329l3196144k8741127k4609543k0858234j7530794j4682795
$$ 267546282 229892953 196696809 167955682 143346139 122487905 104957111 90274316
55927I0274316j2288226j0271442q600086p258724o175736n261067m484321l848879
$$ 90274316 77986090 67714648 59114562 51855838 45680102 40419035 35934714 32085835
55919C2085835l324024k865439k470823k155678j899793j669210j465662j306010
$$ 32085835 28761811 25896372 23425549 21269871 19370078 17700868 16235206 14929196
55911A4929196j176073j049802r32542q42962p71754o97603o25617n72538n30911
$$ 14929196 13753123 12703321 11770779 10927817 10156063 9458460 8832843 8260305 7729394
55902G729394m83074m34745m01373l76050l42710l07076k84280k68979k46594
$$ 7729394 7246320 6811575 6410202 6034152 5691442 5384366 5100086 4831107 4584513
55893D584513k21751k07740j99560j84011j65521j56400j51972j39980j24723
$$ 4584513 4362762 4155022 3955462 3771451 3605930 3449530 3297558 3157578 3032855
55884C032855j18048j15916j06761r4202q9221q8365q1199p1250o8690o9930o4729
$$ 3032855 2914807 2798891 2692130 2597928 2508707 2420342 2339143 2267893 2199203 2129273 2064544
55873B064544n6181n4142n5836n1990m5316m4428m6093m1665l4811l4937l9105
$$ 2064544 2008363 1954221 1898385 1846395 1801079 1756651 1710558 1668893 1634082 1599145 1560040
55862A560040l7840l3143l3511l6556l3509k6078k2478k1277j5106o029j957k054
$$ 1560040 1522200 1489057 1455546 1418990 1385481 1359403 1336925 1315648 1300542 1294513 1292556 1290502
55850A290502n19l03q082j9731k5460k5662k7465k9711k5841j8177j4991j6106
$$ 1290502 1289983 1289680 1281598 1261867 1236407 1210745 1183280 1153569 1127728 1109551 1094560 1078454
55838A078454j4988j2291j4019j8760j9866j8040j9420k3356k4090k2216k2812
$$ 1078454 1063466 1051175 1037156 1018396 998530 980490 961070 937714 913624 891408 868596
55827H68596k4592k2364j7764j6411j7028j4503j0815j1660j5090j4795j1963
$$ 868596 844004 821640 803876 787465 770437 755934 745119 733459 718369 703574 691611
55816F91611j2475j4966j3230q213o154o724m272P67K828K015L231N926N268K232
$$ 691611 679136 664170 650940 642727 636573 629849 625577 626344 629172 631187 634418 640344 645612 647844
55802F47844K130M260L188r01l041l325n994j0150j1249j0544j3010j7236j7415
$$ 647844 649974 654234 657422 656521 653480 650155 644161 634011 622762 612218 599208 581972 564557
55789E64557j4282j3813j6031j5356j1585j0183j1777j1324q057o570p490o311
$$ 564557 550275 536462 520431 505075 493490 483307 471530 460206 452149 445579 438089 431778
55777D31778k239M80N65P21N78l071q797j1566j1201j1839j3354j1780p923o773
$$ 431778 429539 430019 430584 431305 431883 428812 420015 408449 397248 385409 372055 360275 352352 345579
55763C45579q302p525l976k442l909m284k806l227n810o451m749m851p259p790
$$ 345579 337277 329752 325776 323334 319425 315141 312335 309108 303298 296847 292098 287247 279988 272198
55749B72198n716n021o445o103l356k278l877m350k645k288m164m650k718j873
$$ 272198 266482 261461 255016 248913 245557 243279 239402 235052 232407 230119 225955 221305 218587 216714
55735B16714l282l695j921q08j179k39K402L382J757M29K11j354m183n017l640
$$ 216714 213432 209737 207816 207008 205829 205590 207992 211374 213131 213560 213771 212417 208234 203217 199577
55720A99577l516n130n055k792j916l234l259r74L62l33j01J879K605J428J641
$$ 199577 196061 190931 185876 183084 181168 177934 174675 173701 174063 173730 173629 175508 178113 179541 181182
55705A81182M182N829N452N926Q065Q688O639M766M177K498l63r40J365K608J180
$$ 181182 185364 191193 196645 202571 210636 219324 225963 230729 234906 237404 237041 236101 237466 240074 241254
55690B41254K57J254J033j764l736k933k335m090n693m974l781l594k373J006
$$ 241254 241511 242765 243798 242034 238298 235365 233030 228940 223247 218273 214492 210898 208525 209531
55676B09531L756L649K429K061J647M66O5R40J099o0m14O11O83q25j303J66R51
$$ 209531 213287 216936 219365 221426 223073 223539 223604 224544 225643 225583 225169 225780 226463 225638 224335 224501 225452
55659B25452j38o31P82J808J135Q94K299L170K161J137J151L27k107l892m023
$$ 225452 225314 224683 225465 227273 228408 229302 231601 234771 236932 238069 239220 239547 237440 233548 229525
55644B29525m645o705q050p950q859j1391j2284r964p616p796q344o679m176l137
$$ 229525 224880 218175 210125 202175 193316 181925 169641 159677 152061 144265 135921 129242 125066 121929
55630A21929l037k774l180m593n129l827k434k027j292J17K39j293j977r46o38
$$ 121929 118892 116118 112938 108345 103216 99389 96955 94928 93636 93753 93992 92699 90722 89776 89138
55615H9138j955k213k24J090j53j480p63N5r27j882j030k31j363k692k222j281
$$ 89138 87183 84970 84746 85836 85683 84203 83440 83495 82568 80686 79656 79425 78062 75370 73148 71867
55599G1867j528j704n87J16r11j570K3J976J911R11R41J212L32o24l21J35l17
$$ 71867 70339 68635 68048 68164 67253 65683 65706 67682 69593 70504 71445 72657 72989 72365 72044 72179 71862
55582G1862k43J393K550J387m20o57k49r55j890j451m68m75r16p29n74j080j116
$$ 71862 71619 73012 75562 76949 76529 75872 75623 74668 72778 71327 70859 70384 69468 68739 68165 67085 65969
55565F5969j67J30j010j627m96M48l26j009J72J645J544J112J955K689J653L90
$$ 65969 65802 65932 64922 63295 62799 63247 62921 61912 62084 63729 65273 66385 68340 71029 72682 73072
55549G3072R88K303K217J440J769K534K109J195J425K341K610K590L009K903J493
$$ 73072 74060 76363 78580 80020 81789 84323 86432 87627 89052 91393 94003 96593 99602 102505 103998
55534A03998K82O52J370R18L07R92K093K316K513L650M346L148J256L60j33j219
$$ 103998 104280 104932 106302 107220 107527 108519 110612 112928 115441 119091 123437 126585 127841 128201 128068 126849
55518A26849j903j286p44j312j424M2R80n40k721l151l040m766p469q763q922
$$ 126849 124946 123660 122916 121604 120180 120222 121202 120662 117941 114790 111750 106984 99515 90752 81830
55503H1830r636j0375r640q258p867p621n864l644l079l543k948j522r65j039
$$ 81830 72194 61819 52179 43921 36054 28433 22569 18925 15846 12303 9355 7833 6868 5829
55489E829l35O96P82O71J714K800K056M82M74J676J781O04lK84J34m31p0J120
$$ 5829 5494 6190 6972 7643 9357 12157 14213 14695 15169 16845 18626 19230 19227 19511 19645 19214 19144 20264
55471B0264J709J538J676K212K461K769L787M668M200K938K040J140m27j642j473
$$ 20264 21973 23511 25187 27399 29860 32629 36416 41084 45284 48222 50262 51402 50975 49333 47860
55456D7860j134k049l061k405j010q22j302p56J22n21k004k117j061r34j835j869
$$ 47860 46726 44677 41616 39211 38201 37379 36077 35321 35443 34922 32918 30801 29740 28806 26971 25102
55440B5102p02K2k74n01j91J60P03J714K045O25j175j314l34k32r04o66M29R00
$$ 25102 24400 24422 24148 23647 23456 23616 24319 26033 28078 28703 27528 26214 25880 25648 24744 24078 24507 25407
55422B5407Q14J355J977J106o42j117k84j78j194j552n49M49O62Q51J342J414
$$ 25407 26221 27576 29553 30659 30017 28900 28616 28438 27244 25692 25143 25592 26254 27105 28447 29861
55406B9861R55O23L86k05n96q3M62j58j095p21M53N92l91j075j241j690k026j274
$$ 29861 30816 31439 31825 31620 31024 30941 31403 31245 30150 29429 29882 30474 30083 29008 27767 26077 24051 22777
55388B2777k00k17o16K75J757J660J41o44l05m08j008m31J271J934R03oK17M37
$$ 22777 22577 22360 21744 22019 23776 25436 25577 24933 24628 24220 23212 22781 24052 25986 26889 26883 27100 27537
55370B7537q8m70k99m80j212j361n18L23O41Q94J006L89l97j08R03J073K64j77
$$ 27537 27449 26979 26680 26200 24988 23627 23109 23432 24073 24967 25973 26362 25965 25857 26760 27833 28097 27920
55352B7920j7l83j293j391m64J43j02l18k50p23j689j964j241m63q2K55L68j95
$$ 27920 27903 27520 26227 24836 24372 24515 24413 24095 23845 23122 21433 19469 18228 17765 17683 17938 18306 18111
55334A8111p33l00M09J27n54k13O19M09k57M08J804J592j45q54N5L23j002j922
$$ 18111 17378 17078 17487 17614 17060 16847 17466 17875 17618 18026 19830 21422 21277 20423 20478 20801 19799 17877
55316A7877j093Q7K50J00M11N89M03P71J689J713N60j24L95O69k36j081p08J04
$$ 17877 16784 16871 17121 17221 17632 18221 18624 19395 21084 22797 23357 23233 23628 24297 24061 22980 22272 22376
55298B2376L19K22K43L3l38j9R30J232N56R4M17O41M32P12J629J934J205O65R24
$$ 22376 22695 22917 23160 23193 22855 22836 23766 24998 25554 25648 26065 26706 27138 27850 29479 31413 32618 33283 34207
55279C4207R58K00l94k72l06r14j150o12l58q95j199o91l57q25j205q02l79o30
$$ 34207 35165 35365 34971 34699 34393 33479 32329 31717 31359 30464 29265 28574 28217 27392 26187 25385 25006 24376
55261B4376j031j053r42o08N57K108K559J669Q31O13lj224j564l69Q33P54J33
$$ 24376 23345 22292 21350 20742 21299 23407 25966 27635 28466 29079 29076 27852 26288 25919 26752 27506 27639
55244B7639P%l45l95K62Q45Q78J042J536J334O7j027j095r08r90m01J329K725
$$ 27639 27646 27646 27301 26906 27168 28013 28891 29933 31469 32803 32870 31843 30748 29840 28850 28449 29778 32503
55226C2503K327Q00k73m71k96QK79Q1n74j077j276j541j527m00J330J987J199
$$ 32503 34830 35630 35357 34886 34590 34598 34877 34958 34384 33307 32031 30490 28963 28563 29893 31880 33079
55209C3079M47N53N98kl95j46j25o18m72P41J679J427Q68P88N25k88o20J1L06
$$ 33079 33526 34079 34677 34675 34280 34134 34009 33391 32919 33660 35339 36766 37634 38422 38947 38659 38039 38050 38356
55190C8356o04j566j397q08q11r09l89J03j26l74J28P52P65P26J197J407O82q4
$$ 38356 37752 36186 34789 33981 33170 32261 31872 31975 31849 31475 31603 32355 33120 33846 35043 36450 37132 37048
55172C7048J21O75M48l79r37j134j300j292j041j004j187q54N3M49j65q74j012
$$ 37048 37169 37844 38292 37913 36976 35842 34542 33250 32209 31205 30018 29164 29217 29666 29501 28627 27615
55155B7615j111j355q59N57J599J584J517J938J707K21j020q01k39p23j476j093
$$ 27615 26504 25149 24290 24847 26446 28030 29547 31485 33192 33413 32393 31592 31353 30630 29154 28061
55139B8061m5L63K52M68P08K14n46o44l10k49j90L84R96J010Q72J152J449J407
$$ 28061 28016 28379 28631 29099 29807 30021 29475 28831 28521 28272 28082 28466 29462 30472 31344 32496 33945 35352
55121C5352J727K691L033J819L33L15J377J891J554J288J270Q31n0o81q40q16
$$ 35352 37079 39770 42803 44622 44955 45270 46647 48538 50092 51380 52650 53481 53431 52750 51910 51094
55105E1094o69l92l20n70p38p40j050j490j046L55J291R51L79N71Q55M02j54J4
$$ 51094 50425 50033 49713 49143 48405 47665 46615 45125 44079 44434 45725 46676 47055 47626 48481 48883 48729 48743
55087D8743M67O32J013J867K164J360P11J238J826J110j64n16k41n47j274j381
$$ 48743 49210 49842 50855 52722 54886 56246 56957 58195 60021 61131 60967 60451 60210 59663 58389 57008
55071E7008q53l52K07J104J701J422Q99O99J10j320k273j519j9O28O40J027J353
$$ 57008 56155 55803 56010 57114 58815 60237 61136 61835 61945 60625 58352 56833 56814 57442 58082 59109 60462
55054F0462O62m16o33l17n37r29n08J90m6q09q38l61n08r94o16L81O88K99L41
$$ 60462 61124 60708 60075 59758 59221 58292 57784 57974 57928 57119 56281 55920 55412 54418 53802 54183 54871 55170 55511
55035E5511Q65Q67L41K49O24O35L48N36R26N89j01Q7R31R22k15j012n42N52J454
$$ 55511 56376 57243 57584 57833 58457 59092 59440 59976 60902 61491 61390 61477 62408 63330 63115 62103 61561 62113 63567
55016F3567K058K231J607M06o83j416j855j672p83j44o39j634j923j568j381j295
$$ 63567 65625 67856 69463 69869 69186 67770 65915 64243 63460 63316 62677 61043 59120 57552 56171 54876
55000E4876p80k41k95k99O47J837J881J025N44M52j86j095j116m81n08j170j056
$$ 54876 54096 53855 53560 53261 53908 55745 57626 58651 59195 59647 59461 58366 57250 56769 56261 55091 54035
54983E4035J82J325J731J946K139J796J213J389K174K341J675J257J471J468R08
$$ 54035 54217 55542 57273 59219 61358 63154 64367 65756 67930 70271 71946 73203 74674 76142 77050
54968G7050N07N98P94J242K499L933M130L170K766L636M635M960N448O905Q739
$$ 77050 77557 78155 78949 80191 82690 86623 90753 93923 96689 100325 104960 109920 115368 122273 131012
54953A31012J0211J1707J3902J6633J9213K1038K1543K0420J8136J5309J1622
$$ 131012 141223 152930 166832 183465 202678 223716 245259 265679 283815 299124 310746
54942C10746O378L0o020j1045j5151j8029j9121j8991j8837j8533j6836j3774
$$ 310746 317124 317154 311134 300089 284938 266909 247788 228797 209960 191427 174591 160817
54930A60817j1119r968r462q505p202n983m610k935j571j001q95p68n75k49M37
$$ 160817 149698 139730 130268 121763 114561 108578 103968 101033 99462 98461 97566 96798 96223 95974 96411
54915I6411J327J977K507L592N468P820J0517J3540J6260J7895J8626J9170J9372
$$ 96411 97738 99715 102222 105814 111282 119102 129619 143159 159419 177314 195940 215110 234482
54902B34482J8342J5869J2506Q304K803l626r633j4206j7135j8354j8002j6995
$$ 234482 252824 268693 281199 289503 292306 288680 279047 264841 247706 229352 211350 194355
54890A94355j6294j5696j4456j2730j1158r489p199n045m274m497m247l380k957
$$ 194355 178061 162365 147909 135179 124021 114532 107333 102288 98014 93517 89270 85890 82933
54877H2933k905k016m10K82l62q42l94j96j036j789j342m07k00o83j204j728k402
$$ 82933 80028 78012 77602 77884 77522 76680 76286 76090 75054 73265 71923 71516 71316 70633 69429 67701 65299
54860F5299k847k730k228j440k80P64P99j42j008j176r40n05K03N77j96j510j723
$$ 65299 62452 59722 57494 56054 55774 56538 57337 57195 56187 55011 54071 53566 53769 54346 54150 52640 50917
54843E0917n64M59L83n5j59k92n71k02R39J576Q69l25q05n23K5O38J026P94L73
$$ 50917 50353 50812 51195 51140 50981 50689 50118 49916 50855 52431 53300 52975 52170 51647 51672 52310 53336 54130 54503
54824E4503P13J622J851J205R30J440J553P36K12Q13J531J421J211J697K109J605
$$ 54503 55216 56838 58689 59894 60824 62264 63817 64553 64765 65578 67109 68530 69741 71438 73547 75152
54808G5152R69J314K292L089M021N609P097P545P532Q303R944J1779J3791J6200
$$ 75152 76121 77435 79727 82816 86837 92446 99543 107088 114620 122923 132867 144646 158437 174637
54794A74637J8351J9417J9719J9911J9380J6834J2211O713J296l806q237j1502
$$ 174637 192988 212405 232124 252035 271415 288249 300460 307173 308469 304663 296426 284924
54782B84924j3664j5151j5917j5614j4428j3007j1624j0111q524p272o639o516
$$ 284924 271260 256109 240192 224578 210150 197143 185519 175408 166884 159612 152973 146457
54770A46457o436n812m424k859j860j227p4J600K643K512K261L108M882O634Q061
$$ 146457 140021 134209 129785 126926 125066 123839 123765 125365 128008 130520 132781 135889 140771 147405 155466
54755A55466R496J1047J2624J4357J6379J8427K0142K1350K1693K0539J7655J3482
$$ 155466 164962 176009 188633 202990 219369 237796 257938 279288 300981 321520 339175 352657
54743C52657Q419K490l906r585j3478j5526j6424j6897j7373j7725j7283j5749
$$ 352657 361076 363566 359660 350075 336597 321071 304647 287750 270377 252652 235369 219620
54731B19620j4029j3288j3260j2610j0996r469q661p974o967o157n823n332m386
$$ 219620 205591 192303 179043 166433 155437 145968 137307 129333 122366 116209 110386 105054 100668
54718A00668l640l368k786j499m06k76n37m01j27j38k0N62R04L40n05o46k12M8
$$ 100668 97028 93660 90874 89375 88969 88693 88156 87755 87628 87490 87470 88032 88936 89276 88771 88125 87913 87961
54700H7961N7J76K76J8l74m63k92m5L80R05J045P79Q62J574K052J597Q07M84K81
$$ 87961 88018 88194 88470 88488 88114 87651 87359 87314 87694 88599 89644 90423 91285 92859 94911 96508 97315 97799 98080
54681I8080m49j185q58M46J485J464P48J39L8L51P26R28J132J591K106K322K462
$$ 98080 97631 96446 95588 96034 97519 98983 99731 99870 99908 100259 100985 101913 103045 104636 106742 109064 111526
54664A11526K997L653L758L530L850M608M656L736L042L272L606L258K740K613
$$ 111526 114523 118176 121934 125464 129314 133922 138578 142314 145356 148628 152234 155492 158232 160845
54650A60845K403J630Q74P19P50N91Q73K176L806M695M712M366M072M399O008
$$ 160845 163248 164878 165752 166471 167221 167812 168685 170861 174667 179362 184074 188440 192512 196911 202919
54635B02919Q534J0591J1556J2250J3046J2734J0260O297J961k716p783j2095
$$ 202919 211453 222044 233600 245850 258896 271630 281890 288187 290148 287432 279649 267554
54623B67554j4521j5399j5549j4882j3264j1639j0727r697p655n503m652m722
$$ 267554 253033 237634 222085 207203 193939 182300 171573 161876 154221 148718 144066 139344
54611A39344m253l085k227j872j223n8J004J611J863J743J422J644K608L109K069
$$ 139344 135091 132006 129779 127907 126684 126626 127630 129241 131104 132847 134269 135913 138521 141630 143699
54596A43699L28n01l54m66j215j804j872j987k564l473m607n794o390n911m827
$$ 143699 144027 143526 143172 142706 141491 139687 137815 135828 133264 129791 125184 119390 113000 107089 102262
54581A02262l896l173k473k135k321k281j483p23r15j487j369q19q33j324j423
$$ 102262 98366 95193 92720 90585 88264 85983 84500 83777 82862 81375 80006 79187 78354 77030 75607
54566G5607j105j004j047p76n70j070j731j506o29k04l04m4O32R09O84O76R03
$$ 75607 74502 73498 72451 71675 71105 70035 68304 66798 66169 65965 65661 65617 66249 67158 67842 68518 69421
54549F9421N97k84q41o79k98K4M62P89M99j07j26N62J216J481J703K085K523L167
$$ 69421 70018 69734 68893 68214 67916 67940 68402 69191 69690 69583 69457 70019 71235 72716 74419 76504 79027 82194
54531H2194M054M512M030L378L687M700N304N388N721O199N900M791L766K905
$$ 82194 86248 90760 94790 98168 101855 106555 111859 117247 122968 129167 135067 139858 143624 146529
54517A46529J274j254l580n044o129p093p303o431n174m312l905l769l807l662
$$ 146529 147803 146549 142969 137925 131796 124703 117400 110969 105795 101483 97578 93809 90002 86340
54503H6340k945j908j097m20M49R98M87m89n29L90P96L5p41m83K61M57O2l76o30
$$ 86340 83395 81487 80390 79970 80419 81417 81904 81415 80886 81276 82072 82107 81366 80883 81144 81601 81663 81287 80657
54484H0657o46k18N27R40O43O7j64Q5O22J234J659J729J628J590J421Q33J15j49
$$ 80657 80011 79793 80320 81260 81903 81970 81806 81891 82513 83747 85406 87135 88763 90353 91774 92607 92722 92573
54466I2573J24O00J168J780J919J075l95j689k499k889k634j670p98q15j211r65
$$ 92573 92697 93297 94465 96245 98164 99239 98844 97155 94656 91767 89133 87463 86665 85850 84639 83674
54450H3674k79k84j118j644j230n52m40r34j700k406k567j872p78l6K43L62K07
$$ 83674 83395 83111 81993 80349 79119 78567 78127 77193 75493 73087 70520 68648 67870 67834 68077 68439 68646
54433F8646m12r39p02p1K01L47J034J762J360L7o56n3Q94J294J339J385J281J045
$$ 68646 68234 67295 66593 66522 66723 67070 68104 69866 71226 71263 70607 70554 71448 72742 74081 75466 76747 77792
54415G7792J052J217J015N17M06Q23J164J120R59Q16O73R19J808K559K266J479
$$ 77792 78844 80061 81076 81593 81999 82822 83986 85106 86065 86881 87554 88473 90281 92840 95106 96585
54399I6585J467K236K718K811L397M320M338L354K824L430M142M178M153M470
$$ 96585 98052 100288 103006 105817 109214 113534 117872 121226 124050 127480 131622 135800 139953 144423
54385A44423M279L062J768J264R19j31j406j915j775j906k663l579m119m076l602
$$ 144423 148702 151764 153532 154796 155715 155584 154178 152263 150488 148582 145919 142340 138221 134145 130543
54370A30543l236l395l764l741l425l353l347k762j849j672k418k991k614j676
$$ 130543 127307 123912 120148 116407 112982 109629 106282 103520 101671 99999 97581 94590 91976 90300
54356I0300p53J02O99N46k05o55m11j0K03N97J314J823J773J456J185J047J280
$$ 90300 89547 89649 90348 90894 90689 90034 89623 89613 89816 90413 91727 93550 95323 96779 97964 99011 100291
54339A00291J977K587K627K681L447M340M422M297N106O040N157K652Q78P35N58
$$ 100291 102268 104855 107482 110163 113610 117950 122372 126669 131775 137815 142972 145624 146502 147237 147795
54324A47795p38j979k285k784m259n304m578l187k893l479l627l263l217l464
$$ 147795 147057 145078 142793 140009 135750 130446 125868 122681 119788 116309 112682 109419 106202 102738
54310A02738l390l101l105l297l349l405l460k877j511l55j50k67KJ37n18j321
$$ 102738 99348 96247 93142 89845 86496 83091 79631 76754 75243 74888 74738 74471 74473 74610 74092 72771
54294G2771j295o87m11n86p46q73j194j503j505j334j047m06L34L51l70p16j53
$$ 72771 71476 70789 70378 69792 69046 68173 66979 65476 63971 62637 61590 61184 61518 61869 61499 60783 60630
54277F0630L93J76j06L14Q75P96M63N30O68L76J33N36J122J123O49J69k94n71
$$ 60630 61023 61199 61093 61407 62282 63078 63541 64071 64739 65115 65248 65784 66906 68029 68678 68847 68553 67982
54259F7982l2J164J684R26J64N42J185P14m82j050q23o17o20m84l51m14j54O54
$$ 67982 67950 69114 70798 71724 71888 72430 73615 74329 73847 72797 71974 71357 70737 70253 69902 69488 69334 69988
54241F9988R91R2r20m70J045J847J351N09j0m20p39n79J1N18P27O69K09n10p83
$$ 69988 70979 71071 70151 69681 70726 72573 73924 74433 74423 74003 73264 72685 72696 73214 73941 74610 74819 74309 73526
54222G3526l83j93q16j404r67m5K03j96m30m04m34k08N43R81K68q18r13j49L36
$$ 73526 73143 72950 72134 70730 69763 69718 69921 69725 69295 68891 68457 68249 68792 69773 70041 69223 68310 68161 68497
54203F8497L91P21J177R78L31K08O15O45K10J22M81M83l3k72J47P14J085J410
$$ 68497 68888 69609 70786 71764 72095 72303 72918 73563 73773 73895 74376 74859 74826 74554 74701 75415 76500 77910
54185G7910J609J315O34J6n22j151j566j440j187j189q50L38J405J059k31q99
$$ 77910 79519 80834 81468 81484 80962 79811 78245 76805 75618 74429 73579 73917 75322 76381 76150 75251
54169G5251o77o62j162j299p72l49l36j53L14L85n8k72m3n2n45q12m41R1L89O59
$$ 75251 74574 73912 72750 71451 70679 70330 69994 69841 70155 70540 70482 70210 70167 70115 69570 68758 68317 68408 68797 69456
54149F9456R75J056R26Q65O44j10q63o64K38O43K95J97P15R39L74j40J33O36N23
$$ 69456 70431 71487 72413 73278 73922 73812 72949 72285 72523 73166 73461 73658 74373 75312 75686 75546 75679 76315 76838
54130G6838k12j180k231k979k700j415k91k50p77p73%Q74J236J007N24K39K88
$$ 76838 76626 75446 73215 70236 67536 66121 65830 65580 64803 64030 64030 64904 66140 67147 67671 67910 68198
54113F8198K12m66j342j385k93J006J363N47p46j520j115K74J603J918J272L70
$$ 68198 68410 67944 66602 65217 64924 65930 67293 67840 67094 65574 64459 64733 66336 68254 69526 69896
54097F9896m13j123j617j590j104m78J85Q11R83M34k98m66j32J18J61K10M5o79
$$ 69896 69483 68360 66743 65153 64049 63571 63756 64567 65550 65984 65686 65220 65088 65206 65367 65577 65622 64943
54079F4943j526j615q22J42O65O09J8p07p08K96J277J134K63j66m7j41m60k30
$$ 64943 63417 61802 60980 61122 61787 62396 62414 61707 60999 61295 62572 63706 63969 63803 63756 63615 63155 62925
54061F2925N75J068R02O52O52O42N54O03N61J01k51K54J171J330O99L51O04P31
$$ 62925 63500 64568 65470 66122 66774 67416 67970 68573 69134 69235 68984 69238 70409 71739 72438 72789 73393 74124
54043G4124N98R91J996K602K372K085K218K222J818J675K173K735L034L606M608
$$ 74124 74722 75713 77709 80311 82683 84768 86986 89208 91026 92701 94874 97609 100643 104249 108857
54028A08857N145M620L712L294L345L601M265N238N615M789L419K561K408K443
$$ 108857 114002 118622 122334 125628 128973 132574 136839 142077 147692 152481 155900 158461 160869 163312
54014A63312K283J854J278R57J178J497J176L79L4L58N00j04j004j673k158k404
$$ 163312 165595 167449 168727 169684 170862 172359 173535 173914 173948 174306 174806 174702 173698 172025 169867 167463
53998A67463k032j172n63m16j58L35M27J3l3O54J219R71M01O3m31j457k379k507
$$ 167463 165431 164259 163696 163280 163122 163457 163884 163897 163864 164518 165737 166708 167109 167172 166741 165284 162905 160398
53980A60398k180k062k153k269k675l367l543k731j741j551j885j880j565j605
$$ 160398 158218 156156 154003 151734 149059 145692 142149 139418 137677 136126 134241 132361 130796 129191
53966A29191k013k148j769j208o20J57J017J512J378Q34L50L41Q26J261J057L65
$$ 129191 127178 125030 123261 122053 121433 121590 122607 124119 125497 126331 126681 127022 127848 129109 130166 130531
53950A30531r7m6J66M78J368K834M019M380M483N034N763N985N762N847O713Q150
$$ 130531 130434 130388 130554 131032 132400 135234 139253 143633 148116 153150 158913 164898 170660 176507 183220 191370
53934A91370R568J0363J0341R977R839R567Q046M904J220j637l359m474n349n947
$$ 191370 200938 211301 221642 231619 241458 251025 259071 263975 265195 263558 260199 255725 250376 244429
53920B44429o199o122n716m972l842k264m63R44J593J853K190K371K118K047K904
$$ 244429 238230 232108 226392 221420 217578 215314 214851 215795 217388 219241 221431 223802 225920 227967 230871
53905B30871M173M702M521M621M971M438K889J664J353Q60n88j994k291k074k413
$$ 230871 235044 239746 244267 248888 253859 258297 261186 262850 264203 265063 264475 262481 260190 258116 255703
53890B55703l031l003k421k187k622l371m158m808m998m751m667n067n440n307
$$ 255703 252672 249669 247248 245061 242439 239068 234910 230102 225104 220353 215686 210619 205179 199872
53876A99872m957m759m520m082l817l917l985l896m104m579m483l605k979l189
$$ 199872 194915 190156 185636 181554 177737 173820 169835 165939 161835 157256 152773 149168 146189 143000
53862A43000l248k314j311j551k605l085k752k449k417k201j905k091k553k481
$$ 143000 139752 137438 136127 134576 131971 128886 126134 123685 121268 119067 117162 115071 112518 110037
53848A10037j803j317j398j554j338q96n55m88p56j156j235q75n86p52j076j206
$$ 110037 108234 106917 105519 103965 102627 101731 101176 100688 99932 98776 97541 96666 96080 95328 94252 93046
53832I3046j324j481j109l1P86M63l76m53K98P97M63k49p74q99m70M63J289J411
$$ 93046 91722 90241 89132 89101 89887 90350 89974 89521 89819 90616 91079 90830 90056 89157 88687 89150 90439 91850
53814I1850J074R57J149J222J026P47M07R4K77J167K029K041J570J612K259K675
$$ 91850 92924 93881 95030 96252 97278 98025 98432 98526 98803 99970 101999 104040 105610 107222 109481 112156
53798A12156K479K180K210K447K763L224L675L904M191M937N644N154L252J305
$$ 112156 114635 116815 119025 121472 124235 127459 131134 135038 139229 144166 149810 154964 158216 159521
53784A59521Q42J913L250L713L213K345J556Q42J09m69p20p94r50j104j129j321
$$ 159521 160363 162276 165526 169239 172452 174797 176353 177195 177304 176835 176115 175321 174371 173267 172138 170817
53768A70817k024k863l133k861k636k470j868j110j180k081k571k095j693k148
$$ 170817 168793 165930 162797 159936 157300 154830 152962 151852 150672 148591 146020 143925 142232 140084
53754A40084k597k040j010n08k48N90J665J929J284M85j48p65j104q39m64o79
$$ 140084 137487 135447 134437 133929 133681 134271 135936 137865 139149 139634 139486 138721 137617 136778 136314 135635
53738A35635j167j090n38l22o11q79j031j412j789j448l61O65R99O30k13j077
$$ 135635 134468 133378 132840 132518 131907 131028 129997 128585 126796 125348 124987 125652 126651 127281 127068 125991
53722A25991j135L9J730K858L305L664M052M111L933L913L922L515K800K175J456
$$ 125991 124856 124895 126625 129483 132788 136452 140504 144615 148548 152461 156383 159898 162698 164873 166329
53707A66329K35j107j802j849j834j780j299n97k58j83J16L97J20j85N67K068
$$ 166329 166564 165457 163655 161806 159972 158192 156893 156296 156038 155855 155971 156368 156488 156303 156870 158938
53691A58938K725J973J090J237J960K326K338K427K422J952J363J374K092K878
$$ 158938 161663 163636 164726 165963 167923 170249 172587 175014 177436 179388 180751 182125 184217 187095
53677A87095L058K487J637J269J760K640L026K555J688J163J454K454L358L154
$$ 187095 190153 192640 194277 195546 197306 199946 202972 205527 207215 208378 209832 212286 215644 218798
53663B18798J833O86Q76J977K656K403J771J149L57n53j071r55n60k13N9J38k65
$$ 218798 220631 221317 222193 224170 226826 229229 231000 232149 232506 231953 230882 229927 229367 229154 229213 229351 229086
53646B29086j153k164k982l440l411k982k591k476k282j678r66n35j70L54N13
$$ 229086 227933 225769 222787 219347 215936 212954 210363 207887 205605 203927 202961 202426 202256 202610 203123
53631B03123k28j260j480q51l28l59m41j85K07N21Q31J096J159J118J171J205
$$ 203123 202895 201635 200155 199304 198976 198617 198176 197991 198198 198719 199550 200646 201805 202923 204094 205299
53615B05299J085J077J342J459J227J363K468L752L937L136K642L058L798M353
$$ 205299 206384 207461 208803 210262 211489 212852 215320 219072 223009 226145 228787 231845 235643 239996
53601B39996M780N022M789M240L790L402K965L075M278N746O114N483N203N627
$$ 239996 244776 249798 254587 258827 262617 266019 268984 272059 276337 282083 288197 293680 298883 304510
53587C04510N658M673L489K924K769K608K545K611K468K134K125K499K678K424
$$ 304510 310168 314841 318330 321254 324023 326631 329176 331787 334255 336389 338514 341013 343691 346115
53573C46115K100J858J534J447K127L062L013J827P27M61M77L28N46J424K183
$$ 346115 348215 350073 351607 353054 355181 358243 361256 363083 363810 364271 364748 365076 365622 367046 369229
53558C69229K170J924K181K694K831K678K793L331M049M743N262N487N562N798
$$ 369229 371399 373323 375504 378198 381029 383707 386500 389831 393880 398623 403885 409372 414934 420732
53544D20732O155O349O390O458O381N925N482N564N872N776N478N528N528M703
$$ 420732 426887 433236 439626 446084 452465 458390 463872 469436 475308 481084 486562 492090 497618 502321
53530E02321L615L620M555M720L538K470K669L390L552L412L693M294M833N426
$$ 502321 505936 509556 514111 518831 522369 524839 527508 530898 534450 537862 541555 545849 550682 556108
53516E56108O141O618O901P638Q846R579R451R310R866J0831J1996J3730J5721
$$ 556108 562249 568867 575768 583406 592252 601831 611282 620592 630458 641289 653285 667015 682736
53503F82736J6778J6797J7403J9494K1646K2311K2183K2812K4174K5232K6018
$$ 682736 699514 716311 733714 753208 774854 797165 819348 842160 866334 891566 917584
53492I17584K7261K8680K9351K9428K9889L0832L1340L0931K9900K8553K7173
$$ 917584 944845 973525 1002876 1032304 1062193 1093025 1124365 1155296 1185196 1213749 1240922
53481A240922K6449K6817K7562K7649K7126K6766K6659K6283K5661K5403K5680
$$ 1240922 1267371 1294188 1321750 1349399 1376525 1403291 1429950 1456233 1481894 1507297 1532977
53470A532977K6071K6272K6119K5260K3599K1785K0395J9084J7346J5609J4462
$$ 1532977 1559048 1585320 1611439 1636699 1660298 1682083 1702478 1721562 1738908 1754517 1768979
53459A768979J3366J1395Q992P508P046O158L885R40j600l639n633p659r542j1447
$$ 1768979 1782345 1793740 1802732 1810240 1817286 1823444 1827329 1828269 1826669 1823030 1817397 1809738 1800196 1788749
53445A788749j3696j6258j8667k0432k1430k2098k3179k5016k7187k8942k9877
$$ 1788749 1775053 1758795 1740128 1719696 1698266 1676168 1652989 1627973 1600786 1571844 1541967
53434A541967l0062k9850k9733l0015l0370l0122k9196k8244k7530k6317k3931
$$ 1541967 1511905 1482055 1452322 1422307 1391937 1361815 1332619 1304375 1276845 1250528 1226597
53423A226597k0809j7957j5827j4311j3303j2567j1516r891q290p317o566n184
$$ 1226597 1205788 1187831 1172004 1157693 1144390 1131823 1120307 1110416 1102126 1094809 1088243 1083059
53411A083059l097r84P39K150L304M271N530P600J0320J3015J5286J7111J8400
$$ 1083059 1079962 1078978 1079717 1081867 1085171 1089442 1094972 1102572 1112892 1125907 1141193 1158304 1176704
53398A176704J9054J9415K0086K1368K3188K5357K7542K9274L0509L1930L4199
$$ 1176704 1195758 1215173 1235259 1256627 1279815 1305172 1332714 1361988 1392497 1424427 1458626
53387A458626L7144M0036M2388M4166M5579M7095M9202N1639N3384N3990N4438
$$ 1458626 1495770 1535806 1578194 1622360 1667939 1715034 1764236 1815875 1869259 1923249 1977687
53376A977687N5907N8147N9793O0089N9491N8749N8111N7413N6416N5002N3330
$$ 1977687 2033594 2091741 2151534 2211623 2271114 2329863 2387974 2445387 2501803 2556805 2610135
53365B610135N1600M9488M6253M1774L6975L2644K8435K3651J8576J4126J0444
$$ 2610135 2661735 2711223 2757476 2799250 2836225 2868869 2897304 2920955 2939531 2953657 2964101
53354B964101O667K041l382r039j4338j8859k2554k5720k8558l1017l3325l6224
$$ 2964101 2970768 2972809 2969427 2960388 2946050 2927191 2904637 2878917 2850359 2819342 2786017 2749793
53342B749793m0203m4854m9291n2851n5121n5918n5698n5376n5216n4475n2645
$$ 2749793 2709590 2664736 2615445 2562594 2507473 2451555 2395857 2340481 2285265 2230790 2178145
53331B178145n0403m8710m7611m6658m5767m4933m3681m1681l9417l7361l5104
$$ 2178145 2127742 2079032 2031421 1984763 1938996 1894063 1850382 1808701 1769284 1731923 1696819
53320A696819l2233k9399k7465k6106k4362k2168k0181j8472j6661j5138j4839
$$ 1696819 1664586 1635187 1607722 1581616 1557254 1535086 1514905 1496433 1479772 1464634 1449795
53309A449795j5722j6643j6842j6501j5835j4646j3073j1707j0661r317p282m940
$$ 1449795 1434073 1417430 1400588 1384087 1368252 1353606 1340533 1328826 1318165 1308848 1301566 1296626
53297A296626k812j077K18J037J684K611L807M857N710O830Q498J0513J2600J4716
$$ 1296626 1293814 1292737 1292955 1293992 1295676 1298287 1302094 1306951 1312661 1319491 1327989 1338502 1351102 1365818
53283A365818J6886J9178K1758K4567K7114K8950L0224L1246L1812L1591L0926
$$ 1365818 1382704 1401882 1423640 1448207 1475321 1504271 1534495 1565741 1597553 1629144 1660070
53272A660070L0548L0524L0139K8837K6757K4391K2107J9939J7502J4334J0673
$$ 1660070 1690618 1721142 1751281 1780118 1806875 1831266 1853373 1873312 1890814 1905148 1915821
53261A915821P477N294L601J772J3j349k880n334q346j0903j2824j4769j6959
$$ 1915821 1923298 1928592 1932193 1933965 1933978 1932629 1929749 1924415 1916069 1905166 1892342 1877573 1860614
53248A860614j8894k0307k1418k2322k2975k3698k4825k5935k6320k6098k5940
$$ 1860614 1841720 1821413 1799995 1777673 1754698 1731000 1706175 1680240 1653920 1627822 1601882
53237A601882k5837k5236k4350k4164k4908k5608k5448k4656k3661k2335k0575
$$ 1601882 1576045 1550809 1526459 1502295 1477387 1451779 1426331 1401675 1378014 1355679 1335104
53226A335104j8911j7920j7471j6949j5978j4646j3299j2262j1561j0871r984
$$ 1335104 1316193 1298273 1280802 1263853 1247875 1233229 1219930 1207668 1196107 1185236 1175252
53215A175252r093q418p812p183o870p071p254o899o448o834q243j0054j1744
$$ 1175252 1166159 1157741 1149929 1142746 1135876 1128805 1121551 1114652 1108204 1101370 1093127 1083073 1071329
53202A071329j3085j3757j3645j3357j3571j3992j3801j2957j2180j1784j1467
$$ 1071329 1058244 1044487 1030842 1017485 1003914 989922 976121 963164 950984 939200 927733
53191I27733j1168j1263j1878j2854j4222j5956j7446j8153j8550j9455k0679
$$ 927733 916565 905302 893424 880570 866348 850392 832946 814793 796243 776788 756109
53180G56109k1392k1577k1867k2094k1454k0139j9307j9177j8642j7161j5713
$$ 756109 734717 713140 691273 669179 647725 627586 608279 589102 570460 553299 537586
53169E37586j5182j5073j4612j3966j3587j3209j2379j1304j0417r675q991q740
$$ 537586 522404 507331 492719 478753 465166 451957 439578 428274 417857 408182 399191 390451
53157C90451r200r837r810q913p572o335n633n740o449p049o888n882m516l551
$$ 390451 381251 371414 361604 352691 345119 338784 333151 327411 320962 313913 307025 301143 296627 293076
53143B93076l526m161m446l789k878k712l159l294k934k745k924k862k319j835
$$ 293076 289550 285389 280943 277154 274276 271564 268405 265111 262177 259432 256508 253646 251327 249492
53129B49492j723j517q52mO97J313J868K241K657L450M209M026K866J729J152
$$ 249492 247769 246252 245400 245396 246093 247406 249274 251515 254172 257622 261831 265857 268723 270452 271604
53114B71604N15p44k146k998l364l733m223m708n184n624n900o003n999n651m790
$$ 271604 272119 271375 269229 266231 262867 259134 254911 250203 245019 239395 233495 227492 221493 215842 211052
53099B11052l941l849m322m475m113l885l948l631k716j995k046k459k747l051
$$ 211052 207111 203262 198940 194465 190352 186467 182519 178888 176172 174177 172131 169672 166925 163874
53085A63874l402l287k527j766j504j406j113r39j191j483j407j188j210j419
$$ 163874 160472 157185 154658 152892 151388 149982 148869 147930 146739 145256 143849 142661 141451 140032
53071A40032j593j620j246k55Q08R82K26m39m39k95m21l67J45N33L84J80K48l6
$$ 140032 138439 136819 135573 135318 136126 137108 137334 136895 136456 136161 135740 135373 135518 136051 136435 136615 136863 136827
53053A36827j103k182k346j889j642j559r99nO03L33m94j131r46R4J200J453Q66
$$ 136827 135724 133542 131196 129307 127665 126106 125107 125102 125705 126038 125544 124413 123467 123561 124761 126214 127080
53036A27080K17j57o22j197j384j259j539k133j912n92M92L37k31j7P46J168J178
$$ 127080 127297 127140 126518 125321 123937 122678 121139 119006 117094 116502 116994 117331 117100 117083 117829 118997 120175
53019A20175J082O56j15k78P08J676J267Ln92l10q8o0N30J598K083J668J231J313
$$ 120175 121257 121913 121798 121520 122228 123904 125171 125174 124582 124272 124184 124124 124654 126252 128335 130003 131234 132547
53001A32547J401J071P43Q80J249J439J494J709K173K660K725K053J017N92J244
$$ 132547 133948 135019 135762 136642 137891 139330 140824 142533 144706 147366 150091 152144 153161 153753 154997
52986A54997K259K672K466K274K394K726L303M022M297L836L412L971N245O088
$$ 154997 157256 159928 162394 164668 167062 169788 173091 177113 181410 185246 188658 192629 197874 203962
52972B03962N991N311M317K989J677Q63L01p46k194l049k833k319k499l378m106
$$ 203962 209953 215264 219581 222570 224247 225110 225411 224665 222471 219422 216589 214270 211771 208393 204287
52957B04287l939k930j918j817k651l473l498k999k686k576k157j353o00j29J63
$$ 204287 200348 197418 195500 193683 191032 187559 184061 181062 178376 175800 173643 172290 171690 171561 171724
52942A71724K13j75p89j106r24m31J82P48R35O35L93Q37J751K303K108J539J060
$$ 171724 171937 171762 170973 169867 168943 168512 168694 169442 170377 171012 171405 172242 173993 176296 178404 179943 181003
52925A81003P54N35L98L45M32P02R37P21J06j88L30J158J485J245R90R87J098
$$ 181003 181757 182292 182690 183035 183467 184169 185106 185827 185933 185745 186075 187233 188718 189963 190953 191940 193038
52908A93038J246J376J118K28p61q98L0J250J849J639J122R09J093J154O39q4
$$ 193038 194284 195660 196778 197006 196245 195347 195377 196627 198476 200115 201237 202146 203239 204393 205032 204948
52892B04948k64J14L62K73L33N55K11p26j078j91Q95R93M31P8k59j050j570q75
$$ 204948 204684 204798 205160 205433 205766 206321 206532 205806 204728 204537 205432 206425 206856 206934 206675 205625 204055 203180
52874B03180L24M64m48r24m14N5j99n21k17M58J082J707K226K179J622J328J657
$$ 203180 203504 203968 203520 202596 202182 202237 202038 201517 201300 201758 202840 204547 206773 208952 210574 211902 213559
52857B13559K048K026J935K231K740L105L416L965M722N338N397M614L086J335
$$ 213559 215607 217633 219568 221799 224539 227644 231060 235025 239747 245085 250482 255096 258182 259517
52843B59517k47j751l142l744l086j890j312j427j388r53p68j078j280j012p57
$$ 259517 259270 257519 254377 250633 247547 245657 244345 242918 241530 240577 239809 238731 237451 236439 235682
52828B35682r95j565k177k873l578l915l713l284k946k716k536k372k097j729
$$ 235682 234687 233122 230945 228072 224494 220579 216866 213582 210636 207920 205384 203012 200915 199186
52814A99186j642j982k087j290j00K98l59j201j605j788j941j778j265q89q88
$$ 199186 197544 195562 193475 192185 192085 192383 192024 190823 189218 187430 185489 183711 182446 181557 180669
52799A80669r35q38q04q01m92q6m09j707l029l345k721k048k004k545l074k906
$$ 180669 179734 178896 178092 177291 176799 176713 176304 174597 171568 168223 165502 163454 161450 158905 155831 152925
52783A52925j925q51m59o55p79o24m65l54j32k8l66q23q62p79j242j845j403J24
$$ 152925 151000 150149 149690 149035 148256 147632 147167 146813 146681 146653 146287 145464 144602 143823 142581 140736 139333 139457
52765A39457J223Q12m84j498j899j876j420p31n01j085j951k421k441k227j795
$$ 139457 140680 141492 141008 139510 137611 135735 134315 133584 133083 131998 130047 127626 125185 122958 121163
52750A21163j260j010j146j340j422j518j410o90K25K96n71j218j016p78j157
$$ 121163 119903 118893 117747 116407 114985 113467 112057 111367 111592 111888 111317 110099 109083 108305 107148
52735A07148j372n82M50L61p48j553j436j041r91j090r35n00L5N71J041J393J564
$$ 107148 105776 105194 105644 106005 105257 103704 102268 101227 100236 99146 98211 97711 97746 98317 99358 100751 102315
52718A02315J418R52N96Q36J325J126J18n90j98O30Q24N21O55J501K493L218L627
$$ 102315 103733 104685 105281 106117 107442 108568 108686 108096 107898 108528 109352 109873 110528 112029 114522 117740 121367
52701A21367L505K681J707J350J369O24j309l359m145l459k237j398j130j145
$$ 121367 124872 127553 129260 130610 131979 132603 131294 127935 123790 120331 118094 116696 115566 114421
52687A14421j237j462j881k291k393k147j850j818k143k672l042k791j862q65
$$ 114421 113184 111722 109841 107550 105157 103010 101160 99342 97199 94527 91485 88694 86832 85967
52673H5967m84o46o95l97j29r1m1Om20j412k279k465k255k058j689r53m12p53
$$ 85967 85483 84837 84142 83745 83616 83525 83484 83490 83070 81658 79379 76914 74659 72601 70912 69959 69547 68794
52655F8794j637j970j242OR49J211R05M30K52N34J004J379J723K071K010J150
$$ 68794 67157 65187 63945 63951 64900 66111 67016 67446 67698 68232 69236 70615 72338 74409 76419 77569
52639G7569j38r86j050p85o96p48o34k84J35M91P72R56R43O77K93N8R3K02N8m68
$$ 77569 77431 76445 75395 74610 73914 73166 72532 72248 72383 72874 73646 74602 75545 76222 76515 76573 76666 76868 76926 76458
52619G6458j241j962k209j633m83K51k15j379j871j047L47J212J196O00k14q11
$$ 76458 75217 73255 71046 69413 68930 69181 68966 67587 65716 64669 65016 66228 67424 68024 67810 66999
52603F6999o57L26J407J755J363Q72O55N58M29L95M96M60J15k82l40p9J12Q2J78
$$ 66999 66342 66668 68075 69830 71193 72065 72720 73278 73707 74102 74598 75058 75173 74891 74551 74472 74584 74666 74844
52584G4844O52J125J014M47J50L94O59N75N70J078J691J767J460J407J640J622
$$ 74844 75496 76621 77635 78082 78232 78626 79285 79860 80430 81508 83199 84966 86426 87833 89473 91095
52568I1095J189P04L85J56J46N48J091J326J403J758K149J815P22k60n35l66o7
$$ 91095 92284 92988 93373 93529 93675 94223 95314 96640 98043 99801 101950 103765 104487 104227 103692 103326 103259
52551A03259M49J033J056K84o42r97p08q6O14J091J069P62O92Q93Q98O40O20R42
$$ 103259 103708 104741 105797 106081 105439 104442 103734 103648 104262 105353 106422 107184 107876 108769 109667 110307 110927 111869
52533A11869J014O11M12R67J787K031J556Q53L95M12Q32J121P48K0j19N61J163
$$ 111869 112883 113494 113906 114873 116660 118691 120247 121100 121495 121907 122739 123860 124608 124628 124509 125070 126233
52516A26233R70L75R1J14N4j39l55o70r98r11l64l9l86q84p74j14M76P25P45N31
$$ 126233 127203 127578 127669 127783 127837 127698 127343 126673 125675 124764 124400 124361 123975 123091 122317 122203 122679 123404 124149 124680
52496A24680j7o97j097j007n47n0R8j58l36K2O13P35L32j4o8q7m2L40P06L74l39
$$ 124680 124663 123966 122869 121862 121315 121265 121363 121205 120869 120891 121504 122239 122571 122557 122489 122402 122360 122700 123406 123780 123441
52475A23441k79O88J315R24M58Q05J368J192N30J84K13L28O93J364J653J106M07
$$ 123441 123162 123850 125165 126089 126547 127352 128720 129912 130442 130626 130839 131167 131860 133224 134877 135983 136390
52458A36390L70O55N78M12P77J303J106K32m18l57K15R65J458J113J2p21k46Q04
$$ 136390 136760 137415 137993 138405 139182 140485 141591 141823 141405 141048 141263 142228 143686 144799 144811 144090 143844 144648
52440A44648J300J187J105J085P71L87L65L54j47o13j60R07J474J281J065J167
$$ 144648 145948 147135 148240 149325 150096 150483 150848 151202 151055 150442 150282 151189 152663 153944 155009 156176
52424A56176J229J151J178J137P06L68R23K027K437J830J169J059Q51j80j695
$$ 156176 157405 158556 159734 160871 161577 161945 162868 164895 167332 169162 170331 171390 172241 172061 170366
52409A70366k830l171k887k380k038j925j719j343j372k220l189l191k252j396
$$ 170366 167536 164365 161478 159098 157060 155135 153416 152073 150701 148481 145292 142101 139849 138453
52395A38453j144j044o89l04j52j50k20l87m57k00J59J73o0n6L05P20J018J115
$$ 138453 137309 136265 135576 135272 135120 134970 134750 134363 133906 133706 133865 134038 133978 133922 134227 134947 135965 137080
52377A37080O92l05j114r51k03J28lL15J353K266K360J898J417J042Q04Q97J369
$$ 137080 137772 137467 136353 135402 135199 135327 135324 135639 136992 139258 141618 143516 144933 145975 146779 147676 149045
52360A49045J995K579K925K625J609O72P02J446J857J632J531K109K944L346L112
$$ 149045 151040 153619 156544 159169 160778 161450 162152 163598 165455 167087 168618 170727 173671 177017 180129
52345A80129K519K075K298L118L655L233K373K044K181J961J313J108J793K892
$$ 180129 182648 184723 187021 190139 193794 197027 199400 201444 203625 205586 206899 208007 209800 212692
52331B12692L783M165L782K704J836K046K842K939K123J364J095Q02M62R08K339
$$ 212692 216475 220640 224422 227126 228962 231008 233850 236789 238912 240276 241371 242173 242635 243543 245882
52316B45882L749M444M859N322N296M608M275N075O242O591O268O347P195Q169
$$ 245882 249631 254075 258934 264256 269552 274160 278435 283510 289752 296343 302611 308958 316153 324322
52302C24322Q700Q834Q915R243R956J0921J1842J2663J3548J4420J4984J5293
$$ 324322 333022 341856 350771 360014 369970 380891 392733 405396 418944 433364 448348 463641
52290D63641J5769J6601J7640J8902K0461K1831K2271K1939K1832K2321K2651
$$ 463641 479410 496011 513651 532553 553014 574845 597116 619055 640887 663208 685859
52279F85859K2252K1664K1594K1831K1652K0813J9581J8300J7245J6499J5611
$$ 685859 708111 729775 751369 773200 794852 815665 835246 853546 870791 887290 902901
52268I02901J4037J2046J0572R814Q871P198N535M736M484L878K774J654O01p80
$$ 902901 916938 928984 939556 949370 958241 965439 970974 975710 980194 984072 986846 988500 989101 988321
52254I88321k504l985m696m756m779n296o157o509n681m052k618j772r68L84K345
$$ 988321 985817 981832 977136 972380 967601 962305 956148 949639 943958 939906 937288 935516 934548 934932 937277
52239I37277M708P199R307J0677J1753J3258J5038J6211J6524J6629J6807J6603
$$ 937277 941985 949184 958491 969168 980921 994179 1009217 1025428 1041952 1058581 1075388 1091991
52227A091991J6036J5921J6453J6548J5415J3748J2451J1062Q597N300K464P69
$$ 1091991 1108027 1123948 1140401 1156949 1172364 1186112 1198563 1209625 1218222 1223522 1225986 1226755
52215A226755k02j103k285l941o000p913r194j0148j1545j3608j5740j7206j7775
$$ 1226755 1226553 1225450 1223165 1219224 1213224 1205311 1196117 1185969 1174424 1160816 1145076 1127870 1110095
52202A110095j7833j8017j8690j9539j9972j9882j9680j9496j8955j7878j6624
$$ 1110095 1092262 1074245 1055555 1036016 1016044 996162 976482 956986 938031 920153 903529
52191I03529j5479j4340j3181j2252j1493j0406q890p581p005o896o780o534o082
$$ 903529 888050 873710 860529 848277 836784 826378 817488 809907 802902 796006 789226 782692 776610
52178G76610n210m141l622l888m229m072l821m003m257m030l572l506l681l343
$$ 776610 771400 767259 763637 759749 755520 751448 747627 743624 739367 735337 731765 728259 724578 721235
52164G21235k316j259r28j560k818l980m389m104l780l713l454k745k135k125
$$ 721235 718919 717660 716732 715172 712354 708374 703985 699881 696101 692388 688934 686189 684054 681929
52150F81929k236j674n45K80K97k31p80r59n74J94P58O34j09j070j939k505k678
$$ 681929 679693 678019 677474 677754 678051 677820 677040 676081 675507 675701 676459 677093 676984 675914 673975 671470 668792
52133F68792k730l123l808m137l747l079k752k858l150l435l489l151k733k806
$$ 668792 666062 662939 659131 654994 651247 648168 645416 642558 639408 635973 632484 629333 626600 623794
52119F23794l226l100k007o15L79J133J958K522K508K464L159M466N606O233O672
$$ 623794 620568 617468 615461 614846 615225 616358 618316 620838 623346 625810 628969 633435 639041 645274 651946
52104F51946P331Q371R740J1172J2378J3464J4760J6137J7122J7836J9028K0878
$$ 651946 659277 667648 677388 688560 700938 714402 729162 745299 762421 780257 799285 820163
52092H20163K2622K3805K4961K6478K7749K8178K8152K8182K7909K6911K5733
$$ 820163 842785 866590 891551 918029 945778 973956 1002108 1030290 1058199 1085110 1110843
52081A110843K5077K4526K3194K1144J9179J7594J6008J4138J1908R103N868L131
$$ 1110843 1135920 1160446 1183640 1204784 1223963 1241557 1257565 1271703 1283611 1292714 1298582 1301713
52069A301713J689J026j60k485n566q746j1457j3240j4205j5121j6405j7424j7488
$$ 1301713 1303402 1304428 1304268 1301783 1296217 1287471 1276014 1262774 1248569 1233448 1217043 1199619 1182131
52056A182131j6960j6606j6349j5613j4488j3578j2998j2383j1559j0457q788
$$ 1182131 1165171 1148565 1132216 1116603 1102115 1088537 1075539 1063156 1051597 1041140 1032352
52045A032352o611m761l764k901j216R98K890M512O450Q372R400R683J0196J1075
$$ 1032352 1025741 1020980 1017216 1014315 1013099 1014097 1016987 1021499 1027949 1036321 1045721 1055404 1065600 1076675
52031A076675J1491J1245J1140J1616J2159J2327J2266J1900J0729Q792O936N740
$$ 1076675 1088166 1099411 1110551 1122167 1134326 1146653 1158919 1170819 1181548 1190340 1197276 1203016
52019A203016M791L446J632l14k123l689n127o776q750j0652j2258j4050j6451
$$ 1203016 1207807 1211253 1212885 1212571 1210448 1206759 1201632 1194856 1186106 1175454 1163196 1149146 1132695
52006A132695j8875k0399k1055k1567k2097k2304k2401k2965k3800k4111k3872
$$ 1132695 1113820 1093421 1072366 1050799 1028702 1006398 983997 961032 937232 913121 889249
51995H89249k3836k4098k3831k2738k1677k1401k1615k1591k1023j9935j8511
$$ 889249 865413 841315 817484 794746 773069 751668 730053 708462 687439 667504 648993
51984F48993j7197j6336j5559j4325j3023j2606j3056j3285j2796j2312j2429
$$ 648993 631796 615460 599901 585576 572553 559947 546891 533606 520810 508498 496069
51973D96069j2657j2358j1723j1187j0634r827q996q411p849p051o254n814n543
$$ 496069 483412 471054 459331 448144 437510 427683 418687 410276 402427 395376 389122 383308 377765
51960C77765m918l666k066q28o71j647k867l369l187l064l282l403l159k819k665
$$ 377765 372847 369181 367115 366287 365616 363969 361102 357733 354546 351482 348200 344797 341638 338819 336154
51945C36154k754l187m008m766m942m687m473m138l229k128j760k143k347k024
$$ 336154 333400 330213 326205 321439 316497 311810 307337 303199 299970 297842 296082 293939 291592 289568
51931B89568j808j934j682p63p4l48r88j055o70n85r70j326j258p37R1Q72J203
$$ 289568 287760 285826 284144 283381 283307 282959 281971 280916 280246 279661 278691 277365 276107 275370 275461 276333 277536
51914B77536J066P77L32o20j964k961l229l158l153l048k693k366k240k104j909
$$ 277536 278602 279379 279711 279091 277127 274166 270937 267779 264626 261578 258885 256519 254279 252175 250266
51899B50266j921k036j703r09m12n24n55n6K73k73j186j499j207j014j111j153
$$ 250266 248345 246309 244606 243697 243285 242761 242206 242150 242423 242150 240964 239465 238258 237244 236133 234980
51883B34980j026q91o27j06K44l9n66m61L69J078J086P68P21R23Q63L41k22k72
$$ 234980 233954 233063 232436 232330 232574 232535 231969 231508 231877 232955 234041 234809 235530 236453 237316 237657 237435 237163
51865B37163K22O84O13J75k8L18J106K126L127L626L298K633K552L185L634L205
$$ 237163 237385 238069 238682 238857 238829 239147 240253 242379 245506 249132 252430 255063 257615 260800 264434 267639
51849B67639K333J923K265K918L312L175K731K646L344M237M223L157K172K208
$$ 267639 269972 271895 274160 277078 280390 283565 286296 288942 292286 296523 300746 303903 306075 308283
51835C08283K828K980K403J697J341J245J069N65k55j101j671k072k610l142l079
$$ 308283 311111 314091 316494 318191 319532 320777 321846 322411 322156 321055 319384 317312 314702 311560 308481
51820C08481k274j431j337j995k830l263l019k169j169m66L2P40J529J754J233
$$ 308481 306207 304776 303439 301444 298614 295351 292332 290163 288994 288528 288560 289300 290829 292583 293816
51805B93816O15M41N45O16P76J126J370J334J308J441J381R15M52L21J43n06j277
$$ 293816 294431 294872 295417 296033 296809 297935 299305 300639 301947 303388 304769 305684 306136 306457 306600 306094 304817
51788C04817j550j421j472j831j940j330k17O67P15K5o29o69m44o11r80p42J45
$$ 304817 303267 301846 300374 298543 296603 295273 295056 295723 296438 296463 295834 295165 294721 294110 293130 292388 292533
51771B92533P44N66K57L47L52k32q78q27k65K03O21J304J849J558O10j20l07m16
$$ 292533 293277 293843 294100 294447 294799 294567 293689 292862 292597 292800 293421 294725 296574 298132 298742 298622 298315 297899
51753B97899o90o79M2J202K054J992R87l29j050p62J67J043J424J201O14L07P89
$$ 297899 297209 296530 296572 297774 299828 301820 302807 302478 301428 300666 300833 301876 303300 304501 305115 305422 306211
51736C06211J668J984J576J366J957K817L377M110N638P436Q310P749N993L366
$$ 306211 307879 309863 311439 312805 314762 317579 320956 325066 330704 338140 346450 354199 360192 363558
51722C63558M78j475j780j436k117l922n213m794l229j818j146j162j833l072
$$ 363558 364036 362561 360781 359345 357228 353306 348093 343299 340070 338252 337106 335944 334111 331039
51708C31039m374n150n299n178n050m841m471m234m554n315n637m762l095j859
$$ 331039 326665 321515 316216 311038 305988 301147 296676 292442 287888 282573 276936 272174 269079 267220
51694B67220j673j954j972j795j813j934j824j567j460j358q13K99J714L203M702
$$ 267220 265547 263593 261621 259826 258013 256079 254255 252688 251228 249870 249057 249356 251070 254273 258975
51679B58975O139P397Q141P603N065R10l224n829o658o327n367m207l382l009
$$ 258975 265114 272511 280652 288255 293320 294230 291006 285177 278519 272192 266825 262618 259236 256227
51665B56227k501j414j88O18J307K504M045N286O218P309Q407Q742Q068P020O214
$$ 256227 253726 252312 252124 252742 254049 256553 260598 265884 272102 279411 287818 296560 304628 311648 317862
51650C17862N608M848L685K026K8j838l214m302n481o691p579q046q176p907p332
$$ 317862 323470 328318 332003 334029 334057 332219 329005 324703 319222 312531 304952 296906 288730 280823 273491
51635B73491o940o968o793n767m406l854m295m752m536m010l688l377k575j313
$$ 273491 266551 259583 252790 247023 242617 238763 234468 229716 225180 221170 217482 214105 211530 210217
51621B10217k00J13n47j670k360k128j330n75PN50Q58O54J99L7J82J42l17r47
$$ 210217 210017 210130 209583 207913 205553 203425 202095 201520 201527 202077 202935 203589 203788 203825 204007 204149 203832 202885
51603B02885j449j622j222k41P26J036P95N72M78K33q9r9J21Q4j87j08N18J203
$$ 202885 201436 199814 198592 198351 199077 200113 200908 201480 201958 202191 202102 202003 202124 202208 202021 201913 202431 203634
51585B03634J608J912K226K304K176K351L044L767M047M091M339M811N328O005
$$ 203634 205242 207154 209380 211684 213860 216211 219255 223022 227069 231160 235499 240310 245638 251643
51571B51643P089Q417R459R873R771R474R076Q303O819M700K451M31j496l497
$$ 251643 258732 267149 276608 286481 296252 305726 314802 323105 329924 334624 337075 337506 336010 332513
51557C32513n254o295o674o874p080o917n963m261k382j104q29j072q11L42J692
$$ 332513 327259 320964 314290 307416 300336 293419 287456 283195 280813 279709 278880 277808 276997 277339 279031
51542B79031K458K829L477M472N412O257P259Q223Q698Q805R073R421R124P947
$$ 279031 281489 284318 287795 292267 297679 303936 311195 319418 328116 336921 345994 355415 364539 372486
51528C72486O530N407M392L189J924P27o65k340l717m122l651l077k922k968k666
$$ 372486 379016 384423 388815 392004 393928 394655 393990 391650 387933 383811 380160 377083 374161 371193 368527
51513C68527j840q32O9J102K604M191M931M502L671L228L003K451J673J132O72
$$ 368527 366687 365855 365924 367026 369630 373821 378752 383254 386925 390153 393156 395607 397280 398412 399084
51498C99084l56k090l981n462o313o529o426o600p203p432o538n059m269m542
$$ 399084 398728 396638 392657 387195 380882 374353 367927 361327 354124 346692 340154 335095 330826 326284
51484C26284n041n000m417l535k515j735j604j912k042j834j636j454q84O6Q37
$$ 326284 321243 316243 311826 308291 305776 304041 302437 300525 298483 296649 295013 293559 292675 292741 293578
51469B93578J127J084P29Ko28m63L36R28J138J707K925M109M761N253N809N864
$$ 293578 294705 295789 296518 296520 295892 295429 295765 296693 297831 299538 302463 306572 311333 316586 322395 328259
51453C28259N126M460M837N990O961P473P932Q360Q151O905M987L187K048J403
$$ 328259 333385 337845 342682 348672 355633 363106 371038 379398 387549 394454 399441 402628 404676 406079
51439D06079N13j139l119m452m801m780m956n075m572l357j869o58j37k71m24
$$ 406079 406592 405453 402334 397882 393081 388301 383345 378270 373698 370341 368472 367814 367677 367406 366982
51424C66982M4R06J363J334J682K818L773L316J455p85k718m494o394q162r192
$$ 366982 367026 367932 369295 370629 372311 375129 378902 382218 383673 382888 380170 375676 369282 361120 351928
51409C51928r131q320p542p266p234p061o937p169p241o270m426l018k788k974
$$ 351928 342797 334477 326935 319669 312435 305374 298437 291268 284027 277757 273331 270313 267525 264551
51395B64551k510j460o72n42p40p93m21M16J379J979K180K451K984L408L611M203
$$ 264551 262041 260581 259909 259367 258627 257834 257413 257829 259208 261187 263367 265818 268802 272210 275821 280024
51379B80024N609P147P676O821N051K843L84k060m115n695p102q606j0112j1177
$$ 280024 285633 292780 300456 307277 312328 315171 315555 313495 309380 303685 296583 287977 277865 266688
51365B66688j1337j0575r510q904q875q845q267p194o058n284n051n039m520l200
$$ 266688 255351 244776 235266 226362 217487 208642 200375 193181 187123 181839 176788 171749 167229 164029
51351A64029j937j883k934l724l345k269j341p31l25l44q59j274j001l02N9k39
$$ 164029 162092 160209 157275 153551 150206 147937 146596 145865 145540 145196 144337 143063 142062 141760 141819 141580
51335A41580r11j521j699j236l58L82P48R96J196R66K13m18l20K65P20Q73R08
$$ 141580 140669 139148 137449 136213 135855 136237 136985 137981 139177 140143 140356 139938 139618 139883 140603 141476 142384
51318A42384Q95Q81J061J437J651J657K029L061M036M074L378K984L406M251M982
$$ 142384 143279 144160 145221 146658 148309 149966 151995 155056 159092 163166 166544 169528 172934 177185 182167
51303A82167N529O003O356O426O165N820N920O789P968Q458P721O061L936J435
$$ 182167 187696 193699 200055 206481 212646 218466 224386 231175 239143 247601 255322 261383 265319 266754
51289B66754j242l427m653n253n815o346o547o493o551o821p070p057o576n545
$$ 266754 265512 262085 257432 252179 246364 240018 233471 226978 220427 213606 206536 199479 192903 187358
51275A87358m354l736l894m184m039l727l737l874l609k939k293j863j590j507
$$ 187358 183004 179268 175374 171190 167151 163424 159687 155813 152204 149265 146972 145109 143519 142012
51261A42012j619j670j537j518j771j855j355o27k50k18j81j70l23l25P7L75l9
$$ 142012 140393 138723 137186 135668 133897 132042 130687 130060 129810 129592 129411 129241 128918 128593 128670 129045 129006
51244A29006o65m17P71J837K158K248K591K800K407J778J549J612J333N79l7N3
$$ 129006 128341 127924 128695 130532 132690 134938 137529 140329 142736 144514 146063 147675 149008 149587 149550 149603
51228A49603O62J027N78n17j544j917j668j215q12l63K59Q46R18J95r18j530j129
$$ 149603 150265 151292 151870 151353 149809 147892 146224 145009 144197 143834 144093 144939 145857 146052 145134 143604 142475
51211A42475j61N53P82Q58Q45M36l15q62r59q71n67M44J975K736J877L25l70j5
$$ 142475 142314 142867 143649 144507 145352 145788 145473 144611 143652 142781 142214 142658 144633 147369 149246 149571 149201 149186
51193A49186L30K13K55P96J182Q83M24N60R62N72q74k312k600j885j283j352j487
$$ 149186 149516 149729 149984 150780 151962 152845 153269 153829 154791 155363 154489 152177 149577 147692 146409 145057 143570
51176A43570r87j42K73J51l2k70r88j948k181j366m35k06k71J71J007J464J257
$$ 143570 142583 142441 142714 142865 142833 142563 141575 139627 137446 136080 135645 135439 135168 135339 136346 137810 139067
51159A39067P80M52M74R04J411J313M17m86n26R7M75K26k05l98m49o34r78j229
$$ 139067 139847 140299 140773 141677 143088 144401 144818 144332 143806 143903 144378 144604 144399 144001 143552 142918 141940 140711
51141A40711j146r08j147k246l508l676k492j115o27p72o49n4N13O92N09J47q0
$$ 140711 139565 138657 137510 135264 131756 128080 125588 124473 123846 123074 122425 122371 122884 123576 124085 124232 124152
51124A24152J40O22P95O49R15J892K804K870K355J913J679J591J939K798L595
$$ 124152 124292 124914 125709 126358 127273 129165 131969 134839 137194 139107 140786 142377 144316 147114 150709
51109A50709L933M130M219L391J410m27r31q23j479k633k899k095j413j405j453
$$ 150709 154642 158772 162991 166382 167792 167365 166434 165611 164132 161499 158600 156505 155092 153687 152234
51094A52234j207j075j067n38O35J688K079K005J710J202O96M33Q7o89j259p13
$$ 152234 151027 149952 148885 148347 148982 150670 152749 154754 156464 157666 158362 158795 158882 158193 156934 156221
51078A56221M98R35K06o83j086j402j751j426k81O47O10K15L02P04Q48P58P86
$$ 156221 156719 157654 157860 157177 156091 154689 152938 151512 151231 151878 152488 152703 153005 153709 154557 155315 156101
51061A56101Q49O62K17l59j007j507j555j249r76o98k3R59J655J894K055K178
$$ 156101 156950 157612 157829 157470 156463 154956 153401 152152 151176 150478 150455 151414 153069 154963 157018 159196
51045A59196J876J237Q84R07P74M48N80J260J766J939K594M018N154N124M461
$$ 159196 161072 162309 163193 164100 164874 165322 165902 167162 168928 170867 173461 177479 182633 187757 192218
51030A92218M080L907L470K956K698K350J520O31K35K6n04r82p84l48p27j948
$$ 192218 196298 200205 203675 206631 209329 211679 213199 213830 214065 214091 213587 212605 211821 211473 210746 208798
51014B08798k736k128n75O79R04M41K47R06K002K584K317J784J583J690J931K409
$$ 208798 206062 203934 203359 204038 204942 205383 205630 206536 208538 211122 213439 215223 216806 218496 220427 222836
50998B22836L118L689M000M486N343O045O216O403P216Q206Q467Q053P998Q863
$$ 222836 225954 229643 233643 238129 243472 249517 255733 262136 269352 277558 286025 294078 302076 310939
50984C10939J0143J1103J1674J2299J3383J4973J6817J8578K0174K1884K4084
$$ 310939 321082 332185 343859 356158 369541 384514 401331 419909 440083 461967 486051
50973D86051K6975L0596L4847L9441M4085M8815N3814N8896O3605O7913P2241
$$ 486051 513026 543622 578469 617910 661995 710810 764624 823520 887125 955038 1027279
50962A027279P6525P9927Q1889Q2952Q3907Q4509Q3539P9960P3635O5163N5436
$$ 1027279 1103804 1183731 1265620 1348572 1432479 1516988 1600527 1680487 1754122 1819285 1874721
50951A874721M5152L4386K2753J0309k034j3267k3130l1809l9111m4501m7852
$$ 1874721 1919873 1954259 1977012 1987321 1985287 1972020 1948890 1917081 1877970 1833469 1785617
50940A785617m9613n0227m9698m7885m4968m1551l8356l5901l4346l3642l3637
$$ 1785617 1736004 1685777 1636079 1588194 1543226 1501675 1463319 1427418 1393072 1359430 1325793
50929A325793l4010l4351l4585l5216l6762l9006m1129m2541m3258m3495m3355
$$ 1325793 1291783 1257432 1222847 1187631 1150869 1111863 1070734 1028193 984935 941440 898085
50918H98085m2824m1751l9885l7277l4514l2090k9795k7282k4895k3180k1767
$$ 898085 855261 813510 773625 736348 701834 669744 639949 612667 587772 564592 542825
50907E42825j9719j6958j4371j2443j0774r130p893p109o065m359k569j363o60
$$ 542825 523106 506148 491777 479334 468560 459430 451537 444428 438363 434004 431435 430072 429412
50894D29412j16K65N13R05J395J567J534K031L162M028M158M324N169O067O247
$$ 429412 429296 429561 430074 430979 432374 433941 435475 437506 440668 444696 448854 453178 458347 464414 470661
50879D70661O220O910Q073Q821R217J0088J1496J2630J3215J3919J5263J6960
$$ 470661 476881 483791 491864 500685 509902 519990 531486 544116 557331 571250 586513 603473
50867F03473J8523J9916K1340K2978K5053K7777L1104L4766L8551M2435M6690
$$ 603473 621996 641912 663252 686230 711283 739060 770164 804930 843481 885916 932606
50856I32606N1985N9043O7913P7846Q8138R8735J09829J21403J33386J45645J57565
$$ 932606 984591 1043634 1111547 1189393 1277531 1376266 1486095 1607498 1740884 1886529 2044094
50845B044094J68214J77338J85468J92588J97410J98527J95461J87885J74735
$$ 2044094 2212308 2389646 2575114 2767702 2965112 3163639 3359100 3546985 3721720
50836C721720J55171J30024J01294P0554L8706O846k3690n2055p7692r9531j16097
$$ 3721720 3876891 4006915 4108209 4178763 4217469 4224315 4200625 4148570 4070878 3971347 3855250
50825C855250j26548j31064j30452j25770j18116j08176r6423q4155p3688o6665
$$ 3855250 3728702 3597638 3467186 3341416 3223300 3115124 3018701 2934546 2860858 2794193
50815B794193o2718o0653o0344o2387o6362p0894p5369q0286q5748r0810r4621
$$ 2794193 2731475 2670822 2610478 2548091 2481729 2410835 2335466 2255180 2169432 2078622 1984001
50804A984001r7262r8973r9309r7498r3244q6994p9851p3078o7103o1078n4105
$$ 1984001 1886739 1787766 1688457 1590959 1497715 1410721 1330870 1257792 1190689 1129611 1075506
50793A075506m6728m0353l5174k9837k3429j6837j1499p521l740O18N040Q455
$$ 1075506 1028778 988425 953251 923414 899985 883148 871649 864128 860388 861006 866046 874501
50781H74501J0407J1373J1924J1917J0772Q538O176M472L212J742r2k053m038
$$ 874501 884908 896281 908205 920122 930894 939432 945608 950080 953292 955034 954942 952889 948851
50768I48851n888p144p752q556j0293j2384j3694j4149j4574j5110j4927j3649
$$ 948851 942963 935819 928067 919511 909218 896834 883140 868991 854417 839307 824380 810731
50756H10731j1959j0516r071p086m480j510J578M562P469J0793J4919J9226K2571
$$ 810731 798772 788256 779185 772099 767619 766109 767687 772249 779718 790511 805430 824656 847227
50743H47227K4852K7333L1213L6398M1972M7306N2429N7902O4546P2766Q1921
$$ 847227 872079 899412 930625 967023 1008995 1056301 1108730 1166632 1231178 1303944 1385865
50732A385865R0843R9122J07373J15948J24040J30239J33535J33551J30371J24419
$$ 1385865 1476708 1575830 1683203 1799151 1923191 2053430 2186965 2320516 2450887 2575306
50722B575306J16137J05441R1805P4991N5389L3637J0420j3304l6335n7618p6206
$$ 2575306 2691443 2796884 2888689 2963680 3019069 3052706 3063126 3049822 3013487 2955869 2879663
50711B879663r0962j00919j06015j06970j04389r8622r0469q1196p1681o2235
$$ 2879663 2788701 2687782 2581767 2474797 2370408 2271786 2181317 2100121 2028440 1966205
50701A966205n3438m6279m1138l7446l4877l4109l5842l9652m4454m9535n4472
$$ 1966205 1912767 1866488 1825350 1787904 1753027 1718918 1683076 1643424 1598970 1549435 1494963
50690A494963n8476o0692o1042o0151n8491n6011n2538m8113m2951l7456l2218
$$ 1494963 1436487 1375795 1314753 1254602 1196111 1140100 1087562 1039449 996498 959042 926824
50679I26824k7631k3505j9291j4694r817m780N57O334J2348J8133K3382K8173
$$ 926824 899193 875688 856397 841703 831886 827106 827663 833997 846345 864478 887860 916033
50667I16033L2668L6686L9801M1816M2841M2829M1480L8860L5637L2386K9021
$$ 916033 948701 985387 1025188 1067004 1109845 1152674 1194154 1233014 1268651 1301037 1330058
50656A330058K5423K2104J9585J7433J4817J1811R359P831O522M754K758J152
$$ 1330058 1355481 1377585 1397170 1414603 1429420 1441231 1450590 1458421 1464943 1469697 1472455 1473607
50644A473607K43J75J154L108N590Q368J1793J6225K1448K6858L1972L6534M0375
$$ 1473607 1473850 1474025 1475179 1478287 1483877 1492245 1504038 1520263 1541711 1568569 1600541 1637075 1677450
50631A677450M3361M5237M5512M3897M0886L7408L3771K9474K4258J8722J3683
$$ 1677450 1720811 1766048 1811560 1855457 1896343 1933751 1967522 1996996 2021254 2039976 2053659
50620B053659R399N892L593L116M563P467J1311J5800K0602K5079K8344K9579
$$ 2053659 2063058 2068950 2072543 2075659 2080222 2087689 2099000 2114800 2135402 2160481 2188825 2218404
50608B218404K8496K5474K1148J5887R774K967m162j1284j8253k5136l2199l9766
$$ 2218404 2246900 2272374 2293522 2309409 2319183 2322150 2317988 2306704 2288451 2263315 2231116 2191350
50596B191350m7739n5561o2798o9464p5276p9161q0286p9256p7445p5260p2051
$$ 2191350 2143611 2088050 2025252 1955788 1880512 1801351 1721065 1641809 1564364 1489104 1417053
50585A417053o7711o3265n9524n6088n2220m7981m3930m0190l6448l2532k8577
$$ 1417053 1349342 1286077 1226553 1170465 1118245 1070264 1026334 986144 949696 917164 888587
50574H88587k4828k1455j8406j5274j1712q025m962k779r68R97L273O009R434
$$ 888587 863759 842304 823898 808624 796912 788887 783925 781146 780178 781175 784448 790457 799891
50561G99891J3178J6198J7877J8808K0105K2291K5233K8709L2478L6067L8979
$$ 799891 813069 829267 847144 865952 886057 908348 933581 962290 994768 1030835 1069814
50550A069814M1174M3139M5388M7929N0058N0799M9802M7683M5196M2352L8875
$$ 1069814 1110988 1154127 1199515 1247444 1297502 1348301 1398103 1445786 1490982 1533334 1572209
50539A572209L5297L2713L1484L0945L0609L0857L2135L4157L6294L8228L9965
$$ 1572209 1607506 1640219 1671703 1702648 1733257 1764114 1796249 1830406 1866700 1904928 1944893
50528A944893M1697M3888M6945N0622N4387N8415O3429O9264P4562P8334Q0955
$$ 1944893 1986590 2030478 2077423 2128045 2182432 2240847 2304276 2373540 2448102 2526436 2607391
50517B607391Q3027Q4005Q2825P9235P3615O5907N5591M2662K7963J2611k601
$$ 2607391 2690418 2774423 2857248 2936483 3010098 3076005 3131596 3174258 3202221 3214832 3212231
50506C212231j7332l1673m5698n8892p0192p8724q4139q6171q4549p9618p2263
$$ 3212231 3194899 3163226 3117528 3058636 2988444 2909720 2825581 2739410 2654861 2575243 2502980
50495B502980o2905n1273l7680k3653j0594J415J2675K2414K9294L2972L4062
$$ 2502980 2440075 2388802 2351122 2327469 2316875 2318290 2330965 2353379 2382673 2415645 2449707
50484B449707L2761K8441K0583R266n189k2200m0417n8017p3669q6813r6954j03421
$$ 2449707 2482468 2510909 2531492 2540758 2535569 2513369 2472952 2414935 2341266 2254453 2157499 2054078
50472B054078j06051j05625j03297r9791r5248q9573q2839p5520o8332o1710n5476
$$ 2054078 1948027 1842402 1739105 1639314 1544066 1454493 1371654 1296134 1227802 1166092 1110616
50461A110616m9248m2980l6945l1386k6452k2256j8710j5378j1817p968m068l56
$$ 1110616 1061368 1018388 981443 950057 923605 901349 882639 867261 855444 847476 843408 843052
50449H43052K916N511P512R409J1583J3876J5923J7727J9611K1749K3964K5923
$$ 843052 845968 851479 858991 868400 879983 893859 909782 927509 947120 968869 992833 1018756
50437A018756K7340K8233K9089L0490L2370L3903L4408L4048L3496L3148L2842
$$ 1018756 1046096 1074329 1103418 1133908 1166278 1200181 1234589 1268637 1302133 1335281 1368123
50426A368123L2074L0428K8017K5652K4156K3423K2552K0944J8802J6525J4356
$$ 1368123 1400197 1430625 1458642 1484294 1508450 1531873 1554425 1575369 1594171 1610696 1625052
50415A625052J2846J2877J4752J7840K1401K5174K8785L1437L2749L3287L3644
$$ 1625052 1637898 1650775 1665527 1683367 1704768 1729942 1758727 1790164 1822913 1856200 1889844
50404A889844L3630L2869L1525K9804K7336K3820J9628J5041R555K773m609j1691
$$ 1889844 1923474 1956343 1987868 2017672 2045008 2068828 2088456 2103497 2113052 2115825 2111216 2099525
50392B099525j8758k6722l5603m4522n2988o1021o8223p3730p7044p8149p6884
$$ 2099525 2080767 2054045 2018442 1973920 1920932 1859911 1791688 1717958 1640914 1562765 1485881
50381A485881p3142o7539o1020n3878m5950l7580k9321k0932j1845k745M656R726
$$ 1485881 1412739 1345200 1284180 1230302 1184352 1146772 1117451 1096519 1084674 1081929 1086585 1096311
50369A096311J3590J7205J9762J9772J6915J2094O137p55q495j6605k4200l0281
$$ 1096311 1109901 1127106 1146868 1166640 1183555 1195649 1201786 1201031 1192536 1175931 1151731 1121450
50357A121450l4231l6264l7162l7434l6924l5364l2953l0274k7788k5529k3209
$$ 1121450 1087219 1050955 1013793 976359 939435 904071 871118 840844 813056 787527 764318
50346G64318k0548j7731j5351j3724j2508j1270j0127r402q874p919o320m401
$$ 764318 743770 726039 710688 696964 684456 673186 663059 653657 644783 636864 630544 626143
50334F26143k460n20J413L344N344P248Q520R047R695J1340J3471J4704J4693
$$ 626143 623683 623163 624576 627920 633264 640512 649032 658079 667774 679114 692585 707289 721982
50321G21982J4575J5316J6476J7036J6746J6179J5964J6418J7562J9099K0559
$$ 721982 736557 751873 768349 785385 802131 818310 834274 850692 868254 887353 907912
50310I07912K1652K2277K2241K1419K0120J8830J7479J5528J2944J0487Q880Q074
$$ 907912 929564 951841 974082 995501 1015621 1034451 1051930 1067458 1080402 1090889 1099769 1107843
50298A107843P555O859N638L735J526k55j250j799k372l037l693m504n916q391
$$ 1107843 1115398 1122257 1127895 1131630 1133156 1132901 1131651 1129852 1127480 1124443 1120750 1116246 1110330 1101939
50284A101939j2160j6830k1328k4552k6234k6815k6690k6115k5621k5730k6131
$$ 1101939 1089779 1072949 1051621 1027069 1000835 974020 947330 921215 895594 869864 843733
50273H43733k5917k4824k3584k2763k2042k0955j9703j8692j7829j6744j5274
$$ 843733 817816 792992 769408 746645 724603 703648 683945 665253 647424 630680 615406
50262F15406j3349j0863q180o190n324m864l838k305j162q18p49k93O22J635K444
$$ 615406 602057 591194 583014 576824 571500 566636 562798 560493 559331 558513 557764 557471 558093 559728 562172
50247E62172K946L161L115K852K466K106J773J204K44o82r24n12k50o78j363j610
$$ 562172 565118 568279 571394 574246 576712 578818 580591 581795 582039 581357 580433 579921 579671 578993 577630 576020
50231E76020j517j830k923m322n236n284m726m188m159m579m928m763m053k997
$$ 576020 574503 572673 569750 565428 560192 554908 550182 545994 541835 537256 532328 527565 523512 520515
50217E20515j733l36J021K127K767K762K176J496J305J600J755J389R27J013J571
$$ 520515 518782 518446 519467 521594 524361 527123 529299 530795 532100 533700 535455 536844 537771 538784 540355
50202E40355J846J337M18j29J8M20M18j00o48q46r13j204j503j225l31N01O39
$$ 540355 542201 543538 543956 543827 543845 544265 544683 544583 543935 543089 542176 540972 539469 538244 537913 538414 539053
50185E39053R5p88j742k511k826k878l400m803o488p484p625p562p632p345o246
$$ 539053 539148 538360 536618 534107 531281 528403 525003 520200 513712 506228 498603 491041 483409 476064 469818
50170D69818m750l655k999j994j53J920L156L135K266J000o23k595m501n770o238
$$ 469818 465068 461413 458414 456420 456267 458187 461343 464478 466744 467744 467121 464526 460025 454255 448017
50155D48017o252o362o865p531p741p121o063n286m901m415l734l433l712l744
$$ 448017 441765 435403 428538 421007 413266 406145 400082 394796 389895 385480 381746 378313 374601 370857
50141C70857k789j463r82j445j737j223n75o25j059q66K10J261J319N86K99J276
$$ 370857 368068 366605 365623 364178 362441 361218 360643 360018 358959 358093 358303 359564 360883 361469 361768 363044
50125C63044K871L716L382K763K724L131L502L913M589N285N780O482P676Q669
$$ 363044 365915 369631 373013 375776 378500 381631 385133 389046 393635 398920 404700 411182 418858 427527
50111D27527Q645Q026P827P947P268N584M078L623L703L496L072K885K919K867
$$ 427527 436172 444198 452025 459972 467240 472824 476902 480525 484228 487724 490796 493681 496600 499467
50097D99467K611K022Q94m92j314j154n28q8J96O07J053J376J783K467L185L674
$$ 499467 502078 504100 504994 504502 503188 502034 501506 501418 501614 502221 503274 504650 506433 508900 512085 515759
50081E15759M157M919N735O178O267O400O848P577Q434R260J0042J1028J2414
$$ 515759 519916 524835 530570 536748 543015 549415 556263 563840 572274 581534 591576 602604 615018
50068F15018J3754J4256J3872J3553J4058J4949J5171J4297J2815J1519J0980
$$ 615018 628772 643028 656900 670453 684511 699460 714631 728928 741743 753262 764242
50057G64242J1287J1926J2071J1307R902Q336O823N457M270L076J609J08q24j114
$$ 764242 775529 787455 799526 810833 820735 829071 835894 841351 845621 848697 850306 850414 849590 848476
50043H48476j535k698m282n567o269o556o692p097q163r610j0498j0368r883r840
$$ 848476 846941 844243 839961 834394 828125 821569 814877 807780 799617 790007 779509 769141 759258 749418
50029G49418j0108j0044r550q979q357p433o313n448n052n042n342n756n668m534
$$ 749418 739310 729266 719716 710737 702380 694947 688634 683186 678134 673092 667750 661994 656326 651792
50015F51792k612q21K54Q09J328J889K191K078K009K757M488O278P053O887O791
$$ 651792 649180 648359 648613 649422 650750 652639 654830 656908 658917 661674 666162 672440 679493 686380 693171
50000F93171P267P870Q322Q985R930J0566J0969J2495J6074K0634K4459K7505
$$ 693171 700438 708308 716630 725615 735545 746111 757080 769575 785649 806283 830742 858247
49988H58247L1146L5783M0047M2379M2301L9983L5614K9679K3080J6580J0540
$$ 858247 889393 925176 965223 1007602 1049903 1089886 1125500 1155179 1178259 1194839 1205379
49977A205379N403J844L26Q65L339P358J1804J5195J6697J6215J3374P267k261
$$ 1205379 1210782 1212626 1212952 1213817 1217156 1224514 1236318 1251513 1268210 1284425 1297799 1305066 1302805
49964A302805j3705k4983l5091m4069n1573n6419n7825n6592n4481n2424m9825
$$ 1302805 1289100 1264117 1229026 1184957 1133384 1076965 1019140 962548 908067 855643 805818
49953H05818m5763m0513l5415l1419k8292k5355k2439j9851j7762j6110j4801
$$ 805818 760055 719542 684127 652708 624416 599061 576622 556771 539009 522899 508098
49942E08098j3641j2320j0797r494q709q081p055n704m634m138l888l409k502
$$ 508098 494457 482137 471340 461846 453137 445056 438001 432297 427663 423525 419637 416228 413726
49929D13726j314k44K28m8o73j086j051o15Q6P77J114J203J632K551L157K726
$$ 413726 412412 412168 412396 412348 411675 410589 409538 408923 409009 409786 410900 412103 413735 416286 419443 422169
49913D22169J792J509J986K200J574P58N54Q51J054J019J030J255J620K067K517
$$ 422169 423961 425470 427456 429656 431230 431988 432542 433393 434447 435466 436496 437751 439371 441438 443955
49898D43955K800K904L115L724M633N476O071O571P236Q158R232J0388J1760J3487
$$ 443955 446755 449659 452774 456498 461131 466607 472678 479249 486485 494643 503875 514263 526023 539510
49884E39510J5361J6825J7593J8104J9140K1144K4063K7705L1921L6549M1565
$$ 539510 554871 571696 589289 607393 626533 647677 671740 699445 731366 767915 809480
49873H09480M7171N3462N9950O5770P0286P3157P3903P1909O7059O0106N2281
$$ 809480 856651 910113 970063 1035833 1106119 1179276 1253179 1325088 1392147 1452253 1504534
49862A504534M4801L8705L4685L2760L2359L3057L4958L7987M0962M1818L8949
$$ 1504534 1549335 1588040 1622725 1655485 1687844 1720901 1755859 1793846 1834808 1876626 1915575
49851A915575L2173K2383J0513k898j7309l1652m4415n4308o0960o5084o7832
$$ 1915575 1947748 1970131 1980644 1977746 1960437 1928785 1884370 1830062 1769102 1704018 1636186
49840A636186o9732p0356o9300o7277o5566o4361o2479n9225n5654n3159n1402
$$ 1636186 1566454 1496098 1426798 1359521 1293955 1229594 1167115 1107890 1052236 999077 947675
49829I47675m8838m5042m1178l8044l5021l1479k8083k5701k3844k1205j7447
$$ 947675 898837 853795 812617 774573 739552 708073 679990 654289 630445 609240 591793
49818E91793j3667j1160j0269j0284j0109r168q002p684q403r055q630p477o724
$$ 591793 578126 566966 556697 546413 536304 527136 519134 511450 503047 493992 485362 477885 471161
49805D71161o785p018o657n542m075k873k353k447k809l268l734l689k631j115
$$ 471161 464376 457358 450701 445159 441084 438211 435858 433411 430602 427334 423600 419911 417280 416165
49791D16165n30j359k542l038l067l143k903j971j081j102j501j095N1Q08P86
$$ 416165 415635 414276 411734 408696 405629 402486 399583 397612 396531 395429 393928 392833 392884 393692 394478
49776C94478O34O36L48k49m80j02L60O84J367K630L941M932N934P217Q377R009
$$ 394478 395112 395748 396096 395847 395367 395265 395625 396309 397676 400306 404247 409179 415113 422330 430707 439716
49760D39716R326R831J0806J2420J4789J7720K0848K4194K8073L2370L6594M0777
$$ 439716 449042 458873 469679 482099 496888 514608 535456 559650 587723 620093 656687 697464
49748F97464M5607N1250N6587N9921O0197N7331N1873M4559L6002K6743J7827
$$ 697464 743071 794321 850908 910829 971026 1028357 1080230 1124789 1160791 1187534 1205361
49737A205361J0961P418O977Q581J1847J6890K2757K7140K8129K5412J9375J0036
$$ 1205361 1216322 1223740 1230717 1239298 1251145 1268035 1290792 1317932 1346061 1371473 1390848 1400884
49725A400884k504j7157l2061m5380n5670o2062o4678o4505o2508n9105n4583
$$ 1400884 1398380 1381223 1349162 1303782 1248112 1186050 1121372 1056867 994359 935254 880671
49714H80671m9432m4054l8644l3582k9363k5894k2475j8852j5676j3571j2280
$$ 880671 831239 787185 748541 714959 685596 659702 637227 618375 602699 589128 576848
49703E76848j1122r751q142o402m966m364m367l942k575j024k28r2JJ07m5j63
$$ 576848 565726 555975 547833 541431 536465 532101 527734 523792 521217 520193 519965 519873 519874 519981 519936 519773
49687E19773K90J111J471J048L82M5M2J10J41J83L63Q11J420J752J465P86K84
$$ 519773 520063 521174 522645 523693 524075 524120 524162 524272 524413 524596 524959 525770 527190 528942 530407 531193 531477
$$ [...]
##END NTUPLES=NMR SPECTRUM
##END=
