
##TITLE=AC1324_UGAAH12153_7163909_z8CT513T2h
##JCAMPDX= 6.0         $$ Bruker NMR JCAMP-DX V2.0
##DATA TYPE= NMR SPECTRUM
##DATA CLASS= NTUPLES
##ORIGIN= BRUKER
##OWNER= Administrator
$$ 1.72 TOPSPIN		Version 2.1
$$ 2013-01-29 19:43:35.926 -0500  Administrator@X
$$ Compression mode = diff/dup
##.OBSERVE FREQUENCY= 400.02188249412
##.OBSERVE NUCLEUS= ^1H
##.ACQUISITION MODE= SIMULTANEOUS (DQD)
##.ACQUISITION SCHEME= undefined
##.AVERAGES= 8
##.DIGITISER RES= 22
##SPECTROMETER/DATA SYSTEM= spect
##.PULSE SEQUENCE= zg30
##.SOLVENT NAME= COFFEE_meoh
##.SHIFT REFERENCE= INTERNAL, COFFEE_meoh, 1, 14.98509
##AUDIT TRAIL= $$ (NUMBER, WHEN, WHO, WHERE, PROCESS, VERSION, WHAT)
$$ ##TITLE= Audit trail, TOPSPIN		Version 2.1
$$ ##JCAMPDX= 5.01
$$ ##ORIGIN= Bruker BioSpin GmbH
$$ ##OWNER= Administrator
$$ $$ E:\/data/COFFEE/nmr/AC1324_UGAAH12153_7163909_z8CT513T2h/20/pdata/1/auditp.txt
$$ ##AUDIT TRAIL=  $$ (NUMBER, WHEN, WHO, WHERE, PROCESS, VERSION, WHAT)
(   1,<2013-01-29 19:43:27.629 -0500>,<Administrator>,<X>,<go>,<TOPSPIN 2.1>,
      <created by zg
	started at 2013-01-29 19:42:21.520 -0500,
	POWCHK enabled, PULCHK disabled,
       configuration hash MD5:
       86 BA 57 50 F2 9D 5C 9B 26 00 A9 28 5F 66 2E 89
       data hash MD5: 64K
       A1 AF CF 4C A6 F2 5A 47 D9 F0 D1 F3 58 98 97 9F>)
(   2,<2013-01-29 19:43:31.020 -0500>,<Administrator>,<X>,<proc1d>,<TOPSPIN 2.1>,
      <Start of raw data processing
       efp LB = 0 FT_mod = 6 PKNL = 1 PHC0 = 0 PHC1 = 0 SI = 32K 
       data hash MD5: 32K
       44 52 9A 58 92 CC 1E BC EC 84 40 B1 76 7E D6 BE>)
(   3,<2013-01-29 19:43:31.489 -0500>,<Administrator>,<X>,<proc1d>,<TOPSPIN 2.1>,
      <pk PHC0 = 98.28918 PHC1 = 0 
       data hash MD5: 32K
       96 EB EF 7D D9 87 E7 E6 B4 E6 63 45 A4 98 C6 E4>)
(   4,<2013-01-29 19:43:31.723 -0500>,<Administrator>,<X>,<proc1d>,<TOPSPIN 2.1>,
      <abs ABSG = 1 
       data hash MD5: 32K
       8B 95 A9 EC F3 D1 AC 37 EA 27 FF 46 41 29 B4 40>)
(   5,<2013-01-29 19:43:31.833 -0500>,<Administrator>,<X>,<proc1d>,<TOPSPIN 2.1>,
      <abs ABSG = 2 
       data hash MD5: 32K
       A0 6F 02 C9 0A 72 4C 13 6B A1 7E CE FB 80 28 7E>)
(   6,<2013-01-29 19:43:31.973 -0500>,<Administrator>,<X>,<proc1d>,<TOPSPIN 2.1>,
      <abs ABSG = 3 
       data hash MD5: 32K
       6C 6D C1 AF 61 C4 FC 40 22 B9 E8 BB C3 62 6D 0D>)
(   7,<2013-01-29 19:43:32.129 -0500>,<Administrator>,<X>,<proc1d>,<TOPSPIN 2.1>,
      <abs ABSG = 4 
       data hash MD5: 32K
       28 88 2E 3A 56 42 D9 14 C9 81 5E 7A FC 3F 05 78>)
(   8,<2013-01-29 19:43:32.286 -0500>,<Administrator>,<X>,<proc1d>,<TOPSPIN 2.1>,
      <abs ABSG = 5 
       data hash MD5: 32K
       2D A4 F3 FA FF 67 E1 7B 1A 70 07 50 D3 9D DB 0C>)
$$ ##END=
$$ 
$$ $$ hash MD5
$$ $$ 92 3F B7 D4 35 1A ED 06 37 ED C0 AC A9 AB 85 F4
##$RELAX= 
##$RELAX= 
##$RELAX= 
##$RELAX= 
##$RELAX= 
##$RELAX= 
##$RELAX= 
$$ Bruker specific parameters
$$ --------------------------
##$DU= <E:\>
##$EXPNO= 20
##$NAME= <AC1324_UGAAH12153_7163909_z8CT513T2h>
$$ [...]
##$TP= (0..7)
150 150 150 150 150 150 150 150
##$TP07= 0
##$TPNAME0= <>
##$TPNAME1= <>
##$TPNAME2= <>
##$TPNAME3= <>
##$TPNAME4= <>
##$TPNAME5= <>
##$TPNAME6= <>
##$TPNAME7= <>
##$TPOAL= (0..7)
0.5 0.5 0.5 0.5 0.5 0.5 0.5 0.5
##$TPOFFS= (0..7)
0 0 0 0 0 0 0 0
##$TUNHIN= 0
##$TUNHOUT= 0
##$TUNXOUT= 0
##$USERA1= <user>
##$USERA2= <user>
##$USERA3= <user>
##$USERA4= <user>
##$USERA5= <user>
##$V9= 5
##$VALIST= <valist>
##$VCLIST= <CCCCCCCCCCCCCCC>
##$VD= 0
##$VDLIST= <DDDDDDDDDDDDDDD>
##$VPLIST= <PPPPPPPPPPPPPPP>
##$VTLIST= <TTTTTTTTTTTTTTT>
##$WBST= 1024
##$WBSW= 4
##$XGAIN= (0..3)
0 0 0 0
##$XL= 0
##$YL= 0
##$YMAX_a= 599067
##$YMIN_a= -505937
##$ZGOPTNS= <>
##$ZL1= 120
##$ZL2= 120
##$ZL3= 120
##$ZL4= 120
##$ABSF1= 14.98509
##$ABSF2= -5.573092
##$ABSG= 5
##$ABSL= 3
##$ALPHA= 0
##$AQORDER= 0
##$ASSFAC= 0
##$ASSFACI= 0
##$ASSFACX= 0
##$ASSWID= 0
##$AUNMP= <proc_prof1d_extract_pilot.lims>
##$AXLEFT= 0
##$AXNAME= <>
##$AXNUC= <1H>
##$AXRIGHT= 0
##$AXTYPE= 0
##$AXUNIT= <>
##$AZFE= 0.1
##$AZFW= 0.1
##$BCFW= 0
##$BC_mod= 0
##$BYTORDP= 0
##$COROFFS= 0
##$CY= 15
##$DATMOD= 1
##$DC= 0
##$DFILT= <>
##$DTYPP= 0
##$F1P= 0
##$F2P= 0
##$FCOR= 0.5
##$FTSIZE= 32768
##$FT_mod= 6
##$GAMMA= 0
##$GB= 0
##$INTBC= 1
##$INTSCL= 1
##$ISEN= 128
##$LB= 0
##$LEV0= 0
##$LPBIN= 0
##$MAXI= 10000
##$MC2= 0
##$MEAN= 0
##$ME_mod= 0
##$MI= 0
##$NCOEF= 0
##$NC_proc= -8
##$NLEV= 6
##$NOISF1= 0
##$NOISF2= 0
##$NSP= 0
##$NTH_PI= 0
##$NZP= 0
##$OFFSET= 14.98509
##$PC= 1
##$PHC0= 98.28918
##$PHC1= 0
##$PH_mod= 1
##$PKNL= yes
##$PPARMOD= 0
##$PPDIAG= 0
##$PPIPTYP= 0
##$PPMPNUM= 2147483647
##$PPRESOL= 1
##$PSCAL= 4
##$PSIGN= 0
##$PYNMP= <proc.py>
##$REVERSE= no
##$SF= 400.02
##$SI= 32768
##$SIGF1= 0
##$SIGF2= 0
##$SINO= 400
##$SIOLD= 32768
##$SPECTYP= <>
##$SREGLST= <1H.CDCl3>
##$SSB= 0
##$STSI= 32768
##$STSR= 0
##$SW_p= 8223.68421052631
##$SYMM= 0
##$S_DEV= 0
##$TDeff= 65536
##$TDoff= 0
##$TI= <>
##$TILT= no
##$TM1= 0
##$TM2= 0
##$TOPLEV= 0
##$USERP1= <user>
##$USERP2= <user>
##$USERP3= <user>
##$USERP4= <user>
##$USERP5= <user>
##$WDW= 1
##$XDIM= 32768
##$YMAX_p= 461385681
##$YMIN_p= -779332
##$CURPLOT= <Network HP LaserJet P1505>
##$CURPRIN= <$Network HP LaserJet P1505>
##$DFORMAT= <normdp>
##$LAYOUT= <+/1D_H.xwp>
##$LFORMAT= <normlp>
##$PFORMAT= <normpl>
##$SURQMSG= 1
$$ End of Bruker specific parameters
$$ ---------------------------------
##NTUPLES= NMR SPECTRUM
##VAR_NAME=  FREQUENCY,     SPECTRUM/REAL,   SPECTRUM/IMAG
##SYMBOL=    X,             R,               I
##VAR_TYPE=  INDEPENDENT,   DEPENDENT,       DEPENDENT
##VAR_FORM=  AFFN,          ASDF,            ASDF
##VAR_DIM=   32768,         32768,           32768
##UNITS=     HZ,            ARBITRARY UNITS, ARBITRARY UNITS
##FACTOR=    0.250966925370066, 1,           1
##FIRST=     8223.43324360094, -85589,       6182
##LAST=      0,             -49,             -148594
##MIN=       0,             -779332,         0
##MAX=       8223.43324360094, 461385681,    0
$$ Real data points
##PAGE= N=1
##DATA TABLE= (X++(R..R)), XYDATA
$$ [...]
19510b40576R445g5089m3879D4596a25741A14619g1176q5826f5051k0881p5591
19499a61523c7329l63530a61536f8125g447k28513j44587a16395A87068c17918
19488a95365e4921k27755p2920a69018F8592g3258A09256j4038a07889D0358a57320
19476h053B33548c7864B9687J91984c3003k61662f5056j31485D9240D858b56122
19464b22711e1396B83401b38328q839K0212j40869c0292B1260a73059k80057a23340
19452e2555j15582l71B52174a43537F9979J4438b52795M5845h8703p7292O3451
19441a02544j41486h2274B73726I2807K5959a3355D0715b12918m33663i7837B67450
19429A14414O7191c17828C4648b19285C3042J32509a14874k0460B76748E253a60992
$$ y = [-240576, -231131, -75089, -118968, 44596, -125741, 114619, -71176, -157002, -65051, -85932, -161523, -37329, -400859, -161536, -68125, -7447, -235960, -380547, -116395, 187068, -317918, -195365, -54921, -282676, -355596, -169018, 68592, -73258, 109256, 95218, -107889, 40358, -157320, -8053, 233548, -37864, 29687, 221671, -33003, -294665, -65056, -196541, 49240, 4858, -256122, -222711, -51396, 283401, -238328, -247167, -226955, -367824, -30292, 21260, -173059, -453116, -123340, -52555, -168137, -168508, 252174, -143537, 69979, 84417, -252795, -206950, -88703, -165995, -102544, -244030, -82274, 273726, 92807, 118766, -13355, 40715, -212918, -646581, -97837, 267450, 114414, 181605, -317828, 34648, -219285, 33042, 165551, -114874, -135334, 276748, 5253, -160992]
19417E4593b35703h7561G8625J57268b35291a00813k85468a69070k12525e2748
19406c38105G0978L2711c41461F1413a54155b7710q3128j2437B6766a1374j07237
19395a18611D3564a60736j93645d9075A64870Q5527a69325k01677J45220M0225
19385a85557A53514E3853b25586D3941i1826C9128j0942J7333M2565J6417d3615
19373D0879K8305e23277a51423C88444d9019I6300B6191J04341a73338A14313
19362A59568b8193D3334L5547l7065i2912L2586A0650K41517b80080E0151b62376
19350b265m6143F9739b02586e1554F861h3862p5553k2607A8497c28998E4393a7025
19337b09343J7457O3074J0625H0538f6631I8367a17706M6084k82657a56115c9461
$$ y = [54593, -235703, -87561, 78625, 235893, -235291, -100813, -386281, -169070, -381595, -52748, -338105, 70978, 103689, -341461, 61413, -154155, -27710, -110838, -123275, 26766, -11374, -118611, 43564, -160736, -354381, -49075, 164870, 250397, -169325, -371002, -225782, -185557, 153514, 53853, -225586, 43941, -91826, 39128, 28186, 45519, 88084, 104501, -43615, 40879, 69184, -523277, -151423, 388444, -49019, 96300, 26191, 130532, -173338, 114313, 159568, -28193, 43334, 78881, 41816, -92912, -60326, 10650, 252167, -280080, 50151, -262376, -2265, -48408, 69739, -202586, -51554, 6861, -83862, -159415, -182022, 18497, -328998, 54393, -17025, -209343, -191886, -128812, -118187, 80538, -66631, 98367, -117706, -71622, -354279, -156115, -39461]
19325h7989m2811A24016C1182a01637G0235K29877a18691a6247l516k5304k25507
19314b70574O5195I8906C2831M1643J23650b36850Q9465j16058n2787B65635c14793
19302d31427c132B54039a45473K6804j42093G9864f4034n8776l3148A2395b7108
19290c70798A18093c5723C52155B3142h4660B878b04553N4155A97236b49051A38424
19278a86757A35460B7459b58174C8846J46398a86223a9403j14904D4422c0832
19267A38785c56409B64433A02901D0764L41183f6253j50892O2322b8034j55155
19257a83189B00631c2805k55987d2782A16420A4316e42213J98414a4315p3089
19247h7404l2024A26349b71192L5883I9229a92675A2656P7950J39144d73602a54190
$$ y = [-87989, -130800, 124016, 31182, -101637, 70235, 300112, -118691, -16247, -19763, -45067, -270574, -205379, 98906, 32831, 74474, 198124, -236850, -147385, -263443, -316230, 265635, -314793, -431427, -3132, 254039, -145473, -118669, -260762, 79864, -64034, -122810, -155958, 12395, -27108, -370798, 118093, -35723, 352155, 23142, -84660, 2878, -204553, -150398, 197236, -249051, 138424, -186757, 135460, 27459, -258174, 38846, 185244, -186223, -19403, -134307, 44422, -30832, 138785, -356409, 264433, 102901, 40764, 381947, -66253, -217145, -154823, -28034, -183189, 200631, -32805, -288792, -42782, 116420, 14316, -542213, -343799, -14315, -87404, -119428, 126349, -271192, -235309, 99229, -192675, 12656, 90606, 229750, -473602, -154190]
19235C13867d892j25301o6360i764j06552A07805b0999j38815k3601A26376m4170
19224H2206c85474a57935J4943A14939f76l8798o7629A4522b09992A67893c24849
19212g1016l9330b8064k79117B0996R0755b15300h6079k20817C7718K20119a92640
19200c0685j48016P4055j61309d6433D3130g7476n1614B33547a32464B70053b02179
19188B18745a95323A00567N7974f7941E7568b3003E0995c88759C3398b624B2372
19176A8200b33690a08890H9170M2325a42765E3270A330a70787F6215i9120A17006
19164F0736b7106l27381g525A0388L44215f9089o7201A87850f0744A42589m5406
19153I7183b54528J4146J03157j7772O7761E20397b77416a6479A28084C0213b95240
$$ y = [313867, -4892, -130193, -196553, -9764, -116316, 107805, -20999, -159814, -183415, 126376, 82206, -385474, -157935, -142992, 114939, -676, -39474, -107103, 14522, -209992, 167893, -324849, -71016, -110346, -28064, -307181, 20996, 111751, -215300, -86079, -306896, 37718, 257837, -192640, -30685, -178701, -104646, -265955, -46433, 43130, -77476, -129090, 233547, -132464, 270053, -202179, 218745, -195323, 100567, 158541, -67941, 57568, -23003, 50995, -388759, 33398, -2624, 22372, 18200, -233690, -108890, 89170, 131495, -142765, 53270, 1330, -170787, 66215, -99120, 117006, 60736, -27106, -354487, -7525, 10388, 354603, -69089, -136290, 187850, -60744, 142589, 97183, -254528, -240382, -137225, -154997, -87236, 520397, -277416, -16479, 128084, 30213, -295240]
19141d0674C2786I283f9702A19189k3637P8633B9551A0037K72336a19278l5213
19130a54491p255j25510J06159I9324b86345B6331c80538a52943A72577d74092
19119A05808d09904R5795A40962f0169A08729b29760A12364j6656g6564j34068
19109b10632h8905k23730f4306j79983A13383a07144n3588h0114G8228a14364
19098B76215N389a02953E4052K4740c85808B67841A13187b7599F355a67806A58721
19086a2582j61632F5432b64955g8187q0214o3048f1312l70439C6100b92761a07325
19074c94200a59509j13424J28469C9981b8218B43075h7594A42768b67757B85143
19063A83776A7041a80664D4478Q1825D2767a53839K5923A97624b38529e5630r0335
$$ y = [-40674, 32786, 9283, -69702, 119189, 95552, 174185, 29551, 10037, 282373, -119278, -154491, -161746, -287256, -181097, 99324, -286345, 26331, -380538, -152943, 172577, -474092, 105808, -409904, -314109, 140962, -60169, 108729, -229760, 112364, 95708, -76564, -210632, -88905, -312635, -64306, -244289, 113383, -107144, -160732, -80114, 78228, -114364, 276215, 281604, -102953, 54052, 78792, -385808, 267841, 113187, -27599, 6355, -167806, 158721, -12582, -174214, 65432, -264955, -78187, -158401, -221449, -61312, -431751, 36100, -292761, -107325, -394200, -159509, -272933, -144464, 39981, -28218, 243075, -87594, 142768, -267757, 285143, 183776, 17041, -180664, 44478, 126303, 42767, -153839, -127916, 197624, -238529, -55630, -145965]
19052a45965J4310c8881F629J49015a83088A96582f2328r6429b4646B32690b65396
19040A26497a10889k8492j40085A69851D4483r742c8641j75973j09347N923A29523
19028B21622e2977G6382K22550D6557M2668M5237b01868D6042a04436A2872K47435
19017B60307f1025I6487a17311j55440J17314L2113j799A58017a2841A00405a82687
19005G393b88571A9925J80985o4958a10100D4388a54195a6560j26119k30097J33334
18994b39442E3293J438b11448A87080b33891A07209l8982A4022f7376o2433j31542
18983b61351G9302R1780D7339f5839k85465J50484K3488A51323E9764K8963J98175
18972B86902K1245M75314m6530j66468A90984I0644a14772J5702A00776L2385
$$ y = [-145965, -131655, -38881, 6629, 155644, -183088, 196582, -62328, -158757, -24646, 232690, -265396, 126497, -110889, -139381, -279466, 169851, 44483, 34741, -38641, -214614, -323961, -318038, 129523, 221622, -52977, 76382, 298932, 46557, 89225, 134462, -201868, 46042, -104436, 12872, 260307, -61025, 96487, -117311, -272751, -155437, -123324, -125123, 158017, -12841, 100405, -182687, 7393, -288571, 19925, 200910, 135952, -110100, 44388, -154195, -16560, -142679, -372776, -239442, 53293, 54731, -211448, 187080, -233891, 107209, 68227, 14022, -67376, -129809, -261351, 79302, 171082, 47339, -65839, -351304, -200820, -177332, 151323, 59764, 88727, 286902, 308147, 783461, 736931, 570463, 190984, 90644, -114772, -99070, 100776, 133161]
18962A33161b83241a24909A11213e3148A4271b8218B2492E641J25822l3890j5798
18951H1775d47105B3210K23437b27419B279M9867a31190n7128L3477A2922i710
18939A49772a26602I4728J45154J53951b66719D9706a62670E5568f1864k22842
18929b84706K4605f0510B40501C6254K13283m3455b232D5356E565c10906k7090
18918c37996B60758b06138J1463O827A32325c2834j35980A91933O2961l2855J25119
18907C47158O58773C71019L46290b14381C0738J15132J73364b15243f4594b7241
18896A27197r950a93098A92175g4704B77252c9898A07083b5741A1164i4555A85105
18884b32065k9194J18785c5822C8156a74877P4559k267A3060J06673A160a11147
$$ y = [133161, -283241, -124909, 111213, -53148, 14271, -28218, 22492, 5641, 131463, 97573, 81775, -447105, 23210, 246647, -227419, 2279, 52146, -131190, -188318, -154841, 12922, -9710, 149772, -126602, 94728, 239882, 393833, -266719, 49706, -162670, 55568, -61864, -284706, -260101, -60510, 240501, 36254, 249537, 206082, -2232, 45356, 5565, -310906, -337996, 260758, -206138, -194675, -187848, 132325, -32834, -168814, 191933, 254894, 222039, 347158, 1005931, 371019, 717309, -214381, 30738, 145870, 319234, -215243, -64594, -27241, 127197, 117247, -193098, 192175, -74704, 277252, -39898, 107083, -25741, 11164, -94555, 185105, -232065, -261259, -142474, -35822, 38156, -174877, -100318, -102585, 13060, 119733, 1160, -111147]
18872b63207A40891h5114j4532r853N4149k62239A17163c08581I289K1986P7258
18861A08533R3712d00154a55347J4995E7506b16550M5037p0156M6125g0600c4258
18849b2191n7701k0750j29071A21036l1976d03291C06186r3178f8932o243l96668
18838d71843B62115R5581a95033Q2774P756a7710F186f9560H0585a40208a2766
18826E0449f8415c2800E4852J50487b11605O5226A71640b71971a754F0197b32555
18814G1580N1605b80383d2622E4725P2494Q0066b67649C8266J35297G6559C516
18802b23160r8196l9894D5947f593B06643B2814O7343b1932G2913O0345L5812
18791A69070c10396Q3139D7452d50698a25019K5536j90909R4581C8216e5950m423
$$ y = [-263207, 140891, -85114, -99646, -109499, -55350, -317589, 117163, -308581, 9289, 31275, 108533, 202245, -400154, -155347, -140352, 57506, -216550, -171513, -241669, -195544, -70600, -34258, -22191, -79892, -100642, -229713, 121036, 89060, -403291, 306186, 213008, -68932, -75175, -471843, 262115, 357696, -195033, -112259, -104503, -17710, 6186, -69560, 80585, -140208, -12766, 50449, -68415, -32800, 54852, 205339, -211605, -146379, 171640, -271971, -1754, 60197, -232555, 71580, 123185, -280383, -42622, 54725, 127219, 207285, -267649, 38266, 173563, 76559, 3516, -223160, -321356, -361250, 45947, -6593, 206643, 22814, 90157, -21932, 72913, 133258, 169070, -310396, -227257, 47452, -450698, -125019, -99483, -290392, -195811, 38216, -55950, -60373]
18780f0373r6496r7303G5564a77802j71230J51626h8436A03748l5872b83857i5837
18768d88135B9963i9489o7784o0101f0818n3653j28355k5447a6774l16824H0909
18756a37872J1131k31457a53074b5211B18219p6262J58630p0054f4700k69363
18746c34063J21142L2603F7428a59700q634m9410H3406a92973R1548H1574m212
18735G7362B1800L6047c0513A86239j5848a54448o4617A21152J55844e6514j85206
18724b41720A1550b18906L9868B8023A607O4170J55814d38279A66109b10579B21012
18712b22617A70118k5843n4275c2333G2253J6996a44330c69q8609L0336I2371
18700b32045D5719c45163I6871I283O5877c3785D3982b30226b1929p4974I8953
$$ y = [-60373, -156869, -254172, 75564, -177802, -349032, -197406, -88436, 103748, 67876, -283857, -95837, -488135, 29963, -99489, -167273, -227374, -60818, -114471, -242826, -268273, -16774, -333598, 80909, -137872, -126741, -358198, -153074, -25211, 218219, 141957, 300587, 230533, -64700, -334063, -212921, -180318, 67428, -159700, -168334, -217744, 83406, -192973, -101425, 81574, 77362, 21800, 57847, -30513, 186239, 170391, -154448, -219065, 121152, 276996, -56514, -241720, 11550, -218906, -179038, 28023, 1607, 65777, 221591, -438279, 166109, -210579, 221012, -222617, 170118, 144275, 90000, -32333, 72253, 89249, -144330, -369, -88978, -58642, 92371, -232045, 45719, -345163, 96871, 9283, 75160, -33785, 43982, -230226, -21929, -96903, 98953]
18688E0525K04161b26546L9900L8895D5211b15355A40078j8249R0531N390b50472
18676C2292g614I1821C352c4599H2895d04420B4637c73960E3752K0151b04864
18664c94526G9176J78047a99104B986K3740K92134b52171C0284N5194c396j8493
18653b1889m3622r1892C5833P727a41740H1712h4120b2521r975k0583B5749f0568
18640a68514f7055A30985a11458A67031a83544j75514i5750j45844J13799j5925
18630a43720N2338E211b50489h8589G6032A7267a08458C4052h7195B14956a65132
18618b50850A46937K0854a01857A24769b03139I1265a81426d5412J0287j86833
18608b21958c3127k62666J15428a0978k02728k3183i9430G2405a11178j95154
$$ y = [50525, 254686, -226546, -186646, -147751, 45211, -215355, 140078, 121829, 212360, 217750, -250472, 32292, -7614, 91821, 3352, -34599, 82895, -404420, 24637, -373960, 53752, 73903, -204864, -394526, 79176, 257223, -199104, 2986, 26726, 318860, -252171, 30284, 85478, -3396, -21889, -65511, -157403, 35833, 43560, -141740, 81712, -84120, -22521, -32496, -53079, 25749, -60568, -168514, -67055, 130985, -111458, 167031, -183544, -359058, -95750, -241594, -127795, -143720, -91382, 5211, -250489, -88589, 76032, 17267, -108458, 34052, -87195, 214956, -165132, -250850, 146937, 167791, -101857, 124769, -203139, 91265, -181426, -45412, -35125, -221958, -33127, -295793, -180365, -10978, -213706, -236889, -99430, 72405, -111178, -306332]
18598c06332a18199B1754b12560B64412j8120a48858A41519K10927d1248j8303
18588e9551A27160D2809b29028A34894O0365a1263j85980q6868J34466A10565
18577b22209g2668K1501j3696j09793n7369B28049f0795q7812d8873c453A39880
18565a49652C32925a38745j06199a17841a0415j29364D9554d9189n2429A97260
18554a39685O214k07838I6704b3998q1142D3090b96530c0100E5777a56276B26226
18542i4618A24346H943b49599h0427j54587c3346B70248g9673j41507H0107b38821
18530b62856B32370A01887i4102B13427p9669a70483O3707I8387e938B41318A12096
18518F6748c14890J48654l1026p5168a04527B53489a4602l03519A2356b27669
$$ y = [-306332, -118199, 21754, -212560, 264412, 246292, -148858, 141519, 352446, -41248, -59551, 127160, 42809, -229028, 134894, 195259, -11263, -197243, -284111, -149645, 110565, -222209, -72668, -51167, -64863, -174656, -232025, 228049, -60795, -148607, -48873, -3453, 139880, -149652, 332925, -138745, -244944, -117841, -10415, -139779, 49554, -49189, -101618, 197260, -139685, -133471, -341309, 96704, -23998, -105140, 43090, -296530, -30100, 55777, -156276, 226226, -94618, 124346, 8943, -249599, -80427, -235014, -33346, 270248, -79673, -221180, 80107, -238821, -262856, 232370, 101887, -94102, 213427, 133758, -170483, -106776, 98387, -5938, 241318, 112096, 66748, -314890, -166236, -197262, -272430, -104527, 253489, -14602, -318121, 12356, -227669]
18507H1238a80656B39821b0477I4410o61L0251i1351k22028A70090f9993l03841
18496c73834a26842n8497P2592j85795E790Q4188c26017a9661o426q8224G215
18484C7683a8803D08276b95833A64217a96069M3557B8577K9909K04565a49306
18473c72842d6602A38146D5716a35569E3735a45025B51672E864c4254B53200b67474
18461a22670e8514j53770C7114l504e2064e623A30356J1107a48569B21273c3879
18449b29477o7031A7611a33090B00329H0354M2279e6082m7385b5637A99367a03583
18437A36717d8771A24125A1260d28946b02595O3860G798a27366N3157j26369A2191
18425a75380H4242e2151k7370j51355l6488J21512f4814B85610A22973l2649O0201
$$ y = [81238, -180656, 239821, -20477, 94410, 93749, 124000, -91351, -313379, 170090, -69993, -373834, -126842, -185339, -112747, -298542, 5790, 89978, -326017, -19661, -26087, -114311, 7215, 37683, -18803, 408276, -295833, 164217, -196069, -152512, 28577, 58486, 263051, -149306, -372842, -46602, 138146, 45716, -135569, 53735, -145025, 251672, 5864, -34254, 253200, -267474, -122670, -58514, -212284, 37114, 33610, -52064, -5623, 130356, 141463, -148569, 221273, -33879, -229477, -296508, 17611, -133090, 200329, 80354, 122633, -56082, -103467, -25637, 199367, -103583, 136717, -48771, 124125, 11260, -428946, -202595, -138735, 7798, -127366, -74209, -200578, 12191, -175380, 84242, -52151, -79521, -230876, -267364, -145852, -64814, 285610, 122973, 90324, 150525]
18414A50525J85244A46588a8394A62567a37984r6594C33740d15q2666H0476q017
18403G2459a22154c5515B59044b9964j59323D3201L1648O2452F0667B5004c5171
18391C491J35290f5476n511L1915a5098j28160d7518j127A2529J02393I156K9472
18379C8628A1013K42077a10983A37021a41887E1924b01835A50577b25885j40147
18369c66032A56152D0730b19504B22720O4886D1001L8123g1295A00473A5621a80712
18357b87164c5586A43314j3847c03228B92155f1911j18383j1157A3807a54192
18346F6531B6100J95871b5047l0783a6049D3656A1788K58959a57205J7527p1046
18335b10724A53470h0159B2253a896n4680p1050A5935a99521G7074a48058A1603
$$ y = [150525, 335769, 146588, -18394, 162567, -137984, -234578, 333740, -415, -83081, 80476, 72459, -122154, -35515, 259044, -29964, -189287, 43201, 74849, 137301, 60667, 25004, -35171, 3491, 138781, -65476, -70987, -39072, -15098, -143258, -47518, -48645, 12529, 114922, 9156, 38628, 11013, 253090, -110983, 137021, -141887, 51924, -201835, 150577, -225885, -366032, 156152, 40730, -219504, 222720, 287606, 41001, 79124, -71295, 100473, 15621, -180712, -287164, -35586, 143314, 129467, -303228, 292155, -61911, -180294, -191451, 13807, -154192, 66531, 26100, 221971, -25047, -55830, -16049, 43656, 11788, 270747, -157205, -139678, -210724, 153470, -80159, 22253, -1896, -56576, -127626, 15935, -199521, 77074, -148058, 11603]
18323B42716g8266C79599c3521k64984R9485i6846d3520l38I190b51396B27710
18311B6499J13479E0997a93942N9140l7836I6631k1258L57635a70752c1402k14416
18300b45818e7719A21988a54962f6637j22466F5385f8645E830b893k46685A49263
18288A79439b38485A87794a40517A33191E5628J27810a79572A46539K0140f2468
18277F895P0232K8095K3186a96642A91904e03084a2337j38101B7064b70205H2719
18265D3214a50143A30723a27690j3224I4842a54511f9583A73133c74433B00193
18254h9360A106f8386A73913c85086d4751C98813e7461j61186i9583c092k88722
18243b91814A40786o4972J9234k9793a49975g855l75195J55398F1538a16165E8310
$$ y = [242716, -78266, 379599, -33521, -298505, -199020, -96846, -43520, -43858, 9190, -251396, 227710, 26499, 139978, 50997, -193942, -134802, -172638, 96631, 75373, 433008, -170752, -31402, -245818, -57719, 121988, -154962, -66637, -189103, 65385, -68645, 5830, -2893, -249578, 149263, 179439, -238485, 187794, -140517, 133191, 55628, 183438, -179572, 146539, 166679, -62468, 6895, 77127, 105222, 128408, -196642, 191904, -503084, -12337, -150438, 27064, -270205, 82719, 43214, -150143, 130723, -127690, -140914, 94842, -154511, -69583, 173133, -374433, 200193, -89360, 1106, -68386, 173913, -385086, -44751, 398813, -57461, -218647, -99583, -3092, -291814, 140786, 75814, 95048, 65255, -149975, -7855, -383050, -227652, 61538, -116165, 58310]
18231A67553C6180J57362J8304L087n7810a77343J3508n1514A03888A2180b65724
18219b34035O2537q6314a21493p3644A72755m9711b02330h4108A78959e0219A79859
18207B55816b13766D5558a50493B11476m1991F755P659a28208N5995j06557B67735
18195a85244G1260d24155F0725b21573B9978L64200j77848i9919H1239N5937J45398
18184B82574A10982d4860o066a1757k61160J09441N1423A36502D2460f2102H9773
18172A43469b51302A98590C8910J85041j9851P6780b8239j92283A46750E5064
18161A23797Q5103c17137a55744D6484a26234M8746B8975J04293r122h0077A59274
18149A14449d4898l4268F3694J14167b06366D3297B450J70276a6895k63172J17312
$$ y = [167553, 36180, 193542, 211846, 214933, 157123, -177343, -163835, -215349, 103888, 12180, -265724, -234035, -171498, -257812, -121493, -195137, 172755, 123044, -202330, -84108, 178959, -50219, 179859, 255816, -213766, 45558, -150493, 211476, 169485, 6755, 14414, -128208, -72213, -178770, 267735, -185244, 71260, -424155, 60725, -221573, 29978, 394178, 216330, -99919, 81239, 137176, 282574, 110982, -44860, -50926, -11757, -272917, -163476, -112053, 136502, 42460, -62102, 89773, 143469, -251302, 198590, 38910, 223951, 204100, 280880, -28239, -220522, 146750, 55064, 123797, 208900, -317137, -155744, 46484, -126234, -77488, 28975, 133268, 124146, -80077, 159274, 114449, -44898, -79166, 63694, 177861, -206366, 43297, 2450, 172726, -16895, -280067, -162755]
18138a62755j08221N4330p5035d3750o9139G0525R484K47229i5422j83192a3731
18126h7785A57429a33735j4008j7632P0217E3762a7344j28404A65706i6662A42743
18114e9401q3837D7213J37809j8721E5860a21102A40219a52066q542A92471A0985
18102B16203g7417b3477I4614L45B1118i0572m4984I900N6697R7745B4117b32700
18089a1780G4402k363a88112R3611j2229r996B82347A5334R8847c7876k0113A63822
18076f3675n8409A95035a2208k00555B57796I2877J0545J55526f7279K2136B95608
18064a84445A0600a14777n2124A75095b67095B0730L0668Q4636a82484b0514k9295
18053d9809B14453J04560a11606k65438H944K91207B1887b67504b5614B75251
$$ y = [-162755, -270976, -216646, -291681, -43750, -112889, 70525, 80009, 327238, -95422, -278614, -13731, -87785, 157429, -133735, -147743, -165375, -95158, 53762, -17344, -145748, 165706, -96662, 142743, -59401, -143238, 47213, 185022, 166301, 55860, -121102, 140219, -152066, -160608, 192471, 10985, 216203, -77417, -23477, 94614, 94959, 21118, -90572, -135556, 9900, 66597, 164342, 24117, -232700, -11780, 74402, 72039, -188112, -94501, -106730, -116726, 282347, 15334, 114181, -37876, -57989, 163822, -63675, -122084, 195035, -12208, -212763, 257796, 92877, 103422, 258948, -67279, -45143, 295608, -184445, 10600, -114777, -166901, 175095, -267095, 20730, 51398, 136034, -182484, -20514, -49809, 214453, 319013, -111606, -377044, 8944, 300151, 21887, -267504, -25614, 275251]
18042b32407C68352b50559a10184B16207I5143a42846k17164d6852n8483l1929
18032a37264B8021J67003h8489l20044A74294o0004b78933c0396j43519f8335
18021D7728b24806C06909b8726G3870b04220B03693d87331g7654j70041A7244
18010A6953g8638F9592L5544i471j95189F4219K08746b40584A47334D6319d70768
17998a62393L9160A54895b24379o2306C60892i7267m7639k3586B02136J49971
17988C52107g5419A21805c83757i0625n877H7851k4132K01099B1434m52g8589
17976E4810b9948j27132k736M9560j89925E7763a40891D68K99114b31079C8312
17964D0587K64684c28799e1492F2077F566a31572j67922q4167A13621b9091E3862
$$ y = [-232407, 368352, -250559, -110184, 216207, 95143, -142846, -360010, -46852, -105335, -137264, 28021, 195024, -88489, -408533, 174294, 114290, -278933, -30396, -173915, -68335, 47728, -224806, 306909, -28726, 73870, -204220, 203693, -487331, -77654, -247695, 17244, 16953, -78638, 69592, 105136, -9471, -204660, 64219, 272965, -240584, 147334, 46319, -470768, -162393, -123233, 154895, -224379, -286685, 360892, -97267, -144906, -168492, 202136, 352107, -75419, 121805, -383757, -90625, -96502, 87851, 63719, 264818, 21434, 20982, -78589, 54810, -29948, -157080, -159816, -110256, -300181, 57763, -140891, 468, 299582, -231079, 38312, 40587, 305271, -328799, -51492, 62077, 6566, -131572, -299494, -383661, 113621, -29091, 53862]
17952e9669q9910c5784A67821B5989i8606A20139a69085g1663k49801H2745J41329
17941B24074m1371c55550C15009R3211A67193P1049d5402Q807A97243O496E6074
17929A97145P4801C0503J24821h4316N218k00781A15110a36514k7752h0267C88783
17917B114d7513I3622J64395F813i5200q4406J5802d7809D6018R7020a84536f5402
17904H1855j415J24604E2446a31343j8994j13305A41260g8419h218A08225a27672
17892b9449A8042K1700h7828j09696d410F7795d8164A2974e5112C06997A31374
17880H0815Q8829h4687B81089o4811G3246J78357J0289b84238A05595K4554n1152
17869G8997L42699G3344a20894D8905J20975m9641A6445J45051J1178O1721A6058
$$ y = [-59669, -149579, -35784, 167821, 25989, -98606, 120139, -169085, -71663, -321464, 82745, 224074, 182703, -355550, 315009, 408220, 167193, 238242, -45402, -36595, 197243, 203739, 56074, 197145, 271946, 30503, 155324, -84316, -79098, -279879, 115110, -136514, -164266, -80267, 388783, 2114, -47513, 93622, 258017, 6813, -95200, -179606, -163804, -47809, 46018, 143038, -184536, -65402, 81855, 80440, 205044, 52446, -131343, -150337, -263642, 141260, -78419, -8218, 108225, -127672, -29449, 18042, 39742, -87828, -197524, -4410, 67795, -48164, 12974, -55112, 306997, 131374, 80815, 169644, -84687, 281089, 216278, 73246, 251603, 261892, -284238, 105595, 130149, 78997, 421696, 73344, -120894, 48905, 169880, 120239, 16445, 161496, 172674, 234395, 16058]
17857a06369A58735a10055c0920j00800A55185k5483q572L4585E6539i4341A2653
17845b7650k17719J02328A67911E6717N9408J1188b55010A80339N4699D3812a38525
17833b2567A91393A8482a65000B11066m7516c33434A13894K33073a82716e5903
17822a92021k2410g6706j73632J15966k10370g3116a9822A47923l7095i7821E5741
17810f3498j42830m0681Q198a3747A88588r0747a39838A70138G1149J7553a98965
17798a49090O0698E2107R0735j4555k8479O8597k0291J70760C3751b01368i1510
17786E5118a04448A23734P829b2347j07057B0129Q1487J34212p4279o2816L4952
17775A33685K69701j23222F9398b16615E654e384B9604J43442G7245b47913c1010
$$ y = [-106369, 158735, -110055, -30920, -131720, 155185, 129702, 121130, 155715, 56539, -94341, 12653, -27650, -245369, -143041, 167911, 56717, 116125, 127313, -255010, 180339, 235038, 43812, -138525, -22567, 191393, 18482, -165000, 211066, 163550, -333434, 113894, 346967, -182716, -55903, -192021, -214431, -76706, -250338, -134372, -344742, -73116, -19822, 147923, 110828, -97821, 55741, -63498, -206328, -247009, -238811, -13747, 188588, 97841, -139838, 170138, 71149, 88702, -198965, -149090, -88392, 52107, 142842, 128287, 99808, 168405, 148114, 318874, 33751, -201368, -91510, 55118, -104448, 123734, 131563, -22347, -129404, 20129, 101616, 235828, 161549, 98733, 133685, 403386, 280164, 69398, -216615, 5654, -5384, 29604, 173046, 77245, -247913, -31010]
17763b57994A97556b13684j54540B00966n8944J19432g8205p4633B41796a99927
17752a819G285a90496B66721a62455A84943a14598j4742A24249a73051g5938o4980
17741a40918A01843J25555c5584l82057a51871j12887a23744r942o6559B16990
17730A57060B7726i7599b2422a0138G9718b6524A62971G7748f97A20176d3665
17718B07961D5692J86635L66295G86J75937i5497F6435K82703e5950k7717B09856
17706a6264r7617A11084b4898o5286A57489F3319a55646C18656A36070c3703D7096
17694D90692i4149E1314k1993a42315A44642k4555A6046g33A22497j3474a50992
17682H9561J24838a1639A70395G8954a83853Q7798A78888a9327A93722F2355h113
$$ y = [-257994, 197556, -213684, -368224, 200966, 142022, 261454, -78205, -152838, 241796, -199927, -1819, 7285, -190496, 266721, -162455, 184943, -114598, -129340, 124249, -173051, -75938, -140918, 101843, 227398, -35584, -417641, -151871, -264758, -123744, -133686, -200245, 216990, 157060, 27726, -97599, -22422, -10138, 79718, -26524, 162971, 77748, -697, 120176, -43665, 207961, 45692, 232327, 598622, 786, 176723, -95497, 66435, 349138, -55950, -83667, 209856, -16264, -113881, 111084, -24898, -90184, 157489, 63319, -155646, 318656, 136070, -33703, 47096, 490692, -94149, 51314, 29321, -142315, 144642, 120087, 16046, -733, 122497, 109023, -150992, 89561, 214399, -11639, 170395, 78954, -183853, -96055, 178888, -19327, 193722, 62355, -8113]
17670a54760f2963A64085A4503M43058a22043j09500C2287a13773H2341A9721
17659A72722n9167O05L4919i6265G5973a85610E9928M9170l408a06095j32617
17648b38712J02263E761J03094c4340C58562A35189g4915j75592A30219c0468
17637A58064F2219P3736d1710C81294g2365B4144O2409B4490L46807j27129k3515
17626B20653K1500j4810m2853f3716A38820b44847C444J70918b33525J00019j09026
17615b42532A38075C9208e9507l7708l5681B00302f9497A54343l9718e7936A18981
17603B42966J91500A22194b469E6036J63860e335A01055j3975J30429N4692b7892
17591C83125m5263q2912b26484A81326n9286n5900L0283k1586R9099k4750l2997
$$ y = [-154760, -62963, 164085, 14503, 457561, -122043, -231543, 32287, -113773, 82341, 19721, 172722, 113555, 114160, 149079, -96265, 75973, -185610, 59928, 109098, 105690, -106095, -238712, -136449, 5761, 108855, -34340, 358562, 135189, -74915, -250507, 130219, -30468, 158064, 62219, 135955, -41710, 381294, -72365, 24144, 86553, 24490, 371297, 244168, 220653, 242153, 227343, 184490, -63716, 138820, -244847, 3444, 174362, -233525, -133506, -242532, 138075, 39208, -59507, -97215, -132896, 200302, -69497, 154343, 114625, -57936, 118981, 242966, 434466, 122194, -2469, 56036, 219896, -5335, 101055, 87080, 217509, 272201, -27892, 383125, 337862, 254950, -226484, 181326, 122040, 66140, 96423, 74837, 173936, 149186, 116189]
17580A16189B067K54970q4343J08326a00394N10A91388A2791L54310j05486K7220
17569B88835R0094j00683j31347N2580a7422q0911A49558K30038j11364p5539
17559A92693F3853L76881j49254J40922a5021A02877B8589Q5839F868L14451A34172
17547A73877J93147Q8889n2682H5294K76863p6468A4475P8194K70054o3952o8011
17536B30760a82009D3919N3273J00040k3484L385P6966m2327K35389j67773M86462
17525G65850K54315J7654p8892k36562j1542J1845A72274J93506j716n7895m4094
17514B62075H5311L1138P35924Q6931j65062M42329l13679l06759K57858B44962
17503C20242o2432J4822A25621K60158r0924J8034K16771A85401j7070j1866G0958
$$ y = [116189, 2067, 257037, 172694, 281020, -100394, -99884, 191388, 12791, 367101, 261615, 288835, 378929, 278246, 146899, 199479, -17422, -98333, 149558, 379596, 268232, 192693, 63853, 440734, 291480, 432402, -15021, 102877, 28589, 114428, 6868, 321319, 134172, 173877, 367024, 455913, 403231, 85294, 362157, 285689, 14475, 92669, 362723, 298771, 230760, -182009, 43919, 97192, 197232, 173748, 177133, 254099, 211772, 447161, 279388, 765850, 1020165, 1037819, 958927, 722365, 710823, 722668, 172274, 365780, 364064, 306169, 262075, 85311, 116449, 852373, 939304, 774242, 1216571, 902892, 596133, 853991, 244962, 320242, 257810, 272632, 125621, 385779, 294855, 312889, 529660, 185401, 168331, 156465, 70958]
17491B49685J66092M972a68193A71837a18295B52375A1844K02744M60785C11425
17480C57481j60293L29673A92684J43129A58591K33146j85569M7344J21414F4863
17469B5381J57920p2917O0342K46934A99458K52783L6866k07095K19246k25875
17459B75383J1663o6211p7320K261L70305l6265k23276N1284p7816j09545K8271
17448A48734K61113J51570G1160L44348J12649j39581J68127j41793J64549l5616
17438E43843k53013L29852j83331q4010J3396j05721I0O03990A10251N94294k84345
17427D20200A5942J18261K68551o1407j28464Q1159B1385K86132f3553B56588
17416C11589A26271K75774N13K21601j24187k25302K77385j59442F6473B981L91969
$$ y = [249685, 415777, 420749, -168193, 171837, -118295, 252375, 11844, 214588, 675373, 311425, 357481, 197188, 526861, 192684, 335813, 158591, 391737, 206168, 253512, 374926, 64863, 25381, 183301, 110384, 170726, 417660, 199458, 452241, 489107, 282012, 501258, 275383, 287046, 220835, 143515, 145776, 516081, 479816, 256540, 307824, 230008, 120463, 148734, 409847, 561417, 71160, 415508, 528157, 388576, 556703, 414910, 579459, 543843, 290830, 620682, 437351, 353341, 366737, 261016, 90, 604080, 110251, 704545, 420200, 15942, 134203, 402754, 341347, 212883, 294042, 21385, 307517, -63553, 256588, 311589, 126271, 402045, 402558, 624159, 499972, 274670, 552055, 392613, 66473, 2981, 394950]
17405C94950n4154E1395J22841h3323C09625n4670J58670I3007m2654K63295m0865
17394B72783H9543P0923a28002G9794K16119M516D0597R1921K56488m7410m3473
17383B98123G4285K10083L9278p8477J83740A43296M61176B71177n6055l9788
17373A75334E0847L06434L1334D5458K52454K2033n0611n9159O7727l3000r3518
17362A51384g9560B26467A06386b2048A0110K9534M06975j22206H7408K14330
17352C01738I7481L47673B12547j1688n2113K50054A31130J16934J992I6556J12165
17341B08721n9228A8199J30520J55024r6619K51401k5705o8618A76139J79753
17331C55892j62967K79038j61861J55097E3310J95480G2629J74740K67016B25743
$$ y = [394950, 340796, 51395, 174236, -83323, 309625, 254955, 413625, 93007, 50353, 313648, 272783, 89543, 160466, -128002, 79794, 295913, 300429, 40597, 132518, 389006, 341596, 298123, 74285, 284368, 323646, 245169, 428909, 143296, 604472, 271177, 215122, 175334, 50847, 357281, 388615, 45458, 297912, 319945, 269334, 210175, 277902, 244902, 151384, -79560, 226467, 106386, -22048, 10110, 39644, 446619, 324413, 87408, 301738, 97481, 445154, 212547, 200859, 148746, 398800, 131130, 248064, 250056, 96556, 208721, 149493, 18199, 148719, 303743, 207124, 458525, 432820, 364202, 176139, 355892, 192925, 471963, 310102, 465199, 53310, 248790, 72629, 247369, 514385, 225743]
17320B82778J21604A55171K45835k5732K00351A29538M61995b3252F0020L18470
17310C78490A58926E8300B4588M19350k00163M4795K596n2768J90088B14110J10745
17299C24855J71551A98665M19058k93295j39578G9740K01379J8623p5284n9440
17289A65018a03625B30990r7671J41764r9881K4671K75169k00383H388L00911
17279C09299L27087B67448J55429B05361D6735K56206K65839j13896A40287K25746
17269C66033p6422J10142C2868M66785k40508M9727j01255r5054L95210q1083
17259D26690J04264A19081K56755A25057L05132j18366l2456P5298Q5180j53986
17249B85859L43441k58696L19991a20575H72395C14410k9821A30860K03782J72118
$$ y = [282778, 404382, 155171, 401006, 375274, 575625, 129538, 591533, -23252, 60020, 378490, 158926, 58300, 24588, 443938, 243775, 288570, 291166, 238398, 428486, 214110, 324855, 496406, 198665, 617723, 324428, 184850, 79740, 281119, 299742, 224458, 165018, -103625, 230990, 133319, 275083, 175202, 199873, 475042, 274659, 8388, 309299, 636386, 267448, 422877, 205361, 46735, 302941, 568780, 454884, 140287, 366033, 289611, 399753, 32868, 499653, 259145, 308872, 207617, 112563, 507773, 426690, 530954, 119081, 375836, 125057, 430189, 311823, 279367, 354665, 439845, 285859, 629300, 370604, 690595, -120575, 872395, 314410, 284589, 130860, 334642, 506760]
17239E06760b4255C23590J78753A71567b2984B52882J49314j02421L17466A77051
17228E14642J44474k89694E6684L32648o917P2421J0760j9163j66189J32139o6784
17217C45599j25703n920L24886j26804Q1988o6623H5564L56038r2468K6102Q0706
17206D55942k18922L02327R7919k94786K07495B68036K10960M4799n2377K15786
17196F87204B48684o2828J28890K7390R9740L0584P4516L9341M8458B03516Q593
17185B12109L65761k31022K30194R1747l30223R8769j31482J56391P9079k1743
17175E19580j19977K45774k96937K51617A71433L23047q5217J27395R2345j70005
17165D58998L703j0399j52637K04823B00683J48704L50819k79680J23395A56642
$$ y = [506760, -24255, 323590, 502343, 171567, -22984, 252882, 402196, 299775, 617241, 177051, 514642, 659116, 369422, 56684, 389332, 382415, 454836, 465596, 446433, 280244, 412383, 345599, 219896, 213976, 538862, 412058, 494046, 427423, 85564, 441602, 349134, 375236, 455942, 237020, 539347, 637266, 342480, 549975, 268036, 478996, 523795, 471418, 687204, 248684, 185856, 314746, 342136, 441876, 472460, 546976, 586317, 634775, 203516, 212109, 577870, 346848, 577042, 668789, 338566, 437335, 305853, 462244, 541323, 519580, 399603, 645377, 348440, 600057, 171433, 494480, 409263, 536658, 629003, 458998, 462701, 452302, 299665, 504488, 200683, 349387, 700206, 420526, 543921, 156642]
17154C40709J20512k8419J23091O7193j08654L32116l71610J12081A57294K37169
17144C94463q0637J61781J29574B35848L35321o376J71481C59513j47932L98412
17134F09993B89760L63135k45172l7630L31614j56334k32013M74119r5600q7638
17124F04241P1021j37173o060J7929j14601M10588r9933q3628l16455J91257K34886
17113G72072k98595M4420M18505j16188B40823k9379L60937L2817k03786K46276
17103F47688l21534N0636J65825j10842K10696M1971K56913l04969k10390L50097
17093G76091l1966k57551J11766J35226k44691K8844j0370P6578K59648j22003
17083G21572J69119k39235k35689J99330j31627J27312m2341j64445N13383k08020
$$ y = [340709, 461221, 432802, 555893, 623086, 514432, 846548, 474938, 587019, 157294, 394463, 313826, 475607, 605181, 235848, 571169, 564793, 736274, 359513, 211581, 609993, 289760, 652895, 407723, 370093, 701707, 545373, 313360, 787479, 691879, 604241, 675262, 538089, 532029, 549958, 435357, 845945, 746012, 662384, 345929, 537186, 772072, 473477, 517897, 936402, 820214, 240823, 211444, 572381, 605198, 401412, 647688, 326154, 376790, 542615, 431773, 642469, 684440, 941353, 636384, 425994, 776091, 744125, 486574, 598340, 733566, 488875, 517719, 507349, 583927, 843575, 721572, 890691, 651456, 415767, 615097, 483470, 610782, 568441, 403996, 917379, 709359]
17073G09359o0120J14514K50007l27803k04939K2579J91462L20674k72148l02409
17063D41176L42773j49295L46965j2170k38629j64005K46675q8788k6266J13385
17053H11821R7193k15518L71368k69222r2833K78139l09473K05168l80395L41440
17043H37688j4749J94496K48266m16822N8011J16905q541J79639j45996l27305
17033G21592K4387J32897l44829J07285M57379j62808k50586L82552j06150L692
17023I65411O1281j13923J09738J15514n53391M69917J16610j62469k20674N50467
17013A338481q2534r8560j74727K92864j00777J26508k57335K52333m00213J96419
17003A092459K57665j28196m3498j64293L68324m69821N27042k17450J83922P165
$$ y = [709359, 649239, 763753, 1013760, 685957, 481018, 503597, 695059, 1015733, 743585, 441176, 783949, 634654, 981619, 969449, 730820, 566815, 813490, 724702, 698436, 811821, 909014, 693496, 1064864, 795642, 702809, 980948, 671475, 876643, 496248, 837688, 822939, 1017435, 1265701, 848879, 906890, 1023795, 1015254, 1194893, 1048897, 721592, 745979, 878876, 534047, 641332, 1098711, 935903, 685317, 1067869, 961719, 965411, 1026692, 912769, 1022507, 1138021, 584630, 1054547, 1171157, 1008688, 788014, 1338481, 1255947, 1157387, 982660, 1275524, 1174747, 1301255, 1043920, 1296253, 896040, 1092459, 1350124, 1221928, 1178430, 1014137, 1382461, 912640, 1439682, 1222232, 1406154, 1413319]
16993A413319n27032K73446r083P8439J56207l3415k29660P9302J24968j92467
16983A134024J59699j8462j76103J80807L68613n88505K61616N2236j67050O72306
16973A879181l40936l32695J18037J13884k1404J29060J44083j01659k50075L63024
16963A700500J13517l14883n5995R2522J42957l8129N9060j99053L02458j25937
16953A677017k07125J56083j78215K04456Q2367l32147L39832k53355J37328M04965
16943B031206l25115K59418p1428q2453L91633r7808r8538l15605N19599k74842
16933A936067m3250K31714J71935j87637m7346J43519k32064P3340K18484j6252
16923B248510r2251q3746K64256J749J21000l40636K72162j37359K05284m4467
$$ y = [1413319, 886287, 1159733, 1150650, 1229089, 1385296, 1351881, 1122221, 1201523, 1326491, 1134024, 1293723, 1275261, 1099158, 1279965, 1648578, 1060073, 1321689, 1373925, 1206875, 1879181, 1538245, 1205550, 1323587, 1437471, 1416067, 1545127, 1689210, 1587551, 1337476, 1700500, 1814017, 1499134, 1443139, 1535661, 1678618, 1640489, 1699549, 1500496, 1802954, 1677017, 1469892, 1625975, 1447760, 1652216, 1734583, 1402436, 1742268, 1488913, 1626241, 2031206, 1706091, 1965509, 1894081, 1811628, 2203261, 2105453, 2006915, 1691310, 2210909, 1936067, 1892817, 2124531, 2296466, 2108829, 2061483, 2205002, 1972938, 2046278, 2264762, 2248510, 2156259, 2072513, 2336769, 2338518, 2459518, 2118882, 2391044, 2253685, 2458969, 2414502]
16913B414502O0852j54328J74173J9482j43895J84326k02894K26004J4642K22571
16903B815435r4189j38200K12999R3375P1201J35437m02150K26371R0671k01181
16893B809769m7415K56068K0496L74829p3579k92472J7411p1916K63348Q8587
16883C345126j0052j4119K5775j7485L84100R7843L6326L3286l29297R8763N548
16872C655814L44066l75914L11728N4279q2610J91140l025J72735O7351J09424
16862D444988N2154j32127N3112L79335k13466K50567q1724K17793q5811j93274
16852D691547M92304l08957q9679L81240L87278r3858o4614k54J90472k8306M99704
16841F056877n0488m7544K34326j46711n6279K20151M61789l18646L29134k34225
$$ y = [2414502, 2475354, 2321026, 2495199, 2514681, 2370786, 2555112, 2352218, 2578222, 2592864, 2815435, 2721246, 2583046, 2796045, 2889420, 2960621, 3096058, 2693908, 2920279, 3010950, 2809769, 2762354, 3018422, 3038918, 3413747, 3340168, 3047696, 3065107, 2993191, 3256539, 3345126, 3335074, 3320955, 3346730, 3329245, 3713345, 3811188, 3847514, 3880800, 3551503, 3650266, 3655814, 3999880, 3623966, 3935694, 3989973, 3907363, 4098503, 4095478, 4268213, 4335564, 4444988, 4497142, 4365015, 4418127, 4797462, 4583996, 4834563, 4752839, 4970632, 4884821, 4691547, 5183851, 4874894, 4785215, 5166455, 5553733, 5459875, 5395261, 5395007, 5585479, 5557173, 6056877, 6006389, 5958845, 6193171, 6046460, 5990181, 6210332, 6672121, 6353475, 6682609, 6448384]
16831F448384M83832o0677N99127k38616J82709K50189M94648j46396N1520j60771
16821G903949L91234K37319o0424L05928L2380p3563L81260K13567K47932M61001
16811A0040583k0990J51701r2985L80951L11134K74008K00252M70942l35570L27001
16801A1707027N76492K76057N11045p8469N47362K77941K20984K40229K31742
16792A4510410M57228N40123K60254K63800O66931J76451K29379P86483L31698
16783A8222757M98943K30667Q62301J78639P63932N88766M93403O30587P70557
16774B3240552M54320P23466J139030L04040R59453N73580R18680J257516L17987
16765B9888624J482656Q94736P43201J069224J488553J156163J042481J228936
$$ y = [6448384, 6932216, 6871539, 7470666, 7232050, 7414759, 7664948, 8159596, 8013200, 8064720, 7903949, 8295183, 8532502, 8472078, 8778006, 8810386, 8736823, 9118083, 9331650, 9579582, 10040583, 10019593, 10171294, 10078309, 10459260, 10770394, 11044402, 11244654, 11715596, 11380026, 11707027, 12283519, 12559576, 13070621, 12992152, 13539514, 13817455, 14038439, 14278668, 14510410, 14967638, 15507761, 15768015, 16031815, 16698746, 16875197, 17104576, 17891059, 18222757, 18721700, 18952367, 19814668, 19993307, 20757239, 21346005, 21839408, 22469995, 23240552, 23694872, 24418338, 25557368, 25861408, 26820861, 27394441, 28313121, 29570637, 29888624, 31371280, 32266016, 33009217, 34078441, 35566994, 36723157, 37765638, 38994574]
16757C8994574J370049J495060J169690J551457J024611J844516J536911J896967
16749E0883835J629946K092703J470148K286812K166184J856884K276814K097544
16741F6760870K067047K237231K177636K829418K030177K089072K650669K177362
16733H5019482K414347K193195K170171J901891K222691J769887J549694J613517
16725A00854875J026205J172022J449217J92781M02096P40486m8857k97682j090274
16716A04400869o26012j064269r69532j625295j574766j825219j785191j934293
16708I2996292k259790k340452k150877k028113k329329k294500k686893k326420
16700G4579918k119741k264861k458459k083070k387845k136672k022094k297067
$$ y = [38994574, 40364623, 41859683, 43029373, 44580830, 45605441, 47449957, 48986868, 50883835, 52513781, 54606484, 56076632, 58363444, 60529628, 62386512, 64663326, 66760870, 68827917, 71065148, 73242784, 76072202, 78102379, 80191451, 82842120, 85019482, 87433829, 89627024, 91797195, 93699086, 95921777, 97691664, 99241358, 100854875, 101881080, 103053102, 104502319, 104695100, 105097196, 105837682, 105788825, 105491143, 104400869, 103774857, 102710588, 101741056, 100115761, 98540995, 96715776, 94930585, 92996292, 90736502, 88396050, 86245173, 84217060, 81887731, 79593231, 76906338, 74579918, 72460177, 70195316, 67736857, 65653787, 63265942, 61129270, 59107176, 56810109]
16692E6810109j589683j982529j848532j646838j791108j444306j625773j762993
16684D3118347j230126j387266j241633j509414j382390j159694r96747j186638
16676C3024439j027977j035140j003072r76320p88515q49738p38873j013390n70662
16667B5020752j040774n93600o91051o27502n19204m95677o18594p58122m24856
16658A9251372l33046r30033n92702n6898k38719o49867m79923k71972n35475
16649A5162737n07927K8344p68640j54501j04717n88702n94062K58964o41213
16640A2090283n0125n25915p6728j38613l29291q3209j90446o00831J38297l32883
16630I900539m8489p38621L74657j41211j34965k54359k05690k88632k77713l61575
$$ y = [56810109, 55220426, 53237897, 51389365, 49742527, 47951419, 46507113, 44881340, 43118347, 41888221, 40500955, 39259322, 37749908, 36367518, 35207824, 34211077, 33024439, 31996462, 30961322, 29958250, 28981930, 28193415, 27343677, 26604804, 25591414, 25020752, 23979978, 23386378, 22695327, 22067825, 21548621, 21052944, 20434350, 19676228, 19251372, 18918326, 17988293, 17395591, 17338693, 17099974, 16450107, 15970184, 15698212, 15162737, 14654810, 14683154, 13914514, 13760013, 13655296, 13066594, 12472532, 12731496, 12090283, 12040158, 11514243, 11437515, 11298902, 10969611, 10886402, 10695956, 10095125, 10233422, 9900539, 9852050, 9113429, 9488086, 9346875, 9211910, 8957551, 8751861, 8463229, 8185516, 7823941]
16620G823941m7290j77455J34439l2355l93851j20853r7498J0787r0060m63388
16610F546417k24684L15633l34323J8756j55905k64815K50243k66674K5553j89898
16600E720303q1644m69814L29318l58414P38O9140L1500M8305j60442n69416K12427
16589D772001k58233J56353k78202J82805k15200Q8391l3333L4387k84452N866
16579D170383k98016Q0904N1450m6515O5734l07059K77942k63155l379m01415
16569C326874K58759j46654M0678J06204j40623m9060j1046N4279J77658n30162
16559C086907j66984r2126K360L63152j63096n15009K35412K78221j83675j39631
16549B705531K9281k22299L70756m39424M5604Q7400j4861k0472q8811J37528
$$ y = [7823941, 7776651, 7599196, 7733635, 7701280, 7307429, 7186576, 7089078, 7099865, 7009805, 6546417, 6321733, 6637366, 6303043, 6321799, 6165894, 5901079, 6151322, 5884648, 5910201, 5720303, 5638659, 5168845, 5498163, 5139749, 5140487, 5209627, 5241127, 5289432, 5128990, 4559574, 4772001, 4513768, 4670121, 4391919, 4574724, 4359524, 4447915, 4414582, 4448969, 4164517, 4170383, 3872367, 3953271, 4004721, 3958206, 4023940, 3716881, 3994823, 3731668, 3728289, 3326874, 3585633, 3438979, 3479657, 3585861, 3445238, 3396178, 3385132, 3439411, 3617069, 3086907, 2919923, 2827797, 2830157, 3193309, 3030213, 2515204, 2750616, 3028837, 2845162, 2705531, 2734812, 2512513, 2883269, 2443845, 2489449, 2576849, 2561988, 2541516, 2452705, 2590233]
16539B590233j13879j35871k64311j5870L73154j47650K0874l8495j57856J40996
16529B251325j63018l73588L56712m6690m1446K65981k41863L1623l16967J78827
16519A900896N5780K4423K4459k17466q6118K68009j25818j40982K14776j24359
16509A793600J75020j50732L9326k00651q5240O6225J94779j62559j31509J71408
16499A709667l43104q0543K82251j95369j13040M86442p2889j47264Q2198k6843
16489A581506k26692j23394N18857k95699k18406L66188j74053P9932n69289L61483
16479A300433Q5152l80965L30194N5636k89043J65238l46794N27786r7811j38961
16469A210865j912j48738M33709l38998Q0619j13307k04327R9245M4129L87155
$$ y = [2590233, 2476354, 2340483, 2076172, 2060302, 2433456, 2285806, 2306680, 2268185, 2110329, 2251325, 2088307, 1714719, 2071431, 2024741, 1983295, 2249276, 2007413, 2039036, 1722069, 1900896, 1956676, 1981099, 2005558, 1788092, 1701974, 1969983, 1844165, 1703183, 1917959, 1793600, 1968620, 1817888, 1857214, 1656563, 1571323, 1637548, 1832327, 1669768, 1538259, 1709667, 1366563, 1286020, 1568271, 1372902, 1259862, 1746304, 1673415, 1526151, 1608349, 1581506, 1354814, 1231420, 1750277, 1454578, 1236172, 1602360, 1428307, 1508239, 938950, 1300433, 1385585, 1004620, 1334814, 1390450, 1101407, 1266645, 919851, 1447637, 1349826, 1210865, 1208953, 1060215, 1493924, 1154926, 1235545, 1122238, 917911, 1017156, 1061285, 1448440]
16459A448440j35992m84154K97482J4057k05571K04493L8446j37712K14696l20940
16449I33245Q7968J44004q6383j7780k34769M96295l32574m1644l71752J71380
16439G47990K75638k69324K9943k3370J11683P9130q3715J87374n7988j20625
16429H76736Q3198k50101Q8895J591K08985q2084p7375n727k16465K37417J81187
16418A046257j09115C05334N55715j94569P1346L4858K5829j5098L39964n1143
16408A072236m38690J19055j64983L18377j10670k87202J02876L12568j33806
16399G89761B80142J04746K86364M1017n2107K36594l37260P4488J64530l19945
16389D78569n8849K98524k16359j06620P2355J09438J9499j7603J099O5290j86153
$$ y = [1448440, 1312448, 828294, 1125776, 1139833, 934262, 1138755, 1177201, 1039489, 1254185, 933245, 1021213, 1165217, 1078834, 1061054, 826285, 1322580, 990006, 948362, 576610, 747990, 1023628, 754304, 784247, 760877, 872560, 951690, 867975, 1055349, 997361, 876736, 959934, 709833, 798728, 800319, 1009304, 927220, 849845, 844118, 627653, 865070, 1046257, 937142, 305334, 861049, 666480, 737826, 772684, 798513, 783415, 1123379, 1072236, 633546, 752601, 587618, 905995, 795325, 508123, 610999, 923567, 789761, 280142, 384888, 671252, 712269, 660162, 896756, 559496, 633984, 798514, 478569, 419720, 718244, 501885, 395265, 467620, 577058, 596557, 578954, 580053, 645343, 459190]
16378D59190K21947p4910K7246l04831K23185j76225K04629N4667K19254P7180
16368I31332l89224K19535r4049k9448k61247J25801M3939B46899M00944k07535
16358D40308J17824k34501L69459j97533J03690o5376J45901k66590N5486P217
16348D75885k2006J84274k65101J02992Q2212B47374J41555J24306o2060A54090
16337D62936O7516j86806j29585L39133j19929L56738l57128J53923j92440J042
16327C95400k9088K44680k29826j0359j14103R2044l7948K42651B76019K32681
16317E08700k43426O631N0349k9512a32023G16110B50055J69861j88193L49417
16307E81140k83943A29445Q3154P0931K20770P8654J14694j9098A61098M04896
$$ y = [459190, 681137, 606227, 633473, 328642, 551827, 375602, 580231, 634898, 854152, 931332, 542108, 761643, 667594, 638146, 376899, 502700, 546639, 246899, 647843, 440308, 558132, 323631, 693090, 495557, 599247, 533871, 679772, 413182, 468668, 475885, 453879, 638153, 373052, 476044, 558256, 247374, 388929, 513235, 451175, 154090, 462936, 530452, 343646, 214061, 553194, 433265, 790003, 432875, 586798, 394358, 395400, 366312, 610992, 381166, 370807, 256704, 348748, 310800, 553451, 276019, 508700, 265274, 271905, 322254, 292742, -132023, 716110, 250055, 419916, 231723, 581140, 297197, 129445, 212599, 283530, 504300, 582954, 697648, 678550, 161098, 565994]
16297E65994k32845j08098M49406B20989O7862I4512K14954L23025j27243J9905
16287E25153j03278j56997p8924C2835J94917M9355J48307P3483k11502P0905
16277C58300A7954K81444l5665r7717J52558G5277M70325j44159j20422R86L03916
16266E85923A34089c841B13852L6596J19946M8306N9006e7503D05823J58771j62483
16255D02111A43709J46544j44388K57221A00456M9754K15034j43994J18721O2500
16245D02471j47913J62016k02846G4832J49350b2102A91098K49739b1699A97750
16234I6163J38114b62085D38573a559B63133j09537K03921J29353k10704N6119
16224C32285G0414L87647A32871a5732B08982J06748l0522g8352K1011D69346
$$ y = [565994, 333149, 225051, 674457, 220989, 288851, 94512, 309466, 632491, 505248, 525153, 421875, 264878, 185954, 32835, 227752, 277107, 425414, 498897, 287395, 358300, 17954, 299398, 263733, 166016, 318574, 75277, 545602, 401443, 281021, 282007, 585923, 134089, -3841, 213852, 250448, 370394, 418700, 477706, -57503, 405823, 564594, 402111, 143709, 290253, 145865, 403086, 100456, 150210, 365244, 221250, 339971, 402471, 254558, 416574, 213728, 74832, 224182, -22102, 191098, 440837, -21699, 197750, 96163, 234277, -262085, 438573, -1559, 263133, 153596, 357517, 486870, 276166, 332285, 70414, 458061, 132871, -15732, 208982, 315730, 285208, -78352, -57341, 469346]
16213E86544B42749J16607o6168j11604Q4686j21690J84263J28127j44966I8488
16202I8092B2627K80323G3875J66688K0650J00298O4467A55452g4274C33831q4206
16191B49625F5149C1625K63881l7615h1103A33891f3177B73083o3867e6320D39919
16179A3358P1468a16763A46462B6957a6996C93106G6217a33599B71677b71804
16168B05891O6507F7026Q5675d3923B91816b1451n3722B23048O1550d4491E9835
16156h5974A25649J8827K9600Q7355a44880B8754a00796A67942c055o2160j76094
16145b41309C5836q661O377a7545B43526J9578o8405K45066A48557B1801g8675
16133B09625r4497A5169N5219a29786C78971b2489A01973i6978B39586H5134A9079
$$ y = [586544, 242749, 359356, 293188, 181584, 266270, 144580, 328843, 456970, 312004, 98488, 98092, 22627, 302950, 73875, 240563, 261213, 361511, 425978, 155452, -74274, 333831, 249625, 65149, 31625, 295506, 257891, -81103, 133891, -63177, 273083, 209216, -56320, 439919, 13358, 84826, -116763, 146462, 26957, -16996, 393106, 76217, -133599, 271677, -271804, 205891, 272398, 67026, 152701, -43923, 291816, -21451, -75173, 223048, 284598, -44491, 59835, -85974, 125649, 144476, 174076, 261431, -144880, 28754, -100796, 167942, -3055, -65215, -241309, 35836, 27175, 33552, -17545, 243526, 263104, 194699, 439765, 148557, 21801, -78675, 209625, 115128, 15169, 70388, -129786, 378971, -22489, 101973, -96978, 239586, 85134, 19079]
16121F3079a67260F4744L6609A655J4155L44233A78279m6803J14209L1373a05762
16109H3337M06361B07558b39965B03446n3191L2318J086a31816A21759C572a3541
16097A12474a35644d6946o7630d3391D09347b72200i8232B2939P8707c00570O2241
16086b38329D72a19662l9787b1623A40395K1401l5168L7223c53621g1177C9261
16074a201j63626e3391k8833A17273B2746M6920b0892j76706A04568K04651c334
16062C51868G6384B7942J06809D4219L24140B0063e1107A45484c5364A0208M03289
16051D13497k04668F643b49895A54228A9058e7915j7521m6039I2488J21026E0720
16039b23272b7904C0726a29415N3088G4889b73278B46076p2848c16019A23656
$$ y = [63079, -167260, 64744, 101353, 1655, 15810, 360043, 178279, 131476, 245685, 277058, -105762, 83337, 489698, 207558, -239965, 203446, 150255, 182573, 183659, -131816, 121759, 3572, -13541, 112474, -135644, -46946, -114576, -43391, 409347, -272200, -98232, 22939, 101646, -300570, -238329, 472, -119662, -159449, -21623, 140395, 161796, 126628, 163851, -353621, -71177, 39261, -1201, -164827, -53391, -82224, 117273, 22746, 69666, -20892, -197598, 104568, 309219, -3334, 351868, 76384, 27942, 134751, 44219, 368359, 20063, -51107, 145484, -35364, 10208, 413497, 208829, 6643, -249895, 154228, 19058, -57915, -75436, -121475, 92488, 213514, 50720, -223272, -27904, 30726, -129415, -76327, 74889, -273278, 246076, 173228, -316019, 123656]
16028a56797L9641l6455c5262D7224J49796A3621K04084b23103A8514K77332r9230
16017A96616a13097B85810I770K9518J30516j4197J20l9419J83200b02405G8462
16005A60461a02597C08010G5495B2192K65660B6299Q7817C7638g7970A50937M5066
15994A96003e4481A39929a06327A88043C3866J7259M23285N43835j71144K24520
15984A071621m3832P2732l62835r9243k15837A16236M1412R2639b70866B37748
15973a02005K1847A92423l6118I427g776q6233F0325R5011F4154a98667C04388
15961b53152A63002O1678R2575a9771j13677J8798J1464I1197a33283C58468a11787
15949B95871b62515i1111B17655c2534j48423O0695B2469J10300b93273B84585
$$ y = [-156797, -117156, -153611, -35262, 47224, 197020, 13621, 217705, -223103, 18514, 295846, 196616, -113097, 285810, 9770, 39288, 169804, 155607, 155727, 116308, 299508, -202405, 78462, 160461, -102597, 308010, 75495, 22192, 287852, 26299, 114116, 37638, -77970, 150937, 196003, -54481, 139929, -106327, 188043, 33866, 51125, 474410, 1018245, 847101, 1071621, 1027789, 1100521, 737686, 638443, 422606, 116236, 157648, 250287, -270866, 237748, -102005, -80158, 192423, 156305, 9427, -7776, -94009, 60325, 155336, 64154, -198667, 304388, -253152, 163002, 224680, 317255, -19771, -133448, -114650, -103186, 91197, -133283, 358468, -111787, 295871, -262515, -91111, 217655, -32534, -180957, -120262, 22469, 132769, -293273, 284585]
15938A77981a31846e2757k27822d7147B8092a39641B10753i7814E4274a46764
15927a27374A42579Q0190E2730N24692D8130i4954C27162a59167q4143A00322
15916I0934d90432a73923E1129e40810J02874E0833P4970o368C8427N4687a22764
15904a34615C5687A4895d77450J43302I1447i425j16412O722n0338j18727a23347
15892a51019j37724F2590c14430A37679c2374j4872A76144c59336B03547B3488
15881c35757I3749a46567j82884a46058l4144L0186b4816E3962g2166A35755C4516
15869a25597A96506b4343H502O3871J09627a15710A95602a79843A37102a0533
15858a93867j27421B23459f9496k58614E9746A2640a13521I8445e0427q027C8088
$$ y = [177981, -131846, -52757, -280579, -47147, 28092, -139641, 210753, -97814, 54274, -146764, -127374, 142579, 222769, 52730, 577422, 48130, -94954, 327162, -159167, -243310, 100322, 90934, -490432, -173923, 51129, -540810, -437936, 50833, 125803, 119435, 38427, 93114, -122764, -134615, 35687, 14895, -477450, -334148, 91447, -9425, -125837, -119115, -169453, -288180, -123347, -151019, -288743, 62590, -314430, 137679, -32374, -47246, 176144, -359336, 203547, 23488, -335757, 93749, -146567, -329451, -146058, -180202, -150016, -24816, 53962, -72166, 135755, 34516, -125597, 196506, -24343, 8502, 72373, 182000, -115710, 195602, -179843, 137102, -10533, -193867, -321288, 223459, -69496, -328110, 59746, 12640, -113521, 98445, -50427, -58454, 38088]
15846A38952B1555c61343E6320c1915j56010D0219a03988B21936C0264a62025
15835B17340A7452N5405r462L57768a30067m2979o5946C35645a29039A94664b35602
15823A63753p0535B359J22701R8712q3386B928J05169b42112B20638c4005l9194
15812g3199A20133b18977A61385d15047g700A772J29984P8740a1140j16245L1894
15801i5491D3236f9110b9141A22725c37887A21670a36402K9534M08M4061C71920
15789b28807a8832K974A5062J39655f0521B07778h7184A71616F3779a86260a901
15777b6012A21924c43592C5017J29564a52355m3220F9008e8413K2310j00262C06032
15765a44332n6781P152H641a52743A67111d41542B11973h2442A61114b55425B26673
$$ y = [138952, 21555, -361343, 56320, -31915, -187925, 40219, -103988, 221936, 30264, -162025, 217340, 17452, 72857, 63395, 421163, -130067, -173046, -238992, 335645, -129039, 194664, -235602, 163753, 93218, 2359, 125060, 223772, 140386, 2928, 108097, -242112, 220638, -34005, -73199, 120133, -218977, 161385, -415047, -7700, 1772, 131756, 210496, -11140, -127385, -95491, 43236, -69110, -29141, 122725, -337887, 121670, -136402, -106868, -106460, -62399, 371920, -228807, -18832, -15858, 15062, 154717, -60521, 207778, -87184, 171616, 63779, -186260, -1901, -26012, 121924, -343592, 35017, 164581, -152355, -195575, 69008, -58413, -36103, -136365, 306032, -144332, -201113, -193961, 8641, -152743, 167111, -441542, 211973, -82442, 161114, -255425, 226673]
15753a26424E8583b56852D98564A95141a1545A98019a52380A74236R073g7107
15742b23437A02836P7320c22117B79729i7025L0474A45870n9054c738m857C7495
15730a81996l21486J31007a26397k05390D8570a92255D4579J16686a11673p226
15720a18899j89598D9938f7108l5046A7312K78065h8125C22896a70135A4753L204
15709A7957L316g7039q1092b1340i361k60298R7651d1834m1421K3127A47826D5211
15696b8126n5826p6308B5127K59173A19621d5330C11247Q5321b59864C5195a90413
15684a74542A28534J33450e936j45823B22121p7748B7379L34581a6295G8673k7547
15673E1126i8250M333o9212F7920a96969F3638J37030f7294G8121J20313b70319
$$ y = [-126424, 58583, -256852, 498564, 195141, -11545, 198019, -152380, 174236, 183309, -77107, -223437, 102836, 180156, -322117, 279729, -97025, -66551, 145870, 86816, -3738, -8595, 37495, -181996, -503482, -372475, -126397, -331787, 48570, -192255, 44579, 161265, -111673, -118899, -308497, 49938, -67108, -102154, 17312, 295377, -88125, 322896, -170135, 14753, 17957, 21273, -77039, -158131, -21340, -9361, -269659, -172008, -41834, -83255, -60128, 147826, 45211, -28126, -83952, -160260, 25127, 284300, 119621, -45330, 311247, 396568, -259864, 35195, -190413, -174542, 128534, 261984, -5936, -151759, 222121, 144373, 27379, 361960, -16295, 78673, 51126, -98250, -93917, -163129, 67920, -196969, 63638, 200668, -67294, 78121, 198434, -270319]
15661D1514a34606b3863F9777b41071f9164q7925d0842j46246h1586C7155a09243
15649C3985a48608K0518e8632G6622c82F6753e0262B6958b18687g7303l0288L8577
15637f9014C2798i9121J2289C69502A48308e7582a3786g25j73098B3261f1428
15625a71148G2258J08768K5175J18956a64974A26874c00031a37003l1940e5764
15614B37334c2050B92771A19985a41845A698J96896F368k946K78775b39512G2768
15602A48315d2534k79752P0107J5620K3330o406B480J26794b5194l78709J47243
15591b56660R8277o2027g2531j69039a9539I4672a85591J7027r1617M3009m2531
15580b59703G9118j7693d2986F6092b1468r3727B77016b0578m4733k09808A76241
$$ y = [41514, -134606, -23863, 69777, -241071, -69164, -157089, -40842, -187088, -81586, 37155, -109243, 33985, -148608, -128090, -58632, 76622, -382, 66753, -50262, 26958, -218687, -77303, -107591, -69014, 32798, -99121, -86832, 369502, 148308, -57582, -13786, -725, -173823, 23261, -61428, -171148, 72258, 181026, 206201, 325157, -164974, 126874, -300031, -137003, -168943, -55764, 237334, -32050, 292771, 119985, -141845, 1698, 198594, 6368, 3422, 282197, -239512, 72768, 148315, -42534, -322286, -252179, -236559, -213229, -219635, 2480, 129274, -25194, -403903, -256660, -158383, -220410, -72531, -241570, -19539, 94672, -185591, -168564, -260181, -217172, -259703, 79118, 61425, -42986, 66092, -21468, -115195, 277016, -20578, -65311, -275119, 176241]
15568A2241a22983I5395a9379B74505n0459a03181B30067a76977D1074A4858b85256
15556A21934d5293j97051i8700A1801a29617o4929j6633B66113D8792O1219a03256
15544A86722a14561B05036h5977D83a27674A10154d27615a61654A724a29453B75219
15532f7281A0800M2907g7307A42772J10886B5366K0986M4174R5385b678B5123
15520a51759F7857M63552B52567j19222a30762j98053A81215J4207a03088A48386
15509A26912J27812J00023j62928J40589r5979d1605A4702J26768h403I6208K7683
15498A23891j4696B8407a86059A56344m2695J70108e9059C43484D0231K44874
15488B85105A01322O3419J45824A17401J63526f6232E1537a6430A64073b8596
$$ y = [12241, -122983, 95395, -19379, 274505, 224046, -103181, 230067, -176977, 41074, 14858, -285256, 121934, -45293, -242344, -98700, 11801, -129617, -194546, -211179, 266113, 48792, 110011, -103256, 186722, -114561, 205036, -85977, 483, -127674, 110154, -427615, -161654, 1724, -129453, 275219, -67281, 10800, 53707, -77307, 142772, 253658, 25366, 46352, 90526, 185911, -2678, 25123, -151759, 67857, 531409, 252567, 133345, -130762, -328815, 181215, 195422, -103088, 148386, 126912, 254724, 354747, 191819, 332408, 236429, -41605, 14702, 141470, -8403, 96208, 123891, 109195, 28407, -186059, 156344, 113649, 283757, -59059, 343484, 40231, 285105, 101322, 164741, 310565, 117401, 280927, -66232, 51537, -16430, 164073, -28596]
15477C47483a5601H8393J04673L94169O80788B01696P1348G4557J31281C146J88893
15466A92039J18200J51032k07851a14134p5732g9092k60757B56961C7225M15617
15456D52842a40C45259e9334k70208J53440D42033a30899B44786K88060A18919
15445g596D33879j29838L66755j77061L17133N60897E56398n547B36859J503n8433
15434A79929a35204B21889a14553n0415A48513a32254C06395A00431b36739K9187
15424b07552H222b04400h0056J7163B00565a21234E9262j1270K08361e2926A05492
15412a11444k0022B11756b21900Q5858N1658H813a36921A03532b59456A92487
15401A71327a63450A34641N4799N3948a78893a8055H851a33919A00665K67844
$$ y = [347483, -15601, 88393, 193066, 587235, 1268023, 201696, 273044, 74557, 205838, 3146, 192039, 310239, 461271, 253420, -114134, -189866, -79092, -339849, 256961, 37225, 452842, -140, 345259, -59334, -329542, -176102, 442033, -130899, 244786, 532846, 118919, -7596, 433879, 304041, 670796, 493735, 810868, 1371765, 556398, 550851, 236859, 238362, 179929, -135204, 221889, -114553, -164968, 148513, -132254, 306395, 100431, -236739, -207552, 8222, -204400, -80056, -62893, 200565, -121234, 59262, 47992, 256353, -52926, 105492, -111444, -131466, 211756, -221900, -136042, -84384, 8813, -136921, 103532, -259456, 192487, 171327, -163450, 134641, 189440, 243388, -178893, -18055, 8851, -133919, 100665, 368509]
15391C68509r2751G2432B6244a77645P2369c6240r4752M2716A92886D5312a48690
15379B90245i4609a6544H8138a15694C67752H007O5526Q7967K96093A50497h9873
15367B7143L0408B1401K54385F2897J51476a74748C26962a7835B4777L22058q5731
15356B61104F9608a69361A32258K37722D8118K22609b54127A08398k7416O6235
15346A47217E0453L65110j59406C2179L60258j01042K24225j75922A11940J55463
15336B67403c9822B25715d38411D9322K93073I7029L10399k2621A402P6090C7991
15324A41398e7695k7017D7308J86696A9519R3504N275m7972B423K37231m1692
15313A97962F5305B5246J58759A634L35801B9842b13830H6322a26063M7397A6651
$$ y = [368509, 275758, 72432, 26244, -177645, -105276, -36240, -130992, -88276, 192886, 45312, -148690, 290245, -94609, -16544, 88138, -115694, 367752, 8007, 73533, 161500, 457593, 150497, -89873, 27143, 57551, 21401, 275786, 62897, 214373, -174748, 326962, -17835, 24777, 346835, 261104, 69608, -169361, 132258, 369980, 48118, 270727, -254127, 108398, 80982, 147217, 50453, 415563, 256157, 32179, 392437, 291395, 515620, 339698, 111940, 267403, -39822, 225715, -438411, 49322, 342395, 97029, 407428, 384807, 1402, 77492, 37991, 141398, -57695, -84712, 47308, 234004, 19519, 113023, 118298, 70326, 2423, 239654, 197962, 65305, 25246, 184005, 1634, 337435, 29842, -213830, 86322, -126063, -78666, 16651]
15301D4477J12945c37189h4896J9951f985B34009I7852J18100q6860f3877j03265
15290a67142b5066l5217J4324A15993n1467f5966g197C5373j4367K4130N3032
15279I8168a31821e1678A10077P9689i7686A46014b81412a22018A36771h0392
15268a69383C86360A35368m1172a33341G6854c6323F6651f7622e39n9877E9715
15256A3436b49936K2882c0257A15212B7515b40717L9776N4334A25392A4294P9990
15245I4284L3293a89615A84963M09171L13489J048298o83872K01731J0668E29099
15234A91809K04949a61708A99784d3589k19090c4133J6822G0684L1954J3288K21471
15223C37397m4227A7425J7553Q4894J2393e6158m7433A13001J27693o4784h1646
$$ y = [44477, 157422, -337189, -84896, -64945, -6985, 234009, 97852, 215952, 129092, -63877, -167142, -25066, -60283, -45959, 115993, 64526, -65966, -7197, 35373, 21006, 45136, 98168, -131821, -51678, 110077, 189766, -97686, 146014, -281412, -122018, 136771, -80392, -169383, 386360, 135368, 94196, -133341, 76854, -36323, 66651, -67622, -539, -60416, 59715, 13436, -249936, -227054, -30257, 115212, 27515, -240717, -200941, -146607, 125392, 14294, 94284, 127577, -189615, 184963, 594134, 907623, 1955921, 1272049, 1473780, 1484448, 529099, 191809, 396758, -161708, 199784, -43589, -262679, -34133, -17311, 70684, 102638, 115926, 337397, 293170, 17425, 34978, 119872, 132265, -56158, -103591, 113001, 240694, 175910, -81646]
15211b66906D7612K33724j2394j27413J17765F8162a74302D38491j05687j24550
15201B08254C6822L1750J6044b62201A49018A6090b04565B54724f8956e371B15931
15189c8316n5516j76361d4254C9780h9135C8655K25491r789j23829c84857H4512
15177B25563A5266L59260L9496p3745b39396L9548q7726a42708F8168J53636A01688
15165c84185D02272b9548A08316b07356f8744D0207J50353a93625e4071o9697
15155a23768A04007b38590C15638D468a93660g3226A5889i7822I326c4056C72814
15143A17371O2722M6838a20589B48423j01256a02085A21504A605f0800j68844
15133b29644A98948b1853n3C6620K04332h3769B08502a69944I5901K19215A27484
$$ y = [-266906, 47612, 281336, 268942, 141529, 259294, 68162, -174302, 438491, 332804, 208254, 36822, 68572, 84616, -262201, 149018, 16090, -204565, 254724, -68956, -5371, 215931, -38316, -93832, -270193, -44254, 39780, -89135, 38655, 264146, 254357, 130528, -384857, 84512, 225563, 15266, 374526, 414022, 340277, -239396, -199848, -287574, -142708, 68168, 221804, 101688, -384185, 402272, -29548, 108316, -207356, -68744, 40207, 190560, -193625, -54071, -123768, 104007, -238590, 315638, 4468, -193660, -73226, 15889, -97822, 9326, -34056, 372814, 117371, 180093, 226931, -120589, 248423, 147167, -102085, 121504, 1605, -60800, -229644, 198948, -21853, -21906, 36620, 240952, -83769, 208502, -169944, 95901, 315116, 127484]
15121a59273C08465k8689K18379P8643B10183K0360A04946J60767j25219J82287
15111C22781K1394r1800d8045D9191f7940j59902A73522a2323l13662A23609J62822
15100B86431D0532R4352J66196a34309F1696K4717J11744b03107H2906O9200R5896
15089B48002A1223b3859A6002a2983I3002J28841O309A08563N6847a35346K6656
15078a08690A38719f8375B87422M8820H1245K44457H1252K9624H159L73753A89442
15066c138D21550I8197m4828a13074A52069HJ60166Q0803r1906J48533a60653
15054B29963L3322K8754j30918b12558B2653N9312K7058a5870B37285H5505J74483
15043B59988J68369A92233Q9182L0786J93588B04798J78948A42124J82442A34394
$$ y = [-159273, 308465, 279776, 498155, 576798, 210183, 230543, 104946, 265713, 140494, 322781, 344175, 252375, -48045, 49191, -67940, -227842, 173522, -12323, -325985, 123609, 286431, 40532, 134884, 301080, -134309, 61696, 86413, 198157, -203107, 82906, 152106, 248002, 11223, -23859, 16002, -12983, 93002, 221843, 228152, 108563, 165410, -135346, -108690, 138719, -68375, 287422, 336242, 81245, 325702, 81252, 110876, 8159, 381912, 189442, -3138, 421550, 98197, 53369, -113074, 152069, 8, 160174, 240977, 149071, 297604, -160653, 229963, 263285, 292039, 161121, -212558, 22653, 81965, 109023, -15870, 237285, 85505, 259988, 428357, 192233, 281415, 312201, 505789, 204798, 383746, 142124, 324566, 134394]
15032D20250N8236K07644l31719R0193K2766K06419l5312C00007L17969j09267
15022E08709J49811B93072Q3040P5597K95119j62764B81045J59149A13371N4976
15012A68347L10849P6271J8263l7845k17749G4097L07820k4187H2970K66069A41620
15000F84085j43901B52896K21874J90263k94204k4533J81849B14381K94075j75866
14990C32590L78782C23273l0199j12920J03333p3534J94504O2018K50976L7103
14980G54554L1313k10659j14588n0714M1901J55441k63375J06837m5841r872K52870
14969F47867l12235L49366C39695j15941Q5847O4570M1406C0517J80171C5245
14958B40079F6193J89834j00414F5684b00471D24955j31649A08883L58497j61991
$$ y = [420250, 478486, 686130, 354411, 444604, 467370, 673789, 638477, 300007, 617976, 508709, 658520, 293072, 376112, 451709, 746828, 584064, 281045, 440194, 113371, 168347, 479196, 555467, 573730, 535885, 318136, 74097, 381917, 357730, 82970, 349039, 141620, 684085, 540184, 252896, 474770, 665033, 370829, 346296, 528145, 214381, 508456, 332590, 711372, 323273, 293074, 180154, 283487, 209953, 404457, 466475, 717451, 754554, 785867, 575208, 460620, 409906, 451807, 607248, 343873, 450710, 404869, 394997, 647867, 335632, 684998, 339695, 223754, 309601, 374171, 415577, 30517, 210688, 35245, 240079, 66193, 256027, 155613, 65684, -200471, 424955, 293306, 108883, 467380, 305389]
14948C05389I2659N47895k49821J96881B91509K17537L3206m4242B00417L22340
14938E22757j70753p2531j23710K88595J58335J10206k33988M35414M4661L15291
14928A274277l79190P02054j67029K45956j6173j50375j24428k73199r9982O74533
14918A686444K41351J97402j20625o01842M7561k90120l6126l63005n8038k28652
14908D74350j91955J225g4619B70925J18077N7497I3003L38928N255p2970F5363
14896A8126L77902p4801j25089M5000K29638j48551M5825J09528j94006L27571
14886F11143q3751L04149k46875R8070J66745j08591J28957j48440J61697m04136
14876D78968A66950K73040j97637K18154q2121R511A14113M02134o9990Q5560
$$ y = [305389, 92659, 640554, 390733, 587614, 291509, 509046, 542252, 498010, 200417, 522757, 352004, 279473, 155763, 444358, 602693, 712899, 478911, 914325, 958986, 1274277, 895087, 1597141, 1430112, 1676068, 1659895, 1509520, 1385092, 1111893, 1011911, 1686444, 1927795, 2125197, 2004572, 1402730, 1450291, 1160171, 1124045, 761040, 703002, 474350, 282395, 283620, -74619, 270925, 389002, 446499, 93003, 431931, 437186, 364216, 65363, 18126, 396028, 321227, 196138, 241138, 470776, 322225, 368050, 477578, 283572, 611143, 527392, 831541, 584666, 682736, 849481, 740890, 869847, 721407, 883104, 478968, 166950, 439990, 242353, 460507, 378386, 387897, 114113, 516247, 446257, 531817]
14866E31817j50923L50222n5328J80045B48039n7643R1208K17316k15811K11012
14856D94121A72732L06400R035j13702L28991N9587l11790Q6548L0606P4435j97083
14845D45759J81930J30176N23247k68451m26742K52245j63264R4962l11508L26164
14835G84518j61610m6501j48228L2963O1312j29722o2796K37525J38404B70105
14824G33314k85695k12627M60850J4085J6639j67460J66326l34890O46960D83650
14813H00052k58101K15599j56597R0928q0459K05352j94046J30246o6275L17156
14803A003855j44139j03838n7147j34452L0106L60702m58101B40479B8380N37188
14793E65568J75816p0833j77054E1348L39117N75712A12707P27502l44340J0710
$$ y = [531817, 380894, 731116, 675788, 855833, 248039, 190396, 281604, 498920, 283109, 494121, 172732, 479132, 488167, 374465, 703456, 763043, 451253, 537801, 568407, 642842, 445759, 627689, 757865, 1281112, 1012661, 585919, 838164, 674900, 769862, 458354, 784518, 622908, 576407, 428179, 461142, 522454, 392732, 329936, 567461, 705865, 270105, 733314, 447619, 234992, 695842, 709927, 726566, 559106, 725432, 390542, 1037502, 483650, 800052, 541951, 757550, 600953, 691881, 611422, 816774, 622728, 752974, 686699, 1003855, 859716, 755878, 698731, 564279, 594385, 955087, 496986, 240479, 28380, 565568, 741384, 670551, 493497, 51348, 390465, 966177, 112707, 840209, 495869, 506579]
14783E06579K99117j70316M8249J69452Q3809p0515k86688J60819O64882n16946
14773H88442k74393K68105j66987J18834C98250j90530N41023k85011R698N399
14763D78829J86859k80141L17316j43714a34886E27374J8069n6689j00081r2929
14753B95744J05395J66030j25226q134K9746l28M9024J25282J14687j91109J95141
14742G56252k17423J46391J13316j10876k45528K51812l8874J84314D11404N83903
14732I95307K1428O8602K29782L77410k04642K46097k32045l59800n4673E41218
14721G80019J14244D22342K72136n3928J45561l5760l3532k5492n723K42908J8588
14710I47100m8750n8025l28357K03463K00002J11615K10060M07064k41959L35433
$$ y = [506579, 805696, 635380, 683629, 853081, 936890, 866375, 579687, 740506, 1405388, 888442, 614049, 882154, 715167, 834001, 398250, 207720, 748743, 463732, 473430, 478829, 665688, 385547, 702863, 559149, -134886, 527374, 545443, 488754, 388673, 295744, 401139, 567169, 441943, 433809, 463555, 463227, 512251, 637533, 752220, 561111, 756252, 538829, 685220, 798536, 687660, 442132, 693944, 655070, 839384, 411404, 995307, 1016735, 1085337, 1315119, 1692529, 1487887, 1733984, 1501939, 1142139, 1087466, 541218, 780019, 894263, 422342, 694478, 640550, 786111, 750351, 716819, 691327, 685604, 928512, 947100, 898350, 840325, 511968, 715431, 915433, 1027048, 1237108, 1644172, 1402213, 1737646]
14700A737646R8350p54423o1964P5239j31200k90740L17042q3265j06659k24033
14690E75993L18187C87859M73475k61081J45322L20676m39522J20646j89627L3872
14680E91620J06720O9377j14298K84952o199q5761k26234m6675J10187O3754K42943
14669I90386N7253k15458o4316K4986j24066N4300M2804L75236k50692p8387m2933
14658G69113K25698j5478j93096K55980P7592J43906k3255j94496j65996K35463
14648A115431o0868l36976o9001N09245j00634K91677m76197L40522m4524k07217
14638I61458K32447k81773K86539j84663P5481J13312k09993m8150J34588l83569
14628F95677L67708l3490j87050M19487k53654k2016J87478o7203p0296q078M9637
$$ y = [1737646, 1835996, 1081573, 1019609, 1094848, 963648, 672908, 989950, 906685, 800026, 575993, 894180, 387859, 861334, 600253, 745575, 1066251, 626729, 747375, 557748, 591620, 698340, 767717, 653419, 938371, 932172, 846411, 620177, 573502, 683689, 747443, 990386, 1047639, 832181, 767865, 792851, 668785, 723085, 765889, 1141125, 890433, 812046, 769113, 994811, 979333, 786237, 1042217, 1119809, 1263715, 1240460, 1045964, 879968, 1115431, 1054563, 717587, 648586, 1157831, 1057197, 1348874, 872677, 1213199, 1168675, 961458, 1193905, 912132, 1198671, 1014008, 1089489, 1202801, 992808, 944658, 1079246, 695677, 1063385, 1029895, 842845, 1262332, 1008678, 986662, 1174140, 1106937, 1036641, 1028563, 1078200]
14617A078200M98870o07154M34997J0034k87576M0709J14815q4287P0812J38195
14607A407615j09132L6783M6790K9854P3818m28847J25774L4809J26289J20916
14597A464669k65861J40420l0012J33775l08556M56945k47584K89918j90885R8162
14587A540991K38853j93624q4958l09110K52950K9631J013K00611j06601r5381
14577A474375M2682j81992M08693L5605O4368n0850o1116j30258K67665q7740
14567A781432L9979N6952J31820R3674k05463r5405Q0064R9689R1005K12970J49691
14556B436408k34151M35004r6503J61627M21124K18827R45703J180505L485014
14547H953558R147345J8825080R586222A9354726F725777B828369n18142l76496
$$ y = [1078200, 1577070, 969916, 1404913, 1414947, 1127371, 1168080, 1282895, 1198608, 1269420, 1407615, 1298483, 1335266, 1382056, 1411910, 1485728, 1056881, 1182655, 1217464, 1343753, 1464669, 1198808, 1339228, 1309216, 1442991, 1134435, 1591380, 1343796, 1633714, 1442829, 1540991, 1779844, 1586220, 1501262, 1192152, 1445102, 1474733, 1475746, 1676357, 1569756, 1474375, 1517057, 1335065, 1743758, 1779363, 1843731, 1792881, 1731765, 1601507, 1869172, 1781432, 1821411, 1878363, 2010183, 2103857, 1898394, 1802989, 1883053, 1982742, 2073747, 2286717, 2436408, 2202257, 2637261, 2540758, 2702385, 3123509, 3342336, 4288039, 5468544, 8953558, 18100903, 36925983, 46512205, 19354726, 6725777, 2828369, 2310227, 1933731]
14539A933731k70353L19022J103975J660352o24810j953081k48936m23726K87014
14530A783188o3439k38457J6959K71709K09389k72749J96239j73748J28345J73297
14520B030733L81886l79455K54107j14810K97184o80100M07157J49407j24895
14511B221214j27486K14223k08350j23538L39114L53205k61302k3601N7345L4857
14501B475681q3366K59320K2697K96207m3913m32348L96748k41090K00865q5957
14491B764844k47227K41226O6831K15271k09584K68388j83955J05951J03766J0565
14481C136076j61322P2048k26698K85894o9453K87399L29841n76685K24817M26378
14471C728295j72812K32557j40354K17023l05844N9171l4516K62865K11197m68491
$$ y = [1933731, 1663378, 1982400, 3086375, 4746727, 4121917, 2168836, 1919900, 1496174, 1783188, 1719749, 1481292, 1498251, 1769960, 1979349, 1706600, 1902839, 1729091, 1857436, 2030733, 2412619, 2033164, 2287271, 2172461, 2469645, 1789545, 2196702, 2346109, 2221214, 2093728, 2307951, 2099601, 1976063, 2315177, 2668382, 2407080, 2383479, 2440824, 2475681, 2392315, 2651635, 2674332, 2970539, 2926626, 2494278, 2891026, 2649936, 2850801, 2764844, 2517617, 2758843, 2825674, 3040945, 2831361, 3099749, 2915794, 3021745, 3125511, 3136076, 2974754, 3046802, 2820104, 3105998, 3036545, 3323944, 3653785, 3077100, 3301917, 3728295, 3555483, 3788040, 3647686, 3864709, 3558865, 3618036, 3583520, 3846385, 4057582, 3589091]
14461C589091K91843l39525N09151J13092j17773K86981j19631J57589k56311
14452D114507J19325K0480M2769N0011O7022L1862N4135N0938R4757J36420J98508
14441D980734p9435K11858J77733k94290L5705j25462K40896J58479J41342J55511
14431E603071k6729j5630J04622j58966J89521N36057j38840P8192N0275L63364
14421F584937L35518K89883k31411r1899j64566K20374K43247J4469M00R0151
14411G291103P482L55768K5114K57111m3216M45261K33371l04103J35246J970
14401H405107J96602J24407J39627j15359K02988M9067K57010L17082l26888M16265
14391I665908j594N89856K78997K55991o4832J36190L30807K61933O36901L52557
$$ y = [3589091, 3880934, 3541409, 4050560, 4163652, 4045879, 4332860, 4213229, 4370818, 4114507, 4233832, 4254312, 4297081, 4347092, 4414114, 4445976, 4500111, 4551049, 4645806, 4782226, 4980734, 4901299, 5113157, 5290890, 4996600, 5032305, 4906843, 5147739, 5306218, 5447560, 5603071, 5576342, 5560712, 5665334, 5506368, 5695889, 6231946, 6093106, 6171298, 6221573, 6584937, 6920455, 7210338, 6978927, 6887028, 6722462, 6942836, 7186083, 7200552, 7200952, 7291103, 7298585, 7654353, 7679467, 7936578, 7893362, 8338623, 8571994, 8267891, 8403137, 8405107, 8601709, 8726116, 8865743, 8750384, 8953372, 9002439, 9259449, 9576531, 9249643, 9665908, 9664314, 10254170, 10533167, 10789158, 10724326, 10860516, 11191323, 11453256, 12090157, 12442714]
14381A2442714P386q4438J35137n3429L71425M1460N31137K72746J16584L58757
14371A4139479M4195Q72696P1547M48994J25644L09765P90328J76797L14301O4417
14361A7358163L75469L25890M59226J64356N97749M01927L73969O37139L57867
14352B1051755O15232R98340J32509K92048P34613O81371K52521P79516J069891
14343B6607796L95586Q66578P93090P04514M54483J429126N41284R91673J206083
14334C3990213R06824J065589J122412J144678J018544J003563J393659J548569
14326D3194051J305292J771020J484401K192455J247259J893821J990673J862257
14318E6941229K311971J913989K262168K541916K750294K511537L113344L180563
$$ y = [12442714, 12450100, 12365662, 12500799, 12447370, 12818795, 12860255, 13391392, 13664138, 13780722, 14139479, 14183674, 15056370, 15127917, 15576911, 15702555, 16012320, 16802648, 16979445, 17293746, 17358163, 17733632, 18059522, 18518748, 18683104, 19280853, 19682780, 20056749, 20693888, 21051755, 21666987, 22665327, 22797836, 23089884, 23824497, 24505868, 24758389, 25537905, 26607796, 27003382, 27869960, 28663050, 29367564, 29822047, 31251173, 31792457, 32784130, 33990213, 34897037, 35962626, 37085038, 38229716, 39248260, 40251823, 41645482, 43194051, 44499343, 46270363, 47754764, 49947219, 51194478, 53088299, 55078972, 56941229, 59253200, 61167189, 63429357, 65971273, 68721567, 71233104, 74346448, 77527011]
14310G7527011K989091L484405L940582L552574M481783M645475M449319N327831
14302A10398071M996548N796864O107478O401206O873688P258116Q026914Q517261
14294A64376146Q937588R261755J0592961J0907497J1455805J2364989J2892804
14287B40789545J3623867J3948598J5396959J5665887J6026109J6288012J6801495
14280C48540472J6681373J6512407J5885129J5464191J3681598J2581264J0388396
14273D49734830P979387L671464j042233l460126j311180p77738l720905o677735
14265D44395764j0646367j2631022j4510507j5593753j6568006j7087209j6902960
14258C40455940j7153143j6256661j6115741j5306469j5073307j3918743j3363698
$$ y = [77527011, 80516102, 84000507, 87941089, 91493663, 95975446, 100620921, 105070240, 110398071, 115394619, 121191483, 127298961, 133700167, 140573855, 147831971, 155858885, 164376146, 173313734, 182575489, 193168450, 204075947, 215531752, 227896741, 240789545, 254413412, 268362010, 283758969, 299424856, 315450965, 331738977, 348540472, 365221845, 381734252, 397619381, 413083572, 426765170, 439346434, 449734830, 457714217, 461385681, 460343448, 456883322, 455572142, 454794404, 451073499, 444395764, 433749397, 421118375, 406607868, 391014115, 374446109, 357358900, 340455940, 323302797, 307046136, 290930395, 275623926, 260550619, 246631876, 233268178]
14251B33268178j2509148j2530895j1479786j0575065q674196q321549q790121
14244A60387418q074573p804976p230926o887273o337507n714474n630851m558648
14236A08148190n122456n296913m081573m098623l629706l067823l640726l249677
14228G5960693l540637k656197k507629k591355k309624k460826k136437k066005
14220E5691983j619699k092817k018640j712970j626547j388479r40058j477164
14212D2815609j635855j347491j009703j175974q25851p42797r99953j358648
14204C3719337q05396j256562m94999j018398k62568j072973j042285q28843n13172
14195B6424141r32471m3115r21162q22745l15471p91119m61581p67240l69925
$$ y = [233268178, 220759030, 208228135, 196748349, 186173284, 177499088, 169177539, 160387418, 152312845, 144507869, 137276943, 130389670, 124052163, 118337689, 112706838, 108148190, 103025734, 97728821, 93647248, 89548625, 85918919, 82851096, 79210370, 75960693, 72420056, 69763859, 67256230, 64664875, 62355251, 59894425, 57757988, 55691983, 54072284, 51979467, 49960827, 48247857, 46621310, 45232831, 44292773, 42815609, 41179754, 39832263, 38822560, 37646586, 36820735, 36077938, 35077985, 33719337, 32913941, 31657379, 31162380, 30143982, 29881414, 28808441, 27766156, 26937313, 26424141, 25491670, 25448555, 24527393, 23704648, 23389177, 22598058, 22136477, 21369237, 20999312]
14186B0999312m58464j85772q22624k73577m35734q22338P9696l84866j91013
14177A7504620n26127l65808o24088j79407l00689l89519k31440n6319m43496
14168A4387727m26528O1903j96463n81529L0780o73682M31537m88680k01663m02746
14158A1940656k86111k30357j4583j76458k39943p005n43531l635k25617j63043
14148A0050373o9605j1806n71612J87132J03402o60265R6198j66889j57582l5704
14138H763642p0041k56609J79539Q996n11641l18853J60928l44440m8588O7463
14128G630396m23925P5500K17893k92304J14586j99244j12044j24366l28947K94304
14118F851849m29632J18897l33005K18337m54860P8207M2713l58278K60963k20073
$$ y = [20999312, 20540848, 20355076, 19532452, 19258875, 18823141, 18000803, 18080499, 17695633, 17504620, 16978493, 16612685, 15988597, 15809190, 15508501, 15118982, 14887542, 14831223, 14387727, 13961199, 14023102, 13826639, 13245110, 13275890, 12602208, 13033745, 12545065, 12343402, 11940656, 11654545, 11424188, 11409605, 11233147, 10993204, 10986199, 10442668, 10439033, 10213416, 10050373, 9980768, 9968962, 9397350, 9584482, 9687884, 9027619, 9123817, 8956928, 8799346, 8763642, 8693601, 8436992, 8616531, 8625527, 8113886, 7795033, 7955961, 7611521, 7562933, 7630396, 7206471, 7281971, 7499864, 7207560, 7322146, 7122902, 7010858, 6886492, 6557545, 6851849, 6422217, 6541114, 6208109, 6426446, 5971586, 6049793, 6092506, 5734228, 5995191, 5775118]
14108E775118q5444r0582k4154k13418j31148P6189Q2573p5955l88028M71924
14098E397075m83989J37765r6076J34724k35309J32838n81636L66781j34720K83036
14088D920489j50425j07477l20224k35402K23860r9891k90611M93080j58192n8432
14078D216775k17276K02064l06943Q4008J06400j16359l63939L22874l23686k1704
14068C582214R4762j93007J88964j59268K16699l06580R0326J05710k118J61125
14058C778827j19211k91474k8178j6899j09763L3784j40250j83263j52246M68162
14048C239489k73812o5867k12358j40998L17937J15168k51468J42762l55910K39404
14038B754347m19323L72443O6870k69169J26859J14653j20535p6251J79210m9154
$$ y = [5775118, 5689674, 5599092, 5574938, 5361520, 5230372, 5306561, 5389134, 5313179, 4925151, 5397075, 4913086, 5050851, 4954775, 5089499, 4854190, 4987028, 4405392, 4772173, 4637453, 4920489, 4770064, 4662587, 4342363, 4106961, 4330821, 4230930, 3940319, 4433399, 4275207, 4216775, 3999499, 4201563, 3894620, 3978628, 4085028, 3968669, 3604730, 3927604, 3603918, 3582214, 3676976, 3483969, 3672933, 3513665, 3730364, 3423784, 3514110, 3619820, 3617702, 3778827, 3659616, 3368142, 3339964, 3323065, 3213302, 3247086, 3106836, 2923573, 2771327, 3239489, 2965677, 2899810, 2687452, 2546454, 2864391, 2979559, 2728091, 2870853, 2514943, 2754347, 2335024, 2707467, 2774337, 2505168, 2632027, 2746680, 2626145, 2549894, 2729104, 2679950]
14028B679950O5464l05798j18029K52522l28849k99569L18747J37450l26201J21206
14018B196893k58171K34463k44529r9822N27268k39949J77418k95129o5760n9002
14008A873680j91441P7819R4170o7495J27450P0732n73114P10891k93537J8887
13998A848042J93030n3392k19072j8708k60519k49555N64325j79883N6994O47614
13988B328876J644737O663347J7842109K0357059k0977868A1978126n139816k037642
13980D800668j198583j13930k00730l45253k69862l12454K41951k45836J43642
13971B499613j4149n7466m96523m5254K11989j03017Q5199j87848p9391l1224
13961A781929K13017k43016l38607M56358j57526L12766k13854M5158j39515j03352
$$ y = [2679950, 2745414, 2439616, 2321587, 2574109, 2245260, 1945691, 2264438, 2401888, 2075687, 2196893, 1938722, 2173185, 1928656, 1828834, 2356102, 2116153, 2293571, 1998442, 1932682, 1873680, 1682239, 1760058, 1854228, 1786733, 1914183, 1984915, 1411801, 2122692, 1829155, 1848042, 2041072, 1987680, 1768608, 1749900, 1489381, 1239826, 1804151, 1624268, 1681262, 2328876, 3973613, 10636960, 28479069, 48836128, 27858260, 11978126, 6838310, 4800668, 3602085, 3488155, 3287425, 2942172, 2672310, 2359856, 2601807, 2355971, 2499613, 2485464, 2427998, 1931475, 1886221, 2098210, 1995193, 2080392, 1892544, 1813153, 1781929, 1994946, 1751930, 1413323, 1869681, 1712155, 2024921, 1811067, 1856225, 1716710, 1613358]
13951A613358J24818m00247M59096L035j83978l9861l70304K91826k16264N90469
13941A871948m65021K032J32024j78223k953k1320L46053l56381j35015M41888
13931A635032n6367l60421L2109M1016j6439P1458L48057l60137o5589P2017l2653
13920A308083K06151n34886N76328j52824L30721l25525l33579J84055o4830K03791
13910A397485m64411L23021r0428Q9603j39077Q1425k44087J33580j65879J04199
13900A025431J78786o9080k52405J07832o2955L3747J37910p5817j97889J74960
13890A000520R1680j23007K87693k40990N7169Q9922j0193P4010j05541o5945
13880A055318q5687P4908m0450l6404L86245l46395K05272m61629M18678j86234
$$ y = [1613358, 1738176, 1337929, 1797025, 1800060, 1616082, 1576221, 1205917, 1497743, 1281479, 1871948, 1406927, 1408959, 1540983, 1362760, 1359807, 1338487, 1684540, 1328159, 1193144, 1635032, 1578665, 1218244, 1250353, 1291369, 1274930, 1346388, 1694445, 1334308, 1268719, 1340736, 1308083, 1514234, 979348, 1555676, 1402852, 1733573, 1408048, 1074469, 1258524, 1193694, 1397485, 933074, 1256095, 1165667, 1255270, 1116193, 1197618, 953531, 1087111, 921232, 1025431, 1204217, 1135137, 882732, 990564, 927609, 961356, 1099266, 1023449, 825560, 1000520, 1092200, 969193, 1256886, 1015896, 1073065, 1162987, 1152794, 1226804, 1121263, 1055318, 969631, 1044539, 1004089, 967685, 1353930, 1007535, 1212807, 751178, 1169856, 983622]
13870I83622K04360J1502j35888k75260R786Q3383q798K82102n67750J99569p2351
13859G14277K24728j67609j6045K53714J00013k65736P5294J72741j08221o7422
13849I15734j87486K20465P065Q6149j44260l64161L58598m6245j86001m0934
13839F18924N3101K54614k6950l5460J49879k14736k32501K65983j75186J42080
13829G99748K4621o3363J50329l86982M48939j12981k3978P3400j53370J61196
13819I17559Q5477j96632j32829j3830j39444m7353M97134l68363k2016N50056
13809A129759l44924J05379n1802j13926K14510k64274j85994K60748L4140l40876
13799D42740L44146o5994l33322K16398L1018J03831C40748M11486J08753l55572
$$ y = [983622, 1187982, 1199484, 1063596, 788336, 798122, 881505, 872707, 1154809, 587059, 786628, 714277, 939005, 771396, 755351, 1009065, 1109078, 843342, 918636, 1091377, 983156, 915734, 728248, 948713, 955778, 1041927, 897667, 533506, 892104, 845859, 659858, 618924, 672025, 926639, 899689, 864229, 1014108, 799372, 566871, 832854, 657668, 799748, 824369, 761006, 911335, 524353, 973292, 860311, 836333, 909733, 756363, 917559, 1003036, 806404, 673575, 659745, 520301, 472948, 970082, 601719, 579703, 1129759, 784835, 890214, 838412, 724486, 938996, 674722, 488728, 749476, 783616, 442740, 786886, 720892, 387570, 603968, 634986, 738817, 340748, 752234, 860987, 505415]
13789E05415k8649p7671M33971n7345r5620P1790l46420P7432J44953p1780K1324
13778E77400r5461N1402L15771k8663L9203j13666j71249K74434j51262O3785
13768G61694j83553O3250K041j18875I3091L86186n9869M22512L0555j60458j5919
13757F96098k21824J6483A70626K70522K29472j80386K88813C61153J07945j63977
13747C05121n0225M43730C39591M2196L19955l15211N6264j02065J17075j48858
13737C08947J70309N1666K94967B29440J97107O1747A95819L15031j31282J29614
13727E09182J72061j00484j47870p1697K54565k03557K5555R6j02508K5973K32674
13716E93990j75136M3459j11596J94492M43593C52787K8620j82197J11475o3824
$$ y = [505415, 476766, 399095, 833066, 775721, 680101, 751891, 405471, 482903, 627856, 556076, 577400, 481939, 533341, 849112, 820449, 859652, 745986, 574737, 849171, 697909, 761694, 578141, 641391, 643432, 524557, 93091, 479277, 419408, 841920, 872475, 712017, 696098, 474274, 490757, 170626, 441148, 670620, 490234, 779047, 361153, 469098, 305121, 254896, 698626, 339591, 381787, 701742, 386531, 442795, 340730, 457805, 308947, 479256, 530922, 825889, 229440, 426547, 488294, 195819, 510850, 379568, 509182, 681243, 580759, 432889, 361192, 615757, 412200, 437755, 437851, 335343, 361316, 593990, 418854, 462313, 350717, 545209, 988802, 352787, 381407, 199210, 310685, 246861]
13706B46861L12349Q3095k41098j7899j54285J65356l5079M62966l92779j08002
13696C21485J09663m4154Q1130j19479N6250r0914K25910J81876j62294A87232
13685A53510J40917K19485k56416J97860R6819k45716K18287L19009C54725J6773
13675C71498J9569L44395C13508L2062J66512j86637c3385C00830M09341C39617
13664D19036J688P5102j22724O0832j89004j02595M04843A70570l1614L78427
13654E17383j93813J04399p859J49741j85603j43271J48199K30219Q0967j75332
13644E25030j28051A58294M38388k70671Q6191J3707m8586L38387l39780q2755
13634B93175o8599G2242b20671C82348m6173n271N0656J52414A20342O1023K69718
$$ y = [246861, 559210, 642305, 401207, 383308, 229023, 394379, 359300, 822266, 429487, 321485, 431148, 386994, 468124, 348645, 404895, 313981, 539891, 721767, 559473, 187232, 153510, 294427, 513912, 257496, 455356, 552175, 306459, 524746, 843755, 354725, 371498, 391067, 735462, 313508, 345570, 512082, 325445, -33385, 300830, 710171, 339617, 419036, 420724, 495826, 373102, 433934, 244930, 142335, 547178, 170570, 138956, 517383, 323570, 427969, 420110, 569851, 384248, 240977, 389176, 619395, 700362, 525030, 396979, 158294, 596682, 326011, 412202, 425909, 377323, 715710, 375930, 293175, 224576, 72242, -220671, 382348, 336175, 330904, 381560, 533974, 120342, 181365, 451083]
13623D51083A53262J44491l7910j2819O0797j07212P9750H3742J42705K15238
13613D41685j82903k0700K02931j79583P7189Q1419r3149r2188K66070A99671
13602B52758K08392k00141P8255A00871M1647J45712l6608K04956A38036L33860
13592D71896B09035J28329j66616L56395A03654e2920D20715J5877A94845K57433
13582D52278p2487L7691k02273J34751A52313J28188K81503j54491r6811A07674
13571a47268D15197A45875b01545A85577M78327d0399E41800d5826C00245o5160
13561B35085J54197A32283K03026J43456R1446A29650J46004J62874C7620M29398
13551D67018h9774A64791Q6265a2796D67277j36709j65113r784L23248b15969
$$ y = [451083, 153262, 297753, 259843, 247024, 307821, 200609, 280359, 83742, 226447, 441685, 258782, 238082, 441013, 261430, 338619, 420038, 326889, 234701, 500771, 199671, 252758, 461150, 261009, 339264, 100871, 142518, 288230, 251622, 456578, 138036, 471896, 209035, 337364, 170748, 527143, 103654, -52920, 420715, 436592, 194845, 452278, 379791, 417482, 215209, 349960, 152313, 280501, 562004, 407513, 310702, 107674, -147268, 415197, 145875, -201545, 185577, 663904, -40399, 541800, -45826, 300245, 235085, 389282, 132283, 335309, 478765, 570211, 129650, 275654, 438528, 37620, 467018, -89774, 164791, 251056, -12796, 467277, 330568, 165455, 155671, 478919, -215969]
13540D77732k16413L0678H3621L05841j38854A8266K42265L11477B62174r551
13530B52623k4389F5143B9341b5166D3631L21360K4386A76927o1560J7513F5207
13518F6630J586N56390A66381K25987A64280j822p6890K47767p0171E3613K04239
13507B57852o051J77503m5202P8265j15343m8660p8299o6555K11913j00411J12559
13496C77571j64088J45244b2750m096A70364O3162P617J57619A03854b11128C1341
13484I5827J62651J37871J91208A68923J64319j49908J45015F2941K64349A18924
13473b18208B66175A17466J2243j7034K36236L352A39715C1741M61952k15427
13463B78266c3540C09745A16509D0229j006d5727d082A5482M08266C0338M5698
$$ y = [477732, 261319, 291997, 83621, 389462, 250608, 18266, 260531, 572008, 262174, 252623, 228234, 65143, 29341, -25166, 43631, 364991, 389377, 176927, 115367, 132880, 65207, 66630, 68216, 624606, 166381, 392368, 164280, 162458, 85568, 333335, 263164, 53613, 257852, 251801, 429304, 384102, 462367, 347024, 298364, 220065, 153510, 365423, 265012, 377571, 213483, 358727, -22750, -26846, 170364, 233526, 241143, 398762, 103854, -211128, 31341, 95827, 258478, 396349, 587557, 168923, 333242, 183334, 328349, 62941, 327290, 118924, -218208, 266175, 117466, 129709, 112675, 348911, 352263, 139715, 31741, 493693, 278266, -33540, 309745, 116509, 40229, 39223, -45727, -4082, 15482, 423748, 30338, 76036]
13452G6036P4967J05684A01354h7497M3156D3665b6108D18005A25655L49h4350
13440B72289A34665L1316g7146F5593J81160J34275j65430J26291k1531b6836
13429A38027l2787J20311K38874j85882L4555A29186J29292J71044a5254B33525
13418D54662A92897J6695q6636a03162A4072J54056b069B10788H4510m84b78438
13406d9595H1964K13183o1954K51260b4772l7585C73106A43355a2065B24876b2140
13394B7925a18524b2760j90438H6695J74404c10067B49395f3990D38176j49734
13384B88442A31888J52840j6222G7591J65434g7146C25539A21861K43793l3144
13374C32510m4601I8539O2435a60377K2168B40554P164Q1415R0567A30342j4350
$$ y = [76036, 151003, 256687, 101354, -87497, -44341, 43665, -26108, 418005, 125655, 126004, -84350, 272289, 134665, 165981, -77146, 65593, 246753, 381028, 215598, 341889, 320358, -26836, 138027, 105240, 225551, 464425, 278543, 313098, 129186, 258478, 429522, -15254, 233525, 454662, 192897, 209592, 122956, -103162, 14072, 168128, -2069, 210788, 84510, 84026, -278438, -49595, 81964, 295147, 233193, 484453, -24772, -62357, 373106, 143355, -12065, 224876, -22140, 27925, -118524, -22760, -213198, 86695, 261099, -310067, 249395, -63990, 438176, 288442, 131888, 284728, 268506, 77591, 243025, -77146, 325539, 121861, 365654, 332510, 287909, 98539, 160974, -160377, -138209, 240554, 247718, 329133, 419700, 130342, 115992]
13363A15992J96465A21474K80389J96911B69614b6519A21492L3952J80854I7283
13352I2919i396B37164b06619B14035e0401A42789J98557A35851B3491K16292
13342B39783K04193A58309R9871J5142K1925l4137H9201L41505j85753p3838c1588
13330B22747O4097B629K89954b189A91495l2207P0149F053K94699F0296K91435
13319C51731j01670n4465n0914L6060R2867L10059j37185A78335K20069m4458
13309C53946K0324A58064f7698A35997K38358j50798m8049Q7862Q8534j30817
13299B21087q4374D0684Q0572p586A1255K11764J05483a18052b612B42118L9730
13288B81848E6586J3787R8889Q8610n5966N5862A21683a3896B88348a99742F1004
$$ y = [115992, 312457, 121474, 401863, 598774, 269614, -26519, 121492, 155444, 336298, 97283, 92919, -9396, 237164, -206619, 214035, -50401, 142789, 341346, 135851, 23491, 239783, 443976, 158309, 258180, 273322, 295247, 261110, 89201, 430706, 244953, 171115, -31588, 222747, 286844, 2629, 292583, -2189, 191495, 159288, 229437, 6053, 300752, 60296, 351731, 250061, 195596, 144682, 180742, 273609, 583668, 446483, 178335, 398404, 353946, 374270, 158064, -67698, 135997, 374355, 223557, 175508, 263370, 351904, 221087, 136713, 40684, 121256, 113670, 11255, 223019, 328502, -118052, -2612, 242118, 281848, 56586, 70373, 169262, 257872, 201906, 257768, 121683, -13896, 288348, -199742, 61004]
13276a1755j27343f5213F5290J31118C1912K70204I081J13496O1558i0046G561
13264e3729a6949B35970n6536M38h3946p7948B81103n9918I3175b51040B93513
13252C26363e3781G6793Q9600J87824I6220A6490g2853D66751B00290a08955B61606
13240C50238A71915a98292h1489F4089J97561i7726C63445A23914J69703a40785
13229F4220a16597D2107e453C01766G936G22N7884a15505B31910G3399C472K18865
13217B22337B1177R7740E2174e7070g91I6057a84033A64780a6406B17620b30103
13205a01159A25505f9639j44888B81548a58091A80383O3754j07711B2653a11637
13194a4084D28173C0450K69177g2342B53400d5506D5532R3998O1979J70829g1172
$$ y = [-11755, -139098, -65213, 65290, 196408, 31912, 302116, 9081, 122577, 184135, -90046, 7561, -53729, -16949, 235970, 179434, 179872, -83946, -161894, 281103, 221185, 93175, -251040, 293513, 326363, -53781, 76793, 166393, 354217, 96220, 16490, -72853, 466751, 200290, -108955, 261606, 350238, 171915, -198292, -81489, 64089, 261650, -97726, 363445, 123914, 293617, -140785, 64220, -116597, 42107, -5453, 301766, 7936, 722, 58606, -115505, 231910, 73399, 3472, 222337, 21177, 118917, 52174, -57070, -791, 96057, -184033, 164780, -16406, 217620, -230103, -101159, 125505, -69639, -214527, 281548, -158091, 180383, 244137, 136426, 22653, -111637, -14084, 428173, 30450, 299627, -72342, 253400, -45506, 45532, 139530, 201509, 372338, -71172]
13182A27762k7876L7634c8650A09506d6157A16898m1552l6864j4496J97596I6914
13170I878i8788B35457a3432p731A89573n1367a11345r9625B4069L4308J43173
13159B01550o9525B7539f5187j71675h9725D36974I8140K30854D3823A930R2093
13148I4023h7686H5741i2529d4823K080q038I5470R5970a4020B94674j41709d5160
13135e2057j9655F8737a578q4083D845P8697J95213L8640j08655c6961n7385j26307
13123b20653A58414E6331R5255N166m2149K7105B2386K44640n5395a39488A68167
13111E5033a55085j00300D306J34907M4233o6640M1159K50758k02006d73154F9283
13099A73044n4198K2877f6377A78597K01265a62446G32092A62064f7604G7203
$$ y = [127762, 99886, 137520, -38650, 109506, -46157, 116898, 75346, 38482, 23986, 221582, 96914, 9878, -98788, 235457, -13432, -21163, 189573, 138206, -111345, -210970, 24069, 58377, 201550, 132025, 27539, -65187, -236862, -89725, 436974, 98140, 328994, 43823, 1930, 94023, -87686, 85741, -92529, -44823, -42743, -50781, 95470, 191440, -14020, 294674, 152965, -45160, -52057, -71712, 68737, -1578, -85661, 4845, 83542, 278755, 317395, 208740, -36961, -94346, -220653, 158414, 56331, 151586, 156752, 114603, 141708, 22386, 267026, 211631, -139488, 168167, 55033, -155085, -255385, 4306, 139213, 183446, 116806, 157965, 408723, 206717, -473154, 69283, 173044, 118846, 141723, -66377, 178597, 379862, -162446, 732092, 162064, -67604, 77203]
13088A27590P1630J93798a341A66965a94816A98406J99476j80415K0074E7180
13077d5246q9773b5098j9179m9836j18260D9723a3787k67847C6066h3665j55425
13066b39090h3417A11624a51370O0404J4791A68691a09475B76902A786K38584
13056B40370e453A93842i3904B28852J21364C8252L48009A2774d4781n7136C97792
13044e5420J109p1926j7126N2611d2369a2991F6959d5549B58829b7869k2841H1715
13031E09220A61624a87538B21297P785J83575p7093j40100b43904A74143a27809
13020F9756A6729B156a96754K5220B59125J0005j12495J04002j11502e6304K2278
13009c4026B1811e0531B72448A22166n3074b0343B55385J5589C4890J23725o6624
$$ y = [127590, 199220, 393018, -1341, 166965, -194816, 198406, 397882, 217467, 237541, 57180, -45246, -135019, -25098, -44277, -94113, -212373, 49723, -13787, -281634, 36066, -83665, -239090, -83417, 111624, -151370, -90966, -76175, 168691, -109475, 276902, 1786, 240370, -5453, 193842, -93904, 228852, 350216, 38252, 386261, 12774, -44781, -101917, 397792, -55420, -54311, -126237, -143363, -90752, -42369, -12991, 66959, -45549, 258829, -27869, -50710, 81715, 509220, 161624, -187538, 221297, 229082, 412657, 335564, 195464, -243904, 174143, -127809, 69756, 16729, 2156, -196754, -171534, 259125, 269130, 156635, 260637, 149135, -56304, -34026, 21811, -50531, 272448, 122166, 69092, -20343, 255385, 270974, 34890, 158615, 91991]
12998I1991a70020B83305J18879A52783L2864D2036a563o7126k18963c0442j19027
12987a49469b9830H9185a03816A63677a27460k41079B604a29182a1098I4585b8155
12975h1419H1439K73564a66492D7541J62371d14836A63200k1250b73514h6386
12964B44869j06092a80822A64165R8355g2571L667E9081b36304B48732h2179r4971
12953a77150I6942K81835A77871A4567b0828r2760b7145b278p3946A15843A0510
12941B50089e7727l038o1574k06694R2139A62635a67031d7798l1711G1345J14090
12930A85435i0120I0946a1585A03587m6446P657a27801E0846L16751g6691J8669
12919e8022C06028a31748N0234l1250k17439B0377J71670M2086c1580j39009C14583
$$ y = [91991, -170020, 283305, 402184, 152783, 185647, 42036, -1563, -68689, -287652, -30442, -149469, -29830, 89185, -103816, 163677, -127460, -368539, 2604, -129182, -11098, 94585, -28155, -81419, 81439, 355003, -166492, 47541, 209912, -414836, 163200, 141950, -273514, -86386, 244869, 138777, -180822, 164165, 262520, -72571, -68904, 59081, -236304, 248732, -82179, -177150, 96942, 378777, 177871, 14567, -20828, -113588, -27145, -2278, -76224, 115843, 10510, 250089, -57727, -60765, -122339, -329033, -236894, 162635, -167031, -47798, -79509, 71345, 185435, -90120, 90946, -11585, 103587, 57141, 64798, -127801, 50846, 367597, -76691, -58022, 306028, -131748, -81514, -112764, -330203, 20377, 192047, 234133, -31580, -170589, 314583]
12907A26411H296h902j21491f3088p1425b8482C4208R5926E7829b08560C67076
12895i9696a5906o2450k9239m8272H9878i4199B1235J790J35826N3363d1628B95556
12882I7356a82034r0954H8120g5949b9402A89243c23093A4418J70357a82963D31232
12870B3660r59J4926J03174E6632b80637G343J92384b86465d4842B01232j2959
12859A88273d57419J98005G7615c7694q4626e043k77110C8174j0863J9159d8564
12847d842A18597a29583A01549e1231A60196b51269D52503i4315j93314A94094
12836I1558a68271d5446p1386D8812d4559j36064j73551D3526J36695e0860C4721
12824B33315E0982k2962b16228A53650d793l10679P5690C33J28136a93007O2860
$$ y = [126411, 8296, -8902, -130393, -63088, -134513, -28482, 34208, 130134, 57829, -208560, 367076, -99696, -15906, -78356, -107595, -155867, 89878, -94199, 21235, 23025, 158851, 212214, -41628, 295556, 97356, -182034, -272988, 88120, -75949, -29402, 189243, -323093, 14418, 184775, -182963, 431232, 23660, 22701, 37627, 140801, 56632, -280637, 7343, 199727, -286465, -44842, 201232, 188273, -457419, -259414, 77615, -37694, -122320, -5043, -282153, 38174, 27311, 46470, -48564, -4842, 118597, -129583, 101549, -51231, 160196, -251269, 452503, -94315, -287629, 194094, 91558, -168271, -45446, -116832, 48812, -44559, -180623, -354174, 43526, 180221, -50860, 34721, 233315, 50982, 28020, -216228, 153650, -4793, -315472, -239782, 333, 128469, -193007, -130147]
12813a30147b5580b695k7658k42850J09657A12242b60551A42557k6696b86329
12802A29093g7273j10486e3506B28710b25512B9561M0178a05762J5672p3580C33134
12790h9979K4535n7291N8318k13857J27521l6141g8769L7258C2346b03947B73869
12778B48666d9121A08624E3121a12061l613c3352j80980B76196A3576J69319c8526
12766i5421A96628a80410f6317p5699f7478B4938i6874b8829k13686L5875A98667
12754d8569j39385A6862a30219A87993J30155C2630A2257a07809K8512K54B59669
12742a62425g205p4163I1455c14235A47445J69821A12102J33233C6381J5012K3980
12731G5373b62804i5017n8996B6448a97172D5523J27993J05228b75951j13998
$$ y = [-130147, -25580, -2695, -30353, -273203, -163546, 112242, -260551, 142557, 115861, -286329, 129093, -77273, -187759, -53506, 228710, -225512, 29561, 69739, -105762, -90090, -163670, 333134, -89979, -65444, -122735, -64417, -278274, -150753, -186894, -78769, -41511, 32346, -203947, 273869, 248666, -49121, 108624, 53121, -112061, -115674, -33352, -214332, 276196, 13576, 182895, -38526, -95421, 196628, -180410, -66317, -142016, -67478, 24938, -96874, -28829, -242515, -206640, 198667, -48569, -187954, 16862, -130219, 187993, 318148, 32630, 12257, -107809, -79297, -79043, 259669, -162425, -7205, -81368, 91455, -314235, 147445, 317266, 112102, 245335, 36381, 51393, 75373, -262804, -95017, -154013, 26448, -197172, 45523, 173516, 278744, -275951, -389949]
12721c89949b156j7263C40309D9748b42730F7469a63825b6314B93259a34054A17755
12709a86867B16061R443J13854L28754A95917j9517k8074i1003B22517A06979
12698a51775D5555c69943B3154L5707R2502A883a66551K7255J6856B09574c2256
12686a68021N6010F7996a05684B26480K07613k07431P8275r3929G5123K40390
12676C15513A19728I139J52111c283A87145p0778f3782k2322j1172k78128A93738
12664A74928K49665a86810B64298e9432k492B75990a42236A61412j8083J97139
12654C40468A67017D2834Q6176J806o0782K8298g1963A94216R7926a00043C992
12642a73020f1361C0538N3015b87063g6916B3404f7091A14580E0475j2448M22149
$$ y = [-389949, -2156, -19419, 340309, 49748, -242730, 67469, -163825, -26314, 293259, -134054, 117755, -186867, 216061, 225504, 339358, 668112, 195917, 176400, 148326, -91003, 222517, 106979, -151775, 45555, -369943, 23154, 58861, 151363, 1883, -166551, -139296, -122440, 209574, -32256, -168021, -112011, 67996, -105684, 226480, 434093, 226662, 304937, 211008, 75123, 315513, 119728, 9139, 161250, -3283, 187145, 116367, -63782, -86104, -97276, -375404, 193738, 174928, 424593, -186810, 264298, -59432, -61924, 275990, -142236, 161412, 143329, 340468, 167017, 42834, 129010, 130816, 70034, 98332, -71963, 194216, 292142, -100043, 3992, -173020, -61361, 30538, 83553, -287063, -76916, 23404, -67091, 114580, 50475, 38027, 460176]
12631D60176K4090k36585G2663L07323j35950b7715p4056b7886C4425J52539B5336
12619B80650I9886q28J30808e1044B46764d2608j75196O9756A83878b9063l67046
12608c96109A27104k7414d2210n5607A97915a60145D5637J32317B8047J42028
12598A70075J26718q9670E3767b62551c6240C9207K7581b62185D5038a40331A26826
12586C0043J21716L9016a8058l35426R9076a03711D04284i1236A11539b7874H0366
12574I0593b21163C45384A69484a98016N4357M2435j37303Q142k2768D08262B725
12562a03842F5609a08762H5758B7861A0314b63487J20403k2984H7293D873a39225
12550A61441c9635n5909p6940g332c514k27437P3004A89748C7958d58717B05142
$$ y = [460176, 484266, 247681, 72663, 379986, 244036, -27715, -101771, -27886, 34425, 186964, 25336, 280650, 99886, 99058, 229866, -51044, 246764, -42608, -217804, -148048, 183878, -29063, -396109, 127104, 99690, -42210, -97817, 197915, -160145, 45637, 177954, 28047, 170075, 296793, 207123, 53767, -262551, -36240, 39207, 66788, -262185, 45038, -140331, 126826, 30043, 151759, 190775, -18058, -353484, -254408, -103711, 404284, -91236, 111539, -27874, 80366, 90593, -221163, 345384, 169484, -198016, -143659, -101224, -238527, -230385, -253153, 408262, 2725, -103842, 65609, -108762, 85758, 27861, 10314, -263487, -143084, -166068, 87293, 4873, -139225, 161441, -39635, -95544, -172484, -7332, -3514, -230951, -157947, 189748, 37958, -458717, 205142]
12538A41136F0231b01557d0247j1209C17569a15175j9596j09297f2441a5791C5017
12526A28349D5952p240a84278M5641n5928D3720b018q7114L7350q183j05073P8165
12514h6873A02120a57077A43371c8918A16433c425o7613j99972F7037N7847a04269
12502G3841a42084C35754q4781I9244g9703C8500K87945j57772b10060C0996a61196
12490a94617A42856b45699C111P3531a09584p6579k1869f4528K2487A28090L5875
12479A63965b32764d3439B15407b45399J15198M1276D0847L1967J02775p6678
12469I8911b31689A25134a62684B28495a11633A90419K68114e6348j53456D3633
12458a97014Q8758m8530e3312B50216a27979B93014a07848G2344b25060a157r5448
$$ y = [141136, 60231, -201557, -40247, -51456, 317569, -115175, -134771, -244068, -62441, -15791, 35017, 128349, 45952, 38712, -184278, -138637, -194565, 43720, -2018, -89132, -51782, -59965, -165038, -86873, 102120, -157077, 143371, -38918, 116433, -3425, -71038, -271010, 67037, 124884, -104269, 73841, -142084, 335754, 250973, 99244, -79703, 38500, 326445, 168673, -210060, 30996, -161196, -194617, 142856, -245699, 3111, 76642, -109584, -186163, -208032, -64528, -42041, 128090, 163965, -232764, -43439, 215407, -245399, -130201, -88925, 40847, 72814, 175589, 98911, -231689, 125134, -162684, 228495, -111633, 190419, 458533, -56348, -209804, 43633, -197014, -108256, -156786, -53312, 250216, -127979, 293014, -107848, 72344, -225060, -1157, -96605]
12447i6605A40030N6h1228A45510J25841a60326C1107j4819K61230j14835a12442
12435E3894O2547l4941K91824b21872R7915G7711h8727j35568c8921n2907D4510
12423c013D3777a85910E9199b68663e8267F5733d0394A26086c18706B53243f7359
12411f7616I8116K38290b88039J3357j094f1813n3422A07174h977A33676G622
12399c3787k63772B70217j01037E270J94780I4221b53416d6285j89200A82687
12388C83490j41915p019Q3329c0341j02194C907f4408n6272C14347i4422C9583
12376E1493J11787L6683J0209j03404b1416B42601C9044a54433J6010D3910L8168
12365H2078k0716e18339j4949D2588b14299B79735a10436L5463C6190c2207j63732
$$ y = [-96605, 140030, 140086, -81228, 145510, 271351, -160326, 31107, 16288, 277518, 162683, -112442, 53894, 116441, 81500, 373324, -221872, -123957, 77711, -88727, -224295, -38921, -91828, 44510, -3013, 43777, -185910, 59199, -268663, -58267, 65733, -40394, 126086, -318706, 253243, -67359, -67616, 98116, 336406, -288039, -274682, -275776, -61813, -115235, 107174, -8977, 133676, 7622, -33787, -297559, 270217, 169180, 5270, 200050, 94221, -253416, -46285, -235485, 182687, 383490, 241575, 234556, 317885, -30341, -132535, 3907, -64408, -120680, 314347, -94422, 39583, 51493, 163280, 199963, 210172, 106768, -21416, 242601, 39044, -154433, -138423, 43910, 82078, 61362, -518339, -533288, 42588, -214299, 279735, -110436, -74973, 36190, -32207, -195939]
12354a95939C37431G242i9658D0886R2209B4213P6404j5034C9012O4236a76138
12342B8445f0051C40613a95043K4855B847J86562H7819c4376B96133O7474j46033
12331B17574a40482G4145J64988L2667r0759n083A808a4565D35114I4284P4017
12320A68301K60361A4571L08518H4457K97624A71477m8832K42159m8464o7741
12310B48599E4083Q2190K7076J36271o3035M695n5987K0484L9436k1105E8472
12298A65412l2490j9618a09712E2872K9533h3757A68473B8722K62604b682j30505
12287a33187b8935B00882B1309A0631P3492L4132J52152i9778C25568D6450f7810
12275A22936f2865B13068J21628I7419P7632K7190J2249l3794o7200k0204O5380
$$ y = [-195939, 337431, 7242, -99658, 40886, 133095, 24213, 100617, 85583, 39012, 103248, -176138, 28445, -60051, 340613, -195043, -170188, 2847, 189409, 87819, -34376, 296133, 363607, 217574, -140482, 74145, 239133, 271800, 181041, 175958, 1808, -14565, 435114, 94284, 168301, 428662, 14571, 323089, 84457, 382081, 171477, 122645, 364804, 316340, 248599, 54083, 136273, 163349, 299620, 236585, 241280, 185293, 205777, 245213, 224108, 58472, 165412, 132922, 113304, -109712, 52872, 82405, -83757, 168473, 28722, 291326, -2682, -133187, -28935, 200882, 21309, 10631, 84123, 118255, 270407, -99778, 325568, 46450, -67810, 122936, -62865, 213068, 334696, 97419, 175051, 202241, 214490, 180696, 113496, 93292, 158672]
12264A58672J93933E4002a4823C0714N13860H4321J04037o3028M5949n7209J17994
12253B32064n4617h7315A37772a44757G2290K10603A37233o7329J50217a35735
12242A04632L19295j97878a1673C24608j39885M2504C3421r460K20253a57252
12231a05105E5978K64586o8226B847K62945l1772a40685F734N41405k17219M484
12220C35404J7222A4989M39437q1086D3359J01483J77162F6396k7662L8107K08474
12209B85315c53557C76077j50779j05214l2495J94340p4429f0907B58703q4127
12199A74576J7356h3188A75055m2437K0199k7249R6868K9454e106A25049J28832
12188B53881d2707E75651A15069K0283l5751L50802B16608d4967r4292A60514
$$ y = [158672, 352605, 54002, -14823, 30714, 544574, 84321, 188358, 125330, 171279, 114070, 232064, 177447, -87315, 137772, -144757, 72290, 282893, 137233, 69904, 220121, -135735, 104632, 423927, 226049, -11673, 324608, 184723, 227227, 33421, 23961, 244214, -157252, -105105, 55978, 320564, 252338, 2847, 265792, 234020, -140685, 6734, 548139, 330920, 335404, 352626, 14989, 454426, 373340, 43359, 144842, 322004, 66396, 38734, 76841, 285315, -353557, 376077, 225298, 120084, 87589, 281929, 207500, -60907, 258703, 174576, 191932, -83188, 175055, 132618, 152817, 125568, 222436, 251890, -5106, 125049, 253881, -42707, 575651, 115069, 135352, 99601, 450403, 216608, -44967, -139259, 160514]
12177h2873A31293N0345B4701K9752L22041D7196L46382q6041A10714m9741L54259
12166D15232A43463J18274L33283j89907A53641a83988A67490G9349L35045A66855
12155a11965A25126J02335b30857d3281A17134f2585JA76409K27046H987h1027
12143H8918a28004A90737i0589A14490K3703E690f4930C3308J84384n0459j457
12132A65776L8392E4775i6236I2057g3059B40828h0994C54013B7611O9757L84837
12121D82205A57365D6065i8747A96793L10015H6795J03123M4728K49335B19553
12110E1279L69954a52170B3856O8526J22541C1721a06307H7857a0937j03677k39797
12099c54411B47165m6093I1708a29395A71428A1434O0393g3710j90040g5787D09064
$$ y = [-82873, 131293, 181638, 24701, 54453, 376494, 47196, 393578, 307537, 110714, 60973, 415232, 143463, 261737, 595020, 405113, 153641, -183988, 167490, 79349, 414394, 166855, -111965, 125126, 227461, -230857, -43281, 117134, -62585, -62584, 176409, 403455, 8987, -81027, 88918, -128004, 190737, -90589, 114490, 138193, 5690, -64930, 33308, 217692, 167233, 165776, 204168, 54775, -96236, 92057, -73059, 240828, -80994, 354013, 27611, 97368, 482205, 157365, 46065, -98747, 196793, 506808, 86795, 189918, 234646, 483981, 219553, 51279, 421233, -152170, 23856, 92382, 214923, 31721, -106307, 87857, -10937, -114614, -354411, 247165, 201072, 91708, -129395, 171428, 11434, 71827, -73710, -263750, -75787, 409064]
12087C46961A5637J73732p7663J63225G5909J3188j3155R6292M6163a48895A56458
12075g9016B2635K12846j08153j1756P3343n89k7729J39730j23639J45059a53822
12063G4141M46707A02405c4319B12178B3176R7079J97701b02966A08753a59504
12052b29720f1659j21064B55040j10883h2842F7964c05370j35640a45920A64947
12041A12308g1999j77407G0377d2641k6945j1368b6606A22018b0159p2151A42050
12029d6366A84346R2721H3720R4483e9035A20659J76759f8977D13156i3172C36774
12017B23898A10662C4495O1755a7748B40493b0136D49255F2220a47112E73744
12006a37091d1674A66944e1530A36660D4716N4781D2383a2898B8045K4732K08476
$$ y = [346961, 15637, 189369, 111706, 274931, 75909, 89097, 75942, 172234, 218397, -148895, 156458, -79016, 22635, 235481, 127328, 115572, 188915, 188326, 160597, 300327, 176688, 321747, -153822, 74141, 520848, 102405, -34319, 212178, 23176, 120255, 317956, -202966, 108753, -159504, -229720, -61659, -182723, 255040, 144157, -82842, 67964, -305370, -441010, -145920, 164947, 112308, -71999, -249406, 70377, -42641, -69586, -80954, -26606, 122018, -20159, -92310, 142050, -46366, 184346, 277067, 83720, 178203, -59035, 120659, 297418, -68977, 413156, -93172, 336774, 223898, 110662, 34495, 96250, -17748, 240493, -20136, 449255, 62220, -147112, 573744, -137091, -41674, 166944, -51530, 136660, 44716, 99497, 42383, -12898, 28045, 52777, 261253]
11995B61253D8499J0440a67141C2106R459h7687B57669b1304j06108J3697n0012
11984a63727N7864j59099J7329A75527H5209b41213R2393A50973a16794f306B83391
11972E0483e9552j17160J9702k23834A02617b009A17240b6680j77193g9500A96249
11960A88525a53350k01068g2957b6674J2000l12543G2886K1116M2686a54494b1800
11948E339c76731c1171j06848C9167b6028k8147A06446c63286A99452a13803I807
11936D84675o5398b34931j25704H375N8397a85527L9285C0866K17459g88k29168
11925b29956l3358L3978h5939C25428a40915n2228c8632a724j02523k4532k55734
11914c84513A68011b5109j20033C9199N2990c3157j15028q574r3293l9374D20350
$$ y = [261253, 48499, 58939, -167141, 32106, 41565, -87687, 257669, -21304, -127412, -113715, -163727, -105863, -264962, -247633, 175527, 85209, -241213, -148820, 150973, -116794, -6306, 283391, 50483, -59552, -176712, -157010, -380844, 102617, -2009, 117240, -26680, -203873, -79500, 196249, 188525, -153350, -354418, -72957, -26674, -14674, -327217, 72886, 94002, 136688, -154494, -21800, 5339, -376731, -31171, -138019, 39167, -26028, -54175, 106446, -363286, 199452, -113803, 9807, 484675, 419277, -234931, -360635, 8375, 66772, -185527, -146242, 30866, 248325, -788, -229956, -263314, -229336, -85939, 325428, -140915, -193143, -38632, -1724, -104247, -128779, -384513, 168011, -25109, -145142, 39199, 92189, -33157, -148185, -156759, -250052, -289426, 420350]
11902H8299I90J50472n0836b23358B52824c0897I3030k731k3755b55330d4501
11890b03537D5501b33879M744B03321M2917c7683B76326e2143H9152i0860j8106
11879a08966n996c8272j22258c0227A44543b74549P377g5147n4883i926B12697
11867a06479n8550O4732F4065a18760N2902r7094D08272A95213n2452J34828F4097
11855d6971k16911J5340G6926b59492J27486B6507e4311A1759a97944c6162l78836
11844d14998C2544i0247k07969A8503b93849A72322b23696H2622A0761c21584
11833g6264f855H2331D0834c80473C2224J48205d8735B805b41101A79132b67014
11821c8285j22286A83631e0937j31053h2640m1758A85476i5310r6308B40691a74478
$$ y = [88299, 990, 151462, 100626, -223358, 252824, -30897, 93030, 90299, 66544, -255330, -44501, -203537, 45501, -233879, -229135, 203321, 246238, -37683, 276326, -52143, 89152, -90860, -108966, -114962, -38272, -160530, -30227, 144543, -274549, -267172, -75147, -130030, -9926, 212697, -106479, -165029, -100297, 64065, -118760, -65858, -162952, 408272, 195213, 142761, 277589, 64097, -46971, -263882, -248542, 76926, -259492, -132006, 26507, -54311, 11759, -197944, -36162, -414998, 32544, -90247, -298216, 18503, -293849, 172322, -223696, 82622, 10761, -321584, -76264, -6855, 82331, 40834, -380473, 32224, 180429, -48735, 2805, -241101, 179132, -267014, -38285, -160571, 183631, -50937, -181990, -82640, -124398, 185476, -95310, -191618, 240691, -174478]
11809i8291o5175A02259c5397I786a22813A80673C9922J78142q6835a26352o4605
11798a90957A02840i1701M312A47002f1814B46384a48075C01834b69913D6025
11787c18435A54035K048I864J23583l6053a76455j38228I054g2485B86944p8557
11776B08387J1122j08247i8386m4642d6178j85161A2536g0768j33455h615E9919
11764f5569k56070a47122q115H4426J70447c9398j6709j20101E977b95877E9965
11752a47189l3204n828A33675C9552c802H2328Q494j469c8194D05147A8165K66782
11740B84947M4658a58860A71660b80964G284b24673P8082D05707g6634G5126a57043
11728f4684j64742E2943c1004d800k9954B00847c7100K783B58073f16j13909B70204
$$ y = [-98291, -163466, 102259, -35397, 9786, -122813, 180673, 39922, 218064, 131229, -126352, -190957, 102840, -91701, -87389, 147002, -61814, 246384, -148075, 301834, -269913, 46025, -318435, 154035, 156083, 9864, 133447, 97394, -176455, -314683, 9054, -72485, 286944, 208387, 219509, 111262, -98386, -143028, -46178, -231339, 12536, -70768, -204223, -8615, 59919, -65569, -321639, -147122, -155237, 84426, 254873, -39398, -56107, -176208, 5977, -295877, 59965, -147189, -180393, -186221, 133675, 39552, -3802, 82328, 90822, 89353, -38194, 405147, 18165, 284947, 329605, -158860, 171660, -280964, 7284, -224673, -146591, 405707, -76634, 75126, -157043, -64684, -229426, 52943, -31004, -4800, -34754, 200847, -37100, -34317, 258073, -616, -114525, 270204]
11715a80362i204k34315A0396b42800B05752J87711A30481a1075j60461p6604
11705b48140F0294J54036G3909a03697C0864b2675E388a18850c3199A8976a85855
11693B23130G8508J12014q7631c2034A32825P9541l6192m5490J17268e2409B15290
11681A14203D1541a08392B43145K80290D8993L2450b74338b1790k09754B16292
11670G3821J8809a8670A47313o064e6521H3067h9005K8868A72553c35270i8529
11658a34522e7805a6931k09248O0573a1148D8622J57302a64764A10484o256g8067
11646C6577g3489D39223B06296a65261A63951H1830L1820a59354j77813g9307
11635b85985F6024R625e1859a1431j68066h1016K2038k21015B45802a25811l12661
$$ y = [-180362, -9204, -243519, 10396, -242800, 205752, 393463, 130481, -11075, -171536, -248140, 60294, 214330, 73909, -103697, 30864, -22675, 5388, -118850, -33199, 18976, -185855, 223130, 78508, 190522, 102891, -32034, 132825, 212366, 176174, 130684, 247952, -52409, 215290, 114203, 41541, -108392, 243145, 523435, 48993, 81443, -274338, -21790, -231544, 216292, 73821, 92630, -18670, 147313, 141249, -56521, 83067, -89005, -60137, 172553, -335270, -98529, -134522, -57805, -16931, -226179, -165606, -11148, 48622, 205924, -164764, 110484, 104228, -78067, 36577, -73489, 439223, 206296, -165261, 163951, 81830, 113650, -159354, -337167, -79307, -285985, 66024, 75649, -51859, -11431, -179497, -81016, -58978, -279993, 245802, -125811, -438472]
11624d38472a80682N4150p034j95873A91554q8481J8552a69703B39714c46391
11613I6894a83171A21249a43236N7399B64357k329f6970j4110m0607B00400D0359
11601b43412l6467a17157e5439A73498G2314a54843N6010C9943K41019A13606
11590I6084J18027R5426a37353O6282k63266h0920r4557J5708H0432Q0873J11196
11579B72501J24501j55340j02229P0823n7631a13129l59375f3047l3484K9806
11569f6725A15548E5402b36727i285B25977C5858L7430j4480J51508H136K59073
11558B67209n649G441K79405n9303J0383Q851H7360a88624h366B07678a0575B11117
11545B75780P4302H4031A7621b64436H818J24199D5893j6460p788R6828K26004
$$ y = [-438472, -180682, -126532, -133566, -329439, 191554, 103073, 121625, -169703, 239714, -346391, 96894, -183171, 121249, -143236, -85837, 264357, 262028, -66970, -81080, -121687, 200400, 40359, -243412, -279879, -117157, -55439, 173498, 72314, -154843, -98833, 39943, 280962, 113606, 96084, 214111, 309537, -137353, -71071, -334337, -80920, -175477, -159769, 80432, 161305, 272501, 397002, 241662, 139433, 210256, 152625, -113129, -472504, -63047, -96531, -66725, 115548, 55402, -236727, -9285, 225977, 35858, 73288, 58808, 210316, 8136, 267209, 261560, 7441, 286846, 227543, 237926, 246777, 87360, -188624, -8366, 207678, -10575, 211117, 275780, 350082, 84031, 17621, -264436, 8818, 133017, 45893, 29433, 21645, 118473, 344477]
11534C44477E8276d0757E9223L9361J63004A09925B9130Q0866a62249C21098j46556
11523A74542J0404m9351A486J69199J28144H1295J97107j04473R2575O7180A19854
11511A30161J9984J25137d621B16995R8828j01936D416K22254a29784H1311Q2754
11500A64065B6262O3725k2633b3422C03702M8395j59711J2938N8811G8783R5418
11489A74201c7645A28310k0997D7620P687a02514A04163K48228l8852a06447A67878
11477h7548b5331A53994J68070H0893j964L38039A8704K33798o2128e2936B25430
11465c5367B42546B2210i1980g53B60381A02926b23249c9156j26585b4332A46739
11453C2384f9184b9570H6262L4081f5672j06448F9570a46358A1063J36257E0710
$$ y = [344477, 58276, -40757, 59223, 98584, 261588, 109925, 29130, 109996, -162249, 321098, 174542, 184946, 135595, 1486, 170685, 298829, 81295, 278402, 173929, 266504, 333684, 119854, 130161, 150145, 275282, -4621, 216995, 315823, 213887, 4416, 226670, -129784, 81311, 164065, 26262, 89987, 67354, -23422, 303702, 352097, 192386, 205324, 264135, 78783, 174201, -37645, 128310, 107313, 47620, 55307, -102514, 104163, 352391, 313539, -106447, 167878, -87548, -25331, 153994, 322064, 80893, 78929, 416968, 18704, 252502, 190374, -52936, 225430, -35367, 242546, 22210, -91980, -753, 260381, 102926, -223249, -39156, -165741, -24332, 146739, 32384, -69184, -29570, 86262, 120343, -65672, -172120, 69570, -146358, 11063, 147320, 50710]
11441D3120g6711k04085E7533R0105L40211B20513p9947a76631J2068E9313b39466
11429B81394l5376b32089A20820l3443a7121k41826B19831b69658f0243H4494
11418A18655J22385B5735f3733j19860O000b5875j83134P9216B38458a62458N5049
11407a07409B21136B4737a41311q2730A30382b17006E8527g6910A00368L71726
11397D72094j65105i6625p068A00550j7940J70353p1868a64734j10532e0342C63264
11385a43314j45544B4189R1362a60593F1338b82027a07745C04982A21185a37768
11374H5950b43743r344A7238b7765D0922J60579p7038l823j7160K8701b85904
11362g1381j99808H2956h4027k05609A03661b23089A4358c58684i4705j65042
$$ y = [43120, -76711, -280796, 57533, 147638, 487849, 220513, 140566, -176631, -164563, 59313, -239466, 281394, 246018, -232089, 120820, 87377, -17121, -258947, 219831, -269658, -60243, 84494, 118655, 241040, 25735, -63733, -183593, -177593, -25875, -209009, -129793, 238458, -162458, -107409, 221136, 24737, -141311, -224041, 130382, -217006, 58527, -76910, 100368, 472094, 306989, -96625, -103693, 100550, 82610, 252963, 181095, -164734, -275266, -50342, 363264, -143314, -288858, 24189, 115551, -160593, 61338, -282027, -107745, 304982, 121185, -137768, 85950, -243743, -253087, 17238, -27765, 40922, 201501, 124463, 120640, 103480, 132181, -285904, -71381, -271189, 82956, -84027, -289636, 103661, -223089, 14358, -358684, -94705, -259747]
11352b59747C9691f5713A78658a27747j12495A97249a32730j13215A78384C4506
11341H4824C6657R3396e0233C9644i3161n889A76607b55248J8849D302c51886
11329a12187j3580k91357a83627g1031k1207a1499D59706d1332A3990e6591j2159
11318f8750q3890B27927B6100g7962c0679p5216M1268a330A21784J0668a97262
11306a790j15483j0967F0870e3012B89011b05387H0506a02230B2612J67980c5284
11294d4894j19081a6115p7780L8167B00874d07628f4063B46543b293j93153m8417
11283b43863A62748m1266E614P9816d8652j18891E8026c56205J77497g0450L854
11272f6596I7159f7663A86170m1591k0020B3715J7727f8113j97377j98653h3684
$$ y = [-259747, 39691, -65713, 178658, -127747, -240242, 197249, -132730, -245945, 178384, 34506, 84824, 36657, 130053, -50233, 39644, -93161, -99050, 176607, -255248, -236399, 4302, -351886, -112187, -125767, -417124, -183627, -71031, -92238, -11499, 459706, -41332, 13990, -56591, -68750, -152640, 227927, 26100, -77962, -30679, -105895, -64627, -1330, 121784, 132452, -197262, -1790, -117273, -128240, 60870, -53012, 289011, -205387, 80506, -102230, 22612, 190592, -35284, -44894, -163975, -16115, -93895, -55728, 200874, -407628, -64063, 246543, -2293, -195446, -243863, 162748, 121482, 5614, 85430, -48652, -167543, 58026, -356205, -178708, -70450, -66596, 97159, -67663, 186170, 144579, 124559, 23715, 41442, -68113, -265490, -464143, -83684]
11260b19805K0545f9108A65216N2284a06104j2029j8403r7585m72c1538C86828
11248c03503a00208a5734C79777B4179J5583Q2945a90545J3928F2879J30519E5962
11236a6033j79255e817C04709O7773E1636b16560e1026B47741G092c00787A74249
11224a59468G2190J12164a09467D0772O0324b56359E1469b23391A16986i2767
11213B6785h7121j54900H173M664a32790f2416a7220I7758j9544b09557O5354
11202a44203c1991p6849n1350k72843J90189j24574j19606a19150c6970m5950
11192h2920j59326J10713k2773I1654B1569b11573O1497E1741i633l8661A25018
11180f680D1116J19394b62204j00429G4346b1189p7851A69656A8446g3134B9595
$$ y = [-219805, -199260, -69108, 165216, 217500, -106104, -118133, -136536, -234121, -234593, -31538, 386828, -303503, -100208, -15734, 379777, 24179, 39762, 122707, -190545, -176617, 62879, 193398, 55962, -16033, -195288, -5817, 304709, 372482, 51636, -216560, -51026, 247741, 7092, -300787, 174249, -159468, 72190, 184354, -109467, 40772, 101096, -256359, 51469, -223391, 116986, -92767, 26785, -87121, -242021, 8173, 12837, -132790, -62416, -17220, 97758, 78214, -209557, -144203, -31991, -108840, -160190, -433033, -242844, -367418, -487024, -119150, -36970, -82920, -242246, -131533, -154306, 91654, 21569, -211573, -150076, 51741, -9633, -48294, 125018, -6680, 41116, 160510, -262204, -362633, 74346, -21189, -99040, 169656, 18446, -73134, 29595]
11168a59081A59703a52133p1813n3672J11149I5816L5228i1260I6860b06825i2585
11156c77354D6668J14918E0038c24045a38835K6518A00250C7416L86104a8343
11145B78966e2998G1106k3079L86563E971i3251A27941f896j71165b0505j84358
11134b04863i6872G36c24619E5300P360P3855F6915J99876H5243a25394B72547
11122C65203a36518k18114A69989h2521A53351C9542h4323B32798b11324j02387
11112c13711A07719j8276h4134A82892a35526K3204c4547D6971J42671F0697d7685
11100A30472K056J12067a67466A37778L7282K2311J60814a50153C5172K68616
11090C03788A34725k1583K72293e1087C43126m196A25416J03008J56537j56513
$$ y = [-159081, 159703, -152133, -223946, -277618, -166469, 95816, 131044, -91260, 96860, -206825, -92585, -377354, 46668, 161586, 50038, -324045, -138835, -112317, 100250, 37416, 423520, -18343, 278966, -52998, 71106, 48027, 434590, 5971, -93251, 127941, -6896, -178061, -20505, -204863, -96872, 736, -324619, 55300, 62660, 136515, 66915, 266791, 85243, -125394, 272547, 365203, -136518, -354632, 169989, -82521, 153351, 39542, -84323, 232798, -211324, -313711, 107719, 89443, -84134, 182892, -135526, -112322, -34547, 46971, 189642, 60697, -47685, 130472, 132528, 244595, -167466, 137778, 175060, 197371, 358185, -150153, 35172, 303788, 134725, 113142, 385435, -51087, 343126, 338930, 125416, 228424, 384961, 228448]
11080B28448N9395Q0025j4844l7458K070D1615L69206B3980L53011j7141j32341
11069B27509G9503K09299l0192N1424J57210J53701E2149K51400J44859J09499
11059E57907j61422K3567J98771Q263q5261L0841m7067J54717J0549R3275Q5476
11048H69616J2338k61382k1200K69630l70323M40304k72956J57634k30962M51177
11038A043876l58052K67141J7029l46999k24599L20645J45556j72707J55155K20849
11028A067894D32191L68622K8071C34848M64396m0667J11847R5801k55315J42767
11018H53677j79341m4650J06371n5569j13560M7343M52272n25842J25427o9725
11008E96403o5552J74190j88560L94763k85742l998L7832j94056j31M7669m6588
$$ y = [228448, 287843, 367868, 353024, 315566, 317636, 41615, 410821, 23980, 376991, 359850, 227509, 79503, 288802, 258610, 310034, 467244, 620945, 52149, 303549, 448408, 557907, 396485, 420052, 618823, 627086, 541825, 572666, 525599, 680316, 690865, 784140, 869616, 881954, 620572, 599372, 869002, 498679, 938983, 666027, 823661, 592699, 1043876, 685824, 952965, 969994, 622995, 398396, 719041, 864597, 691890, 847045, 1067894, 432191, 800813, 828884, 334848, 799244, 758577, 870424, 966225, 710910, 853677, 674336, 629686, 736057, 680488, 566928, 614271, 1066543, 540701, 666128, 596403, 530851, 705041, 516481, 911244, 625502, 621504, 659336, 465280, 465149, 512818, 466230]
10997D66230L20864k49265K90421k54285K11191J5129j61069L82310l36146L66870
10987A052250l72165J87156j26158J01842m1263J61570r7387J10340k82680N41022
10977A234527m88832M64249o0956M47459L26907q1366K407L97430K04296j31819
10967B314302O44474K42360j81470k3332j9828l57931k41043m94507K02554n29311
10957A556268p7815J0932k89840P2113J86423J63058O0792r5560m6166l86028
10947A154177J06750p8834l36691l61357j10917K588J10701C2828K68151A27394
10936A9255J31186C3191L01878A32698j8911b1515m1041B00284m711J13606a66070
10924C12503c5371l7904k05539a17565j8599j00004e2582B92740j35409a58447
$$ y = [466230, 787094, 537829, 828250, 573965, 785156, 800285, 639216, 1021526, 685380, 1052250, 680085, 867241, 741083, 842925, 801662, 963232, 865845, 976185, 693505, 1234527, 745695, 1209944, 1148988, 1596447, 1923354, 1841988, 1844395, 2241825, 2446121, 2314302, 2958776, 3201136, 3019666, 2996334, 2976506, 2618575, 2377532, 1883025, 2085579, 1556268, 1478453, 1489385, 1199545, 1271658, 1458081, 1621139, 1681931, 1586371, 1540205, 1154177, 1260927, 1182093, 845402, 484045, 373128, 375716, 486417, 32828, 300979, 127394, 19255, 150441, 33191, 335069, 132698, 113787, -21515, -62556, 200284, 195573, 309179, -166070, 312503, -35371, -73275, -278814, -117565, -136164, -236168, -52582, 292740, 157331, -158447]
10913h463A78473b17892A13823f8347A66310B9793b63645K941f8931G985a52299
10901G5674a70053C1738a47200C16619A04274c8485C5293c26138i0789b1819n7254
10890g9073B44721I5740L6457a81168P6770B528f9104J9858k5500B7778a50588
10878i0897m8311b4242k75851h7879j07198e9667I747c9443I4595k0818b20856
10866C3481a7774m6922D9788h9626l09813a77106E8037a34798L2831p8407G1724
10854b68150J4354B69493j27883d08170A36272b4387q6153L1541j42792F0294
10843a19501b5320q9177B14750O0041C3312f0697A45361h3597A57843b59669a13646
10831h7195j11629E1244i847j22386M3375L1450m08864H7718k9854K30781a73826
$$ y = [-8463, 178473, -217892, 113823, -68347, 166310, 29793, -263645, -260704, -68931, 7985, -152299, 75674, -170053, 31738, -147200, 316619, 104274, -38485, 35293, -326138, -90789, -21819, -79073, 244721, 95740, 132197, -181168, -104398, 2528, -69104, -49246, -74746, 27778, -150588, -90897, -139208, -24242, -300093, -87879, -195077, -59667, 9747, -39443, 94595, 73777, -220856, 33481, -17774, -64696, 49788, -89626, -399439, -177106, 58037, -134798, -101967, -180374, 71724, -268150, -253796, 269493, 141610, -408170, 136272, -24387, -110540, -78999, -221791, 60294, -119501, -25320, -114497, 214750, 274791, 33312, -60697, 145361, -83597, 157843, -259669, -113646, -87195, -198824, 51244, -9847, -132233, -88858, -57408, -466272, 87718, 57864, 288645, -173826]
10819g2020K5597n7711P505k0401F692c84368d1601F5040d748B83230D9154a23262
10806A25588a33054c9061C8343H978a08028J1231A676J40600K07103a89558A24682
10794a38518G1259c0008j04312o7819L0069I7248a63128f8277G0042J22023M7502
10783B39567f5069a4512j6035k10994A62700j2496c5473B08865b59392a00213
10772D8414b02705A00271l8315A8509K29707j23087a77973G9397a812k41585M84
10761b42913A57911i5950j1018c5668B07480a70424g035n6087j87824A77469H0765
10749a10054b4740k48848a11838o8839j28988A2768h2370a5882n03257B50218
10738A4617J85834e5101k33005B07298a38517E8469J3258b68296k10798i1103
$$ y = [-72020, -46423, -104134, -96629, -117030, 6692, -384368, -41601, 65040, -4748, 283230, 49154, -123262, 125588, -133054, -39061, 38343, 8978, -108028, -96797, 1676, 142276, 349379, -189558, 124682, -138518, 71259, -30008, -134320, -202139, -172070, 97248, -163128, -68277, 70042, 192065, 239567, -65069, -14512, -30547, -241541, 162700, 150204, -35473, 208865, -259392, -100213, 48414, -202705, 100271, 61956, 18509, 248216, 125129, -177973, 79397, -1812, -243397, -242913, 157911, -95950, -106968, -35668, 207480, -170424, -7035, -63122, -250946, 177469, 80765, -110054, -24740, -273588, -111838, -180677, -309665, 12768, -82370, -15882, -519139, 250218, 14617, 200451, -55101, -288106, 207298, -138517, 58469, 71727, -268296, -479094, -91103]
10727f2458C7438o619a17011L0114E3245c04365h45k33652j12710l5398a1813
10715c10705K7847C0116K8561a696l4172j7020B04737c04812a03328k52196a03650
10703a39627G0246a11218A77842d0042n856j13608L8440B28600a58877M4543l54108
10692d68442a67557O1663l44983a1688j12587j31271B24209H0093i8401j56877
10682b55278L1991I445R8133j0827C0897K03257d23668F796d03459b5626j26105
10671a51731A85254P052g564k21525E2248g5245A37648C7138b55909A38895c13863
10659c65643l636F538J02103a03192k91233B60819g2910q0639n3171b6598k10938
10648b37536O7309c1177o128a059k25522l7647g3589j01188l1932M6419J3753
$$ y = [-62458, 37438, 30819, -117011, -86897, 53245, -304365, -845, -234497, -347207, -382605, -11813, -310705, -282858, 30116, 58677, -1696, -35868, -52888, 204737, -304812, -103328, -355524, -103650, -139627, 70246, -111218, 177842, -40042, -45898, -159506, -121066, 228600, -158877, -114334, -468442, -167557, -105894, -450877, -11688, -124275, -255546, 224209, 80093, -98401, -255278, -223287, 9445, 107578, 96751, 30897, 234154, -423668, 6796, -403459, -25626, -151731, 185254, 192306, -7564, -229089, 52248, -75245, 137648, 37138, -255909, 138895, -313863, -365643, -369279, 6538, 108641, -103192, -394425, 260819, -72910, -153549, -206720, -26598, -237536, -170227, -31177, -37305, -1059, -226581, -264228, -73589, -174777, -206709, -160290, -146537]
10637a46537j63545A88774c27170a62690D26455a60727A57764G1764a68502N1329
10627a17173j619e1907j14654A93316a48205N9154N692j2239M3599B14957a50962
10615B4156M9329J99905a57316c1518B16014b83646G520c19624C3658g9679A3321
10603d2127a4878j72309j34025f297j62526k9723P5132k9938E5198a7894A58172
10591b52637d5006p1411j7556L6093B1604a66110o5170O0710g9252H6468a28185
10579a24734c3566A42142N7499E7341a26766B25837a04701p1874E3762j1585e4688
10567i7485A60053a58227A67260p4059l6992K40462a4562p2042p0432G898b06701
10555e8665A59734e3388g086n8420j10511A348b49789a03278H4323l0044B450
$$ y = [-146537, -310082, 188774, -327170, -162690, 426455, -160727, 157764, 71764, -168502, -117173, -118792, -51907, -166561, 193316, -148205, -89051, -83359, -95598, -51999, 214957, -150962, 24156, 73485, 273390, -157316, -31518, 216014, -283646, 7520, -319624, 33658, -79679, 13321, -42127, -14878, -187187, -321212, -6297, -168823, -198546, -123414, -153352, 55198, -17894, 158172, -252637, -45006, -116417, -133973, -97880, 21604, -166110, -231280, -170570, -79252, 86468, -128185, -124734, -33566, 142142, 199641, 57341, -126766, 225837, -104701, -176575, 53762, 42177, -54688, -97485, 160053, -158227, 167260, 93201, 56209, 296671, -14562, -86604, -157036, 7898, -206701, -58665, 159734, -53388, -7086, -65506, -176017, 1348, -249789, -103278, 84323, 54279, 2450]
10543a59631r7921J19224N7243J0023j19329A96895a59158A81702J05596a81346
10532I691J75871b40195a5420A9640E492e74020a68546F0188L0721k4818K42204
10521C08295a25411B27025r3196E1895a43311l11268J70672A19906a29868C91602
10510a38047m9920f7888I707g2016o8774e4772p5314K2766B7048a70649G5458
10498b09208j54699A44988D4724J93921c59795h426a665q3471A16846n5858g1953
10486A85430C7385d74793a84045G0500a10465K2750A9347f3150B58706j12876
10476A45830J44751K67047j61660L4645J03537O4694B65943a29168B14216H5022
10465A32267C15L30066j06746a13497j18487k9888B3954f3580a0807A8726g0316
$$ y = [-159631, -257552, -138328, -81085, -71062, -190391, 196895, -159158, 181702, 287298, -181346, 9691, 185562, -240195, -15420, 19640, 5492, -574020, -168546, 60188, 90909, 66091, 308295, -125411, 227025, 133829, 51895, -143311, -454579, -283907, 119906, -129868, 391602, -138047, -187967, -67888, 9707, -72016, -140790, -54772, -130086, -107320, 27048, -170649, 75458, -209208, -363907, 144988, 44724, 238645, -359795, -8426, -1665, -85136, 116846, 60988, -71953, 185430, 37385, -474793, -184045, 70500, -110465, -87715, 19347, -63150, 258706, 145830, 290581, 557628, 395968, 430613, 534150, 598844, 265943, -129168, 214216, 85022, 132267, 315, 330381, 223635, -113497, -231984, -261872, 23954, -63580, -10807, 18726, -70316]
10453a14391J6684d1325k29312G9130K18279c05322e1151l4122l39988E355a88334
10441g1467j5244E0592c45026m2455B23395N7432f300k03162D5488K334L74761
10430D22583b20554I1045e1935k20181c8924j33212e5718m8804A17921b98309
10419b00469R3820d4079o9405j86408J00173k17984B33186H3483g9768B4179R7274
10408A21453E8537O0944C2577b3060A87895a15786A78732c48190b792n5115j80536
10397b38443j6222N5776I4431a35955A52801J21605c32409B97205G9145J45336
10387B24481c2472J3084B65047f4774G5177L15600j09013e3017p9646C17440M4319
10376C61759A35509l033a0152B63442m5119m423O5469b0230B22891R106L97016
$$ y = [-114391, -97707, -41325, -270637, 79130, 297409, -305322, -51151, -85273, -425261, 5355, -188334, -71467, -86711, 50592, -345026, -387481, 223395, 280827, -6300, -209462, 45488, 47822, 422583, -220554, 91045, -51935, -272116, -38924, -172136, -55718, -104522, 117921, -298309, -200469, -106649, -44079, -113484, -299892, -199719, -417703, 233186, 83483, -79768, 24179, 121453, 58537, 119481, 32577, -23060, 187895, -115786, 178732, -348190, -2792, -57907, -238443, -254665, -198889, 94431, -135955, 152801, 274406, -332409, 297205, 79145, 224481, -32472, -19388, 265047, -64774, 75177, 390777, 281764, -53017, -132663, 317440, 361759, 135509, 132476, -10152, 263442, 218323, 213900, 279369, -20230, 222891, 231997, 629013]
10365F29013G782O25647r1668l754j87839o9889J5508J02510I9642K66300F2582
10353E4057P9679I261K66649F9782J6264L67962L18647j67326B03884Q9945J58775
10342D52604k13188K31241B07433L84605j60650q9527c9486C78730H626J60833
10332A69459R7614D1026q511J68384o0864C0139b76330C62769j79875F1236a20142
10320A08258a64554C40186j26853J57603a62593d7859A43385b09469D20748j78307
10310B42441R385b80980e4293K5569E1676J81322H104b05084P6512I2781A039
10298A35149b18483N9347D0053d0862G3606b53788Q8956L8187j41511f5325K2075
10287d3250F1777K501c1710A27671k4724l6825b69023B91351I3246f9200b0090
$$ y = [629013, 7782, 633429, 541761, 538007, 350168, 280279, 295787, 398297, 99642, 365942, 62582, 54057, 133736, 9261, 275910, 69782, 86046, 454008, 772655, 605329, 203884, 293829, 452604, 239416, 470657, 207433, 592038, 431388, 341861, -39486, 378730, 8626, 169459, 267073, 41026, 32515, 200899, 140035, 30139, -276330, 362769, 182894, 61236, -120142, 108258, -164554, 340186, 213333, 370936, -162593, -47859, 143385, -209469, 420748, 242441, 251826, -280980, -54293, -28724, 51676, 232998, 8104, -205084, -128572, 92781, 1039, 135149, -218483, -159136, 40053, -40862, 73606, -253788, -164832, -126645, -268156, -65325, -43250, 61777, 64278, -31710, 127671, 102947, 66122, -269023, 291351, 93246, -69200, -20090]
10275B90408g2957A34948b1435A65214J4899a6338n9805E8845p826b51755A73378
10263b4795r2564j43013H3548a6542B63554m1761e6152D46945a00562A52291a4074
10251A82372K08032M3999c2425F8270K19853D5561j8434P1200Q882b85203c6622
10239D4804c80738h8621j13587A74216e8837k35671L5290A49582k8898g3211G7494
10227b51594A22614b41601j36459e317B3038a4968j90861C8973P8197b0744j01174
10216a21918M5591k09708d7996j93236i198C4664A2940O8145b974A18848k1894
10205I6954a20717L2891O754A02909a6760k66590H5592a45907k55685A0649R0987
10194A01636N638a62329M7970C37596d0455k06331A45979a66364A26159E5710
$$ y = [290408, -72957, 134948, -21435, 165214, 180113, -16338, -76143, 58845, 51019, -251755, 173378, -24795, -117359, -260372, 83548, -16542, 263554, 221793, -56152, 446945, -100562, 152291, -14074, 182372, 390404, 434403, -32425, 68270, 288123, 45561, 27127, 98327, 107209, -285203, -36622, 44804, -380738, -88621, -202208, 174216, -58837, -294508, -259218, 149582, 120684, -73211, 77494, -251594, 122614, -241601, -378060, -5317, 23038, -14968, -205829, 38973, 117170, -20744, -121918, -76327, -286035, -47996, -241232, -9198, 34664, 12940, 81085, -2974, 118848, 96954, -120717, -87826, -81072, 102909, -16760, -283350, 85592, -145907, -401592, 10649, 101636, 107274, -162329, -114359, 337596, -40455, -246786, 145979, -166364, 126159, 55710]
10183i106G265i2135L1737E0240a04130k82911J15778c4312m15495G6948k3409
10172E3539j9242d1251A11414b50041A20566f3000A05805b93765H5257b60831
10161G3346b37351B28636A6806Q5218N1592b59443I6992l1667B4815J06016b62795
10149a28778o2270e7778E445b0141j11929k5595k9135q6028d522n6704j09649
10138a70875A60440e03990A93948a00107k9670e9914B45304c11445O788a38872
10127a42638q7307h3754j19160B9288p908a29503m944M5755j84975A87432b36188
10115A52867a6248k56227B94526f509C9763a15628j02587i6127j70455I4720a00785
10103F1261a59965g4350j08551C7900d9745p531C13607C6238P8283g1731H1947
$$ y = [-9106, 7265, -92135, -60398, 50240, -104130, -387041, -271263, -34312, -449807, 76948, 53539, 34297, -41251, 111414, -250041, 120566, -63000, 105805, -293765, 85257, -260831, 73346, -237351, 228636, 16806, 102024, 153616, -259443, 96992, 65325, 24815, 130831, -262795, -128778, -191048, -57778, 5445, -20141, -132070, -157665, -186800, -272828, -4522, -61226, -170875, 160440, -503990, 193948, -100107, -129777, -59914, 245304, -311445, -304657, -138872, -142638, -229945, -83754, -202914, 29288, 21380, -129503, -134447, -88692, -273667, 187432, -236188, 152867, -16248, -272475, 294526, -6509, 39763, -115628, -218215, -96127, -266582, 94720, -100785, 61261, -159965, -74350, -182901, 37900, -49745, -57276, 313607, 36238, 114521, -71731, 81947]
10091g2366K6177l39201a33595A02475a91293D2276c52470n6221i0378A13752
10080I6922c81023J02646B516e7327D1512c25228C1567C183J80685d88377h1387
10068a80765G9344a9796E0810B1157R524b34360e4784j8683l7283F7814M538g4315
10055G8203a60043N8512E4339i1882p6653B76815a73581D5418c16717j52475a40657
10043H8767a40180I051O7299b05948B46765c906F4818c97655e5780D468b6972
10031b12073j34426D7374J40815r0374J42634a49100B8409g7445B0926i9716a7678
10019g8448c0865k67151R0671D2214b569F314c4181j70769P3498A79371b68439
10007a97681k40663N1716F1229a57229B4913a32947M6143k2710j05709p7711A70887
$$ y = [-72366, -46189, -385390, -133595, 102475, -191293, 42276, -352470, -408691, -90378, 113752, 96922, -381023, -278377, 2516, -57327, 41512, -325228, 31567, 3183, 183868, -488377, -81387, -180765, 79344, -19796, 50810, 21157, 30681, -234360, -54784, -73467, -110750, 67814, 72352, -74315, 78203, -160043, -101531, 54339, -91882, -168535, 276815, -173581, 45418, -316717, -469192, -140657, 88767, -140180, 9051, 76350, -205948, 246765, -3906, 64818, -397655, -55780, 4468, -26972, -212073, -346499, 47374, 188189, 97815, 240449, -149100, 28409, -77445, 20926, -99716, -17678, -78448, -30865, -298016, -207345, 42214, -2569, 6314, -34181, -204950, -131452, 179371, -268439, -197681, -438344, -386628, 61229, -157229, 24913, -132947, -86804, -109514, -215223, -292934, 170887]
9995H8454P1473J04880a32811j06844a0080o2002k55848e1225q9958K4968B3343
9983f4302l792I4699J6049a9849A61783n977a45663B14975c15160A26453J38326
9972B64779b55664E0693a40636A25360M0294L6524g3481E5400L9438c9262j67211
9961b06473l2964P7791B04269B6114R438c77188J86901F234J84475b72779H168
9949B86807b06010K9120F2711b71223D2257Q7466e1604B05336f8134l7682j09495
9938b15311J04263I9464K17167g7257j6476A18830j6829b03666L1105h0624k0423
9927a01047p3633F9531O6870B1325c3377A00823d938k6280j05496K2295j6572
9916a30991j57250M1985c8278B60406b13288j87648h33o3481k27287H6387c32979
$$ y = [88454, 159927, 264807, -132811, -239655, -10080, -72082, -327930, -51225, -141183, -116215, 23343, -64302, -68094, 94699, 110748, -19849, 161783, 155806, -145663, 214975, -315160, 126453, 264779, -255664, 50693, -140636, 125360, 165654, 202178, -73481, 55400, 94838, -39262, -206473, -239437, -161646, 204269, 26114, 35552, -377188, -190287, 6234, 190709, -272779, 8168, 286807, -206010, -176890, 62711, -271223, 42257, 129723, -51604, 205336, -68134, -105816, -215311, -111048, 99464, 316631, -77257, -93733, 118830, 102001, -203666, -172561, -80624, -101047, -174680, 69531, 136401, 21325, -33377, 100823, -4938, -31218, -136714, -114419, -130991, -288241, -246256, -38278, 260406, -213288, -400936, -833, -64314, -291601, 86387, -332979]
9904A53689J14945b90369b9386D1329a4055j07612O811l8138l7853A21283a22664
9892g1562b7117k1440C09758A05823a81534B08532B9653a4414j22792k00567A1946
9880h4461j19766I9425b80251B31486A06561K49328a02547B68067J2819H858M2457
9869E1315i8671A0064a49238I736P0100d86789A8918O959b52351B47206b11971
9857a82926J1743p0447H8721a9796A08311L460a22867k3599f8415q9294k3961
9846a81670Q5407A50579a05614j76451h3951k82078I8884e7794A11735D9184c70972
9834b11797c2600p1203M5785C0305c41910P845a64390N753C5351N5680a04787
9822B14517H4903a0129B18799R6448a21012D39054b24151O8990k4644M580A48641
$$ y = [153689, 268634, -290369, -29386, 41329, -14055, -121667, -114856, -152994, -190847, 121283, -122664, -71562, -27117, -48557, 309758, 105823, -181534, 208532, 29653, -14414, -137206, -337773, 11946, -84461, -204227, 99425, -280251, 231486, 106561, 355889, -102547, 268067, 280886, 8858, 51315, -98671, 10064, -149238, 9736, 79836, -486789, 18918, 25877, -252351, 247206, -211971, -182926, -171183, -241630, 88721, -19796, 108311, 111771, -122867, -146466, -68415, -157709, -181670, -96263, 150579, -105614, -282065, -83951, -366029, 98884, -57794, 111735, 49184, -370972, -211797, -32600, -103803, -58018, 30305, -341910, -334065, -164390, -158637, 35351, 91031, -104787, 214517, 84903, -10129, 218799, 315247, -121012, 439054, -224151, -155161, -179805, -175225, 148641]
9810A11442a28402r8051N6555d2980j3166D7641c81191a0400B53658b55766N9749
9799a96017j36629F090g0881k1271b8095D9004a80534A10964a23068I706c51830
9787e4552B46156I9263D2864b12843A43417a49411B16362r3473j6317a61412f8969
9775d59982a653B22543b6851k8740A5750N6382c0632k80490B36006d1350l7914
9764g9264k22099J15168G4667g3074B6646J79088A3359J57652E9588J27016a70806
9752b50395B3155g1238a661B01838F317a11653l10744F834J39772a43682j21270
9741b64952A6927c05856A55817a27171k56394b8810k93958K0244K894R0041N1683
9730a57906j41195G6413c42596a15534G2523a67834k95008C6870d4j1019A0207
$$ y = [111442, -128402, -226453, -169898, -42980, -56146, 47641, -381191, -10400, 253658, -255766, -196017, -332646, 6090, -70881, -92152, -28095, 49004, -180534, 110964, -123068, 9706, -351830, -54552, 246156, 99263, 42864, -212843, 143417, -149411, 216362, 122889, 106572, -161412, -68969, -459982, -1653, 222543, -26851, -55591, 15750, 72132, -30632, -311122, 236006, -41350, -79264, -301363, -186195, 74667, -73074, 26646, 205734, 13359, 171011, 59588, 186604, -170806, -250395, 23155, -71238, -1661, 201838, 6317, -111653, -422397, 6834, 146606, -143682, -264952, 16927, -305856, 155817, -127171, -383565, -28810, -322768, -302524, -299630, -209589, -157906, -299101, 76413, -342596, -115534, 72523, -167834, -462842, 36870, -44, -11063, 10207]
9718C04465A05615l6188K0786b08863j43809B04579c60649C75089I8572b00035
9707b36503B51284a52763a1133j73991B43560g1076j58565B28687p9275i0659
9696a52633b1937l76693a40220K0810C22803d9591E7302f7839j16471j7304G1941
9684C56786b96196j43267E4975a49044K9811m2929A40646b0029C3000a32698B4859
9672A50648a01059H2966i3704A84019n1151N0938c15094A87246b22204A29842
9661h8678E5622J92734c52716J48692A3056c71596H0431g4078b2227N089O189
9650a0949j52841C0359m752a82982L3271N0925c1724A07220a34231C31447a21470
9638f8835A43181e9957j28476Q5042p8521I7411a81439B18813a14345F339a44244
$$ y = [304465, 105615, 69427, 90213, -208863, -352672, 204579, -360649, 375089, 98572, -200035, -236503, 251284, -152763, -11133, -185124, 243560, -71076, -229641, 228687, 149412, -90659, -152633, -21937, -398630, -140220, -119410, 322803, -49591, 57302, -67839, -184310, -201614, 71941, 356786, -296196, -439463, 54975, -149044, -119233, -162162, 140646, -20029, 33000, -132698, 24859, 150648, -101059, 82966, -93704, 184019, 132868, 183806, -315094, 187246, -222204, 129842, -88678, 55622, 248356, -352716, -204024, 13056, -371596, 80431, -74078, -22227, -17138, -10949, -163790, 30359, 25607, -182982, -149711, -98786, -31724, 107220, -134231, 331447, -121470, -68835, 143181, -59957, -188433, -103391, -181912, 97411, -181439, 218813, -114345, 6339, -144244]
9626f7982j52516O3558P4200G7772J13775c76361a72420A86866g1122a3C8102
9614a84929c2839q1797m3743e4636k18454I3303J42226h7864q1914A51432d04866
9602a73919B8781L034b09235a5879D9570a47392C07822b81340D1931d56937B5149
9590I6028h585G1993B5025J87593A6106c65815N9429a13733p7355A97238c25368
9578d3537q0109A02099d1836j07970P2998B63546c52929a35878k09658d9397j27331
9567a76728N4592A17540c7142G157J35515d21262a31365O4502A42833g023r4091
9556a01114A76154d43412a47230A19433f6369l28792J83556b9381q8735D3604
9545b1769B71831b47375a07551J0925L2536C56265a91277E9644J07246n3436k328
$$ y = [-67982, -220498, -156940, -82740, 77772, 191547, -376361, -172420, 186866, -71122, -13, 38102, -184929, -32839, -114636, -158379, -54636, -273090, 93303, 235529, -87864, -169778, 151432, -404866, -173919, 28781, 31815, -209235, -15879, 49570, -147392, 307822, -281340, 41931, -456937, 25149, 96028, -8585, 71993, 25025, 212618, 16106, -365815, -306386, -113733, -191088, 197238, -325368, -43537, -123646, 102099, -41836, -149806, -76808, 263546, -352929, -135878, -345536, -49397, -176728, -122136, 117540, -37142, 7157, 142672, -421262, -131365, -66863, 142833, -7023, -101114, 176154, -443412, -147230, 119433, -66369, -395161, -211605, -29381, -118116, 43604, -21769, 271831, -247375, -107551, -96626, -64090, 356265, -191277, 59644, 166890, 113454, 111126]
9534A11126a00184j06969B52662a83772c1446j80961Q3746e6776j16036g2945
9523G6092j4474a79332F5859b4436E9679d44790A57815O5156h1311G4449b35918
9511B97163a5456G8092k0793B2078J01969a19213a1632C19805a23454M2108k4015
9500a05361A0421b02300D1510J13359a13774K8842k5603j43752P9718L9355A19688
9488c388l28790A46335a19707c324p2993J9191A77046a96586e8305m9254B24393
9476H0391K3708c40975a3658j59270j9401g3506j09632l7728B13730g2466m5206
9465a17672K8716C00898a63486b2432k54856f6416n1847A70608b23435a03054
9454i5284k03316B38325l0296d7019J4729n34348H7735K52277i8482I5341I371
$$ y = [111126, -100184, -207153, 252662, -183772, -31446, -212407, -128661, -56776, -172812, -72945, 76092, 61618, -179332, 65859, -24436, 59679, -444790, 157815, 222971, -81311, 74449, -235918, 297163, -15456, 78092, 57299, 22078, 124047, -119213, -11632, 319805, -123454, -81346, -105361, 10421, -202300, 41510, 154869, -113774, -84932, -110535, -254287, -174569, -135214, 119688, -3388, -332178, 146335, -119707, -3324, -76317, -57126, 177046, -196586, -58305, -107559, 224393, 80391, 104099, -340975, -13658, -172928, -192329, -73506, -183138, -220866, 213730, -72466, -117672, -88956, 300898, -163486, -22432, -277288, -66416, -118263, 170608, -223435, -103054, -95284, -298600, 238325, 208029, -47019, -32290, -566638, 87735, 340012, -98482, 95341, 9371]
9442D0452P4028b53460H6183d4766j38858Q746e2745k49303J25995G7054k1318
9431E5736J91687c8675k22229G0332a38988r9938d9372B45053h5655m2738k15420
9420c43813J45739A38995a06417a7790A40312a26599H8448J08862C6766K61f4176
9408a78263A45951a5717A71691b79262A39483a36563n8432p818j385M0455j92340
9397c56083B00501a30392E2326a73397B21752E9457b1917j29427A80995a70625
9386i975l78785J62174E6032A9380f6178k78503A9149a30555n8621R2178G0144
9374a9623j22098a6457A4210c75381g7652q2261i570n0259a5922A009a7737E140
9361c11071a4390k16346L4266k698F323b4474r3830J9728k31439C7083c09020
$$ y = [40452, 114480, -253460, 86183, -44766, -183624, -174878, -52745, -302048, -176053, 77054, 55736, 247423, -38675, -260904, 70332, -138988, -238926, -49372, 245053, -85655, -128393, -343813, -198074, 138995, -106417, -17790, 140312, -126599, 88448, 197310, 36766, 37027, -64176, -178263, 145951, -15717, 171691, -279262, 139483, -136563, -194995, -202813, -204198, -163743, -356083, 200501, -130392, 52326, -173397, 221752, 59457, -21917, -151344, 180995, -170625, -9975, -388760, -226586, 56032, 19380, -66178, -344681, 19149, -130555, -189176, -96998, 70144, -19623, -141721, -16457, 14210, -375381, -77652, -159913, -9570, -59829, -15922, 1009, -17737, 5140, -311071, -14390, -230736, -196470, -199168, 6323, -24474, -118304, -98576, -330015, 37083, -309020]
9349a92948L0725o4123A77788c21285J49159e2130q1230r20B7218J4249J34694
9338A76161a40175p4104E8460L56993G6059R1991e9425A5582g1673A36100M0386
9327A76486A4667b28085i3656j96272E8755J3242a62532i47j05369B3279h4963
9315i3643l20679a4531D3444h7029m6152G1861L0353b41375B33177b93094C6679
9303a41816j78051D1187M4474O0058A4847J26930b8078A3508a57984L0671F007
9291a58217k64721a53405A10557f6885J3300r989p128D2832A3817a94298P1599
9280a22699d0450j54243F2574R6289a55140B33495a63847d7492P016B6610K22338
9269B48948Q0496D0381J81956A0751c53351a33680b3467C9789j349L668c52422
$$ y = [-192948, -162223, -226346, 177788, -321285, -172126, -52130, -133360, -134280, 27218, 41467, 176161, -140175, -214279, 58460, 415453, 76059, 168050, -59425, 15582, -71673, 136100, 176486, 14667, -228085, -93656, -289928, 58755, 71997, -162532, -947, -106316, 23279, -84963, -93643, -414322, -14531, 43444, -87029, -133181, 71861, 102214, -241375, 233177, -293094, 36679, -141816, -319867, 41187, 85661, 145719, 14847, 141777, -28078, 13508, -157984, -127313, 6007, -158217, -422938, -153405, 110557, -66885, -53585, -63574, -70702, 42832, 13817, -194298, -122699, -40450, -194693, 62574, 158863, -155140, 233495, -163847, -47492, -40476, 26610, 248948, 329444, 40381, 222337, 10751, -353351, -133680, -23467, 39789, 38440, 42108, -352422]
9257B25054m4807a43922l21270B10881b11234i9121A6718g8259I7210d8767j49645
9246a98412j81375a30506m6941N2384B1989a3477j30074B351b49366f9578r3007
9235a62585g9457k20101C1761K55793a39430E6146R7965a69664A41123J50324
9225B91447b05685B1742K35492A18527d6357B0405c38988d4408B0939g3283A0826
9213f1290k29184a10346C34263a67869b5852k47692j64577A66513a41001n4637
9203a95638f1740l5781a1543C27683H8437b4347n1497j00020i735A92025Q4354
9192B76379B4915i0059I928b1800F7569h8811j61821f8183A23257b56613A26309
9180H50c69748M0672a14037A99232n4216e14975a14013C00268m0624A9470h6457
$$ y = [225054, 180247, -143922, -465192, 210881, -211234, -99121, 16718, -78259, 97210, -48767, -198412, -379787, -130506, -177447, -125063, 21989, -13477, -143551, 2351, -249366, -69578, -162585, -79457, -299558, 31761, 287554, -139430, 56146, 154111, -169664, 141123, 291447, -205685, 21742, 257234, 118527, -46357, 20405, -338988, -44408, 20939, -73283, 10826, -61290, -290474, -110346, 334263, -167869, -25852, -273544, -438121, 166513, -141001, -195638, -61740, -97521, -11543, 327683, 88437, -24347, -75844, -175864, -9735, 192025, 276379, 24915, -90059, 9928, -21800, 67569, -88811, -250632, -68183, 123257, -256613, 126309, 850, -369748, -329076, -114037, 199232, 145016, -514975, -114013, 300268, 259644, 19470, -86457]
9168g5498o552c430H2476K2997d4861q2416c2710k83503e3234k24161J7608i2160
9155a77801I9848C9497g0216b795G2375c2506j73891J7090f6212j89642k778e5906
9142D0802d9977C18705b01395A01859J26061h6390d053H0366J73962A9021a82496
9130a37356j98443E2556a5492m3941l18545C2134a56877j85152J63792j07712
9120b85949I4187a74202q1617M5629B41597g6494A45147j0459a81044h2954A26101
9108A36795c8394A1208J26547e1574j2319j03731C13O4074b32306N2707J6221
9097a63378B38047b02457A81554d78079I4918a84461h9501D3922J0180h0170H8823
9085I774a29879j2279A0917f2803p8513Q780I8788b7201A05365a83077A6924h5035
$$ y = [-75498, -82050, -3430, 82476, 105473, -44861, -127277, -32710, -316213, -53234, -277395, -259787, -92160, -177801, 99848, 39497, -70216, -2795, 72375, -32506, -206397, -189307, -66212, -255854, -258632, -55906, 40802, -49977, 318705, -201395, 101859, 227920, -86390, -4053, 80366, 254328, 19021, -182496, -137356, -335799, 52556, -15492, -59433, -377978, 32134, -156877, -342029, -178237, -285949, 94187, -174202, -255819, -210190, 241597, -76494, 145147, 134688, -181044, -82954, 126101, 136795, -38394, 11208, 137755, -51574, -63893, -167624, 313, 64387, -232306, -179599, -163378, 238047, -202457, 181554, -478079, 94918, -184461, -89501, 43922, 54102, -80170, 88823, 9774, -129879, -142158, 10917, -62803, -141316, -132536, 98788, -27201, 105365, -183077, 16924, -85035]
9072C62113c4549j81116R7722J0876B06715n6539b25127i5000j35951B35132a93522
9060e6128F6874N2591b41516C11204I9456k2013e1433O202j53591R0058m798B6553
9047g372j01298M7537Q609K4706A56933b02995D1456c95995h0551j90758i7321
9035A45819e9249B53623a35154f5955H2269f2557e236j56873p1036H763a33250
9023A78897a88302g0277E2913b2940B3336J99927f6195C57345j53577c30317d1067
9011b54832N9217B11214k9282a53892f5160j96471a15439b4723a0850l43604D0599
8999C6377a11626l8124J1143j35192f105k05044h0297k12383G5122e0653r1898
8988a42551A02807A0720a78294G2262a34919L9424F6360a89675o2146a4404B31209
$$ y = [362113, -34549, -215665, -117943, -107067, 206715, 150176, -225127, -95000, -230951, 235132, -193522, -56128, 66874, 119465, -241516, 311204, 99456, 77443, -51433, -45231, -198822, -108764, -113562, 26553, -7372, -108670, -61133, -52524, -27818, 156933, -202995, 41456, -395995, -80551, -271309, -97321, 145819, -59249, 253623, -135154, -65955, 82269, -62557, -5236, -162109, -233145, 8763, -133250, 178897, -188302, -70277, 52913, -22940, 23336, 223263, -66195, 357345, 203768, -330317, -41067, -254832, -195615, 211214, 181932, -153892, -65160, -261631, -115439, -24723, -10850, -354454, 40599, 36377, -111626, -149750, -138607, -273799, -6105, -211149, -80297, -292680, 75122, -50653, -142551, 102807, 10720, -178294, 72262, -134919, -95495, 66360, -189675, -251821, -14404, 231209]
8976a51678A16590a49579p6499q390a8122A5888c69735j24916A62481j104J20895
8965B82272C2164P0519D2106a43136j26638C18163E1326i6719A71131b97398j33243
8954d30641a09053k60876b8235B72684h8147B02338a97019j8869L9395B63774
8943a87569m522c3373l3163j44404l0374J16893C9821a67812E1223f2353D32606
8931A56290L1099A99d589j22566E3174a48188C05074L32415A50141M18416K37100
8920H05657L591493P416248K45023B707041G44227O6912B92616b7917B1639a75059
8909g853j53946f8442B34807a1135B76655o1789H2708J2505H173K6456J03259
8898A37888k8069g5958j4445m5511K9628B92198b33473B75897a91615J9214a7529
$$ y = [-151678, 116590, -149579, -226078, -234468, -18122, 15888, -369735, -494651, 162481, 161377, 282272, 32164, 102683, 42106, -143136, -269774, 318163, 51326, -96719, 171131, -297398, -430641, -109053, -369929, -28235, 272684, -88147, 202338, -197019, -215888, -176493, 263774, -187569, -192091, -33373, -66536, -210940, -241314, -124421, 39821, -167812, 51223, -62353, 432606, 156290, 187389, 199, -4589, -127155, 53174, -148188, 305074, 637489, 150141, 568557, 805657, 4397150, 11813398, 12058421, 2707041, 744227, 811139, 292616, -27917, 21639, -175059, -7853, -161799, -68442, 234807, -11135, 276655, 214866, 82708, 95213, 8173, 34629, 137888, 109819, -75958, -90403, -135914, -106286, 292198, -233473, 275897, -191615, -172401, -17529]
8886b33835A06695B0699i3137L1666q73D5276c9718l6999H3299m054e1395J1090
8874d0305A34193e5526q2687M0966J2323G0221K11438c6311k70544a7976c550
8862a82951r8197B9238P1578a44024j32452J795B50994E035c8961C22655C6804
8850A25190h0531m4636G3245g7571a3075B10448a58751g8175b0989q8306a9464
$$ y = [-233835, 106695, 20699, -93137, -61471, -62344, 45276, -39718, -76717, 83299, 79245, -51395, -40305, 134193, -55526, -138213, -97247, -84924, 70221, 281659, -36311, -306855, -17976, -3550, -182951, -281148, 29238, 100816, -144024, -276476, -274681, 250994, 5035, -38961, 322655, 36804, 125190, -80531, -125167, 73245, -77571, -13075, 210448, -158751, -78175, -20989, -109295, -19464]
$$ [...]
##END NTUPLES=NMR SPECTRUM
##END=
