
##TITLE=AC1324_UGAAH12153_7163909_z8CT513T2h
##JCAMPDX= 6.0         $$ Bruker NMR JCAMP-DX V2.0
##DATA TYPE= NMR SPECTRUM
##DATA CLASS= NTUPLES
##ORIGIN= BRUKER
##OWNER= Administrator
$$ 1.72 TOPSPIN		Version 2.1
$$ 2013-01-29 19:56:38.537 -0500  Administrator@X
$$ Compression mode = diff/dup
##.OBSERVE FREQUENCY= 400.02188249412
##.OBSERVE NUCLEUS= ^1H
##.ACQUISITION MODE= SIMULTANEOUS (DQD)
##.ACQUISITION SCHEME= undefined
##.AVERAGES= 64
##.DIGITISER RES= 22
##SPECTROMETER/DATA SYSTEM= spect
##.PULSE SEQUENCE= noesygpps1d.comp
##.SOLVENT NAME= COFFEE_meoh
##.SHIFT REFERENCE= INTERNAL, COFFEE_meoh, 1, 14.96275
##AUDIT TRAIL= $$ (NUMBER, WHEN, WHO, WHERE, PROCESS, VERSION, WHAT)
$$ ##TITLE= Audit trail, TOPSPIN		Version 2.1
$$ ##JCAMPDX= 5.01
$$ ##ORIGIN= Bruker BioSpin GmbH
$$ ##OWNER= Administrator
$$ $$ E:\/data/COFFEE/nmr/AC1324_UGAAH12153_7163909_z8CT513T2h/22/pdata/1/auditp.txt
$$ ##AUDIT TRAIL=  $$ (NUMBER, WHEN, WHO, WHERE, PROCESS, VERSION, WHAT)
(   1,<2013-01-29 19:56:32.569 -0500>,<Administrator>,<X>,<go>,<TOPSPIN 2.1>,
      <created by zg
	started at 2013-01-29 19:45:02.083 -0500,
	POWCHK enabled, PULCHK disabled,
       configuration hash MD5:
       86 BA 57 50 F2 9D 5C 9B 26 00 A9 28 5F 66 2E 89
       data hash MD5: 64K
       EE DA 42 EC 38 D1 B3 11 8F 0B 0F 32 9D 0C A1 A7>)
(   2,<2013-01-29 19:56:35.662 -0500>,<Administrator>,<X>,<proc1d>,<TOPSPIN 2.1>,
      <Start of raw data processing
       efp LB = 0.3 FT_mod = 6 PKNL = 1 PHC0 = 0 PHC1 = 0 SI = 128K 
       data hash MD5: 128K
       0A FB 28 A1 B0 25 37 AD A9 89 4F 48 40 B4 72 32>)
(   3,<2013-01-29 19:56:36.725 -0500>,<Administrator>,<X>,<proc1d>,<TOPSPIN 2.1>,
      <pk PHC0 = -79.40369 PHC1 = 0 
       data hash MD5: 128K
       F5 13 C7 B5 4B 90 7C E7 67 B4 57 2C 66 03 63 0B>)
(   4,<2013-01-29 19:56:37.475 -0500>,<Administrator>,<X>,<proc1d>,<TOPSPIN 2.1>,
      <abs ABSG = 1 
       data hash MD5: 128K
       9A 7B BF 56 EF 1C F0 35 34 42 0B 46 2F AF AB 67>)
(   5,<2013-01-29 19:56:37.678 -0500>,<Administrator>,<X>,<proc1d>,<TOPSPIN 2.1>,
      <abs ABSG = 2 
       data hash MD5: 128K
       B3 5E DA F8 74 56 9B 59 03 CE D1 21 52 9E 0C 8C>)
(   6,<2013-01-29 19:56:37.866 -0500>,<Administrator>,<X>,<proc1d>,<TOPSPIN 2.1>,
      <abs ABSG = 3 
       data hash MD5: 128K
       8A D5 E3 71 E5 44 0B 66 F2 C5 F4 BA 6A 2B 5C F6>)
(   7,<2013-01-29 19:56:38.053 -0500>,<Administrator>,<X>,<proc1d>,<TOPSPIN 2.1>,
      <abs ABSG = 4 
       data hash MD5: 128K
       28 97 44 9C 05 31 E7 EC 1C D6 64 36 FF 54 0C AC>)
(   8,<2013-01-29 19:56:38.225 -0500>,<Administrator>,<X>,<proc1d>,<TOPSPIN 2.1>,
      <abs ABSG = 5 
       data hash MD5: 128K
       8E D5 0C 80 AB A1 E8 48 B9 92 47 A1 04 CE 60 B2>)
$$ ##END=
$$ 
$$ $$ hash MD5
$$ $$ 57 0B 93 14 96 5A 14 9C D1 9B A3 CB 56 80 A1 62
##$RELAX= 
##$RELAX= 
##$RELAX= 
##$RELAX= 
##$RELAX= 
##$RELAX= 
##$RELAX= 
##$RELAX= 
$$ Bruker specific parameters
$$ --------------------------
##$DU= <E:\>
##$EXPNO= 22
$$ [...]
##$TP07= 0
##$TPNAME0= <>
##$TPNAME1= <>
##$TPNAME2= <>
##$TPNAME3= <>
##$TPNAME4= <>
##$TPNAME5= <>
##$TPNAME6= <>
##$TPNAME7= <>
##$TPOAL= (0..7)
0.5 0.5 0.5 0.5 0.5 0.5 0.5 0.5
##$TPOFFS= (0..7)
0 0 0 0 0 0 0 0
##$TUNHIN= 0
##$TUNHOUT= 0
##$TUNXOUT= 0
##$USERA1= <user>
##$USERA2= <user>
##$USERA3= <user>
##$USERA4= <user>
##$USERA5= <user>
##$V9= 5
##$VALIST= <valist>
##$VCLIST= <CCCCCCCCCCCCCCC>
##$VD= 0
##$VDLIST= <DDDDDDDDDDDDDDD>
##$VPLIST= <PPPPPPPPPPPPPPP>
##$VTLIST= <TTTTTTTTTTTTTTT>
##$WBST= 1024
##$WBSW= 4
##$XGAIN= (0..3)
0 0 0 0
##$XL= 0
##$YL= 0
##$YMAX_a= 8008828
##$YMIN_a= -17583884
##$ZGOPTNS= <>
##$ZL1= 120
##$ZL2= 120
##$ZL3= 120
##$ZL4= 120
##$ABSF1= 14.96275
##$ABSF2= -5.595431
##$ABSG= 5
##$ABSL= 3
##$ALPHA= 0
##$AQORDER= 0
##$ASSFAC= 0
##$ASSFACI= 0
##$ASSFACX= 0
##$ASSWID= 0
##$AUNMP= <proc_prof1d_extract.lims>
##$AXLEFT= 0
##$AXNAME= <>
##$AXNUC= <1H>
##$AXRIGHT= 0
##$AXTYPE= 0
##$AXUNIT= <>
##$AZFE= 0.1
##$AZFW= 0.1
##$BCFW= 0
##$BC_mod= 0
##$BYTORDP= 0
##$COROFFS= 0
##$CY= 15
##$DATMOD= 1
##$DC= 0
##$DFILT= <>
##$DTYPP= 0
##$F1P= 0
##$F2P= 0
##$FCOR= 0.5
##$FTSIZE= 131072
##$FT_mod= 6
##$GAMMA= 0
##$GB= 0
##$INTBC= 1
##$INTSCL= 1
##$ISEN= 128
##$LB= 0.3
##$LEV0= 0
##$LPBIN= 0
##$MAXI= 10000
##$MC2= 0
##$MEAN= 0
##$ME_mod= 0
##$MI= 0
##$NCOEF= 0
##$NC_proc= -2
##$NLEV= 6
##$NOISF1= 0
##$NOISF2= 0
##$NSP= 0
##$NTH_PI= 0
##$NZP= 0
##$OFFSET= 14.96275
##$PC= 1
##$PHC0= -79.40369
##$PHC1= 0
##$PH_mod= 1
##$PKNL= yes
##$PPARMOD= 0
##$PPDIAG= 0
##$PPIPTYP= 0
##$PPMPNUM= 2147483647
##$PPRESOL= 1
##$PSCAL= 4
##$PSIGN= 0
##$PYNMP= <proc.py>
##$REVERSE= no
##$SF= 400.020008937262
##$SI= 131072
##$SIGF1= 0
##$SIGF2= 0
##$SINO= 400
##$SIOLD= 131072
##$SPECTYP= <>
##$SREGLST= <1H.CDCl3>
##$SSB= 0
##$STSI= 131072
##$STSR= 0
##$SW_p= 8223.68421052631
##$SYMM= 0
##$S_DEV= 0
##$TDeff= 65536
##$TDoff= 0
##$TI= <>
##$TILT= no
##$TM1= 0
##$TM2= 0
##$TOPLEV= 0
##$USERP1= <user>
##$USERP2= <user>
##$USERP3= <user>
##$USERP4= <user>
##$USERP5= <user>
##$WDW= 1
##$XDIM= 131072
##$YMAX_p= 431910765
##$YMIN_p= -11521
##$CURPLOT= <Network HP LaserJet P1505>
##$CURPRIN= <$Network HP LaserJet P1505>
##$DFORMAT= <normdp>
##$LAYOUT= <+/1D_H.xwp>
##$LFORMAT= <normlp>
##$PFORMAT= <normpl>
##$SURQMSG= 1
$$ End of Bruker specific parameters
$$ ---------------------------------
##NTUPLES= NMR SPECTRUM
##VAR_NAME=  FREQUENCY,     SPECTRUM/REAL,   SPECTRUM/IMAG
##SYMBOL=    X,             R,               I
##VAR_TYPE=  INDEPENDENT,   DEPENDENT,       DEPENDENT
##VAR_FORM=  AFFN,          ASDF,            ASDF
##VAR_DIM=   131072,        131072,          131072
##UNITS=     HZ,            ARBITRARY UNITS, ARBITRARY UNITS
##FACTOR=    0.0627417313425164, 1,          1
##FIRST=     8223.62146879497, 1962,         -62959
##LAST=      0,             3864,            -62737
##MIN=       0,             -11521,          0
##MAX=       8223.62146879497, 431910765,    0
$$ Real data points
##PAGE= N=1
##DATA TABLE= (X++(R..R)), XYDATA
$$ [...]
67460 106168 107107 106567 105322 104013 102865 102139 102169 102856 103636 104099 104358 104725 105281 105844 106207 106297 106217 106170 106306
67441 106306 106629 107034 107362 107424 107098 106529 106127 106315 107304 109038 111108 112741 113216 112557 111634 111374 111939 112783
67423 112783 113355 113543 113512 113358 112958 112061 110567 108744 107136 106198 106040 106450 107022 107263 106866 106021 105303 105138
67405 105138 105469 105940 106239 106215 105929 105738 106017 106638 106994 106799 106538 106779 107263 107233 106574 106099 106535 107631 108502
67386 108502 108578 107943 107005 106200 105963 106546 107620 108289 107806 106380 105077 104776 105371 106179 106919 107888 109199 110362
67368 110362 110963 111325 112029 112949 113306 112721 111753 111224 111333 111703 112004 112214 112424 112651 112879 113048 113031 112776 112487
67349 112487 112434 112538 112317 111507 110630 110661 112015 114045 115771 116973 118267 120067 121866 122814 122828 122727 123278
67332 123278 124413 125530 126304 126941 127711 128464 128739 128289 127399 126618 126192 125895 125463 125063 125129 125795 126697 127398
67314 127398 127804 128111 128473 128946 129642 130677 131913 132861 133052 132583 132224 132818 134451 136356 137777 138767 139865
67297 139865 141111 141826 141462 140276 138918 137731 136749 136045 135635 135298 134986 135261 136737 139095 141215 142394
67281 142394 142905 143216 143273 142902 142408 142321 142850 143999 145797 147897 149306 149225 148097 147257 147547 148737 150185
67264 150185 151406 151941 151472 150403 149769 150091 150725 150690 149805 148635 147739 147494 148312 150273 152597 154112 154433
67247 154433 154247 154273 154387 154031 153150 152419 152670 154308 157061 160037 162117 162707 162269 162007 162856 164701 166557
67230 166557 167471 167314 166798 166805 167655 168960 170096 170779 171236 171925 173139 174838 176792 178841 180981 183261 185626
67213 185626 187907 189874 191244 191706 191150 189945 188864 188581 189199 190330 191558 192739 193899 195017 195953
67198 195953 196440 196210 195358 194637 195016 196665 198643 199974 200776 201876 203459 204817 205464 205774 206213 206625 206821
67181 206821 207311 208750 210967 213227 215228 217141 218817 219753 219987 220334 221478 223316 225330 227145 228583
67166 228583 229643 230696 232226 234173 235921 237129 238131 239266 240322 240967 241349 241960 243188 245215 247928
67151 247928 250690 252592 253280 253176 252749 252122 251675 252305 254445 257323 259819 261669 263229 264584 265671 266906
67135 266906 268721 270697 272098 273229 275252 278499 281866 284240 285792 287475 289857 292913 296433 300143
67121 300143 303673 306772 309426 311655 313521 315417 317897 320927 323727 325726 327383 329619 332624 335586
67107 335586 337565 338344 338405 338345 338496 339055 340385 342828 346135 349407 351960 354079 356519 359408 362144 364343
67091 364343 366345 368645 371337 374333 377701 381501 385553 389585 393398 396826 399884 403030 406888 411510
67077 411510 416246 420538 424439 428186 431674 434708 437411 440059 442734 445458 448356 451401 454291 456995
67063 456995 460134 464382 469553 474644 478772 481833 484384 487137 490497 494319 498150 501813 505597 509736
67049 509736 513972 517938 521773 525992 530818 535937 540844 545194 548896 552202 555730 560197 565991 572943
67035 572943 580324 587009 592086 595673 599036 603510 609364 615894 622415 628734 634806 640513 645958 651564
67021 651564 657615 663897 670024 675965 682056 688602 695658 703178 711164 719588 728300 737097 745824 754311
67007 754311 762312 769664 776559 783410 790360 797211 804011 811309 819439 827855 835815 843600 852284 862185
66993 862185 872328 881779 890823 900245 910045 919606 928783 938037 947548 956934 965942 974859 984054 993542
66979 993542 1003154 1012804 1022453 1032078 1041845 1052092 1063023 1074536 1086384 1098323 1110127 1121692
66967 1121692 1133176 1144896 1157082 1169839 1183240 1197207 1211325 1225053 1238181 1250901 1263443
66956 1263443 1275903 1288433 1301310 1314669 1328332 1342059 1355881 1370010 1384433 1398686 1412156
66945 1412156 1424650 1436609 1448659 1461035 1473652 1486579 1500058 1513945 1527639 1540772 1553614
66934 1553614 1566499 1579245 1591608 1603876 1616447 1629045 1641090 1652801 1665221 1678958 1693421
66923 1693421 1707486 1720515 1732551 1743968 1755248 1766782 1778589 1790410 1802199 1814247 1826633
66912 1826633 1838853 1850302 1860946 1871297 1881806 1892457 1902883 1912706 1921831 1930476 1938845 1946782
66900 1946782 1953944 1960317 1966299 1972138 1977592 1982388 1986854 1991718 1997223 2002655 2006899 2009497 2011112 2012898
66886 2012898 2015367 2017919 2019517 2019710 2018910 2017840 2016926 2016077 2014809 2012553 2009128 2004974 2000790 1996934 1993305
66871 1993305 1989668 1985863 1981752 1977271 1972533 1967544 1961879 1955002 1946979 1938481 1929990 1921344 1912179 1902420
66857 1902420 1892184 1881624 1871115 1861153 1851644 1841643 1830252 1817595 1804485 1791360 1778089 1764790
66845 1764790 1752167 1740720 1729992 1718998 1707238 1694964 1682522 1669824 1656663 1643324 1630459
66834 1630459 1618222 1605843 1592320 1577443 1561914 1546548 1531704 1517441 1503749 1490418 1476970
66823 1476970 1463079 1448959 1435108 1421745 1408654 1395497 1382096 1368445 1354647 1340876 1327327
66812 1327327 1314157 1301433 1289050 1276772 1264435 1252083 1239732 1227128 1214045 1200779 1188015
66801 1188015 1176110 1164821 1153838 1143128 1132537 1121465 1109356 1096328 1083044 1070161 1058134
66790 1058134 1047181 1036943 1026457 1015072 1003407 992831 983865 975535 966441 956089 945013 933972
66778 933972 923367 913283 903764 894932 886810 879009 870799 861804 852570 844083 836632 829507 821932 813943
66764 813943 806083 798534 790927 782889 774483 766103 758180 750945 744287 737767 730848 723193 714801 706049
66750 706049 697638 690205 683735 677476 670715 663567 656728 650575 644818 639083 633466 628269 623475 618713
66736 618713 613660 608275 602748 597371 592398 587804 583217 578242 572908 567618 562610 557631 552258 546460
66722 546460 540718 535566 531054 526728 522124 517279 512716 508916 505839 502920 499501 495280 490488 485737
66708 485737 481559 477984 474595 471067 467523 464220 461034 457533 453507 449197 444985 441153 437962 435590
66694 435590 433775 431752 428827 424944 420609 416435 412860 410019 407631 405199 402584 400211 398324 396245
66680 396245 392842 387843 382283 377520 374044 371371 368791 365993 363110 360397 357881 355287 352334 349082
66666 349082 345870 342969 340466 338459 337022 335905 334570 332741 330725 328891 327000 324344 320605 316389
66652 316389 312767 310391 309061 308041 306701 304844 302607 300229 297976 296146 294926 294226 293715 293025 291943
66637 291943 290504 289007 287757 286622 284995 282482 279570 277260 276005 275312 274458 273267 271943 270454 268402
66622 268402 265548 262259 259363 257525 256656 255941 254627 252757 250934 249465 248083 246557 245187 244381 244052
66607 244052 243729 243085 242067 240693 239035 237340 235851 234551 233246 231895 230697 229936 229868 230541 231534 232059
66591 232059 231598 230356 228845 227299 225822 224828 224682 224909 224404 222654 220366 218626 217839 217693 217712 217477 216654
66574 216654 215307 214062 213501 213418 213036 211988 210732 209942 209766 209796 209521 208653 207196 205391 203570 201934 200469
66557 200469 199025 197426 195505 193247 190925 188982 187685 186992 186746 186825 187040 187125 186969 186699 186368 185781 184843
66540 184843 183881 183242 182706 181674 179963 178040 176365 174919 173508 172122 170701 168909 166601 164321 162890
66525 162890 162518 162682 162850 162924 162924 162666 161988 161069 160278 159791 159480 159166 158839 158646 158672 158765 158652 158267 157787 157255
66505 157255 156431 155254 154234 153981 154434 154988 155258 155238 154744 153401 151429 149818 149193 148927 147905 145955 143973
66488 143973 142801 142472 142550 142682 142707 142614 142552 142641 142670 142206 141135 139848 138797 138070 137505 137046 136750 136561 136281
66469 136281 135809 135301 134963 134700 134051 132656 130779 129194 128442 128336 128329 128205 128192 128512 129124 129890 130754 131630 132285
66450 132285 132428 131841 130448 128419 126270 124668 123978 123984 124140 124043 123694 123401 123518 124154 125016 125505 125138 124004
66432 124004 122823 122421 123014 124070 124966 125738 126968 128915 131017 132413 132770 132447 131955 131490 130934 130128 129122
66415 129122 128259 127909 128002 127932 127115 125629 124107 123008 122139 120965 119241 117288 115668 114607 113742 112542
66399 112542 110981 109587 108781 108457 108354 108501 108959 109393 109389 109053 108831 108818 108777 108837 109480 110639 111387 110952 109589
66380 109589 108079 106754 105489 104361 103677 103412 103098 102367 101324 100416 100177 100959 102484 103730 103697 102362
66364 102362 100529 98790 97120 95540 94522 94383 94796 95383 96403 98260 100497 101963 102067 101391 100902 100932
66348 100932 101136 101102 100697 99966 99003 97950 96992 96359 96259 96643 96993 96609 95307 93715 92691 92544 92926 93325
66330 93325 93435 93164 92596 92048 91947 92518 93568 94580 95019 94670 93852 93242 93364 94170 95119 95534 94872 92970
66312 92970 90373 88249 87529 88013 88581 88353 87396 86298 85443 84908 84716 84843 85057 85090 84917 84702 84492 84199
66294 84199 83894 83911 84522 85568 86516 86910 86758 86452 86356 86499 86693 86828 86921 86992 87060 87245 87669 88237 88662 88771
66274 88771 88675 88619 88791 89241 89807 90147 90027 89595 89165 88770 88232 87604 87196 87038 86716 85930 84905 84057 83567
66255 83567 83520 84115 85332 86635 87404 87533 87280 86751 85890 84841 83838 82784 81421 79963 79090 79170 79842
66238 79842 80586 81347 82330 83456 84360 84841 85031 85147 85325 85642 86097 86462 86375 85689 84666 83697 82914 82187 81422
66219 81422 80692 80096 79683 79553 79746 79959 79640 78598 77252 76075 75061 74132 73716 74314 75643 76907 77916
66202 77916 79179 80729 81721 81611 81037 80919 81258 81443 81281 80966 80381 79307 78204 77941 78674 79639 80130 80063
66184 80063 79486 78283 76669 75402 75062 75394 75703 75703 75717 76202 77271 78527 79287 79082 78073 76922 76311 76626
66166 76626 77902 79678 81074 81449 81078 80812 81056 81429 81435 80982 80151 78934 77500 76340 75889 76196 77080 78241
66148 78241 79038 78647 76822 74292 72066 70542 69600 69300 69977 71584 73301 74024 73243 71449 69736 68929
66132 68929 69036 69493 69835 69957 69867 69526 69033 68637 68418 68220 68067 68362 69380 70727 71612 71661 71227 70930 71043
66113 71043 71395 71690 71755 71504 70856 69919 69188 69206 69848 70230 69676 68589 68026 68465 69387 70020 70169 70281 70981
66094 70981 72514 74365 75536 75553 75064 74997 75310 75240 74699 74554 75249 75946 75595 74225 72606 71141 69770 68681
66076 68681 68336 68799 69579 70205 70615 70929 71185 71372 71564 71907 72440 72858 72580 71443 70291 70301 71479 72391
66058 72391 71792 70069 68536 67769 67321 66822 66516 66672 67142 67705 68337 68920 69069 68546 67684 67186 67583 68856
66040 68856 70438 71624 72177 72521 73160 74037 74679 74888 75009 75514 76535 77795 78772 78977 78359 77502 77239 78001
66022 78001 79486 80873 81316 80509 79001 77759 77228 76974 76373 75379 74377 73619 73147 72990 73105 73379 73985
66005 73985 75318 77095 78084 77497 76307 76232 77512 78700 78707 77988 77416 76993 76300 75419 74644 73772 72433 70783
65987 70783 69286 68052 66985 66330 66446 67163 67934 68535 69106 69547 69482 68919 68481 68760 69719 70845 71662 71971
65969 71971 71829 71413 70825 70061 69289 68932 69184 69575 69468 68907 68487 68331 67863 66884 66293 67095 68984 70534
65951 70534 70756 69932 68916 68246 68119 68660 69667 70465 70589 70571 71493 73594 75816 76998 77193 77382 78047 78517
65933 78517 77821 75884 73630 72118 71798 72486 73727 75082 76266 77223 78016 78591 78748 78445 77944 77497 77014
65916 77014 76335 75762 75860 76588 77034 76374 74882 73612 73214 73410 73596 73508 73224 72869 72521 72210 71846 71285 70570
65897 70570 70052 70219 71398 73453 75559 76541 75915 74578 73996 74577 75277 74921 73415 71481 69753 68554
65881 68554 68110 68365 68800 68902 68697 68452 68037 67106 65797 64760 64406 64513 64629 64600 64635 65095 66182 67633
65863 67633 68797 69287 69451 69841 70308 70116 68972 67449 66248 65478 64954 64814 65418 66717 68071 68770 68618
65846 68618 68024 67649 67963 69021 70550 72158 73546 74620 75440 75950 75779 74574 72606 70780 69814 69620
65830 69620 69692 69784 69899 69908 69696 69576 70029 71031 72087 72958 73877 74968 75942 76594 77201 78114 79263 80317 81126
65811 81126 81710 82011 81882 81309 80464 79572 78831 78360 78202 78360 78789 79246 79302 78790 78172 78101 78599 79025 78954 78695
65791 78695 78760 79200 79747 80345 81131 81969 82358 81919 80863 79924 79804 80548 81463 81719 81072 79931 78839 78117
65773 78117 77945 78414 79307 80077 80238 79722 78833 78017 77666 77832 78018 77543 76275 74824 73939 73894 74495 75298 75645
65754 75645 74943 73284 71609 70904 71299 72172 72869 73061 72600 71536 70217 69008 67864 66535 65227 64619
65738 64619 64989 65640 65563 64644 63837 64043 65111 66164 66735 67153 67833 68645 69249 69634 69872 69620 68532 67141
65720 67141 66710 67935 70191 72265 73423 73571 72855 71533 69961 68318 66577 65015 64416 65253 66882 68070
65704 68070 68337 68296 68645 69234 69280 68215 66225 64149 62901 62781 63272 63610 63472 62990 62306 61525 61002 61199
65686 61199 62109 63175 63914 64316 64549 64651 64749 65214 66280 67742 69326 71062 72886 74139 74081 72900 71663
65669 71663 71064 70690 69790 68400 67243 66760 66695 66622 66466 66404 66583 67057 67825 68745 69544 69984 69943 69349 68225
65650 68225 66856 65669 64829 64147 63489 63029 62930 63033 63131 63331 63806 64351 64638 64891 65865 67912 70329 71873
65632 71873 71884 70778 69521 68742 68332 67854 67175 66555 66170 65808 65178 64307 63472 62964 63084 64088 65776 67352
65614 67352 68112 68150 68008 67773 67025 65706 64444 63799 63572 63077 61853 59994 58095 57018 57355 58895 60801
65597 60801 62402 63561 64293 64528 64458 64648 65369 66096 66062 65150 63920 62903 62202 61685 61252 60916 60773 60828 60822
65578 60822 60440 59846 59731 60504 61614 62113 61803 61415 61625 62222 62531 62417 62522 63462 64988 66237 66756 66973
65560 66973 67454 68026 68019 67267 66340 65755 65426 65024 64406 63422 61820 59749 58080 57722 58695 60154 61180 61349
65542 61349 60800 60146 60169 61091 62152 62268 61212 59885 59371 59971 61166 62265 62970 63489 64199 65138 65856 65889
65524 65889 65394 65148 65828 67331 68838 69536 69324 68834 68749 69133 69504 69527 69423 69634 70305 71272 72442 73962
65506 73962 75937 78106 79923 81066 81814 82678 83588 83755 82674 81020 80123 80619 82042 83656 85121 86299
65490 86299 87019 87353 87697 88297 89055 89966 91259 92846 94145 94852 95413 96297 97220 97687 97947 98783 100505 102758
65472 102758 105183 107667 109975 111766 113119 114560 116374 118220 119618 120503 121070 121275 120750 119232 116948
65457 116948 114445 112006 109293 105755 101380 96843 92960 90190 88610 87870 87070 85246 82386 79635 78103
65442 78103 77666 77286 76280 74934 73965 73688 73671 73155 71955 70860 70776 71493 71933 71663 71387 71668 72095 72229
65424 72229 72443 73012 73189 72288 71062 70754 71167 71001 69968 69269 69775 70924 71720 71815 71299 70386 69726 70130
65406 70130 71447 72439 72265 71409 70726 70366 70233 70739 72237 74114 75331 75717 76040 76812 77594 77635 76824 75893
65388 75893 75767 76735 78184 79225 79508 79290 78855 78348 78179 78990 80925 83379 85729 87949 90218 92445
65372 92445 94645 97444 101575 106959 112772 118472 124404 131320 139642 149340 160268 172271 184845 196870
65358 196870 206963 214197 218427 219835 218396 214009 207033 198481 189689 181826 175359 169742 163917 157484
65344 157484 151231 146196 142559 139860 137873 136531 135256 133273 130602 127982 125732 123462 120956 118552
65330 118552 116377 113978 111062 107915 104766 101385 97681 94071 90844 87765 84735 82250 80688 79671
65316 79671 78669 77741 77148 76684 75994 75231 74803 74705 74534 73963 72841 71214 69599 68822 69111 69733 69968 69983
65298 69983 70255 70538 70134 68899 67375 66143 65558 65846 66822 67685 67717 67047 66273 65566 64716 63800 63151 62739
65280 62739 62224 61558 61050 60906 61148 61794 62629 63086 62956 62923 63698 64854 65347 65030 64701 64682 64397 63571 62865
65261 62865 62866 63240 63433 63611 64382 66012 68370 71220 74160 76639 78429 79847 81184 82274 82890 83195 83474
65244 83474 83780 84120 84545 84651 83509 80768 77530 75400 74736 74437 73449 71810 70137 68762 67742 67206
65228 67206 67154 67103 66382 64829 62931 61320 60314 59929 60029 60312 60393 60089 59582 59155 58833 58423 57871 57363 57029
65209 57029 56751 56458 56503 57440 59282 61115 61751 60890 59465 58622 58523 58511 58420 59058 61017 63485 64945 64864 64029
65190 64029 63261 62608 61983 61765 62210 62805 62850 62347 61765 61200 60427 59678 59671 60708 62186 63177 63229 62495 61358
65171 61358 60138 59063 58405 58489 59404 60645 61351 61101 60267 59425 58723 58141 58008 58752 60232 61767 62740 62871
65153 62871 62126 60892 60095 60554 62090 63748 64956 65972 67096 68012 68216 67663 66719 65758 65141 65248 66181
65136 66181 67529 68718 69496 69939 70147 70179 70196 70482 71239 72451 73870 75109 75869 76106 75959 75539 74887 74080
65118 74080 73182 72161 71071 70243 69995 70134 70135 69899 69949 70620 71430 71678 71461 71594 72508 73647 74135 73768 73134
65099 73134 72991 73801 75784 79020 83369 88467 94012 99910 106063 112141 117833 123229 128703 134425 140211
65084 140211 145829 151183 156115 160336 163711 166382 168516 170098 171032 171173 170195 167785 164118 159733 154761
65069 154761 148753 141686 134649 128891 124366 119847 114488 108709 103469 99166 95428 91623 87392 82944
65055 82944 79015 76388 75300 75340 75840 76236 76164 75502 74360 72889 71134 69201 67424 66141 65386 65029 65075
65038 65075 65532 66120 66446 66385 66008 65267 64085 62728 61704 61285 61403 61900 62534 62848 62490 61742 61326 61658
65020 61658 62583 63794 65064 66021 66204 65515 64365 63250 62486 62331 62990 64310 65776 66897 67362 66877 65326
65003 65326 63218 61566 61104 61795 63114 64471 65344 65496 65283 65361 65890 66310 66120 65534 65187 65445 66186 66966
64985 66966 67211 66533 65047 63263 61586 60123 58942 58140 57614 57183 57001 57393 58128 58447 58061 57665 58012
64968 58012 58925 59631 59769 59641 59682 60090 60760 61253 61019 60044 59082 58842 59155 59329 59144 58974 59051 59187 59365 60025
64948 60025 61418 62942 63550 62824 61406 60332 60056 60259 60451 60491 60487 60524 60759 61506 62803 63987 64172 63225
64930 63225 61875 60805 60058 59427 58932 58628 58363 58103 58176 58828 59712 60215 60149 59866 59827 60260 61087 61928 62338
64911 62338 62276 62202 62524 63120 63588 63750 63670 63387 62960 62624 62579 62670 62568 62188 61742 61439 61352 61505 61869 62253 62417
64890 62417 62295 62049 61932 62134 62669 63372 64109 64888 65587 65688 64744 63106 61749 61209 61210 61489 62365 64032 65861
64871 65861 66995 67316 67213 66721 65625 64225 63256 62943 62751 62236 61617 61341 61494 61847 62146 62204 61975 61680
64853 61680 61603 61668 61468 60797 59949 59413 59449 59969 60588 60822 60514 60045 59815 59620 58981 58069 57714 58339 59472 60589
64833 60589 61813 63279 64373 64354 63500 62796 62560 62183 61366 60752 60910 61362 61321 60933 60975 61527 61738 61074 60081
64814 60081 59611 59842 60427 61165 62101 63211 64376 65494 66306 66408 65789 65089 64892 64982 64765 64259 64125 64799
64796 64799 66088 67599 69066 70252 71022 71481 71612 70899 68963 66550 65093 65092 65616 65687 65452 65537 65947 66179
64778 66179 66043 65730 65307 64659 63795 62901 62206 61986 62413 63192 63698 63696 63575 63622 63589 63315 63255 63892 64999 65951
64758 65951 66456 66524 66147 65544 65331 65860 66659 67079 67147 67223 67172 66594 65675 65064 65013 65285 65779 66562 67406 67922 68129
64737 68129 68273 68198 67543 66486 65604 65076 64746 64812 65581 66539 66630 65683 64666 64253 64081 63835 64103 65439 67295
64718 67295 68659 69308 69717 70098 70276 70284 70399 70619 70635 70331 69835 69138 68100 66912 66148 66175 66680 66993 66877
64699 66877 66901 67870 69797 71606 72220 71826 71673 72490 73649 74126 73877 73790 74499 75707 76645 76860 76478 75890
64681 75890 75314 74683 73972 73497 73623 74258 74924 75335 75546 75494 74972 74277 74338 75654 77433 78321 77827 76600 75470
64662 75470 74794 74646 75024 75637 75920 75562 74832 74254 74105 74334 74714 74951 74812 74296 73559 72639 71495 70376
64644 70376 69824 70053 70579 70788 70689 70734 70965 70857 70096 69040 68185 67581 67160 67226 68062 69192 69669 69165 68286
64625 68286 67663 67268 66846 66569 66814 67593 68557 69381 69895 70013 69894 70008 70723 71918 73231 74460 75426 75747
64607 75747 75230 74369 73981 74345 75067 75697 76063 76055 75625 75120 75119 75791 76749 77664 78581 79476 79951 79729 79107 78559
64587 78559 78043 77118 75661 74146 73163 72895 73191 73925 75087 76526 77811 78506 78505 77978 77060 75906 74998 74986
64569 74986 75984 77310 78204 78602 78934 79399 79808 79967 79884 79664 79483 79525 79678 79519 78978 78721 79449 80943 82294
64550 82294 82941 82931 82308 80947 79123 77653 77256 78023 79539 81113 81987 81843 81179 80739 80628 80479 80300 80428
64532 80428 80641 80284 79447 79080 79492 79620 78432 76333 74454 73190 72282 71859 72356 73458 74048 73466 72275
64515 72275 71586 71970 73095 74121 74376 73886 73309 73186 73379 73397 73080 72630 72174 71689 71337 71434 72026 72765 73313
64496 73313 73629 73828 73962 74030 74091 74240 74445 74452 73923 72827 71676 71177 71569 72436 73233 73801 74302 74881 75507 75946
64476 75946 75785 74749 73128 71693 70993 70920 71088 71378 71934 72827 74006 75405 76876 78117 78855 79082 79003
64459 79003 78874 78943 79363 80045 80739 81332 81916 82529 83050 83410 83683 83919 84153 84599 85512 86747 87770 88167 87889
64440 87889 86988 85572 84135 83391 83508 83880 83839 83211 82080 80571 79177 78673 79254 80217 80947 81767 83279
64423 83279 85249 86783 87389 87397 87519 88388 90197 92317 93547 93287 92219 91374 90861 90127 89134 88479 88440 88607
64405 88607 88561 88343 88177 88161 88248 88174 87501 86184 84954 84603 85010 85360 85182 84581 83611 82198 80699 79800 79661
64386 79661 79804 80012 80643 81781 82835 83363 83722 84387 85107 85329 85175 85349 86166 87126 87541 87291 86850 86746
64368 86746 87022 87195 86726 85507 83881 82300 81158 80828 81505 82974 84744 86470 88057 89380 90288 90963
64352 90963 91877 93168 94265 94402 93395 91775 90253 89186 88513 88064 87869 88135 88917 89921 90749 91230 91439
64335 91439 91486 91458 91446 91481 91540 91724 92250 93170 94378 96073 98760 102375 105789 107814 108552 109066 109793 109961 108742
64316 108742 106380 103938 102322 101750 101821 101911 101790 101889 102604 103352 102942 101101 99105 98545 99794 101955 103944
64299 103944 105228 105841 106141 106519 107077 107662 108284 109280 110853 112615 113802 113889 112966 111757 111345 112513 115131
64282 115131 118358 121626 125130 129232 133741 138121 142109 145734 148866 151236 152947 154598 156711 159148
64268 159148 161177 162095 161702 160218 157836 154554 150567 146602 143493 141391 139650 137587 135166 132885 131232
64253 131232 130318 129869 129442 128745 127738 126367 124471 122273 120678 120477 121317 122063 122286 122722 124103 126245
64237 126245 128667 131369 134381 137150 139189 141010 143633 147293 151335 155282 159225 163145 166602 169384
64223 169384 171880 174481 177047 179255 181090 182637 183689 183891 183084 181281 178530 175104 171604 168533 165866
64208 165866 163318 160903 158901 157370 156098 155056 154553 154798 155619 156731 157976 159133 159875 160223 160738 161810
64192 161810 162922 163121 162253 161269 161144 161825 162420 162137 160902 159350 158401 158592 159619 160751 161745 162975 164527
64175 164527 165778 166254 166397 166896 167670 168253 168869 170269 172528 174860 176781 178688 180966 183327 185492 187972
64159 187972 191552 196353 201958 208186 215201 223026 231531 240873 251454 263298 275785 288099 299740
64146 299740 310495 320188 328595 335453 340334 342587 341676 337723 331624 324431 316624 308158 299205 290440
64132 290440 282391 274844 267328 260023 253649 248436 243735 238791 233525 228377 223787 220063 217438 215815
64118 215815 214624 213252 211628 210274 209783 210299 211360 212161 212091 211151 209860 208863 208698 209717 211832 214395
64102 214395 216761 219063 222081 226222 231075 236142 241551 247725 254687 262120 269936 278363 287573 297484
64088 297484 307984 319103 330950 343490 356270 368387 378974 387802 395179 401153 405157 406641
64076 406641 405759 403129 399136 393751 386924 378823 369791 360306 351012 342571 335391 329480 324478 319931
64062 319931 315730 312277 309952 308475 307148 305804 305057 305457 306820 308660 310872 313642 317086 321384 326967
64047 326967 334082 342328 351064 360204 370230 381531 394093 407752 422332 437532 453056 468967
64035 468967 485673 503391 521694 539629 556269 571267 584886 597389 608485 617634 624848 630787
64023 630787 635951 640239 643457 645677 646733 645920 642798 637929 632259 626031 618912 610939 602670 594554
64009 594554 586836 580097 575166 572395 571547 572535 575658 580921 587657 595172 603402 612627 622872 633935
63995 633935 645809 658709 672769 687959 704387 722534 743076 766365 792031 819215 847325
63984 847325 876553 907731 941880 979882 1022135 1068275 1117519 1169600 1225057 1284364 1347272
63973 1347272 1413554 1483982 1559892 1642062 1730877 1827507 1933990 2052142 2183354 2329926
63963 2329926 2495955 2686640 2907437 3164329 3464292 3814872 4223813 4699508 5251014
63954 5251014 5886370 6610461 7424475 8326654 9312665 10375364 11505125 12690657 13918810
63945 13918810 15172971 16431502 17667517 18850074 19946443 20925284 21759988 22430776
63937 22430776 22924812 23234766 23356742 23288381 23028326 22577932 21944276 21142082 20193283
63928 20193283 19125248 17968976 16756812 15518995 14280459 13060387 11874598 10737857
63920 10737857 9663814 8663467 7744438 6911417 6166355 5507974 4931693 4430633 3996904
63911 3996904 3622305 3298844 3019358 2777762 2568554 2386380 2226517 2085525 1960974
63902 1960974 1850533 1751722 1662538 1581807 1508692 1442095 1380730 1323551 1269931 1219485 1171847
63891 1171847 1126487 1082663 1039718 997472 956155 915805 875979 836339 797459 760616 726613
63880 726613 695006 664798 635792 608853 584734 562986 542436 522524 503716 486587 470988
63869 470988 456318 442224 428742 416044 404357 393895 384542 375808 367417 359800 353631 349017 345523
63856 345523 342896 341293 340799 341174 342196 343921 346440 349652 353418 357722 362533 367668 372810 377493 381114
63841 381114 383237 383936 383549 382028 378843 373643 366742 358765 350067 340672 330579 319936 309020 298189
63827 298189 287698 277544 267631 258164 249604 242104 235283 228751 222600 217134 212353 208022 204040 200317
63813 200317 196448 192008 187286 183187 180160 177608 174754 171790 169628 168581 167925 166949 165919 165594 166145
63798 166145 167065 167959 168821 169552 169794 169450 168928 168561 168140 167221 165613 163315 160354 157007 153910 151530 149717
63781 149717 148037 146336 144678 143054 141539 140505 140152 140039 139539 138635 137751 136986 136067 135011 134195 133675
63765 133675 133006 131834 130266 128620 127294 126892 127860 129789 131650 132894 133818 134700 135242 135240 135176 135628 136515
63748 136515 137404 138201 139035 139783 140262 140724 141649 143107 144768 146508 148613 151433 155135 159771 165288 171545
63732 171545 178541 186513 195548 205266 215269 225781 237358 249888 262235 273069 281863 288983 295029
63719 295029 300151 303848 305284 303902 299821 293670 286121 277622 268414 258576 248192 237695 228013 220001
63705 220001 213589 207728 201395 194579 188128 182729 178269 174220 170466 167429 165429 164173 163039 161771
63691 161771 160700 160378 161141 162873 164964 166584 167440 168235 170044 173159 176999 181270 186675 194078 203424
63676 203424 213971 225311 237496 250274 262856 274604 285450 295362 303789 309913 313219 313528 310720
63663 310720 304817 296312 286097 274949 263243 251268 239587 228894 219473 211002 202999 195418 188725
63650 188725 183375 179362 176313 173846 171738 169862 168222 167146 167224 168832 171658 174820 177570 179857 182222
63635 182222 185181 188884 193285 198353 203905 209457 214619 219724 225768 233541 242970 253480 264874 277588
63621 277588 292131 308509 326309 345155 364918 385594 407197 429787 453323 477269 500459
63610 500459 521498 539238 552778 561324 564545 563141 558642 552490 545580 538736 533045 529159 526578
63597 526578 524143 521140 517461 512805 506398 497754 487286 475868 464004 451642 438577 424801 410541
63584 410541 396182 382132 368701 356097 344534 334221 325219 317387 310488 304357 299014 294673 291519
63571 291519 289438 288136 287664 288574 291321 295764 301508 308518 317025 327111 338791 352326 367876 385001
63557 385001 403165 422666 444418 468671 494703 521881 550178 579068 606595 630295 648822
63546 648822 662196 670825 675036 675585 673985 672071 671358 672726 676323 681616 687723 693864 699477 703921
63532 703921 706129 704631 698026 685654 667821 645307 618837 589270 558101 527186 497701 469701
63520 469701 442845 417255 393479 371998 353012 336451 321925 308925 297281 287236 278912 271985
63508 271985 266065 261099 257147 254034 251530 249644 248445 247835 247721 248190 249259 250738 252673 255632 260147
63493 260147 266021 272608 279697 287791 297529 309120 322199 335982 349616 362681 375411 388251
63481 388251 401238 413839 425236 434594 441245 444892 445639 443726 439348 432766 424427 414874 404615
63468 404615 394074 383447 372695 362012 352172 343886 336843 330034 323103 316603 310687 304464 297300
63455 297300 289932 283550 278433 274372 271786 271247 272108 272837 272893 273333 275427 279487 285274 292689 301583 311455
63439 311455 321869 332933 345152 359045 374950 392773 411847 431476 451718 473179 495987
63428 495987 519567 543715 569313 597479 628281 660706 693610 726179 757429 785662 808674
63417 808674 824637 832875 833944 829071 819668 807343 793968 781134 769433 758529 747998 737849
63405 737849 728112 718144 706568 691980 673818 652592 629223 604208 577652 550100 522855 497225
63393 497225 473827 452837 434452 418625 404845 392806 382956 375640 369984 364568 359212 355246 353891
63380 353891 355118 358309 363144 369432 376805 385203 395218 407382 421478 437043 454263 473858 496178
63367 496178 520862 547287 575038 603979 634159 665578 697734 729329 758534 783610 803316
63356 803316 816892 823967 824657 819781 810851 799595 787357 775030 763490 753653 745763 738960 731925
63343 731925 723789 714049 701989 686851 668504 647343 623585 597305 569251 540974 513940 488927
63331 488927 466346 446513 429337 414244 400677 388338 376910 366117 356257 348124 342119 337943
63319 337943 335295 334191 334287 334608 334559 334669 335764 337795 340003 341832 343116 343717 343663 343406 343251 342662 340744
63302 340744 337376 333356 329463 325920 322765 320145 318028 316097 314167 312514 311610 311615 312175 312585 312272 311300
63286 311300 310356 310059 310354 310788 311219 311954 313274 315129 317279 319425 321175 322242 322818 323542 324938 326959
63270 326959 329149 331102 332748 334252 335801 337491 339404 341739 344711 348264 351964 355278 357969 360216
63256 360216 362418 364907 367766 370855 374031 377323 380875 384802 389193 394118 399491 405045 410713 416909
63242 416909 424168 432573 441860 451994 463205 475548 488982 503985 521451 541693 563997 587591
63230 587591 612679 640080 670097 702173 735535 769654 804001 837593 869106 897643 923531
63219 923531 948239 973194 998721 1024342 1049888 1075759 1102123 1128578 1154710 1180241 1204275
63208 1204275 1225088 1241202 1252046 1257087 1254925 1244124 1224635 1197709 1164655 1126409 1084072 1039016
63196 1039016 992433 945455 899779 857407 819444 785563 754891 727114 702612 681865 664943
63185 664943 651415 640731 632851 628305 627295 628918 631744 635203 639957 646856 655896 666243 676807
63172 676807 686708 695635 704087 712993 722813 733066 742892 751963 760771 770054 779937 789573 797684 803468
63158 803468 806867 807921 806258 801480 793743 783579 771369 757443 742464 727181 711892 696660
63146 696660 682002 668741 657097 646467 636297 626704 618037 610217 602823 595579 588603 582311 577148
63133 577148 573151 569766 566364 562907 559783 557006 554122 550983 548093 545947 544416 543043 541635 540335
63119 540335 539439 539332 540290 542155 544554 547643 552211 558754 566751 575107 583022 590249 596991 603936 611955
63104 611955 621179 630573 638930 646107 652852 659702 666644 673728 681241 689084 696519 702872 708152 712846
63090 712846 717361 721819 726024 729404 731324 731805 731810 732464 734037 735871 737295 738334 739492 741020 742656
63075 742656 744110 745679 748179 752191 757475 763251 768970 774676 780704 787328 794824 803663 814448 827621
63061 827621 843282 861180 880895 902261 925733 952192 982195 1015533 1051793 1091287 1135075
63050 1135075 1183913 1237438 1294657 1355097 1419124 1487051 1558189 1631067 1704467 1777967 1851362
63039 1851362 1923921 1994629 2063071 2129661 2194807 2258262 2319651 2379336 2438193 2496550 2553856
63028 2553856 2609358 2662348 2711293 2753295 2785075 2804392 2810059 2801003 2776128 2735174 2679036 2609082
63016 2609082 2526882 2434887 2336706 2236020 2135416 2036593 1941235 1851021 1766918 1689190 1618230
63005 1618230 1554936 1500116 1453925 1416057 1386157 1363792 1348300 1338919 1335041 1336217 1342059 1352247
62993 1352247 1366488 1384227 1404452 1425962 1447905 1470031 1492429 1515107 1537729 1559641 1580074
62982 1580074 1598462 1614642 1628705 1640491 1649166 1653380 1651947 1644420 1631070 1612353 1588377 1558845
62970 1558845 1523526 1482979 1438839 1393162 1347264 1301340 1255386 1210271 1167550 1128208 1092020
62959 1092020 1058249 1026681 997811 972213 949959 930525 913136 897297 883089 870859 860648
62948 860648 852100 844929 839154 834728 831216 828024 824775 821320 817628 813800 809972 806036 801691 796938
62934 796938 792174 787518 782418 776417 770056 764443 759936 755782 751162 746116 741215 736676 732106 726980
62920 726980 721120 714814 708574 702687 696902 690676 683821 676780 670100 663772 657312 650427 643363 636515
62906 636515 630015 623905 618514 614308 611318 609074 607211 605863 605184 604792 604036 602779 601525 600744 600301
62891 600301 599517 597601 594096 589280 584122 579600 575984 572937 570157 567562 565046 562590 560682 560075 560986
62876 560986 562970 565635 568942 572651 576132 579064 581838 584874 588045 591190 594703 599069 604117 609252
62862 609252 614174 618989 623833 628826 634107 639556 644738 649466 654075 658701 662691 665242 666256 666072
62848 666072 664823 662776 660916 660218 660423 660375 659556 658466 657395 655792 653130 649681 645994 642192 638210
62833 638210 634236 630372 626192 621144 615280 609178 603199 597084 590366 582994 575487 568482 562232 556572
62819 556572 551294 546256 541178 535733 530050 524735 520116 515857 511666 507977 505393 503816 502786 502468
62805 502468 503538 506133 509610 513453 517815 522963 528724 534711 540849 547505 555291 564633 575280 586406
62791 586406 597614 609656 623732 640253 658804 679051 701009 724668 750217 778636 811209
62780 811209 848321 889540 934998 985853 1043145 1107087 1177819 1255983 1341915 1434954 1534163
62769 1534163 1639183 1749701 1864502 1981645 2099197 2215023 2326073 2428579 2519158 2595415
62759 2595415 2655538 2697690 2720048 2721421 2701892 2662815 2606115 2533702 2447749 2351161 2247121
62748 2247121 2138174 2026290 1913723 1802980 1695662 1592088 1492470 1397874 1309585 1228060
62738 1228060 1153045 1084295 1021653 964722 912923 865759 822722 783247 747035 714123 684422
62727 684422 657489 632954 610747 590680 572274 555283 539874 525952 512876 500303 488805
62716 488805 479139 471320 464932 459836 455928 452603 449265 446150 444038 443314 443935 446110 450286 456463 464100
62701 464100 472812 482714 494084 507164 522273 539703 559435 581282 605376 632225 662332 695945
62689 695945 733060 773332 816047 860399 905667 950902 994726 1035747 1073009 1105673 1132534
62678 1132534 1152327 1164378 1168518 1164436 1151621 1130088 1100906 1065991 1027434 986840 944967 902018
62666 902018 858334 814687 771892 730601 691577 655627 622835 592409 563745 537149 512958
62655 512958 490611 469493 450292 434327 421546 410284 399281 388920 380013 372281 364804 357396
62643 357396 350594 344413 337937 330456 322539 315576 310437 306839 303937 301110 298055 294551 290640 286897
62629 286897 283996 281916 280018 277998 276261 275210 274686 274431 274583 275301 276315 277269 278132 278937 279589 280371
62613 280371 282100 285152 288759 291961 294873 298252 302240 306457 311116 317010 324354 332559 341281 350864
62599 350864 361554 373135 385726 400182 417198 436612 458081 482050 509561 541360 577603
62588 577603 618269 663422 713058 766781 823691 882626 942639 1003118 1063160 1120916 1173828
62577 1173828 1219501 1256184 1282767 1298890 1304955 1301469 1288354 1265414 1233452 1194348 1149975 1101639
62565 1101639 1050716 999078 948419 899531 852580 807814 765740 726827 691249 658696 628408
62554 628408 599735 572768 548066 525695 504970 485232 466401 448571 431618 415547 400832
62543 400832 387935 376724 366655 357341 348743 341055 334618 329668 325911 322555 319001 315307 311939
62530 311939 309372 308043 308171 309289 310343 310737 311049 312289 314660 317508 320385 323682 328091 333762 340190
62515 340190 346816 353697 361580 371266 382905 396038 410400 426507 445204 466705 490283 514960
62503 514960 540416 567021 594839 622716 648729 671700 691904 709888 724926 735256 739804 739010
62491 739010 733863 724801 711906 695669 676991 656684 635324 613445 591534 569950 549104 529582
62479 529582 511839 495914 481626 468938 457965 448762 441245 435173 430088 425514 421457 418507 417267
62466 417267 417823 419869 423010 426695 430253 433500 437144 442102 448432 455336 462227 469405 477628 487386
62452 487386 498718 511349 524731 538188 551301 564064 576448 587914 597594 604901 609665 611694
62440 611694 610507 605669 597208 585555 571251 554936 537451 519593 501819 484405 467841 452712
62428 452712 439152 426799 415404 405122 396102 388231 381592 376805 374486 374546 376344 379354 383402 388484
62414 388484 394742 402472 411779 422287 433453 445001 456813 468662 480418 492252 504133 515308
62402 515308 524738 531968 537157 540498 542093 542119 540486 536507 529630 520464 510329 499911 489162 478503
62388 478503 468996 460962 453450 445729 438595 433457 430702 429659 429798 431205 434184 439124 446689 457425
62374 457425 471118 487107 505321 526590 551705 580613 612725 647812 686241 728401 774171
62363 774171 823113 874974 929667 986640 1044481 1101348 1155628 1206098 1251739 1291722 1325323
62352 1325323 1351477 1368647 1375702 1372920 1361741 1343681 1319899 1291500 1259486 1224404 1186725 1147578
62340 1147578 1108310 1069295 1030065 990840 953040 917914 885527 855566 828175 803317 780088
62329 780088 757636 736253 716687 698837 682049 666321 652286 640163 629694 621020 614632 610305
62317 610305 606913 603554 600117 596513 592165 586767 580940 575441 569988 563445 555037 544937 533703 521685
62303 521685 509219 497005 485852 476032 467193 459035 451858 446227 442274 439583 437712 436543 436176 436797
62289 436797 438668 441947 446426 451706 457650 464355 471704 479343 487215 495674 504933 514735 524755 534889
62275 534889 545027 555068 565399 576788 589384 602295 614700 627023 640537 656181 674342
62264 674342 695449 719963 747818 778592 812392 850050 892285 939037 989731 1043606 1099382
62253 1099382 1154844 1207169 1253818 1293037 1323543 1343980 1353089 1350672 1338255 1318284 1292421 1260821
62241 1260821 1223210 1180387 1134378 1087303 1040343 993763 947721 903007 860954 822559 787869
62230 787869 756531 728746 705094 685423 668641 653836 640925 629839 619836 610289 601616 594598
62218 594598 589101 584246 579610 575461 571876 568513 565459 563573 563583 565214 567552 570010 572672 575913 580015
62203 580015 585170 591652 599746 609404 620147 631609 644144 658506 674895 692824 712066 733082
62191 733082 756076 780234 804543 828940 853832 878674 901891 922290 939861 954985 967458
62180 967458 976679 982462 985384 986538 987178 988403 990949 995251 1001765 1011198 1024472 1042412 1065317 1092775
62166 1092775 1124017 1158446 1195513 1234092 1272344 1308331 1340424 1367083 1386975 1399810 1406599
62155 1406599 1408592 1406315 1400001 1390356 1378139 1363325 1345509 1325004 1302880 1280050 1256991 1234272
62143 1234272 1212632 1192500 1174033 1157583 1143498 1131375 1120165 1109138 1098233 1087469 1076713
62132 1076713 1066267 1057028 1049678 1044072 1039702 1036412 1034456 1034159 1035718 1039122 1044127 1050565 1058675 1068784
62118 1068784 1080607 1093274 1106258 1119964 1135151 1151976 1169801 1187867 1206042 1224926 1245217
62107 1245217 1266980 1289704 1313066 1337315 1362732 1389181 1416561 1445279 1475781 1507915 1541356
62096 1541356 1576387 1613692 1653561 1695941 1741095 1789524 1841279 1895986 1953480 2013789 2076555
62085 2076555 2141132 2207107 2273946 2340227 2404208 2465301 2524093 2580710 2634204 2683992 2730946
62074 2730946 2776307 2820151 2861578 2899905 2935056 2967309 2997455 3026997 3057507 3089801 3124026
62063 3124026 3160246 3198285 3237034 3274515 3308996 3339965 3368043 3394079 3418441 3441227 3463002
62052 3463002 3484836 3507300 3529792 3551404 3572216 3593071 3614297 3635668 3657668 3681693 3708488
62041 3708488 3737258 3767030 3798149 3831602 3867351 3904210 3941129 3977741 4013755 4048534 4081348
62030 4081348 4111508 4138241 4160891 4179211 4193015 4201597 4204076 4200444 4191753 4179095 4162828 4143092
62018 4143092 4120697 4097025 4073086 4048986 4024397 3999375 3974630 3951200 3930061 3911994 3897521
62007 3897521 3886825 3879942 3877141 3878941 3885524 3896386 3910846 3928687 3949886 3973842 3999309 4025009
61995 4025009 4049798 4072293 4091019 4105280 4115466 4122266 4125948 4126655 4125027 4122132 4118946 4116088 4113800
61982 4113800 4111892 4109803 4106839 4102241 4095104 4084612 4070567 4053381 4033398 4010500 3984505 3955514
61970 3955514 3923575 3888333 3849470 3807397 3763198 3717923 3672063 3625664 3578768 3531753 3485202
61959 3485202 3439418 3394233 3349484 3305560 3263200 3222977 3185404 3151331 3121532 3095901 3073775
61948 3073775 3055274 3041551 3033350 3029958 3030152 3033696 3041294 3053316 3069154 3087667 3107816 3128921
61936 3128921 3150732 3173274 3196458 3219912 3243257 3266271 3288555 3309436 3328466 3345768 3361559
61925 3361559 3375695 3388227 3400302 3414114 3432006 3455889 3487407 3528194 3579838 3643803 3721578
61914 3721578 3814926 3926071 4057585 4211976 4391409 4598116 4835203 5106986 5418741 5776622
61904 5776622 6187757 6659532 7197737 7804651 8477793 9208613 9980386 10766275 11529088
61895 11529088 12223317 12799446 13210469 13419773 13408036 13176685 12747017 12155548 11446970
61886 11446970 10666779 9855835 9047699 8267862 7533826 6855956 6239047 5683907 5188447
61877 5188447 4748711 4359998 4017468 3716172 3451243 3218430 3014140 2834863 2677069
61868 2677069 2537955 2415736 2308974 2216084 2135833 2067700 2011167 1965016 1927811 1898749 1877661
61857 1877661 1864587 1859708 1863195 1874452 1891845 1913714 1939322 1968307 1999629 2031717 2063270 2093085
61845 2093085 2119331 2139816 2153145 2159118 2158249 2151547 2140699 2127700 2114158 2101407 2091157 2085253
61833 2085253 2084614 2088894 2097215 2108586 2121551 2134199 2144898 2152533 2155753 2152641 2141634 2122516 2096093
61820 2096093 2063254 2024848 1982268 1937505 1892385 1848061 1805415 1765667 1730248 1700091 1675374
61809 1675374 1656080 1642577 1635323 1634231 1638737 1648588 1664107 1685517 1712456 1744511 1781927 1825317
61797 1825317 1874834 1930104 1991062 2058531 2133765 2217576 2310106 2411532 2522902 2646147 2783342
61786 2783342 2936274 3106902 3297867 3512233 3753237 4025055 4333663 4686288 5090170
61777 5090170 5552764 6083179 6692407 7391820 8192251 9104342 10137606 11296616 12576648
61768 12576648 13961097 15419453 16904289 18349538 19673732 20788540 21610186 22072122
61760 22072122 22137239 21805424 21112438 20120995 18908833 17557373 16142099 14725874 13356511
61751 13356511 12067483 10879227 9800677 8832280 7969820 7206629 6533947 5941690 5420210
61742 5420210 4961132 4556633 4199091 3882095 3601029 3352100 3131351 2935059 2760476
61733 2760476 2605516 2468045 2345906 2237339 2140852 2054865 1977722 1907862 1843792 1784201
61723 1784201 1728366 1676221 1627821 1582881 1540930 1501585 1464610 1430036 1398347 1370147 1345492
61712 1345492 1323849 1304819 1288486 1274902 1263665 1254272 1246467 1239917 1233812 1227187 1219545 1210986 1201819
61699 1201819 1192195 1181964 1170818 1158677 1145906 1132888 1119470 1105192 1090115 1074956 1060210
61688 1060210 1045506 1030115 1013852 997218 980773 964622 948562 932660 917571 904076 892204
61677 892204 881127 870229 860033 851613 845368 840846 837643 835738 834942 834782 835186 836662 839482 843116
61663 843116 846769 850084 853057 855756 858510 862009 866752 872543 878750 884859 890601 895901 900966 906117
61649 906117 911186 915365 917999 919311 919913 919783 918179 914501 908847 901682 893425 884564 875887 868263 862236
61634 862236 857998 855693 855493 857329 860780 865480 871475 878874 887213 895457 902698 908536 912720 914930
61620 914930 915196 914192 912789 911530 910783 910988 912242 913944 915349 916414 917660 919285 920866 921862 921999
61605 921999 921179 919393 916755 913347 909078 903897 897936 891244 883638 875168 866381 857685 848872 839756
61591 839756 830882 822890 815513 808077 800743 794359 789251 785121 782127 780950 781653 783503 786261 790630
61577 790630 797015 804834 813740 824662 838828 856307 876254 898063 921518 946270 972076 999429
61565 999429 1029175 1061411 1095285 1129837 1164486 1198680 1231594 1262487 1291187 1318078 1343750
61554 1343750 1368658 1392954 1416476 1438899 1459867 1478997 1495839 1509876 1520539 1527258 1529559 1527168
61542 1527168 1520091 1508753 1494033 1476829 1457521 1436177 1413375 1390329 1367884 1345992 1324623
61531 1324623 1304675 1287216 1272249 1259019 1247299 1237573 1230158 1225023 1222343 1222283 1224370 1228136 1234556
61518 1234556 1245753 1263007 1285906 1313794 1347035 1386461 1432560 1485904 1547656 1619003 1700687
61507 1700687 1793644 1899566 2020299 2157195 2311517 2484870 2678548 2892740 3126692 3378846
61497 3378846 3645909 3921833 4198013 4464069 4708130 4917436 5080366 5189007 5240328 5235653
61487 5235653 5179482 5078385 4940136 4773275 4586851 4389625 4188938 3990447 3798819 3618014
61477 3618014 3450674 3297925 3160271 3038257 2932046 2841029 2764452 2702006 2653437 2618088
61467 2618088 2595266 2584587 2585517 2596953 2617583 2646233 2681648 2722617 2768572 2819238 2873216 2927734
61455 2927734 2980433 3030669 3078465 3123168 3164171 3202114 3238131 3272378 3304669 3336327 3370045
61444 3370045 3407703 3449285 3494102 3542100 3593543 3648077 3704578 3761658 3818097 3872922 3925091
61433 3925091 3972960 4014288 4046943 4069413 4080517 4079326 4065901 4041589 4007954 3965785 3915780
61422 3915780 3859729 3800182 3739284 3678730 3620483 3566462 3517495 3473540 3435028 3403193 3378896
61411 3378896 3361893 3351464 3347082 3348192 3353951 3363501 3376071 3390481 3404911 3417404 3426408 3430730
61399 3430730 3429372 3421717 3407910 3389107 3367457 3345608 3325903 3309988 3299251 3295384 3300368 3316269
61387 3316269 3345375 3390219 3452962 3534941 3637100 3760620 3906775 4076518 4270587 4489589
61377 4489589 4733245 4999525 5284630 5583174 5887591 6187663 6471522 6727455 6944872
61368 6944872 7114631 7230026 7288220 7290507 7241206 7146368 7012792 6846977 6654368 6439611
61358 6439611 6207350 5962511 5710070 5454903 5201488 4953214 4712230 4480309 4259388
61349 4259388 4050764 3854417 3670015 3498219 3340191 3196283 3066182 2950043 2848333
61340 2848333 2760716 2686157 2624103 2574570 2537095 2510671 2494752 2489207 2493213 2505311 2524756 2551675
61328 2551675 2585482 2624223 2665967 2709858 2755326 2801286 2846808 2891765 2936081 2978993 3019705
61317 3019705 3058123 3094214 3127230 3156459 3182455 3206839 3230975 3255269 3279384 3302478 3323343
61306 3323343 3340830 3354216 3363015 3366596 3364277 3355655 3340720 3319786 3293370 3261749 3224592 3181504
61294 3181504 3133068 3080781 3025738 2968043 2907985 2847160 2787701 2730757 2676493 2625482 2579338
61283 2579338 2539790 2507581 2482454 2463829 2451203 2444087 2441923 2444159 2450303 2459693 2471209 2483338
61271 2483338 2494736 2504677 2512865 2518921 2522252 2522328 2518852 2511703 2500944 2486879 2469985 2450947 2430971
61258 2430971 2411975 2396221 2385796 2382590 2388470 2405094 2433687 2475283 2531045 2601978 2688384 2789750
61246 2789750 2904852 3031568 3166817 3306883 3447290 3581784 3701974 3798904 3865185 3895574
61236 3895574 3886684 3837737 3751704 3634531 3492842 3332974 3161935 2987617 2817024 2654698
61226 2654698 2503165 2364092 2238406 2125904 2025584 1936369 1857363 1787820 1727201 1674980
61216 1674980 1630192 1591495 1557835 1528782 1504220 1484103 1468506 1457336 1449935 1445566 1444380 1447276
61204 1447276 1454623 1465736 1479730 1496171 1514609 1534231 1554385 1574774 1594658 1612492 1626944
61193 1626944 1637890 1645954 1651532 1654779 1656152 1656313 1655547 1653564 1649761 1643601 1634954 1624163 1611448 1596330
61179 1596330 1578184 1557257 1534404 1509759 1482630 1453034 1422400 1392190 1362643 1333466 1304910
61168 1304910 1277284 1250043 1222337 1194114 1165878 1137654 1109090 1080388 1052300 1025283 999372
61157 999372 974837 952168 931342 911763 893097 875567 859126 842772 825120 805552 784654
61146 784654 763595 743204 723668 705054 687895 673017 660793 650932 643066 637204 633442 631528
61134 631528 630983 631419 632616 634568 637648 642384 648844 656410 664360 672403 680632 689356 699135 710549
61120 710549 723646 737926 753082 769365 786981 805601 824828 844768 865647 887147 908548
61109 908548 929351 949281 967788 983912 996710 1005580 1010231 1010565 1006710 999213 989179 977913 966073
61096 966073 953301 939113 924031 909262 895282 881393 866823 851650 836356 821115 805893
61085 805893 790786 775903 761292 747226 734076 721624 709049 696053 683597 673071 665004 658864
61073 658864 653805 649331 645541 642931 641628 640760 639143 636742 634769 634042 633930 633344 632055 630466 628625
61058 628625 626106 622549 617850 612238 606589 602133 599305 597349 595558 594383 594657 596305 598649 601666
61044 601666 606043 612083 619305 627185 635735 645265 655958 667687 679969 692198 704161 716061 727793
61031 727793 738497 747296 754284 760446 766737 773462 780307 786660 792185 797312 802881 809091 815180 820445
61017 820445 825175 830237 836122 842814 850239 858407 867291 876885 887297 898695 911429 926141 943267
61004 943267 962426 982962 1005211 1030614 1060453 1095181 1135062 1180438 1230954 1285415 1342840
60993 1342840 1402982 1465537 1529931 1596397 1666369 1741352 1822336 1910587 2007639 2113779 2227839
60982 2227839 2349449 2480630 2624849 2786455 2972389 3193258 3461842 3792354 4202432
60973 4202432 4714110 5352342 6146842 7138891 8382076 9928386 11809811 14029146 16550339
60964 16550339 19268337 21973693 24368074 26163041 27211793 27575986 27481279 27210454 27013902
60955 27013902 27061486 27404288 27934387 28387219 28430094 27805344 26435910 24430474 22009294
60946 22009294 19417213 16865836 14505401 12416574 10620606 9102776 7834286 6782596
60938 6782596 5914405 5198601 4608697 4122039 3718243 3379849 3093153 2846830 2630682
60929 2630682 2436931 2261571 2102955 1959615 1830210 1714326 1611749 1521442 1442157 1373209
60919 1373209 1313408 1259905 1209393 1160208 1112340 1065912 1020805 977478 936993 900119 867042
60908 867042 837792 812195 789521 768875 750011 733359 719263 707449 697038 686886 676241
60897 676241 665399 655501 647531 641794 638319 637022 637220 637765 638171 639054 641035 643817 646835 650157 654176
60882 654176 658850 663834 668905 673707 677560 680111 681809 683209 684174 684229 683258 681262 677883 672808 666382
60867 666382 659219 651459 642958 633897 624628 615104 605069 594793 585132 576876 570278 565129 561033 557723
60853 557723 555310 554108 554193 555459 558141 562763 569382 577437 586628 597401 610139 624413 639479 655126
60839 655126 671479 688265 704852 720929 736800 753001 769704 786278 801443 814226 824837
60828 824837 834244 843007 851141 858928 866903 874790 881448 886289 889868 892619 894012 893618 892110 890379
60814 890379 888344 885448 881615 876814 870410 861984 852325 842500 832288 820606 807210 792929 778387
60801 778387 763553 748498 733611 719036 704846 691834 681155 672997 666377 660540 655841 653027
60789 653027 652376 653857 657501 663119 670046 677516 685080 692551 699878 707261 715029 723180 731210 738498
60775 738498 744701 749801 754047 757892 761749 765781 770071 774764 779745 784363 787970 790750 793638 797410
60761 797410 802161 807640 813640 819953 826315 832605 838970 845677 852912 860641 868473 875821 882397 888464
60747 888464 894383 900133 905554 910766 915871 920378 923473 924911 925159 924591 923045 920431 917314 914473 911988
60732 911988 909072 904836 899035 892068 884443 876390 867916 859009 849696 840078 830459 821245 812489 803788
60718 803788 794937 786445 778852 771743 764105 755728 747416 739591 731508 722361 712484 702883 694147 686526
60704 686526 680580 676858 675110 674598 675147 677310 681543 687847 696155 706413 718071 730045 741374 751593
60690 751593 760340 767020 771081 772356 770959 766968 760332 750979 739021 724881 709228 692726 675974
60677 675974 659673 644581 631142 619343 609053 600259 592869 586660 581658 578230 576556 576341 577327
60664 577327 579632 583171 587128 590552 593215 595389 597043 597857 597928 597831 598013 598554 599482 600887 602778 605272
60648 605272 608811 613688 619404 625001 629991 634418 638077 640434 641541 642411 644034 646454 649216 652391
60634 652391 656587 662134 668820 676566 685860 697168 710150 723893 737891 752367 767480 782757
60622 782757 797643 812234 826822 841005 853953 865473 875974 885214 892007 895625 896758 896426 894485
60609 894485 889961 882606 873441 863869 854760 846289 838183 830126 822272 815309 809824 805737 802464 799257
60595 799257 795202 789521 782484 775610 770281 766242 762048 756890 751471 747153 744762 744226 744901 746088 747435
60580 747435 748892 750226 750895 750594 749644 748558 747545 746758 746625 747467 749037 750877 752848 754856 756479 757407
60564 757407 757954 758443 758295 756431 752488 747006 740539 733352 725997 719434 714287 710472 707802 706479 706733
60549 706733 708351 710858 714042 718107 723412 730171 738367 747981 759259 772675 788693 807922 831456
60536 831456 860489 895321 935127 978822 1025464 1073347 1119275 1159464 1190927 1211703 1220486 1217014
60524 1217014 1202673 1179972 1151423 1119278 1085997 1054153 1025826 1002420 984830 973345 967653
60513 967653 967405 972437 982001 994376 1007930 1022131 1036842 1051143 1063893 1075102 1085796 1096731
60501 1096731 1108334 1121801 1139195 1162291 1192070 1229389 1275469 1331790 1400297 1483578 1584024
60490 1584024 1702934 1841275 2001127 2185466 2396888 2637786 2911542 3221818 3569747
60481 3569747 3951968 4360236 4780385 5190738 5563323 5868845 6081709 6182520 6160099 6014662
60471 6014662 5759438 5417885 5018190 4588677 4154836 3736904 3348445 2996893 2685113
60462 2685113 2412493 2175901 1971325 1795172 1644109 1514437 1402547 1305816 1222494 1150884
60452 1150884 1089079 1035265 987783 945139 906394 871365 840076 812166 787096 764572 744370
60441 744370 726062 709262 693864 679626 665957 652610 640258 629760 620980 612931 605073 597935
60429 597935 592346 588385 585361 582686 580516 579434 579571 580375 581378 582818 585071 587812 590375 592787 595714
60414 595714 599328 603041 606490 609982 613673 617098 619965 622739 625944 629472 633082 636971 641238 645330
60400 645330 648709 651706 655093 659165 663825 669182 675317 681655 687298 692004 696274 700490 704459 707752
60386 707752 710018 710937 710354 708574 706287 704057 702011 699959 697663 695076 692447 690105 688064 686130 684487
60371 684487 683748 684184 685285 686480 687931 690102 692798 695261 697128 698755 700514 702300 703896 705495 707551
60356 707551 710336 713798 717788 722259 727321 733169 739912 747377 755129 762849 770716 779307 788966 799314
60342 799314 809543 819103 827881 835754 842353 847394 850884 852835 853141 851895 849447 845938 841361 836412
60328 836412 832629 831056 831275 832375 834297 837437 841426 845387 849030 852381 854670 854698 852275 848131 842492
60313 842492 835158 827073 820203 815278 811008 806252 801732 798745 797270 796380 795559 794559 792815 790203 787922
60298 787922 787492 789106 791782 794816 798287 802473 807566 813689 820433 826573 830949 833437 834523 834284 832503
60283 832503 829483 826017 822694 819778 817546 816063 814897 813676 812808 813096 814851 817865 821997 827271 833704
60268 833704 841590 851542 863625 876881 890490 905015 921656 940575 961005 982903 1007390 1035433
60256 1035433 1067007 1101825 1140060 1182021 1227864 1278114 1333965 1396553 1466199 1542660 1625893
60245 1625893 1716329 1814507 1920517 2033624 2152273 2274480 2398157 2521022 2640540 2754238
60235 2754238 2859999 2955857 3039893 3110730 3167872 3211098 3239687 3252757 3250303 3233441 3203744
60224 3203744 3162869 3112903 3056527 2996580 2935676 2876333 2821261 2773281 2734799 2707216 2690925
60213 2690925 2686154 2693845 2715300 2750972 2800244 2862683 2938796 3028945 3131994 3245688 3367980
60202 3367980 3497195 3631008 3765906 3897681 4022041 4135038 4233510 4315183 4378029 4419865
60192 4419865 4439153 4435929 4411337 4366417 4302076 4220198 4123992 4017070 3902789 3784697 3667059
60181 3667059 3554417 3450711 3358824 3280746 3217981 3171844 3143421 3133276 3141454 3167808 3211886
60170 3211886 3272238 3346214 3430787 3523294 3621058 3720700 3818324 3910122 3992481 4062021 4116255
60159 4116255 4154092 4175238 4179394 4166579 4137978 4095939 4043326 3983365 3919770 3856363 3796686
60148 3796686 3744416 3703612 3677650 3668048 3675099 3699594 3743285 3807879 3894470 4003922 4137040
60137 4137040 4294333 4476403 4684638 4920814 5185823 5479268 5800106 6146730 6516157
60128 6516157 6903817 7304338 7711985 8120124 8520909 8905901 9266885 9596312 9887575
60119 9887575 10135025 10333468 10478008 10565037 10593151 10562308 10472301 10323211 10117532 9860938
60109 9860938 9560880 9225579 8864706 8489706 8112238 7742504 7389184 7059833 6760263
60100 6760263 6493964 6263003 6069360 5914914 5800560 5726080 5690689 5693094 5731146 5802021
60090 5802021 5902583 6028957 6175616 6335310 6499960 6661410 6811592 6942887 7048993
60081 7048993 7125608 7170334 7182289 7162065 7111770 7034474 6933176 6810242 6667848 6508640
60071 6508640 6335628 6151645 5959513 5762886 5566292 5373889 5188423 5011724 4845805
60062 4845805 4692975 4555123 4433404 4328511 4240921 4171101 4119976 4088946 4078917 4089532
60052 4089532 4119934 4170052 4240270 4329785 4436009 4555724 4686066 4824053 4965722 5106170
60042 5106170 5240102 5362169 5467371 5551673 5612214 5646879 5654075 5633241 5585292 5512178 5416110
60031 5416110 5299455 5165312 5017910 4862292 4703567 4546373 4394819 4252456 4121828
60022 4121828 4004075 3899539 3809007 3733976 3675583 3633896 3608697 3600463 3610022 3637731 3683708
60011 3683708 3748587 3833321 3938432 4064013 4210021 4375607 4558053 4752988 4955461 5160048
60001 5160048 5360116 5548200 5717640 5863557 5982387 6071367 6128742 6153838 6146615 6107583
59991 6107583 6038283 5941350 5819969 5677785 5519435 5350609 5177381 5005610 4840630 4686616
59981 4686616 4546118 4420721 4312198 4222468 4152590 4102665 4072844 4063623 4074946 4105757 4154684
59970 4154684 4220535 4301871 4396721 4502839 4617588 4737356 4857843 4975304 5087056 5190708
59960 5190708 5283691 5363898 5430141 5481642 5517658 5538004 5543555 5536121 5518369 5493964 5467053 5441341
59948 5441341 5420279 5408235 5410606 5432410 5477479 5549328 5651962 5789269 5964312 6179677 6437800
59937 6437800 6740274 7087183 7477313 7908053 8374182 8866826 9373716 9879679 10366550
59928 10366550 10813704 11200167 11506924 11718064 11821785 11812276 11691175 11466997 11153446 10768052
59918 10768052 10330720 9861365 9377801 8895346 8427298 7984547 7574759 7202596 6870757
59909 6870757 6580547 6331995 6124446 5957348 5830272 5742428 5692680 5680045 5703814 5763299
59899 5763299 5857693 5985884 6145890 6334337 6546444 6776067 7015348 7254582 7482807 7688458
59889 7688458 7859626 7984666 8053806 8060750 8003083 7881864 7701387 7468985 7194253 6887992
59879 6887992 6561407 6225395 5889660 5562215 5249525 4956654 4686970 4442146 4222834
59870 4222834 4029208 3860778 3716226 3593811 3491633 3407259 3337516 3278995 3228453 3182602
59860 3182602 3138209 3092985 3046058 2997223 2946211 2893185 2839482 2787325 2739079 2697096 2663587
59849 2663587 2639718 2625026 2618272 2618610 2625163 2635650 2646249 2653031 2653139 2644777 2626854 2599065 2562080
59836 2562080 2517437 2467304 2414275 2361113 2310438 2264408 2224392 2190874 2163961 2144027 2131543
59825 2131543 2126381 2127905 2135989 2151339 2174510 2205263 2243453 2289928 2345727 2410569 2482769 2560274
59813 2560274 2640984 2722081 2799976 2871398 2934322 2987752 3030964 3063255 3084295 3094539 3095172 3087595
59801 3087595 3072971 3052384 3027429 3000488 2974480 2952494 2937497 2931874 2937128 2954319 2984900 3030901
59789 3030901 3094435 3177615 3283036 3413889 3573517 3765385 3993526 4262277 4574924 4932344
59779 4932344 5331982 5766269 6220560 6672429 7093298 7451520 7716457 7864115 7883124 7777584
59769 7777584 7564888 7270667 6923815 6552260 6179385 5822193 5491935 5195639 4936831
59760 4936831 4715876 4530930 4379039 4256717 4160532 4087906 4037118 4006301 3993044 3995385 4012619
59749 4012619 4044692 4091415 4152683 4228727 4319543 4424745 4544584 4680531 4834201 5006392
59739 5006392 5197933 5410880 5648134 5912367 6206026 6531805 6892261 7289330 7724816
59730 7724816 8200615 8717382 9273150 9863673 10483161 11123365 11772278 12415073 13036812
59721 13036812 13624381 14167329 14659046 15098241 15489323 15841871 16170155 16492047 16826354
59712 16826354 17190040 17597304 18059533 18583973 19171867 19818390 20513820 21243376 21985897
59703 21985897 22714277 23398555 24009441 24520709 24911170 25166748 25281895 25259966 25113082
59694 25113082 24861168 24529378 24144800 23734301 23323744 22937260 22596164 22318300 22117986
59685 22117986 22006208 21991394 22080961 22282405 22602896 23048464 23624128 24333830 25178615 26153890
59675 26153890 27247699 28439549 29698280 30980034 32228867 33380259 34365941 35119896
59667 35119896 35586149 35726581 35525789 34992515 34159092 33078351 31816518 30443750 29026558
59658 29026558 27623613 26282917 25039147 23912386 22908565 22019971 21225578 20493300
59650 20493300 19785449 19065797 18306062 17490665 16618668 15701969 14760738 13818478 12897930
59641 12897930 12017777 11190752 10424066 9721098 9082270 8505124 7985264 7518123 7099783
59632 7099783 6726510 6394419 6099660 5838324 5606275 5399878 5216896 5056037 4915787
59623 4915787 4794455 4690972 4604471 4533051 4473965 4425033 4384803 4351227 4321314 4292312 4262145
59612 4262145 4228444 4188333 4139728 4081982 4014873 3937924 3851316 3756724 3656715 3553890 3450930
59601 3450930 3350574 3254866 3164807 3081021 3004224 2934811 2872779 2818422 2772526 2735531 2707165
59590 2707165 2687218 2675896 2672985 2677258 2687211 2701855 2720452 2742060 2765831 2791215 2817405 2843001
59578 2843001 2866686 2887945 2906929 2924122 2940450 2957223 2975568 2996218 3020041 3048328 3082268
59567 3082268 3122532 3169573 3224015 3286587 3358123 3439780 3532892 3638489 3757340 3890491 4039270
59556 4039270 4204794 4388042 4590391 4813298 5057187 5321167 5603839 5903688 6218481
59547 6218481 6544951 6879304 7217442 7554590 7885596 8206214 8513777 8806529 9082951
59538 9082951 9342175 9584617 9811776 10025437 10226887 10416346 10593324 10758361 10914657
59529 10914657 11067346 11220799 11376669 11533816 11688516 11833957 11960231 12055676 12108546 12108060
59519 12108060 12045360 11914610 11713540 11443264 11108176 10716054 10277531 9804923 9311186
59510 9311186 8808934 8309082 7820044 7348468 6900203 6479665 6088702 5727379 5395987
59501 5395987 5095269 4824943 4583423 4369186 4181160 4017482 3875204 3751740 3645621
59492 3645621 3555539 3479933 3418077 3370411 3337105 3317161 3309466 3313723 3329904 3357879 3398351 3453167
59480 3453167 3523894 3610846 3714083 3834546 3973600 4132343 4312007 4514127 4739465 4987382
59470 4987382 5256648 5545670 5850935 6165919 6482308 6791439 7083771 7348045 7572458
59461 7572458 7746632 7862064 7911974 7892583 7804887 7654409 7449186 7198302 6911614 6599459
59451 6599459 6271938 5938337 5606740 5283621 4973796 4680833 4407213 4154105 3921657
59442 3921657 3709762 3518091 3345469 3190160 3051021 2927510 2818380 2721523 2635548 2560402
59432 2560402 2495855 2440521 2393198 2354089 2323649 2300989 2284493 2273381 2267709 2267327 2271697 2280221
59420 2280221 2291950 2305525 2320298 2337145 2357459 2381714 2409655 2441373 2477479 2518509 2564464
59409 2564464 2614263 2665207 2713918 2758758 2801032 2843679 2889844 2943229 3008317 3088733 3185954
59398 3185954 3300592 3434017 3587373 3759774 3949252 4155713 4382194 4633776 4916507
59389 4916507 5237056 5601687 6014581 6477105 6988060 7543505 8136139 8755401 9388307
59380 9388307 10020239 10635847 11220588 11762188 12251396 12682685 13055045 13371377 13636183
59371 13636183 13853839 14028817 14165733 14267482 14333469 14360275 14343366 14277480 14156732 13976427
59361 13976427 13735348 13436220 13085155 12692055 12270965 11838300 11410125 11000944 10623336
59352 10623336 10286174 9992373 9738945 9519135 9323940 9142492 8963091 8775050 8569911
59343 8569911 8341800 8087908 7808702 7507044 7187214 6855075 6518202 6184451 5860233
59334 5860233 5550436 5259061 4988781 4740394 4513912 4309892 4128756 3969334 3829392
59325 3829392 3707390 3602688 3514407 3441323 3382629 3337571 3304517 3281643 3268515 3265819 3273615
59314 3273615 3291018 3317549 3353566 3399217 3454182 3518687 3593764 3680149 3777666 3885782 4003959
59303 4003959 4131233 4266092 4406827 4551458 4697393 4841689 4981354 5112764 5231317
59294 5231317 5332772 5414894 5477150 5519411 5542148 5547622 5539655 5522225 5499242 5475373 5455730
59283 5455730 5444440 5444397 5458297 5488798 5537519 5604678 5689562 5790323 5903363 6023822 6146681
59272 6146681 6266618 6377344 6472526 6547506 6599286 6625299 6623832 6595787 6544630 6474175 6387445
59261 6387445 6287668 6179000 6065842 5952625 5844650 5748056 5668228 5608715 5571624 5557865
59251 5557865 5566637 5595599 5642075 5703531 5776947 5858679 5945278 6033735 6121040 6204632 6283748
59240 6283748 6359694 6434855 6512397 6596971 6694510 6810870 6951350 7121430 7326588 7570564
59230 7570564 7854129 8175230 8528887 8906162 9293818 9675469 10032884 10346938 10599101
59221 10599101 10773406 10857464 10842612 10724751 10505543 10192186 9796051 9332196 8819399 8278216
59211 8278216 7727386 7181844 6653379 6151342 5682131 5249186 4854220 4497828 4178826
59202 4178826 3894304 3641132 3416918 3219384 3045854 2893738 2760709 2644098 2541066
59193 2541066 2449690 2368983 2297555 2233209 2174185 2119929 2070310 2024962 1983686 1946505 1912936
59182 1912936 1882109 1853942 1829252 1808381 1790657 1775572 1763479 1754654 1748723 1745573 1746042 1751131
59170 1751131 1761203 1776208 1795859 1819262 1845314 1873967 1906310 1943135 1984228 2029219 2078065
59159 2078065 2130462 2185951 2245123 2309549 2380069 2456257 2538093 2626857 2723563 2827696 2938501
59148 2938501 3056528 3182767 3316895 3457282 3602085 3749358 3896508 4040464 4178120
59139 4178120 4306084 4420546 4518187 4597090 4656454 4695898 4715616 4716906 4702146 4674499 4637766
59128 4637766 4596134 4553876 4515518 4486004 4469874 4470325 4489753 4530996 4597015 4689454 4808782
59117 4808782 4955892 5132130 5337255 5568592 5822455 6094851 6379781 6667849 6947286
59108 6947286 7205642 7430149 7608158 7729054 7786312 7778287 7708530 7585968 7423359 7234264
59098 7234264 7031357 6826845 6631937 6454187 6296130 6157494 6037745 5935527 5846897 5766012
59088 5766012 5687549 5607605 5522746 5429384 5324240 5205048 5071070 4923307 4763740 4594067
59078 4594067 4415663 4230799 4042807 3854564 3667814 3484488 3307490 3139230 2980253
59069 2980253 2830190 2689270 2558029 2436335 2323745 2220263 2125889 2039931 1961504 1890220
59059 1890220 1825615 1766508 1711675 1660725 1613656 1569982 1528876 1489711 1452068 1415896 1382064
59048 1382064 1351967 1325978 1303050 1282374 1264514 1250257 1239231 1230481 1223585 1218338 1214163 1210784
59036 1210784 1208873 1209151 1211413 1215295 1221487 1231321 1245440 1263369 1283895 1305402 1326473 1346659 1366013
59023 1366013 1383558 1397222 1405826 1410100 1411085 1408766 1403275 1396337 1390232 1385911 1383194 1382222 1383696 1388222
59009 1388222 1396260 1408168 1423399 1440147 1456563 1471855 1485635 1497025 1505150 1509819 1510976 1508235
58997 1508235 1501776 1492993 1483430 1473797 1464678 1457232 1452270 1449445 1448210 1448734 1451086 1454516 1458535 1463746
58983 1463746 1470553 1478001 1485104 1492405 1501037 1511053 1521937 1533945 1547602 1562575 1578395 1595725
58971 1595725 1615560 1637770 1661760 1688091 1718090 1752113 1789364 1829061 1870728 1913659 1957115
58960 1957115 2000680 2043671 2084918 2124140 2162763 2202297 2242760 2283887 2326990 2374048 2425655
58949 2425655 2481547 2542663 2611033 2687799 2772879 2866468 2969421 3082261 3205147 3338894
58939 3338894 3484920 3644135 3816890 4003865 4206081 4424307 4659595 4914376 5192208
58930 5192208 5496703 5831457 6200641 6608711 7059832 7558222 8108237 8712960 9373133
58921 9373133 10088333 10858137 11680275 12547398 13446230 14358838 15263171 16132760 16937632
58912 16937632 17646302 18227635 18653564 18903469 18967424 18845607 18546265 18085729 17488667
58903 17488667 16784820 16003859 15173081 14317868 13460983 12620405 11809016 11036392 10309515
58894 10309515 9632035 9004729 8427273 7898732 7416786 6978193 6580279 6220773 5896334
58885 5896334 5602713 5336476 5095232 4876172 4675761 4491116 4320482 4162245 4014650
58876 4014650 3876650 3748010 3628528 3517997 3416692 3324743 3241181 3164602 3094476 3030713
58866 3030713 2972417 2918469 2869013 2824912 2786020 2751427 2721175 2696175 2676526 2661419 2650597
58855 2650597 2644410 2642571 2644602 2651529 2665428 2686987 2715037 2748722 2788619 2835360 2888636 2948044
58843 2948044 3013782 3086093 3165064 3251259 3345667 3448952 3561643 3684888 3819901 3966895
58833 3966895 4125828 4298054 4485955 4691134 4914425 5157667 5424086 5716961 6039252
58824 6039252 6394539 6786930 7220060 7697406 8223353 8802281 9436391 10125437 10867927
58815 10867927 11660300 12494299 13356101 14227591 15086659 15906431 16656519 17306330 17827251
58806 17827251 18193716 18386156 18395050 18221759 17876067 17374825 16742392 16008639 15203835 14355281
58796 14355281 13487780 12623978 11782101 10974323 10208281 9489127 8819618 8199862 7628533
58787 7628533 7104020 6624242 6186515 5788243 5426969 5099494 4801952 4531019 4284211
58778 4284211 4059024 3852934 3664209 3491454 3332331 3184002 3044829 2914349 2791690
58769 2791690 2675570 2565793 2463074 2367250 2277243 2192917 2115394 2045365 1982642 1927425 1880265
58758 1880265 1840663 1807348 1779946 1758585 1741869 1727413 1714636 1704957 1698906 1695177 1692836 1692183
58746 1692183 1692805 1693044 1692294 1691773 1692053 1691678 1689075 1683981 1676114 1664351 1648298 1629089 1607867 1585074
58732 1585074 1561752 1539530 1518370 1496206 1471703 1445593 1418522 1389675 1358606 1326510 1294462
58721 1294462 1262194 1229666 1198028 1167845 1138150 1108463 1080013 1053862 1029571 1006885 986790
58710 986790 969536 953483 937434 922486 910024 899467 889539 880344 872627 866291 861055 857343 855151
58697 855151 853313 851126 849461 849040 848941 847965 846102 843366 838650 831057 821134 809664 796679 782792
58683 782792 769861 758946 749066 739303 730564 723889 718774 714715 712803 713905 716659 719108 721077 723230
58669 723230 725121 726138 727273 729962 733949 738074 742444 748143 755424 763623 772131 779997 785362 786930
58655 786930 785642 783736 782601 782461 783419 785761 789847 796421 806225 818785 832754 848000 865946 887116
58641 887116 910029 933504 958458 986318 1017340 1051698 1090503 1134294 1182099 1233525 1290354
58630 1290354 1354726 1427310 1508748 1601318 1707508 1828434 1965273 2120763 2297501 2496041
58620 2496041 2716162 2958360 3221989 3502896 3794281 4088287 4374796 4640090 4869094
58611 4869094 5048757 5168817 5221836 5205384 5123723 4985639 4801335 4582214 4341369 4091354
58601 4091354 3841597 3598932 3369027 3155455 2958722 2778123 2613641 2464747 2329134
58592 2329134 2204680 2091365 1989563 1898013 1815350 1742031 1678634 1623826 1576173 1536456 1505781
58581 1505781 1482712 1464485 1449754 1437889 1426996 1415134 1402300 1388822 1373072 1353323 1330773
58570 1330773 1308225 1286790 1266316 1247874 1233053 1221547 1211844 1203415 1195825 1186729 1173407 1155662
58558 1155662 1134965 1111812 1086447 1061074 1038475 1019060 1001794 987167 976563 969515 964286 960548
58546 960548 958858 958203 956756 954394 951825 947901 940576 930022 918109 905413 891351 876588 862465
58533 862465 848604 833905 819308 806580 794931 781987 767782 754636 743235 732005 720439
58522 720439 709821 700295 690208 678973 668045 658523 650049 642476 636456 632065 628774 626773 626463
58509 626463 626941 627014 627305 629158 632004 634172 635787 638308 641743 644950 648282 653156 659290 665163 671039
58494 671039 678756 688640 699321 710434 722788 735916 748191 759384 770523 781347 790581 798588
58482 798588 807052 816030 823857 829770 833970 835421 832537 825949 817857 808734 797392 784031 770212
58469 770212 756046 740441 724032 708841 695121 681622 668791 658433 650210 641856 633065 625853
58457 625853 620781 616107 611111 607014 604076 600925 597331 594727 593520 592746 592670 594694 598416 601925 605418
58442 605418 611347 620532 631167 642140 654170 667095 679073 689141 697813 704759 708749 710211 710993
58429 710993 711480 710783 709694 710220 712286 714272 716684 721638 728715 735168 740376 746097 752007 755280 755330
58414 755330 754899 755532 755902 755570 756423 759219 762376 765238 768918 772970 775015 774648 773953 773184 769786 762839
58398 762839 754631 746671 737997 728612 720700 715041 709914 704829 701594 700526 699396 697447 696689 697953
58384 697953 699414 700182 701537 703440 703858 702788 702990 705504 708452 711394 716519 724239 732013 738932 747000
58369 747000 756417 764250 769614 775482 783406 790913 796222 801181 807392 813740 819791 827356 836640 845084
58355 845084 851998 860047 870296 880189 888218 895870 903078 906671 905570 902740 899941 895479 889281 884817
58341 884817 883504 882476 880529 880882 885185 890232 893790 898388 906090 914730 922693 932111 943837 954500
58327 954500 962228 970183 980761 991368 999700 1008107 1018889 1030339 1041314 1054565 1071510 1088781
58315 1088781 1104010 1119911 1138458 1156230 1169805 1180741 1190914 1198124 1200896 1202607 1206302 1210202
58303 1210202 1212597 1216076 1222567 1229433 1234919 1242111 1253039 1264469 1274143 1285439 1300992 1317526 1332102
58290 1332102 1347555 1366526 1386068 1403710 1422903 1446793 1472469 1497048 1523456 1554342 1586374
58279 1586374 1616616 1648380 1684640 1721781 1756095 1789992 1825428 1857897 1883803 1907212 1932420
58268 1932420 1956581 1976700 1996866 2021122 2046273 2069467 2095547 2128816 2164857 2198890 2234823
58257 2234823 2277321 2322622 2366392 2413019 2467498 2525723 2582646 2642375 2709999 2781229 2850688
58246 2850688 2922544 3002026 3084507 3164400 3246751 3338253 3435102 3531907 3634040 3748217 3869457
58235 3869457 3990809 4117372 4256893 4405257 4555736 4713701 4887376 5073232 5265797
58226 5265797 5472193 5700905 5946372 6201585 6475259 6778734 7107246 7453112 7825568
58217 7825568 8237284 8683779 9158130 9673187 10245976 10873890 11551549 12296961 13134159
58208 13134159 14065696 15092436 16244978 17563966 19067438 20774082 22741569 25045652
58200 25045652 27746643 30926715 34744949 39414501 45160436 52265326 61134754 72268417
58192 72268417 86236312 103791409 125925744 153585944 187219948 226578428 270653178
58185 270653178 317178785 361836252 398375416 420477890 424371277 410229905 381543069
58178 381543069 343393785 300942836 258518369 219118439 184292737 154462079 129431092
58171 129431092 108734798 91774640 77924207 66638404 57466111 49995629 43858263
58164 43858263 38780490 34575937 31085375 28166115 25728573 23729846 22126760 20872813
58156 20872813 19957051 19403216 19229745 19451984 20127280 21353242 23203239 25687681 28770535
58147 28770535 32351460 36165826 39710660 42334546 43476501 42892704 40724635 37393462
58139 37393462 33417737 29265791 25286989 21697442 18588943 15959503 13762779 11946265
58131 11946265 10457025 9236145 8228399 7395189 6708606 6138931 5658649 5252552 4911572
58122 4911572 4620327 4361310 4126983 3916379 3723175 3537873 3358694 3189677 3030517
58113 3030517 2878227 2736055 2610475 2501213 2403469 2317450 2246178 2186081 2129343 2073788
58103 2073788 2021495 1969806 1913184 1852510 1793534 1737314 1680705 1624710 1573475 1526101 1477964
58092 1477964 1429269 1384060 1341792 1298242 1254050 1214210 1179441 1145891 1112950 1083742 1058134
58081 1058134 1032723 1007605 985988 967267 947479 926434 907636 891382 874644 857439 842597
58070 842597 829530 814927 799442 787007 777631 767472 756013 746586 739725 732467 724422 718144 713164
58057 713164 705973 696377 687784 680707 671995 661002 650671 641964 632950 623863 617299 612782 606782 598867
58043 598867 592356 588292 584199 579499 576710 576444 576521 576844 579957 585956 591961 597350 604366 612746 618988
58028 618988 622019 624532 627616 628985 627701 625844 624342 621759 618310 616450 616362 615364 612822 611123 610796
58013 610796 609361 606115 603392 601826 599009 594285 590329 588374 586279 582972 580568 580251 580000 578102 575232
57998 575232 571555 565626 557686 550350 544449 537737 529080 520326 512714 505212 497877 493077 491617 491131
57984 491131 489967 489364 490323 491723 493117 496085 501196 506739 511798 517504 523896 528822 531197 532200 532121
57969 532121 529480 524527 520065 517262 514037 509068 503919 499639 494828 488936 484088 481605 479813 477242
57955 477242 474966 473855 472445 469569 466354 463750 460831 457341 455214 455625 457034 457883 458778 460377 461686
57940 461686 462013 462082 461789 459515 455107 450804 447741 444379 439842 435701 432729 429008 423228 416898 411220
57925 411220 404740 396376 388002 381649 376716 372294 369670 369983 371743 373179 374982 378340 382401 386101
57911 386101 390490 396799 403980 410493 416883 424344 432424 440244 448351 457200 465392 471471 475994 479976
57897 479976 482862 483942 484084 484150 483256 480460 476588 472602 467803 461439 454423 447623 440166 431324 422462
57882 422462 415192 409116 403216 397899 393878 390646 387840 386459 386950 387845 388162 389308 392632 397001 401023
57867 401023 405771 412759 420739 427142 431581 435525 439536 443125 446470 450082 453426 455714 457240 458387
57853 458387 458389 456726 454484 452672 450531 447238 443806 441335 438838 435001 430781 427965 426191 423678 420031
57838 420031 416249 412829 409818 407824 406914 405402 401745 396797 392279 387953 382410 375797 369532 363881
57824 363881 357822 350910 343532 335873 328218 321646 316782 312565 307691 302362 297232 291879 286077 281257
57810 281257 278697 277347 275561 273861 273711 274526 274402 273174 272357 272492 272735 272749 272960 273373 274135 276780 282889
57793 282889 291920 302263 313839 327490 342416 356518 368988 380205 389259 394062 394175 391467 387656
57780 387656 382990 377518 371788 365904 359460 352685 346358 340542 334704 328981 323972 319555 315306 311808
57766 311808 309956 309231 308323 307291 307450 309199 311583 313943 316418 318796 320472 321626 323036 324640 325656
57751 325656 326076 326714 327750 328544 328952 329646 331089 333264 336274 340164 344376 348353 352410 357080 362148
57736 362148 367311 373038 379556 385819 390945 395926 402376 410261 418427 426675 435575 444967 454481 464963
57722 464963 477451 491254 504990 519059 535038 552962 571288 589372 607931 627226 646877
57711 646877 667505 690576 716543 744946 776311 812043 852546 897409 947437 1004413 1068843
57700 1068843 1140127 1219274 1309361 1412923 1530842 1664251 1815612 1987340 2180952 2397828
57690 2397828 2638813 2902320 3183998 3478142 3777408 4070757 4343639 4581101 4769991
57681 4769991 4899189 4961052 4954315 4884628 4762084 4599590 4412860 4218580 4030868 3860726
57671 3860726 3718798 3615784 3558648 3547901 3578781 3641708 3719317 3785433 3811142 3774451 3666624
57660 3666624 3493193 3271290 3024061 2773543 2535866 2320874 2133577 1974895 1842746
57651 1842746 1734426 1648078 1581821 1532740 1497724 1474637 1462161 1459322 1465709 1481368 1506194
57640 1506194 1540229 1584606 1641014 1710191 1792316 1889070 2003634 2138131 2292551 2466604
57630 2466604 2660875 2875196 3107189 3352899 3607082 3861638 4104942 4323765 4505239
57621 4505239 4637248 4709629 4717131 4660884 4546498 4381907 4177338 3945096 3697228 3443581
57611 3443581 3192344 2950695 2723605 2513032 2319461 2143409 1984783 1842232 1714376
57602 1714376 1600681 1500158 1410379 1329024 1255478 1189857 1131399 1078840 1031443 988588 949290
57591 949290 913133 880754 852407 826924 803034 780747 760438 741625 723756 707242 692495
57580 692495 678857 665676 653691 644110 636955 631321 626604 622518 618686 615219 612964 612237 612160 612148 613125
57565 613125 616212 621145 627193 634665 644188 655268 666927 679143 692439 706696 721683 738166
57553 738166 757209 778892 802900 829866 860852 896014 935116 978999 1029318 1087133 1152892
57542 1152892 1227450 1311987 1407298 1514335 1635063 1771599 1924588 2093349 2277019 2474164
57532 2474164 2681180 2891990 3099010 3293365 3464613 3601841 3695899 3740684 3733329 3674743
57522 3674743 3570194 3428270 3258669 3070811 2873584 2674978 2481432 2297672 2126849
57513 2126849 1970450 1828673 1701523 1589204 1491092 1405212 1329608 1263589 1206850 1158117
57503 1158117 1115677 1078683 1046924 1019886 997121 979039 966181 958023 953478 952203 954385 959623
57491 959623 967244 977539 991683 1010512 1034204 1062948 1097133 1137150 1183831 1238783 1303507 1378615
57479 1378615 1464695 1563409 1676715 1805430 1949490 2109042 2283908 2471983 2668945 2869052
57469 2869052 3064984 3247053 3403871 3524329 3599169 3622065 3591068 3509289 3383457 3221934
57459 3221934 3034292 2831198 2622447 2414878 2213077 2021433 1843899 1682053 1535237
57450 1535237 1402876 1285204 1181624 1089991 1008213 935415 871102 814288 764011 719776 680925
57439 680925 646301 615019 586916 561857 539165 518118 498501 480350 463544 447908 433437
57428 433437 420218 408307 397613 387745 378180 368819 360030 351894 343890 335669 327554 319853 312331
57415 312331 304898 298072 292103 286470 280987 276517 273568 271083 267832 264247 261614 260109 259054 258491
57401 258491 258908 259817 260118 259647 258922 257727 255563 253321 252732 254055 255849 257107 258068 258794 258670 257809 257407
57384 257407 258076 259007 259339 259264 259262 259222 258871 258253 257389 256181 254878 253909 253214 252500 252040 252275 252729 252408 251299
57365 251299 250330 249884 249446 248720 247872 246653 244570 242023 240037 238749 237469 236291 236167 237174 238184 238684
57349 238684 239451 240917 242263 242830 243189 244108 245516 247139 249189 251786 254517 257020 259233 260826 261342
57334 261342 261173 261400 262420 263693 264973 266563 268230 269208 269641 270610 272371 273920 274781 275778 277415 278979
57318 278979 280008 281302 283633 286644 289879 293682 298251 302950 307408 312223 317670 322835 327015 331027
57304 331027 336161 342697 350254 358683 367667 376393 384662 393606 404414 416934 430278 444030 458160
57291 458160 472616 487876 505216 525495 548203 572290 597293 623092 649311 675712 702475
57280 702475 729473 755839 780654 803326 822870 837800 847279 851489 850427 843397 830332 812625
57268 812625 792042 769669 746379 723084 699912 676297 652632 630658 611513 594595 579013
57257 579013 564802 551823 539011 525936 513882 504127 496274 489436 483823 479756 476199 471834 466858
57244 466858 462346 458541 455029 451987 449938 448846 448409 448646 449255 449246 448214 447192 447290 448381 449991 452262
57228 452262 454911 456592 456790 457153 459335 462503 464758 466096 468077 471202 474567 477754 481303 485441 489939
57213 489939 495041 501155 507772 513968 519820 526160 533221 540598 548149 555828 563067 569483 575713 582473
57199 582473 589363 595734 602045 609090 616548 623583 630279 637161 644014 650568 657666 666206 675500 684210
57185 684210 692417 701313 711414 722556 735118 749629 765620 782360 800262 820129 841606 863997
57173 863997 888046 915233 945688 978426 1013114 1050012 1088637 1128112 1168393 1209486 1250018
57162 1250018 1288236 1323869 1357366 1388139 1415578 1441182 1467520 1495407 1524025 1553336 1584229
57151 1584229 1616733 1650292 1685511 1723465 1763556 1804238 1845625 1889231 1935450 1983526 2033690
57140 2033690 2086963 2143066 2200962 2261261 2325716 2394479 2466341 2541395 2620796 2704012 2789148
57129 2789148 2876048 2966273 3059906 3155216 3251719 3350780 3453104 3558726 3669824 3790361
57119 3790361 3922233 4064683 4217951 4384278 4564329 4755579 4955395 5163456 5380862
57110 5380862 5609603 5853252 6115388 6397329 6700654 7031913 7401388 7817523 8287073
57101 8287073 8821262 9437877 10157864 11005956 12016447 13234214 14709872 16499299 18667348
57092 18667348 21283139 24406781 28082991 32344340 37208715 42668724 48690115 55221555
57084 55221555 62197476 69536037 77155096 84986859 92924523 100697543 107800560 113601078
57076 113601078 117574725 119475661 119327171 117304182 113640164 108595315 102441772 95444279
57068 95444279 87855695 79928884 71917794 64058123 56547835 49540690 43143954 37414816
57060 37414816 32364070 27969522 24188126 20961327 18220930 15898973 13934225 12271551
57052 12271551 10860728 9658956 8632285 7752781 6995865 6340951 5771833 5274634 4836724
57043 4836724 4448412 4103483 3796663 3521870 3273842 3049745 2847755 2665081 2498550
57034 2498550 2346188 2207004 2079657 1962204 1852915 1750757 1655356 1566712 1484557 1407837
57024 1407837 1335288 1266624 1202534 1143398 1088652 1037661 990554 947805 909384 874733 843348
57013 843348 815138 790329 769102 751198 735971 723052 712858 706194 703480 704708 710130 720733
57001 720733 738026 763599 798984 846068 907748 987960 1090564 1218090 1371473 1549354 1744641
56990 1744641 1940091 2108802 2222489 2262502 2225895 2124149 1977663 1809174 1637742 1475173
56980 1475173 1326375 1192085 1070913 960231 857722 763266 678758 605678 543515 490840
56970 490840 446935 411690 384546 364441 350502 342161 338755 339609 344489 353483 366504 383333 404112
56957 404112 429191 458076 488624 517281 539996 553084 553961 541973 518937 488691 455635 423235
56945 423235 393452 367213 345031 327117 313222 302944 296392 294335 297417 305487 318058 335329
56933 335329 358242 387443 422652 463009 506964 550955 588700 613115 619639 607814 580314 541487
56921 541487 496678 451270 409003 371222 337995 309412 285442 265366 248328 234243 223421
56910 223421 215546 209710 205269 201948 199207 196351 193475 191658 191843 193860 196735 199717 202862 206847
56896 206847 212307 219273 227345 236455 247202 260295 276035 294678 316871 343126 373060 405571
56884 405571 439326 472272 500887 520918 529332 525407 510326 486588 457780 427805 399576 374550
56872 374550 353490 337036 325381 318213 315591 318571 328593 346580 372993 408449 453755 509380
56860 509380 575133 650008 731462 814142 889369 946658 977077 976588 947298 896082 831912 763392
56848 763392 697165 637289 585814 544030 513139 493808 485764 488447 502021 527585 566774 621495
56836 621495 693641 784356 893347 1018594 1155415 1294463 1420823 1516794 1567591 1566221 1514994
56825 1514994 1423930 1307384 1180054 1053858 936902 834032 747515 677445 622661 581999
56815 581999 554828 540691 539101 550028 574329 613524 668993 741035 828059 926089 1028358
56804 1028358 1124782 1202308 1247799 1252867 1217230 1148067 1056567 954568 852249 756699 671730
56793 671730 599093 539517 492569 456641 430226 412897 404522 404376 412030 428422 454732 490575
56781 490575 534391 584785 639582 693458 738217 766187 772896 757259 721377 670710 612613 553233
56769 553233 496016 443064 396394 357069 324334 296735 273599 254783 239733 227554 217615 209497
56757 209497 202767 197191 192776 189325 186414 183979 182270 181027 179467 177357 175265 173406 171116 168021
56743 168021 164891 162621 161012 159296 157350 155640 154244 152658 150476 147848 145333 143471 142253 140955
56729 140955 138889 136438 134847 134787 135580 136012 135489 134220 132805 131827 131418 131079 130321 129417 128964 128816 128286
56712 128286 127426 127104 127576 127978 127696 127299 127511 128056 128230 128031 127965 128097 127955 127188 125892 124419 123095 121975
56694 121975 120810 119540 118674 118709 119271 119508 119323 119403 120034 120750 121338 122321 124094 126353 128670 130900 132717
56677 132717 133565 133497 133367 133844 134779 135761 136584 136970 136646 135926 135482 135313 134761 133724 132820 132122 130819 128580
56659 128580 126201 124302 122423 119989 117269 114663 111956 109024 106478 104784 103457 101747 99616 97447
56645 97447 95495 94103 93703 94006 94001 93358 93059 94013 95838 97745 99806 102513 105752 109021 112126 114959
56629 114959 117161 118672 120108 121934 123858 125573 127477 129991 132748 135105 136928 138337 139222 139566 139646
56614 139646 139454 138560 137050 135857 135675 136185 136782 137312 137674 137575 137209 137267 137769 137860 137307 137130 138034 139256 139728
56595 139728 139394 138573 137149 135285 133955 133785 134209 134632 135409 136813 138145 138932 139927 141771 143685 144778
56579 144778 145677 147484 149941 151980 153394 154641 155736 156740 158623 162187 166613 170453 173577 176882
56565 176882 180597 184273 188023 192360 197144 201943 207126 213317 220064 226247 231538 236354 240741 244500
56551 244500 247999 251644 254846 256691 257274 257153 255924 252779 248267 244040 240766 237476 233137 227867 222521
56536 222521 217802 213819 209924 205260 200012 195581 192807 190675 187712 183988 180705 178421 176819 175681
56522 175681 174887 173883 172289 170688 169767 169189 168292 167287 166641 165935 164601 163184 162593 162591 162351 161936 161912 162008
56504 162008 161556 160805 160388 159906 158446 156157 153951 152021 149997 148159 147088 146535 145931 145625 146254 147404
56488 147404 148321 149402 151476 154188 156678 159261 162723 166489 169350 171550 174236 177233 179447 181241
56474 181241 184248 188742 193249 196916 200356 203960 207314 210649 215014 220596 226439 232189 238519 245523
56460 245523 252330 258656 265173 271971 278200 283618 289007 294549 299123 301668 302162 301109 299293 298061
56446 298061 298447 299830 300727 300921 301488 302803 304015 304527 304453 303593 301529 298698 295799 292124 286254 278457
56430 278457 270619 263631 256663 249208 241996 235507 229397 223812 219554 216461 213282 209629 206484 204395
56416 204395 202780 201394 200804 200964 200922 200387 200005 199744 198658 196699 195097 194473 194186 193914 194208 194995 195257
56399 195257 194731 194321 194296 193743 192353 191213 191281 192553 195023 198850 203265 207069 210539 215055 220589 225547
56383 225547 229444 233604 238650 243478 247458 251480 255905 259505 261531 262967 264696 266118 266617 266655 266468
56368 266468 265345 263227 261388 260564 260000 259166 258829 259530 260696 261999 263866 265868 266497 265485 264453 264239
56352 264239 263584 261616 259699 259400 260388 261808 264087 267764 271863 274965 276983 278779 281069 284502 289620
56337 289620 295898 302098 308180 315452 324234 333071 340926 348376 355814 362372 367638 372653 378214 383863
56323 383863 389422 395676 402557 408585 413153 417504 422309 426258 428213 428885 429119 428443 426588 424550 422813
56308 422813 420349 416698 413211 410898 408929 406566 404676 403902 403318 402403 402438 404357 407057 409476 412556
56293 412556 417533 423939 430869 438555 447231 456109 464939 474868 486496 498905 511872 526840 544318
56280 544318 562623 580815 600538 623162 647514 672545 699913 731569 766927 804845 846492
56269 846492 893733 946406 1003755 1067063 1138553 1219068 1309058 1410375 1524836 1652351 1792463
56258 1792463 1946250 2114636 2296387 2489760 2694365 2909143 3130084 3352068 3571325
56249 3571325 3783902 3983551 4163687 4320016 4449179 4546728 4609245 4637091 4632713 4597817
56239 4597817 4534717 4448786 4346620 4232771 4110437 3983777 3856699 3730500 3605180 3481980
56229 3481980 3362328 3245624 3130518 3017064 2905290 2793183 2678712 2562609 2446665
56220 2446665 2330756 2214073 2097860 1984171 1873169 1764290 1658888 1559064 1465155 1376830
56210 1376830 1295272 1221585 1154411 1091866 1034594 984177 939841 899451 862527 829549 799624
56199 799624 771644 746520 725541 707719 691359 676791 664801 654018 642811 632305 624502 618857
56187 618857 613808 610092 609226 610103 610531 610978 613476 617918 622702 627899 634444 641320 646871 651888 658120
56172 658120 664789 669817 673395 677040 680301 681750 682057 682746 683056 681422 678819 677220 676045 673714 671350
56157 671350 671190 672584 673400 674222 677182 681829 686194 690942 698348 708077 718111 729041 743359 761276
56143 761276 781325 804426 833339 868895 910957 962225 1026737 1105037 1194880 1295870 1408875
56132 1408875 1531110 1656033 1777941 1892977 1996708 2085457 2160183 2225097 2282651 2333207
56122 2333207 2378297 2419530 2454764 2479675 2492878 2495881 2489301 2473575 2452183 2429045 2402975 2368980
56110 2368980 2324219 2268345 2199570 2116067 2020952 1920759 1819238 1717320 1618202 1526828 1444439
56099 1444439 1368790 1299586 1238831 1186217 1139357 1098247 1064533 1036843 1011976 990128 973694
56088 973694 961584 950152 939049 930616 924287 917386 910697 907221 906117 904036 901808 903405 908804
56075 908804 914332 919527 926990 936006 943257 949482 958335 969011 977297 983677 992688 1004261 1013636 1020289
56061 1020289 1028930 1040851 1052163 1061589 1072251 1084739 1096028 1106291 1119100 1133958 1146457 1156754
56049 1156754 1170020 1187588 1205685 1223708 1245302 1270201 1293647 1315172 1339365 1366718 1392464
56038 1392464 1415680 1440586 1467562 1492177 1514467 1539650 1568174 1594853 1619457 1648057 1681998
56027 1681998 1715780 1747886 1783180 1822442 1860316 1896074 1935474 1979396 2021753 2061322 2104264
56016 2104264 2152192 2199558 2245827 2298036 2357883 2418593 2478113 2542848 2614671 2687160 2758658
56005 2758658 2835815 2920032 3003953 3085800 3173476 3270039 3369273 3469967 3579685 3699713 3821824
55994 3821824 3944850 4078273 4224205 4372828 4521342 4679749 4851886 5029375 5211016
55985 5211016 5408805 5627513 5858473 6101218 6370027 6670628 6992576 7333779 7709364
55976 7709364 8126663 8576117 9057617 9590064 10183601 10829913 11532321 12316434 13198416
55967 13198416 14174939 15259331 16493683 17910065 19518321 21351279 23482750 25984629
55959 25984629 28917650 32394159 36606840 41779009 48154114 56071180 65993008 78451707
55951 78451707 94087626 113793166 138638707 169443507 206379811 248891257 295488148
55944 295488148 342988860 385925209 417460295 431910765 427142004 405078012 370352178
55937 370352178 328465930 284466238 242206042 204019902 170854086 142757532 119360398
55930 119360398 100105382 84350160 71484846 61002736 52466232 45470920 39683003
55923 39683003 34867639 30844192 27444524 24535016 22036571 19889436 18023359 16381316
55915 16381316 14940128 13682610 12573467 11581407 10699150 9921346 9225141 8590581 8018507
55906 8018507 7510544 7051142 6625661 6237106 5889024 5569608 5267753 4987993 4735076
55897 4735076 4499773 4273742 4063091 3873807 3698281 3528995 3371345 3230410 3098587
55888 3098587 2968645 2846081 2736567 2633686 2530854 2433474 2347689 2268398 2189568 2115469
55878 2115469 2050655 1989328 1925517 1863960 1810395 1760605 1709279 1660428 1618917 1580513 1540148
55867 1540148 1501510 1468832 1437489 1402270 1366979 1336503 1307115 1273965 1240871 1213536 1189999
55856 1189999 1166673 1147116 1136031 1130808 1127394 1128466 1137691 1151617 1164863 1177311 1188756 1192694
55844 1192694 1183386 1163696 1138821 1108078 1070005 1029431 991711 955283 917225 880661 849323
55833 849323 820219 789274 759282 734864 714346 693944 675336 661802 651147 639565 628449
55822 628449 620610 613893 605144 596420 590734 585780 578411 571302 568671 569348 570444 573735 581700 591085
55808 591085 597086 600343 603421 604100 599008 590505 583129 576241 566666 555648 546584 538568 528582 517553
55794 517553 508033 498346 485266 470244 456959 444924 431349 417201 405567 395978 385938 376146
55782 376146 368886 363257 357283 352676 352235 354528 356257 357632 360260 361944 359082 352264 344266 334560
55768 334560 321182 306164 293607 283861 274660 266316 260731 256819 252090 247347 244962 243964 241612 238315
55754 238315 236261 234790 231884 228556 226847 225149 220550 214377 210362 208622 206409 203487 201666 200132
55740 200132 196380 191072 187134 184745 181755 178296 176433 175954 174917 173664 174071 175620 176327 176559 177708
55725 177708 178231 175405 170082 165336 161374 156198 150331 146295 144135 141872 139704 139389 140248 140231 140209 142652
55709 142652 146761 149564 151353 155370 162385 170226 178542 189281 202203 214206 223561 230848 235609
55696 235609 236184 233234 229531 225795 220252 212522 204429 196809 188958 181316 175395 171073 167195 164580
55682 164580 165069 167972 170979 174187 179605 186966 193802 199370 204773 209467 211627 211899 212780 214150 213371
55667 213371 210116 207187 206078 205406 204294 203680 203696 203146 202216 202484 203757 204047 203021 202317 202133 200777 197959
55650 197959 195262 192966 189552 184764 179941 174867 167545 157688 147532 138661 130784 123869 118470 113654
55636 113654 107659 101003 96111 93604 91774 89769 88311 87150 85065 82568 81478 81544 80647 78561 77274
55621 77274 77341 77201 76468 76502 77207 76632 74412 72443 71479 70194 68237 67043 66872 66167 64544 63403 62910
55604 62910 61524 59248 58178 58927 59544 58905 58185 58074 57501 56223 55805 56920 58265 59039 59912 60776 60302
55587 60302 58592 57546 57745 57608 56383 55304 54973 54342 53142 52644 53197 53530 53246 53346 53718 52869 50836
55570 50836 49501 49334 48680 47005 45807 45555 44820 43330 42819 43788 44467 44060 43994 44843 45114 44328 44202 45440
55552 45440 46347 46060 46150 47589 49113 50151 52347 56414 60349 62593 64277 66591 68588 69474 70457 72406
55536 72406 74125 74794 75711 77732 79379 79445 79217 80133 81365 81591 81107 80342 78409 75001 71732 69755 67893
55519 67893 64836 61285 58247 55160 51401 47739 44624 40937 36092 31445 28054 24925 21082 17379
55505 17379 14684 12286 9790 8541 9410 11091 12290 13653 15863 17886 18885 19883 21649 22921 22595
55490 22595 21783 21772 21862 21195 20794 21697 22817 22707 21831 21154 20181 18429 17130 17406 18322 18763 19503 21308
55472 21308 22658 21707 19123 16776 14958 13096 11854 12183 13307 13798 13727 13858 13797 12900 12017 12415 13852
55455 13852 15371 16908 18539 19381 18984 18579 19227 19956 19433 18148 17168 16126 14398 12918 12782 13303 13434
55438 13434 13850 15493 17254 17411 16402 15949 16237 16131 15449 14992 14890 14734 14723 15088 15224 14889 15173 16632
55420 16632 17728 17041 15804 16110 17674 18655 18714 18911 19271 18818 17594 16505 15533 14084 12754 12799 14176
55403 14176 15790 17290 18911 20146 20332 20083 20437 21109 21292 21551 22976 24966 25798 25086 23939 22947 21747
55386 21747 20352 19274 18500 17711 17198 17237 17047 15800 14154 13345 13318 13171 12921 13303 14337 15511 16862
55369 16862 18521 19839 20314 20676 21658 22537 22397 21914 22201 22744 22318 21183 20534 20394 19922 19250 19142 19324
55351 19324 18901 18008 17398 16947 16207 15785 16380 17059 16373 14641 13320 12702 12075 11586 11884 12424 12134 11421
55333 11421 11488 12097 12070 11644 12117 13310 13643 12783 12124 12406 12793 12588 12123 11669 10986 10201 9758 9485 8960
55314 8960 8585 8892 9245 8814 8420 9544 11816 13412 13773 14035 14784 15368 15508 15746 16072 15837 15221 15160 15680
55295 15680 15854 15512 15425 15707 15615 14990 14406 13869 12909 11921 11794 12273 12305 11956 12272 13195 13415 12527 11632 11608
55275 11608 12203 13065 14118 14881 14887 14789 15588 16870 17350 17011 16996 17527 17792 17821 18528 19800 20485 20409 20462 20532 19506
55254 19506 17632 16707 17313 17834 17028 15758 15386 16067 17352 18948 20167 20107 19091 18537 18858 18902 17941 16764
55236 16764 16256 16378 17068 18604 20487 21444 21204 20888 21096 21087 20435 19942 20184 20589 20788 21503 23215 25128
55218 25128 26290 26703 26734 26592 26839 28170 30074 30979 30335 29339 29002 28861 28248 27464 26832 25820 24091 22390
55200 22390 21532 21384 21512 21966 22714 23211 23177 23053 23218 23554 24087 25054 26022 26037 25059 24175 23976 23861 23335 22810
55180 22810 22656 22629 22756 23601 25074 26139 26279 26191 26446 26616 26363 26274 26841 27553 27702 27348 26994 27067 27959 29685
55160 29685 31263 31491 30575 29827 29607 28960 27582 26614 26853 27663 28338 29166 30315 30981 30589 29723 29063 28418
55142 28418 27572 26977 26796 26327 25239 24419 24733 25769 26585 26903 26950 26928 27238 28387 30176 31817 33215 35052
55124 35052 37230 38518 38350 37726 37618 37673 37287 36815 36786 36885 36584 35927 34998 33554 31823 30728 30625 30848
55106 30848 31079 32047 34076 36089 36937 36824 36635 36782 37430 38874 40829 42258 42657 42688 42975 43259 43386 43953
55088 43953 45194 46315 46739 46989 47557 47934 47619 47004 46515 45923 45342 45664 47052 48186 48103 47675 48136 49158
55070 49158 49599 49294 48946 48977 49531 50840 52583 53620 53327 52467 51924 51501 50860 50583 51205 52166 52850 53748
55052 53748 55370 56828 56832 55501 54023 53103 52829 53340 54491 55408 55496 55350 55764 56484 56893 57160 57661 57998
55034 57998 57679 57124 56871 56483 55402 54198 53748 53792 53596 53520 54578 56765 59034 60728 61930 62694 62954
55017 62954 62979 63006 62661 61587 60297 59516 59047 58140 56684 55179 53854 52550 51163 49552 47368 44597
55001 44597 41870 39814 38582 38281 38940 39661 38977 36817 34936 34583 35032 35432 36630 39628 43402 46035
54985 46035 47226 48035 48852 49366 49986 51497 53613 55468 57263 59761 62401 63658 63385 63224 64427 66650
54969 66650 69191 72130 75730 79680 83468 87030 90806 95459 101425 108425 115853 124060 134539 148195
54955 148195 164161 181165 199136 218340 237742 255617 271242 284594 294748 300024 299571 293664
54943 293664 282738 267428 249351 230553 212203 194719 178698 164558 151689 139342 128129
54932 128129 119251 112507 106543 100980 96721 94048 91912 89517 87391 86459 86987 88710 91198 93976 97071
54917 97071 101349 107529 115100 123230 132462 144316 159308 176537 195086 214473 233700 251189 265895
54904 265895 277340 284399 285437 280066 269743 256269 240635 223562 205991 188552 171354 154738
54892 154738 139521 126262 115010 105911 99189 94377 90432 86925 84327 82902 82080 81184 80033 78599
54878 78599 76791 74865 73405 72632 72171 71539 70385 68294 65089 61359 58129 55917 54584 53869 53429 52581
54862 52581 50841 48666 46977 46032 45402 44764 44008 42894 41497 40735 41438 43087 44398 44968 45320 45588 45377
54845 45377 44820 44537 44453 43883 42951 42714 43574 44604 44859 44450 44032 44104 45062 47115 49782 52158 53870 55136
54827 55136 55927 55937 55511 55619 56644 57982 59100 60244 61808 63685 65502 66977 67914 68390 68970 70256
54811 70256 72308 74957 78331 82489 86930 91387 96713 104025 113304 123926 136206 151139 168763
54798 168763 188089 208559 230160 251987 271948 288161 299544 305122 304197 297540 287129 274298
54786 274298 259273 242629 225850 209972 194894 180523 167437 155983 145859 137113 130432 125895
54774 125895 122502 119472 117044 115441 114191 113128 113076 114725 117620 120988 124816 129512 135156 141738 149558
54759 149558 158909 169916 182986 198760 217259 237734 259580 282522 305554 326572 343538 355341
54747 355341 361289 360813 354240 343059 328780 312105 293512 273852 253917 234147 215192 198019
54735 198019 183029 169748 157761 147232 138170 130034 122486 115831 110317 105651 101525 97953 94878
54722 94878 92123 89804 87957 85832 82786 79940 79399 81358 83491 83952 83496 83660 84238 83982 82838 81924
54706 81924 81783 81896 81733 81264 80599 79891 79457 79417 79463 79455 79836 81010 82630 83997 84813 85194 85419 85939 87102
54687 87102 88479 89057 88510 87727 87733 88608 89809 90902 91635 91892 91933 92144 92361 92126 91730 92086 93341 94617
54669 94617 95491 96686 98842 101689 105009 109274 114563 119841 124192 128000 132134 136759 141669 146972 152633
54654 152633 158072 162918 167465 171780 175220 177531 179513 181844 184252 186733 190532 196797 205062 214215
54640 214215 224171 235359 247175 258166 267287 273905 277151 276465 272356 265488 255563 242285 226977
54627 226977 211802 197694 184307 171805 161168 152575 144864 137082 129577 123190 118197 114425 111702
54614 111702 109729 108048 106549 105733 106170 107883 110352 112994 115605 118336 121230 123909 126064 128105 130695
54599 130695 133591 135671 136290 135777 134368 131666 127736 123773 120799 118406 115578 112103 108348 104348 100131
54584 100131 96389 93710 91492 88655 85189 82047 79715 77797 75888 73968 72008 70026 68464 67761
54570 67761 67550 67010 66041 65396 65594 66234 66529 66127 65362 64929 65243 65959 66336 66165 65906 65836 65679 65409 65683
54551 65683 66933 68616 69873 70418 70349 69843 69534 70369 72287 73813 73866 73299 73724 75445 77654 80117 83441
54534 83441 87915 93230 99236 106021 113274 120383 127078 133233 138239 141345 142431 141766 139324 135146 130068
54519 130068 125138 120474 115485 110068 104695 99581 94665 90329 87163 85023 83158 81314 79917 79107
54505 79107 78332 77081 75399 73582 71850 70356 69149 68179 67665 68143 69680 71347 72082 71873 71624 72146
54489 72146 73723 76195 78857 80644 81083 80790 80580 80577 80743 81587 83506 85956 88133 89966 91554 92244 91393
54472 91393 89690 88600 88685 89400 90200 90860 91024 90525 89954 89939 90111 89720 88879 88165 87411 86112 84693 83987
54454 83987 83664 82677 81132 80243 80311 80272 79522 78768 78594 78516 78042 77550 77439 77334 76779 75951 75190 74479 73797 73348
54434 73348 73124 72835 72490 72371 72317 71807 70952 70546 70856 71189 71013 70767 71170 72376 74126 76145 78032 79318
54416 79318 79869 79849 79263 78152 77157 77080 77751 78202 78196 78742 80750 83839 86874 89132 90636 91864 93357 95297
54398 95297 97373 99406 101877 105283 109228 112970 116608 120759 125234 129197 132689 136700 141403 145492
54384 145492 147741 148247 147632 146052 143606 140848 138142 135149 131650 128265 125712 123774 121613 118774 115395
54369 115395 111795 108307 105318 103083 101549 100495 99678 98863 97970 97114 96252 95028 93404 92038 91401 90915
54353 90915 89810 88521 88169 88837 89488 89591 89634 90013 90677 92112 95244 99821 104083 106780 108599 111016
54337 111016 114623 119197 124436 129818 134436 137751 139990 141353 141546 140629 139480 138681 137556 135053 131089
54322 131089 126411 121664 117221 113416 110223 107018 103240 99045 94983 91392 88389 85946 83613 80770
54308 80770 77534 74843 73235 72156 70917 69707 69114 69215 69714 70448 71124 71004 69520 66964 64163 61796
54292 61796 60341 60150 61095 62513 63832 64833 65055 63757 61054 58421 57351 57842 58850 59790 60895 62430
54276 62430 64240 65961 67171 67442 66687 65396 64219 63452 63109 63217 63778 64684 65866 67249 68525 69373
54260 69373 69980 70824 71808 72285 72097 71887 72004 71844 70790 69232 68097 67792 68095 68654 69150 69307 69178 69112
54242 69112 69167 69031 68718 68792 69524 70396 70809 70780 70556 70143 69639 69453 69677 69761 69283 68560 68083 67850 67675 67576 67378
54221 67378 66531 64930 63405 62829 63135 63717 64327 65013 65652 66142 66693 67421 67955 67924 67414 66586 65313 63656
54203 63656 62170 61253 60675 60272 60507 61664 62993 63370 62543 61135 59750 58680 58159 58250 58711 59387 60450
54186 60450 61837 62928 63286 63342 63785 64673 65687 66873 68496 70396 72036 72965 72913 71842 70353 69554 69953
54169 69953 70794 70968 70243 69132 68022 67058 66484 66511 66991 67583 67977 67787 66803 65657 65520 66701 68175 68992
54151 68992 69364 69768 69932 69560 69269 69752 70569 70880 70842 71178 71780 71902 71546 71508 72130 73027 73972 75064 75995
54132 75995 76147 75599 75207 75526 76247 76771 76732 75985 74701 73497 72877 72593 72108 71532 71437 71790 71851 71154 69984
54113 69984 68814 67867 67292 67206 67420 67559 67486 67308 67045 66705 66515 66617 66663 66133 64942 63329 61425 59406
54095 59406 57772 56865 56325 55670 55209 55710 57188 58680 59278 58875 57885 56640 55196 53475 51695 50733 51574
54078 51574 54057 56636 57915 58054 58124 58587 59129 59538 59859 59886 59327 58423 57736 57451 57453 57892 58978 60365 61430
54059 61430 62016 62336 62444 62461 63024 64598 66488 67419 67078 66327 65947 65997 66430 67448 69003 70636 72058 73418
54041 73418 74834 76133 77158 77979 78839 80192 82606 86155 90121 93817 97520 102024 107471 113152 118277
54026 118277 122479 125782 128674 131934 135852 139915 143719 147679 152110 156225 159045 160855 162693 164745
54012 164745 166374 167536 168892 170519 171719 172255 172680 173204 173265 172523 171366 170188 168988 167868 167067 166297
53996 166297 164907 162908 161006 159494 158008 156609 156004 156283 156380 155371 153539 151562 149404 146678 143575
53981 143575 140721 138401 136404 134465 132531 130769 129488 128877 128737 128685 128594 128562 128588 128611 128671 128628 127979 126510
53963 126510 124859 123780 123129 122264 121151 120192 119267 118020 117003 117370 119256 121483 123141 124571 126558
53948 126558 129430 133168 137586 142140 146405 150963 157019 164891 173640 182350 190969 199777 208957 218839
53934 218839 229515 239854 247910 252725 254931 255268 253561 249623 244137 237981 231438 224657 218173 212385
53920 212385 207173 202495 198734 196091 194372 193740 194803 197483 200630 203316 205764 208570 211823 215522
53906 215522 219959 225028 229959 234390 238895 243814 248373 251727 254014 255606 256142 255297 253818 252720 251950
53891 251950 250762 248952 246775 244083 240582 236700 233206 230111 226741 222767 218425 213929 209373 205045
53877 205045 201057 196811 191576 185542 179638 174352 169362 164336 159501 155321 152033 149491 147202 144615
53863 144615 141711 139114 137299 135912 134199 131868 129157 126352 123656 121256 119086 116798 114332 112176
53849 112176 110584 108926 106497 103735 101912 101645 102254 102631 102290 101536 100993 101040 101479 101702 101321 100491 99548
53832 99548 98585 97576 96614 95709 94606 93153 91681 90727 90523 90886 91407 91632 91302 90605 90002 89738 89773 90106
53814 90106 90741 91382 91791 92411 93923 96082 97827 98770 99675 101143 102804 104344 106315 109118 112023 114208
53798 114208 116124 118846 122526 126483 130456 134752 139376 143952 148384 152745 156641 159502 161466 163235
53784 163235 165087 166728 168016 169147 170099 170655 171016 171806 173338 175338 177308 178691 178813 177392 175120
53769 175120 173068 171424 169410 166642 163938 162452 162397 162883 162784 161578 159526 157252 155109 152995 150773
53754 150773 148634 146844 145407 144221 143304 142524 141368 139442 137071 134996 133556 132562 131799 131235 130770 130194
53738 130194 129436 128553 127450 125920 123995 122107 120877 120768 121784 123412 125063 126705 128825 131681 134848
53723 134848 137686 139924 141678 143233 144943 146902 148539 149054 148434 147474 146625 145615 144593 144676 146486 148798
53707 148798 149728 148937 147749 147254 147287 147304 147382 148006 149358 151146 152921 154517 156206 158261 160361 161924 163226
53690 163226 165489 169311 173636 177004 179331 181656 184513 187494 190213 192796 195423 198161 201261 204938
53676 204938 208842 212383 215537 218710 221897 224723 227265 230091 233365 236626 239562 242337 244979 247068
53662 247068 248323 249027 249601 250132 250451 250297 249300 247236 244422 241520 238790 235865 232383 228594 225234 222902
53646 222902 221566 220537 219120 217422 216212 215769 215314 214055 212321 211083 210612 210312 209654 208602 207290
53631 207290 205994 205353 205833 206954 207737 207983 208452 209676 211255 212509 213229 213641 214097 214973 216416 218067
53615 218067 219458 220754 222621 225282 228242 231018 233683 236536 239728 243389 247621 252241 256878 261510
53601 261510 266477 271827 277008 281374 284768 287564 290394 293849 298114 302924 308118 314014 320794 327673
53587 327673 333400 337641 341323 345504 350455 355941 361745 367590 373010 377731 381981 386122 390171 393848
53573 393848 396972 399692 402393 405344 408376 411028 413141 415132 417477 420143 422788 425195 427207 428613
53559 428613 429630 431168 434004 437845 441764 445347 448816 452259 455576 459084 463412 468617 474064 479234
53545 479234 484045 488308 491544 493499 494320 494157 493183 492092 491815 492489 493297 493563 493475 493499 493652 493700 493618 493519 493494
53526 493494 493853 495187 497834 501449 505341 509122 512953 517283 522407 528189 534287 540791 548331 557291
53512 557291 567233 577546 588409 600524 614092 628648 643869 659971 677380 696501 717658 740636
53500 740636 764354 787635 810381 833519 857936 884010 911882 941341 971543 1001762 1032416
53489 1032416 1064500 1097930 1131397 1163959 1195873 1227621 1259148 1290456 1321999 1353885 1385351
53478 1385351 1415654 1444989 1474135 1503691 1534008 1565257 1597051 1628440 1658727 1687942 1716277
53467 1716277 1743551 1769511 1794180 1817569 1839445 1859677 1878399 1895604 1911011 1924535 1936430
53456 1936430 1946819 1955578 1962751 1968460 1972217 1973043 1970555 1965267 1957556 1947082 1933602 1917625 1899748
53443 1899748 1879995 1858370 1835479 1811946 1787565 1761513 1733129 1702268 1669400 1635704 1602491
53432 1602491 1570050 1537535 1504314 1470856 1437915 1405563 1373676 1342804 1313847 1287169 1262646
53421 1262646 1240194 1219741 1200982 1183732 1168199 1154442 1141938 1130254 1119821 1111538 1105872 1102824
53409 1102824 1102364 1104271 1107890 1112721 1119143 1127975 1139493 1153348 1169300 1187410 1207616 1229668 1253526
53396 1253526 1279351 1307020 1336014 1365927 1396956 1429866 1465490 1504017 1544672 1586352 1628772
53385 1628772 1672706 1719015 1767850 1819031 1872709 1929216 1988564 2050488 2114774 2181137 2249032
53374 2249032 2317944 2387699 2458232 2529216 2600163 2670612 2739969 2807469 2872694 2935889 2997429
53363 2997429 3057087 3114000 3167140 3215567 3258586 3296093 3328685 3357117 3381576 3401554 3416325
53352 3416325 3425447 3428948 3427031 3419608 3406424 3387890 3365307 3339542 3309695 3273930 3231558 3183324
53340 3183324 3129702 3070257 3005231 2936591 2866622 2796258 2725673 2655742 2587760 2522014 2457611
53329 2457611 2393797 2330751 2269117 2209331 2151424 2095142 2040269 1987048 1936144 1888073 1842915
53318 1842915 1800677 1761453 1725092 1691351 1660643 1633880 1611061 1590601 1570662 1550705 1531254
53307 1531254 1512754 1495310 1479076 1464122 1450237 1437489 1426753 1419041 1414497 1412433 1412023 1412555 1413494
53294 1413494 1414957 1417801 1422684 1429320 1437078 1445806 1455450 1465401 1474998 1484436 1494497 1505663 1518136
53281 1518136 1532444 1549279 1568834 1590833 1614983 1640946 1668178 1696314 1725366 1755044 1784375
53270 1784375 1812630 1840196 1867805 1895335 1922088 1947783 1972359 1995156 2015303 2032767 2048219
53259 2048219 2061995 2074029 2084498 2093604 2100816 2105285 2106975 2106518 2103979 2098679 2090291 2079219 2065804
53246 2065804 2049917 2031561 2011030 1988312 1962961 1934840 1904470 1872524 1839478 1805766 1771712
53235 1771712 1737339 1702780 1668785 1636168 1604795 1573776 1542658 1511766 1481483 1452034 1423933
53224 1423933 1397774 1373371 1349891 1326967 1304882 1283552 1262271 1240879 1220310 1201513 1184403
53213 1184403 1168336 1152976 1138202 1123729 1109417 1095630 1082765 1070649 1058676 1046309 1033133
53202 1033133 1018749 1002967 985935 967890 949007 929681 910621 892326 874641 857048 839295
53191 839295 821575 804187 787176 770271 753051 735207 716662 697467 677715 657538 637033
53180 637033 616125 594822 573682 553616 534982 517292 500087 483632 468293 453759 439588
53169 439588 426185 414485 404699 395966 387220 377943 368195 358457 349370 341167 333436 325777 318471 312037
53155 312037 306466 301361 296586 292186 287992 283955 280541 278031 275715 272600 268760 265179 262473 260638
53141 260638 259865 260510 262197 263945 265361 266911 268853 270755 272210 273193 273564 273043 271864 270602 269189
53126 269189 266973 263974 261089 258657 255796 251711 246850 242125 237679 233122 228513 224342 220775 217466
53112 217466 214034 210395 206708 203146 199657 196030 192360 189142 186434 183284 178794 173625 169553 167438
53098 167438 166483 165631 164691 163808 162768 161395 159942 158579 157033 155127 153124 151199 149150 146940 144918
53083 144918 143118 140993 138252 135387 132960 130941 129125 127656 126762 126461 126855 128086 129673 130590 130425
53068 130425 129819 129412 129097 128816 129204 130620 132182 132662 131937 130753 129430 127655 125346 122959 120968 119623
53052 119623 119119 119421 119987 120183 120042 120214 121121 122420 123298 123191 122306 121541 121721 122874 124419 125895 127027
53035 127027 127287 126170 124114 122346 121483 120986 120359 120020 120381 120846 120637 120130 120415 121779 123449 124784 125945
53018 125945 127250 128461 129014 128707 128015 127720 128200 129112 129955 130834 132219 133994 135430 136294 137331 139267
53002 139267 141911 144696 147585 150886 154570 158231 161462 163950 165664 167312 170115 174606 179998 185153
52988 185153 189746 194026 198011 201524 204655 207525 209849 211274 211851 211746 210809 208952 206569 204017 201067
52973 201067 197459 193663 190386 187663 185043 182404 179834 177004 173500 169659 166256 163383 160421 157274
52959 157274 154792 153711 153671 153683 153185 152409 151988 152420 153689 155164 156038 155986 155437 155128 155439 156151 156743 156964
52941 156964 157027 157263 157758 158517 159733 161534 163662 165872 168456 171678 174811 176624 176949 176923 177390 177996 178292
52924 178292 178723 179831 181268 182450 183582 185113 186651 187293 186807 185811 185100 185376 187174 190160 192824 193737
52908 193737 193070 192174 191840 191657 190964 189747 188571 188125 188756 189995 190808 190756 190616 191267 192330 192691 192075 191315
52890 191315 191110 191302 191416 191258 190877 190457 190330 190686 191304 191857 192303 192655 192712 192485 192602 193728 195824 198379
52872 198379 200975 203164 204407 204898 205981 208870 213279 218032 222526 226631 229729 231226 231844 233103 235403
52857 235403 237685 239009 239301 238506 236337 233233 230408 228437 226740 224867 223250 222175 220990 219097 216882
52842 216882 214974 213269 211523 210297 210426 211819 213561 214989 216028 216565 216176 214601 212162 209537 207237
52827 207237 205294 203441 201654 200391 200071 200431 200700 200326 199162 197110 194119 190599 187231 184288 181584
52812 181584 179094 177124 175757 174679 173661 172730 171803 170751 169937 170080 171339 173017 174353 175027 174753 173131
52796 173131 170330 167341 165046 163397 161819 159978 157858 155543 153334 151677 150645 149802 148881 148151 147816
52781 147816 147550 147064 146722 147072 147984 148704 148569 147359 145224 142703 140619 139513 139233 139315 139617 140284 141226
52764 141226 141925 141750 140363 137976 135255 132754 130331 127453 124179 121418 119909 119269 118486 117056 115285
52749 115285 113654 112351 111379 110677 110020 109059 107681 106240 105301 105076 105161 104887 104006 102898 102068 101598 101303
52732 101303 101197 101485 102145 102845 103299 103508 103709 104309 105771 108261 111485 115114 119147 123475 127404 130220
52716 130220 132148 134104 136434 138481 139462 139147 137580 134816 131244 127626 124465 121703 119187 116960 114882
52701 114882 112497 109606 106614 104022 101913 100102 98369 96381 93872 91128 88815 87084 85422 83596
52687 83596 82111 81354 80934 80414 80080 80329 80718 80422 79412 78476 78180 78376 78652 78705 78295 77306 75956 74601
52669 74601 73342 72088 70910 70023 69489 69262 69414 69990 70670 70902 70466 69705 69196 69301 69915 70534 70749 70820
52651 70820 71511 73085 74693 75170 74358 73232 72750 72934 73112 72774 71998 71248 70927 71070 71400 71590 71437 70869
52633 70869 70002 69269 69312 70524 72719 75245 77301 78184 77536 75625 73325 71601 70910 71028 71352 71462 71467 71789
52615 71789 72474 72954 72777 72390 72734 74040 75502 76238 76124 75471 74371 72821 71207 70268 70527 71851 73496
52598 73496 74615 74959 75123 75814 76899 77540 77314 76702 76323 76196 76064 76001 76249 76727 77152 77481 77844 78187 78325
52579 78325 78303 78396 78797 79466 80260 81042 81722 82362 83214 84541 86370 88401 90116 91158 91771 92704 94401 96441
52561 96441 98149 99542 101114 102779 103787 103881 103853 104623 106299 108490 110991 113706 116321 118531 120247 121244
52545 121244 121011 119526 117846 117330 118318 120018 121544 122614 123281 123490 123132 122395 121833 122005 122881 123710 123749
52528 123749 123108 122538 122397 122326 122038 121821 121942 122124 122099 122217 122894 123724 123796 122922 122068 122405 124071 125919 126505
52509 126505 125488 124037 123535 123926 123875 122637 121000 120024 119589 118909 117932 117325 117286 117227 116708 116035 115760 116046
52491 116046 116710 117569 118560 119676 120796 121554 121587 121127 121098 122271 124471 126817 128599 129626 129964 129782 129417
52474 129417 129276 129624 130538 131864 133083 133521 133042 132282 131914 131972 132224 132829 134065 135557 136461 136503 136417 137180
52456 137180 139053 141469 143673 145397 147007 149000 151407 153856 156202 158780 161903 165452 169097 172607
52442 172607 175677 177786 178507 177781 175694 172425 168571 165079 162382 160029 157496 154912 152491 149736 145979
52427 145979 141507 137480 134736 133205 132410 131964 131532 130860 130025 129319 128771 127974 126498 124349 122022 120153
52411 120153 119012 118266 117436 116600 116287 116585 116797 116222 114838 112988 110930 109068 108120 108499 109830 111482
52395 111482 113194 114808 115908 116332 116639 117422 118439 119028 119161 119460 120345 121662 123010 123996 124417 124630 125429
52378 125429 127126 129109 130666 131742 132453 132610 132484 133311 135962 139588 142684 145104 147843 151120 154039
52363 154039 156133 157935 159781 161224 162004 162634 163630 164957 166521 168431 170542 172562 174756 177689 181046
52348 181046 183649 184963 185701 186593 187522 188354 189585 191501 193538 195264 197258 200126 203170 205064 205623
52333 205623 206098 207694 210436 213473 216002 217770 218965 219835 220468 221015 221962 223721 225981 227952 229379
52318 229379 230820 232738 234923 237098 239530 242558 245948 249279 252677 256618 261144 265781 270240 274834
52304 274834 280080 286080 292465 299004 306158 314786 325110 336245 347112 357625 368603 380688 393893
52291 393893 408089 423211 438926 454783 470898 487939 506179 525120 544278 563755 583724
52280 583724 603850 623648 643083 662427 681742 700769 719103 736393 752667 768524 784644
52269 784644 800960 816694 831301 844918 857814 869830 880557 889631 896806 902215 906651 911021
52257 911021 915301 918533 919976 919735 918240 915802 912828 909754 906449 902373 897581 892857 888631 884578
52243 884578 880716 877907 876744 876772 877562 879726 884037 890174 897280 905247 914494 924885 935929 947822
52229 947822 961333 976604 992864 1009304 1025645 1041861 1057979 1074101 1090069 1105190 1118815
52218 1118815 1131064 1142338 1152245 1159712 1164202 1166213 1166523 1165515 1163320 1160031 1155508 1149331 1141109 1130629
52204 1130629 1117778 1102755 1086343 1069514 1052614 1035230 1016920 997803 978424 959344 940914
52193 940914 923143 905740 888493 871625 855601 840714 827018 814530 803140 792490 782292
52182 782292 772746 764277 756920 750257 744000 738294 733401 729361 725975 722941 719997 717070 714291 711751
52168 711751 709383 707189 705388 704098 703052 701779 699891 697061 693110 688456 684136 680848 678131 674915
52154 674915 670772 666222 661922 658022 654290 650452 646388 642283 638625 635792 633709 632104 630879 629884
52140 629884 628601 626520 623697 620478 616834 612546 608003 604145 601425 599353 597255 595004 592808 590745
52126 590745 588898 587560 586882 586479 585798 584803 584038 583963 584508 585352 586472 588165 590507 592991 594865 595796 596054
52109 596054 596160 596661 598201 601374 606222 612110 618280 624327 630157 635955 642450 650634 660750 671889
52095 671889 683091 694502 706881 720360 734562 749801 767206 787311 809209 831479 853512
52084 853512 875581 898075 921110 944649 968557 992555 1016293 1039467 1061779 1082910 1102640
52073 1102640 1120842 1137287 1151650 1163821 1174037 1182620 1189673 1195083 1198637 1200039 1199026 1195660 1190394
52060 1190394 1183711 1175708 1166197 1155122 1142745 1129312 1114745 1098916 1082293 1066027 1051065 1037304
52048 1037304 1023960 1010771 998373 987396 977700 968896 961173 955108 950779 947621 945142 943427 942929
52035 942929 944118 947350 952680 959650 967553 976082 985601 996644 1009157 1022306 1035074 1047130 1059093
52022 1059093 1071723 1084842 1097382 1108664 1119141 1129525 1139518 1148000 1154275 1158590 1161424 1162852
52010 1162852 1162726 1160936 1157284 1151476 1143516 1133840 1122775 1110007 1094806 1076769 1056243 1034125 1011273
51997 1011273 988047 964314 939847 914606 888674 862216 835702 809894 785222 761289 737405
51986 737405 713578 690565 668939 648475 628627 609205 590325 571968 554045 536813 520870
51975 520870 506523 493351 480668 468426 457362 448034 439911 431763 422915 413795 405222 397621 391040
51962 391040 385424 380463 375574 370391 365114 360056 355105 349978 344753 339753 335163 331119 327895 325495
51948 325495 323307 320727 317966 315693 313941 311985 309290 306009 302498 298986 295844 293584 292293 291436
51934 291436 290481 289347 288083 286515 284558 282607 281268 280774 280809 280763 280161 278982 277604 276297 274838 272898
51918 272898 270667 268699 267136 265539 263574 261476 259658 258239 257069 255906 254365 252128 249445 247178
51904 247178 246011 245735 245538 244860 243828 242928 242456 242237 241807 240834 239276 237110 234249 231024 228533 227938
51888 227938 229348 231755 234071 235837 236977 237490 237637 237898 238429 238883 239015 239112 239513 240086 240555 241023 241742
51871 241742 242590 243241 243742 244515 245787 247397 249165 251107 253185 255172 256944 258711 260810 263341 266142
51856 266142 269020 271845 274468 276805 279102 281863 285277 288811 291754 294109 296555 299421 302201 304358
51842 304358 306130 308075 310186 312084 313862 316024 318568 320786 322063 322316 321528 319506 316424 313053 310002
51827 310002 307125 304024 300842 298128 296159 294774 293669 292494 290843 288674 286641 285626 285803 286492 287045
51812 287045 287607 288798 290792 292963 294515 295298 295832 296576 297431 298065 298443 298760 298948 298628 297582 296008 294282
51795 294282 292715 291490 290502 289276 287433 285340 283903 283537 283653 283370 282356 280789 278924 277164 276209
51780 276209 276534 277741 278856 279277 279084 278460 277360 275900 274607 273851 273293 272303 270794 269247 267959 266781
51764 266781 265698 265120 265166 265071 263937 261967 260310 259620 259328 258544 257122 255543 254262 253598 253854 254952 256217
51747 256217 257088 257958 259814 263101 267336 271842 276465 281521 287283 293509 299288 303506 305701 306225 305321
51732 305321 302535 297564 291352 285552 280972 277233 273866 271047 269131 268254 268575 270213 272577 274327 274451
51717 274451 273018 270616 267506 263734 259723 256257 253892 252529 251484 249903 247364 244234 241236 238651
51703 238651 236182 233582 231059 228947 227259 225643 223603 220816 217545 214649 212834 211929 211290 210757 210675
51688 210675 211072 211520 211922 212820 214722 217592 221190 225487 230609 236824 244461 253179 261229 266227 267028
51673 267028 264374 259725 254250 249079 245453 243938 244059 245191 247270 250291 253844 257678 262099 267288
51659 267288 272848 278521 284668 291427 298047 303670 308072 310918 311087 307771 301757 294660 287238 279400
51645 279400 271401 263899 256993 250345 244206 239248 235290 231214 226447 221710 217986 215415 213424 211345
51631 211345 208670 205320 201962 199549 198301 197480 196319 194673 192718 190604 188699 187624 187606 188075 188230
51616 188230 187849 187284 186928 186855 186922 187078 187613 188947 190940 192590 192851 191745 190298 189347 188786 188128 187373 187078
51598 187078 187722 189197 190854 192046 192742 193535 194912 196631 198059 198949 199574 200287 201313 202898 205240 208290
51582 208290 212005 216725 222857 230128 237651 244874 252120 260062 268971 278564 288309 297691 306430 314515
51568 314515 321893 328126 332561 334769 334548 331733 326528 320015 313732 308497 303999 299655 295401 291440
51554 291440 287746 284317 281662 280488 280909 282323 284178 286602 290121 294856 300227 305618 311197 317820
51540 317820 326026 335377 344929 353985 362091 368664 373249 376169 378333 380177 381150 380446 377978 374489 370969
51525 370969 368168 366440 365783 366000 366885 368291 370075 372142 374484 377050 379570 381678 383115 383654 382979
51510 382979 380905 377674 373698 368959 362989 355525 346970 338092 329495 321451 314065 307402 301505 296329
51496 296329 291622 286960 282023 276861 271822 267247 263314 260013 257186 254658 252440 250664 249201 247590
51482 247590 245525 243156 240739 238321 236110 234854 235278 237225 239720 241838 243172 243677 243624 243646 244301 245509
51466 245509 246873 248551 251247 255182 259658 263951 268217 273131 278878 284953 290876 296785 303204 310346
51452 310346 317799 324975 331716 338207 344280 349320 353092 356192 359157 361478 362158 361053 359015 356850
51438 356850 354881 353459 353023 353421 353995 354649 356097 358586 361024 361987 361107 358874 355489 350669 344442 337441
51422 337441 330344 323414 316622 309836 302867 295594 288157 280859 273871 267117 260404 253647 247168 241852
51408 241852 238651 237683 237986 238414 238608 238951 239964 242124 245911 251356 257591 263424 268499 273448 278804
51393 278804 284274 289313 293902 298314 302356 305332 306660 306105 303514 298754 292025 283863 274685 264655
51379 264655 254070 243494 233254 223191 213246 203938 195825 188803 182501 177083 172965 169774 166455
51366 166455 162575 158832 155893 153383 150478 146981 143344 140042 137422 135801 135140 134863 134428 133813 133062
51351 133062 131813 129881 127950 126954 126903 126968 126644 126196 125995 126011 126019 125872 125527 125157 125126 125470 125663 125433 125468 126590
51331 126590 128440 129866 130559 131353 132785 134289 135140 135389 135541 136081 137737 141398 147050 153269 158487 162528
51315 162528 166478 171342 177285 183977 191118 198601 206413 214382 221979 228553 233864 238162 241643 244032
51301 244032 244779 243425 239818 234325 227837 221203 214567 207655 200588 193885 187685 181652 175767 170512
51287 170512 165987 161593 157042 153074 150627 149684 149372 148805 147470 145234 142504 140046 138216 136649 135028
51272 135028 133725 133240 133401 133621 133602 133287 132448 130901 128953 127143 125761 124980 125097 126009 126722 126155 124408
51255 124408 122704 122038 122390 123240 124265 125424 126828 128694 131072 133441 134935 135198 134775 134435 134254 133627
51239 133627 132144 130286 129077 129066 129818 130474 130611 130347 129821 129047 128226 127658 127264 126702 126146 126372 127701 129312
51221 129312 130018 129446 128154 126951 126482 127033 128204 129043 129003 128588 128633 129205 129803 130376 131449 133193 135045
51204 135045 136454 137518 138624 139788 140683 141177 141618 142567 144301 146583 148896 150839 152208 152855 152747 152213
51188 152213 151785 151693 151715 151605 151307 150716 149672 148412 147560 147368 147345 146961 146308 145757 145385 145183 145359 145902 146248
51169 146248 146019 145828 146602 148238 149631 150068 149969 150191 151104 152472 153766 154345 153740 152006 149681 147292 144957
51152 144957 142474 139669 136792 134570 133583 133391 132695 130736 128184 126238 125231 124698 124450 124763 125541 126132
51136 126132 126166 125987 126054 126426 127020 127897 129075 130500 132373 135049 138352 141434 143668 145329 147068 148980
51120 148980 150588 151522 151768 151348 150185 148403 146437 144665 143070 141442 139747 138109 136487 134713 132908
51105 132908 131539 130799 130246 129405 128562 128450 129257 130491 131802 133244 134632 135399 135529 135981 137617 140187
51089 140187 142886 145404 147783 149713 150812 151401 152149 152996 153152 152189 150478 148547 146680 145269 144855 145490
51073 145490 146494 147172 147449 147701 148342 149693 151861 154480 156850 158431 159044 158644 157283 155337 153348 151509
51057 151509 149660 147919 146926 147227 148694 150671 152467 153614 154030 154193 154957 156910 159925 163415 166881
51042 166881 170195 173497 176978 180651 184290 187630 190570 193104 195152 196583 197299 197197 196241 194786 193558
51027 193558 192985 192655 191843 190460 189121 188355 188200 188544 189399 190604 191662 192164 192211 192252 192567 193041 193420 193786
51009 193786 194683 196588 199177 201371 202449 202939 204154 206828 210445 213947 216958 220248 224956 231257 237970
50994 237970 243792 248766 254021 260125 266469 272486 278575 285324 292634 300413 309429 320479 333070 345968
50980 345968 358854 372566 387945 405381 425367 448438 474477 503058 534647 570565 611499
50969 611499 656947 706426 760394 819479 883466 951578 1023296 1098448 1176778 1257688 1340031
50958 1340031 1421971 1501420 1576733 1646673 1709740 1764131 1808500 1842225 1864885 1876042 1875711 1864445
50946 1864445 1842933 1812167 1774125 1731454 1686113 1638967 1590918 1543591 1498413 1455757 1415561
50935 1415561 1378135 1343655 1311377 1280070 1248966 1217762 1186027 1153212 1119102 1083810 1047438
50924 1047438 1010098 972015 933305 893875 853811 813644 773994 735327 698274 663715 632089
50913 632089 602947 575686 550518 528262 509333 493302 479346 466854 455650 445887 437663 430677
50901 430677 424427 418785 414131 410853 409037 408657 409664 411763 414453 417399 420381 422960 424770 426268
50887 426268 428495 431919 436057 440425 445111 450146 455137 460043 465577 472276 479795 487716 496396 506320
50873 506320 517160 528312 539902 552530 566386 581415 598027 616794 637621 660027 684144
50862 684144 710757 740483 773643 810920 853400 901938 957036 1019408 1090063 1169831 1259270
50851 1259270 1359118 1470307 1593473 1728787 1876177 2035181 2204544 2382385 2566735 2755419
50841 2755419 2945402 3132682 3312827 3481186 3632681 3762146 3865271 3939187 3982345 3994437
50831 3994437 3976583 3931129 3860997 3769464 3660636 3539729 3412497 3284370 3160020 3043199
50821 3043199 2936492 2841115 2757019 2683297 2618543 2560867 2507598 2455329 2400801 2342073 2278723
50810 2278723 2210927 2138663 2061830 1980547 1894978 1805413 1713045 1620348 1530115 1444214 1363536
50799 1363536 1288717 1220317 1158547 1103541 1055827 1015927 983489 957466 937289 923423 916611
50788 916611 916941 923718 935928 952718 973646 998575 1027095 1058110 1090119 1121779 1151979 1179565
50776 1179565 1203417 1222799 1237438 1247370 1252937 1254690 1252956 1247678 1238954 1227401 1213522 1196991
50764 1196991 1177135 1154054 1128721 1102083 1074584 1046517 1018258 990129 962533 936419 913181
50753 913181 893951 879227 869091 863434 862072 865094 873069 886437 904735 926861 952077 980317
50741 980317 1011632 1046018 1083822 1125707 1172054 1223024 1279440 1342975 1415051 1495967 1585399
50730 1585399 1683289 1789686 1903889 2024120 2147934 2272595 2395133 2512320 2620836 2717486
50720 2717486 2799376 2863838 2908272 2930405 2929096 2904810 2859152 2794159 2712490 2618135 2516292
50709 2516292 2412224 2310285 2213733 2124808 2044735 1973959 1912528 1860047 1815375 1776778 1742515
50698 1742515 1710945 1680179 1648130 1613084 1573997 1530364 1482321 1430855 1377307 1322582 1267377
50687 1267377 1213220 1162397 1116388 1074946 1037239 1003413 974588 951740 935256 925246 921661
50676 921661 924162 932503 947061 968580 997426 1033517 1076977 1128382 1188112 1255709 1329944 1409223
50664 1409223 1491701 1575194 1657334 1735866 1808794 1874400 1931465 1979642 2019511 2052103 2078305
50653 2078305 2098681 2113657 2123566 2128491 2128292 2123005 2113052 2099039 2081539 2061254 2039269 2016972
50641 2016972 1995892 1977624 1963563 1954394 1949998 1950131 1954970 1964773 1979242 1997590 2018937 2042181
50629 2042181 2065667 2087659 2107278 2124586 2139645 2151797 2159919 2163094 2161122 2154833 2146070 2137066
50617 2137066 2129622 2124920 2123920 2127466 2135971 2149303 2167015 2188377 2212145 2236664 2260300 2281599
50605 2281599 2299212 2312148 2320192 2323617 2322258 2315091 2300728 2278063 2246470 2205794 2156327 2098541
50593 2098541 2032825 1959831 1881103 1798928 1715413 1632006 1549923 1470560 1395215 1324646 1259050
50582 1259050 1198284 1142096 1090479 1043882 1002760 966826 935057 906568 881246 859565 842073
50571 842073 828981 819801 813395 808862 806470 807222 811463 818523 827843 839731 854679 872550 893006
50558 893006 916336 943265 974220 1009232 1048455 1092274 1140887 1194076 1251460 1312850 1378354
50547 1378354 1448025 1521180 1596064 1670455 1742592 1811263 1875164 1932946 1984164 2029716 2071011
50536 2071011 2109090 2144784 2179195 2213457 2248199 2283591 2319586 2355817 2391621 2426769 2462119
50525 2462119 2499205 2539218 2582674 2629967 2681837 2739133 2802140 2870036 2940952 3012736 3083727
50514 3083727 3152598 3217496 3275749 3324649 3362203 3386896 3397196 3391822 3370445 3333716 3282610
50503 3282610 3218046 3141316 3054856 2962445 2868343 2775998 2687724 2605804 2533451 2473926 2428808
50492 2428808 2397897 2380851 2377902 2388515 2410294 2440076 2475611 2515320 2556640 2595398 2626818
50481 2626818 2646632 2651374 2638399 2606038 2553758 2482384 2394413 2293816 2184936 2071392 1956044
50470 1956044 1841559 1730447 1624663 1525609 1434392 1351615 1276913 1209241 1147841 1092790 1044576
50459 1044576 1003358 968584 939158 914037 892819 875663 862555 852947 846312 842675 842189 844499
50447 844499 849038 855799 865249 877510 892093 908499 926647 946634 968465 992130 1017565 1044397
50435 1044397 1072072 1100469 1130188 1161969 1195900 1231312 1267341 1303411 1339190 1374329 1408441
50424 1408441 1441337 1472978 1503006 1530604 1555250 1577524 1598708 1619544 1639900 1659763 1679875
50413 1679875 1701002 1723234 1746641 1772140 1800934 1833217 1868069 1904515 1941958 1979643 2016599
50402 2016599 2052386 2087239 2120955 2152063 2178573 2199303 2214010 2222436 2223699 2216675 2200516 2174650
50390 2174650 2138635 2092438 2036744 1972721 1901459 1823989 1741977 1658063 1575242 1496011 1422175
50379 1422175 1355060 1295490 1243847 1200653 1166935 1143496 1130005 1125402 1129044 1140560 1158530 1180207
50367 1180207 1202987 1225472 1246665 1264851 1277816 1283664 1280972 1268820 1247420 1218395 1183810 1145214
50355 1145214 1103919 1061550 1019574 978646 939087 901580 866710 834264 803863 775953 751310
50344 751310 729776 710409 692741 676972 663033 650484 639417 630498 623919 619139 615915 614680
50332 614680 615592 617996 621289 625628 631411 638670 647344 657493 668825 680671 692992 706821 722964
50319 722964 740648 758179 774770 791172 808620 827716 848357 870159 892736 915826 939292
50308 939292 962990 986564 1009439 1030995 1050831 1068943 1085612 1100901 1114358 1125420 1134035 1140589
50296 1140589 1145197 1147518 1147304 1144801 1140510 1134879 1128305 1120977 1112505 1102075 1089201 1074025 1056687
50283 1056687 1036863 1014343 989716 964007 937746 910757 882860 854494 826672 800520 776742
50272 776742 755208 734990 714957 694554 674114 654541 636570 620212 604917 590395 577123
50261 577123 565795 556420 548378 541301 535321 530400 526083 522282 519710 518917 519256 519479 519289 519717 521823
50246 521823 525444 529413 532799 535691 538857 542774 547071 550955 554045 556532 558506 559546 559249 557858
50232 557858 556008 554004 551769 549358 547022 544663 541676 537631 532911 528398 524567 521077 517196 512584
50218 512584 507725 503646 501146 500183 499980 499727 499065 497968 496464 494736 493384 493177 494396 496617 499257
50203 499257 502152 505397 508828 511986 514554 516609 518418 520253 522404 525049 528029 530981 533793 536658
50189 536658 539565 542068 543788 544874 545678 546215 546176 545277 543273 539864 535011 529173 522839 515863 507774
50174 507774 498727 489693 481552 474425 468096 462703 458676 456175 454983 454941 456167 458662 461828 464641 466413
50159 466413 467206 467267 466152 462874 457142 450062 443236 437298 431689 425737 419522 413666 408618 404340 400464
50144 400464 396693 393121 390180 388146 386766 385481 383893 381923 379781 378050 377558 378663 380723 382675
50130 382675 384171 385797 388141 391029 393846 396358 399043 402718 407781 413737 419565 424752 429813 435549
50116 435549 442023 448644 455021 461135 466735 471243 474549 477385 480545 483978 486893 488545 488733 487781 486272
50101 486272 484696 483183 481603 479910 478253 476777 475515 474525 473901 473647 473694 474080 474951 476407 478520 481417
50085 481417 485126 489405 493948 498743 504143 510694 518995 529353 541260 553514 565356 577282 590344
50072 590344 604874 620417 636624 653467 670689 687762 704481 720973 737064 752179 765874
50061 765874 777871 787650 794809 799955 804469 809229 814222 819439 825200 831310 836847 841240 844786 847639
50047 847639 849193 849113 848169 847274 846344 844915 843313 842208 841456 840383 839045 838288 838580 839589 840974 842929
50031 842929 845892 850318 856838 866144 878589 894258 913478 936928 965359 999525 1040220 1087894
50019 1087894 1142269 1202719 1268754 1339412 1412133 1482904 1547867 1604559 1651708 1688563 1715009
50008 1715009 1732166 1742582 1749795 1757543 1768805 1784962 1805528 1828485 1850820 1868982 1879328 1878513
49996 1878513 1863798 1833407 1787037 1726026 1652908 1570798 1483205 1393950 1306511 1223103 1144590
49985 1144590 1071420 1004471 944855 892990 848058 808450 772754 740385 711366 685702 663076
49974 663076 643042 625254 609469 595499 583193 572333 562578 553690 545736 538867 532962 527815 523525
49961 523525 520215 517421 514310 510666 507108 504082 501236 498147 495071 492461 490136 487509 484414 481185
49947 481185 478153 475529 473650 472839 473029 473908 475358 477444 480039 482775 485386 487924 490693 494072 498204
49932 498204 502795 507486 512579 518948 527000 536142 545642 555585 566550 578710 591843 605978 621366
49919 621366 637916 655228 673222 692336 713071 735600 759816 785532 812897 842917 877380
49908 877380 917970 965605 1020828 1084460 1157435 1240279 1333033 1435132 1544678 1658147 1771463
49897 1771463 1881272 1984819 2079321 2162567 2234225 2295876 2349898 2398982 2446343 2495081 2546687
49886 2546687 2600598 2655056 2707494 2753908 2788945 2807539 2806441 2784277 2741019 2678048 2598290
49875 2598290 2505603 2403853 2296418 2185979 2074430 1963169 1853680 1747534 1645729 1548438
49865 1548438 1455619 1367601 1284946 1208095 1137354 1072930 1014811 962771 916498 875411 838482
49854 838482 804786 774348 747915 725712 706918 690491 675896 662685 649983 636900 623203
49843 623203 609155 595006 580999 567550 554831 542320 529254 515548 501960 489334 478000
49832 478000 467953 459334 452479 447479 443825 440617 437202 433503 429742 426091 422791 420296 418914 418432
49818 418432 418514 419278 421015 423389 425585 427305 429112 431567 434549 437630 440665 443720 446852 450276 454406
49803 454406 459414 464996 470756 476559 482334 487943 493494 499426 506016 513214 521273 531131 543686 558942
49789 558942 576325 595639 617304 641975 670526 704358 745093 793732 850401 914942 987262
49778 987262 1066774 1151524 1238104 1322442 1400787 1470178 1528438 1574226 1607495 1629888 1644451
49767 1644451 1654758 1664173 1675580 1691137 1711818 1737015 1764484 1790475 1809960 1817380 1807921 1778708
49755 1778708 1729281 1661395 1578495 1485131 1386354 1287058 1191185 1101089 1017742 941784 874207
49744 874207 815790 766185 724115 688408 658394 633458 612846 595945 582139 570320 559242
49733 559242 548656 539436 532190 526253 520513 514720 509543 505612 502940 501028 499199 497047 494846 493227
49719 493227 492237 491170 489585 487951 486754 485511 483366 480341 477269 474702 472570 470865 469861 469569 469582
49704 469582 469632 469809 470050 469957 469378 468855 469107 470274 471868 473386 474823 476640 479310 482823 486642 490218
49688 490218 493489 496743 500069 503140 505565 507267 508509 509661 510938 512228 513186 513568 513524 513557 514214 515731
49672 515731 517747 519417 520046 519745 519205 518794 518186 517036 515573 514233 513061 511892 510891 510429 510535 510857
49656 510857 511095 511139 510880 510263 509465 508660 507692 506343 504834 503648 502845 501998 500839 499562 498421 497408 496426
49639 496426 495446 494410 493380 492856 493486 495231 497222 498721 499822 500882 501729 502039 502310 503692 506726 510677
49623 510677 514361 517283 519738 522146 524693 527460 530446 533400 535923 537846 539338 540584 541628 542670
49609 542670 544280 547079 551249 556504 562464 568931 575952 583767 592542 601975 611433 620790 630925 642934
49595 642934 656880 671744 686573 701230 716032 731225 747081 763969 782011 800958 820714
49584 820714 841677 864368 889071 916116 946089 979281 1015233 1053300 1093490 1136267 1181678
49573 1181678 1229221 1278555 1329885 1383569 1439754 1498491 1559842 1623720 1689846 1758015 1828208
49562 1828208 1900306 1973823 2047995 2122075 2195474 2267673 2337933 2405046 2467477 2523802 2572857
49551 2572857 2613450 2644251 2664284 2673390 2671939 2660331 2639176 2609764 2573755 2532224 2485493 2434177
49539 2434177 2380107 2325869 2273536 2224020 2177484 2134085 2094324 2058915 2028469 2003234 1983059
49528 1983059 1967653 1956989 1951530 1951917 1958428 1970774 1988538 2011617 2040099 2073898 2112799 2156758
49516 2156758 2205715 2259098 2315896 2375386 2437368 2501516 2566861 2632166 2696344 2758129 2815638
49505 2815638 2866634 2909126 2941503 2962483 2971347 2967962 2952116 2923108 2880581 2825647 2760607 2687540
49493 2687540 2607556 2521419 2430358 2336135 2240649 2145608 2052214 1961099 1872787 1788160 1708168
49482 1708168 1633136 1562791 1496967 1435813 1379198 1326331 1276277 1228585 1183398 1141177 1102378
49471 1102378 1066969 1034193 1003123 973573 946040 920646 896670 873406 851008 830074 810758
49460 810758 792758 775988 760729 747172 735168 724385 714433 704898 695634 687039 679712 673794 668864
49447 668864 664480 660492 656801 653167 649523 646202 643522 641235 638711 635731 632821 630710 629618 629291
49433 629291 629543 630495 632272 634739 637764 641578 646677 653347 661432 670682 681238 693582 707879 723261
49419 723261 737855 749612 757306 760907 761294 759818 757916 756707 756715 758025 760700 764847 770285 776455 782860
49404 782860 789446 796461 804141 812676 822257 832882 844140 855362 865982 875759 884802 893486 902150
49391 902150 910715 918719 925784 931889 937161 941714 945854 950076 954563 958915 962724 966239 970238 975410
49377 975410 982111 990416 999957 1009946 1019841 1029918 1040841 1052800 1065530 1079031 1093724 1109889
49365 1109889 1127485 1146566 1167335 1189576 1212578 1235913 1260006 1285685 1313429 1343243 1374962
49354 1374962 1408383 1443290 1479633 1517656 1557766 1600440 1646271 1695820 1749176 1805856 1865343
49343 1865343 1927688 1993499 2063502 2138219 2217935 2302761 2392721 2487753 2587601 2691772 2799941
49332 2799941 2912445 3030057 3153039 3280489 3410725 3542145 3673609 3804203 3932909
49323 3932909 4058387 4178832 4292107 4396267 4490013 4572385 4641933 4696520 4734292 4754902
49313 4754902 4759583 4749990 4727233 4692099 4645900 4590664 4528571 4461600 4391747 4321083 4251263 4183233
49301 4183233 4117733 4056018 3999877 3950988 3910230 3877384 3851437 3831559 3818066 3812200 3814729 3825079
49289 3825079 3842095 3865300 3894961 3931245 3973939 4022857 4077877 4138469 4203673 4272694 4345126
49278 4345126 4420427 4497495 4574888 4651121 4724533 4793050 4854282 4905850 4945627 4971922 4983565
49267 4983565 4979851 4960497 4925707 4876137 4812636 4736132 4647903 4549822 4444256 4333865 4221419
49256 4221419 4109156 3997989 3887813 3779038 3673372 3572630 3477378 3387487 3303462 3226136
49246 3226136 3155198 3089203 3027274 2969918 2917948 2871379 2829674 2792288 2758536 2727491 2698395
49235 2698395 2670793 2644136 2617888 2592182 2567716 2544690 2522439 2500310 2478178 2455870 2432996
49224 2432996 2409939 2388189 2368949 2351913 2336075 2321185 2307680 2295702 2285020 2275642 2267649 2260622
49212 2260622 2254010 2247922 2242862 2238710 2234746 2230709 2227121 2224374 2222115 2219852 2217731 2216370 2216145 2216849
49198 2216849 2217926 2218916 2219748 2220672 2221866 2223202 2224448 2225512 2226364 2226854 2226811 2226144 2224656 2221946 2217762 2212291
49182 2212291 2205952 2199032 2191679 2183987 2175821 2166851 2157109 2147381 2138784 2132011 2127120 2123665 2120891 2118239
49168 2118239 2116160 2116081 2119032 2124489 2131047 2137938 2145339 2153501 2162482 2172708 2184883 2198996 2214112
49155 2214112 2229609 2246144 2264832 2285757 2307847 2330164 2352827 2376543 2401590 2427553 2454022
49144 2454022 2481285 2510188 2541333 2574529 2608946 2643709 2678380 2713005 2747756 2782343 2815928
49133 2815928 2847959 2879119 2911059 2945027 2980993 3018202 3056065 3094255 3132472 3170660 3209190
49122 3209190 3248288 3287414 3325612 3362360 3397663 3431507 3463733 3494359 3523489 3550885 3576079
49111 3576079 3598987 3620000 3639395 3657060 3672914 3687181 3700035 3711233 3720344 3727264 3732441 3736748
49099 3736748 3741110 3746028 3751304 3756362 3760890 3765164 3769932 3776150 3784635 3795605 3808472 3822353 3836942
49086 3836942 3852847 3871090 3892367 3916698 3943611 3972610 4003434 4035788 4068987 4102272 4135484
49075 4135484 4168939 4202446 4235029 4265952 4295402 4323620 4349925 4373397 4394152 4412989 4429865
49064 4429865 4443605 4453191 4458525 4459852 4457282 4451191 4442354 4431193 4417382 4400545 4380921 4359128
49052 4359128 4335732 4311276 4286194 4260426 4233589 4205862 4178219 4151518 4125875 4101287 4078222
49041 4078222 4057058 4037434 4018761 4001018 3984484 3969083 3954639 3941553 3930508 3921584 3914234 3908001
49029 3908001 3902653 3897796 3893104 3888982 3886280 3885114 3884557 3883673 3882324 3880813 3879402 3878631 3879517 3882832 3888386
49014 3888386 3895430 3903561 3912864 3923507 3935725 3950020 3966701 3985197 4004419 4023954 4044429 4066444
49002 4066444 4089621 4112963 4135789 4157915 4179203 4199404 4218329 4235801 4251527 4265343 4277394
48991 4277394 4287588 4295021 4298564 4298208 4295214 4290660 4284329 4275364 4263463 4248862 4231444 4210628 4186133
48978 4186133 4158328 4127758 4094757 4059522 4022131 3982319 3939777 3894889 3848856 3802766 3756760
48967 3756760 3710372 3663442 3616394 3569768 3523825 3478599 3434051 3390100 3346723 3304127 3262754
48956 3262754 3223051 3185311 3149732 3116544 3086000 3058252 3033263 3010861 2990852 2973082 2957467
48945 2957467 2944067 2933133 2924935 2919412 2916020 2914083 2913303 2913864 2916036 2919809 2925015 2931731 2940457 2951780
48931 2951780 2965825 2982082 2999856 3018894 3039447 3061772 3085732 3110973 3137305 3164703 3193075
48920 3193075 3222239 3252146 3282946 3314778 3347571 3381084 3415198 3450233 3486966 3526087 3567527
48909 3567527 3610475 3654281 3699204 3746053 3795212 3846321 3898935 3953117 4009233 4067350 4127115
48898 4127115 4188228 4250898 4315673 4382757 4451581 4521145 4590765 4660324 4729844 4799195 4868383
48887 4868383 4937727 5007299 5076324 5143543 5208231 5270477 5330449 5387720 5441517 5491332 5537072
48876 5537072 5578793 5616599 5650712 5681280 5707867 5729257 5744041 5751620 5752597 5748083 5738628 5723925
48864 5723925 5703351 5676493 5643197 5603577 5558222 5508156 5454296 5397102 5336884 5274186 5209533
48853 5209533 5142993 5074321 5003545 4931193 4858087 4785034 4712545 4640572 4568760 4497288 4427260
48842 4427260 4359899 4295502 4233616 4174050 4117146 4063128 4011864 3963554 3919030 3878982 3843176
48831 3843176 3810820 3781458 3755158 3731998 3711798 3694400 3679885 3668269 3659113 3651669 3645550 3641189
48819 3641189 3639473 3640920 3645367 3652481 3662245 3674733 3689694 3706668 3725444 3746022 3768148 3791219
48807 3791219 3814805 3839115 3864796 3892347 3921742 3952653 3985015 4019227 4055562 4093462 4131823
48796 4131823 4170082 4208576 4247616 4286754 4325379 4363582 4401912 4440589 4479602 4519292 4560187
48785 4560187 4602312 4645259 4688854 4733188 4778142 4823546 4869742 4917213 4965563 5013596 5060646
48774 5060646 5107233 5154205 5201822 5249804 5297613 5344357 5389040 5431341 5471625 5509761 5544375
48763 5544375 5573635 5596405 5612300 5621113 5622731 5617339 5605194 5586371 5561027 5529687 5492945 5451116
48751 5451116 5404471 5353531 5298756 5240114 5177330 5110443 5039895 4966271 4890193 4812318 4733204
48740 4733204 4653345 4573436 4494321 4416520 4340202 4265945 4195150 4129194 4068318 4011750 3958864
48729 3958864 3909898 3865590 3826394 3792144 3762344 3736732 3715456 3698518 3685238 3674696 3666733
48718 3666733 3661975 3660707 3662218 3665520 3670214 3676364 3683993 3693185 3704276 3717456 3732452 3748972 3767127
48705 3767127 3786947 3807720 3828226 3847443 3864765 3879928 3893234 3905496 3917252 3928314 3938553
48694 3938553 3948712 3959776 3971901 3984807 3999031 4015916 4036309 4060175 4087679 4119799 4157461
48683 4157461 4200695 4249150 4303002 4362903 4429320 4502333 4581866 4667724 4759515 4856885 4959877
48672 4959877 5068891 5184190 5305457 5431745 5561797 5694410 5828359 5961909 6092582
48663 6092582 6217683 6334996 6442767 6539137 6621905 6688849 6738011 6767733 6776887 6765328 6734014
48652 6734014 6684633 6619129 6539540 6447963 6346535 6237391 6122416 6002826 5879166 5752109
48642 5752109 5623179 5494348 5366877 5240827 5115720 4991390 4868215 4746929 4628325
48633 4628325 4512890 4400617 4291426 4185814 4084746 3988813 3897789 3811205 3729061 3651756
48623 3651756 3579504 3512006 3448575 3388450 3331190 3276971 3226406 3179852 3136934 3096797 3058774
$$ [...]
##END NTUPLES=NMR SPECTRUM
##END=
