
##TITLE=AC1324_UGAAH12153_6535724_wPBb3waUKT
##JCAMPDX= 6.0         $$ Bruker NMR JCAMP-DX V2.0
##DATA TYPE= NMR SPECTRUM
##DATA CLASS= NTUPLES
##ORIGIN= BRUKER
##OWNER= Administrator
$$ 1.72 TOPSPIN		Version 2.1
$$ 2012-07-18 00:02:04.843 -0500  Administrator@TOPSPIN
$$ Compression mode = diff/dup
##.OBSERVE FREQUENCY= 400.02188249412
##.OBSERVE NUCLEUS= ^1H
##.ACQUISITION MODE= SIMULTANEOUS (DQD)
##.ACQUISITION SCHEME= undefined
##.AVERAGES= 64
##.DIGITISER RES= 22
##SPECTROMETER/DATA SYSTEM= spect
##.PULSE SEQUENCE= noesygpps1d.comp
##.SOLVENT NAME= COFFEE_meoh
##.SHIFT REFERENCE= INTERNAL, COFFEE_meoh, 1, 14.9608
##AUDIT TRAIL= $$ (NUMBER, WHEN, WHO, WHERE, PROCESS, VERSION, WHAT)
$$ ##TITLE= Audit trail, TOPSPIN		Version 2.1
$$ ##JCAMPDX= 5.01
$$ ##ORIGIN= Bruker BioSpin GmbH
$$ ##OWNER= Administrator
$$ $$ C:\Bruker\TOPSPIN/data/COFFEE/nmr/AC1324_UGAAH12153_6535724_wPBb3waUKT/12/pdata/1/auditp.txt
$$ ##AUDIT TRAIL=  $$ (NUMBER, WHEN, WHO, WHERE, PROCESS, VERSION, WHAT)
(   1,<2012-07-18 00:02:00.125 -0500>,<Administrator>,<TOPSPIN>,<go>,<TOPSPIN 2.1>,
      <created by zg
	started at 2012-07-17 23:50:29.937 -0500,
	POWCHK enabled, PULCHK disabled,
       configuration hash MD5:
       6B 1B 68 BB D9 2E 58 E2 7F 35 AD 54 07 DF 0E 41
       data hash MD5: 64K
       0E F3 D4 DD B4 8A 3C 75 2B FD DC 37 53 DB A2 2E>)
(   2,<2012-07-18 00:02:02.890 -0500>,<Administrator>,<TOPSPIN>,<proc1d>,<TOPSPIN 2.1>,
      <Start of raw data processing
       efp LB = 0.3 FT_mod = 6 PKNL = 1 PHC0 = 0 PHC1 = 0 SI = 128K 
       data hash MD5: 128K
       04 E5 7C 17 38 9E D3 C5 2E 10 FB D9 9D FC 11 52>)
(   3,<2012-07-18 00:02:04.078 -0500>,<Administrator>,<TOPSPIN>,<proc1d>,<TOPSPIN 2.1>,
      <pk PHC0 = 0.8129883 PHC1 = 0 
       data hash MD5: 128K
       E4 1A 8F E6 0B E3 48 8D 13 C3 3E 04 F3 69 C7 E9>)
(   4,<2012-07-18 00:02:04.328 -0500>,<Administrator>,<TOPSPIN>,<proc1d>,<TOPSPIN 2.1>,
      <abs ABSG = 1 
       data hash MD5: 128K
       9F 45 39 DB 97 37 73 1A 98 AE 8C 04 67 A2 BE D9>)
(   5,<2012-07-18 00:02:04.406 -0500>,<Administrator>,<TOPSPIN>,<proc1d>,<TOPSPIN 2.1>,
      <abs ABSG = 2 
       data hash MD5: 128K
       15 5E 91 A5 3B 6E D0 F7 86 A6 0E 89 49 21 F9 62>)
(   6,<2012-07-18 00:02:04.546 -0500>,<Administrator>,<TOPSPIN>,<proc1d>,<TOPSPIN 2.1>,
      <abs ABSG = 3 
       data hash MD5: 128K
       A7 25 9C 41 B2 6A EC 44 9C 73 98 41 5F 3D 11 47>)
(   7,<2012-07-18 00:02:04.703 -0500>,<Administrator>,<TOPSPIN>,<proc1d>,<TOPSPIN 2.1>,
      <abs ABSG = 4 
       data hash MD5: 128K
       EF 3F 43 A1 0A FF 93 2E 49 F1 A7 65 8A 0F 56 43>)
(   8,<2012-07-18 00:02:04.750 -0500>,<Administrator>,<TOPSPIN>,<proc1d>,<TOPSPIN 2.1>,
      <abs ABSG = 5 
       data hash MD5: 128K
       58 66 FD F7 84 8D 6C E6 46 59 37 A9 18 8A 2B FF>)
$$ ##END=
$$ 
$$ $$ hash MD5
$$ $$ 92 7F AC 4E 97 CA 2E 10 5D 93 4D FD 07 76 97 85
##$RELAX= 
##$RELAX= 
##$RELAX= 
##$RELAX= 
##$RELAX= 
##$RELAX= 
##$RELAX= 
##$RELAX= 
$$ Bruker specific parameters
$$ [...]
150 150 150 150 150 150 150 150
##$TP07= 0
##$TPNAME0= <>
##$TPNAME1= <>
##$TPNAME2= <>
##$TPNAME3= <>
##$TPNAME4= <>
##$TPNAME5= <>
##$TPNAME6= <>
##$TPNAME7= <>
##$TPOAL= (0..7)
0.5 0.5 0.5 0.5 0.5 0.5 0.5 0.5
##$TPOFFS= (0..7)
0 0 0 0 0 0 0 0
##$TUNHIN= 0
##$TUNHOUT= 0
##$TUNXOUT= 0
##$USERA1= <user>
##$USERA2= <user>
##$USERA3= <user>
##$USERA4= <user>
##$USERA5= <user>
##$V9= 5
##$VALIST= <valist>
##$VCLIST= <CCCCCCCCCCCCCCC>
##$VD= 0
##$VDLIST= <DDDDDDDDDDDDDDD>
##$VPLIST= <PPPPPPPPPPPPPPP>
##$VTLIST= <TTTTTTTTTTTTTTT>
##$WBST= 2048
##$WBSW= 25
##$XGAIN= (0..3)
0 0 0 0
##$XL= 0
##$YL= 0
##$YMAX_a= 11537578
##$YMIN_a= -8818063
##$ZGOPTNS= <>
##$ZL1= 120
##$ZL2= 120
##$ZL3= 120
##$ZL4= 120
##$ABSF1= 14.9608
##$ABSF2= -5.597382
##$ABSG= 5
##$ABSL= 3
##$ALPHA= 0
##$AQORDER= 0
##$ASSFAC= 0
##$ASSFACI= 0
##$ASSFACX= 0
##$ASSWID= 0
##$AUNMP= <proc_prof1d_extract.lims>
##$AXLEFT= 0
##$AXNAME= <>
##$AXNUC= <1H>
##$AXRIGHT= 0
##$AXTYPE= 0
##$AXUNIT= <>
##$AZFE= 0.1
##$AZFW= 0.1
##$BCFW= 0
##$BC_mod= 0
##$BYTORDP= 0
##$COROFFS= 0
##$CY= 15
##$DATMOD= 1
##$DC= 0
##$DFILT= <>
##$DTYPP= 0
##$F1P= 0
##$F2P= 0
##$FCOR= 0.5
##$FTSIZE= 131072
##$FT_mod= 6
##$GAMMA= 0
##$GB= 0
##$INTBC= 1
##$INTSCL= 1
##$ISEN= 128
##$LB= 0.3
##$LEV0= 0
##$LPBIN= 0
##$MAXI= 10000
##$MC2= 0
##$MEAN= 0
##$ME_mod= 0
##$MI= 0
##$NCOEF= 0
##$NC_proc= -2
##$NLEV= 6
##$NOISF1= 0
##$NOISF2= 0
##$NSP= 0
##$NTH_PI= 0
##$NZP= 0
##$OFFSET= 14.9608
##$PC= 1
##$PHC0= 0.8129883
##$PHC1= 0
##$PH_mod= 1
##$PKNL= yes
##$PPARMOD= 0
##$PPDIAG= 0
##$PPIPTYP= 0
##$PPMPNUM= 2147483647
##$PPRESOL= 1
##$PSCAL= 4
##$PSIGN= 0
##$PYNMP= <proc.py>
##$REVERSE= no
##$SF= 400.020009717612
##$SI= 131072
##$SIGF1= 0
##$SIGF2= 0
##$SINO= 400
##$SIOLD= 131072
##$SPECTYP= <>
##$SREGLST= <1H.CDCl3>
##$SSB= 0
##$STSI= 131072
##$STSR= 0
##$SW_p= 8223.68421052631
##$SYMM= 0
##$S_DEV= 0
##$TDeff= 65536
##$TDoff= 0
##$TI= <>
##$TILT= no
##$TM1= 0
##$TM2= 0
##$TOPLEV= 0
##$USERP1= <user>
##$USERP2= <user>
##$USERP3= <user>
##$USERP4= <user>
##$USERP5= <user>
##$WDW= 1
##$XDIM= 131072
##$YMAX_p= 449745859
##$YMIN_p= -12761
##$CURPLOT= <Network HP LaserJet P1505>
##$CURPRIN= <$Network HP LaserJet P1505>
##$DFORMAT= <normdp>
##$LAYOUT= <+/1D_H.xwp>
##$LFORMAT= <normlp>
##$PFORMAT= <normpl>
##$SURQMSG= 1
$$ End of Bruker specific parameters
$$ ---------------------------------
##NTUPLES= NMR SPECTRUM
##VAR_NAME=  FREQUENCY,     SPECTRUM/REAL,   SPECTRUM/IMAG
##SYMBOL=    X,             R,               I
##VAR_TYPE=  INDEPENDENT,   DEPENDENT,       DEPENDENT
##VAR_FORM=  AFFN,          ASDF,            ASDF
##VAR_DIM=   131072,        131072,          131072
##UNITS=     HZ,            ARBITRARY UNITS, ARBITRARY UNITS
##FACTOR=    0.0627417313425164, 1,          1
##FIRST=     8223.62146879497, -319,         -55299
##LAST=      0,             1595,            -55776
##MIN=       0,             -12761,          0
##MAX=       8223.62146879497, 449745859,    0
$$ Real data points
##PAGE= N=1
##DATA TABLE= (X++(R..R)), XYDATA
$$ [...]
$$ plain form
63919 5013094 4777348 4518975 4246022 3965749 3684810 3408891 3141946 2886354 2644185
63910 2644185 2417989 2210144 2021891 1853398 1704381 1574102 1460991 1362893 1277825 1204200
63900 1204200 1140505 1085349 1037837 997350 962804 932584 905405 880793 858513 838003 818643
63889 818643 800067 781769 762818 742559 721459 700721 681143 662799 645808 630858 618744
63878 618744 609685 603303 599158 597263 598136 602298 609602 619182 630295 643051 657999 675120 693619
63865 693619 712730 732264 752262 772436 792196 810994 828514 844720 859815 873870 886401
63854 886401 896529 903755 908333 910748 911068 908959 904087 896225 885215 871195 854800 836783 817412
63841 817412 796442 773724 749630 724806 699645 674070 647848 621057 594254 568088 542887
$$ packed form
63919E013094k35746k58373k72953k80273k80939k75919k66945k55592k42169
63910B644185k26196k07845j88253j68493j49017j30279j13111r8098q5068p3625
63900A204200o3695n5156m7512m0487l4546l0220k7179k4612k2280k0510j9360
63889H18643j8576j8298j8951k0259k1100k0738j9578j8344j6991j4950j2114
63878F18744r059o382m145j895Q73M162P304R580J1113J2756J4948J7121J8499
63865F93619J9111J9534J9998K0174J9760J8798J7520J6206J5095J4055J2531
63854H86401J0128P226M578K415L20k109m872p862j1010j4020j6395j8017j9371
63841H17412k0970k2718k4094k4824k5161k5575k6222k6791k6803k6166k5201
$$ plain form
63830 542887 518763 496079 475442 457118 440727 425647 411479 397979 384916 372360 360776
63819 360776 350445 340947 331700 322853 315099 308661 303020 297754 293089 289309 286112 282938 279723 276904
63805 276904 274770 273087 271404 269592 268048 267346 267513 267719 266994 265294 263482 262074 260504 257978 254666
63790 254666 251415 248526 245534 242289 239493 237767 236664 235165 232977 230831 229488 228887 228396 227546 226282
63775 226282 224703 222966 221433 220595 220671 221405 222418 223664 225362 227462 229397 230459 230370 229472 228373 227449
63759 227449 226684 225903 225084 224356 223731 223047 222267 221690 221691 222399 223725 225488 227202 228001 227310 225644 224301 224137
63741 224137 224981 226273 227733 229204 230450 231599 233370 236281 239872 243220 246020 248555 250831 252467
63727 252467 253512 254680 256504 258803 261339 264548 269114 275017 281383 287219 292055 295965 299245 302147
$$ packed form
63830E42887k4124k2684k0637j8324j6391j5080j4168j3500j3063j2556j1584
63819C60776j0331r498r247q847p754o438n641n266m665l780l197l174l215k819
63805B76904k134j683j683j812j544p02J67K06p25j700j812j408j570k526l312
63790B54666l251k889k992l245k796j726j103j499k188k146j343o01m91q50j264
63775B26282j579j737j533q38P6P34J013J246J698K100J935J062q9q98j099r24
63759B27449p65p81q19p28o25o84p80n77JP08J326J763J714P99o91j666j343j64
63741B24137Q44J292J460J471J246J149J771K911L591L348K800K535K276J636
63727B52467J045J168J824K299K536L209M566N903O366N836M836L910L280K902
$$ plain form
63713 302147 304706 306749 308053 308475 307950 306422 303879 300473 296646 293125 290582 289124 288233 287437 286907
63698 286907 287135 288149 289488 290888 292538 294540 296624 298664 301040 304083 307434 310433 313045 315958
63684 315958 319665 323761 327289 329641 330971 331783 332232 331991 330836 329158 327641 326512 325427 324184 323205
63669 323205 323113 324039 325527 326977 328020 328623 329017 329401 329619 329249 328039 326061 323372 319880 315721 311473
63653 311473 307667 304295 301035 297751 294513 291362 288432 286179 285062 284981 285323 285591 285791 286225 287118 288456
63637 288456 289991 291428 292721 294167 296146 298891 302519 306967 311823 316560 321257 326717 333459 340956
63623 340956 348328 355502 363038 371061 379199 387672 397590 409821 424099 439696 456493 474983 495562
63610 495562 518321 543330 570740 600690 633382 669103 707682 747800 787036 822728 852771
$$ packed form
63713C02147K559K043J304M22n25j528k543l406l827l521k543j458q91p96n30
63698B86907K28J014J339J400J650K002K084K040K376L043L351K999K612K913
63684C15958L707M096L528K352J330Q12M49k41j155j678j517j129j085j243r79
63669C23205r2R26J488J450J043O03L94L84K18l70j210j978k689l492m159m248
63653C11473l806l372l260l284l238l151k930k253j117q1L42K68K00M34Q93J338
63637B88456J535J437J293J446J979K745L628M448M856M737M697N460O742P497
63623C40956P372P174P536Q023Q138Q473R918J2231J4278J5597J6797J8490K0579
63610D95562K2759K5009K7410K9950L2692L5721L8579M0118L9236L5692L0043
$$ plain form
63599 852771 875758 890723 897167 895538 887624 876177 863805 852026 841276 831567 822839 814635 805737
63586 805737 794374 778902 758536 733714 705930 677086 648779 621927 596760 573086 550848
63575 550848 530655 513580 500186 489907 481721 475227 470743 468524 468363 469915 472913 477012 481903
63562 481903 487679 494742 503192 512594 522389 532171 541601 550535 559414 569130 580377 593505 609070
63549 609070 627968 650791 677601 708650 744909 787354 835783 888237 941019 989043 1026955
63538 1026955 1050963 1060062 1055780 1041292 1020775 998528 977671 959607 944895 934065 926960 921769
63526 921769 915628 906171 892104 872681 847598 817456 783608 747317 709497 671287 634218 599613
63514 599613 568217 540432 516312 495192 475943 457997 441796 427961 416358 406268 397149 388877
$$ packed form
63599H52771K2987J4965O444j629p914j1447j2372j1779j0750r709q728q204q898
63586H05737j1363j5472k0366k4822k7784k8844k8307k6852k5167k3674k2238
63575E50848k0193j7075j3394j0279q186o494m484k219j61J552K998M099M891
63562D81903N776P063Q450R402R795R782R430Q934Q879R716J1247J3128J5565
63549F09070J8898K2823K6810L1049L6259M2445M8429N2454N2782M8024L7912
63538A026955K4008R099m282j4488k0517k2247k0857j8064j4712j0830p105n191
63526I21769o141r457j4067j9423k5083l0142l3848l6291l7820l8210l7069l4605
63514E99613l1396k7785k4120k1120j9249j7946j6201j3835j1603j0090r119q272
$$ plain form
63502 388877 381436 374681 368391 362419 356836 351939 347969 344801 342103 339753 337855 336383 335188 334399
63488 334399 334412 335278 336447 337343 337944 338509 339023 339245 339228 339498 340667 343047 346569 350933 355759 360649 365205
63471 365205 369049 371902 373561 373754 372211 369101 365210 361348 357610 353566 349170 345067 341942 339974
63457 339974 339079 339189 339969 340641 340597 340064 339790 340193 341197 342886 345785 350276 355986 362126 368421 375483
63441 375483 384073 394129 404796 415475 426641 439479 454990 473743 496296 523286 554769 589499
63429 589499 624801 657138 683226 701429 712468 718656 722340 725219 728895 735284 746041 761952
63417 761952 783254 810244 843185 881749 924888 971044 1018121 1063293 1103198 1134504 1154552
63406 1154552 1162158 1158419 1146617 1130749 1113831 1097479 1082603 1069737 1058536 1047385 1033931 1016109
$$ packed form
63502C88877p441o755o290n972n583m897l970l168k698k350j898j472j195p89
63488C34399J3Q66J169Q96O01N65N14K22j7K70J169K380L522M364M826M890M556
63471C65205L844K853J659J93j543l110l891l862l738m044m396m103l125j968
63457C39974q95J10P80O72m4n33k74M03J004J689K899M491N710O140O295P062
63441C75483Q590J0056J0667J0679J1166J2838J5511J8753K2553K6990L1483L4730
63429E89499L5302L2337K6088J8203J1039O188L684K879L676O389J0757J5911
63417G61952K1302K6990L2941L8564M3139M6156M7077M5172L9905L1306K0048
63406A154552P606l739j1802j5868j6918j6352j4876j2866j1201j1151j3454j7822
$$ plain form
63394 1016109 992875 964333 931379 895114 856542 816788 777361 739812 704992 672775 642647
63383 642647 614529 589009 566856 548366 533206 520929 511474 504926 500799 498008 495825 494631 495396
63370 495396 498661 504317 512161 522101 533827 546783 560719 576046 593475 613456 635998 660808
63358 660808 687582 716418 748077 783595 823446 867090 913207 960083 1005651 1047453 1082904
63347 1082904 1109731 1126399 1132538 1129209 1118648 1103514 1086226 1068775 1052656 1038588 1026184 1014014
63335 1014014 1000121 982706 960679 933818 902603 868018 831499 794723 759058 725227 693680
63324 693680 665170 640567 620164 603635 590916 582761 580082 582651 588321 593276 593252 585374 569647
63311 569647 548690 525776 502961 480975 460302 441789 426191 413559 403288 394623 387059 380417
$$ packed form
63394A016109k3234k8542l2954l6265l8572l9754l9427l7549l4820l2217l0128
63383F42647k8118k5520k2153j8490j5160j2277r455o548m127k791k183j194P65
63370D95396L265N656P844R940J1726J2956J3936J5327J7429J9981K2542K4810
63358F60808K6774K8836L1659L5518L9851M3644M6117M6876M5568M1802L5451
63347A082904K6827J6668O139l329j0561j5134j7288j7451j6119j4068j2404j2170
63335A014014j3893j7415k2027k6861l1215l4585l6519l6776l5665l3831l1547
63324F93680k8510k4603k0403j6529j2719q155k679K569N670M955k4p878j5727
63311E69647k0957k2914k2815k1986k0673j8513j5598j2632j0271q665p564o642
$$ plain form
63299 380417 374672 369816 365887 363022 361226 360019 358567 356309 353306 349863 346098 342110 338376 335576
63285 335576 333971 333108 332110 330162 326928 322823 318849 315915 314248 313512 313335 313512 313868 314283 314795 315416
63269 315416 315922 316128 316349 317203 318871 320867 322599 323905 324976 326141 327822 330345 333566 336994 340551
63254 340551 344871 350520 357142 363825 370191 376685 383741 391107 398241 405129 412415 420818 430665 442021
63240 442021 454997 469713 486100 504085 524043 546718 572378 600191 628854 657882 687899
63229 687899 719568 752577 785872 818532 850136 880542 909778 938094 965784 992945 1019754
63218 1019754 1047002 1075880 1106955 1139500 1172055 1203428 1232839 1259102 1280197 1294057 1299686
63207 1299686 1297177 1286665 1267736 1240224 1205267 1165085 1121734 1076419 1029940 983280 937646
$$ packed form
63299C80417n745m856l929k865j796j207j452k258l003l443l765l988l734k800
63285C35576j605q63r98j948l234m105l974k934j667p36j77J77L56M15N12O21
63269C15416N06K06K21Q54J668J996J732J306J071J165J681K523L221L428L557
63254C40551M320N649O622O683O366O494P056P366P134O888P286Q403R847J1356
63240D42021J2976J4716J6387J7985J9958K2675K5660K7813K8663K9028L0017
63229F87899L1669L3009L3295L2660L1604L0406K9236K8316K7690K7161K6809
63218A019754K7248K8878L1075L2545L2555L1373K9411K6263K1095J3860N629
63207A299686k509j0512j8929k7512l4957m0182m3351m5315m6479m6660m5634
$$ plain form
63196 937646 894347 854761 819868 789530 762727 738963 719032 703939 693468 686433 681996 679953
63184 679953 679951 681422 684506 690144 698818 709754 721783 734399 747504 760599 772903 784082 794325
63171 794325 803881 812974 822045 831484 841012 849595 856012 859358 859172 855496 848772 839292 826759 810697
63157 810697 791320 769631 746685 723131 699521 676515 654422 632898 611577 590924 572087
63146 572087 555849 542034 529975 519300 510048 502207 495503 489706 484905 481255 478575 476439 474631
63133 474631 473238 472324 471805 471764 472544 474277 476602 479156 482142 486025 490815 496066 501524 507298 513365
63118 513365 519422 525381 531542 537947 543965 548973 553209 557503 562257 567090 571462 575229 578528 581496
63104 581496 584224 586750 588868 590242 590858 591182 591584 591811 591369 590392 589713 589975 590959 592006 592888 593925 595372
$$ packed form
63196I37646m3299l9586l4893l0338k6803k3764j9931j5093j0471p035m437k043
63184F79953kJ471L084N638Q674J0936J2029J2616J3105J3095J2304J1179J0243
63171G94325R556R093R071R439R528Q583O417L346j86l676o724r480j2533j6062
63157H10697j9377k1689k2946k3554k3610k3006k2093k1524k1321k0653j8837
63146E72087j6238j3815j2059j0675r252p841o704n797m801l650k680k136j808
63133D74631j393r14n19m1P80J733K325K554K986L883M790N251N458N774O067
63118E13365O057N959O161O405O018N008M236M294M754M833M372L767L299K968
63104E81496K728K526K118J374O16L24M02K27m42r77o79K62R84J047Q82J037J447
$$ plain form
63087 595372 597042 598627 600161 601964 604193 606559 608535 609941 611361 613894 618273 624206 630750 637308
63073 637308 644093 651628 660141 669585 679988 691495 704164 717918 732665 748396 765316 783945
63061 783945 804833 827977 852795 879049 907661 940294 978139 1021342 1069467 1122069 1178832
63050 1178832 1239613 1304543 1373779 1446939 1522952 1600574 1678835 1756868 1833657 1908312 1980641
63039 1980641 2051219 2120816 2189822 2258253 2326277 2394574 2463950 2534403 2604667 2672577 2735548
63028 2735548 2790488 2833798 2862258 2874091 2868739 2845716 2804306 2744685 2668745 2579476 2479942
63017 2479942 2373253 2262990 2152829 2045552 1942771 1845592 1755266 1673199 1600593 1538111
63007 1538111 1485657 1442415 1407316 1379522 1358521 1343919 1335343 1332434 1334713 1341463 1351780 1364688
$$ packed form
63087E95372J670J585J534J803K229K366J976J406J420K533M379N933O544O558
63073F37308O785P535Q513R444J0403J1507J2669J3754J4747J5731J6920J8629
63061G83945K0888K3144K4818K6254K8612L2633L7845M3203M8125N2602N6763
63050A178832O0781O4930O9236P3160P6013P7622P8261P8033P6789P4655P2329
63039A980641P0578O9597O9006O8431O8024O8297O9376P0453P0264O7910O2971
63028B735548N4940M3310K8460J1833n352k3023m1410n9621p5940q9269r9534
63017B479942j06689j10263j10161j07277j02781r7179r0326q2067p2606o2482
63007A538111n2454m3242l5099k7794k1001j4602q576k909K279O750J0317J2908
$$ plain form
62995 1364688 1379175 1394366 1409864 1425693 1441747 1457523 1472706 1487749 1503420 1519781 1535918
62984 1535918 1550583 1562805 1571951 1577561 1579111 1575637 1565698 1548216 1523401 1492442 1456284 1415279
62972 1415279 1370248 1323195 1276367 1230884 1186770 1144179 1103996 1067223 1034255 1004887 978627
62961 978627 954742 932293 910630 889891 870737 853412 837129 820569 803005 784824 766971
62950 766971 750096 734359 719772 706297 693593 681049 668277 655337 642341 629122 615696
62939 615696 602846 591755 582903 575611 568834 562174 555944 550485 545812 541867 538694 536143 533618 530557
62925 530557 527210 524662 523800 524316 524989 525007 524737 525011 525893 526597 526586 526235 526109 525934 524811 522310 518890 515181
62907 515181 511365 507430 503562 499885 496117 491943 487628 483841 480866 478328 475722 473001 470652 469383
$$ packed form
62995A364688J4487J5191J5498J5829J6054J5776J5183J5043J5671J6361J6137
62984A535918J4665J2222R146N610J550l474r939j7482k4815l0959l6158m1005
62972A415279m5031m7053m6828m5483m4114m2591m0183l6773l2968k9368k6260
62961I78627k3885k2449k1663k0739j9154j7325j6283j6560j7564j8181j7853
62950G66971j6875j5737j4587j3475j2704j2544j2772j2940j2996j3219j3426
62939F15696j2850j1091q852p292o777o660o230n459m673l945l173k551k525l061
62925E30557l347k548q62N16O73J8k70K74Q82P04j1l51j26j75j123k501l420l709
62907E15181l816l935l868l677l768m174m315l787k975k538k606k721k349j269
$$ plain form
62893 469383 469614 470984 472421 473019 472877 472765 473047 473324 473120 472454 471580 470646 469842 469534 469893 470646 471429 472208
62875 472208 473148 474300 475587 476846 477758 478004 477699 477315 476938 475980 473990 471436 469317 468207 468032 468427
62859 468427 468827 468567 467523 466590 466905 468568 470606 472199 473424 474690 475987 476929 477229 476914 476279 475758
62843 475758 475667 475994 476535 477088 477321 476675 474841 472259 469732 467578 465566 463580 461849 460550 459708 459527
62827 459527 460249 461579 462787 463549 464232 465217 466545 468400 471246 475139 479451 483720 488234 493341 498722
62812 498722 503980 509442 515612 522118 528046 533306 538936 545889 554039 562582 570970 579289 588048 597881
62798 597881 609312 622642 638007 655353 674151 693371 712249 731202 751676 775030 801832
62787 801832 832336 867150 907024 952189 1002470 1058317 1121361 1193519 1275493 1366504 1465588
$$ packed form
62893D69383K31J370J437N98j42j12K82K77k04o66q74r34q04l08L59P53P83P79
62875D72208R40J152J287J259R12K46l05l84l77r58j990k554k119j110j75L95
62859D68427M00k60j044r33L15J663K038J593J225J266J297R42L00l15o35n21
62843D75758r1L27N41N53K33o46j834k582k527k154k012j986j731j299q42j81
62827D59527P22J330J208P62O83R85J328J855K846L893M312M269M514N107N381
62812D98722N258N462O170O506N928N260N630O953Q150Q543Q388Q319Q759R833
62798E97881J1431J3330J5365J7346J8798J9220J8878J8953K0474K3354K6802
62787H01832L0504L4814L9874M5165N0281N5847O3044P2158Q1974R1011R9084
$$ plain form
62776 1465588 1572710 1688135 1811080 1939588 2071565 2204998 2336864 2462617 2577473
62767 2577473 2677883 2761269 2824827 2865583 2881729 2873383 2841928 2789111 2716901 2627774 2524828
62756 2524828 2411703 2292362 2170511 2048867 1928976 1811718 1697942 1588695 1485087
62747 1485087 1388025 1297956 1214911 1138853 1069874 1007895 952371 902518 857759 817759 782175
62736 782175 750617 722687 697721 674714 652956 632715 614848 599712 586873 575888 566828 559768
62724 559768 554174 549196 544437 540164 536819 534482 532835 531580 530877 531310 533365 537053 542133 548467 555932
62709 555932 564224 573155 583077 594712 608653 625338 645323 669024 696224 726390 759532 796176
62697 796176 836439 879768 925800 974783 1026735 1080729 1135491 1190250 1244385 1296527 1344592
$$ packed form
62776A465588J07122J15425J22945J28508J31977J33433J31866J25753J14856
62767B577473J00410Q3386O3558M0756J6146q346l1455n2817p2210q9127j02946
62756B524828j13125j19341j21851j21644j19891j17258j13776j09247j03608
62747A485087r7062r0069q3045p6058o8979o1979n5524m9853m4759m0000l5584
62736G82175l1558k7930k4966k3007k1758k0241j7867j5136j2839j0985r060p060
62724E59768n594m978m759m273l345k337j647j255p03M33K055L688N080O334P465
62709E55932Q292Q931R922J1635J3941J6685J9985K3701K7200L0166L3142L6644
62697G96176M0263M3329M6032M8983N1952N3994N4762N4759N4135N2142M8065
$$ plain form
62686 1344592 1386598 1421025 1446600 1462258 1467335 1461503 1444663 1417332 1381006 1337701 1289100 1236428
62674 1236428 1180999 1124350 1067800 1012260 958519 907373 859363 814781 773956 737159 704097
62663 704097 673936 646084 620749 598435 579112 562132 546837 532999 520671 509832 500216 491401
62651 491401 483045 475074 467615 460746 454345 448215 442258 436515 431083 426092 421763 418401 416224 415139
62637 415139 414781 414902 415689 417460 420042 422677 424674 425914 426547 426542 425839 424699 423415 421841 419739 417593
62621 417593 416479 416883 418143 419327 420343 421880 424622 428910 434861 442263 450421 458610 466767 475479
62607 475479 485285 496310 508550 522098 536921 552761 569492 587425 607106 629109 654181 683386
62595 683386 717754 757807 803542 854701 910805 971030 1034314 1099559 1165484 1230270 1291636
$$ packed form
62686A344592M2006L4427K5575J5658N077n832j6840k7331l6326m3305m8601n2672
62674A236428n5429n6649n6550n5540n3741n1146m8010m4582m0825l6797l3062
62663G04097l0161k7852k5335k2314j9323j6980j5295j3838j2328j0839r616q815
62651D91401q356p971p459o869o401o130n957n743n432m991m329l362k177j085
62637D15139l58J21P87J771K582K635J997J240O33np03j140j284j574k102k146
62621D17593j114M04J260J184J016J537K742M288N951P402Q158Q189Q157Q712
62607D75479R806J1025J2240J3548J4823J5840J6731J7933J9681K2003K5072K9205
62595F83386L4368M0053M5735N1159N6104O0225O3284O5245O5925O4786O1366
$$ plain form
62584 1291636 1347273 1395048 1432869 1458797 1471574 1470904 1457231 1431562 1395639 1351804 1302189 1248119
62572 1248119 1190576 1131110 1071871 1014733 960676 909962 862530 818158 776659 738086 702591
62561 702591 670093 640445 613964 591321 572537 556467 541713 527897 515623 505287 496333 487748
62549 487748 478993 470389 462833 457133 453395 450964 449085 447630 446993 447318 448116 448693 448758 448511 448313 448329 448300
62532 448300 447619 445797 442978 439832 437003 434884 433968 434923 438009 442703 448303 454787 462737 472564 484208
62517 484208 497641 513175 531075 551222 573434 597891 624884 654216 685236 717500 751053
62506 751053 785776 820610 853737 883635 909770 932170 950488 963759 971120 972574 968914 961027
62494 961027 949556 935310 919847 905381 893964 886693 883633 884427 888942 897474 910602 928965 953002
$$ packed form
62584A291636N5637M7775L7821K5928J2777o70j3673k5669l5923m3835m9615n4070
62572A248119n7543n9466n9239n7138n4057n0714m7432m4372m1499l8573l5495
62561G02591l2498k9648k6481k2643j8784j6070j4754j3816j2274j0336q954q585
62549D87748q755q604p556n700l738k431j879j455o37L25P98N77O5k47j98J6k9
62532D48300o81j822k819l146k829k119r16R55L086M694N600O484P950R827J1644
62517D84208J3433J5534J7900K0147K2212K4457K6993K9332L1020L2264L3553
62506G51053L4723L4834L3127K9898K6135K2400J8318J3271P361J454l660p887
62494I61027j1471j4246j5463j4466j1417p271l060P94M515Q532J3128J8363K4037
$$ plain form
62481 953002 982639 1017165 1055639 1097558 1143039 1192108 1243674 1295066 1342527 1382360 1412082
62470 1412082 1431075 1440352 1441476 1435221 1420857 1396611 1361089 1314715 1260058 1200681 1139457 1077818
62458 1077818 1016389 955985 897881 843421 793685 749489 711318 679155 652452 630363 611993
62447 611993 596635 583941 573836 566147 560490 556720 555244 556406 559666 563937 568827 574947 582709
62434 582709 591362 599627 606793 612662 616796 618583 617906 615036 609812 601655 590615 577822 564558 551321
62420 551321 538085 524983 512266 499970 488215 477664 469049 462188 455976 449558 443142 437445 432671
62407 432671 428406 424346 420707 417782 415424 413215 410967 408754 406475 403863 401108 399096 398608 399513 401222
62392 401222 403706 407381 411937 416052 418688 420117 421225 422271 422942 423307 424020 425706 428670 433107 438927
$$ packed form
62481I53002K9637L4526L8474M1919M5481M9069N1566N1392M7461L9833K9722
62470A412082J8993R277J124o255j4364k4246l5522m6374n4657n9377o1224o1639
62458A077818o1429o0404n8104n4460m9736m4196l8171l2163k6703k2089j8370
62447F11993j5358j2694j0105p689n657l770j476J162L260M271M890O120P762
62434E82709Q653Q265P166N869M134J787o77k870n224q157j1040j2793j3264j3237
62420E51321j3236j3102j2717j2296j1755j0551q615o861o212o418o416n697m774
62407D32671m265m060l639k925k358k209k248k213k279k612k755k012m88R05J709
62392D01222K484L675M556M115K636J429J108J046O71L65P13J686K964M437N820
$$ plain form
62377 438927 445410 451685 457760 464559 472825 482496 493242 504945 517307 529611 541463 553420 566420
62364 566420 580940 597172 615674 637213 662123 690487 722906 760446 803703 852536 906870
62353 906870 967086 1033016 1102758 1172876 1239692 1300241 1352298 1394150 1424724 1443856 1452353 1451686
62341 1451686 1443449 1428798 1408243 1381863 1349641 1311695 1268558 1221619 1173172 1125676 1080765
62330 1080765 1039084 1001030 967242 938157 913403 892093 873681 858057 844727 832331 819357
62319 819357 805025 789120 771218 750737 727914 704152 681003 658969 637665 616964 597566
62308 597566 580332 565384 552043 539569 527861 517517 509271 503305 499044 495647 492684 490223 488277
62295 488277 486445 484323 482179 480850 480817 481600 482334 482832 483732 485516 487753 489584 490759 491883 493703 496465
$$ packed form
62377D38927O483O275O075O799Q266R671J0746J1703J2362J2304J1852J1957J3000
62364E66420J4520J6232J8502K1539K4910K8364L2419L7540M3257M8833N4334
62353I06870O0216O5930O9742P0118O6816O0549N2057M1852L0574J9132Q497o67
62341A451686q237j4651k0555k6380l2222l7946m3137m6939m8447m7496m4911
62330A080765m1681l8054l3788k9085k4754k1310j8412j5624j3330j2396j2974
62319H19357j4332j5905j7902k0481k2823k3762k3149k2034k1304k0701j9398
62308E97566j7234j4948j3341j2474j1708j0344q246n966m261l397k963k461j946
62295D88277j832k122k144j329l3P83P34M98R00J784K237J831J175J124J820K762
$$ plain form
62279 496465 499973 503960 508204 512465 516456 519931 522881 525777 529467 534558 540917 548082 556118 565646
62265 565646 577021 590038 604644 621403 640925 663386 689193 719626 756053 798692 846935
62254 846935 900828 961303 1028715 1101824 1178431 1256165 1332057 1402115 1462457 1511038 1547921
62243 1547921 1574088 1590487 1597998 1597348 1588617 1571159 1544357 1508280 1463562 1411062 1352060 1288627
62231 1288627 1223354 1158497 1095409 1034790 977362 924183 876263 833890 796385 762630 731806
62220 731806 703674 678298 655750 636078 619314 605302 593481 582894 572489 561559 550143
62209 550143 539079 529482 521960 516208 511356 506696 502114 497964 494634 492281 490941 490760 491910 494217
62195 494217 497092 500101 503463 507661 512630 517857 523444 530541 540173 551830 563751 574640 584719
$$ packed form
62279D96465L508L987M244M261L991L475K950K896L690N091O359P165Q036R528
62265E65646J1375J3017J4606J6759J9522K2461K5807L0433L6427M2639M8243
62254H46935N3893O0475O7412P3109P6607P7734P5892P0058O0342M8581L6883
62243A547921K6167J6399P511o50q731j7458k6802l6077m4718n2500n9002o3433
62231A288627o5273o4857o3088o0619n7428n3179m7920m2373l7505l3755l0824
62220G31806k8132k5376k2548j9672j6764j4012j1821j0587j0405j0930j1416
62209E50143j1064r597p522n752m852m660m582m150l330k353j340j81J150K307
62195D94217K875L009L362M198M969N227N587P097R632J1657J1921J0889J0079
$$ plain form
62182 584719 595109 606635 619325 632517 645053 655668 663683 669447 673967 678216 682869 688452 695454
62169 695454 704427 716222 731960 752476 777914 808211 843786 885241 932255 983167 1035710 1087745
62157 1087745 1137103 1181247 1217637 1244457 1261010 1267848 1266780 1260248 1249962 1235939 1217090 1192654
62145 1192654 1162884 1128655 1091070 1051540 1011775 973377 937574 905299 877129 853070 832817
62134 832817 816429 804383 796653 792099 789275 787680 787668 789172 791076 792151 792274 792346 793229 795163 798190
62119 798190 802682 809207 818078 829219 842166 855758 867862 876054 879083 877699 873892 869483 865522
62106 865522 862582 860907 860011 858464 854442 846653 835043 820979 806755 794457 784992 778191 773719
62093 773719 771449 771001 771586 772770 775023 778963 784269 789783 794600 798613 802068 805171 808202 811527 815258
$$ packed form
62182E84719J0390J1526J2690J3192J2536J0615Q015N764M520M249M653N583P002
62169F95454Q973J1795J5738K0516K5438L0297L5575M1455M7014N0912N2543N2035
62157A087745M9358M4144L6390K6820J6553O838j068o532j0286j4023j8849k4436
62145A192654k9770l4229l7585l9530l9765l8398l5803l2275k8170k4059k0253
62134H32817j6388j2046p730m554k824j595j2J504J904J075J23P2Q83J934L027
62119G98190M492O525Q871J1141J2947J3592J2104Q192L029j384l807m409l961
62106H65522k940j675q96j547m022p789j1610j4064j4224j2298r465o801m472
62093G73719k270m48N85J184K253L940N306N514M817M013L455L103L031L325L731
$$ plain form
62078 815258 819222 823542 828962 836300 845733 856826 869158 882722 897747 914304 932184 951112
62066 951112 971096 992481 1015623 1040747 1068344 1099420 1134640 1172964 1211523 1247158 1277837
62055 1277837 1302471 1320014 1329547 1331184 1326323 1316772 1303797 1287813 1268418 1244550 1215076 1179670
62043 1179670 1139222 1095373 1049817 1004017 959251 916567 876663 839835 806012 774821 745846
62032 745846 719014 694791 673899 656727 642907 631443 621406 612542 605067 598815 592949 586754
62020 586754 580366 574273 568339 561948 555055 548439 542722 537781 533314 529382 525932 522332 518030 513443
62006 513443 509634 507208 505930 505276 504888 504656 504831 506031 508658 512248 515797 518747 521264 523538 525285
61991 525285 526069 525762 524488 522427 519762 516549 512483 507052 500073 491886 482986 473739 464534 455873 448120
$$ packed form
62078H15258L964M320N420P338R433J1093J2332J3564J5025J6557J7880J8928
62066I51112J9984K1385K3142K5124K7597L1076L5220L8324L8559L5635L0679
62055A277837K4634J7543R533J637m861r551j2975j5984j9395k3868k9474l5406
62043A179670m0448m3849m5556m5800m4766m2684l9904l6828l3823l1191k8975
62032G45846k6832k4223k0892j7172j3820j1464j0037q864p475o252n866o195
62020E86754o388o093n934o391o893o616n717m941m467l932l450l600m302m587
62006E13443l809k426j278o54l88k32J75J200K627L590L549K950K517K274J747
61991E25285P84l07j274k061k665l213m066n431o979q187q900r247r205q661p753
$$ plain form
61976 448120 441423 435947 431862 428934 426414 423557 420123 416323 412576 409385 407068 405381 403706 401867
61962 401867 400432 399948 400218 400611 400765 400628 400109 399170 398115 397341 396873 396476 396107 395914 395898 395974 396333 397422
61944 397422 399594 403054 408026 414574 422300 430584 439147 448128 457741 468153 479525 491696 503916
61931 503916 515433 526335 537280 548364 558855 568193 576547 584082 590287 594551 596958 597922 597337
61918 597337 594691 589950 583808 577134 570664 565206 561567 559984 559973 561077 563653 568728 577083 588576
61904 588576 602254 617001 632008 646694 660300 671770 680149 685048 686667 685463 681899 676469 669750
61891 669750 662334 654673 646955 639143 631192 623286 615827 609173 603487 598782 594891 591268 587026 581412
61877 581412 574205 565548 555536 544300 532435 521048 511131 502955 496115 490045 484479 479526 475404
$$ packed form
61976D48120o697n476m085k928k520k857l434l800l747l191k317j687j675j839
61962D01867j435m84K70L93J54j37n19r39j055p74m68l97l69j93j6P6L59J089
61944C97422K172L460M972O548P726Q284Q563Q981R613J0412J1372J2171J2220
61931E03916J1517J0902J0945J1084J0491R338Q354P535O205M264K407R64n85
61918E97337k646m741o142o674o470n458l639j583j1J104K576N075Q355J1493
61904E88576J3678J4747J5007J4686J3606J1470Q379M899J619j204l564n430o719
61891F69750p416p661p718p812p951p906p459o654n686m705l891l623m242n614
61877E81412p207q657j0012j1236j1865j1387r917q176o840o070n566m953m122
$$ plain form
61864 475404 472063 469043 465914 462962 461279 461945 465069 469817 475370 481749 489667 499733 511943 525807
61850 525807 540786 556644 573546 591900 611980 633601 656087 678533 700076 720060 738064
61839 738064 753731 766397 774991 778582 777098 771343 762323 750830 737770 724488 712441 702661 695716
61826 695716 692004 691794 695067 701564 710891 722399 735066 747756 759532 769563 776882 780544 779907
61813 779907 774606 764507 750030 732349 712800 692195 671058 650275 630883 613222 596911 581702
61801 581702 567771 555072 543144 531877 521908 513781 507168 501288 495739 490508 485576 480960 476877
61788 476877 473441 470421 467647 465318 463546 461947 460138 458353 457059 456232 455569 455132 455133 455243 454803 453709
61772 453709 452460 451332 450181 449105 448608 448853 449392 449937 450863 452539 454589 456307 457539 458790 460576
$$ packed form
61864D75404l341l020l129k952j683O66L124M748N553O379P918J0066J2210J3864
61850E25807J4979J5858J6902J8354K0080K1621K2486K2446K1543J9984J8004
61839G38064J5667J2666Q594L591j484n755r020j1493j3060j3282j2047r780o945
61826F95716l712k10L273O497R327J1508J2667J2690J1776J0031P319L662o37
61813G79907n301j0099j4477j7681j9549k0605k1137k0783j9392j7661j6311j5209
61801E81702j3931j2699j1928j1267r969q127o613n880n549n231m932m616m083
61788D76877l436l020k774k329j772j599j809j785j294q27o63m37JJ10m40j094
61772D53709j249j128j151j076m97K45N39N45R26J676K050J718J232J251J786
$$ plain form
61757 460576 462979 465728 468494 471148 473817 476597 479193 481100 482223 483029 483881 484479 484127 482367 479253
61742 479253 475261 471120 467434 464261 461238 458237 455629 453760 452556 451896 451992 452994 454499 455926 457271
61727 457271 459007 461279 463641 465589 467046 468275 469649 471546 474118 477049 479793 482148 484392 486849
61713 486849 489565 492429 495248 497574 498799 498665 497540 495986 494240 492255 490010 487501 484599 481289
61699 481289 477986 475303 473407 471800 469808 467132 463900 460406 456976 453901 451312 449080 446914 444557
61685 444557 441919 439139 436561 434514 432964 431475 429661 427652 425977 424975 424415 423641 421989 419169 415555
61670 415555 412198 410310 410415 411895 413408 413825 412872 411102 409318 407935 406800 405691 404847 404790 405646 406937
61654 406937 408215 409566 411228 413016 414462 415397 415976 416255 416140 415782 415601 415831 416369 417150 418324 419945
$$ packed form
61757D60576K403K749K766K654K669K780K596J907J123Q06Q52N98l52j760l114
61742D79253l992m141l686l173l023l001k608j869j204o60R6J002J505J427J345
61727D57271J736K272K362J948J457J229J374J897K572K931K744K355K244K457
61713D86849K716K864K819K326J225j34j125j554j746j985k245k509k902l310
61699D81289l303k683j896j607j992k676l232l494l430l075k589k232k166k357
61685D44557k638k780k578k047j550j489j814k009j675j002n60p74j652k820l614
61670D15555l357j888J05J480J513M17r53j770j784j383j135j109q44n7Q56J291
61654D06937J278J351J662J788J446R35N79K79j15l58j81K30N38P81J174J621
$$ plain form
61638 419945 421849 424067 426944 430507 433992 436386 437354 437306 436714 435722 434412 433042 431849 430799 429656
61623 429656 428175 426194 423678 420744 417558 414165 410535 406784 403243 400232 397831 395917 394308 392827
61609 392827 391292 389478 387117 383946 379849 375008 369825 364609 359343 353843 348142 342660 337916 334129
61595 334129 331143 328677 326497 324319 321805 318845 315735 312848 310236 307786 305692 304336 303642 302947 301798
61580 301798 300539 299722 299193 298201 296402 294309 292636 291523 290609 289682 289014 289088 289978 291018 291164 289938 287988
61563 287988 286487 285954 285941 285921 286063 286812 288019 289010 289499 290021 291299 293476 296166 298993 301779 304303 306224
61546 306224 307395 308048 308542 308983 309213 309116 308843 308739 309166 310378 312430 315078 317808 320032 321340 321661 321264
61529 321264 320623 320159 320021 320082 320065 319612 318385 316352 314052 312319 311562 311405 311181 310651 310063 309638 309297 308850
$$ packed form
61638D19945J904K218K877L563L485K394R68m8n92r92j310j370j193j050j143
61623D29656j481j981k516k934l186l393l630l751l541l011k401j914j609j481
61609C92827j535j814k361l171m097m841n183n216n266n500n701n482m744l787
61595C34129k986k466k180k178k514k960l110k887k612k450k094j356o94o95j149
61580C01798j259q17n29r92j799k093j673j113r14r27o68P4Q90J040J46j226j950
61563B87988j501n33j3k0J42P49J207R91M89N22J278K177K690K827K786K524J921
61546C06224J171O53M94M41K30r7k73j04M27J212K052K648K730K224J308L21l97
61529C21264o41m64j38O1j7m53j227k033k300j733p57j57k24n30n88m25l41m47
$$ plain form
61511 308850 308161 307079 305510 303731 302388 301947 302221 302609 302746 302776 303043 303663 304378 304687 304134 302658 300735
61494 300735 299146 298485 298815 299765 300916 302109 303373 304564 305238 305135 304737 304999 306316 308009 309089 309336
61478 309336 309319 309531 309989 310707 312037 314232 316937 319459 321404 322855 324048 325089 325894 326192 325697 324536
61462 324536 323378 322840 322774 322463 321571 320582 320171 320415 320902 321441 322280 323552 324814 325432 325398 325483 326407 327954
61444 327954 329187 329547 329456 329755 330883 332836 335588 339015 342554 345470 347646 349669 351940 354068 355417
61429 355417 356001 356533 357690 359525 361492 362879 363347 363191 363007 363064 363185 363274 363565 364216 365024 365852 366904 368191
61411 368191 369113 369114 368485 367862 367138 365628 363287 360945 359171 357679 356206 355173 354881 354695 353797 352392 351322
61394 351322 350696 349747 348126 346500 345581 345232 345002 345007 345728 347129 348602 349723 350570 351241 351540 351415 351350 351945
$$ packed form
61511C08850o89j082j569j779j343m41K74L88J37L0K67O20P15L09n53j476j923
61494C00735j589o61L30R50J151J193J264J191O74j03l98K62J317J693J080K47
61478C09336j7K12M58P18J330K195K705K522J945J451J193J041Q05K98m95j161
61462C24536j158n38o6l11q92r89m11K44M87N39Q39J272J262O18l4Q5R24J547
61444C27954J233L60r1K99J128J953K752L427L539K916K176K023K271K128J349
61429C55417N84N32J157J835J967J387M68j56j84N7J21Q9K91O51Q08Q28J052J287
61411C68191R22Jo29o23p24j510k341k342j774j492j473j033k92j86q98j405j070
61394C51322o26r49j621j626r19l49k30NP21J401J473J121Q47O71K99j25o5N95
$$ plain form
61376 351945 353246 354816 356449 358441 361079 364151 367159 369801 371952 373323 373582 372954 372391 372828 374300
61361 374300 375994 377198 378014 379056 380632 382410 383946 385349 387301 390503 395220 401265 408246 415772
61347 415772 423574 431494 439264 446319 452011 456101 458904 460969 462861 465248 468778 473544 478853 483803
61333 483803 487907 491006 492902 493575 493605 493792 494291 494448 493597 491666 488999 485965 482909 480185 478012 476438
61317 476438 475477 475116 475279 476046 477815 480926 485157 490022 495529 502164 510072 518879 528509 539580 552696
61302 552696 567769 584295 601703 618993 634535 646939 655927 661947 665233 665722 663585 659201 652748
61289 652748 644385 634749 624708 614600 604167 593243 582046 570827 559710 548960 539038 530262
61277 530262 522715 516493 511774 508666 507249 507637 509645 512537 515559 518637 522074 525603 528409 530171
$$ packed form
61376C51945J301J570J633J992K638L072L008K642K151J371K59o28n63M37J472
61361C74300J694J204Q16J042J576J778J536J403J952L202M717O045O981P526
61347D15772P802P920P770P055N692M090K803K065J892K387L530M766N309M950
61333D83803M104L099J896O73L0J87M99J57q51j931k667l034l056k724k173j574
61317D76438r61l61J63P67J769L111M231M865N507O635P908Q807R630J1071J3116
61302E52696J5073J6526J7408J7290J5542J2404Q988O020L286M89k137m384o453
61289F52748q363r636j0041j0108j0433j0924j1197j1219j1117j0750r922q776
61277E30262p547o222m719l108j417L88K008K892L022L078L437L529K806J762
$$ plain form
61263 530171 531493 533087 535064 537386 540580 545562 552829 561921 571520 580053 586582 591279 594824 597409
61249 597409 598755 599032 599081 599491 600002 600117 599753 598909 597217 594396 590858 587388 584475 582320 581129 580854
61233 580854 580870 580447 579462 578321 577394 576988 577622 579717 583103 587357 592583 599279 607386 616059 624494 632535
61217 632535 640356 648039 655727 663777 672438 681516 690525 699005 706627 713250 718927 723640 727021 728726
61203 728726 729167 729481 730628 732799 735835 739710 744394 749695 755684 763016 772395 783951 797356 812166
61189 812166 827512 841716 853001 860712 865483 868224 869428 869464 868809 867613 865412 861697 856582 850623
61175 850623 844267 837678 830856 823565 815391 806271 796815 787667 778702 769403 759946 751177 743252 734942
61161 734942 724881 713127 700974 689419 678433 667626 656937 646508 636479 627266 619587 613827
$$ packed form
61263E30171J322J594J977K322L194M982P267R092R599Q533O529M697L545K585
61249E97409J346K77M9M10N11J15l64q44j692k821l538l470k913k155j191k75
61233E80854J6m23r85j141r27m06O34K095L386M254N226O696Q107Q673Q435Q041
61217F32535P821P683P688Q050Q661R078R009Q480P622O623N677M713L381J705
61203G28726M41L14J147K171L036L875M684N301N989P332R379J1556J3405J4810
61189H12166J5346J4204J1285P711M771K741J204L6o55j196k201l715n115n959
61175H50623o356o589o822p291q174r120r456r148q965r299r457q769p925q310
61161G34942j0061j1754j2153j1555j0986j0807j0689j0429j0029r213p679n760
$$ plain form
61149 613827 609690 606867 605681 606419 608175 609055 607696 604128 598993 592570 584974 576816 569007 562029 555929
61134 555929 550891 547203 544551 542030 539252 537085 536853 538932 542576 547018 552367 559328 568397 579554
61120 579554 592574 607362 623930 642168 661728 682231 703658 726487 751324 778242 806410
61109 806410 834480 861509 887555 913200 938376 961932 982668 1000641 1016944 1032137 1045470
61098 1045470 1055854 1062967 1066815 1066775 1061972 1052517 1039547 1023908 1005578 984628 961961 938558 914566
61085 914566 889796 864742 840378 817123 794664 772827 752017 732656 714733 698153 683104
61074 683104 669739 657760 646658 636317 627139 619578 613757 609533 606747 605259 604837 605173 606103 607708
61060 607708 610096 613135 616567 620378 624956 630810 638187 646843 656105 665367 674820 685592 698686 713793
$$ packed form
61149F13827m137k823j186P38J756Q80j359l568n135o423p596q158p809o978o100
61134E55929n038l688k652k521k778k167k32K079L644M442N349O961R069J1157
61120E79554J3020J4788J6568J8238J9560K0503K1427K2829K4837K6918K8168
61109H06410K8070K7029K6046K5645K5176K3556K0736J7973J6303J5193J3333
61098A045470J0384P113L848m0m803r455j2970j5639j8330k0950k2667k3403k3992
61085I14566k4770k5054k4364k3255k2459k1837k0810j9361j7923j6580j5049
61074F83104j3365j1979j1102j0341r178p561n821m224k786j488m22L36R30J605
61060F07708K388L039L432L811M578N854P377Q656R262R262R453J0772J3094J5107
$$ plain form
61046 713793 729608 745472 762220 781152 802646 826149 851089 877242 904414 932416 961382
61035 961382 991807 1024195 1058808 1095551 1133920 1173450 1214613 1258885 1307251 1358679 1410589
61024 1410589 1460868 1509121 1556206 1603332 1651829 1703419 1760321 1824965 1899161 1983118 2075413
61013 2075413 2174379 2279739 2393286 2519053 2663620 2835804 3045463 3303165 3621539 4016105
61003 4016105 4504458 5107151 5852499 6780775 7943090 9397720 11203039 13388634 15889604
60994 15889604 18478540 20777332 22395375 23125490 23053170 22498276 21852530 21441881 21467585
60985 21467585 21977430 22824075 23658348 24034957 23611972 22312889 20333600 18007322 15645403
60976 15645403 13453326 11529607 9899050 8543949 7427375 6510256 5759118 5145353
$$ packed form
61046G13793J5815J5864J6748J8932K1494K3503K4940K6153K7172K8002K8966
61035I61382L0425L2388L4613L6743L8369L9530M1163M4272M8366N1428N1910
61024A410589N0279M8253M7085M7126M8497N1590N6902O4644P4196Q3957R2295
61013B075413R8966J05360J13547J25767J44567J72184K09659K57702L18374L94566
61003D016105M88353O02693P45348R28276J162315J454630J805319K185595K500970
60994A5889604K588936K298792J618043P30115p2320n54894o45746m10649K5704
60985B1467585N09845Q46645Q34273L76609m22985j299083j979289k326278k361919
60976A5645403k192077j923719j630557j355101j116574r17119p51138o13765
$$ plain form
60968 5145353 4643582 4233057 3898275 3626122 3403091 3216098 3054935 2912920 2785752
60959 2785752 2670462 2564824 2466845 2374828 2287970 2206394 2130332 2059669 1994227 1933599 1876270
60948 1876270 1819600 1761332 1700954 1639413 1578065 1518148 1460682 1406216 1354751 1306128 1260213
60937 1260213 1216659 1174916 1134723 1096168 1059075 1022856 987271 952844 920206 889447 860493
60926 860493 833612 809090 786699 765974 746704 728811 712072 696412 682204 669750 658692
60915 658692 648340 638435 629125 620441 612351 605279 599996 596857 595487 595303 595973 597312 599022 600762
60901 600762 602353 603866 605593 607906 610955 614457 617803 620342 621566 621268 619720 617625 615646 613945
60887 613945 612190 609863 606511 601871 595983 589130 581616 573723 565897 558642 551942 545065 537281 528722
$$ packed form
60968E145353n01771m10525l34782k72153k23031j86993j61163j42015j27168
60959B785752j15290j05638r7979r2017q6858q1576p6062p0663o5442o0628n7329
60948A876270n6670n8268o0378o1541o1348n9917n7466n4466n1465m8623m5915
60937A260213m3554m1743m0193l8555l7093l6219l5585l4427l2638l0759k8954
60926H60493k6881k4522k2391k0725j9270j7893j6739j5660j4208j2454j1058
60915F58692j0352r905r310q684q090p072n283l139j370j84O70J339J710J740
60901F00762J591J513J727K313L049L502L346K539J224k98j548k095j979j701
60887F13945j755k327l352m640n888o853p514p893p826p255o700o877p784q559
$$ plain form
60873 528722 520254 512553 505584 498962 492534 486462 480870 475563 470171 464594 459230 454680 451284 449078
60859 449078 448089 448294 449279 450272 450701 450486 449792 448845 448145 448353 449660 451576 453581 455607 457533 458680 458409
60842 458409 457008 455428 454205 453101 451725 450024 448113 446060 443958 441968 440242 438976 438392 438415 438532
60827 438532 438350 438192 438779 440434 442942 445993 449238 452005 453579 453941 453779 453622 453381 452776 451759 450394
60811 450394 448775 447250 446233 445487 444073 441374 437855 434463 431531 428672 425502 422037 418442 414763
60797 414763 411023 407312 403668 399883 395497 390129 383998 378055 373275 369765 366782 363648 360295 356908
60783 356908 353510 350188 347352 345368 344153 343375 342831 342408 341977 341671 341994 343263 345118 346947 348592 350279
60767 350279 352135 354252 357014 360731 365052 369314 373460 377991 383031 388115 393026 398064 403139 407296
$$ packed form
60873E28722q468p701o969o622o428o072n592n307n392n577n364m550l396k206
60859D49078r89K05R85R93M29k15o94r47p00K08J307J916K005K026J926J147k71
60842D58409j401j580j223j104j376j701j911k053k102j990j726j266n84K3J17
60827D38532j82j58N87J655K508L051L245K767J574L62j62j57k41o05j017j365
60811D50394j619j525j017p46j414k699l519l392k932k859l170l465l595l679
60797D14763l740l711l644l785m386n368o131n943m780l510k983l134l353l387
60783C56908l398l322k836j984j215p78n44m23m31l06L23J269J855J829J645J687
60767C50279J856K117K762L717M321M262M146M531N040N084M911N038N075M157
$$ plain form
60753 407296 409699 410595 410770 410565 410051 409724 410132 410982 411411 411161 410749 410392 409554 407774 405232 402072 397837
60736 397837 392142 385436 378542 371765 365087 358953 354122 350659 347700 344408 340820 337628 335405 334131
60722 334131 333184 331782 329702 327569 326178 325572 325168 324709 324580 325052 325719 325926 325392 324175 322477 320750
60706 320750 319641 319441 319847 320501 321431 322631 323641 324008 323937 324059 324779 326245 328654 332002 335702 339097
60690 339097 342254 345729 349595 353336 356720 360115 363805 367624 371507 375850 380968 386617 392332 397833
60676 397833 402851 406999 410207 412924 415496 417647 418920 419308 419049 418041 415908 412522 408046 402628 396420
60661 396420 389837 383409 377441 372134 367937 365373 364437 364471 364647 364428 363724 362951 362865 363953 365922 368081
60645 368081 370209 372646 375474 378033 379491 379662 379002 377971 376546 374328 370992 366685 362065 357920 354750
$$ packed form
60753D07296K403Q96J75k05n14l27M08Q50M29k50m12l57q38j780k542l160m235
60736C97837n695o706o894o777o678o134m831l463k959l292l588l192k223j274
60722C34131r47j402k080k133j391o06m04m59j29M72O67K07n34j217j698j727
60706C20750j109k00M06O54R30J200J010L67p1J22P20J466K409L348L700L395
60690C39097L157L475L866L741L384L395L690L819L883M343N118N649N715N501
60676C97833N018M148L208K717K572K151J273L88k59j008k133l386m476n418o208
60661C96420o583o428n968n307m197k564r36L4J76k19p04p73q6J088J969K159
60645C68081K128K437K828K559J458J71o60j031j425k218l336m307m620m145l170
$$ plain form
60630 354750 352655 351441 350683 349916 349056 348614 349140 350489 351938 353022 353924 354974 356160 357290 358330 359308
60614 359308 360058 360253 359643 358238 356498 355340 355553 356962 358479 359234 359419 359784 360609 361564 362348 362942 363295
60597 363295 363239 362865 362629 362892 363530 364134 364465 364664 365122 366124 367511 368709 369227 369084 368612 367990 367224 366520
60579 366520 366279 366636 367291 367956 368758 370096 372281 375406 379406 384202 390003 397414 406896 418044 429829
60564 429829 441711 454073 467200 480230 491601 500258 505943 508597 508165 505014 499890 493310 485530
60551 485530 477277 469951 464699 461643 460317 460539 462418 465804 470265 475585 481968 489772 499413 511473
60537 511473 526486 544358 564159 584599 604642 623543 640397 653776 662068 664410 661446 655013
60525 655013 646946 638220 629179 620184 611666 603788 596482 589823 583995 578882 574098 569593 565904 563622
$$ packed form
60630C54750k095j214p58p67q60m42N26J349J449J084R02J050J186J130J040R78
60614C59308P50J95o10j405j740j158K13J409J517P55J85L65Q25R55P84N94L53
60597C63295n6l74k36K63O38O04L31J99M58J002J387J198N18j43m72o22p66p04
60579C66520k41L57O55O65Q02J338K185L125M000M796N801P411R482J1148J1785
60564D29829J1882J2362J3127J3030J1371Q657N685K654m32l151n124o580p780
60551D85530q253p326n252l056j326K22J879L386M461N320O383P804R641J2060
60537E11473J5013J7872J9801K0440K0043J8901J6854J3379Q292K342k964o433
60525F55013q067q726r041q995q518p878p306o659n828n113m784m505l689k282
$$ plain form
60511 563622 562823 563172 564361 566271 568840 571990 575722 580246 586094 594105 605124 619726 638350 661614
60497 661614 690080 723686 761757 803750 849548 898711 949740 1000519 1049272 1094666 1135045
60486 1135045 1168028 1190990 1201833 1199441 1183829 1156080 1118050 1072111 1021064 967883 915067
60475 915067 864181 816144 771704 731249 694436 660662 629947 602844 579444 559053 541062
60464 541062 525497 512315 500698 489691 479278 470245 463043 457260 452223 447654 443621 440085 436648
60451 436648 432738 428162 423549 419936 417580 415439 412251 408013 403911 400911 399021 397985 397919 398868 400191
60436 400191 401006 401066 400829 400725 400675 400281 399240 397639 396002 394917 394389 393740 392424 390829 389949 390278 391325
60419 391325 392239 392675 393007 393936 395964 398984 402233 404792 406203 406606 406372 405823 405240 404875 404853 405233 406202
$$ packed form
60511E63622p99L49J189J910K569L150L732M524N848Q011J1019J4602J8624K3264
60497F61614K8466L3606L8071M1993M5798M9163N1029N0779M8753M5394M0379
60486A135045L2983K2962J0843k392j5612k7749l8030m5939n1047n3181n2816
60475I15067n0886m8037m4440m0455l6813l3774l0715k7103k3400k0391j7991
60464E41062j5565j3182j1617j1007j0413r033p202n783n037m569m033l536l437
60451D36648l910m576m613l613k356k141l188m238m102l000j890j036o6R49J323
60436D00191Q15O0k37j04n0l94j041j601j637j085n28o49j316j595q80L29J047
60419C91325R14M36L32R29K028L020L249K559J411M03k34n49n83l65k2L80R69
$$ plain form
60402 406202 407959 410392 413079 415713 418260 420678 422817 424799 427136 430129 433360 436193 438622 441186
60388 441186 444041 446555 448061 448750 449567 451318 454090 457448 460942 464310 467416 470275 473201 476647 480659
60373 480659 484678 488202 491560 495559 500271 504664 507745 509675 511358 513273 515248 517135 519039 520875
60359 520875 522421 524026 526704 531125 536878 543091 549528 556778 565612 576471 589304 603480 617937
60346 617937 631772 644622 656172 665408 670817 671477 667754 660901 652187 642417 632050 621587 611792
60333 611792 603365 596299 589782 583092 576493 570869 566458 562411 557725 552213 546227 539828 532713 524965
60319 524965 517468 511472 507829 506607 507191 508717 510619 512991 516423 521539 528791 538606 551429 567369
60305 567369 585967 606623 629255 654140 680828 707392 731058 749476 761216 765375 761391 749472
$$ packed form
60402D06202J757K433K687K634K547K418K139J982K337K993L231K833K429K564
60388D41186K855K514J506O89Q17J751K772L358L494L368L106K859K926L446M012
60373D80659M019L524L358L999M712M393L081J930J683J915J975J887J904J836
60359E20875J546J605K678M421N753O213O437P250Q834J0859J2833J4176J4457
60346F17937J3835J2850J1550R236N409O60l723o853q714r770j0367j0463r795
60333F11792q427p066o517o690o599n624m411m047m686n512n986o399p115p748
60319E24965p497n996l643j222N84J526J902K372L432N116P252R815J2823J5940
60305E67369J8598K0656K2632K4885K6688K6564K3666J8418J1740M159l984j1919
$$ plain form
60293 749472 730666 706293 677793 647467 618603 593939 574039 557838 544604 534568 527652 522721
60281 522721 518549 514831 511689 508844 505924 503052 500380 497404 493514 488970 484586 480590 476587 472566
60267 472566 469093 466423 464185 462095 460194 458239 455737 452965 451086 450624 450600 449866 448685 448048 447937 447344
60251 447344 445846 444138 442942 442295 442101 442496 443340 444098 444682 445788 447868 450320 452239 453548 454777 456056
60235 456056 457012 457529 457941 458486 459097 459812 460901 462441 464214 466143 468422 470972 473190 474560 475268 475911
60219 475911 476787 477792 478880 480246 482093 484520 487699 491866 497024 502887 509280 516359 524218 532425
60205 532425 540263 547461 554402 561507 568624 575267 581294 587082 592987 598912 604503 609593 614248 618471
60191 618471 622082 624845 626566 627040 626179 624279 622029 620023 618257 616174 613189 609105 604089 598437 592412
$$ packed form
60293G49472j8806k4373k8500l0326k8864k4664j9900j6201j3234j0036o916m931
60281E22721m172l718l142k845k920k872k672k976l890m544m384l996m003m021
60267D72566l473k670k238k090j901j955k502k772j879m62k4p34j181o37j11n93
60251D47344j498j708j196o47j94L95Q44P58N84J106K080K452J919J309J229J279
60235D56056R56N17M12N45O11P15J089J540J773J929K279K550K218J370P08O43
60219D75911Q76J005J088J366J847K427L179M167N158N863O393P079P859Q207
60205E32425P838P198O941P105P117O643O027N788N905N925N591N090M655M223
60191F18471L611K763J721M74q61j900k250k006j766k083k985m084n016n652o025
$$ plain form
60176 592412 586248 580180 574476 569404 565055 561241 557720 554593 552273 550815 549432 547063 543504 539638
60162 539638 536365 533620 530800 527920 525798 525002 525100 525219 525078 525123 525825 527145 528635 529784 530303 530346 530486
60145 530486 531217 532414 533484 534088 534475 534988 535565 536058 536876 538937 542844 548334 554571 560842 566835 572405
60129 572405 577333 581410 584684 587521 590331 593179 595739 597702 599187 600630 602296 604109 606006 608203
60115 608203 610913 613965 617033 620179 623846 628162 632472 635726 637286 637313 636556 635846 635580 635445 634716 632967
60099 632967 630412 627440 623992 619717 614702 609732 605671 602755 600542 598422 596119 593914 592477 592317
60085 592317 593191 594123 594197 593399 592601 592663 593530 594221 593686 591730 589065 586456 583927 580881 576901 572198 567157
60068 567157 561658 555147 547502 539654 533033 528177 524101 519393 513883 508802 505173 502589 499920 496711
$$ packed form
60176E92412o164o068n704n072m349l814l521l127k320j458j383k369l559l866
60162E39638l273k745k820k880k122p96R8J19j41M5P02J320J490J149N19M3J40
60145E30486P31J197J070O04L87N13N77M93Q18K061L907N490O237O271N993N570
60129E72405M928M077L274K837K810K848K560J963J485J443J666J813J897K197
60115F08203K710L052L068L146L667M316M310L254J560K7p57p10k66j35p29j749
60099F32967k555k972l448m275n015m970m061k916k213k120k303k205j437j60
60085E92317Q74R32P4p98p98O2Q67O91n35j956k665k609k529l046l980m703n041
60068E67157n499o511p645p848o621m856m076m708n510n081l629k584k669l209
$$ plain form
60054 496711 493265 489741 486008 482324 479312 477118 475379 474283 474836 477519 481364 485001 488171 491580
60040 491580 495737 500700 506622 513557 520752 526992 531895 536187 540523 544640 547919 550197 551567 551849
60026 551849 550756 548412 545278 541609 537264 532001 525807 519043 512414 506680 502087 498020 493342 487286
60012 487286 480141 473094 467239 462709 458848 455176 451773 448618 445120 440866 436492 433159 431224 430043
59998 430043 428974 427884 426602 424795 422732 421520 421980 423712 425766 427856 430343 433362 436576 439742
59984 439742 443026 446719 450892 455286 459349 462524 464745 466406 467582 467585 465750 462473 458963 456037 453586
59969 453586 451147 448505 445689 442861 440333 438346 436722 435076 433454 432399 432299 433029 434342 436097 437851
59954 437851 438694 438104 436799 436199 436971 438446 439568 440053 440432 441231 442402 443478 444004 443814 443142 442523 442358
$$ packed form
60054D96711l446l524l733l684l012k194j739j096N53K683L845L637L170L409
60040D91580M157M963N922O935P195O240M903M292M336M117L279K278J370K82
60026E51849j093k344l134l669m345n263o194o764o629n734m593m067m678o056
60012D87286p145p047n855m530l861l672l403l155l498m254m374l333j935j181
59998D30043j069j090j282j807k063j212M60J732K054K090K487L019L214L166
59984D39742L284L693M173M394M063L175K221J661J176Lj835l277l510k926k451
59969D53586k439k642k816k828k528j987j624j646j622j055j00P30J313J755J754
59954D37851Q43n90j305o00P72J475J122M85L79P99J171J076N26j90o72o19j65
$$ plain form
59937 442358 442417 441957 440507 438373 436217 434348 432731 431450 430725 430547 430859 432127 435095 439672 444649 449042
59921 449042 453336 458828 465972 474051 482361 490903 499650 507693 513689 517040 518353 518762 518987 519061 518803
59906 518803 518323 517910 517570 517048 516467 516566 517927 520144 522139 523239 523583 523678 524057 525357 528063 531837 535535
59889 535535 538268 540264 542405 545149 548263 551439 554767 558533 562798 567332 571835 576175 580486 585065
59875 585065 590067 595287 600228 604425 607635 609725 610377 609033 605279 599369 592307 585309 579140 573932
59861 573932 569511 565776 562785 560605 559147 558287 558200 559384 562096 565822 569747 573885 579318 587036 596909
59846 596909 608114 620064 632203 643107 650700 653714 652566 648735 643797 639195 636234 635565 636683
59833 636683 638138 638202 635394 628955 619409 608562 598456 590137 583423 577734 572856 568933 565993 563650
$$ packed form
59937D42358N9m60j450k134k156j869j617j281p25j78L12J268K968M577M977M393
59921D49042M294N492P144Q079Q310Q542Q747Q043N996L351J313M09K25P4k58
59906E18803m80m13l40n22n81R9J361K217J995J100L44R5L79J300K706L774L698
59889E35535K733J996K141K744L114L176L328L766M265M534M503M340M311M579
59875E85065N002N220M941M197L210K090O52j344l754n910p062o998o169n208
59861E73932m421l735k991k180j458q60q7J184K712L726L925M138N433P718R873
59846E96909J1205J1950J2139J0904P593L014j148l831m938m602k961o69J118
59833F36683J455O4k808o439r546j0847j0106q319o714n689m878l923k940k343
$$ plain form
59819 563650 561258 558410 555310 552618 550841 549854 549039 547859 546268 544613 543165 541761 539993 537741 535395
59804 535395 533446 532006 530859 529827 528828 527750 526542 525356 524302 523226 521998 520970 520668 521049 521477
59789 521477 521489 521146 520545 519482 517820 515780 513609 511254 508623 505880 503276 500926 498871 497089 495323
59774 495323 493253 491012 489147 487905 487003 486290 486095 486621 487524 488578 490256 493076 496737 500516 504256
59759 504256 508312 512698 516903 520554 523822 527217 531394 536944 543842 551211 558123 564530 570934 577376
59745 577376 583413 588951 594320 599432 603660 606753 609200 611399 613159 614352 615444 616820 618042 618366
59731 618366 617787 617135 617206 618136 619455 620443 620587 619970 619209 618887 619131 619741 620363 620403 619173 616546 613306 610522
59713 610522 608663 607513 606722 606095 605426 604485 603304 602317 602089 602836 604141 605208 605609 605873 607074 609750
$$ packed form
59819E63650k392k848l100k692j777r87q15j180j591j655j448j404j768k252k346
59804E35395j949j440j147j032r99j078j208j186j054j076j228j028l02L81M28
59789E21477J2l43o01j063j662k040k171k355k631k743k604k350k055j782j766
59774D95323k070k241j865j242r02p13j95N26R03J054J678K820L661L779L740
59759E04256M056M386M205L651L268L395M177N550O898P369O912O407O404O442
59745E77376O037N538N369N112M228L093K447K199J760J193J092J376J222L24
59731F18366n79o52P1R30J319R88J44o17p61l22K44O10O22M0j230k627l240k784
59713F10522j859j150p91o27o69r41j181r87k28P47J305J067M01K64J201K676
$$ plain form
59697 609750 613460 617513 621754 626356 631227 636086 640944 645903 650479 653584 654500 653595 651876 649948 647658
59682 647658 644745 641603 639193 638138 638055 637881 636786 634579 631356 627130 621982 616305 610660 605482 600938
59667 600938 596866 592778 588217 583299 578661 574755 571505 568830 567067 566463 566613 566906 567366 568501 570447
59652 570447 572813 575377 578364 581853 585410 588564 591302 593799 595883 597010 596654 594555 590746 585556
59638 585556 579564 573455 567868 563222 559507 556302 553212 550312 547966 546262 544923 543713 542567 541294
59624 541294 539557 537246 534577 531682 528496 525193 522285 519934 517470 514048 509580 504696 499942 495501
59610 495501 491613 488751 487184 486646 486657 487062 488098 489947 492371 494799 496794 498354 499701 500883 501783
59595 501783 502454 503121 503765 504055 503903 503795 504312 505567 507357 509548 511914 513796 514526 514135 513241 512231 510997
$$ packed form
59697F09750L710M053M241M602M871M859M858M959M576L105R16r05j719j928k290
59682F47658k913l142k410j055q3j74j095k207l223m226n148n677n645n178m544
59667F00938m072m088m561m918m638l906l250k675j763o04J50K93M60J135J946
59652E70447K366K564K987L489L557L154K738K497K084J127l56k099l809n190
59638E85556n992o109n587m646l715l205l090k900k346j704j339j210j146j273
59624E41294j737k311k669k895l186l303k908k351k464l422m468m884m754m441
59610D95501l888k862j567n38J1M05J036J849K424K428J995J560J347J182R00
59595E01783O71O67O44K90j52j08N17J255J790K191K366J882P30l91q94j010j234
$$ plain form
59578 510997 509486 507933 506325 504157 501104 497676 494756 492593 490609 488207 485489 483086 481455 480509
59564 480509 479891 479419 479083 478667 477715 476112 474439 473377 472895 472478 472065 472210 473146 474267 474892 475156 475680
59547 475680 476674 477933 479603 482326 486472 491617 497084 502787 509339 517446 527605 540527 557499 579379
59533 579379 604473 627613 642396 645315 637858 624656 610003 596347 585088 577333 573504 573060 575185
59520 575185 579357 584898 590457 594644 597097 598438 599147 598856 596827 592769 587010 580133 572688 565100 557585
59505 557585 550108 542566 535088 528114 522174 517610 514398 512043 509679 506596 502911 499584 497525 496698
59491 496698 496321 495796 495139 494546 494039 493776 494330 496267 499522 503423 507266 510719 513876 517195 521266 526330
59475 526330 532046 537898 543741 549768 556045 562298 568001 572433 574919 575430 574854 574197 573490 571966 569375
$$ packed form
59578E10997j511j553j608k168l053l428k920k163j984k402k718k403j631r46
59564D80509o18m72l36m16r52j603j673j062m82m17m13J45R36J121O25K64N24
59547D75680R94J259J670K723M146N145N467N703O552Q107J0159J2922J6972K1880
59533E79379K5094K3140J4783K919p457j3202j4653j3656j1259p755l829m44K125
59520E75185M172N541N559M187K453J341P09k91k029m058n759o877p445p588p515
59505E57585p477p542p478o974n940m564l212k355k364l083l685l327k059q27
59491D96698l77n25o57n93n07k63N54J937L255L901L843L453L157L319M071N064
59475E26330N716N852N843O027O277O253N703M432K486N11n76o57p07j524k591
$$ plain form
59460 569375 566652 565091 565252 566859 569419 572627 576461 581210 587262 594632 602825 611352 620204 629585
59446 629585 639367 649005 657855 665316 670719 673366 672720 668575 661216 651593 641125 631028 621831 613614
59432 613614 606500 600592 595537 590553 585141 579588 574676 571001 568725 567879 568700 571540 576537 583500 592219
59417 592219 602797 615662 631303 650041 671997 697293 726404 760101 798172 837380 870861
59406 870861 890759 892619 877840 852337 823183 796094 774712 761045 756295 761297 775655 795855
59394 795855 814596 823238 816221 793928 761814 726886 694378 666566 643623 625122 610787 600330
59382 600330 593128 588307 585009 582577 580716 579659 579889 581519 584078 587064 590497 594680 599612 604908
59368 604908 610190 615309 620281 625288 630688 636760 643376 650054 656343 662123 667611 673154 678941 684886
$$ packed form
59460E69375k723j561J61J607K560L208L834M749O052P370Q193Q527Q852R381
59446F29585R782R638Q850P461N403K647o46m145p359r623j0468j0097r197q217
59432F13614p114n908n055m984n412n553m912l675k276q46Q21K840M997O963Q719
59417E92219J0578J2865J5641J8738K1956K5296K9111L3697L8071L9208L3481
59406H70861J9898J860j4779k5503k9154k7089k1382j3667m750N002J4358K0200
59394G95855J8741Q642p017k2293l2114l4928l2508k7812k2943j8501j4335j0457
59382F00330p202m821l298k432j861j057K30J630K559K986L433M183M932N296
59368F04908N282N119M972N007N400O072O616O678O289N780N488N543N787N945
$$ plain form
59354 684886 690917 697343 704674 713039 722062 731352 740748 750049 759106 768441 779165 791812 805656
59341 805656 819607 833285 846582 858711 868597 876089 881893 886297 888707 888571 886043 881506 875023
59328 875023 866526 856064 843741 829825 815065 800447 786567 773678 762262 752833 745034 737695
59316 737695 730221 723266 717663 713252 709309 705592 702368 699796 697887 696778 696449 696376 696154 696415 698551
59301 698551 703478 711084 720964 733137 747630 763335 777318 785408 784045 772318 752531 728734
59289 728734 704496 681796 661407 643721 629069 617593 609025 602690 597783 593739 590293 587311 584834
59276 584834 583322 583482 585664 589712 595537 603434 613517 625204 637656 650419 663240 675634 687287
59263 687287 698618 710068 720766 728682 732443 732463 729999 725706 719587 711867 703134 693651 683225 671965
$$ packed form
59354F84886O031O426P331Q365R023R290R396R301R057R335J0724J2647J3844
59341H05656J3951J3678J3297J2129R886P492N804M404K410j36k528m537o483
59328H75023q497j0462j2323j3916j4760j4618j3880j2889j1416r429p799p339
59316G37695p474o955n603m411l943l717l224k572j909j109l29p3k22K61K136
59301F98551M927P606R880J2173J4493J5705J3983Q090j363j1727j9787k3797
59289G28734k4238k2700k0389j7686j4652j1476q568o335m907m044l446k982k477
59276E84834j512J60K182M048N825P897J0083J1687J2452J2763J2821J2394J1653
59263F87287J1331J1450J0698P916L761K0k464m293o119p720q733r483j0426j1260
$$ plain form
59249 671965 660812 651000 643076 636610 630862 625628 621434 618943 618214 618635 619571 620985 623277 626640 630756
59234 630756 635210 639948 645114 650487 655386 659276 662326 665228 668474 671923 674936 676763 676878 675206
59220 675206 672133 668130 663300 657440 650662 643736 637650 632896 629343 626722 624978 624112 623857 623722 623392
59205 623392 622987 622851 623094 623380 623151 622036 620116 617995 616542 616212 616396 615722 613337 609809 606488 604172
59189 604172 602801 602208 602508 603633 605069 606403 607723 609239 610888 612663 614977 618197 621982 625501 628234
59174 628234 630313 632183 634230 636649 639402 642407 645951 650808 657617 666259 676042 686342 696768 706927
59160 706927 716468 725298 733377 740323 745584 749026 750963 751550 750538 747703 743167 737075 729269 719579
59146 719579 708373 696597 685267 674838 664971 654953 644548 634406 625430 617763 610687 603450
$$ packed form
59249F71965j1153r812p924o466n748n234m194k491p29M21R36J414K292L363M116
59234F30756M454M738N166N373M899L890L050K902L246L449L013J827J15j672
59220F75206l073m003m830n860o778o926o086m754l553k621j744q66k55j35l30
59205F23392m05j36K43K86k29j115j920k121j453l30J84o74k385l528l321k316
59189F04172j371n93L00J125J436J334J320J516J649J775K314L220L785L519K733
59174F28234K079J870K047K419K753L005L544M857O809Q642R783J0300J0426J0159
59160G06927R541Q830Q079O946N261L442J937N87j012k835m536o092p806r690
59146G19579j1206j1776j1330j0429r867j0018j0405j0142q976p667p076p237
$$ plain form
59134 603450 595828 587889 579758 571926 565297 560411 556819 553698 550934 549140 548582 548698 548838 549096 550121
59119 550121 552421 556168 561447 568278 576446 585655 595794 606730 617937 628784 639234 649738 660234
59106 660234 669776 677549 683834 689448 694563 698747 701952 704675 707005 708253 707822 705898 703007 699423
59092 699423 695428 691636 688545 686030 683751 681804 680452 679487 678406 677107 675811 674320 671959 668414
59078 668414 664099 659401 653960 647070 638650 629511 620767 613112 606612 600954 595804 591023 586722 583150
59064 583150 580429 578216 575732 572425 568628 565252 562737 560675 558559 556433 554426 552209 549502 546812
59050 546812 544946 543881 542830 541404 539977 538796 537516 536026 535016 535122 535862 536082 535297 534076 533176
59035 533176 532805 532773 532963 533422 534244 535496 537149 538977 540702 542375 544522 547783 552423 558346 565553 574385
$$ packed form
59134F03450p622p939q131p832o629m886l592l121k764j794n58J16J40K58J025
59119E50121K300L747N279O831Q168R209J0139J0936J1207J0847J0450J0504J0496
59106F60234R542P773O285N614N115M184L205K723K330J248m31j924k891l584
59092F99423l995l792l091k515k279j947j352r65j081j299j296j491k361l545
59078F68414m315m698n441o890q420r139q744p655o500n658n150m781m301l572
59064E83150k721k213k484l307l797l376k515k062k116k126k007k217k707k690
59050E46812j866j065j051j426j427j181j280j490j010J06P40K20p85j221r00
59035E33176l71l2J90M59Q22J252J653J828J725J673K147L261M640N923P207Q832
$$ plain form
59019 574385 585091 597243 609781 621737 632757 642898 652079 659889 665798 669408 670614 669756 667569
59006 667569 664832 662034 659366 656921 654863 653607 653965 656741 661857 668072 673996 679346 684849 690941
58992 690941 696998 701937 705254 707268 708601 709591 710142 710049 709450 708776 708140 707058 705187 703182 702315 703240
58976 703240 705654 709262 714425 721555 730375 740298 751198 763297 776472 790192 804152 818498 833339
58963 833339 848363 863100 877285 890720 902978 913495 921979 928492 933018 935073 933883 928961 920425
58950 920425 908774 894540 878225 860374 841522 822103 802562 783509 765635 749490 735398
58939 735398 723511 713818 706170 700278 695615 691363 686855 682252 678459 676109 674907 674238 673975 674212 674602
58924 674602 674668 674566 674766 674980 674209 671991 668927 665791 662921 660737 659984 660843 662407 663671 664591 665549 666354
$$ packed form
59019E74385J0706J2152J2538J1956J1020J0141R181P810N909L610J206q58k187
59006F67569k737k798k668k445k058j256L58K776N116O215N924N350N503O092
58992F90941O057M939L317K014J333R90N51r3n99o74o36j082j871k005q67R25
58976G03240K414L608N163P130Q820R923J0900J2099J3175J3720J3960J4346J4841
58963H33339J5024J4737J4185J3435J2258J0517Q484O513M526K055j190m922q536
58950I20425j1651j4234j6315j7851j8852j9419j9541j9053j7874j6145j4092
58939G35398j1887r693p648n892m663m252m508m603l793k350j202o69k63K37L90
58924F74602O6j02K00K14p71k218l064l136k870k184p53Q59J564J264R20R58Q05
$$ plain form
58907 666354 666660 667113 669056 673056 678569 685250 693794 705046 718799 733999 749786 765810 781686
58894 781686 796660 810051 821812 832592 843321 854768 867351 881244 896604 913661 932530
58883 932530 952871 973727 993738 1011618 1026504 1037953 1045767 1049981 1050929 1049056 1044512 1037048 1026460
58870 1026460 1013143 998164 982796 968041 954545 942802 933180 925612 919438 913870 908640 903875
58858 903875 899286 893886 886800 877956 867615 855674 842077 827681 813877 801270 789392 777836
58846 777836 766916 756974 747737 738797 730089 721387 711945 701413 690733 681367 673754 667125 660695
58833 660695 654323 648029 641675 635434 630064 626255 623866 622038 620044 617957 616609 616818 618522 620806
58819 620806 623092 626123 631286 638888 647566 655585 662321 668227 673764 678814 683004 686119 688182 689425
$$ packed form
58907F66354L06M53J943M000N513O681Q544J1252J3753J5200J5787J6024J5876
58894G81686J4974J3391J1761J0780J0729J1447J2583J3893J5360J7057J8869
58883I32530K0341K0856K0011J7880J4886J1449P814M214R48j873m544p464j0588
58870A026460j3317j4979j5368j4755j3496j1743r622p568o174n568n230m765
58858I03875m589n400p086q844j0341j1941j3597j4396j3804j2607j1878j1556
58846G77836j0920r942r237q940q708q702r442j0532j0680r366p613o629o430
58833F60695o372o294o354o241n370l809k389j828j994k087j348K09J704K284
58819F20806K286L031N163P602Q678Q019O736N906N537N050M190L115K063J243
$$ plain form
58805 689425 690303 691250 692188 692347 690768 687100 681919 676223 670629 664999 658813 651815 644227 636411 628474
58790 628474 620322 612101 604439 598111 593483 590372 588396 587311 586988 587382 588712 591487 595993 601738 607682
58775 607682 613114 618069 622797 627025 629913 630586 628540 623692 616321 607088 596944 586824 577262 568287
58761 568287 559731 551643 544406 538481 534196 531707 530908 531337 532476 534278 537039 540520 543621 545429 546337
58746 546337 547600 549944 553138 556799 560891 565384 570128 575288 581328 588268 595441 602288 608920 615603
58732 615603 622190 628463 634635 641065 647777 654569 661192 667015 671070 673135 674554 677225 681684 686688
58718 686688 690781 693836 696941 701219 707050 714246 722616 732164 742743 753701 764077 773089 780161
58705 780161 784580 785625 783230 778124 771035 762043 750888 737548 722174 704804 685600 665190 644483
$$ packed form
58805F89425Q78R47R38J59j579l668n181n696n594n630o186o998p588p816p937
58790F28474q152q221p662o328m628l111j976j085l23L94J330K775M506N745N944
58775F07682N432M955M728M228K888O73k046m848p371r233j0144j0120r562q975
58761E68287q556q088p237n925m285k489p99M29J139J802K761L481L101J808R08
58746E46337J263K344L194L661M092M493M744N160O040O940P173O847O632O683
58732F15603O587O273O172O430O712O792O623N823M055K065J419K671M459N004
58718F86688M093L055L105M278N831P196Q370R548J0579J0958J0376R012P072
58705G80161M419J045k395n106p089q992j1155j3340j5374j7370j9204k0410k0707
$$ plain form
58692 644483 624292 605341 588308 573557 561034 550703 542721 536895 532366 528302 524522 521007 517239
58679 517239 512647 507435 502252 497346 492709 488827 486357 485076 484077 483174 483275 485021 487901 491230 495402
58664 495402 501493 509972 520410 532209 544930 557801 569336 577787 582017 582007 578657 573174 566610
58651 566610 559796 553319 547293 541304 535006 528757 523355 519129 515638 512356 509291 506701 504534 502420
58637 502420 500115 497740 495745 494877 496003 499556 505018 511116 516698 521388 525320 528448 530419 531171 531324
58622 531324 531638 532219 532566 532337 531707 530985 530352 530131 530831 532612 535066 537897 541481 546246 551635 556246
58606 556246 559085 560326 560781 560991 561076 561214 561892 563485 565734 567910 569558 570826 571812 571969 570685 568319
58590 568319 566033 564574 563898 564163 566249 570799 577350 584968 593305 602494 612415 622660 632916 642843
$$ packed form
58692F44483k0191j8951j7033j4751j2523j0331p982n826m529m064l780l515l768
58679E17239m592n212n183m906m637l882k470j281r99r03J01J746K880L329M172
58664D95402O091Q479J0438J1799J2721J2871J1535Q451M230j0l350n483o564
58651E66610o814o477o026n989o298o249n402m226l491l282l065k590k167k114
58637E02420k305k375j995q68J126L553N462O098N582M690L932L128J971P52J53
58622E31324L14N81L47k29o30p22o33k21P00J781K454K831L584M765N389M611
58606E56246K839J241M55K10Q5J38O78J593K249K176J648J268R86J57j284k366
58590E68319k286j459o76K65K086M550O551P618Q337R189R921J0245J0256R927
$$ plain form
58576 642843 651893 659845 667197 674491 681543 687931 693924 700218 707025 714215 722250 732197 744773 760022
58562 760022 777912 798610 822116 848130 876231 905583 934556 961342 984956 1005037 1020726
58551 1020726 1030610 1034015 1031759 1025442 1016600 1006668 996975 988291 980700 974086 968300 962729 956223 947725
58537 947725 936632 922471 904879 884171 861430 837741 813755 790241 768492 749710 734251
58526 734251 721817 712085 704807 699551 695713 692732 690138 687587 685047 682820 681162 679889 678463 676428
58512 676428 673804 671106 668889 667213 665706 664185 662873 661790 660331 657920 654829 651906 649735 648472
58498 648472 648156 648567 648991 648854 648532 648945 650367 652233 653975 655446 656595 657539 659004 662024 666950 673212
58482 673212 680114 687411 695251 704165 715056 728462 743812 760003 776717 794392 812804 830449
$$ packed form
58576F42843R050P952P352P294P052O388N993O294O807P190Q035R947J2576J5249
58562G60022J7890K0698K3506K6014K8101K9352K8973K6786K3614K0081J5689
58551A020726R884L405k256o317q842r932r693q684p591o614n786n571o506q498
58537I47725j1093j4161j7592k0708k2741k3689k3986k3514k1749j8782j5459
58526G34251j2434r732p278n256l838k981k594k551k540k227j658j273j426k035
58512F76428k624k698k217j676j507j521j312j083j459k411l091k923k171j263
58498F48472l16M11M24j37l22M13J422J866J742J471J149R44J465L020M926O262
58482F73212O902P297P840Q914J0891J3406J5350J6191J6714J7675J8412J7645
$$ plain form
58470 830449 845394 856122 861601 861489 856624 848586 838445 826500 813370 800585 789755 781660 776331
58457 776331 773475 772775 774412 779305 788089 799873 812898 826440 840983 856288 870413 881113 887227
58444 887227 888322 884147 875296 863600 850980 838347 826091 814915 805493 797895 792085 788537 787700
58431 787700 789199 792105 795669 799461 803279 807417 812672 819699 828612 839367 851906 865539 878678
58418 878678 889605 897261 901287 901883 899751 895528 889094 880087 869183 858036 847743 838209 829129
58405 829129 820612 812609 804853 797840 792726 789739 787753 785994 785059 785535 786836 788340 790662 794697 800207
58390 800207 806325 812734 819304 825234 829657 832754 835521 838885 843590 850103 857875 865328 871360 876158
58376 876158 879919 881936 881968 881537 882441 884642 886911 888992 891805 895928 901231 907849 916216 926150 936829
$$ packed form
58470H30449J4945J0728N479j12m865q038j0141j1945j3130j2785j0830q095n329
58457G76331k856p00J637M893Q784J1784J3025J3542J4543J5305J4125J0700O114
58444H87227J095m175q851j1696j2620j2633j2256j1176r422p598n810l548q37
58431G87700J499K906L564L792L818M138N255P027Q913J0755J2539J3633J3139
58418H78678J0927P656M026N96k132m223o434r007j0904j1147j0293r534r080
58405H29129q517q003p756p013n114k987j986j759r35M76J301J504K322M035N510
58390H00207O118O409O570N930M423L097K767L364M705O513P772P453O032M798
58376H76158L761K017L2m31R04K201K269K081K813M123N303O618Q367R934J0679
$$ plain form
58361 936829 947712 958766 970039 981752 994488 1008446 1022802 1036455 1049027 1060374 1069687 1076082
58349 1076082 1079808 1081988 1083410 1084348 1085220 1086590 1088713 1091746 1096087 1101903 1108790 1116491 1125416 1135829
58335 1135829 1147220 1159191 1172224 1186713 1202021 1217464 1233499 1250844 1269068 1287115 1304595
58324 1304595 1321391 1336575 1348967 1358378 1365288 1369880 1372518 1374554 1377315 1380742 1384178 1388032 1393298
58311 1393298 1399900 1407017 1414834 1424615 1437014 1451434 1467043 1483437 1500399 1517855 1535980 1554690
58299 1554690 1573422 1591956 1610808 1630094 1648951 1666982 1685285 1704894 1725203 1745254 1765610
58288 1765610 1787430 1810560 1834209 1858788 1885406 1914082 1944068 1975351 2008211 2041847 2075132
58277 2075132 2108275 2142132 2176455 2210526 2244947 2280948 2318347 2356056 2394275 2434495 2477595
$$ packed form
58361I36829J0883J1054J1273J1713J2736J3958J4356J3653J2572J1347R313O395
58349A076082L726K180J422R38Q72J370K123L033M341N816O887P701Q925J0413
58335A135829J1391J1971J3033J4489J5308J5443J6035J7345J8224J8047J7480
58324A304595J6796J5184J2392R411O910M592K638K036K761L427L436L854N266
58311A393298O602P117P817R781J2399J4420J5609J6394J6962J7456J8125J8710
58299A554690J8732J8534J8852J9286J8857J8031J8303J9609K0309K0051K0356
58288A765610K1820K3130K3649K4579K6618K8676K9986L1283L2860L3636L3285
58277B075132L3143L3857L4323L4071L4421L6001L7399L7709L8219M0220M3100
$$ plain form
58266 2477595 2523516 2572383 2624268 2678363 2734086 2792509 2855061 2921440 2990585 3062892 3139428
58255 3139428 3219598 3301677 3384933 3469130 3552719 3634098 3714251 3795828 3880064 3966912 4057545
58244 4057545 4153998 4256667 4364761 4478919 4600733 4729995 4865284 5007276 5158755 5321260
58234 5321260 5494229 5677397 5871524 6076836 6293309 6522474 6766571 7026305 7301945
58225 7301945 7596049 7912276 8252024 8615319 9004571 9424365 9877977 10367408 10896572
58216 10896572 11471225 12096221 12776275 13519226 14335292 15233621 16223148 17316633 18530859
58207 18530859 19884058 21397284 23097995 25019073 27195895 29669602 32495025 35745969
58199 35745969 39519497 43945464 49198453 55505257 63149726 72480757 83925593 98011085
$$ packed form
58266B477595M5921M8867N1885N4095N5723N8423O2552O6379O9145P2307P6536
58255C139428Q0170Q2079Q3256Q4197Q3589Q1379Q0153Q1577Q4236Q6848R0633
58244D057545R6453J02669J08094J14158J21814J29262J35289J41992J51479J62505
58234E321260J72969J83168J94127K05312K16473K29165K44097K59734K75640
58225G301945K94104L16227L39748L63295L89252M19794M53612M89431N29164
58216A0896572N74653O24996O80054P42951Q16066Q98329R89527J093485J214226
58207A8530859J353199J513226J700711J921078K176822K473707K825423L250944
58199C5745969L773528M425967N252989O306804P644469R331031J1444836J4085492
$$ plain form
58191 98011085 115389981 136849682 163277097 195557721 234315208 279294530 328366725
58184 328366725 376733542 417365507 443147655 449745859 437279137 409686854 372530358
58177 372530358 330958867 288858217 248897406 212741759 181169619 154247877 131622248
58170 131622248 112769497 97120643 84120748 73283072 64211608 56581106 50119251
58163 50119251 44611047 39894666 35837999 32326063 29268902 26601964 24269240 22214568
58155 22214568 20391187 18767098 17315340 16007577 14820734 13741319 12759128 11863187
58147 11863187 11046153 10305377 9636337 9030402 8480702 7984286 7536802 7130814 6760766
58138 6760766 6423754 6113740 5820966 5539443 5270196 5015413 4774365 4546809 4335017
$$ packed form
58191I8011085J7378896K1459701K6427415L2280624L8757487M4979322M9072195
58184C28366725M8366817M0631965K5782148O598204j2466722k7592283l7156496
58177C72530358m1571491m2100650l9960811l6155647l1572140k6921742k2625629
58170A31622248j8852751j5648854j2999895j0837676r071464p630502o461855
58163E0119251n508204m716381m056667l511936l057161k666938k332724k054672
58155B2214568j823381j624089j451758j307763j186843j079415r82191q95941
58147A1863187q17034p40776o69040o05935n49700m96416m47484m05988l70048
58138F760766l37012l10014k92774k81523k69247k54783k41048k27556k11792
$$ plain form
58129 4335017 4139622 3957482 3785950 3625556 3476595 3336780 3204321 3079945 2963981
58120 2963981 2854565 2750439 2652580 2561513 2475905 2395207 2320764 2252894 2189666 2129905 2074616
58109 2074616 2024061 1976140 1929054 1883003 1837944 1792368 1745774 1699831 1655621 1612023 1568285
58098 1568285 1525817 1485928 1447879 1410687 1374843 1340778 1307563 1274615 1242996 1213701 1186319
58087 1186319 1160572 1137427 1117404 1099327 1082012 1065632 1050258 1034589 1017436 999154 980466
58076 980466 961120 940799 920177 900083 880634 861885 844215 827531 811339 796062 782809
58065 782809 771441 760498 749536 739709 731420 723452 715314 708333 703085 697659 690122 681152 672615
58052 672615 664822 656836 648344 639618 630532 621196 612759 606174 600775 595359 590022 585640 582105 578421
$$ packed form
58129D335017j95395j82140j71532j60394j48961j39815j32459j24376j15964
58120B963981j09416j04126r7859r1067q5608q0698p4443o7870o3228n9761n5289
58109B074616n0555m7921m7086m6051m5059m5576m6594m5943m4210m3598m3738
58098A568285m2468l9889l8049l7192l5844l4065l3215l2948l1619k9295k7382
58087A186319k5747k3145k0023j8077j7315j6380j5374j5669j7153j8282j8688
58076I80466j9346k0321k0622k0094j9449j8749j7670j6684j6192j5277j3253
58065G82809j1368j0943j0962r827q289p968q138o981n248n426p537q970q537
58052F72615p793p986q492q726r086r336q437o585n399n416n337m382l535l684
$$ plain form
58038 578421 574209 569916 565683 561029 555599 549540 543203 536916 530788 524393 517042 508603 499597 490347
58024 490347 480742 471055 462102 454235 446995 440169 434281 429536 425225 420783 416564 412953 409506 405747
58010 405747 402121 399422 397719 396426 394990 393107 390792 388639 387462 387352 387543 387332 386554 385157 383222
57995 383222 381518 381000 381414 381285 379500 375914 370347 362430 353037 344583 339002 336260 335320 335489 336178 336471
57979 336471 335913 334962 333971 332447 329963 326983 324189 321832 320219 319855 320448 320785 320372 320214 321190 322653
57963 322653 323569 324150 325337 327358 329787 332367 334882 336747 337552 337528 336811 334896 331490 327290 323221 319560
57947 319560 316353 313844 311838 309560 306967 305284 305420 306811 308720 311610 316085 321461 326820 332757
57933 332757 340617 350465 361112 371696 381855 390659 396799 399882 400479 399015 395605 390847 385611 379995
$$ packed form
58038E78421m212m293m233m654n430o059o337o287o128o395p351q439r006r250
58024D90347r605r687q953p867p240o826n888m745m311m442m219l611l447l759
58010D05747l626k699j703j293j436j883k315k153j177j10J91k11p78j397j935
57995C83222j704n18M14j29j785l586n567p917r393q454n581k742r40J69O89K93
57979C36471n58r51r91j524k484k980k794k357j613l64N93L37m13j58R76J463
57963C22653R16N81J187K021K429K580K515J865Q05k4p17j915l406m200m069l661
57947C19560l207k509k006k278k593j683J36J391J909K890M475N376N359N937
57933C32757P860R848J0647J0584J0159Q804O140L083N97j464l410m758n236n616
$$ plain form
57919 379995 373377 365541 357048 348547 340467 333210 326941 321395 316565 313263 312244 313104 314841 317145
57905 317145 320263 323919 327408 330528 333428 335654 336381 335578 334087 332610 331407 330813 331077 331728 332048 332223
57889 332223 333106 334719 335893 335584 333847 331393 328880 326798 325347 324216 322924 321443 320037 318582 316610
57874 316610 313936 310663 306703 302049 297434 293941 291874 290614 289581 288648 287655 286340 284923 284119 284376
57859 284376 285652 288068 292121 297995 305114 312618 319982 327102 334147 341275 348188 354076 358377 361377
57845 361377 363595 364880 364748 363349 361249 358361 354012 348212 342030 336423 331324 326143 320604 314879
57831 314879 309380 304655 300995 298024 295079 292116 289766 288394 287630 287031 286723 287194 288787 291464 294670
57816 294670 297408 298987 299843 301103 303105 304733 304388 301271 295618 288233 280118 272200 264999 258599 253009
$$ packed form
57919C79995o618p836q493q501q080p257o269n546m830l302j019Q60J737K304
57905C17145L118L656L489L120K900K226P27q03j491j477j203n94K64O51L20J75
57889C32223Q83J613J174l09j737k454k513k082j451j131j292j481j406j455j972
57874C16610k674l273l960m654m615l493k067j260j033r33r93j315j417q04K57
57859B84376J276K416M053N874P119P504P364P120P045P128O913N888M301L000
57845C61377K218J285j32j399k100k888m349n800o182n607n099n181n539n725
57831C14879n499m725l660k971k945k963k350j372p64n99l08M71J593K677L206
57816B94670K738J579Q56J260K002J628l45l117n653p385q115p918p201o400n590
$$ plain form
57801 253009 248398 244943 242659 241373 240690 240045 239090 238011 237155 236464 235642 234858 234838 236076 238293 240802
57785 240802 243236 245869 249348 254149 260134 266644 273084 279247 285110 290719 296471 303036 310557 318254
57771 318254 325213 331201 336242 339855 341475 341373 340390 338770 335927 331436 325686 319416 313101 306861 300629
57756 300629 294301 287952 281793 275763 269531 263261 257912 254264 252026 250510 249782 250326 251867 253450 254554
57741 254554 255303 255694 255516 255052 255003 255650 256876 258932 262233 266349 270246 273800 278083 283694 289670 294531
57725 294531 297798 300007 301837 303745 305966 308420 310855 313249 315714 317903 319099 319019 318029 316511 314580
57710 314580 312460 310385 307924 304190 299060 293498 288397 283744 279161 274515 269670 264427 259187 254950
57696 254950 252153 250171 248399 247128 246774 246962 247007 246701 246000 244551 242308 240085 238710 238043 237597 237729
$$ packed form
57801B53009m611l455k284j286o83o45r55j079q56o91q22p84k0J238K217K509
57785B40802K434K633L479M801N985O510O440O163N863N609N752O565P521P697
57771C18254O959N988N041L613J620j02r83j620k843m491n750o270o315o240o232
57756C00629o328o349o159o030o232o270n349l648k238j516p28N44J541J583J104
57741B54554P49L91j78m64m9O47J226K056L301M116L897L554M283N611N976M861
57725B94531L267K209J830J908K221K454K435K394K465K189J196q0r90j518j931
57710C14580k120k075k461l734n130n562n101m653m583m646m845n243n240m237
57696B54950k797j982j772j271l54J88M5l06p01j449k243k223j375o67m46J32
$$ plain form
57680 237729 239292 242342 246093 250136 255057 261896 271665 285383 303922 327704 357082 393166 437962
57667 437962 493616 561456 640761 726789 809267 873937 907701 904392 867154 806098 733360 658965
57655 658965 589319 527700 475178 431387 395445 366661 344352 327183 313353 301681 291990 284299
57643 284299 278227 273453 270085 268023 266456 264644 262799 261548 260793 259800 258276 256631 255149 253590 251795
57628 251795 250213 249450 249555 249964 250065 249633 248767 247495 245586 242876 239661 236495 233629 230957 228579 226930
57612 226930 226150 225741 225276 225121 226033 228178 230876 233205 234631 235244 235682 236682 238348 239929 240525 239933
57596 239933 238601 236960 235097 232960 230580 228081 225663 223504 221581 219723 217963 216678 216201 216426 216932
57581 216932 217351 217563 217712 218100 218790 219254 218784 217382 215857 214828 214023 212794 210969 208887 207014 205855
$$ packed form
57680B37729J563L050L751M043M921O839R769J3718J8539K3782K9378L6084M4796
57667D37962N5654O7840P9305Q6028Q2478O4670L3764l309l7238o1056p2738p4395
57655F58965o9646o1619n2522m3791l5942k8784k2309j7169j3830j1672r691p691
57643B84299o072m774l368k062j567j812j845j251p55r93j524j645j482j559j795
57628B51795j582p63J05M09J01m32q66j272j909k710l215l166k866k672k378j649
57612B26930p80m09m65j55R12K145K698K329J426O13M38J000J666J581N96n92
57596B39933j332j641j863k137k380k499k418k159j923j858j760j285m77K25N06
57581B16932M19K12J49L88O90M64m70j402j525j029q05j229j825k082j873j159
$$ plain form
57565 205855 205812 206630 207270 206883 205765 204913 204783 204958 204956 204843 204936 205315 205884 206719 208160 210453 213400 216532
57547 216532 219695 223148 226734 229310 229711 228261 226559 225652 225210 224782 224898 226293 228713 231248 233290
57532 233290 234466 234239 232548 230538 229631 229951 230453 230467 230259 230102 229825 229559 230126 232171 235346 238732 241743
57515 241743 244407 247112 250345 254429 259220 264101 268318 271358 273213 274483 276051 278380 281223 284157
57501 284157 287047 289693 291533 292277 292521 292979 293287 292386 290108 287589 285919 285079 284455 283788 283235 282994 283205
57484 283205 283889 284700 285105 285091 285312 286237 287538 288642 289577 290815 292448 294042 295258 296221 297136 297900 298337
57467 298337 298699 299611 301427 303814 306114 307990 309486 310569 311053 311116 311491 312790 314812 316785 318194 319165
57451 319165 320226 321905 324358 327120 329385 330776 331717 332881 334489 336332 338178 339892 341482 343352
$$ packed form
57565B05855m3Q18O40l87j118q52j30J75kj13R3L79N69Q35J441K293K947L132
57547B16532L163L453L586K576M01j450j702r07m42m28J16J395K420K535K042
57532B33290J176k27j691k010r07L20N02J4k08j57k77k66N67K045L175L386L011
57515B41743K664K705L233M084M791M881M217L040J855J270J568K329K843K934
57501B84157K890K646J840P44K44M58L08r01k278k519j670q40o24o67n53k41K11
57484B83205O84Q11M05j4K21R25J301J104R35J238J633J594J216R63R15P64M37
57467B98337L62R12J816K387K300J876J496J083M84O3L75J299K022J973J409R71
57451C19165J061J679K453K762K265J391R41J164J608J843J846J714J590J870
$$ plain form
57437 343352 346139 349857 353534 356219 358077 359997 362438 365257 368428 372144 376195 379957 383167 386205
57423 386205 389505 393068 396569 399633 402059 404159 406696 410056 413685 416799 419378 421845 424124 425910
57409 425910 427703 430542 434636 439141 443391 447447 451313 454622 457429 460376 463584 466300 468113 469712
57395 469712 471895 474652 477860 482021 487475 493541 499329 504864 510602 516435 522201 528690 536947 546631
57381 546631 556140 564435 571744 578371 583862 587867 591038 594461 598574 603078 607485 611369 614410 616718
57367 616718 618953 621783 625255 628965 632748 636881 641598 646667 651608 656237 660858 665914 671490 677224
57353 677224 682716 687946 693266 699022 705273 711852 718638 725706 733231 741276 749649 757950 765689 772485
57339 772485 778339 783820 789781 796717 804418 812335 820075 827462 834439 841273 848690 857277 866732 876082
$$ packed form
57437C43352K787L718L677K685J858J920K441K819L171L716M051L762L210L038
57423C86205L300L563L501L064K426K100K537L360L629L114K579K467K279J786
57409D25910J793K839M094M505M250M056L866L309K807K947L208K716J813J599
57395D69712K183K757L208M161N454O066N788N535N738N833N766O489Q257R684
57381E46631R509Q295P309O627N491M005L171L423M113M504M407L884L041K308
57367F16718K235K830L472L710L783M133M717N069M941M629M621N056N576N734
57353F77224N492N230N320N756O251O579O786P068P525Q045Q373Q301P739O796
57339G72485N854N481N961O936P701P917P740P387O977O834P417Q587R455R350
$$ plain form
57325 876082 884713 892848 900933 909037 916990 924739 932287 939552 946577 953636 960926 968351 975831 983624
57311 983624 992074 1001201 1010737 1020416 1030002 1039250 1048119 1056893 1065791 1074592 1083019 1091437 1100724 1111223
57297 1111223 1122161 1132392 1141675 1150903 1161032 1172082 1183386 1194600 1206081 1218257 1231025 1243927
57285 1243927 1256635 1269013 1280986 1292649 1304349 1316419 1328971 1342161 1356372 1371832 1388255
57274 1388255 1405176 1422309 1439245 1455266 1470145 1484852 1500646 1517562 1534522 1550887 1566986
57263 1566986 1583030 1598553 1613331 1628025 1643305 1658969 1674500 1689936 1705580 1721207 1736235
57252 1736235 1750521 1764525 1778843 1793918 1809968 1826792 1843810 1860546 1877006 1893388 1909657
57241 1909657 1925568 1940888 1955549 1969908 1984836 2001001 2017957 2034547 2050367 2066142 2082433
$$ packed form
57325H76082Q631Q135Q085Q104P953P749P548P265P025P059P290P425P480P793
57311I83624Q450R127R536R679R586R248Q869Q774Q898Q801Q427Q418R287J0499
57297A111223J0938J0231R283R228J0129J1050J1304J1214J1481J2176J2768J2902
57285A243927J2708J2378J1973J1663J1700J2070J2552J3190J4211J5460J6423
57274A388255J6921J7133J6936J6021J4879J4707J5794J6916J6960J6365J6099
57263A566986J6044J5523J4778J4694J5280J5664J5531J5436J5644J5627J5028
57252A736235J4286J4004J4318J5075J6050J6824J7018J6736J6460J6382J6269
57241A909657J5911J5320J4661J4359J4928J6165J6956J6590J5820J5775J6291
$$ plain form
57230 2082433 2098867 2115123 2131722 2149027 2166234 2182360 2197761 2213597 2230127 2246538 2262299
57219 2262299 2277698 2293048 2308260 2323293 2338223 2352757 2366356 2378928 2390798 2402011 2412434
57208 2412434 2422525 2433187 2444681 2456426 2468073 2479928 2492013 2503557 2514031 2524128 2535089
57197 2535089 2547405 2560657 2574258 2587829 2601052 2613705 2625770 2637221 2647779 2657219 2665817 2674222
57185 2674222 2682888 2691738 2700323 2708201 2715332 2722193 2729302 2736476 2742849 2747899 2752271 2757205 2763216 2769682
57171 2769682 2775792 2781525 2787485 2794019 2800870 2807682 2814441 2821232 2827854 2834048 2840024 2846379 2853500 2861405
57157 2861405 2870153 2879891 2890303 2900521 2909933 2918672 2926964 2934494 2941017 2947140 2953676 2960254 2965348
57144 2965348 2967808 2967786 2965978 2962633 2957656 2951227 2943834 2935834 2927279 2918050 2907974 2896947 2885182 2873315
$$ packed form
57230B082433J6434J6256J6599J7305J7207J6126J5401J5836J6530J6411J5761
57219B262299J5399J5350J5212J5033J4930J4534J3599J2572J1870J1213J0423
57208B412434J0091J0662J1494J1745J1647J1855J2085J1544J0474J0097J0961
57197B535089J2316J3252J3601J3571J3223J2653J2065J1451J0558R440Q598Q405
57185B674222Q666Q850Q585P878P131O861P109P174O373N050M372M934O011O466
57171B769682O110N733N960O534O851O812O759O791O622O194N976O355P121P905
57157B861405Q748R738J0412J0218R412Q739Q292P530O523O123O536O578N094
57144B965348K460k2j808l345m977o429p393q000q555r229j0076j1027j1765j1867
$$ plain form
57130 2873315 2862210 2852667 2845275 2840237 2837279 2835956 2836217 2838589 2843656 2851440 2861317 2872486 2884426
57117 2884426 2897059 2910664 2925828 2943588 2965521 2993476 3029132 3073866 3128925 3195453 3274322
57106 3274322 3366254 3472262 3593947 3733688 3895209 4084177 4307961 4575077 4895752 5283328
57096 5283328 5754479 6327951 7024063 7865491 8876607 10079939 11492509 13124424 14977718
57087 14977718 17043405 19298987 21708768 24224781 26787176 29329234 31788922 34114095
57079 34114095 36246012 38090161 39507722 40348827 40508116 39961610 38764759 37025543
57071 37025543 34876085 32452281 29879599 27264163 24690305 22222437 19907096 17774253
57063 17774253 15839694 14108427 12577128 11235403 10067535 9055245 8179913 7423355
$$ packed form
57130B873315j1105r543p392n038k958j323K61K372N067P784R877J1169J1940
57117B884426J2633J3605J5164J7760K1933K7955L5656M4734N5059O6528P8869
57106C274322R1932J06008J21685J39741J61521J88968K23784K67116L20675L87576
57096E283328M71151N73472O96112Q41428J011116J203332J412570J631915J853294
57087A4977718K065687K255582K409781K516013K562395K542058K459688K325173
57079C4114095K131917J844149J417561Q41105J59289n46506j196851j739216
57071C7025543k149458k423804k572682k615436k573858k467868k315341k132843
57063A7774253j934559j731267j531299j341725j167868j012290q75332p56558
$$ plain form
57055 7423355 6768041 6197755 5698326 5257764 4866078 4515241 4199057 3912500 3650925
57046 3650925 3409994 3186324 2977867 2783486 2602300 2433585 2276940 2132124 1998683
57037 1998683 1876071 1764102 1663018 1573016 1493957 1425600 1367883 1320967 1285349 1262066 1252694
57026 1252694 1258979 1281924 1319556 1363747 1399325 1408967 1382063 1320324 1235211 1140348 1045955 958086
57014 958086 879933 812532 755281 707033 666817 633422 604994 579776 557144 537457 520950
57003 520950 507111 495065 484150 473977 464242 454744 445515 436693 428188 419629 410808 402098 394282
56990 394282 388014 383583 381082 380488 381628 384427 389347 397111 407661 419505 430210 437296 438655 432964
56976 432964 420496 403407 384577 366057 348740 333113 319606 308322 299116 292026 287174 284272
$$ packed form
57055G423355o55314n70286m99429m40562l91686l50837l16184k86557k61575
57046C650925k40931k23670k08457j94381j81186j68715j56645j44816j33441
57037A998683j22612j11969j01084r0002p9059o8357n7717m6916l5618k3283r372
57026A252694O285K2945L7632M4191L5578R642k6904o1739q5113r4863r4393q7869
57014I58086p8153o7401n7251m8248m0216l3395k8428k5218k2632j9687j6507
57003E20950j3839j2046j0915j0173r735r498r229q822q505q559q821q710p816
56990C94282o268m431k501n94J140K799M920P764J0550J1844J0705P086J359n691
56976D32964j2468j7089j8830j8520j7317j5627j3507j1284r206p090m852k902
$$ plain form
56964 284272 282915 283396 286563 292749 301601 313239 328717 348646 371842 395785 417777 434991 444276
56951 444276 443450 433065 416076 395562 373370 350906 330016 312280 298018 286702 278104 272521
56939 272521 270176 270989 274848 281641 291152 303435 319320 340153 366867 399206 435203 470650 499412
56926 499412 515618 516559 503651 480757 452052 421209 391300 364241 340398 319235 300322 283525
56914 283525 268724 255896 245253 236751 229685 223266 217405 212354 207828 203227 198648 194893 192359
56901 192359 190595 189117 188026 187575 187812 188958 191605 196157 202503 210555 220606 232829 246920 262730
56887 262730 280837 302001 326245 352602 379123 402617 419048 425349 421177 408799 391519 372483
56875 372483 354227 338257 324857 313883 305714 301000 299735 301388 306026 314608 328066 346782 371211
$$ packed form
56964B84272j357M81L167O186Q852J1638J5478J9929K3196K3943K1992J7214R285
56951D44276q26j0385j6989k0514k2192k2464k0890j7736j4262j1316q598n583
56939B72521k345Q13L859O793R511J2283J5885K0833K6714L2339L5997L5447K8762
56926D99412J6206R41j2908k2894k8705l0843k9909k7059k3843k1163j8913j6797
56914B83525j4801j2828j0643q502p066o419n861n051m526m601m579l755k534
56901A92359j764j478j091m51K37J146K647M552O346Q052J0051J2223J4091J5810
56887B62730J8107K1164K4244K6357K6521K3494J6431O301m172j2378j7280j9036
56875C72483j8256j5970j3400j0974q169m714j265J653M638Q582J3458J8716K4429
$$ plain form
56862 371211 402379 441351 488602 543930 605902 670298 729312 773412 795150 792114 767312 727438
56850 727438 680272 632324 587623 548071 514667 488290 469501 458169 453823 456444 466705 485384
56838 485384 512879 549677 597158 657521 732583 822427 924313 1031422 1131916 1210355 1252558
56827 1252558 1251493 1210107 1139371 1053291 964020 879140 801825 733096 673974 625678 588473
56816 588473 561265 542651 531905 528827 533387 546142 568699 603125 650722 711367 783118 861115
56804 861115 936393 996765 1030707 1032013 1001915 947472 878093 802742 728690 660978 602019 551894
56792 551894 509700 474868 447176 425987 410330 399994 395921 399061 409147 425122 446585 474233
56780 474233 508617 548404 589418 624927 647403 651465 636386 606032 566254 522198 477570 435189
$$ packed form
56862C71211L1168L8972M7251N5328O1972O4396N9014M4100K1738l036k4802l9874
56850G27438m7166m7948m4701l9552l3404k6377j8789j1332m346K621J0261J8679
56838D85384K7495L6798M7481O0363P5062Q9844J01886J07109J00494P8439M2203
56827A252558j065m1386p0736q6080q9271q4880p7315o8729n9122m8296l7205
56816E88473k7208j8614j0746l078M560J2755K2557L4426M7597O0645P1751P7997
56804H61115P5278O0372L3942J306l0098n4443o9379p5351p4052o7712n8959n0125
56792E51894m2194l4832k7692k1189j5657j0336m073L140J0086J5975K1463K7648
56780D74233L4384L9787M1014L5509K2476M062j5079l0354l9778m4056m4628m2381
$$ plain form
56768 435189 397059 363871 335097 309919 287873 268670 251987 237670 225742 215936 207506 199781
56756 199781 192621 186102 180060 174328 169087 164547 160514 156815 153919 152460 152167 151926 151045 149816 148672
56741 148672 147462 145925 144370 143337 142975 143141 143747 144561 144986 144624 143915 143702 144218 144920 145294 145425 145806
56724 145806 146846 148581 150586 152253 153373 154347 155577 156818 157437 157203 156487 155764 155241 154881 154506 153989
56708 153989 153587 153883 155049 156430 157308 157834 158614 159572 159990 159724 159624 160438 161894 163203 163975 164251 164071
56691 164071 163556 163210 163646 164981 166743 168387 169759 171084 172657 174533 176471 178172 179536 180607 181388
56676 181388 181935 182542 183538 184861 186078 186855 187246 187541 188109 189295 191095 192863 193757 193641 193276 193441 194087
56659 194087 194461 193889 192322 190338 188701 187778 187298 186756 185960 184991 183809 182270 180393 178165 175198 171138
$$ packed form
56768D35189l8130l3188k8774k5178k2046j9203j6683j4317j1928r806q430p725
56756A99781p160o519o042n732n241m540m033l699k896j459k93k41q81j229j144
56741A48672j210j537j555j033l62J66O06Q14M25l62p09k13N16P02L74J31L81
56724A45806J040J735K005J667J120R74J230J241O19k34p16p23n23l60l75n17
56708A53989m02K96J166J381Q78N26P80R58M18k66j00Q14J456J309P72K76j80
56691A64071n15l46M36J335J762J644J372J325J573J876J938J701J364J071P81
56676A81388N47O07R96J323J217P77L91K95N68J186J800J768Q94j16l65J65O46
56659A94087L74n72j567j984j637r23m80n42p96r69j182j539j877k228k967m060
$$ plain form
56643 171138 166479 162350 159362 157185 155408 154164 153557 153111 152364 151537 151147 151242 151576 152192 153212 154257
56627 154257 154779 154969 155756 157676 160170 162203 163303 163821 164366 165219 166302 167522 168968 170621 172055 172771
56611 172771 172867 173092 174028 175505 176951 178074 178989 179947 181170 182668 183986 184378 183613 182421 181877 182410 183639
56594 183639 184862 185425 184920 183523 181962 180755 179658 178353 177432 177977 180027 182168 182997 182574 182047 182137
56578 182137 182450 182180 181157 180068 179845 180883 182762 184639 185845 186274 186413 187139 189258 192946 197651 202736
56562 202736 208185 214517 222172 231339 242339 255579 270604 285386 297033 303506 304648 301711 296296
56549 296296 289911 284073 280049 278057 276973 275206 271968 267676 263345 259834 257492 256100 255013 253635
56535 253635 251825 249715 247248 244261 240945 237754 234769 231662 228487 225976 224661 224163 223828 223710 224292
$$ packed form
56643A71138m659m129k988k177j777j244o07m46p47q27l90R5L34O16J020J045
56627A54257N22J90P87J920K494K033J100N18N45Q53J083J220J446J653J434P16
56611A72771R6K25R36J477J446J123R15R58J223J498J318L92p65j192n44N33J229
56594A83639J223N63n05j397j561j207j097j305r21N45K050K141Q29m23n27R0
56578A82137L13k70j023j089k23J038J879J877J206M29J39P26K119L688M705N085
56562B02736N449O332P655R167J1000J3240J5025J4782J1647O473J142k937n415
56549B96296o385n838m024j992j084j767l238m292m331l511k342j392j087j378
56535B53635j810k110k467k987l316l191k985l107l175k511j315m98l35j18N82
$$ plain form
56520 224292 225409 226134 225853 224966 224355 224435 224861 224949 224258 222896 221283 219580 217544 215097 212802 211357 210774
56503 210774 210420 209854 209148 208390 207488 206667 206670 207963 210014 211772 212745 213219 213508 213446 212750 211578 210467 209856
56485 209856 209804 210119 210589 211179 212104 213625 215596 217286 217917 217422 216452 215600 214838 213896 212893 212369 212812 214348
56467 214348 216710 219249 221178 222165 222582 222867 222831 222029 220674 219610 219339 219606 220062 220710 221419 221576 220760
56450 220760 219467 218713 219024 220139 221522 222888 224308 226037 228152 230222 231531 231779 231352 230778 230204 229607
56434 229607 229151 228958 228763 228203 227395 226874 226999 227631 228314 228574 228151 227145 225944 224948 224440 224691 225850 227637
56416 227637 229480 231104 232674 234272 235620 236554 237319 238073 238533 238484 238230 238145 238151 238134 238500 239665 241262 242494
56398 242494 243144 243669 244413 245323 246456 248151 250512 253176 255739 258175 260741 263685 267022 270386 273238
$$ packed form
56520B24292J117P25k81q87o11Q0M26Q8o91j362j613j703k036k447k295j445n83
56503B10774l54n66p06p58r02q21LJ293K051J758R73M74K89o2o96j172j111o11
56485B09856n2L15M70N90R25J521J971J690O31m95r70q52p62r42j003n24M43J536
56467B14348K362K539J929R87M17K85l6q02j355j064k71K67M56O48P09J57q16
56450B20760j293p54L11J115J383J366J420J729K115K070J309K48m27n74n74n97
56434B29607m56j93j95n60q08n21J25O32O83K60m23j006j201r96n08K51J159J787
56416B27637J843J624J570J598J348R34P65P54M60m9k54q5Oj7L66J165J597J232
56398B42494O50N25P44R10J133J695K361K664K563K436K566K944L337L364K852
$$ plain form
56383 273238 275456 277539 279949 282427 284318 285374 285793 285665 284836 283281 281225 278914 276580 274556 273057
56368 273057 271974 271153 270747 270982 271804 273076 274833 276943 278860 280184 281139 282013 282535 282471 282421 283218 284810
56351 284810 286585 288473 290705 292735 293660 293802 294617 296625 298620 299498 299886 301164 303701 306868 310206
56336 310206 313649 316915 319526 321433 323095 324923 327010 329262 331550 333825 336299 339354 343073 347080
56322 347080 350932 354418 357318 359217 359834 359348 358264 357134 356384 356029 355490 354178 352418 351345 351692 353132
56306 353132 355065 357457 360489 363851 366992 369981 373680 379062 386412 394982 403309 410180 415425 419573
56292 419573 422819 424972 426544 429018 433463 439367 445489 451484 457998 465422 473354 481399 489806 499027
56278 499027 508994 519160 529188 539378 550435 562836 576482 590945 605965 621636 638281 656351
$$ packed form
56383B73238K218K083K410K478J891J056M19j28q29j555k056k311k334k024j499
56368B73057j083q21m06K35Q22J272J757K110J917J324R55Q74N22o4n0P97J592
56351B84810J775J888K232K030R25J42Q15K008J995Q78L88J278K537L167L338
56336C10206L443L266K611J907J662J828K087K252K288K275K474L055L719M007
56322C47080L852L486K900J899O17m86j084j130p50l55n39j312j760j073L47J440
56306C53132J933K392L032L362L141K989L699N382P350Q570Q327O871N245M148
56292D19573L246K153J572K474M445N904O122N995O514P424P932Q045Q407R221
56278D99027R967J0166J0028J0190J1057J2401J3646J4463J5020J5671J6645J8070
$$ plain form
56266 656351 676313 698315 722019 747143 774034 803295 834955 868685 905010 945693 992558
56255 992558 1046356 1107131 1175267 1251768 1337848 1434755 1543812 1666162 1802368 1952273 2115002
56244 2115002 2288970 2472093 2662232 2857217 3054235 3249349 3437751 3614296 3773686
56235 3773686 3910457 4019263 4095537 4136347 4141165 4111844 4051507 3963355 3850667 3717584 3569040
56224 3569040 3409652 3243056 3072370 2900692 2730891 2565405 2406495 2256202 2115764
56215 2115764 1985403 1864875 1753786 1651312 1556225 1467634 1385370 1309520 1240064 1177089
56205 1177089 1120652 1070056 1023881 981164 942062 906974 875578 847266 821956 799815 780442
56194 780442 762926 746585 731292 717261 704810 694066 684697 676228 668796 663039 658948 655365 651130
$$ packed form
56266F56351J9962K2002K3704K5124K6891K9261L1660L3730L6325M0683M6865
56255I92558N3798O0775O8136P6501Q6080R6907J09057J22350J36206J49905J62729
56244B115002J73968J83123J90139J94985J97018J95114J88402J76545J59390
56235C773686J36771J08806P6274M0810M818k9321o0337q8152j12688j33083j48544
56224C569040j59388j66596j70686j71678j69801j65486j58910j50293j40438
56215B115764j30361j20528j11089j02474r5087q8591q2264p5850o9456o2975
56205A177089n6437n0596m6175m2717l9102l5088l1396k8312k5310k2141j9373
56194G80442j7516j6341j5293j4031j2451j0744r369q469p432n757m091l583m235
$$ plain form
56181 651130 646334 641963 638636 636140 633933 631665 629397 627609 626816 627004 627737 628850 630502 632478 634101
56166 634101 635200 636544 638942 642463 646838 651918 657365 662609 667699 673596 681092 690053 700185 711769
56152 711769 724991 739299 754256 770460 788813 809401 831940 856985 885931 920256 961413
56141 961413 1010932 1069742 1137578 1213597 1296897 1385616 1476040 1563557 1644277 1715275 1774443
56130 1774443 1821757 1860548 1896125 1932670 1971694 2012519 2052597 2087417 2112016 2123942 2124673 2118079
56118 2118079 2107790 2095480 2080248 2058817 2026848 1980851 1919489 1843952 1757787 1666103 1574103
56107 1574103 1485971 1404925 1333463 1272766 1222219 1180307 1145813 1117782 1094923 1075994 1060559
56096 1060559 1048661 1040014 1034127 1030770 1029534 1029364 1029428 1030121 1032330 1035996 1040311 1044977 1050273 1056137 1062238
$$ packed form
56181F51130m796m371l327k496k207k268k268j788p93J88P33J113J652J976J623
56166F34101J099J344K398L521M375N080N447N244N090N897P496Q961J0132J1584
56152G11769J3222J4308J4957J6204J8353K0588K2539K5045K8946L4325M1157
56141I61413M9519N8810O7836P6019Q3300Q8719R0424Q7517Q0720P0998N9168
56130A774443M7314L8791L5577L6545L9024M0825M0078L4820K4599J1926P31o594
56118B118079j0289j2310j5232k1431l1969m5997o1362p5537q6165r1684r2000
56107A574103q8132q1046p1462o0697n0547m1912l4494k8031k2859j8929j5435
56096A060559j1898q647n887l357j236j70O4O93K209L666M315M666N296N864O101
$$ plain form
56081 1062238 1068803 1076400 1084936 1093808 1102895 1112497 1122454 1132333 1142447 1153713 1166441 1180104 1194297
56068 1194297 1209072 1224334 1239767 1255448 1271840 1289222 1307672 1327339 1348014 1368807 1389115
56057 1389115 1409670 1431714 1455363 1479566 1503283 1525777 1546223 1564278 1580860 1597288 1613817
56046 1613817 1630096 1646734 1665146 1685960 1708754 1733284 1759785 1788041 1817266 1846990 1877155
56035 1877155 1907452 1937585 1968101 1999969 2033489 2068533 2105536 2145198 2187432 2231577 2277271
56024 2277271 2324136 2371230 2418138 2466110 2516787 2570347 2626263 2685244 2748699 2816720 2888302
56013 2888302 2963127 3041411 3122427 3205134 3290039 3378567 3470835 3565914 3663996 3766269 3872865
56002 3872865 3983063 4097450 4217793 4344850 4478418 4619406 4769541 4928926 5096178
$$ packed form
56081A062238O565P597Q536Q872R087R602R957R879J0114J1266J2728J3663J4193
56068A194297J4775J5262J5433J5681J6392J7382J8450J9667K0675K0793K0308
56057A389115K0555K2044K3649K4203K3717K2494K0446J8055J6582J6428J6529
56046A613817J6279J6638J8412K0814K2794K4530K6501K8256K9225K9724L0165
56035A877155L0297L0133L0516L1868L3520L5044L7003L9662M2234M4145M5694
56024B277271M6865M7094M6908M7972N0677N3560N5916N8981O3455O8021P1582
56013B888302P4825P8284Q1016Q2707Q4905Q8528R2268R5079R8082J02273J06596
56002C872865J10198J14387J20343J27057J33568J40988J50135J59385J67252
$$ plain form
55993 5096178 5271173 5455487 5650081 5854870 6070837 6300312 6544967 6805698 7084527
55984 7084527 7384283 7706341 8051124 8420957 8819994 9251265 9716395 10218342 10761840
55975 10761840 11351218 11990697 12687019 13449031 14284843 15202620 16214501 17336853 18586902
55966 18586902 19982941 21548787 23315488 25319291 27602819 30221320 33248194 36777965
55958 36777965 40931516 45865645 51783942 58946643 67678861 78379334 91537321 107758423
55950 107758423 127777246 152431094 182581160 218906385 261372821 308281974 355343847
55943 355343847 395777028 422136724 429245685 416413614 387441510 348578717 306002066
55936 306002066 264271489 226050692 192512626 163855585 139733223 119579064 102797965
$$ packed form
55993E096178J74995J84314J94594K04789K15967K29475K44655K60731K78829
55984G084527K99756L22058L44783L69833L99037M31271M65130N01947N43498
55975A0761840N89378O39479O96322P62012Q35812R17777J011881J122352J250049
55966A8586902J396039J565846J766701K003803K283528K618501L026874L529771
55958C6777965M153551M934129N918297P162701Q732218J0700473J3157987J6221102
55950A07758423K0018823K4653848L0150066L6325225M2466436M6909153M7061873
55943C55343847M0433181K6359696P108961j2832071k8972104l8862793m2576651
55936C06002066m1730577l8220797l3538066k8657041k4122362k0154159j6781099
$$ plain form
55929 102797965 88833555 77186188 67431629 59226494 52290089 46389150 41338477 36996457
55921 36996457 33246948 29988569 27139976 24641703 22445399 20506449 18788030 17262800
55913 17262800 15905839 14691545 13599583 12617231 11732966 10933089 10206563 9547171 8948241
55904 8948241 8400274 7896005 7432895 7008329 6616772 6253703 5917985 5608106 5320049
55895 5320049 5050996 4801380 4571235 4357954 4159479 3976238 3807968 3651851 3505706
55886 3505706 3370090 3245558 3130834 3025307 2930123 2844549 2763768 2682400 2598228 2511234
55876 2511234 2421735 2331473 2244220 2163032 2088154 2018777 1954754 1895246 1837799 1780603 1724224
55865 1724224 1669861 1617576 1567459 1520668 1477861 1438078 1400336 1364716 1330789 1296844 1262064
$$ packed form
55929A02797965j3964410j1647367r754559q205135o936405n900939n050673m342020
55921C6996457l749509l258379k848593k498273k196304j938950j718419j525230
55913A7262800j356961j214294j091962r82352q84265p99877p26526o59392n98930
55904H948241n47967n04269m63110m24566l91557l63069l35718l09879k88057
55895E320049k69053k49616k30145k13281j98475j83241j68270j56117j46145
55886C505706j35616j24532j14724j05527r5184q5574q0781q1368q4172q6994
55876B511234q9499r0262q7253q1188p4878o9377o4023n9508n7447n7196n6379
55865A724224n4363n2285n0117m6791m2807l9783l7742l5620l3927l3945l4780
$$ plain form
55854 1262064 1227855 1195699 1165213 1135676 1107832 1082539 1058928 1035403 1011541 987749 964153
55843 964153 940957 918856 898020 877641 857396 838160 820318 802684 784190 765428 747423
55832 747423 730162 713571 698743 686709 676884 668038 659978 653045 646767 640267 633385 626287 618614
55819 618614 610061 601054 591854 581713 570072 557959 547006 537598 529033 521008 513843 507649 502340
55806 502340 498228 495625 494036 492619 491374 491203 492943 496864 502866 510527 519032 527435 534996 541180
55792 541180 545751 548978 551243 552226 551077 547595 542624 537096 531406 525917 521077 516487 510611 502030
55778 502030 490586 477134 462992 449928 439759 433378 430795 432425 439510 452831 471628 493665
55766 493665 515096 530210 533434 523251 503550 480322 457687 437422 420488 407172 396455 386832
$$ packed form
55854A262064l4209l2156l0486k9537k7844k5293k3611k3525k3862k3792k3596
55843I64153k3196k2101k0836k0379k0245j9236j7842j7634j8494j8762j8005
55832G47423j7261j6591j4828j2034r825q846q060o933o278o500o882p098p673
55819F18614q553r007r200j0141j1641j2113j0953r408q565q025p165o194n309
55806E02340m112k603j589j417j245j71J740L921O002P661Q505Q403P561O184
55792E41180M571L227K265R83j149l482m971n528n690n489m840m590n876q581
55778E02030j1444j3452j4142j3064j0169o381k583J630P085J3321J8797K2037
55766D93665K1431J5114L224j0183j9701k3228k2635k0265j6934j3316j0717r623
$$ plain form
55754 386832 377691 368993 360073 349823 337776 324246 309812 295441 282604 272317 264315 257875
55742 257875 252978 249926 248424 247999 248920 251711 255907 260079 262879 263433 261209 256403 250288 244415 239522
55727 239522 235583 232353 229266 225351 220166 214525 209550 205409 201664 198407 196158 194980 194631 195301 197383
55712 197383 200722 204939 210337 217616 226730 236582 245634 252297 255163 253828 249385 243476 237005 230201
55698 230201 223311 216398 208947 200765 192932 186825 182470 178957 176185 174875 174810 174534 173217 171714 171172
55683 171172 171509 171921 172251 173149 175204 178434 182429 186666 190730 194302 196854 197580 196048 192862 189266
55668 189266 186126 183630 181761 180469 179405 178135 176767 175939 176053 176817 177587 177887 177678 177485 178162 180178
55652 180178 183167 186448 189740 193048 196169 198889 201417 203975 206066 206847 206186 204813 203376 201864 199861
$$ packed form
55754C86832r141q698q920j0250j2047j3530j4434j4371j2837j0287q002o440
55742B57875m897l052j502m25R21K791M196M172K800N54k224m806o115n873m893
55727B39522l939l230l087l915n185n641m975m141l745l257k249j178l49O70K082
55712A97383L339M217N398P279R114R852R052O663K866j335m443n909o471o804
55698B30201o890o913p451q182p833o107m355l513k772j310o5k76j317j503n42
55683A71172L37M12L30Q98K055L230L995M237M064L572K552P26j532l186l596
55668A89266l140k496j869j292j064j270j368q28J14P64P70L00k09j93O77K016
55652A80178K989L281L292L308L121K720K528K558K091P81o61j373j437j512k003
$$ plain form
55637 199861 196886 192569 186992 180793 174492 167949 161078 154706 149851 146288 142886 139380 136810 135917
55623 135917 136107 136417 136605 136718 136375 135305 134084 133501 133399 132802 131109 128647 126069 123662 121346 118982
55607 118982 116550 114168 112083 110496 109307 108058 106287 104050 102047 101026 101023 101358 101420 101161 100746 100104
55591 100104 99117 97904 96602 95130 93594 92545 92344 92468 92033 90949 90028 90015 90974 92603 94611 96732
55575 96732 98803 100929 103249 105648 108054 110896 114721 119347 123929 127912 131425 134639 137277 138945
55561 138945 139562 139199 137843 135478 132212 128204 123620 118699 113696 108878 104784 102204 101422 101614 101496
55546 101496 100573 99272 97984 96641 95340 94681 95140 96476 98041 99357 100262 100829 101394 102351 103742 105236
55530 105236 106562 107714 108637 109041 108703 107721 106363 104831 103172 101263 98893 96097 93315 90986 89084
$$ packed form
55637A99861k975m317n577o199o301o543o871o372m855l563l402l506k570q93
55623A35917J90L10J88J13l43j070j221n83j02n97j693k462k578k407k316k364
55607A18982k432k382k085j587j189j249j771k237k003j021lL35O2k59m15o42
55591A00104r87j213j302j472j536j049k01J24m35j084r21j3R59J629K008K121
55575I6732K071K126K320K399K406K842L825M626M582L983L513L214K638J668
55561A38945O17l63j356k365l266m008m584m921n003m818m094k580p82J92j18
55546A01496r23j301j288j343j301o59M59J336J565J316R05N67N65R57J391J494
55530A05236J326J152R23M04l38r82j358j532j659j909k370k796k782k329j902
$$ plain form
55515 89084 87322 85640 84142 82721 81199 79696 78458 77455 76643 76401 77029 77893 77855 76649 75115 74013
55499 74013 73369 73208 74041 76038 78393 80166 81372 82634 84026 84915 84893 84361 84062 84275 84605 84512 83982 83589
55481 83589 83828 84528 85139 85402 85452 85405 85247 85069 84962 84717 84094 83364 83095 83318 83426 82993 82206 81334 80270
55462 80270 78809 76990 74974 72928 71179 70118 69880 70386 71624 73395 74814 74813 73367 71695 71012 71479
55446 71479 72437 73029 72541 70878 69021 68271 68695 69005 68360 67525 67686 68776 69765 70101 70113 70248 70637 71300
55428 71300 72204 73178 74161 75302 76492 77157 76967 76431 76265 76476 76632 76781 77424 78665 80053 81251 82296
55411 82296 83080 83121 82090 80288 78421 77037 76202 75603 74925 74168 73561 73186 72897 72633 72448 72172 71477 70510
55393 70510 70005 70367 70996 70965 70105 68999 68129 67514 67082 66904 67017 67303 67528 67406 66830 66182 66137 66919 68030
$$ packed form
55515H9084j762j682j498j421j522j503j238j003q12k42O28Q64l8j206j534j102
55499G4013o44j61Q33J997K355J773J206J262J392Q89k2n32k99K13L30r3n30l93
55481H3589K39P00O11K63N0m7j58j78j07k45o23p30k69K23J08m33p87q72j064
55462H0270j461j819k016k046j749j061k38N06J238J771J419jj446j672o83M67
55446G1479R58N92m88j663j857p50M24L10o45q35J61J090R89L36J2J35L89O63
55428G1300R04R74R83J141J190O65j90n36j66K11J56J49O43J241J388J198J045
55411H2296P84M1j031j802j867j384q35n99o78p57o07l75k89k64j85k76o95r67
55393G0510n05L62O29l1q60j106q70o15m32j78J13K86K25j22n76o48m5P82J111
$$ plain form
55374 68030 68917 69547 70071 70389 70487 70721 71245 71536 71164 70727 71282 72954 74809 76055 76738 77211 77544 77607 77314
55355 77314 76665 75932 75722 76381 77356 77682 77137 76387 75940 75531 74752 73728 72895 72485 72490 72867 73561 74535 75817
55336 75817 77215 77965 77198 75014 72724 71687 72136 73324 74473 75231 75450 75043 74168 73364 73289 74268 75984
55319 75984 77665 78691 79051 79097 78970 78533 77834 77252 77025 76900 76534 76102 76176 76993 78023 78464 78082 77416 76991
55300 76991 76470 74915 72020 68787 66695 66339 67095 67933 68238 68024 67811 68261 69526 70893 71482 71310 71244
55283 71244 71798 72523 72814 72765 72722 72457 71550 70457 70386 71821 73757 74828 74847 74730 75152 75921 76665 77539 78895
55264 78895 80680 82550 84295 85767 86619 86702 86611 87253 88752 90244 90884 90586 89620 88061 86033 84037 82518
55247 82518 81367 80241 79174 78403 77802 76978 75875 74849 74165 73805 73692 73724 73592 73000 72107 71395 71073 70953
$$ packed form
55374F8030Q87O30N24L18R8K34N24K91l72m37N55J672J855J246O83M73L33O3k93
55355G7314o49p33k10O59R75L26n45p50m47m09p79j024q33m10NL77O94R74J282
55336G5817J398P50p67k184k290j037M49J188J149P58K19m07q75q04p5R79J716
55319G5984J681J026L60M6j27m37o99n82k27j25l66m32P4Q17J030M41l82o66m25
55300G6991n21j555k895l233k092l56P56Q38L05k14k13M50J265J367N89j72o6
55283G1244N54P25K91m9m3k65r07j093p1J435J936J071J9j17M22P69P44Q74J356
55264G8895J785J870J745J472Q52Q3r1O42J499J492O40k98r66j559k028j996j519
55247H2518j151j126j067p71o01q24j103j026o84l60j13L2j32n92q93p12l22j20
$$ plain form
55229 70953 70970 71386 72272 73160 73512 73346 73163 73302 73540 73329 72394 71105 70216 70179 70721 71241 71488 71700 72133
55210 72133 72742 73328 73816 74314 75024 76119 77591 79196 80572 81374 81317 80318 78774 77458 76887 76872 76939 77013
55192 77013 77422 78359 79686 81174 82570 83505 83780 83765 84061 84704 85036 84555 83516 82540 81937 81629 81433 81110
55174 81110 80351 79133 78056 77932 78898 80131 80698 80614 80767 81731 82969 83480 83072 82533 82551 82941 83132 82941
55156 82941 82590 82298 82199 82383 82671 82649 82316 82338 83186 84297 84678 84133 83278 82521 81709 80729 79748 78819 77924 77460
55136 77460 77932 79011 79676 79563 79447 80003 80850 81330 81541 81894 82179 81881 81136 80579 80407 80270 80056 80076 80401
55117 80401 80662 80694 80886 81599 82606 83400 83837 84270 85092 86331 87627 88571 89135 89738 90809 92327 93901
55100 93901 95149 95787 95526 94283 92535 91088 90342 90039 89849 89935 90706 92231 94106 95783 96795 96883 96235
$$ packed form
55229G0953J7M16Q86Q88L52j66j83J39K38k11r35j289q89l7N42N20K47K12M33
55210G2133O09N86M88M98P10J095J472J605J376Q02n7r99j544j316n71j5O7P4
55192G7013M09R37J327J488J396R35K75j5K96O43L32m81j039r76o03l08j96l23
55174H1110p59j218j077j24R66J233N67q4J53R64J238N11m08n39J8L90J91j91
55156H2941l51k92r9J84K88k2l33K2Q48J111L81n45q55p57q12r80r81r29q95m64
55136G7460M72J079O65j13j16N56Q47M80K11L53K85k98p45n57j72j37k14K0L25
55117H0401K61L2J92P13J007P94M37M33Q22J239J296R44N64O03J071J518J574
55100I3901J248O38k61j243j748j447p46l03j90Q6P71J525J875J677J012Q8o48
$$ plain form
55083 96235 95620 95895 97275 99250 101235 103018 104506 105363 105220 104133 102596 101159 100129 99519 99075 98443
55067 98443 97518 96553 95818 95328 95088 95337 96170 97139 97710 97991 98461 99049 99106 98411 97517 96832 96044 94831 93579
55048 93579 92858 92664 92701 93012 93789 94830 95773 96563 97192 97287 96591 95546 94727 93935 92617 91041 90215 90639
55030 90639 91862 93323 94817 96025 96430 96020 95432 95089 94791 94425 94423 95063 95859 96120 95772 95250 94992 95375
55012 95375 96677 98582 99999 99932 98442 96453 94792 93698 93017 92482 91882 91254 90873 90909 91255 91853 93017
54995 93017 95159 98215 101436 103739 104403 103664 102548 101811 101167 100025 98779 98587 99730 101023 101282 100722
54979 100722 100365 100640 101262 102078 103218 104465 105135 104685 103213 101412 100279 100588 102270 104403 106096 107160
54963 107160 107736 107724 107050 106174 105777 106055 106751 107660 108612 109158 108880 108025 107281 106914 106573 106012 105542 105609 106242
$$ packed form
55083I6235o15K75J380J975J985J783J488Q57j43j087j537j437j030o10m44o32
55067I8443r25r65p35m90k40K49Q33R69N71K81M70N88N7o95q94o85p88j213j252
55048I3579p21j94L7L11P77J041R43P90O29R5o96j045q19p92j318j576q26M24
55030I0639J223J461J494J208M05m10n88l43k98l66kO40P96K61l48n22k58L83
55012I5375J302J905J417o7j490j989j661j094o81n35o00o28l81L6L46N98J164
54995I3017K142L056L221K303O64p39j116p37o44j142j246j92J143J293K59n60
54979A00722l57K75O22Q16J140J247O70m50j472j801j133L09J682K133J693J064
54963A07160N76j2o74q76l97K78O96R09R52N46k78q55p44l67l41n61m70O7O33
$$ plain form
54944 106242 107049 107541 107419 106739 105856 105133 104739 104770 105274 105979 106286 105884 105166 104746 104786 105126 105774 106814 108037
54925 108037 109197 110503 112411 114970 117852 120884 124205 128052 132883 139455 148127 158071 167733 176060
54911 176060 182781 187673 190310 190565 188629 184486 178125 170448 163066 156805 151118 145320 139639 134589
54897 134589 130110 126078 123040 121561 121216 121042 120778 120820 121124 121048 120330 119476 119002 118926 119224 120107 121490 122751
54879 122751 123504 124294 126046 129038 132846 137185 142352 148786 156459 164775 172854 179848 185093 188099 188491
54864 188491 186135 181424 175259 168541 161736 155020 148656 142893 137649 132747 128484 125442 123489 121500
54850 121500 118574 115244 112830 111656 110539 108288 105198 102670 101648 101838 102324 102459 102059 101134 99830
54835 99830 98617 98149 98655 99523 99825 99337 98819 99104 100182 101423 102406 103096 103394 103098 102392 101827 101664 101662 101631
$$ packed form
54944A06242Q07M92j22o80q83p23l94L1N04P05L07m02p18m20M0L40O48J040J223
54925A08037J160J306J908K559K882L032L321L847M831O572Q672R944R662Q327
54911A76060O721M892K637K55j936m143o361p677p382o261n687n798n681n050
54897A34589m479m032l038j479l45j74k64M2L04p6p18q54m74p6K98Q83J383J261
54879A22751P53P90J752K992L808M339N167O434P673Q316Q079O994N245L006L92
54864A88491k356m711o165o718o805o716o364n763n244m902m263l042j953j989
54850A21500k926l330k414j174j117k251l090k528j022J90M86J35m00r25j304
54835I9830j213m68N06Q68L02m88n18K85J078J241R83O90K98k96p06n65j63kl1
$$ plain form
54816 101631 101737 102023 102126 101864 101678 102058 102821 103406 103704 104137 104987 106020 106766 106929 106569 106088 105885 105913 105788
54797 105788 105469 105483 106220 107351 108327 109091 109891 110671 111172 111382 111393 111032 110283 109892 110780 112775 114541 114985
54779 114985 114350 113801 114357 116247 118872 121206 122599 123307 123995 124829 125506 126120 127416 130100 134353 140064
54763 140064 146931 154240 161230 167995 175406 183678 191535 197305 200389 201124 199635 195641 189358 181868
54749 181868 174312 167067 159942 152942 146610 141623 138147 135651 133358 130853 128230 125774 123747 122385
54735 122385 121769 121586 121312 120739 120172 120004 120355 121156 122301 123559 124651 125666 127179 129756 133547 138483
54719 138483 144581 151740 159433 166959 173917 180152 185334 188918 190545 190258 188232 184488 179058 172368
54705 172368 165299 158723 152962 147816 143089 138881 135286 132162 129492 127638 126760 126179 124933 122917 120866
$$ packed form
54816A01631J06K86J03k62j86L80P63N85K98M33Q50J033P46J63l60m81k03K8j25
54797A05788l19J4P37J131R76P64Q00P80N01K10J1l61p49l91Q88J995J766M44
54779A14985o35n49N56J890K625K334J393P08O88Q34O77O14J296K684M253N711
54763A40064O867P309O990O765P411Q272P857N770L084P35j489l994o283p490
54749A81868p556p245p125p000o332m987l476k496k293k505k623k456k027j362
54735A22385o16j83k74n73n67j68L51Q01J145J258J092J015J513K577L791M936
54719A38483O098P159P693P526O958O235N182L584J627k87k026l744n430o690
54705A72368p069o576n761n146m727m208l595l124k670j854q78n81j246k016k051
$$ plain form
54690 120866 119224 117773 116529 116141 116901 118045 118704 118991 119451 119869 119534 118515 117724 117594 117467 116573 115031
54673 115031 113499 112298 111302 110420 109830 109795 110431 111564 112693 113277 113204 112852 112600 112416 112013 111204 109916 108072
54655 108072 105794 103690 102633 103047 104507 106164 107512 108629 109718 110633 111026 110918 110877 111501 112752 113947
54639 113947 114444 114288 114164 114673 115735 116752 117301 117545 117879 118351 118659 118630 118458 118374 118282 117860 116932 115648 114330
54620 114330 113280 112738 112886 113723 114858 115591 115445 114608 113649 112792 111818 110793 110415 111162 112386 112806 111933
54603 111933 110584 109953 110528 111910 113287 113995 113913 113473 113099 112713 112065 111351 110987 110787 110047 108589 107145
54586 107145 106411 106267 106261 106362 106754 107263 107527 107487 107288 106930 106468 106414 107433 109629 112385 114838 116311 116494
54568 116494 115639 114497 113743 113403 113049 112444 111773 111362 111425 112057 113187 114508 115617 116288 116582 116742 117006 117401
$$ packed form
54690A20866j642j451j244l88P60J144O59K87M60M18l35j019p91j30j27q94j542
54673A15031j532j201r96q82n90l5O36J133J129N84p3l52k52j84m03q09j288j844
54655A08072k278k104j057M14J460J657J348J117J089R15L93j08m1O24J251J195
54639A13947M97j56j24N09J062J017N49K44L34M72L08k9j72q4r2m22r28j284j318
54620A14330j050n42J48Q37J135P33j46q37r59q57r74j025l78P47J224M20q73
54603A11933j349o31N75J382J377P08q2m40l74l86o48p14l64k00p40j458j444
54586A07145p34j44oJ01L92N09K64m0j99l58m62n4J019K196K756K453J473J83
54568A16494q55j142p54l40l54o05o71m11O3O32J130J321J109O71K94J60K64L95
$$ plain form
54550 117401 117672 117647 117626 118128 119201 120401 121534 122956 124893 126912 128478 129671 130899 132184 133109 133322
54534 133322 132781 131763 130901 130855 131548 132047 131601 130486 129413 128555 127730 127120 126998 126971 126351 125251 124515 124454
54516 124454 124406 123757 122731 121903 121486 121424 121717 122258 122631 122391 121466 120172 118968 118177 117737 117292 116734 116553
54498 116553 117288 118776 120334 121533 122278 122290 121225 119419 117894 117388 117804 118715 119892 121188 122369 123339
54482 123339 124150 124698 124803 124660 124719 125002 125052 124710 124352 124224 124164 124163 124479 124853 124443 123142 122341 123593 126841
54463 126841 130577 133453 135166 136084 136729 137501 138338 138653 138004 136637 134972 132873 130115 127375 125964 126422
54447 126422 127981 129557 130747 131614 132070 131952 131468 131136 131279 131811 132531 133411 134443 135330 135589 135126 134489
54430 134489 134250 134228 133726 132561 131395 130907 131102 131648 132378 133125 133542 133576 133795 134704 136029 137158 137990 138750
$$ packed form
54550A17401K71k5k1N02J073J200J133J422J937K019J566J193J228J285R25K13
54534A33322n41j018q62m6O93M99m46j115j073q58q25o10j22k7o20j100p36o1
54516A24454m8o49j026q28m17o2K93N41L73k40r25j294j204p91m40m45n58j81
54498A16553P35J488J558J199P45J2j065j806j525n06M16R11J177J296J181R70
54482A23339Q11N48J05j43N9K83N0l42l58j28o0jL16L74m10j301q01J252L248
54463A26841L736K876J713R18O45P72Q37L15o49j367j665k099k758k740j411M58
54447A26422J559J576J190Q67M56j18m84l32J43N32P20Q80J032Q87K59m63o37
54430A34489k39k2n02j165j166m88J95N46P30P47M17L4K19R09J325J129Q32P60
$$ plain form
54412 138750 139266 139135 138495 137942 137694 137504 137374 137662 138337 138873 139076 139377 139990 140379 139983 139056 138392 138537 139483
54393 139483 140746 141578 141642 141753 143326 146607 150006 151788 151976 151883 152190 152399 152003 151241 150540 149990 149660 149798
54375 149798 150354 150827 150979 151312 152425 154169 155801 156726 156857 156511 156318 157007 158812 161201 163501 165709
54359 165709 168381 171845 175889 180138 184249 187743 190128 191398 192002 192100 191151 188522 184279 179108 173705
54344 173705 168528 163942 160237 157475 155536 154260 153329 152159 150267 147805 145512 144052 143560 143759 144239
54329 144239 144604 144645 144537 144681 145214 145816 146087 145966 145720 145639 145851 146245 146465 146117 145168 144071 143395 143350 143715
54310 143715 144169 144592 145069 145639 146030 145728 144429 142422 140359 138687 137462 136700 136567 137131 138180 139433
54294 139433 140698 141656 141747 140632 138724 137039 136464 137178 138635 140066 141149 142282 144015 146137 147650
$$ packed form
54412A38750N16j31o40n53k48j90j30K88O75N36K03L01O13L89l96r27o64J45R46
54393A39483J263Q32O4J11J573L281L399J782J88r3L07K09l96p62p01n50l30J38
54375A49798N56M73J52L33J113J744J632R25J31l46j93O89J805K389K300K208
54359A65709K672L464M044M249M111L494K385J270O04R8r49k629m243n171n403
54344A73705n177m586l705k762j939j276r31j170j892k462k293j460m92J99M80
54329A44239L65M1j08J44N33O02K71j21k46q1K12L94K20l48r49j097o76m5L65
54310A43715M54M23M77N70L91l02j299k007k063j672j225p62j33N64J049J253
54294A39433J265R58R1j115j908j685n75P14J457J431J083J133J733K122J513
$$ plain form
54279 147650 147800 146780 145228 143474 141754 140740 141008 142094 142843 142908 143175 144371 145868 146456 145896 145138
54263 145138 145168 146220 147972 149913 151371 151748 151134 150465 150746 152143 153936 155267 155812 155828 155774 155892 156040
54246 156040 155965 155737 155777 156306 156942 157102 156796 156667 157161 157960 158462 158531 158379 157859 156407 153878 151068 149086
54228 149086 148269 147923 147135 145729 144469 144403 145995 148800 151925 154654 156591 157403 156882 155353 153643 152316
54212 152316 151140 149547 147494 145513 144024 142939 142010 141260 140919 141121 141790 142733 143763 144766 145678 146371
54196 146371 146592 146177 145364 144749 144858 145745 146952 147813 147906 147384 146833 146656 146685 146534 146197 146014 146056 145977 145598 145327
54176 145327 145661 146522 147386 147968 148444 149018 149622 150182 150864 151743 152342 151857 150044 147761 146389 146655 148059
54159 148059 149431 149906 149425 148552 148008 148215 149005 149767 150024 149829 149467 148919 147951 146696 145705 145226 144861 144246
$$ packed form
54279A47650J50j020j552j754j720j014K68J086P49O5K67J196J497N88n60p58
54263A45138L0J052J752J941J458L77o14o69K81J397J793J331N45J6n4J18J48
54246A56040p5k28M0N29O36J60l06j29M94P99N02O9j52n20j452k529k810j982
54228A49086q17l46p88j406j260o6J592K805L125K729J937Q12n21j529j710j327
54212A52316j176j593k053j981j489j085r29p50l41K02O69R43J030J003R12O93
54196A46371K21m15q13o15J09Q87J207Q61R3n22n51j77K9j51l37j83M2p9l79k71
54176A45327L34Q61Q64N82M76N74O04N60O82Q79N99m85j813k283j372K66J404
54159A48059J372M75m81q73n44K07P90P62K57j95l62n48r68j255r91m79l65o15
$$ plain form
54141 144246 143786 144228 145606 147066 147844 148039 148251 148718 149105 149026 148527 148029 147931 148246 148595 148601 148347 148382 149134 150389
54121 150389 151478 151975 152083 152325 153041 154228 155710 157239 158496 159193 159301 159114 159035 159350 160159 161411 162888
54104 162888 164227 165106 165463 165500 165497 165691 166202 166924 167424 167187 166136 164867 164216 164569 165606 166668 167328 167771
54086 167771 168748 171030 174657 178849 182892 187024 191929 197319 201644 203612 203565 202768 201679 199688 196494
54071 196494 192891 189851 187466 185288 183199 181403 179884 178489 177414 177072 177443 178011 178309 178138 177372 176071
54055 176071 174842 174506 175195 176203 176931 177527 178314 179135 179741 180522 182256 185174 188698 192110 195186 198133
54039 198133 201212 204555 208211 212353 217415 223804 231311 239068 246441 253781 261788 270135 277268 281825
54025 281825 283952 284883 285463 285492 284419 282275 279690 277250 275128 273274 271623 269920 267645 264500 260937
$$ packed form
54141A44246m60M42J378J460P78J95K12M67L87p9m99m98r8L15L49Ok54L5P52J255
54121A50389J089M97J08K42P16J187J482J529J257O97J08j87p9L15Q09J252J477
54104A62888J339Q79L57L7lJ94N11P22N00k37j051j269o51L53J037J062O60M43
54086A67771R77K282L627M192M043M132M905N390M325J968m7p97j089j991l194
54071A96494l603l040k385k178k089j796j519j395j075l42L71N68K98j71p66j301
54055A76071j229l36O89J008P28N96P87Q21O06P81J734K918L524L412L076K947
54039A98133L079L343L656M142N062O389P507P757P373P340Q007Q347P133M557
54025B81825K127R31N80K9j073k144k585k440k122j854j651j703k275l145l563
$$ plain form
54010 260937 257751 255034 251919 247628 242420 237158 232205 227296 222390 218017 214630 212054 209845 207856
53996 207856 206170 204733 203355 201968 200649 199437 198284 197138 195956 194766 193761 193206 193082 192982 192517
53981 192517 191709 190821 189963 189090 188276 187663 187159 186503 185673 184993 184763 185019 185676 186646 187676 188397 188785 189295
53963 189295 190236 191191 191502 191277 191506 193023 195680 198643 201174 202934 203935 204623 205885 208506 212570 217576
53947 217576 223107 229113 235639 242687 250446 259417 270196 283353 299443 318577 339506 359304 374344
53934 374344 381937 381410 374158 362852 350221 338058 327158 317989 310987 306135 302801 300435 299125
53921 299125 299095 299948 300943 301865 303128 305140 308069 312086 317199 322823 328141 333113 338503 344651 350710
53906 350710 355439 358346 359674 359740 358801 357293 355674 354022 352158 350072 347932 345758 343396 340749 337720
$$ packed form
54010B60937l186k717l115m291n208n262m953m909m906m373l387k576k209j989
53996B07856j686j437j378j387j319j212j153j146j182j190j005n55j24j00m65
53981A92517q08q88q58q73q14o13n04o56q30o80k30K56O57R70J030P21L88N10
53963A89295R41R55L11k25K29J517K657K963K531J760J001O88J262K621M064N006
53947B17576N531O006O526P048P759Q971J0779J3157J6090J9134K0929J9798J5040
53934C74344P593n27p252j1306j2631j2163j0900r169p002m852l334k366j310
53921B99125l0Q53R95R22J263K012K929M017N113N624N318M972N390O148O059
53906C50710M729K907J328O6r39j508j619j652j864k086k140k174k362k647l029
$$ plain form
53891 337720 333998 329229 323415 316960 310358 304044 298316 293068 287782 282207 276963 272908 269908 266867
53877 266867 263164 259458 256612 254371 251779 248585 245425 242597 239454 235393 230906 227023 223993 221112
53863 221112 217859 214645 212216 210673 209438 207924 205967 203796 201965 201202 201833 203241 204281 204387 203908
53848 203908 203215 202001 199957 197779 196742 197236 198288 198759 198476 197908 197197 196128 194843 193991 193982 194471 194770
53831 194770 194585 194202 194107 194574 195538 196665 197547 197959 197993 197986 198334 199266 200662 202065 203045 203602 204146 204987 205998
53812 205998 206867 207555 208298 209272 210457 211860 213683 216125 219151 222510 225955 229448 233162 237280 241705
53797 241705 245958 249538 252402 255030 257927 261133 264223 266758 268682 270389 272383 274786 277166 278948
53783 278948 279943 280337 280149 279008 276626 273324 269833 266636 263646 260468 256808 252679 248450 244710 241868
$$ packed form
53891C37720l722m769n814o455o602o314n728n248n286n575n244m055l000l041
53877B66867l703l706k846k241k592l194l160k828l143m061m487l883l030k881
53863B21112l253l214k429j543j235j514j957k171j831p63O31J408J040J06m79
53848B03908o93j214k044k178j037M94J052M71k83n68p11j069j285q52rM89K99
53831A94770j85l83r5M67R64J127Q82M12L4pL48R32J396J403R80N57N44Q41J011
53812B05998Q69O88P43R74J185J403J823K442L026L359L445L493L714M118M425
53797B41705M253L580K864K628K897L206L090K535J924J707J994K403K380J782
53783B78948R95L94j88j141k382l302l491l197k990l178l660m129m229l740k842
$$ plain form
53768 241868 239687 237283 233763 229085 224325 220915 219370 218726 217450 214956 212060 209944 208929 208435 207790
53753 207790 206769 205492 204156 202896 201763 200867 200586 201316 202743 203719 203348 202015 200843 200259 199776 199166
53737 199166 199029 199796 200907 201568 201880 202504 203457 204030 203908 203719 204237 205492 206952 208265 209572 211273 213668
53720 213668 216663 219684 222113 223998 226096 228945 232028 234175 234716 233976 232766 231824 231753 232957 235299
53705 235299 238121 240957 243961 247321 250560 253004 254850 257114 260430 264372 268167 271547 274620 277414
53691 277414 279954 282445 284909 286906 288041 288520 288772 288776 288295 287492 286714 285801 284267 282170 280154 278586
53675 278586 277285 276152 275348 274691 273652 272308 271629 272278 273710 274943 275751 276524 277350 277911 278030 277770 277174
53658 277174 276375 275716 275266 274493 273026 271456 270669 270543 270095 268983 268058 268173 269148 270265 271253 272365 273827
$$ packed form
53768B41868k181k404l520m678m760l410j545o44j276k494k896k116j015m94o45
53753B07790j021j277j336j260j133q96k81P30J427R76l71j333j172n84m83o10
53737A99166j37P67J111O61L12O24R53N73j22j89N18J255J460J313J307J701K395
53720B13668K995L021K429J885K098K849L083K147N41p40j210r42p1J204K342
53705B35299K822K836L004L360L239K444J846K264L316L942L795L380L073K794
53691B77414K540K491K464J997J135M79K52Mm81q03p78r13j534k097k016j568
53675B78586j301j133q04o57j039j344o79O49J432J233Q08P73Q26N61J19k60n96
53658B77174p99o59m50p73j467j570p87j26m48j112r25J15R75J117R88J112J462
$$ plain form
53641 273827 275649 277757 279998 282123 283961 285506 286770 287759 288673 289896 291613 293659 295817 297995 300054
53626 300054 301813 303441 305536 308539 312204 315908 319387 323009 327393 332827 338972 345154 351121 357413
53612 357413 364574 372068 378560 383428 387418 391404 395122 397738 399239 400445 401748 402650 402703 402244 401959
53597 401959 402137 402637 403216 403616 403598 403139 402424 401528 400387 399220 398552 398443 398043 396424 393769 391232 389560
53580 389560 388357 386922 385402 384627 384921 385532 385389 384130 382193 380103 378050 376164 374798 374215 374124 373865
53564 373865 373176 372542 372666 373673 375021 376115 376802 377226 377414 377266 376936 376963 377793 379270 380803 382038 383140
53547 383140 384342 385535 386574 387743 389529 391969 394616 397264 400214 403583 406757 409064 410929 413830
53533 413830 418929 426039 434061 442163 450294 458803 467979 478021 489113 501321 514445 528134 542098
$$ packed form
53641B73827J822K108K241K125J838J545J264R89R14J223J717K046K158K178K059
53626C00054J759J628K095L003L665L704L479L622M384N434O145O182N967O292
53612C57413P161P494O492M868L990L986L718K616J501J206J303R02N3m59k85
53597D01959J78N00N79M00j8m59p15q96j141j167o68j09m00j619k655k537j672
53580C89560j203j435j520p75K94O11j43j259j937k090k053j886j366n83r1k59
53564C73865o89o34J24J007J348J094O87M24J88j48l30K7Q30J477J533J235J102
53547C83140J202J193J039J169J786K440K647K648K950L369L174K307J865K901
53533D13830N099P110Q022Q102Q131Q509R176J0042J1092J2208J3124J3689J3964
$$ plain form
53520 542098 556157 570177 584150 598390 613479 629852 647511 666292 686358 708189 731962
53509 731962 757121 782699 808013 832932 857667 882519 907811 933713 959968 985866 1010608
53498 1010608 1033663 1054864 1074375 1092659 1110388 1128198 1146472 1165289 1184417 1203340 1221501
53487 1221501 1238691 1255167 1271347 1287492 1303763 1320394 1337620 1355475 1373792 1392315 1410611
53476 1410611 1427867 1442972 1454984 1463565 1469029 1471969 1472801 1471472 1467589 1460843 1451335 1439527 1425974
53463 1425974 1411218 1395836 1380438 1365462 1350970 1336675 1322262 1307630 1292687 1276819 1258887
53452 1258887 1238168 1215293 1191888 1169203 1147388 1126223 1105929 1086921 1069158 1052355 1036702
53441 1036702 1022894 1011540 1002986 997580 995420 995688 996779 997400 997355 997224 997708 999422 1002769 1007559 1013051
$$ packed form
53520E42098J4059J4020J3973J4240J5089J6373J7659J8781K0066K1831K3773
53509G31962K5159K5578K5314K4919K4735K4852K5292K5902K6255K5898K4742
53498A010608K3055K1201J9511J8284J7729J7810J8274J8817J9128J8923J8161
53487A221501J7190J6476J6180J6145J6271J6631J7226J7855J8317J8523J8296
53476A410611J7256J5105J2012Q581N464K940Q32j329l883o746r508j1808j3553
53463A425974j4756j5382j5398j4976j4492j4295j4413j4632j4943j5868j7932
53452A258887k0719k2875k3405k2685k1815k1165k0294j9008j7763j6803j5653
53441A036702j3808j1354q554n406k160K68J091O21m5j31M84J714L347M790N492
$$ plain form
53426 1013051 1018733 1024899 1032178 1040795 1050707 1062245 1075997 1092000 1109510 1127783 1146815 1167058
53414 1167058 1188676 1211371 1234931 1259640 1285998 1314173 1343893 1374878 1407185 1441014 1476304
53403 1476304 1512751 1550244 1589171 1630262 1674167 1721128 1770879 1822816 1876362 1931179 1987002
53392 1987002 2043412 2099944 2156432 2213029 2269828 2326515 2382293 2436108 2487085 2535012 2580346
53381 2580346 2623532 2664374 2702240 2736666 2767396 2793990 2815937 2833199 2846161 2854876 2858770 2857232
53369 2857232 2850080 2837188 2817983 2791679 2757904 2717040 2670204 2619013 2565019 2509200 2452144
53358 2452144 2394660 2337740 2281886 2227068 2173570 2122273 2073800 2027889 1984094 1942475 1903050
53347 1903050 1865005 1827192 1789189 1751279 1713674 1676554 1640780 1607769 1578389 1552373 1528853
$$ packed form
53426A013051N682O166P279Q617R912J1538J3752J6003J7510J8273J9032K0243
53414A167058K1618K2695K3560K4709K6358K8175K9720L0985L2307L3829L5290
53403A476304L6447L7493L8927M1091M3905M6961M9751N1937N3546N4817N5823
53392A987002N6410N6532N6488N6597N6799N6687N5778N3815N0977M7927M5334
53381B580346M3186M0842L7866L4426L0730K6594K1947J7262J2962Q715L894j538
53369B857232p152j2892j9205k6304l3775m0864m6836n1191n3994n5819n7056
53358B452144n7484n6920n5854n4818n3498n1297m8473m5911m3795m1619l9425
53347A903050l8045l7813l8003l7910l7605l7120l5774l3011k9380k6016k3520
$$ plain form
53336 1528853 1507040 1486436 1466981 1449258 1434195 1422301 1413260 1406171 1399910 1393362 1385697 1376505
53324 1376505 1365571 1352747 1338400 1323727 1310030 1297640 1285972 1274606 1263827 1254055 1245263 1237211
53312 1237211 1229919 1223742 1219131 1216289 1214841 1213946 1213087 1212659 1213439 1215630 1218893 1223264 1229453 1238198 1249796
53297 1249796 1264310 1281623 1301132 1321954 1343794 1367229 1392864 1420499 1449221 1477973 1505842
53286 1505842 1532233 1557052 1580529 1602616 1622742 1640223 1654712 1666187 1674700 1680127 1681980 1679659
53274 1679659 1673285 1664057 1653216 1640761 1625836 1608239 1588658 1567405 1543960 1518172 1491016 1463577
53262 1463577 1436004 1407989 1379579 1350825 1321273 1290623 1259485 1228739 1198466 1168273 1138377
53251 1138377 1109616 1082499 1056916 1032626 1009366 986532 963429 939863 916148 892676 870014
$$ packed form
53336A528853k1813k0604j9455j7723j5063j1894r041p089o261o548p665r192
53324A376505j0934j2824j4347j4673j3697j2390j1668j1366j0779r772q792q052
53312A237211p292o177m611k842j448q95q59m28P80K191L263M371O189Q745J1598
53297A249796J4514J7313J9509K0822K1840K3435K5635K7635K8722K8752K7869
53286A505842K6391K4819K3477K2087K0126J7481J4489J1475Q513N427J853k321
53274A679659o374r228j0841j2455j4925j7597j9581k1253k3445k5788k7156k7439
53262A463577k7573k8015k8410k8754k9552l0650l1138l0746l0273l0193k9896
53251A138377k8761k7117k5583k4290k3260k2834k3103k3566k3715k3472k2662
$$ plain form
53240 870014 849104 830604 814005 798116 782477 767650 754182 742053 731391 722868 716804 712299
53228 712299 707791 702279 695663 688170 679908 670936 661366 651198 640100 627502 613090 597275 581107
53215 581107 565555 550928 537021 523566 510421 497633 485686 475429 467230 460296 453292 445599
53203 445599 437571 429648 421792 413824 405645 396889 386938 375741 364203 353388 343611 334653 326540
53190 326540 319583 313803 308832 304443 300792 298031 295934 294052 292062 289873 287488 284940 282315 279825
53176 279825 277735 276119 274658 272832 270455 267925 265819 264284 263028 261851 260882 260157 259256 257681 255524
53161 255524 253395 251650 249989 248018 245925 244281 243311 242696 242114 241636 241480 241559 241506 241053 240327 239790 239877 240623
53143 240623 241634 242478 242977 243042 242489 241325 240110 239583 239938 240757 241624 242402 242956 243101 243010 243166 243714 244226
$$ packed form
53240H70014k0910j8500j6599j5889j5639j4827j3468j2129j0662q523o064m505
53228G12299m508n512o616p493q262q972r570j0168j1098j2598j4412j5815j6168
53215E81107j5552j4627j3907j3455j3145j2788j1947j0257q199o934p004p693
53203D45599q028p923p856p968q179q756r951j1197j1538j0815r777q958q113
53190C26540o957n780m971m389l651k761k097j882j990k189k385k548k625k490
53176B79825k090j616j461j826k377k530k106j535j256j177r69p25r01j575k157
53161B55524k129j745j661j971k093j644r70o15n82m78j56P9n3m53p26n37Q7P46
53143B40623J011Q44M99O5n53j164j215n27L55Q19Q67P78N54J45r1J56N48N12
$$ plain form
53125 244226 244329 244193 244225 244654 245611 247146 248951 250509 251789 253344 255462 257740 259833 261935 264077 265579
53109 265579 265886 265354 264462 262794 259696 255600 251683 248462 245646 243203 241510 240401 239152 237618 236459
53094 236459 235975 235616 234994 234572 234858 235634 236412 237088 237653 237862 237661 237448 237449 237313 236763 236192 236127 236513 237017 237597
53074 237597 238224 238395 237613 236169 234907 234290 234173 234332 234701 235098 235120 234478 233190 231485 229667 228006 226593
53057 226593 225391 224542 224350 224827 225522 226079 226665 227559 228608 229461 230145 230962 231909 232592 232710 232359 231839 231370
53039 231370 230974 230555 230192 230312 231228 232398 232647 231460 229657 228343 227685 227231 226989 227381 228281 228995 229299
53022 229299 229759 230777 231908 232438 232192 231497 230790 230535 231152 232633 234388 235731 236396 236461 236074 235491 235144
53005 235144 235337 235979 236737 237307 237430 236977 236243 235918 236361 237122 237508 237519 237787 238656 239779 240731 241499 242173 242543
$$ packed form
53125B44226J03j36L2M29R57J535J805J558J280J555K118K278K093K102K142J502
53109B65579L07n32q92j668l098m096l917l221k816k443j693j109j249j534j159
53094B36459m84l59o22m22K86P76P78O76N65K09k01k13Jj36n50n71o5L86N04N80
53074B37597O27J71p82j444j262o17j17J59L69L97K2o42j288j705j818j661j413
53057B26593j202q49j92M77O95N57N86Q94J049Q53O84Q17R47O83J18l51n20m69
53039B31370l96m19l63J20R16J170K49j187j803j314o58m54k42L92R00P14L04
53022B29299M60J018J131N30k46o95p07k55O17J481J755J343O65O5l87n83l47
53005B35144J93O42P58N70J23m53p34l25M43P61L86J1K68Q69J123R52P68O74L70
$$ plain form
52986 242543 242419 242123 242236 242921 243866 244906 246306 248309 250661 252787 254256 254988 255216 255467 256413 258484
52970 258484 261557 265076 268355 270775 272031 272376 272420 272428 272046 271026 269957 269748 270473 271264 271401 270943 270133
52953 270133 268744 266477 263624 260880 258579 256499 254348 252163 250186 248525 247022 245473 244043 243349
52939 243349 243832 245022 245782 245465 244514 243708 243170 242491 241607 241024 241152 241766 242272 242299 241954 241587 241394 241256 240994
52920 240994 240678 240576 240806 241243 241722 242089 242050 241394 240509 240266 241069 242291 242911 242509 241419 240233 239505 239575
52902 239575 240231 240720 240558 240124 240011 240024 239439 238170 236972 236372 236064 235680 235567 236308 237706 238799 238913 238411
52884 238411 238272 239040 240264 240953 240567 239517 238670 238539 239071 240026 241290 242816 244507 246208 247739 249031
52868 249031 250330 252057 254239 256238 257378 257708 257780 257837 257718 257546 257883 258934 260076 260529 260275 259940 259940 260031
$$ packed form
52986B42543j24k96J13O85R45J040J400K003K352K126J469P32K28K51R46K071
52970B58484L073L519L279K420J256L45M4Ql82j020j069k09P25P91J37m58q10
52953B70133j389k267k853k744k301k080k151k185j977j661j503j549j430o94
52939B43349M83J190P60l17r51q06n38o79q84n83J28O14N06K7l45l67j93j38k62
52920B40994l16j02K30M37M79L67l9o56q85k43Q03J222O20m02j090j186p28P0
52902B39575O56M89j62m34j13J3n85j269j198o00l08l84j13P41J398J093J14n02
52884B38411j39P68J224O89l86j050q47j31N32R55J264J526J691J701J531J292
52868B49031J299J727K182J999J140L30P2N7j19j72L37J051J142M53k54l35%R1
$$ plain form
52850 260031 259634 258372 256241 253379 249763 245280 240185 235340 231691 229462 228066 226810 225431 224034
52836 224034 222875 222292 222511 223262 223852 223769 223035 221968 220861 220020 219732 219942 220176 220017 219537 219141 219218 220006
52818 220006 221415 222741 222923 221502 219194 217239 216365 216539 217383 218415 219158 219587 220430 222509 225682 228723
52802 228723 230303 229845 227591 224342 221149 218773 217230 216100 215302 215105 215291 214925 213354 211062 209092
52787 209092 207938 207500 207803 209029 210797 212108 212395 212260 212768 214244 216081 217615 218762 219762 220630 221074
52771 221074 220893 220286 219735 219597 219811 220011 219905 219516 219029 218536 217977 217233 216205 214870 213407 212224 211737
52754 211737 212065 212931 213828 214302 214281 214270 215036 216857 219163 221170 222712 224112 225416 226337 227049 228342 230612
52737 230612 233207 235365 237369 240043 243245 245726 246635 246443 246046 245611 244905 244278 244522 245775 247208 247983
$$ packed form
52850B60031l97j262k131k862l616m483n095m845l649k229j396j256j379j397
52836B24034j159n83K19P51N90q3p34j067j107q41k88K10K34j59m80l96P7P88
52818B20006J409J326J82j421k308j955q74J74Q44J032P43M29Q43K079L173L041
52802B28723J580m58k254l249l193k376j543j130p98j97J86l66j571k292j970
52787B09092j154m38L03J226J768J311K87j35N08J476J837J534J147J000Q68M44
52771B21074j81o07n51j38K14K00j06l89m87m93n59p44j028j335j463j183m87
52754B11737L28Q66Q97M74k1j1P66J821K306K007J542J400J304R21P12J293K270
52737B30612K595K158K004K674L202K481R09j92l97m35p06o27K44J253J433P75
$$ plain form
52721 247983 248007 247531 246466 244528 241866 239118 236912 235635 235545 236597 238053 238782 238325 237376 236819 236565 235850
52704 235850 234546 233563 233757 234952 236258 236992 236985 236378 235537 234994 234996 235139 234788 233884 233068 232969 233557 234229 234354
52685 234354 233751 232835 232333 232753 234029 235618 236805 237001 236061 234522 233220 232457 231802 230926 230270 230427 231176
52668 231176 231751 231977 232494 233756 235401 236795 237696 238120 238020 237507 237100 237372 238443 240039 241896 243861
52652 243861 245766 247548 249460 251904 254906 257810 259604 259703 258503 257079 256223 255817 255247 254220 252916
52637 252916 251553 250191 248907 247712 246314 244440 242463 241214 241050 241583 242503 244177 247060 250911 254937
52622 254937 258388 260718 261539 260876 259284 257306 255044 252571 250472 249449 249450 249652 249332 248478 247588 247122 247125
52605 247125 247142 246607 245491 244460 244139 244393 244569 244241 243479 242574 241862 241621 241756 241845 241846 242521 244522 247218 249116
$$ packed form
52721B47983K4m76j065j938k662k748k206j277r0J052J456P29m57r49n57k54p15
52704B35850j304r83J94J195J306P34po07q41n43KJ43l51r04q16r9N88O72J25
52685B34354o03r16n02M20J276J589J187J96r40j539j302p63o55q76o56J57P49
52668B31176N75K26N17J262J645J394R01M24j00n13m07K72J071J596J857J965
52652B43861J905J782J912K444L002K904J794R9j200j424q56m06n70j027j304
52637B52916j363j362j284j195j398j874j977j249j64N33R20J674K883L851M026
52622B54937L451K330Q21o63j592j978k262k473k099j023JK02l20q54q90m66L
52605B47125J7n35j116j031l21K54J76l28p62r05p12k41J35Q9JO75K001K696J898
$$ plain form
52586 249116 249575 249438 249835 250916 252127 253192 254384 256024 258090 260190 261729 262254 261894 261330 261134 261170
52570 261170 260756 259377 257271 255385 254679 255183 255835 255543 254397 253453 253312 253446 253121 252430 252019 252120 252379
52553 252379 252391 251965 250964 249400 247759 246900 247354 248815 250377 251194 250992 250082 248965 247895 246851 245857
52537 245857 245090 244610 244247 243933 243945 244555 245613 246703 247611 248385 249089 249807 250793 252203 253676 254571 254805 255159
52519 255159 256413 258283 259508 259136 257596 256421 256862 258833 261280 263449 265559 268226 271602 275302 278866
52504 278866 281918 284001 284738 284182 282635 280107 276411 271916 267704 264604 262396 260381 258480 257252 256919
52489 256919 256930 256667 256130 255624 255094 254235 253139 252365 252237 252425 252504 252662 253518 255272 257399 259253 260742 262227
52471 262227 263952 265761 267213 267864 267609 266987 266940 267994 269761 271581 273518 276319 280292 284639 288114
$$ packed form
52586B49116M59j37L97J081J211J065J192J640K066K100J539N25l60n64j96L6
52570B61170m14j379k106j886p06N04O52k92j146r44j41J34l25o91m11J01K59
52553B52379J2m26j001j564j641q59M54J461J562Q17k02r10j117j070j044r94
52537B45857p67m80l63l14J2O10J058J090R08P74P04P18R86J410J473Q95K34L54
52519B55159J254J870J225l72j540j175M41J971K447K169K110K667L376L700L564
52504B78866L052K083P37n56j547k528l696m495m212l100k208k015j901j228l33
52489B56919J1k63n37n06n30q59j096p74j28J88P9J58Q56J754K127J854J489J485
52471B62227J725J809J452O51k55o22m7J054J767J820J937K801L973M347L475
$$ plain form
52456 288114 290048 290548 289943 288373 285844 282448 278549 274754 271597 269166 267168 265355 263661 261897 259699
52441 259699 257041 254531 252932 252506 252977 253880 254706 255056 255028 255205 255881 256495 256332 255563 255053 255173 255412 255278
52423 255278 255018 255225 256116 257432 258744 259659 260017 260088 260395 261304 262926 265341 268509 271977 275205 278342
52407 278342 282303 287897 295303 304445 315269 327287 339232 349497 356584 359088 356130 348434 338494
52394 338494 328918 320744 313755 307832 303221 299789 296970 294545 292739 291485 290261 288859 287734 287305
52380 287305 287347 287338 287152 287201 288051 289975 292725 295828 299257 303561 309014 314898 320196 324762 329222 333854
52364 333854 338288 342299 346078 349492 351813 352551 352040 350931 349655 348676 348647 349804 351630 353526 355408
52349 355408 357312 358874 359796 360423 361351 362692 364223 366036 368492 371671 375364 379481 384053 388947 394065
$$ packed form
52456B88114J934N00o05j570k529l396l899l795l157k431j998j813j694j764k198
52441B59699k658k510j599m26M71R03Q26L50k8J77O76O14j63p69n10J20K39j34
52423B55278k60K07Q91J316J312R15L58P1L07R09J622K415L168L468L228L137
52407B78342L961N594P406R142J0824J2018J1945J0265P087K504k958p696r940
52394C38494r576q174o989n923m611l432k819k425j806j254j224j402j125m29
52380B87305M2rj86M9Q50J924K750L103L429M304N453N884N298M566M460M632
52364C33854M434M011L779L414K321P38n11j109j276r79k9J157J826J896J882
52349C55408J904J562R22O27R28J341J531J813K456L179L693M117M572M894N118
$$ plain form
52334 394065 399750 406508 414362 422906 432023 442128 453699 466898 481704 498053 515737 534532
52322 534532 554561 576185 599340 623212 646746 669371 691151 712450 733667 755073 776596
52311 776596 797785 818262 838238 858359 878882 899287 918952 938056 957284 976552 994562
52300 994562 1010073 1023252 1035288 1046788 1057158 1065486 1071435 1075072 1076347 1075073 1071125 1064449 1055147
52287 1055147 1043776 1031262 1018351 1005286 992143 979191 966880 955739 946365 939195 934237 931396
52275 931396 931044 933697 939070 946120 954240 963772 975078 987869 1001853 1017215 1033736 1050164 1065332
52262 1065332 1079491 1093712 1108393 1123225 1138241 1153819 1169716 1185054 1199309 1212505 1224455
52251 1224455 1234717 1243443 1251322 1258312 1263084 1264131 1260967 1254046 1244068 1231677 1217283 1200814 1181958
$$ packed form
52334C94065N685O758P854Q544R117J0105J1571J3199J4806J6349J7684J8795
52322E34532K0029K1624K3155K3872K3534K2625K1780K1299K1217K1406K1523
52311G76596K1189K0477J9976K0121K0523K0405J9665J9104J9228J9268J8010
52300I94562J5511J3179J2036J1500J0370Q328N949L637J275j274l948o676r302
52287A055147j1371j2514j2911j3065j3143j2952j2311j1141r374p170m958k841
52275I31396l52K653N373P050Q120R532J1306J2791J3984J5362J6521J6428J5168
52262A065332J4159J4221J4681J4832J5016J5578J5897J5338J4255J3196J1950
52251A224455J0262Q726P879O990M772J047l164o921r978j2391j4394j6469j8856
$$ plain form
52238 1181958 1160953 1138841 1116824 1095636 1075488 1056076 1036550 1016140 995170 974993 956628
52227 956628 939875 924023 908894 894813 881970 870374 860220 851767 844881 839022 833691 828789
52215 828789 824597 821554 819936 819691 820571 822355 824758 827273 829433 831176 832592 833472 833604 833439 833806 834858
52199 834858 835937 836712 837813 839955 842976 846181 849169 851857 854119 856103 858692 862952 868941 875383
52185 875383 880660 884003 885731 886495 886359 884736 881284 876589 871534 866139 859645 851776 843299 835088 827331
52170 827331 820081 813937 809516 806593 804348 802320 800700 799959 800624 803089 807112 811727 816184 820798 826326
52155 826326 832688 838920 844266 848623 851904 853753 854199 854078 854396 855573 857584 860535 864705 870102 876260
52140 876260 882488 888169 892915 896644 899682 902649 906130 910444 915818 922793 932129 944133 958299 974014
$$ packed form
52238A181958k1005k2112k2017k1188k0148j9412j9526k0410k0970k0177j8365
52227I56628j6753j5852j5129j4081j2843j1596j0154q453o886n859n331m902
52215H28789m192l043j618k45Q80J784K403K515K160J743J416Q80J32j65L67J052
52199H34858J079P75J101K142L021L205K988K688K262J984K589M260N989O442
52185H75383N277L343J728P64j36j623l452m695n055n395o494p869q477q211p757
52170H27331p250o144m421k923k245k028j620p41O65K465M023M615M457M614N528
52155H26326O362O232N346M357L281J849M46j21L18J177K011K951M170N397O158
52140H76260O228N681M746L729L038K967L481M314N374O975R336J2004J4166J5715
$$ plain form
52126 974014 991561 1012037 1036323 1064461 1095965 1130124 1165928 1202322 1238905 1275961 1313491
52115 1313491 1350667 1386452 1420317 1451962 1480867 1506662 1529488 1549442 1565959 1578341 1586639
52104 1586639 1591525 1593597 1593342 1591459 1588483 1584292 1578666 1572142 1565551 1558772 1550755 1540803 1529091 1515845
52090 1515845 1500755 1483469 1463969 1442208 1418045 1391949 1365270 1339487 1315518 1293943 1275339
52079 1275339 1260038 1247995 1239241 1234061 1232378 1233330 1235944 1239943 1245646 1253410 1263558 1276430 1291957
$$ packed form
52126I74014J7547K0476K4286K8138L1504L4159L5804L6394L6583L7056L7530
52115A313491L7176L5785L3865L1645K8905K5795K2826J9954J6517J2382Q298
52104A586639M886K072k55j883k976m191n626o524o591o779q017r952j1712j3246
52090A515845j5090j7286j9500k1761k4163k6096k6679k5783k3969k1575j8604
52079A275339j5301j2043q754n180j683R52K614L999N703P764J0148J2872J5527
$$ [...]
##END NTUPLES=NMR SPECTRUM
##END=
